##TITLE=1H_Pr EtOH-i
 200.13MHz,.
 8 sc
 
21.3.2026
##JCAMPDX= 6.0         $$ Bruker NMR JCAMP-DX V2.0
##DATA TYPE= NMR FID
##DATA CLASS= NTUPLES
##ORIGIN= UXNMR, Bruker Analytische Messtechnik GmbH
##OWNER= pz
$$ XWIN-NMR		Version 3.5
$$ Thu Mar 12 13:25:30 2026 Russian Standard Time (UT+4h)  she@DPX200
##.OBSERVE FREQUENCY= 200.131
##.OBSERVE NUCLEUS= ^1H
##.DELAY= (6, 6)
##.ACQUISITION MODE= SIMULTANEOUS
##.ACQUISITION SCHEME= undefined
##.AVERAGES= 8
##.DIGITISER RES= 18
##SPECTROMETER/DATA SYSTEM= spect
##.PULSE SEQUENCE= zg30
##.SOLVENT NAME= CDCl3
##.SHIFT REFERENCE= (INTERNAL, CDCl3, 0, 14.3821)
##AUDIT TRAIL= $$ (NUMBER, WHEN, WHO, WHERE, WHAT)
$$ ##TITLE= Audit trail, XWIN-NMR		Version 3.5
$$ ##JCAMPDX= 5.01
$$ ##ORIGIN= Bruker BioSpin GmbH
$$ ##OWNER= she
$$ F:/spectra/data/she/nmr/H-C/1/audita.txt
$$ ##AUDIT TRAIL=  $$ (NUMBER, WHEN, WHO, WHERE, WHAT)
(   1,<2026-03-12 13:23:55.34 +0400>,<she>,<DPX200>,
      <created by zg, POWCHK disabled, PULCHK disabled
       configuration hash MD5:
       00 E9 B6 7A A2 85 ED C7 34 08 36 98 17 FE 4E 26
       data hash MD5: 16K
       F4 C5 66 90 07 BC DD 9D DF 82 45 5C 7B 5E E2 DC>)
$$ ##END=
$$ 
$$ hash MD5
$$ 01 51 23 27 FF 5D B0 FA 88 92 3E 3D C3 5B 70 C6
##$RELAX= 
##$RELAX= 
##$RELAX= 
##$RELAX= 
##$RELAX= 
##$RELAX= 
$$ Bruker specific parameters
$$ --------------------------
##$DU= <F:/spectra>
##$EXPNO= 1
##$NAME= <H-C>
##$PROCNO= 1
##$TYPE= <nmr>
##$USER= <she>
##$AMP= (0..31)
100 100 100 100 100 100 100 100 100 100 100 100 100 100 100 100 100 100 
100 100 100 100 100 100 100 100 100 100 100 100 100 100 
##$AQSEQ= 0
##$AQ_mod= 1
##$AUNM= <au_zg>
##$AUTOPOS= <>
##$BF1= 200.13
##$BF2= 200.13
##$BF3= 200.13
##$BF4= 200.13
##$BF5= 200.13
##$BF6= 200.13
##$BF7= 200.13
##$BF8= 200.13
##$BYTORDA= 1
##$CFDGTYP= 0
##$CFRGTYP= 5
##$CHEMSTR= <none>
##$CNST= (0..31)
1 1 145 1 1 1 1 1 1 1 1 1 1 1 1 1 1 1 1 1 1 1 1 1 1 1 1 1 1 1 1 1 
##$CPDPRG= <>
##$CPDPRG1= <>
##$CPDPRG2= <>
##$CPDPRG3= <>
##$CPDPRG4= <mlev>
##$CPDPRG5= <mlev>
##$CPDPRG6= <mlev>
##$CPDPRG7= <mlev>
##$CPDPRG8= <mlev>
##$CPDPRGB= <>
##$CPDPRGT= <>
##$D= (0..31)
0 0.7 0 0 0 0 0 0 0 0 0 0.03 0 0 0 0 0 0 0 0 0 0 0 0 0 0 0 0 0 0 0 0 
##$DATE= 1773307434
##$DBL= (0..7)
120 120 120 120 120 120 120 120 
##$DBP= (0..7)
150 150 150 150 150 150 150 150 
##$DBP07= 0
##$DBPNAM0= <>
##$DBPNAM1= <>
##$DBPNAM2= <>
##$DBPNAM3= <>
##$DBPNAM4= <>
##$DBPNAM5= <>
##$DBPNAM6= <>
##$DBPNAM7= <>
##$DBPOAL= (0..7)
0.5 0.5 0.5 0.5 0.5 0.5 0.5 0.5 
##$DBPOFFS= (0..7)
0 0 0 0 0 0 0 0 
##$DE= 6
##$DECBNUC= <off>
##$DECIM= 32
##$DECNUC= <off>
##$DECSTAT= 4
##$DIGMOD= 1
##$DIGTYP= 9
##$DL= (0..7)
0 120 120 120 120 120 120 120 
##$DP= (0..7)
150 150 150 150 150 150 150 150 
##$DP07= 0
##$DPNAME0= <>
##$DPNAME1= <>
##$DPNAME2= <>
##$DPNAME3= <>
##$DPNAME4= <>
##$DPNAME5= <>
##$DPNAME6= <>
##$DPNAME7= <>
##$DPOAL= (0..7)
0.5 0.5 0.5 0.5 0.5 0.5 0.5 0.5 
##$DPOFFS= (0..7)
0 0 0 0 0 0 0 0 
##$DQDMODE= 0
##$DR= 18
##$DS= 0
##$DSLIST= <SSSSSSSSSSSSSSS>
##$DSPFIRM= 0
$$ [...]
##$SUBNAM0= <"">
##$SUBNAM1= <"">
##$SUBNAM2= <"">
##$SUBNAM3= <"">
##$SUBNAM4= <"">
##$SUBNAM5= <"">
##$SUBNAM6= <"">
##$SUBNAM7= <"">
##$SUBNAM8= <"">
##$SUBNAM9= <"">
##$SW= 18.0517599122864
##$SWIBOX= (0..15)
0 0 2 0 0 0 0 0 0 0 0 0 0 0 0 0 
##$SW_h= 3612.71676300578
##$TD= 16384
##$TD0= 1
##$TE= 0
##$TE2= 300
##$TE3= 300
##$TEG= 300
##$TL= (0..7)
0 120 120 120 120 120 120 120 
##$TP= (0..7)
150 150 150 150 150 150 150 150 
##$TP07= 0
##$TPNAME0= <>
##$TPNAME1= <>
##$TPNAME2= <>
##$TPNAME3= <>
##$TPNAME4= <>
##$TPNAME5= <>
##$TPNAME6= <>
##$TPNAME7= <>
##$TPOAL= (0..7)
0.5 0.5 0.5 0.5 0.5 0.5 0.5 0.5 
##$TPOFFS= (0..7)
0 0 0 0 0 0 0 0 
##$TUNHIN= 0
##$TUNHOUT= 0
##$TUNXOUT= 0
##$USERA1= <user>
##$USERA2= <user>
##$USERA3= <user>
##$USERA4= <user>
##$USERA5= <user>
##$V9= 5
##$VALIST= <valist>
##$VCLIST= <CCCCCCCCCCCCCCC>
##$VD= 0
##$VDLIST= <DDDDDDDDDDDDDDD>
##$VPLIST= <PPPPPPPPPPPPPPP>
##$VTLIST= <TTTTTTTTTTTTTTT>
##$WBST= 1024
##$WBSW= 4
##$XGAIN= (0..3)
0 0 0 0 
##$XL= 0
##$YL= 0
##$YMAX_a= 296130
##$YMIN_a= -233593
##$ZGOPTNS= <>
##$ZL1= 120
##$ZL2= 120
##$ZL3= 120
##$ZL4= 120
##$ABSF1= 10
##$ABSF2= 0
##$ABSG= 5
##$ABSL= 3
##$ALPHA= 0
##$AQORDER= 0
##$ASSFAC= 0
##$ASSFACI= 0
##$ASSFACX= 0
##$ASSWID= 0
##$AUNMP= <proc_1d>
##$AZFE= 0.1
##$AZFW= 0.1
##$BCFW= 1
##$BC_mod= 2
##$BYTORDP= 1
##$COROFFS= 0
##$CY= -3
##$DATMOD= 1
##$DC= 2
##$DFILT= <>
##$DTYPP= 0
##$F1P= 0
##$F2P= 0
##$FCOR= 0.5
##$FTSIZE= 0
##$FT_mod= 4
##$GAMMA= 1
##$GB= 0.15
##$INTBC= 1
##$INTSCL= 1
##$ISEN= 128
##$LB= 0.25
##$LEV0= 0
##$LPBIN= 0
##$MAXI= 10000
##$MC2= 0
##$MEAN= 0
##$ME_mod= 0
##$MI= 1.114404
##$NCOEF= 0
##$NC_proc= 0
##$NLEV= 6
##$NOISF1= 3.799351
##$NOISF2= 2.8
##$NSP= 1
##$NTH_PI= 0
##$NZP= 0
##$OFFSET= 14.38212
##$PC= 1
##$PHC0= -3780.665
##$PHC1= 5.992319
##$PH_mod= 1
##$PKNL= yes
##$PPARMOD= 0
##$PSCAL= 0
##$PSIGN= 0
##$REVERSE= no
##$SF= 200.129724274929
##$SI= 16384
##$SIGF1= 3
##$SIGF2= 2
##$SINO= 400
##$SIOLD= 16384
##$SREGLST= <1H.CDCl3>
##$SSB= 0
##$STSI= 0
##$STSR= 0
##$SW_p= 3205.1282051282
##$SYMM= 0
##$S_DEV= 0
##$TDeff= 0
##$TDoff= 0
##$TI= <>
##$TILT= no
##$TM1= 0
##$TM2= 0
##$TOPLEV= 0
##$USERP1= <user>
##$USERP2= <user>
##$USERP3= <user>
##$USERP4= <user>
##$USERP5= <user>
##$WDW= 1
##$XDIM= 8192
##$YMAX_p= 0
##$YMIN_p= 0
$$ End of Bruker specific parameters
$$ ---------------------------------
##NTUPLES= NMR FID
##VAR_NAME=  TIME,          FID/REAL,        FID/IMAG
##SYMBOL=    X,             R,               I
##VAR_TYPE=  INDEPENDENT,   DEPENDENT,       DEPENDENT
##VAR_FORM=  AFFN,          ASDF,            ASDF
##VAR_DIM=   8192,          8192,            8192
##UNITS=     SECONDS,       ARBITRARY UNITS, ARBITRARY UNITS
##FACTOR=    0.0002768,     1,               1
##FIRST=     0,             0,               0
##LAST=      2.2672688,     0,               0
##MIN=       0,             -233593,         0
##MAX=       2.2672688,     296130,          0
$$ Real data points
##PAGE= N=1
##DATA TABLE= (X++(R..R)), XYDATA
$$ [...]
1232a968Q03K599k394J754P3l309K994J272k964J202P2j024K358r78k015J915
1248C90J23o07P89j336q3J727p84o68M41l85N00L84q44j8K83J12J83m42J0K76
1268E1k56L77o3m66N98k54k54R06p24k94J005q99J99J053j603K72J307j425N51
1287H1O32j829J339P58k037J289J73j655K126m25k057K369m41j586K358j258j210
1304a373K815j604j021K565j920k10K424k643K89K496k817O37J927k933J461J568
1320A661l301J748J248k898K177K75k869K885m6k723K871p32k068L324j441j920
1336a809L319j655j170L040k359n21L036k664RK566k930P30K229l163J207J761
1352A626l144J671J254k972K016N63k694K449K5k461K548n09j892K748j160j631
$$ plain form
1232 -1968 -1165 1434 -960 794 867 -2442 552 1824 -1140 62 134 -890 1468 490 -1525 390
1248 390 513 -94 695 -641 -724 1003 219 -449 -8 -393 107 491 -353 -371 -88 24 207 -235 -225 51
1268 51 -205 172 109 -357 241 -13 -267 639 -85 -379 626 -273 -74 979 -624 -352 955 -470 81
1287 81 713 -1116 223 981 -1056 233 406 -1249 877 452 -1605 764 323 -1263 1095 -163 -1373
1304 -1373 1442 -162 -1183 1382 -538 -748 1676 -967 -678 1818 -999 -362 1565 -1368 93 1661
1320 1661 -1640 108 1356 -1542 635 910 -1959 926 880 -1843 1028 296 -1772 1552 111 -1809
1336 -1809 1510 -145 -1315 1725 -634 -1155 1881 -783 -774 1792 -1138 -408 1821 -1342 -135 1626
1352 1626 -1518 153 1407 -1565 451 1014 -1680 769 794 -1667 881 372 -1520 1228 68 -1563
1368a563K806j285j127K430j744m48K389j990j78J930j952N18J479k260Q47J341
1384A193k049R68P13j841J395L93j760J304J06j209J359m69r99J496n24p45J180
1401E11p19k89J115q56j73Q49o70J39M49p01L88K73n93M36Pm03M80j99j53L65
1421B56l50M6J93l44L93j44n14P24j76m34O25n87m6J024r44j87Q74q26N51N29
1441F63j654R34R71j490Q45L1j402K001l6k123J638l4r89J962j571j323K949j028
1459C44j234J840j955K94K895k975o56K635j878Q27J343l691J708K711l257Q86
1475a63P66k628L455M54m512K725J123k325K890j865k866N116p41l313K915j897
1491h66k78M622m323k048M962k242j32K412n120J917M949n108l9K418l428L943
$$ plain form
1368 -1563 1243 -42 -1169 1261 -483 -931 1458 -532 -710 1220 -732 -214 1265 -995 -148 1193
1384 1193 -856 112 825 -1016 379 772 -988 316 422 -787 572 103 -896 600 76 -669 511
1401 511 -208 -497 618 -238 -411 438 -232 -93 356 -345 43 316 -277 159 166 -237 243 44 -109 256
1421 256 -94 -48 145 -199 194 50 -464 260 84 -350 275 -312 -358 666 -278 -465 409 -417 134 663
1441 663 -991 -57 914 -576 269 300 -1102 899 863 -1260 378 344 -645 1317 -254 -1577 1372 344
1459 344 -890 950 -1005 -711 2184 -791 -1447 1188 -690 137 1480 -2211 -503 2208 -1049 -163
1475 -163 603 -2025 1430 1884 -2628 97 1220 -1105 1785 -80 -2946 2170 1429 -1884 1031 -866
1491 -866 -1144 3478 -845 -2893 2069 -173 -305 2107 -3013 -1096 3853 -1255 -1294 1124 -2304 1639
1507A639J184o764L464L002l945K990j448m180O829r2n824L764p53j391N625m692
1523e92l731O959j631k085L252n143J219O813n997j917M498l321K750K403p923
1538d446K888N512n109J463K23m756O854J198p912L714J568k762N288l869n200
1553e346Q226m00m563L662l787J49P695o193l651O308k664R59L192q041K198P297
1569E041n872k71K061m746N888K343q936L146L729l783M085k312n927Q094J090
1584C630o454L423j492j301P275m860n295P042r47j561L394o259O71Q016n367
1599h5k525L794l537L506L193q476J846N661m170J806l04n499O720K233p294K684
1615d47Q32k267N852l318n768O860L59l312L167m155m54P423m369l659M479k296
$$ plain form
1507 1639 2823 -3941 -477 2525 -1420 1570 122 -4058 2771 2679 -3145 619 -134 -1525 4100 -592
1523 -592 -4323 2636 1005 -1080 2172 -2971 -1752 5061 -936 -2853 1645 -1676 1074 3477 -4446
1538 -4446 -1558 3954 -1155 308 531 -4225 2629 3827 -4085 -371 1197 -1565 3723 -146 -5346
1553 -5346 2880 2480 -2083 1579 -2208 -2059 5636 -557 -4208 2100 -564 395 3587 -4454 -2256 5041
1569 5041 -831 -1102 959 -3787 2101 4444 -4492 -1346 2383 -1400 2685 373 -5554 2540 3630
1584 3630 -2824 599 -893 -2194 5081 221 -5074 1968 1021 -540 2854 -3405 -2734 5282 -85
1599 -85 -2610 1184 -2353 1153 4346 -4130 -2284 3377 -793 1013 709 -4790 1930 4163 -3131 -447
1615 -447 385 -1882 3970 652 -5116 1744 2103 -1209 1958 -2197 -2651 4772 403 -3256 1223 -1073
1631a073J395L398o979O47O157l815q9J283m439M499K958o695J391K655k563L546
1647B276j330n240N373J646m239K201j427j434N660k548m258M185m62p28K797
1662B472m411m89N501k744j579K088k801K218K907n183L52L245k256J563P6l987
1678c028L480J984l790J295J18j610L676j143l616L163L98j538J960k165r89L908
1694B103j491k001J959j208M59K167l061m10K854j442p1Q42k252J456J885k592
1710h03J63J108j175J463K6k362J606R86j501Q63m27j012K044k94j673J178q8
1727A02l93J204j154o87J606m67n41O90q55K09J136j104k81Q78n23J73M06r22
1745e23L22P17o74L2L08m53M04K48p17K49M15m16J10J59m38K78L09n03O3K94l30
$$ plain form
1631 -1073 322 3720 -3259 -2612 3545 -270 -359 924 -3515 984 3942 -2753 -1362 1293 -1270 2276
1647 2276 946 -4294 1079 2725 -1514 687 -740 -2174 3486 938 -3320 865 403 -325 2472
1662 2472 -1939 -2428 3073 329 -1250 838 -1963 255 3162 -2021 -1669 1576 -680 883 959 -3028
1678 -3028 452 2436 -1354 -59 59 -1551 2125 982 -2634 529 927 -611 1349 -816 -1805 2103
1694 2103 612 -1389 570 -638 -179 1988 -1073 -1483 1371 -71 -142 700 -1552 -96 1789 -803
1710 -803 -640 468 -707 756 782 -1580 26 1012 -489 374 -53 -1065 979 685 -988 190 102
1727 102 -291 913 -241 -928 678 211 -330 360 -495 -286 850 -254 -535 343 -180 -7 399 -523
1745 -523 -201 516 -158 -126 182 -271 133 381 -336 -87 328 -88 22 181 -257 21 330 -173 -110 184 -146
1766a46J61J98m70J80K97m21J82K16m98K43L27n31K41K63n83L85K92o39L08K28
1786B33n41N27O6p38N98J27n92O27j95o36R21j52p03P56l25l79R49o02m80R76
1806D37n59k02Q51r01qJ028r57K1Q20r92L65P28j179M75O74j119O35L54j111R41
1826C01J80j167R99M5r94J116k94r19J277l94p87J146o07m53J251r05l64J208
1844F39r37n1J043j192J86J033j197L32P76j238O33N97j244P43L64j144R66J10
1862D19j096J070j31r18J170l41q27J149m90n23J133p76l68J122q00j34R09r99
1880d31J64R17j059K21O72r47N12M53j068O30L60q90P01K9q04R08j25p44Q37k57
1900G9m78Q51n15l59Q52n22j89O45o32J04O00p61J54N09o35L43K38p08N02K38
$$ plain form
1766 -146 15 213 -257 -77 220 -201 -19 197 -301 -58 269 -262 -21 242 -341 44 336 -303 5 233
1786 233 -308 219 285 -453 145 272 -320 307 112 -524 397 245 -458 298 -27 -406 543 -59 -539 437
1806 437 -122 -324 527 -374 -382 646 -311 -290 530 -462 -97 631 -548 -73 601 -518 117 471 -640 301
1826 301 481 -686 313 358 -636 480 186 -733 544 150 -637 509 -98 -551 700 -205 -569 639
1844 639 -298 -349 694 -498 -312 721 -476 -144 632 -606 27 624 -620 123 487 -657 309 419
1862 419 -677 393 262 -656 514 173 -654 495 5 -518 615 -161 -529 593 -207 -341 568 -431
1880 -431 -267 650 -409 -188 484 -463 49 502 -566 64 424 -466 235 264 -540 368 243 -501 336 79
1900 79 -399 452 -63 -422 430 -92 -281 364 -268 -164 436 -325 -171 338 -297 46 284 -424 78 316
1920C16o34M58l4m02O13k39m01N91k62j75M99m93l2N57n19M0L60n06K85K17n81
1941c42M12J18n10M67r1l82O05k71l68O50l24j63N21n46Q4N85o66J01M23n99M41
1962A45K12q43N76K77p02N50j49n60R41k70p08P90l18k11Q41q92k20J164p22j56
1982b55O57r46M71Q62j293K19P63q69P02J39j367J123N07j249P53j25q05J531
2000H18m66j339J352j94n32J141j240l97J874r89o11J060j109N39J282j983J52
2017f42J436j165N95K97j809J504R29j908P70J86j019J872n31j967J843J68j044
2034d85J310j280o78K508j064j299J483r65K89J659k352k19K245j320O5P41k056
2051a418J454J604k544M13J012j300J689j55k557K063Q64j797J215p59j107K837
$$ plain form
1920 316 -318 140 106 -296 317 78 -323 268 6 -169 330 -163 -195 362 -157 -117 243 -263 22 239 -342
1941 -342 70 188 -322 145 54 -328 277 6 -362 288 -36 -199 322 -224 -140 445 -221 -120 303 -296 145
1962 145 357 -486 90 367 -335 215 66 -494 447 177 -531 259 -59 -270 571 -321 -541 623 -99 -255
1982 -255 402 -544 -73 789 -504 -285 478 -391 311 450 -917 206 713 -536 217 92 -713 818
2000 818 352 -987 365 171 -361 780 -460 -857 1017 28 -583 477 -632 -93 1189 -794 -642
2017 -642 794 -371 224 521 -1288 216 1145 -763 7 193 -826 1046 515 -1452 391 559 -485
2034 -485 825 -455 -1133 1375 311 -988 495 -470 -181 1478 -874 -1093 1152 -168 -103 638 -1418
2051 -1418 36 1640 -904 -491 521 -779 910 755 -1802 261 1125 -672 543 -216 -1323 1514
2067A514q58k140J908m34l34J834k293o46K877j285o49J155j900J165J995k866
2083i57M8J719j388J219K47k801J965J474k249Q79j39j327K729m90k693K016K41
2100D93r78J761j800j140L154r18j539J500j314M45K245k669o06K419j253L07
2116A07Q10k587J412K094k534K77Q07j442K063J03k912J785R92j524J372j002
2132a79j430K942m63k076J553o22j87K115k143j033K584r14m06J044k059Q43K193
2149A762k322k20J325j273J264N40k638J308J455j703P86j54j444K280M0k268
2165a262J385J42p83J675j285j334K389m14j131J171j203J00K001j739p00J610
2181F22r26L71Q42k021O68J626j551K09M78j253J444M41j977R22O03r27J079n45
$$ plain form
2067 1514 656 -1484 424 -10 -344 1490 -803 -1449 1428 143 -506 649 -1251 -86 1909 -957
2083 -957 -909 810 -578 641 888 -1913 52 1526 -723 156 17 -1310 1419 929 -1764 252 493
2100 493 -485 1276 -524 -1664 1490 572 -967 533 -781 -336 1909 -760 -1366 1053 -200 107
2116 107 917 -1670 -258 1836 -698 -421 386 -1056 1007 1110 -1802 -17 975 -549 823 -179
2132 -179 -1609 1333 870 -1206 347 -275 -462 1653 -490 -1523 1061 147 -259 785 -1274 -431 1762
2149 1762 -560 -780 545 -728 536 1076 -1562 -254 1201 -502 284 130 -1314 966 1006 -1262
2165 -1262 123 265 -518 1157 -128 -1462 927 513 -618 553 -650 -550 1451 -288 -988 622
2181 622 -304 67 909 -1112 -444 1182 -369 -160 318 -935 509 950 -1027 -105 498 -429 650 105
2199A05j235J753j1j239R44m88l36J504j029q67J395m52k37Q07j215J37J370j076
2217a70k25P53q30N58O37j378L72Q46q39M07J32r73R56L39j082N37J06n40Q74
2236D80k99q45R21k3n22N98m48k73R13m65m17O12l71J1N36o71k9O56m63qL46n29
2258b90K53M07n86J24L03l99K68J32m97L19J94m10K45M7l44L56L8l99K88M9k79
2279a81K90n4k97L33j7k50K74q6k04L33r6k20K88j00j51L00j36j89L07j09j35
2300a00K65j96j10L32j90j17K68k25k5L09k98n7L25k69OK57l41N6L15l37P0K09
2322A47l43K02J95m18K19J80l80K80P8m08L68N6m09L49j6l18M09j31l21M79j92
2343B6k36M29k72j68M92l52j34M44l48k2L87m46P6L85m56J53K65m80K73K27m98
$$ plain form
2199 105 -1130 623 612 -627 317 -171 -507 997 -32 -899 496 44 -193 614 -601 -464 906 -170
2217 -170 -395 358 -472 86 723 -655 -283 563 -276 131 263 -710 246 585 -497 40 146 -394 480
2236 480 181 -664 257 234 -288 310 -138 -411 502 37 -380 232 -139 -128 408 -263 -292 364 -99 -107 239 -290
2258 -290 -37 370 -216 -92 211 -188 80 212 -285 34 228 -182 63 110 -234 122 160 -239 49 98 -181
2279 -181 109 55 -242 91 74 -176 98 12 -192 141 45 -175 113 13 -138 162 26 -163 144 35 -100
2300 -100 165 -31 -141 191 1 -116 152 -73 -98 211 -87 -144 181 -88 -82 175 -166 -110 205 -132 -62 147
2322 147 -196 6 201 -217 2 182 -198 82 160 -248 120 176 -233 116 100 -218 191 60 -261 218 26
2343 26 -210 219 -53 -221 271 -81 -215 229 -119 -141 246 -200 -124 261 -195 -42 223 -257 16 243 -255
2364b55K98J47m45L73N6m50M28l6l59M46j32l16M63k16k10M56l10j45M59l50m5
2385a43L76m03N1L60m13J18K37l96K29J81m43K72J37l70L21j4l43L92o8k67L49
2406A63j60j62L60k46j07L45k77j9K84l21P7K37l41J30J74k93J96L5k72K92j1
2427H4k47K69j01j51L29k00j25K91k05jK18k95J03K06l09J53J00l03K71K0l43
2448b36L39m9k62L36j54j62L97k81j19M14l26kL31m44J54L75n12J54K58m57L89
2469A43J00n93M43J17m46M59j91m15P20k32m48N82l27j27O51o30j52P23n25K8
2489a20M45p52L65N88q95K54M12o87O27J06r74P74K62p72O45k47n82J119l64q13
2509f09R32l20k94R33r33k96J247p00k69P19r23M00R42j333J56Q33q83O17K33
$$ plain form
2364 -255 43 190 -255 118 174 -276 152 116 -243 203 71 -245 218 2 -208 248 -62 -207 252 -98 -143
2385 -143 233 -170 -119 241 -172 -54 183 -213 16 197 -246 26 163 -207 114 100 -243 149 81 -186 163
2406 163 3 -159 201 -45 -152 193 -84 -103 181 -140 -63 174 -167 -37 137 -156 40 75 -197 95 84
2427 84 -163 106 5 -146 183 -17 -142 149 -56 -57 161 -134 -31 175 -134 19 119 -184 87 107 -236
2448 -236 103 54 -208 128 -26 -188 209 -72 -191 223 -103 -105 226 -218 -64 311 -201 -47 211 -246 143
2469 143 243 -350 93 210 -236 223 32 -383 337 105 -343 239 -88 -215 436 -194 -346 377 -148 -120
2489 -120 325 -427 -62 526 -369 -115 297 -390 237 343 -631 143 405 -367 278 31 -551 568 204 -609
2509 -609 323 3 -291 642 -291 -587 660 -40 -309 410 -513 -113 829 -504 -348 485 -398 219 452
2528D52j368J028N84j225O72j3q25J420l72j270J232j22n61J102j034m95J707
2545I12q19o25R95r53L20J229j653k6J324j013M07M42j599J105R78j666N42L83
2563B83j027J448j54j747J437L05j049J114q07p96K026p00j202J318o93o2J470
2580A164j730l49J845j025j12P97j599R23J362j937K58Q85j123J202R4j997J468
2597A26P21j420R39m21r88K068n05j615J439k95m09J438j541o03K098r06n80J009
2615E55j346N82J567j973q1J368j106P19M06j963J251J112j698O26J65j123J764
2632H25j45j911J417K35q80J273j039q88K119o27j082J157q81J20J569j731m06
2649h75J632r35J72O57j716Q97J322j695K85N66j040J316R5j854J207N77j075
$$ plain form
2528 452 -916 112 696 -529 143 130 -695 725 353 -917 315 193 -368 734 -300 -795 912
2545 912 93 -532 463 -490 -170 1059 -594 -620 704 -309 98 540 -1059 46 1024 -642 -100 283
2563 283 -744 704 550 -1197 240 545 -504 610 -197 -993 1033 333 -869 449 -244 -306 1164
2580 1164 -566 -915 930 -95 -207 590 -1009 -86 1276 -661 -403 482 -641 561 655 -1342 126
2597 126 847 -573 366 -55 -1043 1025 520 -1095 344 49 -360 1078 -463 -1066 1032 126 -454 555
2615 555 -791 -209 1358 -615 -696 672 -434 285 691 -1272 -21 1091 -607 19 184 -939 825
2632 825 680 -1231 186 421 -459 814 -225 -1113 1006 379 -703 454 -427 -307 1262 -469 -875
2649 -875 757 -178 -6 651 -1065 -168 1154 -541 -256 310 -730 586 681 -1173 34 611 -464
2666d64R55n41r46J828l49j292J106l91k46J324j269n92J631o92l18P93j227M36
2684b54J318j459p5R18q95O84L95j569Q33Q22j127N39j5q90J325m2j292R13L9
2703A68n22R94p42o69J369l81n85P43p28J03J065j054k26Q98o25K28M50j107M68
2722a53P80r13K21K59o73P49J47j002O00K44n52N81k56n79R16j19o15N49k39j80
2742b35P18n57l24P08l17j13M32n80J02O12n91k9L75m17K59K47o17K57L19m25
2762a76K37K0l77M34N7m44L04J6k26L32j62k35L70q2j87K37j73n0K93k27p4K30
2784A17j55JJ51k13L6J87j74qJ24j36N2R5j50M0R2j17M4O2j14P3N7j17M1R2j11
2809c1L8M6p6K5N9r2OR3r1QO9j03L1P5j27M8R4j44O3M0j40J15O8j74J00M9j33
$$ plain form
2666 -464 491 -50 -996 832 483 -809 297 -94 -340 984 -285 -877 754 62 -256 537 -690 -254
2684 -254 1064 -395 -470 448 -447 237 632 -937 -104 718 -409 130 115 -775 550 508 -784 129 168
2703 168 -354 640 -102 -771 598 217 -368 375 -353 -250 815 -239 -465 433 -192 36 486 -621 -153
2722 -153 627 -286 -65 194 -479 270 417 -585 15 259 -293 288 32 -547 369 250 -365 184 -55 -235
2742 -235 483 -74 -398 310 -7 -120 312 -268 -166 446 -145 -174 201 -216 43 290 -327 -70 249 -176
2762 -176 61 81 -296 138 195 -249 55 71 -155 177 15 -220 150 68 -119 118 -55 -105 188 -39 -113 117
2784 117 -38 -37 114 -99 -63 124 -50 -58 66 -70 -18 77 -73 -33 59 -58 -14 48 -66 7 64 -53 -12 80 -31
2809 -31 7 53 -23 2 61 -31 -25 68 -23 -15 54 -49 -18 57 -70 -22 72 -72 -9 31 -109 6 74 -100 0 49 -84
2836h4J37j3j52J69oj48J74n2j29K19r2j31K17j16o9K05j75l5K21j83l0J87k12
2859i8N1J74k57Q3J57k32J09J05k44J69P1k27J79J8j93K27m2j96K42n3j60K35
2881A18j05j30K61j56p5K24j86k1K01k03K2J67k22P9J48k30R8R1k08J43O2k10
2903a32J51L2j55J66n0j28J97n2j01J70j18o1J78j15m7J37j14J2J05j45N0P8j23
2926f5Q6J8j20J03Nr9J01k9m7R2o5k5Q3o4RN2q2O6L7j11P5J0r6J14k5r4J31p1
2954a1k2J16j31j0J40j43M4R7j74P5J04j81J12L6j77J88nk09K00l5j30K54j30
2977Hj74L03j31j01K53k56J0L05l00j0K31k84J57J69m03J90K12l41K05N7l74M00
2999A26L3l96L22n0k38M52k46k94N11j95j88L88l67k6N25m56r8M39l90J47L10
$$ plain form
2836 -84 53 40 -112 57 51 -97 77 25 -104 115 23 -108 109 -7 -76 129 -46 -81 140 -43 -73 114 -98
2859 -98 -47 127 -130 -47 110 -122 -13 92 -152 17 88 -139 40 58 -135 92 50 -146 96 43 -117 118
2881 118 13 -117 144 -12 -87 137 -49 -70 131 -72 -50 117 -105 -26 122 -108 -10 81 -127 16 78 -132
2903 -132 19 51 -104 62 12 -116 81 29 -72 98 -20 -81 97 -18 -65 72 -42 -30 75 -70 -20 58 -65
2926 -65 21 39 -81 22 27 -72 29 0 -47 45 -20 -45 38 -26 -17 35 -47 19 56 -55 20 30 -66 48 23 -71 60 -11
2954 -11 -33 83 -48 -58 82 -61 -17 80 -94 -19 85 -96 16 52 -125 63 58 -151 49 14 -116 138 8
2977 8 -166 137 6 -95 158 -98 -88 217 -83 -93 138 -146 11 180 -223 -33 179 -162 43 100 -274 126
2999 126 159 -237 85 35 -203 249 3 -291 220 25 -163 225 -142 -168 357 -99 -197 242 -148 -1 309
3020C09o36K44M34n33K01J42n26N27J40o90M22J05m04N43k34n16P38j10m51N21
3040B26l66j30P63n65l28O98l99K2M89p83J78O91o61P9L16o24N53K86r32M38L28
3061B79n56N41j61o86Q86Lo98N64k38k46Q48n67m96Q70l30j82N77p79P6R26p59
3082a28j48N55o07M11M51j062L63O04o88L95L3p98Q81K14r44N30L6m54Q53m32
3102F5p22R80j40m53O14o26r4J032p06l74P10m96K02N57j041K23Q03p10J62K22
3122B08p52P51L30j036M44K73n24O82k53p99R47M1o62N71l55k49R77n78n50Q19
3142B85l23q0N89q44K7R30o66j00M33o41M80M68j010K78N03n67M42l2p71Q01K04
3163D06p65M32p3l48Q22l93o25P57j24k69N08n78r3Q47n29k53M96m59K43M61q16
$$ plain form
3020 309 -327 -83 351 -182 19 161 -365 162 302 -388 34 139 -265 278 44 -472 266 156 -295 226
3040 226 -140 -270 493 -72 -400 298 -101 -79 410 -373 -195 496 -165 -86 230 -394 159 445 -487 -49 279
3061 279 -277 264 103 -583 303 306 -392 172 -66 -312 536 -31 -527 343 13 -169 408 -371 -295 631 -128
3082 -128 -276 279 -328 83 534 -528 -165 439 -249 146 179 -619 262 476 -468 62 98 -356 497 65
3102 65 -657 323 183 -270 344 -282 -376 656 -50 -424 286 -210 -8 549 -492 -269 534 -176 -14 208
3122 208 -544 207 537 -499 -55 218 -306 376 123 -676 271 312 -350 221 -134 -383 594 16 -534 285
3142 285 -38 -118 471 -373 -346 584 -82 -182 251 -390 90 558 -452 -174 329 -238 204 172 -599 202 406
3163 406 -359 73 0 -348 474 81 -544 213 89 -180 328 -250 -343 504 -25 -278 218 -241 2 463 -353
3184c53J38N78n01J91J34o26N62K74p21L09J30l78N65j71n97O24K9l98M04l01
3204a08k07O98l46l61M96k44oM15n75%N68l97rK52m50K99L08n81J67K46l21K97
3226A41k0m51M32J00l87K61q1k07M57j90l24L80r9j11L00l27m9L98k44r8K22k36
3248a33J07K45l69O7K44k39J06O4k81K28J22k96J36M8j73K33m7k36K43%j52J52
3270F9r1j07K55j12j17J60q8nJ33j56j6J70j25OQ1j36Q4P3j43M9O7r5P9j8p6R0
3296C1%o9M4rl9O6k6n1P4j8l2M0l0pL7qj9K3Pj4J2j4j1K1Qm1K6J9k4%K5l2J3K3
3330B5n5J2J9j6J6ll7M8Rn6M3ol7N5qo7O7Qn7P2m0k3R3o9k7P8m7j8P6p9lQ8q6
3363b5J2O5j02M4O0j04M0M1r1O4J0r2R3lq7J01j8p4J06l3p0J09m8m3R7p3j8J06
$$ plain form
3184 -353 -215 363 -138 53 187 -439 123 397 -324 -15 115 -263 302 131 -466 158 187 -211 193 -108
3204 -108 -315 383 37 -324 172 -72 -78 337 -238 -238 330 -67 -76 176 -274 25 333 -248 -81 165 -156 141
3226 141 121 -330 102 202 -185 76 -5 -212 245 55 -269 111 12 -99 201 -126 -175 223 -21 -119 103 -133
3248 -133 -26 219 -150 -83 161 -78 28 92 -189 39 161 -135 1 49 -124 109 62 -174 69 69 -83 69
3270 69 -22 -129 126 14 -103 57 -31 -36 97 -59 -75 95 -30 -24 57 -79 5 78 -65 -16 51 -44 35 17 -59 31
3296 31 31 -38 6 -3 -42 24 -2 -53 21 3 -29 11 -19 -26 11 3 -16 7 14 0 12 -2 -13 8 16 -25 1 20 -4 -4 21 -11 2 25
3330 25 -30 -18 1 -15 1 -2 -39 9 18 -38 5 -1 -38 17 9 -58 9 17 -40 32 -8 -31 62 -7 -34 44 -3 -21 55 -24 -27 61 -25
3363 -25 -13 52 -50 -6 54 -50 -10 31 -60 4 14 -78 15 12 -75 26 8 -66 40 7 -63 46 -2 -45 52 -21 -39 67
3391F7r3nQ3r4K4P0j06M3N4r3M5M5q7N3K5r6P6Rq8Q7qp1Q6k6o6R3j4n6P8o6lP2
3423C8n4j3O2o1J9M9p2J6M8n0J6J9m9L3K2m8K3Pk2L2k0k6M0Kk9J6j2nL1j7qnJ1
3456gK0j9oK0j0LOj3MK0k5J6j7j8L5qk9L3k8mO2o2k1O4l6J0M5q8L7O2q8M1K2p7
3490e6P1L6j13O6J6p2R1k6j02J28j9r4J23p0m6J40p8q0J30q6KJ20j47jJ63j53
3516e7L6Q5j71J02J04j89Q0O9j39J37Lk02J93K3j58J51p5j09K44j10j43K15j01
3539a2m9J83k04m7K66j60m3J58k09Q5K02k83M2J71j94J37N2k77K10J10k52J62
3561D8j3j88K93n9k69K48l1j31K57k14j08L28j55j17K10k06N6K58l23j8K43j82
3583g3Q6R6l11J84K07l10J03P2k12K76j1l30K46N9j81K23j35j89L79j07k25K40
$$ plain form
3391 67 -26 -31 52 -42 -18 52 -54 -11 43 -50 -5 40 -47 6 31 -65 11 20 -68 19 11 -60 26 0 -66 27 13 -43 35 -31 -34 38
3423 38 -16 -29 33 -28 -9 40 -32 -16 32 -18 -2 17 -32 1 23 -25 -2 5 -17 15 -5 -31 9 11 -18 -2 -14 -19 12 -5 -13 -18 -7
3456 -7 13 -6 -12 8 -2 1 7 -6 -2 18 -7 9 -8 -26 9 1 -28 5 -23 -27 35 -27 -48 16 -20 -10 35 -53 -16 46 -42 -1 21 -56
3490 -56 15 51 -62 4 20 -52 39 13 -89 39 20 -74 49 -21 -67 73 -5 -85 45 -41 -39 81 -66 -67 96 -57
3516 -57 -21 64 -107 -5 99 -90 -10 59 -80 57 60 -142 51 74 -84 67 -8 -117 127 17 -126 89 -12
3539 -12 -61 122 -82 -129 137 -23 -66 92 -117 -32 170 -113 -71 100 -94 43 95 -182 28 138 -114 48
3561 48 35 -153 140 81 -188 60 29 -102 155 -59 -167 161 6 -111 99 -107 -51 207 -116 -134 109 -73
3583 -73 13 109 -202 -18 189 -121 -18 54 -158 118 107 -223 23 82 -99 124 -11 -200 179 72 -153 87
3605H7j36l1K97k94j10L40j82j3J54k91J28K85l38K3J69k11J99N7l58K11J66k57
3627a05J64m3k14L55m5l09K52m8j01K77k34j52L48j11j23J96k39N9K87k99m5K30
3649A00j71J01J05l38J64K08k48Q7L5k05K67L1l18J87N7j48K15j25k10L38n9j94
3671a21J82j14k8K61k26j07K50j25jJ38k50P6K38k30QJ06j73J64P2k67J19J09
3693H1j40J11m1j54K25Nj89J37l7o3J84j26j16K04o2o6J15j46K0J79j53m3J16
3716D1r7O0Q4j86M9J22j10M4K7j32J26N3j77R8K5p5J17n8j08J42Jq9Q5o4l1J21
3742F8p6n9J00m7lP0j03J2Q7p7J4L3p0M8L9r5M3M1m9M7k0m9O4Mm9L5j1j9N0k2
3772Fm5M7%j4K5l2mM0k4j6K4k3NL1m0KL9k4kJ2j3MPj7JJ7jmp%NlmmJ9jj2nNj4
$$ plain form
3605 87 -49 -80 217 -77 -187 153 -29 -42 112 -179 -51 234 -104 -81 88 -123 76 133 -225 -14 152 -105
3627 -105 59 16 -198 157 112 -197 55 7 -94 183 -51 -203 145 34 -89 107 -132 -73 214 -85 -130 100
3649 100 -71 30 135 -203 -39 169 -79 8 43 -162 105 136 -182 5 62 -86 129 4 -206 132 73 -121
3671 -121 61 -53 -81 180 -46 -153 97 -28 -29 109 -141 -65 173 -57 -49 57 -116 48 120 -147 -28 81
3693 81 -59 52 11 -143 82 87 -102 35 -2 -65 119 -7 -123 81 19 -47 68 -78 -58 121 -32 -75 41
3716 41 -56 4 88 -98 -49 73 -37 7 34 -98 28 81 -96 2 27 -48 69 11 -97 45 46 -43 42 -22 -53 68
3742 68 -8 -67 33 -14 -17 53 -50 -38 49 -28 -14 19 -51 -3 36 -59 -16 25 -24 23 3 -46 18 22 -27 8 -3 -22 28 6
3772 6 -39 8 8 -6 19 -13 -17 23 -1 -17 7 -16 -11 20 -20 -18 21 -3 -5 7 -6 -2 5 -12 -11 6 5 1 -6 -6 -1 -4 -8 -12 7 6 -6 -11 -6 -20
3812b0K2mj6J4onJ2JrK0j1j2K4qoJ3j6j6L5j2j4J3j4K2Rm5J5K4k6J8J1l8M6j2
3846Il4M4j7k7M8j9n1O8k2k0M1k2k7N5l0j5L8k9JL3l3oM3n0J4L2l6PL6n5K2K1
3878A9m8L5Rn2M6ll7M0jm5O2k1k5N2l6k5O3m6j5N7l8j2N6n7J8L4m9K9J3n5K9K5
3910B2n0L0J5m9L6J2m5N1j8k7N2k8k7N2l1l2N8l2j8N9m3rM7m2NM4n4K1L5n3K9
3941A0%l2L6Pn6L5J5m7N5j8l7L6Ll8M0j6k1M6l2j0N1m7J5L0n8J5M5m8J4K8k6J2
3973GJ4m9L5J8m4L4km6N1j2l5M4j8j7M1l1j4N8m1j1M1m1J3L4o1K5L0n0M1J0o2
4004c8N3J3o4N1lm0O5l1l9N4k4k8O6n1j0P3o8kO5p2J4N0q3M1M4p8M4K9p5P0Mq1
4036e1P8%o4Q3m3m5R3m4m3Q1n6k2R8q7j5R3r1J2O3j05O4P2j26N9M4r6P8K1j38
$$ plain form
3812 -20 2 -2 -18 -4 -10 -15 -3 -2 -11 9 -2 -14 10 2 -4 9 -7 -23 12 0 -14 -1 -15 7 16 -29 -14 10 -16 2 13 -25 21 9
3846 9 -25 19 2 -25 23 4 -47 21 -1 -21 20 -2 -29 26 -4 -19 19 -10 -9 24 -9 -15 28 -22 -8 24 -12 -5 31 -24 -2 19
3878 19 -29 6 15 -37 9 6 -31 9 8 -37 25 4 -21 31 -5 -30 33 -13 -28 29 -9 -21 35 -22 -4 30 -19 10 23 -32 -3 22
3910 22 -28 2 17 -32 4 16 -29 22 4 -23 29 1 -26 26 -5 -37 21 -11 -29 30 -13 -22 25 -17 -12 32 -22 -1 34 -19 10
3941 10 10 -22 14 21 -35 0 15 -32 23 5 -32 4 7 -31 9 -7 -28 18 -14 -24 27 -20 -5 25 -33 -18 27 -21 -7 21 -5 7
3973 7 21 -28 7 25 -19 15 13 -33 18 6 -29 15 -3 -20 21 -10 -24 34 -7 -18 23 -18 -5 29 -32 -7 23 -27 14 24 -38
4004 -38 15 28 -36 15 12 -28 37 6 -33 21 -3 -31 35 -16 -26 47 -21 -23 42 -30 -16 34 -49 -8 36 -42 2 31 -44 26 30 -51
4036 -51 27 27 -37 46 3 -42 51 7 -36 45 -11 -33 65 -22 -37 56 -35 -23 40 -65 -1 71 -55 4 48 -48 30 51 -87
4065h7J26Jq5R4m4q0J38l8r1J21o0m4J22j10k9J45j04qJ01j34M5R9j45M5Q1j20
4091f1Q4M8j72J19O0j49J08j2j10J62l1j44J35j6q4J62j22p7J90r9m5J31j26J0
4115c9J70j83pJ37j40N8R5k07J11J18j94R4M1j75J85Ok01J56K7j36J78r3j31K43
4139A13p9j23J70j14m7K17j96m1K13j59J8J34k24R7J71k29O2Q8j83J64N1k47J72
4162B8N3j70J79o3j61K38m3j98K05n6j08K46j83r7K42j30m0J80k25L9K29k35k
4185g2J65j86J07J14k84J33J46k08J10M2k15K42Pk34J81j2j43K30j17j51K69j03
4207B1j10J91j66j9K43k10m8K08j61L8J39k53Q4J79k13O8P1j90J90M1k43J59N6
4230G5j73J75m4j73K32l2j63J85j01p5K29j52r5K15j27j9J59j97J0K13j95J8J33
$$ plain form
4065 -87 39 40 -45 49 5 -75 63 25 -66 55 -5 -49 73 -37 -66 79 -25 -33 68 -66 -21 78 -67 -22 59 -61
4091 -61 23 71 -101 18 78 -71 37 25 -85 77 46 -98 37 21 -63 99 -23 -100 90 -9 -54 77 -49 -39
4115 -39 131 -52 -59 78 -62 -4 91 -116 -5 113 -81 13 54 -121 64 70 -131 25 52 -84 94 1 -130 113
4139 113 34 -89 81 -33 -80 137 -59 -100 113 -46 -28 106 -118 -21 150 -79 -17 71 -112 52 103 -144 28
4162 28 81 -89 90 27 -134 104 61 -137 68 12 -96 150 -33 -130 112 -18 -58 122 -103 -64 165 -70 -72
4185 -72 93 -93 14 128 -156 -23 123 -85 25 67 -148 94 101 -133 48 36 -107 123 6 -145 124 21
4207 21 -89 102 -64 -83 160 -50 -98 110 -51 -13 126 -127 -43 136 -77 -9 62 -128 62 103 -140 19 75
4230 75 -98 77 33 -140 92 60 -103 82 -19 -94 135 -17 -112 103 -24 -43 116 -81 -71 142 -53 -35 98
4253I8j86J02R8k38J12J07j82J21Qj66J84J9j79J48k9j00J73p7j19J75o6n8J37
4276H2j17k5J73j39l5J36j24L2J16j72L1J19j39O6L4j38J21L9j34Q3L1j18J26
4299D8k3j18J43k4q5J03m6o0J36p5n0R5n5l3J02q4%Q0r2RO9r6N1N5r7M0M2q0N8
4328A3On8M2L4p7M5Qm9N8j6m0N1j0k8N0m1k6O7m3j8N8l7j1N0l5k9N5l2mK9l5L
4360b0L9l7NK0l4J5K7l3J9J6k9J2K5l9QJ0j8K3J1l5K7Nl5J5J6l4K7ll1K9mk2K0
4393epj5M6k7j2K5j0mL7l8kK9l0LL3k9KK7l3QK3l7J3Ll1L6ll9K9kk3L7j5j9L3
4428Cj7qK9j8qL0k7JK9l6J9J9l1J1K5l7J7J5l7L1j2j3L1jl4L3l0j5M6l2JK4k9
4461b1%M0n0K6K4n6M8Rn8M5J2m6M6rn2O4j8m8P8m1k2P2o2j3P0p9J7O5q6J8P7q4
$$ plain form
4253 98 -88 14 112 -126 -14 93 -89 32 40 -126 58 77 -102 46 17 -83 90 13 -106 69 3 -55 82
4276 82 -35 -60 113 -26 -61 75 -49 -17 99 -73 -42 77 -62 4 38 -100 21 60 -74 9 40 -78 48
4299 48 25 -93 50 26 -59 44 -2 -62 74 -1 -51 44 -11 -44 58 -26 -26 54 -38 -29 40 -56 -5 50 -47 -7 35 -45 13
4328 13 19 -39 3 37 -40 5 13 -36 22 6 -34 17 7 -21 29 -12 -38 29 -14 -32 26 -11 -22 28 -7 -36 19 -13 -17 12 -23 -20
4360 -20 19 -18 -13 7 -27 -12 15 -18 1 17 -12 0 25 -14 -6 4 -14 9 20 -15 12 17 -18 -3 13 -21 6 3 -28 1 -3 -25 -5
4393 -5 -12 -27 19 -8 -20 5 -5 -9 28 -10 -12 17 -13 -10 23 -6 -4 23 -10 -2 21 -16 -3 0 -31 5 2 -37 -8 -10 -33 4 -11 -30 3
4428 3 -14 -22 7 -11 -19 11 -16 -15 14 -22 -3 16 -15 -4 21 -16 1 16 -21 10 -2 -15 16 15 -19 14 -16 -31 15 -17 -16 8 -21
4461 -21 -21 19 -31 -5 19 -37 11 20 -38 7 19 -27 19 10 -42 22 4 -44 34 -7 -29 43 -19 -32 38 -41 -24 41 -45 -27 50 -34
4493c4L4L3r3P0L4j10R1j2p0J00l1r1J33m9n0J04p8m1J40j01l7J28j23K8J11j51
4519f5L0J22j56O3O9j44J01N9j79J19K6j36J53m3j44J94k9j40J76q3q6K16j37
4542a4q2J98j49kJ74k13K3K01k09M4J28k18J26J22k71J42J01k35J90rk30K57J8
4565I2k34K11n7j46K91j48j66K84j32p1K39k45l4L04k48j3K10k52J08K02l61J25
4587d1J95k82J66O9l26K79Q6l32K34mk22L39j12k79L57r5j79K97k20q9L84k63
4609c8j16L05k46N0K65l78N3L18l22J03J50l67K65J71m13K06J00k92L18l1l80
4630b79L91jk87L05j58j76M38k21k30L89k10o1L34l84mM21l44mK54l77K02K56
4652B54m61J45K35l49K63M7m13L64R6l81K94n1k62M40j60l25M07j20j65L59l19
$$ plain form
4493 -34 0 33 -60 10 44 -66 25 13 -57 43 12 -79 54 5 -45 59 -19 -60 80 -21 -58 70 -53 -25 86 -65
4519 -65 -35 87 -69 -6 63 -81 20 79 -100 19 45 -91 62 19 -125 69 40 -100 76 -7 -93 123 -14
4542 -14 -96 102 -47 -49 125 -88 -65 136 -73 -29 99 -119 7 129 -142 0 101 -134 56 47 -183 74 92
4565 92 -142 69 12 -134 157 9 -157 127 -5 -76 163 -82 -116 188 -60 -73 137 -115 -7 195 -166 -41
4587 -41 154 -128 38 107 -219 60 146 -186 48 44 -178 161 49 -230 127 32 -147 150 -70 -159 225 -38
4609 -38 -154 151 -95 -45 220 -158 -105 213 -109 -6 144 -223 42 213 -200 6 106 -186 132 101 -279
4630 -279 112 111 -176 129 -29 -205 233 12 -218 171 -39 -100 234 -150 -154 267 -77 -81 173 -204 -2 254
4652 254 -207 -62 173 -176 87 134 -279 85 181 -200 94 43 -219 221 61 -264 143 23 -142 217 -102
4673a02r4M51k92j09L18l05Q2L06m38O9L22l40J56J27m05K84J90m29K34O3k96
4694b08L74q1l75L94j5k54L18j91j75M42k20k07L43k23j2L37l76k3L82l06L3J99
4716A56l49J81K51m15J34J82k97K44L5l72L18P3l12K64p6k12L73j29k64L26j20
4737ij11L07k65q0L53k22p6K31k60Q6K53l25M1K17k41J28R5l09K08J33k86J73
4759D1K3k24K65l6k66K67k5j71K36j41j36L12j44j25K26j60k0K23k28j8K30j90
4781f1K6J30k15J05J51k33Q2Q3j65J56J4k04J62L1j50J34m2j19J95o2j23J73r0
4804b2m4J51j22n1J66j01k2J04j22L2J21j55L6R2j09N2M4j35Q5N1j11P3J1q2J02
4829D4j4r2R3j1n5O2k1n4Q6k8m7N5j1l4O7n5j3O6n3KL3m7J1L7n0K1K9l5J2J6m0
$$ plain form
4673 -102 -196 255 -37 -146 172 -133 -51 255 -183 -114 208 -132 24 151 -254 30 220 -209 25 88 -208
4694 -208 166 85 -290 104 89 -165 153 -38 -213 229 9 -198 145 -78 -90 247 -129 -152 230 -76 -43 156
4716 156 -193 -12 239 -176 -42 140 -157 87 122 -250 68 141 -171 93 17 -195 178 49 -215 111 -9
4737 -9 -120 187 -78 -158 195 -27 -103 128 -132 -46 207 -118 -77 140 -101 27 122 -187 21 154 -132 41
4759 41 64 -160 105 69 -197 70 45 -126 110 -31 -167 145 1 -124 102 -58 -78 145 -83 -101 129 -61
4781 -61 -35 95 -120 -15 136 -97 -15 68 -97 59 73 -131 31 62 -88 46 4 -115 80 18 -105 68 -22
4804 -22 -66 85 -37 -88 78 -23 -45 59 -63 -31 90 -65 -29 63 -46 6 50 -85 0 51 -60 13 24 -58 44
4829 44 30 -62 31 20 -35 27 6 -48 38 10 -37 18 7 -27 40 -15 -28 38 -15 -13 20 -27 -16 21 -29 -8 21 -14 -2 14 -26
4860b6K6K1l8J2J4l5K4Mj7J6kmPKk3L3lk1J0J8j4NJk4K0JnQQl0J4mj6J9mj8K0
4897ajk3L6k1j5K9nj5K7k2j4M2k5nK9j9k1N1k8j5M0k3MK3m2J0K5m3K9J6m2L4n
4930A0l7L5Ol6K7kk2L0k2j8M2k0oK2k8PL6l8RK1l0J6J0l2L3j1j5J4Ok1K7j2k1
4963b0L1j5mK4l4J2K3k9J1Pk1K7Nm2K8Jk4L0j9j4L9l4jM6o2J9M9n5J1M5n6K0K0
4996A8n9M7J7n1M2Ko1Q5k9n6Q4l5l7P5o0l7R6o4j9Q9r3L3Q0j12K9P5j04O8L3j32
5026g6Q3M9j15Q9j0q4J20j8j14J13l6o3J41q7o8J68j02m6J34j26J1J47j71J9J36
5051I4j52N7J01k10J26R7j98J04K9j63J89J4k14J79rj41J88q9j38K47r8j08J89
5074I4j40l4K25k11k8K15j83L1J64k68R7K00k59R0R8k34K08N3k79J93O8k10K09
$$ plain form
4860 -26 0 21 -17 -5 9 -26 -2 2 -15 1 -1 -5 2 4 -19 14 11 -10 0 18 4 9 10 -14 6 7 2 10 18 -12 2 -2 -18 1 -3 -21 -1
4897 -1 -2 -25 11 -10 -25 4 -1 -16 11 -11 -25 17 -8 -13 16 -3 -24 27 -1 -16 24 1 5 28 -14 -4 21 -22 7 23 -19 15 10
4930 10 -27 8 14 -22 5 3 -19 11 -11 -29 13 -7 -13 9 -19 -12 24 -14 -5 16 -14 2 12 -20 13 2 -13 1 7 -14 13 1 -20
4963 -20 11 -4 -8 16 -18 -6 17 -12 -1 6 -15 12 17 -25 3 4 -20 10 -9 -23 16 -18 -19 27 -35 -16 33 -22 -11 34 -22 -2 18
4996 18 -41 6 23 -28 14 16 -45 40 11 -45 39 4 -33 42 -18 -55 41 -23 -42 47 -46 -13 67 -45 -16 59 -45 23 56 -76
5026 -76 7 56 -59 30 20 -64 56 38 -76 37 1 -62 79 -8 -76 92 -10 -56 78 -48 -37 110 -61 -42 94
5051 94 -58 -1 100 -110 16 113 -85 19 48 -115 74 88 -126 53 44 -97 91 2 -136 111 13 -95 94
5074 94 -46 -80 145 -66 -94 121 -62 -31 133 -135 -38 162 -97 -7 91 -143 65 118 -161 32 100 -110 99
5097I9o3k09L08p1k18K47j16r2K94k28j17L16j95l5K31k89N6K80l01K6K00k66
5119a43J81J22l62J98J50k83K20lk81L22Nl16K65m0j69L09j80j97L70j47j42K72
5141A51k55nL33l07n0K75k56R9J94l77J45K43l21J37R1l03L00O6l79K73L8k39
5163a47L10j24k71L94r0k28K82j75q8L80k77j51L57k31pK55l54P0L18l43P3J76
5185A29k98K09J37l94K14J49k85K37l3k88L46jk92K65q1j63L39j92j93L54j64
5206eq3K59k85JL36k86m8K56k67J19K03l75J30K14k80J41P0l05K92P0l31K19K0
5229F5j94K70j10k29L12n2j78K36j80o8L14k14j13K55j77J3K06k82N5K21k27N3
5251b4J20k32J63J25l03J50J01k04J91k4k18K40Pj92J73o6j16K34j23j31K29j05
$$ plain form
5097 99 36 -173 135 64 -154 93 -23 -115 179 -49 -166 150 -45 -80 151 -138 -82 198 -103 -77 123 -143
5119 -143 38 160 -202 -4 146 -137 83 80 -201 121 126 -190 75 35 -134 175 -5 -202 168 21 -121 151
5141 151 -104 -109 224 -83 -133 142 -114 -15 179 -198 -53 190 -131 6 97 -206 94 160 -219 54 92 -147
5163 -147 163 39 -232 162 72 -156 126 -49 -137 243 -34 -185 172 -59 -66 189 -165 -95 223 -120 -47 129
5185 129 -169 40 177 -217 -3 146 -139 98 65 -223 123 122 -170 95 14 -149 190 -2 -195 159 -5
5206 -5 -88 171 -114 -113 223 -63 -111 145 -122 -3 200 -175 -45 169 -111 30 100 -205 87 157 -174 45 65
5229 65 -129 141 31 -198 114 62 -116 120 -60 -128 186 -28 -141 114 -63 -50 156 -126 -71 150 -77 -24
5251 -24 96 -136 27 152 -151 -1 100 -104 87 63 -155 85 92 -100 73 7 -109 125 2 -129 100 -5
5273ep1J84j84j6K23j78j9J50j75P4J30k24P6J38j78Q7O8j81J48M1j80J19J8j19
5297g4J52n3j35J77k7j04J23q1m4J57j02n0J20q7qJ15j33OJ14j03K1N9j09P0O0
5322F4j13M6M4r2P5Nr8J00Pq0O7no3J01k9p3P1on8P0m4k0O5m3j4M3m4J1M7m6m
5353a6M6m4J1K2k6PK9m6K4J6l9J9J1l6K0J6k7LK1k1J4Pl1K5Lk5J0J2k0L4rk3K4
5386A1qk4K6J0l3L2J0l9K9jl4L3ql4N0rl2L5j5k1M3l1kK6l0qM5l7jL9l7%L5m4
5420b4K7L2n6J7L0n1L5Lm7N7j1m8N7%n1N2k0k3L7j4k9N6l1j7L1l7JN2m8KL8m7
5452b7J9L3m4K2J9n1M0J1m7M4ok7L6j7j4L4k4k3M3k1j0L8l5nM3m7J3K0l8J9Ok8
5484b4K5Nl2M2j8k8M0j1k3L3k5mM8m5NL6m6K5K0n9L4K6m0L0Lm1N3j7k6L5j6l3
$$ plain form
5273 -5 -76 108 -76 -92 131 -47 -66 84 -91 -17 113 -111 -35 103 -75 12 80 -101 47 88 -92 27 45 -74
5297 -74 78 25 -110 67 40 -64 59 -22 -66 91 -11 -61 59 -28 -36 79 -54 -48 66 -37 -16 43 -66 4 64
5322 64 -49 -3 41 -51 24 29 -69 31 38 -42 25 20 -43 58 29 -44 27 21 -37 33 -11 -31 34 -9 -23 20 -24 -13 34 -12 -16
5353 -16 30 -14 -3 19 -7 0 29 -17 7 23 -16 3 14 -22 -2 14 -13 -10 11 -10 4 11 -20 5 8 -17 -7 5 -15 19 10 -13 11
5386 11 3 -21 5 15 -18 14 24 -15 14 13 -21 12 4 -30 20 11 -21 14 -1 -22 21 -10 -12 14 -16 -24 21 -16 -17 22 -15 -15 20 -24
5420 -24 3 35 -21 -4 26 -25 10 13 -34 23 12 -36 21 21 -30 22 2 -21 16 2 -27 29 -2 -19 12 -25 -24 28 -20 -18 20 -27
5452 -27 -8 25 -19 3 22 -29 11 22 -25 19 13 -14 22 5 -9 25 1 -22 21 0 -10 28 -7 -12 31 -16 -3 17 -21 -2 4 -24
5484 -24 1 6 -26 16 -2 -30 10 -1 -24 9 -16 -20 28 -17 -12 24 -22 3 23 -36 -2 24 -16 14 17 -24 29 12 -14 21 5 -28
5516b8O8o0j2O9n0LL6o0L4L9p2K7L2o2M7Mo1O2K5p3N9j9n3J05n3o8J01m0l8Q9
5546E1p7j9J06o9j1P4r8K8Q4j32M4P0j07Q6Mj18J17J8j09J00j8j06J44l6j19J54
5572F1o2n7J35j14m3J72j07l6J24j37L5J23j71L0J26j49P9N7j85J29Q3j81J14
5595B6K4j58J84l2j66J83j9j13J75j14r1K29j24r4J83j42qJ79j97%J87j83N5J05
5619H9k17J13J43k30R5Q2j98J91K3k51J94M2j75J88q7j40K60q0j71K10r5n2K22
5642A56k03p5K63j84nJ60k39R6J95k65N1J41k09J52O7k67J74J08k37J73k3j83
5664a54K58l4k27K26m6j29K53j74j13K87j46q7K00j84J0K38k56j1K16k10P1J28
5686A16k73J50J46k57J29O1k22K35Rk63K22Rj77K19j00j64K90r4j64K22j33m6
$$ plain form
5516 -28 40 -20 -32 37 -13 -10 26 -34 0 39 -33 -6 26 -36 11 15 -46 16 41 -32 27 8 -45 60 7 -61 40 0 -38 51
5546 51 -26 -45 61 -8 -19 55 -43 -15 69 -63 -19 51 -56 30 34 -84 33 51 -58 42 24 -82 62 26 -93 61
5572 61 -1 -58 77 -37 -80 92 -15 -51 73 -64 -29 94 -77 -47 79 -70 9 66 -119 10 93 -88 26
5595 26 50 -108 76 44 -122 61 42 -71 104 -10 -101 128 4 -90 93 -49 -57 122 -75 -75 112 -71 -16 89
5619 89 -128 -15 128 -102 -7 75 -123 68 91 -160 34 76 -99 89 2 -138 122 42 -129 81 -14 -66 156
5642 156 -47 -122 141 -43 -48 112 -127 -31 164 -101 -50 91 -118 34 101 -166 8 116 -121 52 29 -154
5664 -154 104 70 -157 69 23 -106 147 -27 -140 147 1 -86 114 -70 -60 178 -78 -89 127 -83 -12 116
5686 116 -157 -7 139 -118 11 72 -150 85 94 -169 53 62 -115 104 4 -160 130 36 -128 94 -39 -85
5708h5K55k20o8K42j70MJ66k48P2K11k55O2J22k02J65O1k63J54J03k05J71l7j79
5731a44K40l8j91J91m0j20K41j68j01K48j29o6J76j74J7K15k24lJ60j64P8J11
5753A15k39J13J30k07J01M4j77J70L4k10J55K3j29J62o9j26J99m7j14J34q8l8
5775f4J72j45l8J65j09j2J08j42K2J33j44M2O0j37J03O4j79J07N0j21R7j2j19
5798i9J44pj08J06k7o3J27p8p8J44n7m2R8r7JJ20j02j1P6p5J7O7j18M6O3q9M5
5825CK5q7P5K5j02N9K0o7O8j3n8O8J1n8M7ll9P0l8m4P1k2k2M2l4j3O2m6j1L9m3
5856a5J0K8m2OM4m3QJ0k7K3K6m7J7J8l8K4J7m1K5J7l8K5kk1L0Nl6M0j4k4L2k0
5888cj1L0j4oK1j6j4M7j9k9L0mk2K6k7oM1k8rM2m0jL1l5J0L3m4J9K6n6K9J2l1
$$ plain form
5708 -85 170 -50 -118 124 -46 -42 124 -124 -52 159 -96 -34 88 -114 51 112 -151 3 106 -99 72 35 -144
5731 -144 96 58 -133 58 18 -102 139 -29 -130 118 -11 -77 99 -75 -58 157 -67 -70 90 -74 4 115
5753 115 -124 -11 119 -88 13 57 -120 50 84 -126 29 52 -77 85 16 -110 89 42 -72 62 -26 -64
5775 -64 108 -37 -75 90 -19 -31 77 -65 -43 90 -54 -12 48 -89 14 78 -101 6 56 -65 32 20 -99
5798 -99 45 38 -70 36 9 -54 73 -5 -83 61 4 -38 60 -37 -36 84 -18 -29 47 -28 -11 56 -62 -16 47 -42 3
5825 3 28 -59 16 41 -61 -2 18 -49 19 6 -52 16 27 -31 16 13 -26 44 6 -38 33 11 -11 31 -3 -16 46 0 -11 28 -15
5856 -15 -5 23 -19 -13 31 -12 -4 6 -21 2 28 -19 -2 16 -22 2 19 -22 3 20 -18 7 5 -16 14 19 -17 23 9 -15 17 -3
5888 -3 -14 16 2 -4 17 1 -13 34 15 -14 16 12 -10 16 -11 -17 24 -4 -13 29 -11 -12 19 -16 -6 27 -17 2 28 -28 1 13 -18
5921a8J7J8m3L0J5m6M4j1l7N5j1m1M1j5j6N0l0k2M3j6k0M7m2nM9l9kJ7k7%L3n0
5953c2K1L5n7L9Ll5L7pm0N2j1k3L8k4k2M7j6k4M5l1j4M2l0kM2m2K0J9l7J6K4m4
5985a1K8Kl2K6ml1L2Nl7L1k0j2M0k1rL2m3J1L3l8lL4l2K2K2l7K3J1l2K0Ql8M7
6018B7j4k0L9k4k1M7m5mM6l5oL5l7K3J5n2K7K1n0M5jm8N5ql4L6j4m3O4k5l2O6
6050C3m3j5N9n3MN7n4jO2p2K9L2p4L9L2o2M0J4q2Q4qn5O5k2n4J03m4o2R6p1OO4
6082D7o9nR4r0J4N9j06N6O1j06M3M1q5O8Nj00Q4L3q8P7j2q0J14l7q1J23l6o2J04
6111F6q8k0J26r1k9R7r0K1Q4j35L2R1j08N4M1j39J09M6j39R2J3r8J19l6j03J25
6137D0j4p8J15p7m9J58j03m0J22j04J0J14j30%J30j26L9O8j43Q4P5j57P6M5j20
$$ plain form
5921 -18 -1 17 -26 4 19 -27 17 6 -31 24 13 -28 13 -2 -18 32 2 -20 23 7 -13 34 -8 -13 36 -3 -5 12 -15 -15 18 -32
5953 -32 -11 24 -33 6 9 -26 11 4 -36 16 5 -18 20 -4 -26 21 5 -19 26 -5 -19 23 -7 -9 33 -9 11 30 -7 9 33 -11
5985 -11 17 19 -13 13 9 -22 10 15 -22 9 -11 -23 17 -4 -13 19 -24 -13 20 -18 -21 13 -19 3 25 -12 11 22 -10 10 18 -20 27
6018 27 13 -7 32 8 -13 34 -11 -15 31 -4 -10 25 -12 11 26 -26 1 22 -28 17 16 -32 23 15 -19 17 3 -40 24 -1 -33 33
6050 33 -10 -25 34 -19 -15 42 -12 -13 49 -23 6 38 -36 3 35 -27 13 27 -55 29 21 -34 31 9 -45 58 14 -48 48 -23 -17 47
6082 47 -22 -27 67 -23 -9 50 -56 0 61 -45 -2 39 -46 22 27 -73 11 44 -44 33 21 -59 55 18 -63 60 24 -38 66
6111 66 -22 -42 84 -7 -36 61 -29 -8 76 -59 -27 64 -44 10 51 -88 21 67 -72 20 33 -65 54 18 -85 40
6137 40 26 -52 63 -14 -63 95 -8 -48 74 -30 -20 94 -36 -36 94 -32 7 75 -68 16 91 -66 10 55 -65
6162f5J17rj44J39%r8J01l5q6J57o2r4J41p7l6J34j29k7J63j00j7R5j22M7J12
6187A05j63L8Q9j16P2L8j52J13L8j20Q7pr5J51m1j31J42l2o8J25r3n0J58r2n2
6212e6J24j05kJ29j33qJ26j13L7O3j45Q4Q4j44O9M4j16J13Lj35J24Nr4R9m4p6
6238f7J44n9q0J19o3k6J23j01n5J29o8k4Q1r7K5R2j20J4Q5j10P9L9j39J00K6j01
6264e4P4mp7J06j3r5R3j7n4J00n8m6J09n3m3P4o3pR5q0j7Q4p6J9N2q5L0P5j21
6293e2N1K1n7N1J5p7N5K0o3N6nm9O4mo0O0k3l1P4m1l6O7l6j6N1m7%O8o2RL1n7
6325b3K0L3n9K2M6o4K4J3l9L7J0o0L2J0k9L0jl5M1Km5M9qj8L3k0k1M7k3k6L9k1
6357dqM4l4mK8k7KK8m2J8J7l2K6%l2J6K3l8K3Mk0J3J5m9L5Pl7K8J3k8J8jk3K9
$$ plain form
6162 -65 52 43 -101 38 38 -60 41 6 -80 77 15 -79 62 -15 -51 83 -46 -73 90 -10 -27 68 -54 -7 105
6187 105 -58 -20 69 -47 25 63 -89 24 62 -58 29 22 -73 78 37 -94 48 16 -52 73 -20 -70 88 -4 -56
6212 -56 68 -37 -39 90 -43 -51 75 -38 -1 62 -83 1 85 -59 10 54 -62 51 54 -81 43 48 -46 53 9 -67
6238 -67 77 18 -62 57 -6 -32 91 -10 -65 64 -4 -28 53 -44 -19 73 -47 -33 52 -58 21 60 -79 21 47 -54
6264 -54 20 16 -61 45 32 -63 30 13 -41 59 1 -45 64 11 -32 42 -21 -28 67 -13 -30 54 -22 -3 49 -36 -6 69 -52
6293 -52 -1 20 -37 14 29 -48 7 27 -36 20 15 -34 30 26 -34 26 3 -28 46 5 -31 36 0 -16 35 -12 -12 56 -6 3 34 -23
6325 -23 -3 30 -29 -7 39 -25 -1 12 -27 10 20 -40 -8 2 -27 3 2 -33 8 10 -35 14 6 -12 21 1 -20 27 4 -22 17 -4
6357 -4 -12 32 -2 -6 22 -5 -3 25 -17 1 18 -14 12 12 -20 -4 19 -19 4 8 -12 1 16 -33 2 9 -28 0 13 -15 3 2 -21 8
6391Hj1j1K6j3j9L9k2oK3j3pK7k6KJ3j6MK3l0oL0j6jK5l4OK4l3J3J9k8LJ8l7L5
6426ILl5K6Ol2L6j1k6L6kj9K3j2k0L5j5oK1k5OK3k3MK0k1RJ5l8J3K0l2RK0k9K3
6461A1Lk3K3Nl4J6Ql3L0j0j9M3k5j0L9k1j7L7k2pK2l5J6J7j5J5Rk0ONk6K0J8m0
6495a4L3ok8L1j2k2M2l1kJ8j1j6L2k4%J5j6MJ7l1K7Rl0K0J4k3OJ6k5K1jl3L9j1
6529Hk2K9qj6L4j9j8L4k2NJ9l1KK2k7RJ6k5J1J2k8J5J0l0L0mk7K2Lk8L7j7j2M1
6563B5j7j8K1j4nL2l0MK4l0J1L3o1L2K1m2J8J1l6L7j3m1M3Nl6M1j1l8O3k2k8M7
6595B6l7j7M8l7pM2m1LM0m7K4K6m5J3K0l7L3K7n7M4nl5M5j2m0O1j9l5M7k6j8N0
6627C4l0k7M8m6KM1m9jO0n2ML9n5L0L3o4K5L0n5N1on1N6Ln5N4qm2O2k6m2P0l1
$$ plain form
6391 8 -3 -14 12 -1 -20 19 -3 -9 14 1 -6 21 -5 -3 10 -6 -2 21 -9 -15 15 -1 -2 23 -11 -5 19 -14 -1 18 -10 -7 11 -26 9
6426 9 12 -23 3 9 -23 13 2 -24 12 10 -9 14 2 -18 17 2 -4 17 -8 -2 21 -2 2 22 1 10 25 -13 0 20 -12 -3 17 -12 11
6461 11 14 -9 14 19 -15 1 9 -24 6 -4 -23 20 -5 -15 24 3 -14 23 1 -6 16 -19 -3 14 -1 14 23 3 9 14 -12 8 26 -14
6495 -14 19 13 -15 16 4 -18 24 -7 -9 9 -2 -18 14 -10 -10 5 -11 -7 10 -21 6 15 -15 5 19 -4 2 18 -7 14 13 -20 19 8
6529 8 -14 15 7 -9 25 6 -12 22 0 5 24 -7 -5 17 -10 -1 15 -10 1 13 -15 0 10 -20 10 6 -21 1 4 -24 13 -4 -16 25
6563 25 8 -10 11 -3 -8 24 -6 -2 22 -8 3 36 -25 7 28 -14 4 15 -21 16 3 -38 5 10 -26 15 4 -34 29 7 -21 26
6595 26 -11 -28 20 -17 -24 18 -23 -20 20 -27 -3 23 -22 -9 11 -26 7 34 -23 21 16 -19 26 14 -26 35 16 -19 28 2 -16 34
6627 34 4 -23 25 -21 -19 22 -27 -28 32 -20 -16 23 -32 -2 31 -33 -8 22 -33 18 12 -39 17 20 -35 19 11 -31 31 5 -37 33 2
6660Bk6O4o4lP9o8MM8n9J4N6q2K2M7p5L3K5o4O4J4p8N0J3o4O7j7m4O8nn5P5n3
6692a2k1Q0n6k7O9l5k0O7p1jO8n8J3M1q0M8M5p9L1J5n0N5jp3N7J8o4M9km8P6l3
6724Am5O9k6l3P0n4qO6n0j4P1o3jP5r0K3N9p3K5L5q8M6N3p7L4J8p0P8j9o1P1j
6756B1o0P3l7m1R1m3m9Q1m4l4Q1o1j6O7m9jN6p5J8N8n7J5L6m9L1K6p3M4J7n3N2
6787B5mn4O5pn3N2j5l6O2l9k6O2l7k3N7l8j1O4n9kL9m0MM2n3K1L1n1J9K6n2L4
6819CK3o1L9Rn2N8j7l9N4nj7L4k6k7N7l2k5N2l2j1L4l1j0M2l9%L9n1J9L4m8J6
6851a0J8l3K0K0n1L2J3k5K4Km0M6ll9M1ok4L3j7k1M4j9k0L0pk0L8k8j4M2l8LL6
6884B7l6lJ8k0J0J8l6QJ7k2K3J9m3J6J5k3K2Nl1K3mk7L2Jk4N1k0k7L5k1jJ8k5
$$ plain form
6660 2 -24 40 -24 -27 52 -16 -12 36 -23 -9 47 -35 -13 34 -41 -8 17 -47 17 31 -47 3 16 -48 19 2 -42 26 21 -34 41 -12
6692 -12 -33 47 -9 -36 33 -2 -22 45 -26 -27 41 -17 -4 37 -43 5 50 -29 2 17 -33 22 21 -52 5 23 -41 8 6 -42 34 1
6724 1 -44 25 -1 -34 36 -18 -26 40 -10 -24 47 -16 -17 58 -32 -9 50 -23 2 37 -51 -5 48 -29 5 23 -47 31 12 -49 22 21
6756 21 -39 34 -3 -44 47 4 -45 36 -8 -42 39 -22 -38 29 -20 -21 35 -40 -22 36 -21 -6 30 -19 12 38 -35 9 26 -27 25
6787 25 21 -33 32 25 -28 24 9 -27 35 -4 -30 32 -5 -28 29 -9 -20 44 -15 -17 22 -18 -14 28 -25 -4 27 -24 -5 21 -31 3
6819 3 26 -35 4 13 -39 19 2 -37 17 12 -5 29 3 -24 33 1 -24 28 -4 -15 19 -12 -22 20 -19 -19 20 -31 -12 22 -26 -10
6851 -10 8 -25 -5 15 -36 -4 9 -16 8 10 -30 16 13 -26 15 9 -15 18 1 -20 24 5 -15 15 8 -12 26 -2 -16 26 -12 -9 27
6884 27 -9 -12 6 -14 -4 14 -22 -14 3 -19 4 23 -20 -4 11 -12 10 15 -16 7 3 -24 8 9 -15 36 16 -11 24 3 2 20 -5
6917eKK5k0lK0k4NK0k5lK8k5QJ0l2J8Rk6RRj6K2kl1M1j3k4K9kk8M3j9j4K7%j4
6953aJ8j2%K9l4kK1k8OJ7k3J5J7l5J2J8l2K3%l1K6Jj7J2j0%J8Jk5K8j7j2L9k3
6987aqK9k5pL4j8lJ8k3J0J6k6K1Ml6K1J5k1J8%k5K8j4j5L3j6k1L5k6j6L9m0oK9
7021Cj5JL6m1J0K9m1K7Kl3K7Om4M9%l1L2jk8K8Kk2K1ol0N9k6l1M3l2pL7k7KJ8
7056A7m0J9J4l1K0Rk9K5Nl5L8j1l2M8j1k0L2k0j5M1j8nK4k9lM2n1%N1m5K1J1m8
7089b6L7J4m6L3Nk7K7jm3M6j1l8N2k9k7O2k2l9O2l8j5O4p3oO8m0lM3n1J8M0o5
7121b9L6K4n8M3K1o8O0on2N9k5k4N5j7n8O6k9k8P8n6k5O8m1j5N9p1J2O3p6J8L8
7152B2n7L6K6p1M5L2o8M9Nn7O1po5P6j0l8P0n2k8Q6n2k3N0m2JO4p5PN7o9J5M6
$$ plain form
6917 -5 -3 22 2 -1 19 -5 0 20 -5 -8 20 -5 3 13 -19 -1 8 -18 -9 0 -16 6 4 -27 14 1 -23 6 4 -24 19 0 -14 13 13 -1
6953 -1 17 5 5 34 0 -2 19 -9 -3 14 -9 6 23 -12 0 18 -14 9 9 -22 4 5 -12 0 -10 -10 8 9 -16 12 -5 -17 22 -1
6987 -1 -9 20 -5 -12 22 4 1 19 -4 6 22 -4 17 21 -15 6 21 0 18 18 -7 21 7 -8 25 9 -12 23 -3 -19 20 -20 -26 3
7021 3 -12 -11 25 -16 -6 23 -18 9 11 -22 5 11 -33 16 16 -15 17 16 -12 16 18 -4 17 11 -19 40 14 -17 26 -6 -13 24 -3 -1 17
7056 17 -23 -4 10 -21 -1 8 -21 4 9 -26 12 1 -31 17 6 -14 18 -2 -17 24 6 1 25 -4 -7 35 -16 -16 35 -10 11 22 -26
7089 -26 11 25 -21 12 17 -10 17 16 -27 19 8 -30 22 -7 -34 28 6 -33 29 -9 -24 40 -33 -39 29 -11 -14 29 -22 -4 36 -29
7121 -29 7 31 -27 16 37 -31 29 23 -29 30 5 -19 36 19 -39 27 -2 -30 48 -8 -33 35 -6 -21 38 -33 -21 42 -34 -16 22
7152 22 -35 1 27 -44 1 33 -35 14 19 -38 23 16 -49 27 17 -21 49 -3 -31 55 3 -20 30 -12 -11 53 -22 -15 42 -27 -12 34
7184C4q3M5N6r6L8L0p2O6Qo9O4Qo6O6k2n0Q9k6o2Q1l9k7R1o7k4P9n8rO9q3K1N5
7216D7o7NO6p9L2M0r5N4L1p4M4Oo5Q1j2n7N6j5m6Q2m1l8Q0l8k5O8n9j7Q8p8RP4
7248E7q7K8L6o9L9M7p9M2J8p5O2J9q0N5J7o4O2k7l9P4k4n0O3l6k2P0n8k6O7m6
7278b6LN5o0KN9m7%L9n8L7L5q4N3K0o1N7pn7O4J9p8M9Kn0P1l5l9P0l5mL9m8lN5
7312C7m7j7N8n4kN2p1K4L9n5L1K8n9L5L0n7K8J6m2N0jm9N0ml8M1j9j5M2j4l0L9
7344B6j5k6M2m6pN0m5PK7k4kK4l6J4J5k1J9Ql4K0K0l8K6Rk9K4jl5L0J1l3M0j7
7377Ck5L2%k7L6j6j1L6l7j4M2k7%K7l5pL9l4kK6k6K1kj5OK7k7QOk9J6J2j3J5j
7412Dj6K4j3j7L3k3pL3j3j1K2j4j9L6j6oK3j8JJ6k7RPk2J0J9k6J3Rk5J0Pk6J2
$$ plain form
7184 34 -49 -4 52 -44 -6 24 -48 18 26 -43 21 29 -37 29 7 -43 46 20 -42 39 0 -27 64 -3 -27 52 -6 -15 54 -29 -8 47
7216 47 -20 -15 51 -28 4 44 -51 3 34 -40 4 10 -55 26 14 -43 13 -2 -48 34 -7 -45 35 -3 -28 40 -19 -36 52 -26 -17 57
7248 57 -30 -2 34 -35 4 51 -28 14 32 -43 19 38 -42 13 30 -34 28 1 -38 36 12 -38 25 -11 -33 37 -21 -47 20 -26
7278 -26 -23 32 -28 -26 33 -14 -14 25 -33 4 39 -45 8 28 -33 24 17 -40 24 43 -35 14 16 -34 37 2 -37 33 -2 -6 33 -15 -18 37
7312 37 -10 -27 31 -23 -25 27 -44 -20 19 -36 -5 23 -36 -1 29 -28 0 16 -26 24 23 -26 24 20 -18 23 4 -11 31 17 -13 26
7344 26 11 -15 27 -19 -26 24 -21 -14 13 -11 -13 11 -25 -11 4 -17 2 10 -24 -4 16 -22 4 13 -16 8 7 -28 2 13 -20 20 3
7377 3 -22 10 10 -17 19 3 -8 28 -9 -23 19 -8 -8 19 -16 -23 16 -18 -20 6 -20 1 -1 -16 -10 17 -10 -2 4 -25 -9 3 -10 5 4
7412 4 -12 12 -1 -18 15 -8 -15 18 5 -6 16 2 -17 19 3 -3 20 2 3 19 -8 1 8 -14 -4 15 -11 2 11 -14 -4 3 -23 -11
7446a1Nj1J7oj1K8j1j3K7j3lRj2j7L8j4pJ9mj2J1nj1L4k8PJ2j9%J8j8MLj7K0q
7482Aj6RJ6k1J6pj3J8j1k4L4Lj3J0j6LK1oj2J9j0%J7k2J6K2k3nJ7l0J3Ok8K0j
7517CqJ9nk0J3rj4L2qk5L0j6nJ8poJ2j5NJ8l2K0J2l0J1J5k7J9J7l1K0mk4M3qk7
7553a4K4j7%K0k3ML5l2k0L3j9lJ2k3J0K1k3PLj0OJ2k1K3kl2L8j4k3L5mk4K9j1
7587ck4M3j2j7M1k3qL9m3KJ9k8RL0m1L3ml0K2Rl6K9ok8K5%k4L0j5j6M3l0j1M8
7621B3l3j0L2l0J1K6l3PM0m1J3K4m9L5Ll5K9Kl8M9on5O1k1j8K4nm2N6j2l2M4l7
7654a8kM7l6k1M8l4LL0m5J6L1n5K8J9n4M5J7n8M8Kl1M3j0m3N7k4j8M7k6k2N5l9
7686@j2L9l7pN1o3RN5n7OM0n9L0L4p8M4J7m3L1Ml9N0j1l4M2j0k4M8j5m2N6j8k8
$$ plain form
7446 -11 -6 -17 0 -6 -17 11 0 -13 14 1 -2 7 -5 -22 16 2 -5 14 10 -2 9 4 -7 27 -1 6 18 -1 -1 17 -1 3 6 -11 9 1
7482 1 -15 -6 10 -11 5 -2 -15 3 -8 -32 2 5 -8 2 -14 -11 10 4 -8 11 1 1 18 -4 12 34 11 6 23 -7 6 12 -16 4 3
7517 3 -5 14 9 -11 2 -7 -21 11 3 -22 8 -8 -13 5 -2 -8 4 -11 -6 12 -20 0 12 -18 -7 8 -19 0 17 -14 6 2 -22 21 13 -14
7553 -14 10 -7 -7 13 -10 -6 29 -3 -23 10 -9 -12 0 -23 -13 8 -15 -8 -5 -15 -9 3 -18 5 3 -29 9 -5 -28 7 3 -21 8 -3
7587 -3 -27 16 4 -13 28 5 -3 36 -7 -5 14 -14 -5 25 -16 17 13 -17 5 14 -22 7 1 -27 -2 -2 -26 4 -11 -27 16 -14 -25 23
7621 23 -10 -20 12 -18 -7 19 -14 -7 33 -8 5 29 -20 15 18 -17 12 14 -24 25 19 -36 25 4 -14 10 5 -37 19 7 -25 19 -18
7654 -18 -20 27 -9 -30 18 -16 -13 17 -28 -12 19 -36 -8 11 -43 2 19 -39 9 11 -20 23 13 -30 27 3 -15 32 6 -16 39 0
7686 0 -12 27 -10 -17 34 -29 -20 35 -22 -16 24 -35 -5 29 -49 -5 12 -31 0 4 -35 15 4 -30 12 2 -22 26 11 -31 25 7 -21
7719b1N5l9j5O6n4lL8n2J9M4o3J3L4n5L1K2n2K2J8m8M6lm7O2j9m1N1nm1N7l2l2
7751d4P3l9mL9n3LN4m9LN2n2J1K9m4L7K0m6J0K4m8L3lm0M7J2o3N3Lm5L9j5k9M5
7784A3k4j6M4m1mM4l0pM2m2K0L0n3J7K2m0K5K6n2L8Pl4K5J3m5M3ol9K5Kk7M1k3
7817fj5M2j6k9M0k5OK1l7NK3l1J5K6n0J4L5l1mK8l8L6Pl1K1Lj6K6rj8L7%l7K6
7851A8pk7K9k1j1L4k0%J9j4j3L2k7%K1k3J1Nj7LRk4K4Pl7L2Rl3K7lk4K6nj0K3
7886A3lk5L2j5rK4rj0K2j5nJ8j7lJ6k6PNj3MJ4k7J1J7k8J2Qj9K4mj8J8NrlK1k4
7923a1J3mj7K1klJ7jj8J2pJ1Qj8pK5pj7J7qkJ1k9J1OJj4Qj7J4Jj5NJ1k0J3Oj5
7961b1J6Nj5K5oj5R%j0J4Nj1J6j2jRj5mK0j1KJ1j1O%j0JJ7k0KLj2J4pj4K0rj9
$$ plain form
7719 -21 34 -5 -20 46 -8 -11 27 -25 -6 38 -25 -12 22 -33 -2 20 -32 -10 8 -40 6 3 -44 18 -1 -42 9 4 -37 20 -12 -44
7751 -44 29 -10 -14 25 -28 -25 29 -20 -17 35 -17 -6 23 -21 16 36 -10 0 24 -24 9 6 -34 13 25 -38 15 18 -27 12 -3 -32 13
7784 13 -11 -27 17 -24 -28 16 -14 -21 21 -21 -1 29 -24 -7 15 -25 0 26 -26 12 19 -15 10 23 -22 21 15 -24 1 3 -24 17 -6
7817 -6 -21 21 5 -24 16 -9 -3 18 -19 -14 9 -22 -7 19 -31 -17 18 -13 -17 11 -27 9 16 -15 6 9 -7 19 10 -8 29 29 -8 18
7851 18 11 -16 13 -8 -19 15 -5 -5 14 0 -13 19 -8 -8 13 -10 1 6 -11 -8 1 -23 1 8 -29 3 12 -21 6 3 -21 5 0 -10 13
7886 13 10 -15 17 2 -7 17 8 -2 20 5 0 18 1 -2 14 -12 -5 0 -13 -9 5 -22 -11 6 -22 -10 -2 -21 3 -1 -19 -1 4 -5 -8 13 -11
7923 -11 2 -2 -19 2 0 -3 14 13 -5 7 0 11 19 1 -6 19 12 -5 12 4 2 13 -16 -5 1 2 -12 -4 -21 -7 -6 -21 -16 -5 -25 -12 -6 -21
7961 -21 -5 0 -15 10 4 -11 -2 -2 -12 2 7 -4 12 0 -1 8 -7 -11 9 -2 0 11 0 6 6 -4 -3 14 -6 -4 -1 -13 1 -6 -20 0 -9 -28
7999b8K3j2LJ4j6j0K3j2lK7mqJ4onNo%K1j7lPnMJ6k4J7j7j4J9nj1J7poJ4kk1K2
8038Dj3j5J3JpK5j5oJ6j3JJ3j1J0J0k2J4J0j7J4kk6L1oj5K2Rk2Rlj4J8j6pK1k0
8074irK4rj1J5j5J3J2l7J9NqnJ1j4J3Oj7J9j3KJ8kj2J6j7kRQk4L8j6%Rk5J8Kj0
8112Bj5K7k4J1oj6K1klJpj0K4j0njJ2j2J9j6j2K5j3jK3j6oL1m0J4K6k1J2Ol1K1
8148HJ3l2J9Mk9L4qk8L2k0jRj0j1L3k6NJ5k1pK5l0kL6k3J7Rk5RK8l1K3kl2L3l
8184A1j5K2Jl6L2qj5
$$ plain form
7999 -28 -5 -17 -14 0 -16 -26 -3 -15 -18 9 5 -3 11 5 0 5 -1 -1 20 3 0 7 2 6 22 -2 15 -2 -16 3 -2 -13 4 -3 -9 5 3 -18 4
8038 4 -9 -24 -11 -10 -17 8 -7 -13 3 -10 -9 4 -7 3 13 -9 5 15 -2 12 10 -16 15 9 -6 16 25 3 12 9 -5 13 -3 -10 11 -9
8074 -9 -18 6 -3 -14 1 -14 -1 11 -26 -7 -2 -10 -15 -4 -18 -5 1 -16 3 -10 -8 10 8 -4 12 -5 -7 2 10 -14 24 8 8 17 -8 10 12 2
8112 2 -13 14 -10 1 -5 -21 0 -2 -5 -4 -11 -21 3 -7 -12 -13 -1 -13 6 -10 -22 3 -10 -11 12 -4 -10 21 -19 -5 21 0 12 18 -13 8
8148 8 21 -11 8 12 -17 17 9 -19 13 -7 -8 1 -9 -20 13 -13 -8 7 -14 -21 4 -26 -28 8 -15 2 11 -14 -5 23 -8 15 13 -19 14 11
8184 11 -4 18 19 -17 15 7 -8
8191h
$$ Imaginary data points
##PAGE= N=2
##DATA TABLE= (X++(I..I)), XYDATA
0@%%%%%%%%%%%%%%%%%%%%%%%kOqJ0j4J6j9K3k6L1l7M0m8N6o2P3q1R0j04J18j32
44g0J49j67J85k05K28k52K77l04L36l67L99m38M76n15N56n96O35o64O74o50N57
65B44l08l09J951p475N0535K51492k50684l1642K1169k42893K53487N3052l09232
78b10613K45314J34792k08678J21764j41898j63588L79839k9981k63036J63715
88B7630p0791j0849K63411k45969j39597K90548j03364n3826J24383k16394J06033
99b8785K52973k78121n1015J46719j24680J55645N8869l05781J42782J64352j86007
110e3049P9799k6019j49242K64076k461k57112J44483J9702o3194J79766j64625
121b7876j39941K66314m2622j09137J10715j38165L1983K14931k00937p1642J67328
$$ plain form
0 0 0 0 0 0 0 0 0 0 0 0 0 0 0 0 0 0 0 0 0 0 0 0 0 -2 4 -4 6 -8 8 -11 12 -14 17 -20 20 -28 28 -34 39 -42 48 -56 62 -70
44 -70 79 -88 97 -108 120 -132 145 -159 177 -190 209 -229 247 -268 288 -308 327 -337 337 -313 244
65 244 -64 -373 1578 -5897 44638 296130 45446 13804 34973 -207920 45567 98619 -210613
78 -210613 34701 169493 -39185 82579 -59319 -222907 156932 126951 -136085 27630
88 27630 -43161 -54010 209401 -36568 -176165 114383 11019 -42807 81576 -134818 -28785
99 -28785 224188 -53933 -104948 41771 -82909 72736 131605 -174176 -31394 132958 -53049
110 -53049 26750 731 -148511 115565 113104 -144008 475 20177 -43017 136749 -27876
121 -27876 -167817 98497 55875 -53262 57453 -80712 -48729 166202 -34735 -106377 60951
132F0951q8508N4390O7983k24465Q8232J67727j60496K4163L1918j20501J63731
143F5125L0004k07892J01237N8052q4850J08548p5272j14623J90905j2005j21057
154f1828Q9212n8056j0804J51487j25184p6259J43881m9950q561O5154j34931
165g5839M0190J35195j20225j1873N9142p9368Q4309L8906j51121O1694P1490
176E2500p9718N4934j9641q6993J21611Q391j05204O3805j0704l0993R5784o6144
188b372o5345J05287k3752l3286N4765o9592N841R2417p3473k2703N7207m6525
200b1531K8807L5815q7339K8618N6164n7096K0364Q881n3451N9397J4782o8691
212c5280L5350J0669l0061M5783k3770m1429N8752o617l1387L3196k6081o619
$$ plain form
132 60951 -27557 26833 94816 -129649 -41417 126310 -34186 -10023 21895 -98606 65125
143 65125 95129 -112763 -11526 46526 -38324 70224 -5048 -119671 71234 59229 -61828
154 -61828 27384 -30672 -41476 110011 -15173 -91432 52449 2499 -6062 59092 -75839
165 -75839 -35649 99546 -20679 -32552 26590 -52778 31531 70437 -80684 -18990 52500
176 52500 -27218 27716 8075 -78918 42693 51084 -54120 9685 -1019 -32012 63772 -2372
188 -2372 -67717 37570 13818 -19468 35297 -34295 -28454 63963 -9510 -32213 24994 -21531
200 -21531 7276 43091 -44248 -15630 40534 -16562 3802 12683 -40768 18629 33411 -35280
212 -35280 70 10739 -19322 26461 2691 -38738 20014 13397 -17990 15206 -10875 -17494
224a7494M9968l5583j9531L8792k1376K499K4034l9943Q824L3075l1015M516J3246
237A0012k6538K2412J0974l4111J6419J0315j9741J8118l995k0086K3934j048
249F665j6737J5454o683o416J8481j1890p815J6141q238k146J0283j1643J489
262c055J0576j0004R69N485p333M721K361p726N045J338n291M603j029l452M549
277A757j832k047L279j911j67J341k138K135K16k729K609l79j228K836k552n86
293a396L616k506K25J640l482L109J656n227L039J267l973M249r88m685N486o76
309A354l820M295k681j580N647m321j790N372m026O8M423n604R86M881m971R54
325h13K858m282K847J812m748K933J174l478L304m10l457L807r2l055K466m33
$$ plain form
224 -17494 32474 -3109 -22640 16152 -5224 -2725 21309 -18634 -9810 23265 -7750 -3234 10012
237 10012 -16526 5886 16860 -17251 -832 9483 -10258 7860 3865 -16221 7713 6665
249 6665 -10072 5382 -1301 -7717 10764 -1126 -8941 7200 -1038 -3184 7099 -4544 -3055
262 -3055 7521 -2483 -1514 3971 -3362 1359 3720 -4006 1039 2377 -2914 1689 660 -2792 1757
277 1757 -75 -2122 1157 -754 -921 420 -1718 417 633 -2096 513 134 -1094 1742 -810 -1396
293 -1396 2220 -286 -61 1579 -1903 1206 2862 -2365 674 1941 -2032 2217 1229 -3456 2030 1354
309 1354 -2466 1829 -852 -2432 3215 -1106 -2896 2476 -1550 -1482 2941 -2663 -1677 3204 -1767 -813
325 -813 2045 -2237 610 2422 -2326 607 1781 -1697 1607 1197 -2260 1547 1455 -1600 866 433
341D33j572K142p96j393J218mk79N2m58Q0M55N17r95n67J897q19o22K167k625
360a169n2M468l846j237M636l900Q19M296o976J826N842p117K522L087q459P225
376A965L357j1849P039L075r321R925k044j1743J4273p85j1216J1998o068o108
390g502J8149j1394r505J8548r805k849J5773j9522Q45K2390j9471p19J4380j9747
404a0429J2435J3611l0159J1544J5461k2484J6186J043k8029K9452N760l1045
416a6654K1484k406j7277L3813j6209k7005L7281q362j5369K7252k8338m580M4415
429B8045l0911j3823L1231k6091J1112K7444m9414R645L8054l4950J1210J0621
441A2173m1514L8997J9089n4317K3886J2170k9221M1970j4830m7864N4801K473
$$ plain form
341 433 -1139 1003 207 -1186 32 28 -251 -199 -657 -577 -122 395 -600 -1167 730 -89 -711 1456 -1169
360 -1169 -1221 3247 -599 -1836 2800 -1100 -281 4015 -2961 -1135 4707 -2410 112 3199 -5260 1965
376 1965 5322 -6527 512 3587 -5734 4191 2147 -9596 4677 3892 -7324 4674 -1394 -7502
390 -7502 10647 -747 -10252 8296 -1509 -4358 11415 -8107 -7262 15128 -4343 -5062 9318 -10429
404 -10429 2006 15617 -14542 -2998 12463 -10021 6165 7208 -20821 8631 14391 -16654
416 -16654 4830 2424 -14853 18960 2751 -24254 13027 4665 -10704 16548 -11790 -16370 28045
429 28045 -2866 -16689 14542 -11549 -437 27007 -22407 -12762 25292 -9658 1552 12173
441 12173 -29341 9656 28745 -25572 -1686 10484 -18737 23233 8403 -39461 15340 17813
453A7813l6553L4489k6146j4934O4397l6473l5512N0568k3206L29M0314o3050
465b7964K700O5691m6027m236K6619m9742M1127L6252p8420K0103L6887m0808
477a7818L9528p610o6596O8299J9842o2666L5233j2440k6544P6476l5148o1026
489e0470O7520q769j9355M5900o2712q476Q7776m8581k8409M3035m4747L0994
501C706M9822r0910Q856O4316m6746K2304O535p3633O8260L8894q3856K7533J1185
514F266l5900P4107k6952q1098P8601J0937m3562M5274n0540k0441J01835m6281
526A2246n5140N8804l1062J3903N7468r4542l447Q9392m9296j525K2272p1367
538e2294O0229N4967r8113J5064L8188m1104N8659j3465q9730P8166L0985o3588
$$ plain form
453 17813 -18740 15749 -10397 -25331 39066 2593 -32919 17649 -5557 -5228 35086 -27964
465 -27964 -25264 40427 -5600 -9836 16783 -32959 8168 44420 -34000 -13897 22990 -17818
477 -17818 21710 14100 -52496 15803 35645 -27021 8212 -4228 -30772 45704 10556 -50470
489 -50470 17050 8281 -11074 34826 -27886 -36362 51414 2833 -25576 17459 -27288 3706
501 3706 53528 -37382 -28526 35790 -10956 11348 17883 -55750 12510 51404 -32452 -4919 6266
514 6266 -29634 44473 17521 -63577 15024 25961 -17601 27673 -22867 -43308 58527 12246
526 12246 -42894 15910 -15152 -1249 56219 -38323 -41770 47622 -1674 -3199 19073 -52294
538 -52294 7935 62902 -35211 -20147 18041 -23063 35596 22131 -67599 10567 41552 -22036
550b2036L6596k7053l0182R7921l4976p4384O5764r585r351N4568p8560j6392
562d7670R8945m2805k7430L5315n5196M1265O1468r7643O34O1446m0683L3520
574B1166J534q6006O9085M7256p6910K3053j006l4377Q4334k3132q5097O7409
586G309J0771k9683M6927n8021k5898R8835l3832m7426M3781l5897J9779O0252
598E6897q5059j1079P2406l6483Q785J5663p0901M9896N3241p5645R405K1718
610H844l3963N7476p733p8221N6516K5393m1775L2106l0083k8594Q1489k1347
622B0108n6706M3792j2933m34M8556o3021j8559P1861k6861j2781K2093m9448
634c4333L1470N0960o6884k017L5346k9051L3242L339o5733M2689L2613m4525
$$ plain form
550 -22036 14560 -12493 -42675 55246 20270 -54114 11650 2065 -7286 47282 -31278 -47670
562 -47670 51275 8470 -18960 16355 -38841 2424 63892 -33751 -33117 28329 -12354 21166
574 21166 22700 -63306 5779 53035 -23875 -822 -1828 -36205 48129 24997 -60100 7309
586 7309 18080 -11603 35324 -22697 -48595 50240 16408 -31018 12763 -23134 -3355 56897
598 56897 -28162 -39241 33165 -3318 5467 21130 -49771 125 53366 -22279 -12874 8844
610 8844 -25119 32357 24624 -53597 2919 28312 -13463 18643 -11440 -40034 41455 20108
622 20108 -36598 7194 -5739 -6173 42383 -20638 -39197 32664 5803 -6978 15115 -34333
634 -34333 -2863 48097 -18787 -20804 14542 -14509 18733 22072 -43661 -972 31641 -12884
646a2884J9449q716k8172N9893r718n3501L7840N38j3827L6663l8397k1362N8243
659B6049j7418k2358K4449k8302J1903L9851m7023p675L6181k1308J1257R959
671A5565m3750K5666K9849l7558P189O710k0819L4335j767m1240K6621R813j7661
684g047K0677j8490j7477M0688q913k3768J9811j2065J053K7111k8823r598K8992
697A2151j3025J05J0814k5859J2445K2019k5541K113J0375j5012J6750L174k5737
710a5228J5223R186j4831J0891n072j1954K1212l465j5785J2877l383l817J3783
723I637j2729o341J6732o415m099P355j0037L964J0839j2505m01P611o571N159
737B199K146j1133O653N406p731L527l64m901P914j029o667N083o70j845M708
$$ plain form
646 -12884 6565 -2151 -30323 29570 19852 -33649 4191 4729 -9098 27565 -10832 -32194 26049
659 26049 8631 -13727 10722 -17580 -5677 34174 -12849 -20524 15657 -5651 5606 15565
671 15565 -28185 -2519 27330 -10228 -3039 3671 -17148 17187 15420 -25820 801 10614 -7047
684 -7047 13630 -4860 -22337 18351 9438 -14330 5481 -6584 -5531 21580 -7243 -16841 12151
697 12151 -874 -769 10045 -15814 -3369 18650 -6891 -4778 5597 -9415 7335 10509 -15228
710 -15228 -5 9181 -5650 5241 169 -11785 9427 5962 -9823 3054 -329 -4146 9637
723 9637 -3092 -9433 7299 884 -3215 4140 -5897 -1933 8906 -3599 -4000 3611 -2960 2199
737 2199 4345 -6788 -135 5271 -2460 1067 703 -4198 3716 2687 -3980 1103 433 -1412 3296
752C296m433j888N650k742j097K653l275J261K572l405Q45J264j827J798m56j484
768a268K217r62p06J733j464M40J086k039J375O03j942J859p04j466L030j768
784B4j651L287k061o40K938l349L92L313l832Q61K417l951K606J642n017L428
800D07J566m587L816l9m213N172p73m278M992j640k645N374l604k187O021l947
816e65j351N126m991K60N231n796O62M429n467K186L029o048L412K471n800M019
832H07J055n332N100O1n123N340p52m088N346j913l118N395k802k193N097l495
848f15j122M648m103j83M225m395M58L493m171J254K500m087J951J833l733K260
864B13R28l180K749K71k929K720Qk234K382m94j574K118o09j072J547p38m89J177
$$ plain form
752 3296 -1137 -3025 2625 -117 -1214 1439 -1836 -575 1997 -1408 -563 701 -1126 672 216 -1268
768 -1268 949 -13 -719 1014 -450 -10 1076 -963 412 1015 -927 932 228 -1238 1792 24
784 24 -1627 1660 -401 -1041 1897 -1452 -1060 2253 -1579 -718 1699 -2252 354 1996 -3021 407
800 407 1973 -2614 1202 1163 -3050 2122 1349 -2929 2063 423 -2222 3152 -452 -2639 3382 -565
816 -565 -1916 3210 -1781 -1521 3710 -2086 -1424 3005 -2462 -276 2753 -3295 117 2588 -3212 807
832 807 1862 -3470 1630 1691 -3432 1908 1156 -2932 2414 501 -2617 2778 -24 -2217 2880 -615
848 -615 -1737 2911 -1192 -1375 2850 -1545 -1087 2406 -1765 -511 1989 -2098 -147 1686 -2047 213
864 213 1141 -2039 710 981 -1948 772 780 -1454 928 434 -1140 978 369 -703 844 106 -383 794
882G94p41l03P83n52k00N72j70n63J52N86n42k02P35r90J17J567j637l73J737
901G70j416N61J298k916J356K318l153J212J114l318L517R84n210L284J367l649
917a881M048j636m433O652r61m847N025k853j734P593n952l716Q288m104j064
932a575N662q400J732R149q817j98N604p382O029M170j2851N792O603q972N947
947B493n27j0033J2639J412j2707Q217o03n397J2418p892r739J5353l313o225
961c904R369j0814j63J6868j3074n514J2206q864M597Q627j9221N383J4824j3810
975c490L650L254j4316J6222N596k1670R858N383j0117J4795p578j6604K2348
988G331N2j4477J1982r423l196K3285j5956j2739J9763p695l1J2440k2984L339
$$ plain form
882 794 53 -250 533 -19 -219 353 183 -380 -228 358 -184 -386 349 -641 -524 1043 -594 -967 770
901 770 -646 -85 1213 -1703 -347 1971 -1182 30 1144 -2174 1343 2327 -2883 401 1768 -1881
917 -1881 2167 531 -3902 2750 1789 -3058 1967 -886 -2620 4973 -979 -4695 3593 -511 -1575
932 -1575 4087 -4313 -2581 6568 -2249 -2447 3157 -4225 1804 5974 -6877 -1085 5518 -3454 2493
947 2493 1966 -8067 4572 5984 -6723 1494 891 -4506 7912 20 -9719 5634 2321 -3904
961 -3904 5465 -5349 -5512 11356 -1718 -7232 4974 -3890 707 9334 -9887 -4504 10320 -3490
975 -3490 160 3414 -10902 5320 10916 -10754 -896 4487 -5630 9165 1587 -15017 7331
988 7331 7383 -7094 4888 -4535 -7731 15554 -402 -13141 6622 -1073 -1104 11336 -11648 -8309
1002h309K3831j7687k406R215j5639J5469J0549k8458Q350J4024j3961J2172l779
1015C371k1379K4993O042k2893J1520k874p443K4903j4041k0266K4701k501p631
1028c498J3887k1050n45L0146j8662j0615J5614j3418J0769J4472l1824N243K3005
1041A3524j6628O042J334k2765K4883J1091k9895J0065N230j0960K3086j0975
1053D032k5372K7840L132j5602J3566j5393m444L2054j7060j7700K0148q641L615
1066A75J6040k9550P92K8616j6461k155P142j9817J9078J5111l1395N530J3590
1079F696j2329J6003n215k6043K5729R155k1474J0386o470p532K8840j2804k2618
1092a7676K1941k065m026J4818k3639k775L0411j4961r251J1646j5083J2336J6521
$$ plain form
1002 -8309 15522 -2165 -4571 4644 -10995 4474 15023 -13435 -5085 8939 -5022 7150 3371
1015 3371 -18008 6985 13027 -9866 1654 -1220 -8663 16240 2199 -18067 6634 4133 -3498
1028 -3498 10389 -10661 -11206 18940 278 -10337 5277 -8141 2628 17100 -14724 -9481 13524
1041 13524 -3104 2938 4272 -18493 6390 17481 -12414 -2349 2881 -8079 15007 4032
1053 4032 -21340 6500 9632 -5970 7596 -7797 -12241 19813 2753 -14947 5201 -3440 175
1066 175 16215 -13335 -12543 16073 -388 -2543 4599 -15218 3860 18971 -12424 -6894 6696
1079 6696 -5633 10370 5155 -20888 4841 13996 -7478 2908 -3562 -11094 17746 4942 -17676
1092 -17676 4265 2200 -1826 12992 -10647 -13422 16989 2028 -7223 4423 -10660 1676 18197
1105A8197k9763J827J9221j2750Q487K51k3468K0997J2376k3414P185J240r447
1118i061K2479p419k3143K0171L232r774J1920j4645n830K6572j0467j3769J3039
1131C305q097M431J4655k2907k031K0686j0265K72M375j7071J3654J3263k1231
1144f961K632P382q593J3815k730j9915J5963O712j2268Q012o693o808K0470o335
1158D683j4502J2161l008r77J1595j5339l785J7836p687l583O310j1327P082J1474
1172A0933j6106J47R191p235O536R34j4112J0108P098j1002M188o63n829J2382
1186F570k620j1784Q959J018l935O847p519l911J2375l957n614N404m914K232
1200h49P622r769j511P969m316J519K106q216M965N736p417J383J678m012O132
$$ plain form
1105 18197 -11566 -9739 9482 -3268 5219 5470 -17998 2999 15375 -8039 -854 386 -9061
1118 -9061 13418 5999 -17144 3027 6259 -3515 8405 -6240 -12070 14502 4035 -9734 3305
1131 3305 -4792 -361 14294 -8613 -10644 10042 -223 49 4424 -12647 1007 14270 -6961
1144 -6961 -4329 3053 -5540 8275 5545 -14370 1593 8305 -3963 4049 -2644 -9452 11018 4683
1158 4683 -9819 2342 -666 -1643 9952 -5387 -9172 8664 977 -2606 3704 -7623 -541 10933
1172 10933 -5173 -5026 4165 -3070 3466 4400 -9712 396 7494 -3508 680 17 -5812 6570
1186 6570 3950 -7834 1125 2143 -1792 5055 -2464 -6375 6000 2043 -3571 1833 -3081 -849
1200 -849 6773 -2996 -4507 3462 -854 665 2771 -5445 -480 5256 -2161 -778 900 -3112 3020
1215C020k96p300N011J633l563L814k769l031O555j618l888L536j712k76L841
1230B957m148j110M280k147l40J619l082J664K596l467J81J716j474J437R8k511
1246a731J731J125j475N81m31n66J791m34j308P77L3L6M90q20j94O12l2Rl24j71
1266c01M46k02M1J74n57L68J67n43O99k16p51J032l06n40J210r98n00J730r98
1285d5m57J313j412L35J581j997K99J358j798J079Q12k503J621R46k389J683K14
1302F40k179K400k18k290K500n40j683K629j414j309L078j820j101K877k130l04
1318h64K727k808J03K717k807N73J943l058J537J692l380J757J186l009K417L66
1334A092l137K848J09k692K835p18k158L243j281j791L152j773j094L115k314
$$ plain form
1215 3020 2724 -4576 435 2068 -1495 2319 -450 -3481 3074 1456 -2432 1104 -608 -884 2957
1230 2957 -1191 -2301 1979 -168 -508 1111 -1971 -307 2289 -1178 -997 719 -755 682 780 -1731
1246 -1731 0 1125 -350 231 -200 -766 1025 591 -717 60 93 129 619 -201 -395 217 185 194 -130 -301
1266 -301 145 -57 -16 158 -399 -31 136 -407 292 76 -675 357 51 -489 721 -277 -777 953 -45
1285 -45 -502 811 -601 -266 1315 -682 -383 975 -823 256 1068 -1435 186 1132 -1257 426 640
1302 640 -1539 861 643 -1647 853 313 -1370 1259 -155 -1464 1614 -206 -1307 1570 -560 -864
1318 -864 1863 -945 -842 1875 -932 -359 1584 -1474 63 1755 -1625 132 1318 -1691 726 1092
1334 1092 -2045 803 912 -1780 1055 337 -1821 1422 141 -1650 1502 -271 -1365 1750 -564
1349e64n96K961k599l0K623k788M97K125k837J138J614k954J527J133k687J961
1365E24M32k625K348J71k344K250m02j738K472r28j517K364j089q43K088j660
1381d97l57K151j751j52J662j699M39J329j883N94J084j541P95M33j433J166K45
1398E85j338J035l6q96J107l84p51J027l52l91O89n45k1O03n92J40L52n25L47
1417E4J19l88L89j16j99L88k60Q5J80n65M95K26p22M85o1m92R54n10p49J087m13
1438a3k58Q66j278J91J531j459m8J001j378J067Q90k398J024J225j659J256k27
1455C33j988K614J71k449J806m24j057K850j833k072L295q37j133K077k635P6
1471a206L715k938r81K483k235J434J965m605J340L248l127J170N01l495L968
$$ plain form
1349 -564 -1160 1801 -798 -828 1795 -993 -496 1629 -1208 -70 1544 -1410 117 1250 -1437 524
1365 524 956 -1669 679 850 -1494 756 354 -1384 1088 160 -1357 1007 -82 -925 1163 -497
1381 -497 -854 1297 -454 -606 1056 -643 -204 1125 -758 -164 920 -621 174 607 -826 340 585
1398 585 -753 282 246 -650 457 73 -678 349 -3 -394 295 -250 -271 332 -260 -120 232 -293 54
1417 54 173 -215 174 58 -141 247 -13 72 252 -313 182 408 -314 171 110 -382 572 62 -687 400 -13
1438 -13 -271 595 -683 -492 1039 -420 -468 533 -845 222 1112 -1286 -262 963 -696 560 333
1455 333 -1655 959 1130 -1319 487 63 -994 1856 23 -2049 1246 409 -724 1353 -1282 -1206
1471 -1206 2509 -429 -1410 1073 -1162 272 2237 -2368 -1028 2220 -907 263 764 -2731 1237
1486A237J263m887K339Q06k169L917k176l907N399k94l044L035k897n72N870m082
1502a62k780M528k287P16K987o178J277N596m515J81J738m425M675K420p243K483
1518i89K847l397L921j642n499O687J041n286L270j770j588O970m086m909O204
1533A774j196j197L746o161J55P662m831k100L447m010L618L659q459J616N411
1548C134m221K417k40o257O870K661p428K826M37k543O767l462o491P336K15l303
1564a282L917n158q47Q778m798m135M942l051J952M379q457N47P197m437M75J270
1580A292o024N825M012q363J758K821l241N205j762p221O883K211n121L055k648
1595a318j970Q213l468n882N546j018m35M297o830q43Q043l788k003K660m558
$$ plain form
1486 1237 2500 -2387 -48 758 -1411 2506 330 -3577 1822 1528 -1516 1519 -1378 -1950 3920 -162
1502 -162 -2942 1586 -701 15 3002 -3176 -1899 3697 -818 -637 1101 -3324 1351 3771 -3472 -989
1518 -989 1858 -1539 2382 740 -4759 1928 2969 -2317 953 -817 -2405 4565 479 -4430 1774
1533 1774 578 -619 3127 -3034 -2879 4783 -48 -2148 1299 -2711 907 4566 -3893 -2277 3134
1548 3134 -1087 1330 1090 -5167 1703 4364 -3064 -238 199 -2344 4423 961 -5530 1806 2021 -1282
1564 -1282 2635 -2523 -3370 5408 610 -3525 1417 -1634 318 4697 -3760 -3213 3984 -453 22 1292
1580 1292 -4732 1093 5105 -3258 -1500 1321 -1920 3285 1523 -5698 1185 3396 -1725 1330 -1318
1595 -1318 -3288 4925 1457 -4425 1121 103 -332 3965 -2865 -3708 4335 547 -1456 1204 -3354
1610c354L819M551q025N28M638l357L079k67o777N826L322n965K108m28k522O719
1626C895k160o249N284M57k029L691m743j696P465k768l425L303k816J616M388
1641D213o370p38N314k670O62J029n166L747L874n583O54J677k485M153n00n663
1657c852L982J973l024K251k042k094N670j377l968L044r39j44L481m204j455
1672b698M837j774q86J626l336J866L415m229j87K287j956K085M28m196K519K190
1688A991k813J145l01j874L510k95l339K141K91r94K108j991j506L382p18j624
1704h87J459j346K54K395k337r11K162r39K11Q20k230Q81J899j837M0O78j204
1721h92J438M54k134R27Q56r85Q35l78j137J603O7j218P66k44l34J176p70p83
$$ plain form
1610 -3354 465 5016 -3009 -2481 2157 -1200 1879 1612 -5165 661 3983 -1982 126 -302 -2824 3895
1626 3895 1735 -4514 770 1227 -802 2889 -1854 -3550 3915 1147 -2278 1025 -1791 -175 4213
1641 4213 -2157 -2895 2419 -251 411 1440 -3726 21 3895 -1688 -1034 643 -1842 2311 1811 -3852
1657 -3852 130 2103 -921 1330 -712 -2806 2864 1487 -2481 563 -376 -520 2961 -1243 -2698
1672 -2698 2139 365 -521 1105 -2231 -365 3050 -1179 -1366 921 -1035 1050 1478 -2718 -199 1991
1688 1991 -822 323 22 -1852 1658 1363 -1976 165 456 -538 1570 -421 -1927 1455 737 -887
1704 -887 572 -774 -520 1875 -462 -1373 789 -150 61 881 -1349 -468 1431 -406 -366 312 -892
1721 -892 546 1000 -1134 -207 649 -336 499 121 -1016 587 654 -564 202 -42 -376 800 30 -753
1739g53J133k24l91N93o62p6R33n95l46N66l14O5M14o35J3O28l87j29L51l46Q9
1760g3M26m43j11M41k35o1L03l49j8M31l55p8L75l88j0M82m72o1M59m79O9N11
1782C64n96ON07n19J97L77p40L00N23p17L06K58p42O47L01r44N45K40p15P53r1
1803B60q69R31m2p20Q44l99n49J134n56n91J054o18k94J033r04j58J099r49j1
1822c05Q99j051L39P87j241M81P26j181O36M36j209R30L10j244R39R5r82J121
1840D86k62r76J251l57p45J188o89n15J318q22m08J174r32q1J101j127R7R58j140
1859d81L83P52j220N61N90j178P70L54j192Q96J84j014R76j50q98J122k68p59
1877e72J041n36m53J133p36m09J041p32q4Q73r62J28Q39r13K37N48r11N36M17
$$ plain form
1739 -753 380 156 -235 358 -304 -380 553 -42 -388 178 -136 -71 343 -292 -279 349 -38 -167 184 -162 -73
1760 -73 353 -90 -201 240 5 -56 247 -102 -120 311 -44 -122 253 -135 -145 337 -135 -196 263 -216 -147 364
1782 364 -232 -226 281 -238 -41 336 -404 -104 419 -298 8 266 -476 171 472 -472 73 313 -402 351 260
1803 260 -609 322 280 -440 404 5 -544 590 34 -557 497 -121 -415 618 -286 -444 655 -294 -305
1822 -305 594 -457 -118 669 -572 -91 635 -546 90 526 -683 247 557 -687 252 347 -635 486
1840 486 224 -752 499 142 -603 585 -104 -619 699 -123 -531 643 -289 -370 731 -396 -299 659 -481
1859 -481 -98 654 -566 -5 585 -593 177 531 -661 235 419 -595 381 231 -667 455 187 -572
1877 -572 469 -67 -520 613 -123 -532 509 -223 -307 566 -396 -268 571 -342 -105 443 -468 68 485
1896D85r80N99K75p99O77k2p24Q25j05o37P12k77l47P50n25k53P36n16p1N27o38
1917c08J66N36o70J57L50n33M03J24o19N10O6m59M92k00l08O32l10k85N43l54
1937f7m2M41n28J24M08n54K10K46n28M13Q4n94N46J2m96N24k12l10O83m34k83
1958c57O63m33%N21p61K14O67p67J94L42o84O40J69r66O57K10o51P19l53o57J178
1979E45l02p75Q57m73j87J085j022l67J221o97m2O70j214N42J095j389J78O94
1997D19r81R49K49j661J090O31j170Q45l43r77J803l66j427J266l35l99J451j429
2015c85o79J991q53m71R78j445O34J603j972l8J243j152R75L80k223J385J189
2032A160j739P81o9j263K169k13k169J557J16q05J607j471j118K645p25j244J342
$$ plain form
1896 485 -495 104 379 -420 257 235 -489 336 231 -406 306 29 -318 432 -93 -346 390 -126 -197 330 -308
1917 -308 -142 394 -276 -119 231 -302 101 225 -394 116 182 -277 215 15 -293 339 29 -256 287 -67
1937 -67 -109 332 -196 -72 336 -218 -8 238 -290 123 207 -387 159 171 -325 199 -13 -323 360 -74 -357
1958 -357 306 -127 -127 394 -367 -153 514 -253 -59 283 -401 239 408 -558 99 309 -342 377 24 -633 545
1979 545 243 -532 325 -148 -335 750 -272 -639 582 -115 -157 513 -701 -159 936 -453 -275 419
1997 419 -562 387 636 -1025 65 696 -474 371 28 -949 854 488 -939 327 -8 -407 1044 -385
2015 -385 -1064 927 74 -397 581 -864 -230 1373 -599 -637 606 -546 429 809 -1414 -29 1160
2032 1160 -579 202 133 -1130 1039 826 -1343 214 330 -475 1132 -339 -1457 1188 463 -781 561
2049E61j288K89K155k288o38K087j149L88Q10k470J245J943k276L41O57j480K066
2066I53K06k858J679Q98j419J443j051j509K951m16k023J553p97j33K326k292
2082d89j102K643r63k89J116k372R42K433k487k06J304j447J617N90l104J497
2098c17J604j832J016l68j765K812J07k656J514O9p74K133j723j650K946n09j238
2115f31J383j728K51K701k295r53J985j157O85J042k871R69K186k001L47M00j748
2132a435K262N63k866J295P71j163J702j062j839K713l2j719J295r98k25K468
2148A730j828j344K174p65o4J176k267M08K355j813k86R75j411J379R07k610Q37
2165d47J363j378R58k00j777K090M87k016J027p0p30J887j037j546J973k23p59
$$ plain form
2049 561 -727 -438 1717 -571 -1209 878 -271 117 927 -1543 -298 1645 -631 -290 367 -1113 953
2066 953 1159 -1699 -20 878 -541 902 -149 -1658 1293 877 -1146 407 -390 -523 1803 -489
2082 -489 -1591 1052 89 -200 916 -1456 -514 1919 -568 -774 530 -917 700 1290 -1814 -317
2098 -317 1287 -545 471 103 -1662 1150 1257 -1399 115 184 -590 1543 -180 -1830 1116 607 -631
2115 -631 752 -976 -725 1976 -319 -1272 713 -444 241 1283 -1588 -619 1567 -434 -87 313 -1435
2132 -1435 827 1390 -1476 -181 590 -573 1129 67 -1772 941 909 -810 485 -513 -738 1730
2148 1730 -98 -1442 732 -33 -97 1079 -1188 -780 1575 -238 -524 451 -960 419 1326 -1284 -447
2165 -447 916 -462 496 296 -1481 609 1096 -920 107 37 -693 1194 157 -1389 584 361 -398
2182c98J150j406j48K117j340p49J234r43N18J039j964L12J464j152L48K92j387
2199a013J314O80j720O44M02q20J194l67j372J415J63r58Q22n77m48J498p16q84
2217g43J086m22j38R12j126j62J285p60j96O11q63M67P73j163J64O70o79M64J82
2236C62r90P13M42q41M07O2n66P97j08p80O61Jl93N65m01l36P72k73l81M88l26
2257a25o4N51m84j61N09l10j7L31m49J14M00m25L8K78l40J72K25m30J40K66l39
2278a20J50J28l25K08J51l50J81Q1k62K30O7l45K39N7k65K42J0k87K64M1k48K24
2300G1m3k17L18n2k55K76o2j80L13j37k26L64j13j80K99k08j31L83k37j44L29
2321A68k45j8L24l74K3L50l48N4K76m02J63K72m38J63K33m08K57J30m33L51Q0
$$ plain form
2182 -398 752 -654 -802 1315 -25 -774 460 -483 35 1074 -890 -578 886 -266 82 374 -1013
2199 -1013 301 981 -739 -95 307 -513 681 314 -1058 357 520 -438 384 -193 -641 857 141 -743
2217 -743 343 -79 -217 695 -431 -593 692 -68 -264 347 -516 -49 724 -439 -275 395 -284 180 362
2236 362 -628 85 527 -314 93 155 -411 386 278 -502 159 160 -233 332 -69 -405 367 94 -287 201 -125
2257 -125 -189 362 -122 -283 226 -84 -101 230 -219 -105 295 -130 -92 186 -154 18 243 -187 -47 219 -120
2278 -120 30 158 -167 41 192 -158 23 104 -158 72 139 -206 33 90 -175 67 77 -210 54 95 -153 71
2300 71 28 -189 129 77 -178 98 36 -144 169 32 -194 170 57 -123 176 -32 -163 220 -17 -161 168
2321 168 -77 -95 229 -145 -122 228 -120 -66 210 -192 -29 243 -195 -32 201 -207 50 180 -253 98 178
2342A78m29L70ll70M57j14l66M61j28k84M69k76j97M96l24j33M40l72j7M31m53
2363a64L5L89m40J40K97m84K21K31m45K86J31m61L77N2m06M12o4l65M55j23k97
2384b23M18k11j86M48l02j40L86l09KL48m15P2L36l81J34K08l87K43J67l92K46
2405F2P0l05L25m7k81L51j08k16L38j90j23L36k64o4K96k57K4J93k98J58J53l23
2427a70J86O2k47K72m8k59L07o6j53K43j87o0L14k37l2K59k86R7K11l68J74J89
2449B01l69K36O8l32L39n8l19M15j22k62M03k66j30M83l68j52M61l71P3L63n82
2470b89J94M29n57K36J62n28N46R4o81N04O7m42N97k93m82Q03k51m08N93m58q6
2491b50P98p45j76P67n69J18M95r40L83P09r34K76L45p66P84J53j137P88K71p54
$$ plain form
2342 178 -251 119 116 -254 203 89 -277 184 56 -228 241 -35 -232 264 -60 -193 247 -125 -142 289 -164
2363 -164 -129 260 -180 -40 257 -227 -6 225 -220 66 197 -264 113 165 -241 171 107 -258 197 74 -223
2384 -223 195 -16 -202 246 -56 -196 190 -119 -117 231 -184 -112 224 -157 -23 185 -202 41 208 -184 62
2405 62 132 -173 152 105 -176 175 67 -149 189 -1 -124 212 -52 -116 180 -77 -53 140 -158 0 153 -170
2427 -170 16 78 -169 103 55 -204 103 37 -116 127 -60 -120 194 -43 -75 184 -102 -5 206 -162 12 201
2449 201 -168 68 136 -196 143 85 -234 181 59 -203 200 -66 -196 287 -81 -233 228 -143 -70 293 -289
2470 -289 -95 334 -223 13 175 -353 193 287 -394 110 177 -265 332 39 -443 360 109 -299 294 -164 -250
2491 -250 548 -197 -373 394 -175 -57 438 -502 -119 590 -344 -68 277 -489 295 448 -689 99 370 -384
2511c84P51l30p43J280k73q77Q95m21k37J113j010m38J279o78j27P37j178M31
2529b10J134j338R8P46r53Q16L33j570R42O53j100P65k26r70J589j80j363J116
2547B82k31m67J335j138p37J737o44n26R35j182L08J506j613j86J196j011O09
2564A73N95j873R35J165j494N38K05j180J612R1j865J234K57q76J309r03j096
2581a173K062m36j142J175q97k3J743j658n84J660r15J71Q02j881P80J561j727
2598d82K04O40j234J445L05k116J177P23j154J085n83j242K098k01j543J223m87
2615a42l37J719j447r21J936o81l91R91j590M39J787j740k05J119j134R14O31
2632I48k129R29J199j405O78l3j310J806J46j847J133P4o96J490j043j151J964
$$ plain form
2511 -384 367 37 -706 574 301 -576 319 -102 -339 774 -236 -674 605 -73 -200 537 -641 -210
2529 -210 924 -414 -316 430 -523 293 626 -944 -2 651 -449 316 90 -880 709 529 -834 282
2547 282 51 -416 919 -219 -956 781 137 -389 546 -636 -328 1178 -435 -621 575 -436 173
2564 173 768 -1105 -170 995 -499 39 244 -936 676 767 -1098 136 393 -483 826 -77 -1173
2581 -1173 889 453 -689 486 -411 -434 1309 -349 -933 727 -188 -17 785 -1096 -316 1245 -482
2598 -482 -278 362 -872 573 878 -1238 -61 662 -492 593 10 -1232 866 665 -878 345 -142
2615 -142 -479 1240 -207 -1128 808 127 -264 727 -863 -424 1363 -377 -582 537 -597 317 948
2632 948 -1181 -252 947 -458 220 187 -1123 683 829 -1018 115 189 -507 983 -60 -1211 753
2649G53l76q62J049j122N9J775j500n42J334q73M21P37j837O35J369j385L12L44
2667B91j164J359L40j791R07M94q80J064n37j151J673j00j122R60n58k81J509
2684A013j095p74J406n68j38P98j291K30J359j169r8O86r12P62N35j515N83P33
2702E45q90O18r0r96J211J43j110P19j21m19J068o41p54J154k89l85O74p69j6
2721c48J071q22k79P04n87K77N06j028K85P00o98K29J90p16O82K63q77M25K13
2740A90m70N80j87o07P49k0m88M71k74k07O98m13l43N53k51p0M06n22J7N25m09
2761g2l4K70l81K34K41m99J66K39l28K30L4l57L28Q7l21J96Rj73K68q8k18K68
2783I9m3j38K00j32p5K14j04j02J84r8k8J13j20l0J47j06k9J00q8kR5j02j3J15
$$ plain form
2649 753 377 -485 564 -558 -499 1276 -224 -766 568 -305 116 853 -984 -349 1020 -365 -53 291
2667 291 -873 486 826 -965 -58 436 -444 620 83 -1068 605 505 -617 343 -215 -496 1013
2684 1013 -82 -856 550 -18 -156 642 -649 -419 940 -229 -327 359 -553 209 744 -771 -188 545
2702 545 -345 273 183 -813 398 541 -569 150 29 -390 678 37 -717 437 148 -237 437 -332 -348
2721 -348 723 -99 -378 326 -261 16 522 -506 -221 479 -219 10 200 -516 166 429 -448 -23 190
2740 190 -280 300 113 -494 255 235 -253 218 -56 -263 435 22 -321 232 -19 -89 317 -205 -188 337 -72
2761 -72 -106 164 -217 17 258 -241 -75 164 -164 66 100 -257 71 158 -163 33 42 -131 137 49 -169 99
2783 99 56 -82 118 -14 -89 125 21 -81 103 5 -23 90 -30 -60 87 -19 -48 52 -36 -38 57 -45 -58 57
2807E7q4l2J02p3k8R8o5k7J12o9j7Q1o5j1J05j13j5J32j18JR7j19L3J25j64J7
2833d0J29j39M7Q6j81J01R6j92J03N7j77J65J8k15J97J4j73J84n6j51K43r4j48
2856a26K30j11q4K23j79n5K44j89k6K05k11J6K02k38O2J51k32J21J10k48J68P4
2878A07k31J88K2k13K06kk00K20o4j31K19j11j02K21j56n3K04j74k5J92j88J6
2900e5J57k05N9J31j78Q6P0j81J39N3j79J38Oj37J79m0j16J39k7p5J32j08k3J33
2924I8j10lQ1j16N9P7j44O3L9j00P5kq0R7l3n1O9m6j5R1r9RQ9r7N1M4j03P8J4
2953C5j00J26l4p8J41q5n2J51j22k0J63j54pJ28j64P8J16k35J10R0k11J84Lk46
2977a83K53K5k53K36q6j37L17j75j79L18j63o1K89l13j7L79l13oK42l59J96K42
$$ plain form
2807 57 -27 -59 43 -30 -58 40 -25 -52 60 -9 -26 55 -10 -21 84 -29 -44 88 -30 -29 68 -51 -18 107 -57 -40
2833 -40 89 -50 -3 83 -98 3 99 -93 10 67 -110 55 73 -142 55 69 -104 80 24 -127 116 22 -126
2856 -126 104 -7 -91 132 -47 -102 142 -47 -73 132 -79 -63 139 -99 -37 114 -118 3 113 -135 33 107
2878 107 -124 64 86 -127 79 77 -123 97 33 -98 121 10 -92 129 -27 -80 124 -50 -75 117 -71 -55
2900 -55 102 -103 -44 87 -91 -5 65 -116 23 76 -103 35 41 -96 83 43 -73 66 39 -36 96 -12 -35 98
2924 98 -12 -15 66 -50 9 86 -58 5 44 -56 19 17 -63 34 1 -50 19 -27 -42 49 -50 -41 48 -49 2 46 -57 21 35
2953 35 -65 61 27 -51 90 5 -47 104 -18 -38 125 -29 -36 92 -72 6 122 -113 -3 87 -124 60 63 -183
2977 -183 70 95 -158 78 -8 -145 172 -3 -182 136 -27 -88 201 -112 -129 250 -63 -69 173 -186 10 252
2999B52m65J80K17l55K94Om41M41N3m18L59r8k68N29k55l57N31j83j76M25m48
3020a77n0O25m69j01L95m38K07L93o98J77M59n13K63J25o37N74K26p04L91M7m14
3041c19O80k36o35P35p5l95N61m55k14Q67n08l35O07m51J09N79q65R3P16o09J35
3062a5K65p39O01L92r22L52K62n30O62j52p99Q44O7o30N88l51l21R96m92n92P87
3083B73l25q6O51q51n4R71o34j21M69p11M58N86j044K08N75o35N01L3r34Q21L25
3104D76q36M70r5m61R74l67p96Q55j26l25O72p15k02J063n76l37N92n74K80O54
3124F26j028R7P43o04K64J78q70P09M60r44L51J74n24P77j81q68Q10Q6n30N77
3144C03m49l35J018m18n71O70l49PO62q49j00Q76n19l3L57p33M63N76r02J64M07
$$ plain form
2999 252 -213 -33 184 -171 123 129 -312 129 182 -236 123 25 -243 286 31 -326 205 22 -154 271 -177
3020 -177 -227 398 -71 -172 223 -215 -8 385 -313 -136 323 -190 73 198 -439 135 361 -343 48 95 -319
3041 -319 361 125 -510 225 150 -245 316 -139 -353 514 6 -329 278 -173 -64 515 -350 -257 459 -150 -15
3062 -15 250 -489 112 504 -418 -66 196 -334 328 176 -623 221 288 -342 246 -105 -426 570 78 -514 273
3083 273 -52 -138 513 -338 -392 579 -55 -176 293 -418 40 626 -418 -210 365 -270 231 264 -670 151 476
3104 476 -360 110 15 -446 528 161 -635 220 94 -231 441 -274 -476 587 11 -326 266 -308 -28 626
3124 626 -402 -305 438 -166 98 276 -594 115 575 -369 -18 156 -368 409 228 -640 170 256 -274 303
3144 303 -146 -481 537 119 -452 218 -131 -124 538 -311 -411 465 -54 -87 270 -463 0 576 -326 -162 245
3165B45n21N36J3q45O72K64o16M17j85l86Q50k74o09O18j53j63N50o13j78Q01
3185D23m06j94L80m89K40N27p47N8M82m31K62J31o73M63L50o10K49O5l84N84q7
3206A93n91M88M2l07M31l37k47O58k45l24M00k77K5M50m98q8M82l05M3J95m57
3227b69K67L14m87J29J66l02L32jm38L27J20k97K46j14k10M15j23k85K97j07p1
3248i1K89k76r1L52j90n9J94k40P1K45k93K4J89k02J23Q1k81J73J38k41J13K7
3270E5j66K04j9k07J67Kj15J56r7q1J97q9q5J34r8JJ13j15j5J21r3K8N3r6N0O4
3296F9j07M5L9o2N2j0p4O2K5n2K4Kk5L2j3l4K3J5j7J1j0mJ2J0l5QK3j2rJ2rNK3
3329A9l0qM0k5nK0k5J7L8n9J6L3m5K7L2q0M5M0p6M2mm6O8j0p1O7nn3Q2n2m3R9
$$ plain form
3165 245 -276 260 273 -572 100 364 -252 165 -20 -406 444 170 -439 179 26 -137 413 -200 -378 423
3185 423 17 -177 203 -286 -46 481 -266 -208 274 -157 105 236 -437 26 376 -234 15 80 -304 280 193
3206 193 -398 90 132 -175 256 -81 -328 330 85 -239 161 -116 -91 359 -139 -227 255 -50 -7 188 -269
3227 -269 -2 312 -175 -46 120 -182 150 149 -289 38 158 -139 107 -7 -217 198 75 -210 87 -20 -91
3248 -91 198 -78 -169 183 -7 -66 128 -112 -41 204 -89 -65 124 -78 45 126 -155 18 156 -85 28 55
3270 55 -111 93 74 -133 34 36 -79 77 -20 -101 96 7 -78 56 -42 -41 72 -43 -58 63 -30 -2 51 -45 5 69
3296 69 -38 7 46 -16 36 26 -48 14 39 -13 11 13 -12 20 7 -27 -4 11 -6 5 -5 -9 3 13 -22 -14 9 -3 -12 0 -9 -4 19
3329 19 -11 -19 21 -4 -9 11 -14 3 41 -18 -2 31 -14 13 45 -35 10 50 -26 16 12 -34 34 24 -47 20 15 -38 44 -8 -51 48
3361D8n4l4R0p2j3R4r6MR4r3K2O2r9L9N1j00O2L8j02O9K6r2Q8Lr2R6j4o8R8n3
3391Bo2J17n1m1R8o8k2J03q8j4P4p8J3O5j02M2O1j05M9M0p4M2L0r2O9J9p5O2l
3420A1n4P5k7m1P1k3k6O0n3qO6n0j3M4m2J5L8n0NK9l3K9Kn0K4Ql0QPj7J8nj5O
3454b1J1OqpJ0jKPj4K3J6k3J4mk3L4Qm2L5ll2N7m5l9P5k2l2N9n9j3Q9p4k0P2q5
3489d9K4P7j12L1Q3j02L8N7j32Q7N0j03O7J5r5J19j0j30J35j9q3J34o8r7J74p6
3515A5q0J36j18QJ66j85j7J74j50M2R4k11J24J28k17Q2N9j57J84mk34J95K5j49
3539i0J73r0j39K78p7j72J90j06m3K42k17r2K74j54rJ56k50P7K51k90M3J51k20
3562a14J72Q6l34K05J24k44J85m7k15L11k0k67K13n6j05K72k17j44L34j13j15
$$ plain form
3361 48 -6 -40 50 -22 -35 59 -37 -33 61 -32 -10 52 -47 -8 43 -57 5 43 -59 10 36 -56 32 35 -57 39 25 -43 55 2
3391 2 -60 57 6 -35 63 -5 -27 76 -12 -26 48 -30 -17 48 -54 -12 49 -56 -7 33 -41 1 31 -61 8 27 -48 14 11
3420 11 -43 32 5 -36 35 12 -14 46 -7 -15 51 1 -12 32 -10 5 43 -7 -2 27 -6 23 25 -25 -1 7 -23 -15 -8 -25 -7 -12 -27 -21
3454 -21 -10 -4 -12 -19 -9 -10 -8 -1 -15 8 24 1 15 11 -12 22 30 -12 23 20 -12 45 0 -39 36 14 -18 41 -18 -31 58 -16 -36 36 -49
3489 -49 -25 52 -60 -29 54 -48 -10 47 -85 2 52 -51 16 31 -64 55 45 -85 50 31 -52 82 14 -83 91 15
3515 15 -65 71 -47 -39 127 -58 -75 99 -51 -9 85 -126 -2 126 -91 -9 50 -107 77 73 -161 34 59 -90
3539 -90 83 -7 -146 132 55 -117 73 -33 -76 166 -51 -143 131 -23 -32 124 -126 -49 202 -88 -45 106 -114
3562 -114 58 144 -190 15 139 -105 80 33 -182 129 109 -158 55 -1 -106 166 -51 -195 139 26 -89
3583h9K02k39M3L06l05l5K31k17J39J25l78J81K18k73J12M1k50L04N3l66K28L9
3605G0j67K74j74k22L61m5k12K12j59n2L41k70j38K85j53K0J75l37R2L06k89L7
3627d5J25k46K38J00l68J76J38k04J91p6k50L59nk70K04q8q4L18k21j76L06j20
3649Bn3J75k54L5L04k45n7J78j94J30J44l57J14K15k08J01K0k39K54Q4k98J57
3671HK5j29K43j26k14K85k1j48J68j50m2K86j73j30K01j20L7J37k56M2K14j73
3693c6K0O5j74J72Q0k36Q8P2j14J25k5j84J98J2j44J27o7n6K01j09j25J66m4l7
3717b5J03j47oJ76j13l7J00j04O4J00j74K7J06r7O1J2j36J16N3j24M7Ln0J03m6
3742A2r2J10j1n9P4n8l0J15n9n1O7m0LO8q8J0O2n1RK8n3M7L2p6K5K4m0M5Ln0M7
$$ plain form
3583 -89 113 -126 -83 223 -82 -117 114 -103 36 161 -217 -36 182 -91 21 62 -188 116 169 -197 31 70
3605 70 -97 177 3 -219 142 97 -115 97 -62 -114 227 -43 -181 104 -49 -29 146 -191 -99 207 -82 -45
3627 -45 80 -166 72 172 -196 -20 118 -86 105 29 -221 138 133 -137 67 -21 -105 213 -8 -184 122 2
3649 2 -51 124 -130 -95 209 -36 -93 85 -109 21 165 -192 -78 137 -71 30 50 -189 65 149 -149 8
3671 8 33 -96 147 21 -193 92 71 -77 91 -59 -101 185 12 -118 83 -37 0 137 -119 -77 137 -36
3693 -36 -16 49 -125 47 127 -109 -21 51 -63 62 37 -147 51 63 -81 46 -21 -77 124 15 -110 56 12 -25
3717 -25 78 -69 -75 101 -12 -49 51 -53 11 111 -63 -36 70 -27 34 46 -90 26 79 -45 2 5 -45 58 12
3742 12 -80 30 19 -40 34 -24 -54 61 2 -49 18 -22 -19 49 -39 -29 33 -18 -9 19 -34 13 45 -31 -6 18 -22 23 26 -24 23
3773B3Rl7QQj4L0j3l2K8oj5K0j4j1K4j1njk2J1K1j9lJ8pNKmKRjrRLj1J1Rj0QJ2
3813B5l0MJ6j6JLj8K2nk0K5qqMrpM0k4j1K3j2j2L1k7j5L7k8J0K3k7RK8n2L5Nk9
3849a7K5J6m5L9Pm1K8ol0L9lm2M5kl6M1l0l0O4k8k0M7l9J0M3o9K2L5m7kM7n7J8
3882a8L9n6L1J8m7L8J5n0M3om9O2j3l5N9k3k7M7k2j7N6m5j7N0n0lN3n3RK9m8J8
3914a2M1n1K6K4o0L1J5n0M3Qn4N1j2l1M2j2l2M9pk8N0l2k2N9m2jL8l7J4K8n4J6
3946bL3n8L4K9o2L5Pn0M2ll1M3k4k8M5j7k4N0l8k0O0l1rL5k3jL4m2QL6l1J0J3
3979B0m2L2J2n3M1J9n7N1nm8N7j4l2L6k2k2N4m0j1M1l9LL5m6J6M1o1K3K8n6M1
4010BJ2o3O1Nm9N6k6l4P5l4l1O5m1k0O0o0NO6o4KM5n3K4L8q8M4M5p8M1K3p8O9
$$ plain form
3773 23 32 -5 3 11 -3 27 14 -18 10 4 -11 9 -5 -16 8 -3 -8 -9 -31 -20 1 -18 -21 -3 -10 -5 -3 -7 -5 4 3 -6 3 6 -5 6 15 5 13 25
3813 25 -5 -1 15 -1 0 3 -15 7 2 -18 7 -1 -9 -5 -14 -21 19 -5 -16 7 -5 -17 14 -13 -28 9 -19 -9 14 -13 -4 24 -28 7 12 -17
3849 -17 8 24 -21 18 25 -16 12 6 -24 15 12 -30 15 13 -23 18 -12 -42 22 -6 -26 21 -18 -8 35 -34 -12 23 -24 -26 21 -36 -18
3882 -18 21 -35 -4 14 -33 5 20 -30 13 7 -42 20 7 -28 31 8 -19 28 6 -11 45 0 -17 33 -17 -20 33 -20 -11 18 -30 -12
3914 -12 29 -22 4 28 -32 -1 14 -36 7 15 -39 12 0 -31 11 -1 -33 16 9 -19 31 -1 -23 36 -6 -7 31 -6 8 36 -18 -2
3946 -2 31 -27 7 36 -26 9 16 -34 8 5 -26 17 -7 -35 10 -7 -31 19 -19 -39 21 -10 -19 16 -7 -8 26 -16 -8 28 -3 7 20
3979 20 -22 10 22 -31 10 29 -28 23 18 -30 27 13 -19 17 -5 -27 27 -13 -24 17 -22 -19 16 -30 -14 27 -34 -11 17 -39 2
4010 2 14 -49 12 17 -32 24 -2 -36 39 5 -26 39 -2 -22 38 -22 -17 49 -15 -13 32 -21 3 41 -47 -3 42 -36 5 28 -50 19
4042A9J5q1O3Ko5P9l8o9J18m4n0R3p2j7J16j04PQ1r1L5O7j23N1P5j18O2L5j07
4070f1R5K1j28J00J3j02J18l5j06J49m8q2J16o7l8J38j25l5J45j01j4J13j41L3
4094d2J37j58K9R0j34J03N3j71J04N6j39J11pj30J72j3j39J38m1q8J89j21r7J98
4118A00r4o0J56j70QJ83j65j5J27j50Q0J02k22R0J21j73J06K9j82J90J4j99J50
4141B6J1j29K00r6j54K40o3j13J82j40m5K37j85o7J95j51L4J46k24N8J72k06O9
4164cO6j93J73P3k56J38O1j67J89m7j95K48k2j78J86r8q0K57j61j36K52j30k6
4187d9J82k21K2K35k11LJ40k06J29J21k70J09J30k07J41K4k18K12L2k22J68k7
4209A7j20K34j12j70K41q1q8J81j77k5K43j76n5J75j64N0J56k44N8J76j89Q2O2
$$ plain form
4042 19 34 -47 16 18 -47 32 -6 -75 43 -1 -51 42 -30 -47 69 -35 -28 53 -38 -3 64 -59 -8 67 -51 11 46 -61
4070 -61 34 55 -73 27 40 -62 56 21 -85 64 16 -66 50 -17 -55 83 -42 -77 68 -33 -47 66 -75 -42
4094 -42 95 -63 -34 56 -78 25 78 -93 11 67 -72 39 32 -98 74 61 -78 60 19 -69 120 -1 -98 100
4118 100 6 -54 102 -68 -60 123 -42 -57 70 -80 0 102 -120 -30 91 -82 24 53 -129 61 75 -124 26
4141 26 37 -92 108 12 -142 98 35 -78 104 -36 -81 156 -29 -96 99 -52 -18 128 -96 -38 134 -72 -3
4164 -3 63 -130 43 116 -140 -2 59 -108 81 34 -161 87 65 -113 73 -25 -105 152 -9 -145 107 -23 -49
4187 -49 133 -88 -66 169 -42 -39 101 -105 24 145 -125 -16 114 -93 48 72 -146 66 98 -124 44 17
4209 17 -103 131 19 -151 90 9 -79 102 -75 -100 143 -33 -88 87 -77 -27 129 -115 -57 119 -70 12 74
4232G4k05J63Q6k42J54L0j56J90m2j91K18j8j42J60r5p7K20j22r5J67j13j0J66
4255A20j97QJ74j62J9J06j62R4J13k10P9Q9j53J17K4j71J53J1j32J26l4j00J75
4278H7o9j03J48o3l8J33j15m2J57j14k7J18j25K6J07j33J0J13j38O2M3j27Q6N6
4302E2j26R2J2r3J00mj12J00Op9R1n3m9J16m0o3R3n3j7P7o6kP8o6rN1o2K1O3r5
4332c7J8M4n6M2K2o4L0K2o8M1J8m7N0jn4N3j5k6L5ol2N2k0k7M0j3k1L9k5mM0l9
4364iKL2j8pJ4l4PL2k9OK6l2K1Nl1J9J3l6J9J6m0PK6l3K4J0l9K4Lk3K5jj8L0j3
4399bj6K4j2%J8k1oL8ok1K7k6lL2k4pK3j8jK3m6J6J2k3RK0l2J7J0l7M7j8k5K5
4433cLl0L4j8j5L8k2nL8l2JL3l3K0J9m1K1K7m9M5j5m1N1j2l3M1k1k5M8k6k3M7
$$ plain form
4232 74 -131 32 118 -124 30 60 -96 94 52 -139 79 61 -81 79 -16 -93 127 5 -90 77 -36 -46 120
4255 120 -77 -69 105 -57 -38 68 -94 0 113 -97 -18 71 -82 35 59 -112 41 52 -80 46 12 -88 87
4278 87 18 -85 63 0 -38 95 -20 -62 95 -19 -46 72 -53 -27 80 -53 -43 70 -68 -6 37 -90 -4 52
4302 52 -74 18 30 -63 37 33 -79 21 27 -52 39 -14 -63 53 13 -50 43 -10 -27 50 -16 -18 60 -6 -15 36 -26 -5 58 -37
4332 -37 -19 25 -31 11 33 -31 -1 21 -47 -6 12 -35 15 14 -40 13 -2 -28 7 1 -31 21 1 -26 14 1 -20 19 -6 -10 30 -9
4364 -9 -7 25 7 0 14 -20 -13 19 -10 -4 22 -10 11 16 -15 4 17 -19 0 16 -24 -17 9 -24 0 10 -29 -5 -2 -25 0 -1 -19 11 -2
4399 -2 -18 6 -6 -6 12 -9 -15 23 17 -4 23 -3 -6 26 2 -5 18 0 -1 22 -24 -8 4 -19 -10 10 -22 -5 5 -32 15 -3 -28 -3
4433 -3 0 -30 4 -14 -29 9 -13 -18 20 -12 -11 22 -11 9 28 -13 8 35 -14 31 16 -25 26 14 -19 22 1 -24 24 -2 -25 22
4465B2m1jN1n4JK9n0L2K3o4N1K2o5N4kn0P9k2o2R0l5m0P3m7k8R4o8k4P6p4K7O1
4497E8q9K1P6j09N7L3j15Q5L4j21Q3J7j07J22k2j11J45n4p2J39j00l5J55j16l4
4522f0J33j29K5J38j76L6J32j68P7P4j90J40P1j92J18K6j58J88k2j89J93j8j44
4545i5J86j11r0K41j26j07K03j57mK07k38KK20k13M8J43k55J33J59k80J34R1k14
4568a23J98J1k59K40L3k29K26q3j67L25j27j93K69j37o9K84k76n9L23k41j9K19
4590A46l00J29K45l71R7K12l01J97O8l51K77R9l02K25k9k47L81j11k91L34q3j65
4612a41L42k63j24M11k28j22L01k84M7L20l91L5L09l21J26J60m10K49K05l96J88
4633A3P7k98L50k2l98L70Lk72L34j88k21M76k00k26L45k15n3L85l80o1M07k94
$$ plain form
4465 22 -19 -20 31 -23 -22 7 -43 -11 12 -52 -1 21 -44 10 8 -42 37 15 -47 43 8 -32 41 -6 -34 60 -8 -32 44 -30 -3 58
4497 58 -31 -10 66 -43 14 47 -68 17 51 -70 13 30 -77 45 23 -88 57 3 -69 70 -30 -65 90 -26 -60
4522 -60 73 -56 -31 107 -69 -33 99 -69 8 82 -108 32 103 -89 29 55 -103 85 63 -126 67 49 -95
4545 -95 91 -20 -110 131 5 -102 101 -56 -60 147 -91 -89 131 -82 -34 109 -146 -13 146 -134 0 91 -123
4568 -123 75 86 -173 67 100 -129 97 14 -153 172 45 -148 121 -16 -85 199 -77 -136 187 -54 -73 146
4590 146 -154 -25 220 -151 -54 158 -143 54 122 -229 48 147 -155 70 41 -206 175 64 -227 107 24 -141
4612 -141 201 -62 -186 225 -3 -125 176 -108 -61 259 -132 -97 212 -109 17 177 -233 16 221 -175 13
4633 13 90 -208 142 120 -278 92 95 -177 157 -31 -252 224 24 -202 143 -72 -125 260 -120 -181 226 -68
4655f8K4K43m00J74L02m50J29J97l25K72P1m43L32J16l55L04r5k70M45j18l29
4676b44L57j18j41L74l21j32M46k49q6K88l44Q9L57m27L6K90l18J83J40m31K62
4697A1K10l77J91M3l04L83k0l86L33rk21L19j88k07M37j85j86L13k42j0L32l31
4719i4o1L48k75N2K07l71J55K61l51R7J38k85K67M2l64K67Q0k48K35q4k16L52
4741A52q3k31K71j24r4L06k36j18L22j85m5K20k73O5K51k89L2J94k40J36J05l05
4763a69J68J33k45J48J5k15K56lk54K09k3j33K24j22j40K50r1j02J92j60nK07
4785A40j89l2J96j64M9J13k06Q2J43j91O0P3j70J54L4j89J35J3j24J34n0j27J81
4808F5l4j18J35o1n5J50j12m9J53r3k3R8j00J3J16j14PQ0q1L7N9j18N6M9q0M7
$$ plain form
4655 -68 -44 199 -201 -27 275 -175 -46 151 -174 98 169 -274 58 174 -181 123 28 -242 203 85 -244
4676 -244 113 -5 -146 228 -93 -225 221 -28 -114 174 -170 -81 276 -151 -115 175 -143 40 180 -251 11
4697 11 221 -156 35 78 -226 157 137 -249 84 75 -146 173 -15 -222 215 30 -156 157 -85 -95 237 -94
4719 -94 -155 193 -82 -30 177 -194 -39 222 -129 -32 106 -179 88 130 -234 33 113 -135 100 16 -200 152
4741 152 69 -162 109 -15 -109 197 -39 -157 165 -20 -65 155 -118 -53 198 -91 -59 135 -105 31 136 -169
4763 -169 -1 132 -113 35 50 -165 91 88 -166 43 20 -113 111 -11 -151 99 8 -94 98 -62 -67 140
4785 140 -49 -81 115 -49 0 113 -93 -11 132 -59 1 74 -96 58 92 -97 38 51 -73 61 11 -116 65
4808 65 31 -87 48 -13 -68 82 -30 -79 74 -19 -42 56 -44 -31 85 -29 -22 58 -23 14 73 -45 11 60 -20 27
4834B7J3q2P8J2q8O7mm7O3m2k3O5l9k4M4l3rO2n4k9O6l0nL1k6qL5k3mK6l5J1K3
4867A8k1J7J2l3OJ5j2PMk5K1Pj6JJ9k6QK5k1j0K0j5mJ5l1J6J6l3J5J9l2J1J2k4
4901a9J9J4m2K9kk5M7k3k6L2Nj8K5j2k3M8k8j3M7m0MK8k7NK5l0KK3l3J8J6m5L0
4934A1Ml9L3rk5M0rl7M3j3k6M3k7j9M9l6NL6l6LL6l2PK2l8L5Nk7L0rk1K8j9j3
4968eL5j9j3K2l0J2Rl6J8Qj9K4ml0M1nl3M2j3l6N6k3l1N8l6%M5o1J7N6p5M1L4
5001D9o8L8K5q3O4J5p7P2j9n9R1k7o6Q8m4m8J04p1m9J17p6rR2j11L0J02j27M0
5029gO6j22Q7M6j48Q8N0j29J12rj23J46nj29J44m5q8J85j15q0J73j02m3J44j54
5054e8J4J73j73QJ30j64P4J14k31J01J20k02J20M0j99K00K2k21J89k9j28K16r9
$$ plain form
4834 27 40 -42 36 48 -40 27 23 -24 39 -3 -26 39 0 -24 20 -13 -22 40 -14 -43 23 -7 -12 19 -7 -15 20 -3 -7 19 -16 -5 18
4867 18 -3 14 26 -7 -1 14 2 9 13 -12 9 16 0 1 20 -6 2 27 6 -4 16 1 -3 12 -19 -3 13 -20 -5 14 -18 -7 5 -19
4901 -19 0 14 -28 1 -1 -26 21 -2 -28 4 9 -9 16 4 -19 29 1 -12 35 -5 -1 27 0 5 30 0 2 25 -8 10 26 -19 11
4934 11 15 -24 9 0 -25 15 6 -31 12 -1 -27 16 -11 -30 19 -17 -12 24 -12 -9 27 -5 2 24 -14 21 26 -1 29 20 -1 27 8 -5
4968 -5 30 11 -2 20 -10 2 11 -25 -7 1 -18 6 2 -28 13 8 -25 17 4 -32 24 1 -30 28 -8 -8 37 -24 -7 49 -26 15 49
5001 49 -19 19 44 -39 25 40 -37 35 16 -43 48 21 -45 43 -1 -49 55 -16 -65 52 -24 -33 59 -52 -22 80 -47 -7
5029 -7 59 -63 24 70 -78 10 60 -69 43 34 -89 57 52 -77 67 22 -66 119 4 -76 97 -5 -48 96 -58
5054 -58 -44 129 -44 -36 94 -70 4 118 -113 -12 108 -94 26 66 -133 67 89 -132 57 28 -100 116 17
5077A7j58K50r3j10K07j78k5K62k13n3K20j99N6J80k90Q5J92k44R4R5k55K15R4
5100A49l12J94N9k29K66q4k51L09m1j97K50j50j12L27k09j39L08j99j0K43l11
5121a39M9K94k87L4J87k89J91J60l69J66J44k63K15Jl03L23J1k95K69p9j70L37
5143A87j65k14L36j35j15K84k85m2L70k87m7K58k73J13K25l95J22K44l09J63Q9
5164A24l50K91J23l80K49K4k43L43j02l02L63o3k10K94k04j21L96k45j53L12k17
5185g1J1K69l57K1L24k81N4J49l17K19J84l82J60J28k58K50j6l15L23K7k72K59
5207A09j10j62L69j76k13L18j36p5K56k71l7L38k54l1K16k65J17K14l58R8J98
5228A45k51J43P1l12K43J01k85J84mj93K92q6k43K76l3j53K30j59j12L20j82j05
$$ plain form
5077 17 -141 109 16 -94 113 -65 -90 172 -41 -94 126 -73 -17 163 -127 -42 150 -94 0 95 -160 55 149
5100 149 -163 31 90 -139 127 43 -208 101 60 -137 113 -37 -149 178 -31 -170 138 -61 -71 172 -139
5121 -139 -90 204 -83 -49 138 -151 40 200 -169 -3 141 -122 93 94 -209 114 125 -170 99 20 -150 187
5143 187 22 -192 144 9 -106 178 -107 -149 221 -66 -113 145 -128 -15 210 -185 -63 181 -128 35 124
5164 124 -226 65 188 -192 57 81 -162 181 79 -223 140 77 -133 161 -43 -164 232 -13 -166 146 -71
5185 -71 -60 209 -148 -127 197 -84 -30 119 -198 21 205 -177 -17 111 -147 103 87 -228 95 122 -150 109
5207 109 -1 -163 206 30 -183 135 -1 -76 180 -91 -128 210 -44 -75 141 -124 -7 207 -151 -53 145
5228 145 -106 37 108 -204 39 140 -145 39 35 -158 134 48 -195 81 48 -105 125 -34 -146 174 -8 -113
5250a13K09j70L2J93k49K4K17k06N9J14k40J48J29k54J11P5j81J91j7k20K02J2
5272F6j60J81q0j28K47j07j48K09r0m8J71j76l2J99j48rJ31j62O8J30j94M6J18
5295H4j42Q3N3j73J32N6j58J02qj06J51k2j34J41l3o9J09q1m6J31o4o2R0n2j0
5320b8J00j18KJ04r7K5N8r6M7N9j05M1M5p1O2J2q0N7J9n9M4mn0Q0j9n6O8j3m5
5349a8N6l4l2O2k6l4M7l3J6K8k9j4L3k6j0L1l7ML7l2JK7k3mJ7k4J1L8l1mJ9k1
5381eOJ8k9J0J7p%J1k6J1J4l5K2Rl6K6J0l5L2Km2L3lk7L9j0l6M8ol3L3j8j7M6
5415B2k9k1M8k8LL1l0pM8n4J2L6m0NM0n1K3L0n7L2J7m7L3J0m2L8j6k9M4k0k9M4
5447A6j6k4M5l2j7M9m5LL8k9jK5k7RJ9l5L7Pl8L5Ml6L2j6jK9j7k3N0l2rK3k2O
$$ plain form
5250 -113 96 -74 -42 151 -98 -74 143 -63 -4 110 -130 18 147 -107 4 79 -102 89 72 -148 54 66
5272 66 -94 87 7 -121 126 19 -129 80 -10 -58 113 -63 -95 104 -44 -53 78 -84 -16 114 -80 -34 84
5295 84 -58 25 78 -95 37 93 -65 37 29 -77 74 52 -82 59 26 -43 66 -15 -61 70 6 -56 34 -18 -28
5320 -28 72 -46 -44 60 -37 -12 46 -50 -3 56 -49 -8 37 -34 28 40 -40 17 36 -23 21 17 -33 47 28 -28 40 27 -18
5349 -18 38 4 -28 34 8 -26 21 -12 4 32 3 -11 22 -4 -14 17 -20 -16 21 -11 -10 17 -6 -10 7 -17 -6 32 1 -3 16 -5
5381 -5 1 19 -10 0 17 10 10 21 -5 6 20 -15 7 16 -20 6 16 -19 13 15 -27 6 3 -24 15 5 -31 17 11 -22 11 -7 -24 22
5415 22 -7 -28 20 -8 -5 26 -4 -11 37 -17 -5 31 -9 -4 36 -15 8 38 -19 13 30 -17 16 26 -16 22 6 -23 21 1 -28 16
5447 16 0 -24 21 -11 -28 21 -24 -21 17 -12 -13 12 -15 -6 13 -22 15 22 -16 19 23 -13 19 3 2 31 14 -9 41 9 0 23 1 7
5481GK4l9LL7m1K0km1K4K5m9L6oj9L5l1j1L8j7j9N6m4LN4o1J1M6n0L3K1o8M4J3
5514C2n5M4Nm6N5j4n0O1l3k1O1o5nP6o8J0M3p7M6N4r6M7L2p2O0J0q6P5Kp8R5l4
5546Ho9J21m1o8R6n3k8J16r2m2J30r3LQ5j23M3R7j43M8O8j29R2L9j60J19L6j36
5573g6J25k0j23J62l1j33J53o6n9J67j16n6J67j11l7J39j51L5J58j76J6J22j57
5596f8R3P6k10J18Q9j79J28J1j61J96j2k01J83k3j13J92j21j15K25r2r5J75j62
5619f6nK13k11k5K11j85N8J30k48J07J64k42R9Q4k10K00L7k55J90K2j69K13p5
5642C7j85K72o9j59K16j40n1K49k04o9K33j62j6J78k54P2K29k67L8J45k14J52
5664C1R3k80J62R2k22J89k5j96K55j3k21K19o8j14K58j65j29K81j29p1K00k22
$$ plain form
5481 7 31 -8 -5 32 -9 11 9 -32 -8 17 -32 4 -2 -21 14 -17 -28 10 -7 -26 30 -14 -11 43 -18 -7 39 -11 22 43 -25 19 32
5514 32 -23 21 26 -20 35 21 -29 32 -1 -22 39 -26 -31 45 -23 -13 30 -47 -1 53 -43 4 36 -36 24 34 -52 23 25 -53 42 8
5546 8 -61 60 19 -49 47 -6 -34 82 -10 -52 78 -15 -12 73 -50 -7 90 -53 -5 63 -66 26 65 -95 24 60 -76
5573 -76 49 29 -94 68 37 -96 57 -9 -68 99 -17 -73 94 -17 -54 85 -66 -31 127 -49 -33 89 -68
5596 -68 25 101 -109 9 98 -81 47 58 -103 93 81 -120 63 40 -73 119 -2 -117 108 16 -79 96 -66
5619 -66 -71 142 -69 -94 117 -68 -10 120 -128 -21 143 -99 0 84 -126 74 111 -144 46 68 -101 112 37
5642 37 -148 124 55 -104 112 -28 -79 170 -34 -103 130 -32 -48 130 -124 -52 177 -90 -52 93 -121 31
5664 31 124 -156 6 98 -124 65 40 -156 99 86 -135 84 16 -98 160 -5 -134 147 18 -53 147 -75
5686g5LK72k56j0J99k18J08J33k98J20J65k44J33M3k38K42L7k74K04J3j66K23
$$ plain form
5686 -75 -72 200 -56 -66 133 -85 23 156 -142 -22 143 -101 32 75 -163 79 116 -158 46 59 -107 116
$$ [...]
8191B1
##END NTUPLES=NMR FID
##END=
