##TITLE=1H_Pr Et
 CDCl3
 8 sc, 
 24.3.2023
##JCAMPDX= 6.0         $$ Bruker NMR JCAMP-DX V2.0
##DATA TYPE= NMR FID
##DATA CLASS= NTUPLES
##ORIGIN= UXNMR, Bruker Analytische Messtechnik GmbH
##OWNER= root
$$ XWIN-NMR		Version 3.5
$$ Fri Mar 24 14:55:45 2023 Russian Standard Time (UT+4h)  she@DPX200
##.OBSERVE FREQUENCY= 200.13135
##.OBSERVE NUCLEUS= ^1H
##.DELAY= (6, 6)
##.ACQUISITION MODE= SIMULTANEOUS
##.ACQUISITION SCHEME= undefined
##.AVERAGES= 8
##.DIGITISER RES= 18
##SPECTROMETER/DATA SYSTEM= spect
##.PULSE SEQUENCE= zg30
##.SOLVENT NAME= CDCl3
##.SHIFT REFERENCE= (INTERNAL, CDCl3, 0, 15.7039)
##AUDIT TRAIL= $$ (NUMBER, WHEN, WHO, WHERE, WHAT)
$$ ##TITLE= Audit trail, XWIN-NMR		Version 3.5
$$ ##JCAMPDX= 5.01
$$ ##ORIGIN= Bruker BioSpin GmbH
$$ ##OWNER= she
$$ F:/spectra/data/she/nmr/H-F/1/audita.txt
$$ ##AUDIT TRAIL=  $$ (NUMBER, WHEN, WHO, WHERE, WHAT)
(   1,<2023-03-24 14:54:24.12 +0400>,<she>,<DPX200>,
      <created by zg, POWCHK disabled, PULCHK disabled
       configuration hash MD5:
       00 E9 B6 7A A2 85 ED C7 34 08 36 98 17 FE 4E 26
       data hash MD5: 16K
       69 B7 F4 FD D3 E6 2C 10 AB AC A9 37 80 B7 8C 8E>)
$$ ##END=
$$ 
$$ hash MD5
$$ DB B3 C0 CB 51 86 78 0D F7 7F 60 42 D2 23 6D 94
##$RELAX= 
##$RELAX= 
##$RELAX= 
##$RELAX= 
##$RELAX= 
##$RELAX= 
$$ Bruker specific parameters
$$ --------------------------
##$DU= <F:/spectra>
##$EXPNO= 1
##$NAME= <H-F>
##$PROCNO= 1
##$TYPE= <nmr>
##$USER= <she>
##$AMP= (0..31)
100 100 100 100 100 100 100 100 100 100 100 100 100 100 100 100 100 100 
100 100 100 100 100 100 100 100 100 100 100 100 100 100 
##$AQSEQ= 0
##$AQ_mod= 1
##$AUNM= <au_zg>
##$AUTOPOS= <>
##$BF1= 200.13
##$BF2= 200.13
##$BF3= 200.13
##$BF4= 200.13
##$BF5= 200.13
##$BF6= 200.13
##$BF7= 200.13
##$BF8= 200.13
##$BYTORDA= 1
##$CFDGTYP= 0
##$CFRGTYP= 5
##$CHEMSTR= <none>
##$CNST= (0..31)
1 1 145 1 1 1 1 1 1 1 1 1 1 1 1 1 1 1 1 1 1 1 1 1 1 1 1 1 1 1 1 1 
##$CPDPRG= <>
##$CPDPRG1= <>
##$CPDPRG2= <>
##$CPDPRG3= <>
##$CPDPRG4= <mlev>
##$CPDPRG5= <mlev>
##$CPDPRG6= <mlev>
##$CPDPRG7= <mlev>
##$CPDPRG8= <mlev>
##$CPDPRGB= <>
##$CPDPRGT= <>
##$D= (0..31)
0 1.2 0 0 0 0 0 0 0 0.06 0 0.03 0 0 0 0 0.0002 0 0 0 0 0 0 0 0 0 0 0 0 
0 0 0 
##$DATE= 1679655263
##$DBL= (0..7)
120 120 120 120 120 120 120 120 
##$DBP= (0..7)
150 150 150 150 150 150 150 150 
##$DBP07= 0
##$DBPNAM0= <>
##$DBPNAM1= <>
##$DBPNAM2= <>
##$DBPNAM3= <>
##$DBPNAM4= <>
##$DBPNAM5= <>
##$DBPNAM6= <>
##$DBPNAM7= <>
##$DBPOAL= (0..7)
0.5 0.5 0.5 0.5 0.5 0.5 0.5 0.5 
##$DBPOFFS= (0..7)
0 0 0 0 0 0 0 0 
##$DE= 6
##$DECBNUC= <off>
##$DECIM= 32
##$DECNUC= <off>
##$DECSTAT= 4
##$DIGMOD= 1
##$DIGTYP= 9
##$DL= (0..7)
0 120 120 120 120 120 120 120 
##$DP= (0..7)
150 150 150 150 150 150 150 150 
##$DP07= 0
##$DPNAME0= <>
##$DPNAME1= <>
##$DPNAME2= <>
##$DPNAME3= <>
##$DPNAME4= <>
##$DPNAME5= <>
##$DPNAME6= <>
##$DPNAME7= <>
##$DPOAL= (0..7)
0.5 0.5 0.5 0.5 0.5 0.5 0.5 0.5 
##$DPOFFS= (0..7)
0 0 0 0 0 0 0 0 
##$DQDMODE= 0
##$DR= 18
##$DS= 0
##$DSLIST= <SSSSSSSSSSSSSSS>
$$ [...]
##$SUBNAM2= <"">
##$SUBNAM3= <"">
##$SUBNAM4= <"">
##$SUBNAM5= <"">
##$SUBNAM6= <"">
##$SUBNAM7= <"">
##$SUBNAM8= <"">
##$SUBNAM9= <"">
##$SW= 18.05172834244
##$SWIBOX= (0..15)
0 0 2 0 0 0 0 0 0 0 0 0 0 0 0 0 
##$SW_h= 3612.71676300578
##$TD= 16384
##$TD0= 1
##$TE= 0
##$TE2= 300
##$TE3= 300
##$TEG= 300
##$TL= (0..7)
0 120 120 120 120 120 120 120 
##$TP= (0..7)
150 150 150 150 150 150 150 150 
##$TP07= 0
##$TPNAME0= <>
##$TPNAME1= <>
##$TPNAME2= <>
##$TPNAME3= <>
##$TPNAME4= <>
##$TPNAME5= <>
##$TPNAME6= <>
##$TPNAME7= <>
##$TPOAL= (0..7)
0.5 0.5 0.5 0.5 0.5 0.5 0.5 0.5 
##$TPOFFS= (0..7)
0 0 0 0 0 0 0 0 
##$TUNHIN= 0
##$TUNHOUT= 0
##$TUNXOUT= 0
##$USERA1= <user>
##$USERA2= <user>
##$USERA3= <user>
##$USERA4= <user>
##$USERA5= <user>
##$V9= 5
##$VALIST= <valist>
##$VCLIST= <CCCCCCCCCCCCCCC>
##$VD= 0
##$VDLIST= <DDDDDDDDDDDDDDD>
##$VPLIST= <PPPPPPPPPPPPPPP>
##$VTLIST= <TTTTTTTTTTTTTTT>
##$WBST= 1024
##$WBSW= 4
##$XGAIN= (0..3)
0 0 0 0 
##$XL= 0
##$YL= 0
##$YMAX_a= 153590
##$YMIN_a= -125578
##$ZGOPTNS= <>
##$ZL1= 120
##$ZL2= 120
##$ZL3= 120
##$ZL4= 120
##$ABSF1= 10
##$ABSF2= 0
##$ABSG= 5
##$ABSL= 3
##$ALPHA= 0
##$AQORDER= 0
##$ASSFAC= 0
##$ASSFACI= 0
##$ASSFACX= 0
##$ASSWID= 0
##$AUNMP= <proc_1d>
##$AZFE= 0.1
##$AZFW= 0.1
##$BCFW= 1
##$BC_mod= 2
##$BYTORDP= 1
##$COROFFS= 0
##$CY= 11.3945322036743
##$DATMOD= 1
##$DC= 2
##$DFILT= <>
##$DTYPP= 0
##$F1P= 2.36226072786647
##$F2P= -0.459571619588291
##$FCOR= 0.5
##$FTSIZE= 0
##$FT_mod= 4
##$GAMMA= 1
##$GB= 0.15
##$INTBC= 1
##$INTSCL= 1
##$ISEN= 128
##$LB= 0.24
##$LEV0= 0
##$LPBIN= 0
##$MAXI= 10000
##$MC2= 0
##$MEAN= 0
##$ME_mod= 0
##$MI= 1.114404
##$NCOEF= 0
##$NC_proc= 0
##$NLEV= 6
##$NOISF1= 3.799351
##$NOISF2= 2.8
##$NSP= 1
##$NTH_PI= 0
##$NZP= 0
##$OFFSET= 15.70392
##$PC= 1
##$PHC0= -19015.31
##$PHC1= 8.800793
##$PH_mod= 1
##$PKNL= yes
##$PPARMOD= 0
##$PSCAL= 0
##$PSIGN= 0
##$REVERSE= no
##$SF= 200.130013532006
##$SI= 16384
##$SIGF1= 3
##$SIGF2= 2
##$SINO= 400
##$SIOLD= 16384
##$SREGLST= <1H.CDCl3>
##$SSB= 0
##$STSI= 0
##$STSR= 0
##$SW_p= 3612.71676300578
##$SYMM= 0
##$S_DEV= 0
##$TDeff= 0
##$TDoff= 0
##$TI= <>
##$TILT= no
##$TM1= 0
##$TM2= 0
##$TOPLEV= 0
##$USERP1= <user>
##$USERP2= <user>
##$USERP3= <user>
##$USERP4= <user>
##$USERP5= <user>
##$WDW= 1
##$XDIM= 8192
##$YMAX_p= 0
##$YMIN_p= 0
$$ End of Bruker specific parameters
$$ ---------------------------------
##NTUPLES= NMR FID
##VAR_NAME=  TIME,          FID/REAL,        FID/IMAG
##SYMBOL=    X,             R,               I
##VAR_TYPE=  INDEPENDENT,   DEPENDENT,       DEPENDENT
##VAR_FORM=  AFFN,          ASDF,            ASDF
##VAR_DIM=   8192,          8192,            8192
##UNITS=     SECONDS,       ARBITRARY UNITS, ARBITRARY UNITS
##FACTOR=    0.0002768,     1,               1
##FIRST=     0,             0,               0
##LAST=      2.2672688,     0,               0
##MIN=       0,             -125578,         0
##MAX=       2.2672688,     153590,          0
$$ Real data points
##PAGE= N=1
##DATA TABLE= (X++(R..R)), XYDATA
0@%%%%%%%%%%%%%%%%%Nj3J6j6J6j6J6k2L0l2L4m2M8n3O1o9P7q8J01j11J22j36
$$ 0 0 0 0 0 0 0 0 0 0 0 0 0 0 0 0 0 0 5 -8 8 -8 8 -8 8 -14 16 -16 18 -24 24 -29 32 -37 40 -48 53 -58 64 -72
39g2J52j70J91k10K34k58K82l13L44l78M16m60N08n58O16o83P57q41R38j054J195
$$ -72 80 -90 101 -109 125 -133 149 -164 180 -198 218 -242 266 -292 324 -359 398 -443 495 -559 636
60F36j365J574j842K202k708L464m713P114j3237N5094J07371j55245l3796L0445
$$ 636 -729 845 -997 1205 -1503 1961 -2752 4362 -8875 46219 153590 -1655 -35451 -5006
74e006r5274O8608J76559j02136j24953Q1977j0915m8160J32192o88j60122N3933
$$ -5006 -100280 -31672 144887 42751 -82202 -225 -11140 -59300 72892 72204 -87918 -33985
86c3985J00239q5443Q306O6434j11842j5821J60359k8596j11492M9788j5418o3387
$$ -33985 66254 -19189 -10883 55551 -56291 -72112 88247 59651 -51841 -2053 -17471 -80858
98h0858J33455O7139j50799l2231O3746m9632M5061J22473r5126j13472P9750
$$ -80858 52597 119736 -31063 -63294 452 -49180 -4119 118354 23228 -90244 -10494
109a0494J5681m0523R4013L729j32364L4486Q3878o8817K656P1779p4290k8414
$$ -10494 5187 -35336 58677 62406 -69958 -35472 48406 -20411 -17755 54024 -20266 -48680
121d8680J05911l2311q8248O5307K0514n6917O8663K9631j19263j770Q7945l0147
$$ -48680 57231 24920 -63328 1979 22493 -34424 34239 63870 -55393 -57163 30782 635
133F35J454O4183p6991p1943Q8934K8261m9158M5270q6r0913L4939P2336n4713
$$ 635 2089 66272 -10719 -82662 6272 34533 -14625 30645 30559 -60354 -25415 46921 -7792
146g792r918N5501m7213k6850P0329k2778o0518N8487K6005n2110K6369J4933
$$ -7792 -17710 37791 -9422 -36272 34057 11279 -49239 9248 35253 -16857 9512 24445
158B4445p3946J7624P9361k8097k7725K8574m5439l0277Q1772K1509n7256J0144
$$ 24445 -49501 -31877 47484 19387 -8338 20236 -25203 -55480 26292 47801 -9455 689
170F89J690m8519L9342N7763m8125k3997L5107k6067j3170N4358j3539m7351L6706
$$ 689 2379 -46140 -6798 50965 2840 -21157 13950 -12117 -25287 29071 15532 -31819 4887
183D887J8291l9708J5821J6985m3653J3265N2333k7161k8948K1486j8201j2314
$$ 4887 23178 -16530 -709 16276 -27377 -14112 38221 11060 -17888 3598 -14603 -26917
195b6917N4934Q041n0193P97R514k0633K9726L6233l8663k5690K1580q657j961
$$ -26917 28017 36058 -14135 -13338 -3824 -24457 5269 41502 2839 -22851 -1271 -9928 -11889
208a1889L7991q495l7451J4531J1627j9489J5482J6580k7596j428K5088j5704
$$ -11889 26102 17607 -19844 -5313 6314 -13175 2307 18887 -8709 -10137 14951 -753
220g53j3026K0553n549j2279K3856J641k8315N126J2330j1102J1590J7216k3016
$$ -753 -13779 6774 1225 -11054 12802 14443 -13872 -8746 3584 -7518 4072 21288 -1728
233a728j5003J5301j208j348K0546m958k4413M711Q184o764J1896J1302j8147
$$ -1728 -16731 -1430 -2638 -3986 16560 11602 -12811 -8100 84 -6680 5216 16518 -1629
246a629q671R998m047j11J5815l562j4377M550J862p071Q887P911j0165k356N687
$$ -1629 -10300 -302 -4349 -4460 11355 7793 -6584 -2034 -172 -7243 1644 9555 -610 -2966 2721
261B721o335j629R629j610n219N775r69p923L120L963l136L815M445p376n019
$$ 2721 -3614 -5243 4386 2776 -2443 3332 2363 -5560 -2440 1523 -1613 2202 6647 -729 -5748
276e748L271N55K423O903k511q988j445K177K247O458K258p434n748R48K415M543
$$ -5748 -2477 -1922 501 7404 4893 -4095 -5540 -3363 -1116 5342 7600 166 -5582 -4634 -2219 2324
292B324M273l282o479j242J921K658L366j07m030k081J058J268J169M76j145q47
$$ 2324 6597 3315 -3164 -4406 -2485 173 3539 3432 -598 -2679 -1621 -353 816 1292 147 -700
308g00Q36M93q41r02j10J219J862M08j770k655r89K130L399J350j800l627k429
$$ -700 136 629 -212 -1114 -1224 -5 1857 2265 495 -2160 -3149 -1019 2380 3730 1930 -1697 -4126
325d126J400M116K747j019l625l200M7L433L541J78k865l245p01K185K921J105
$$ -4126 -2726 1390 4137 3118 -507 -3707 -3660 -227 3314 3492 627 -2618 -3319 -1134 1787 2892
341B892j745k761n93J511J460P89n83j964m45J849O63q41k37p38o10K321J461
$$ 2892 1147 -1614 -2207 -696 764 1553 970 -994 -1439 410 1073 232 -5 -743 -1353 968 2429
358B429k452j436N62m27J698L110k215l833Q62R12J52L678K53n651p88L049n53
$$ 2429 -23 -1459 -897 -1324 374 3484 1269 -2564 -1702 -790 -638 3040 3293 -2358 -3146 -97 -650
375f50J796L198m734m067M128J276j542L760r37o710K439M986l313M73L323n913
$$ -650 1146 4344 -390 -4457 -329 947 -595 3165 2228 -4482 -2043 2943 -370 103 3426 -2487
391b487j873P722j030m946M319r40o003O379M565q206R3N214n907O70R306n774
$$ -2487 -4360 3362 2332 -2614 1705 765 -5238 1141 5706 -2500 -2407 2807 -3100 -2430 6876 1102
407A102p282P576l4n798Q467J758j2227L168Q294p414J126Q845r834n791J2561
$$ 1102 -6180 1396 1362 -4436 4031 5789 -6438 -3270 5024 -2390 -1264 7581 -2253 -8044 4517
422D517j409q131R217m52j2682Q425Q636j1924J180R465j1168k219J5017o275
$$ 4517 3108 -5023 4194 3742 -8940 -515 8121 -3803 -2623 6842 -4326 -6545 8472 2197
436B197j0128J2009r78j1883J1901N577j6169M285J1225j2759R0J5117j1374r010
$$ 2197 -7931 4078 3100 -8783 3118 8695 -7474 -3189 8036 -4723 -4633 10484 -890 -9900
450i900J6300k975j2514J4360K235j8156R221J1372j6264K404J5248j5282o075
$$ -9900 6400 3425 -9089 5271 7506 -10650 -1429 9943 -6321 -3917 11331 -3951 -10026
463a0026J9551p124j2841J7422r34j8705J4122R512j9788N651J5091j8394k251
$$ -10026 9525 2401 -10440 6982 6048 -12657 1465 10977 -8811 -3160 11931 -6463 -8714
476h714K1210j2014j2133K0229m062j7710J8246N796k2545R485J4375k0238J925
$$ -8714 12496 482 -11651 8578 4516 -13194 5052 10848 -11697 -2212 12163 -8075 -6150
489f150K0491j7198r709K2880o945j6114K0560R13k3304J4579J2864k2362N277
$$ -6150 14341 -2857 -12566 10314 3369 -12745 7815 8728 -14576 3 12867 -9495 -4218
502d218J8575k0753m990K4699j1801j4818K2869l110k1755J9297Q451k5135R926
$$ -4218 14357 -6396 -11386 13313 1512 -13306 9563 6453 -15302 3995 12446 -12689 -2763
515b763J7595k3101m33K3679j7454j1365K6209p156k0559K1961L377k5212J5755
$$ -2763 14832 -8269 -8702 14977 -2477 -13842 12367 5211 -15348 6613 9990 -15222 533
528E33J4902k6204L746K2345k0658o527K6516j2879j7804K5463n64k4176J8454
$$ 533 15435 -10769 -7023 15322 -5336 -11863 14653 1774 -16030 9433 8869 -15307 3147
541C147R563k6514J0415K0603k4255l736K4391j5794j1301K7440p008k4099K0667
$$ 3147 12710 -13804 -3389 17214 -7041 -10777 13614 -2180 -13481 13959 6951 -17148 3519
554C519O656k3407J5062J4644k8175J341K4791j7037p423K4572j3386j9344K6105
$$ 3519 10175 -13232 1830 16474 -11701 -10360 14431 -2606 -10029 14543 1157 -18187 7918
567G918L153k4160J5458R296k6019J0085K2570k3485o608K3694j3499j1140K7056
$$ 7918 11071 -13089 2369 11665 -14354 -4269 18301 -5184 -11792 11902 -1597 -12737 14319
580A4319o569k5904J9515R556k1767J3169J3583k8570L79K6768j4061r070K1667
$$ 14319 7750 -18154 1361 10917 -10850 2319 15902 -12668 -12289 14479 418 -8652 13015
593A3015j3094j8981K6242N737k3724J1880Q859k3870R281K2545k1211q215K1577
$$ 13015 -79 -19060 7182 12919 -10805 1075 9934 -13936 -4655 17890 -3321 -11536 10041
606A0041j0793j0982K3944m791k3893J7184J0472j9742R164J2337k4068K27K4970
$$ 10041 -752 -11734 12210 7419 -16474 710 11182 -8560 604 12941 -11127 -10900 14070
619A4070j1745j0926J7626r309j5843K3152O110k2547P997R361j9180P357K0036
$$ 14070 2325 -8601 9025 -284 -16127 7025 13135 -9412 -1415 7946 -11234 -3877 16159
632A6159j8402q941J9253p719j0656J9903k856k0563J4563R951j8310N882J2035
$$ 16159 -2243 -11184 8069 350 -10306 9597 6741 -13822 741 10692 -7618 -1736 10299
645A0299j8436J84K1012j1212j1684J5562m628j2354J8181L951k0553O245J0518
$$ 10299 -8137 -7953 13059 1847 -9837 5725 1097 -11257 6924 10875 -9678 -3433 7085
658G085j3952M589J5117j5436p885J6763m380r590J4430j515j5919J1182Q415
$$ 7085 -6867 -2278 12839 -2597 -10482 6281 1901 -7689 6741 5226 -10693 489 8904
671H904j4958L222J0663j2444n93J5091r295j0015J3084o73r381J1553J713j6120
$$ 8904 -6054 -2832 7831 -4613 -5206 9885 590 -9425 3659 2986 -6395 5158 6871 -9249
685i249N434J0822r499J170R579j1765n533J4375j791q498Q999r22j1556Q595
$$ -9249 -3815 7007 -2492 -1322 8257 -3508 -9041 5334 3543 -4955 4044 3122 -8434 161
699A61P180j1203J311Q258q504j251J0676o378p270J0046N20p677O612J274j0635
$$ 161 7341 -3862 -2551 5707 -2797 -4048 6628 250 -7020 3026 3546 -4131 2481 3755 -6880
714f880M556Q699o789j306N815p186l004J0592n48p063M459k29o904N926N573
$$ -6880 -2324 6375 -414 -1720 4095 -3091 -6095 4497 3949 -3114 1345 1116 -5788 138 5711
729E711p254m77N003n077r90P134k984m856N647K74n314L784J855n715K471M950
$$ 5711 -1543 -2020 2983 -2094 -3084 4050 1066 -3790 1857 2131 -3183 601 2456 -3259 -788 4162
745D162m670j624L914l100j465N990o80m918K238N35l308L493L243m384j118K613
$$ 4162 -508 -2132 1782 -1318 -2783 3207 2527 -2391 -153 382 -2926 567 3810 -574 -1692 921
761I21k404k47M395j225l136K095j18k486K491J841k706K63J554k337m27K707
$$ 921 -1483 -1730 2665 1440 -1696 399 281 -2205 286 2127 -579 -316 1238 -1099 -1526 1181
777A181o76j112J778p33k172J420J026j170R33Q88j949n63J316m35KJ586n92j560
$$ 1181 505 -607 1171 438 -1734 -314 712 -458 475 1363 -586 -1149 167 -268 -266 1320 728 -832
795h32L68J60l84J234Q07j179p12O4l45N60J336j35r82l70l56L3J054O46m67n76
$$ -832 -464 -304 -688 546 1353 174 -538 -474 -819 -259 1077 942 -40 -410 -766 -733 321 967 500 -76
815g6m12k38M09P09K17k93l73l35q1K61L49K85l7l12k95j95L1M39M23Rk27m76
$$ -76 -488 -726 -317 392 609 316 -57 -392 -473 -212 137 422 385 73 -222 -417 -386 53 476 485 258 -218
837b18m48J69O65M65j7m22o81l51M49P54L11j53n81o40k9N68O62J54l80n37l49
$$ -218 -666 -497 168 633 616 194 -487 -838 -389 365 676 523 -58 -698 -727 -159 503 657 277 -260 -609
858f09O0N86M64q3l16j90l34qO04K13k44J59j86o77K31N66j89J59M40p03o77O88
$$ -609 -549 37 501 418 102 -88 -422 -430 174 387 143 302 116 -561 -330 236 47 206 646 -57 -734 -46
880d6P2k69Q80J6j291J75N71o62N60J175j100q89R49m20n41J736J70j775L99N73
$$ -46 26 -243 637 653 -638 -463 108 -554 6 1181 81 -808 141 -279 -820 916 1086 -689 -290 283
900B83j365R70J764j636q71J443r84p88K392j72k234J299P20k156J162J793k428
$$ 283 -1082 -112 1652 16 -855 588 -396 -1184 1208 1036 -1198 101 821 -1335 -173 1620 -808
917h08j75K567j685j372K612q48k115K913O25l392J214J706k797J175L233l249
$$ -808 -983 1584 -101 -1473 1139 291 -1824 1089 1714 -1678 -464 1242 -1555 -380 2853 -396
933c96j816L295j109j696L942n56m518K409K166l328J673K809m487p62M719k093
$$ -396 -2212 1083 -26 -1722 2220 1664 -2854 -445 1721 -1607 66 2875 -1612 -2374 2345 252
949B52k294M047j353l849M365J482n064J749L001m300R76M744m415k696N292j126
$$ 252 -2042 2005 652 -3197 1168 2650 -2414 -665 2336 -1964 -988 3756 -659 -3355 1937 811
965H11l199M877n31o131L705L741m940J225L807n740q64O925k703m008N179j263
$$ 811 -2388 2489 1958 -4173 -468 3273 -1667 -442 3365 -2375 -3239 3686 983 -3025 2154 891
981H91n104N838K125p095K126M509n507O83O123n650l365P368j275m944N666k76
$$ 891 -4213 1625 3750 -3345 -1219 3290 -2217 -1534 4589 -1061 -4426 2942 1667 -3277 2389 2113
997B113p237N109M892o948N32N121o217p60Q466l701n813O280l75n865O473K456
$$ 2113 -5124 -15 4877 -2071 -1539 3582 -2635 -3395 5071 1370 -4443 1837 1462 -4403 2070 4526
1013D526q805K272O125o026n0O857o131m005Q794j042o513N852N47p794N620N637
$$ 4526 -4279 -2007 4118 -1908 -1958 4899 -1232 -5237 3557 2515 -3998 1854 2401 -5393 227 5864
1029E864q447j31O484n926j160R069m467p080P488P35o609O344K522r886K710
$$ 5864 -2583 -2714 3770 -2156 -3316 5753 1286 -5794 1694 2429 -4180 2164 4686 -5200 -2490
1044b490P654o568j023P325o279m305R855j006p838O048J385q039N604N924r289
$$ -2490 5164 -1404 -2427 4898 -1381 -5686 4169 3163 -4675 1373 2758 -5281 323 6247 -3042
1059c042n04P689n479k032Q909m435p457Q068J683p375N425K957r595K595Q295
$$ -3042 -3546 4143 -1336 -3368 5541 1106 -6351 1717 3400 -3975 1450 4407 -5188 -2593 5702
1074E702o619k193P386n244m452R591p29q386N668K463p798M675N923r017q21
$$ 5702 -917 -3110 4276 -968 -5420 4171 3442 -4944 724 3187 -4611 64 5987 -3030 -3851
1089c851Q222m955k888Q282l788p197Q108J959p844M610L426q731K430Q033o779
$$ -3851 4371 -584 -3472 4810 1022 -6175 1933 3892 -3952 658 4084 -4647 -2217 5816 -963
1104i63k691P545m297m500Q813p69q222N514L091p500L692N594q161p59P995m533
$$ -963 -3654 3891 -406 -4906 3907 3138 -5084 430 3521 -3979 -287 5307 -2854 -3613 4382 -151
1120a51l488P520k759o444P198J964p617L669L938p366J618P004n951k892P087
$$ -151 -3639 3881 1122 -5322 1876 3840 -3777 -108 3830 -3536 -1918 5086 -865 -3757 3330
1135C330k934m491P111l18p302M827L339o703K356N125o637q49P095l795l713
$$ 3330 396 -4095 3016 2698 -4604 223 3562 -3141 -785 4340 -2297 -3146 3949 154 -3559
1150c559O470j647n610N907J785o807K966M049o150Q53N920m999k577O375k161
$$ -3559 2911 1264 -4346 1561 3346 -3461 -495 3554 -2596 -1743 4177 -822 -3399 2976 815
1165H15m360N729P6o055L991L120n799J434M550n129r58N874k975l470N276p58
$$ 815 -3545 2184 2260 -3795 196 3316 -2483 -1049 3501 -1628 -2586 3288 313 -3157 2119 1361
1181A361m677M305J713n444K079L626m636K5M685l512k243M951j278l693M011
$$ 1361 -3316 989 2702 -2742 -663 2963 -1673 -1648 3037 -475 -2718 2233 955 -2738 1273
1196A273N70m615K735K635m366O70L704l534j089M371j995k772L862k29l630K936
$$ 1273 1843 -2772 -37 2598 -1768 -1098 2606 -928 -2017 2354 359 -2413 1449 1220 -2410 526
1212E26J547m003J353K858l385k55L537k346j757L530q59k773K843O21l273J747
$$ 526 2073 -1930 -577 2281 -1104 -1359 2178 -168 -1925 1605 746 -2027 816 1437 -1836 -89
1228h9J942l053L22K719k371r26K928j156j948K507K5k496J791J202k541O89J856
$$ -89 1853 -1200 -878 1841 -530 -1456 1472 316 -1632 875 900 -1596 195 1397 -1144 -455 1401
1245A401k081l31K349j256j314K114l83j753J704N54k000Q47J197j685Q3J636
$$ 1401 -680 -1011 1338 82 -1232 882 499 -1254 450 1004 -996 -149 1048 -637 -554 1082
1261A082j296o86J714n32j211J388Q6j461R89P48j397K53J072j107j94J307o54
$$ 1082 -214 -900 814 282 -929 459 545 -916 73 821 -576 -323 749 -358 -552 755 101
1278A01p93J065j44q83Q79L52j048L04O39p59N9P55n58l83P34j84n42N85J32o14
$$ 101 -692 373 229 -654 225 577 -471 -167 472 -287 -228 527 -31 -414 320 136 -406 179 311 -303
1298c03K83L45n26N0M32l32j17M20j81l35L41M9l09K54J37l32L0K06j69J3K05
$$ -303 -20 325 -201 -151 281 -51 -168 252 71 -264 77 126 -183 71 208 -124 -94 112 -57 -44 161
1319A61j06k09J40J6l5J31mj69qQ0l4N0Q5o5p0mK9RM2L9k5n4j9J0J7nO5k4m9r
$$ 161 55 -154 -14 2 -33 98 94 -75 -83 -3 -37 13 98 33 -37 -41 -12 -3 39 78 53 -1 -20 -10 7 2 67 43 -6 -15
1349a5jl3O0O5k3o0k0Lj7Q7N2n9n4n5k4N8Q1L9p7n9m2L5N7L2O1q5p8L0j0J6J65
$$ -15 -16 -49 11 76 53 -7 -27 -24 -41 46 98 39 -15 -70 -94 -36 45 84 7 -52 -94 -59 -2 30 91 6 -72 -42 -52 -36 129
1380A29n5j23N6K2j23J26J24j74JJ33j87p4K75m8j86K50o6l77K86K10l35J47K73
$$ 129 74 -49 7 29 -94 32 156 -18 -17 116 -71 -145 130 82 -104 146 80 -297 -11 199 -136 11 284
1403B84m74r9M99j72k33M47j18n67M24K83n70L33M19o96m5O40m28l10Q06j80p06
$$ 284 -190 -289 210 38 -195 252 134 -433 -9 274 -296 37 456 -240 -285 355 -73 -383 423 243 -463
1424d63O27J22q39N90O06r40K6P77q08k12J192m76q22R46m2j045R13O00j310L34
$$ -463 164 286 -553 37 643 -297 -271 506 -302 -514 678 202 -620 326 284 -761 152 752 -558 -224
1444b24J001j176j57J360q59p31J497k70j384J161L73j482R39J060j697p4J504
$$ -224 777 -399 -556 804 -55 -786 711 441 -943 218 591 -891 48 1108 -589 -663 841
1461H41j150m31J890p99j609J570L06j572J292P95k138L78J809j509m42J972j224
$$ 841 -309 -740 1150 351 -1258 312 618 -954 338 1133 -1005 -627 1182 -327 -769 1203 -21
1478b1j306K211q5k064J512P22k130J085J674k397l48K337j271r08K391r91k302
$$ -21 -1327 884 799 -1265 247 969 -1161 -76 1598 -799 -1147 1190 -81 -989 1402 411 -1891
1495a891K241Q48k265J314J140k854M58K742j853r65K439j430j737K978P2k842
$$ -1891 350 1198 -1067 247 1387 -1467 -1009 1733 -120 -1085 1354 -76 -1813 1165 1237 -1605
1511a605J716J176k667J127K286k931o22L083j412j468K754r10k843K765J350
$$ -1605 111 1287 -1380 -253 2033 -898 -1520 1563 151 -1317 1437 527 -2316 449 1799
1526A799l002J106J570l122M70L470k165j725K782j148k062L348L42l606J650
$$ 1799 -1203 -97 1473 -1649 -1179 2291 126 -1599 1183 35 -2027 1321 1663 -1943 -293
1541b93J842k913R50K692l176r99L658j282k120K989o76l113L011J636l623Q61
$$ -293 1549 -1364 -414 2278 -898 -1897 1761 479 -1641 1348 672 -2441 570 2206 -1417 -556
1557e56K143l061M07L736k565k278L280o97k324L372L33m143J760K468l013O14
$$ -556 1587 -1474 -1067 2669 104 -2174 1106 409 -1915 1457 1790 -2353 -593 1875 -1138 -524
1573e24K843l328j137M058j187k572K962l05l218K971J836l958N64K693k800L8
$$ -524 2319 -1009 -2146 1912 725 -1847 1115 810 -2408 563 2399 -1559 -995 1698 -1102 -1064
1589a064L668k561k599L542m2k569K845M58m165J748K984k966n5K798k963j216
$$ -1064 2604 43 -2556 986 944 -1625 1220 1678 -2487 -739 2245 -721 -776 2022 -941 -2157
1605b157M146r26l014K712J90l126K644J924l956L20L039k475m22L401k338k564
$$ -2157 1989 1063 -1951 761 951 -2175 469 2393 -1563 -1243 1796 -679 -1101 2300 -38 -2602
1621b602L642K80k875K319O42l758J696L091k946n74K695k357j200L920q03l165
$$ -2602 1040 1320 -1555 764 1406 -2352 -656 2435 -511 -1085 1610 -747 -1947 1973 1170 -1995
1637a995K383O37k806K134J877l593M7L061j994q85K960j747k354L251M76k897
$$ -1995 388 1025 -1781 353 2230 -1363 -1316 1745 -249 -1134 1826 79 -2275 976 1452 -1445
1653a445J676R93l014J268K787k676r42K583j578j206L191n91k951K044R57k464
$$ -1445 231 1224 -1790 -522 2265 -411 -1353 1230 -348 -1554 1637 1046 -1905 139 1096 -1368
1669a368J508J712l027n6K814j669j053K496j173k046K660N34k655J298J182k425
$$ -1368 140 1852 -1175 -1231 1583 -86 -1139 1357 184 -1862 798 1332 -1323 -25 1157 -1268
1685a268Q60K263k286r17K399j007j203K364m15k468J725J077k046Q57J432k283
$$ -1268 -408 1855 -431 -1348 1051 44 -1159 1205 790 -1678 47 1124 -922 -65 1367 -916
1701i16r1K323j229j114J926o32j623J929M54k128R34J198j790L28J712j599p57
$$ -916 -1007 1316 87 -1027 899 267 -1356 573 1027 -1101 -167 1031 -759 -431 1281 -318 -1075
1718a075J925o17j134J612j47j775J250R70j623M05J118j487j58J763q74j000
$$ -1075 850 233 -901 711 564 -1211 39 1009 -614 -209 909 -578 -736 1027 153 -847
1734h47J429k89j230J321L98j555N85R59j213O8J217j046n35J335l10r68R89M5
$$ -847 582 293 -937 384 782 -773 -188 771 -442 -374 843 -203 -738 597 287 -681 308 353
1752C53j103Q03O68j126J13Q34q47j43J103n50p04Q47k7p66P36L27r51K71O56
$$ 353 -750 53 721 -405 -292 542 -305 -448 655 105 -599 248 221 -545 191 518 -433 -162 494
1771D94p00m0P67n63l97P74j18o09N35J29o56L82M22o55PN40m05j68N87k46m39
$$ 494 -206 -246 521 -42 -439 335 217 -392 143 272 -384 -2 420 -235 -228 312 -93 -261 326 80 -359
1792c59M64L1m07L32J87m58P1L54l15j2L49k34k29L51j9l04K50J17l05J06J94
$$ -359 105 136 -271 61 248 -210 -139 215 -100 -112 237 3 -226 125 106 -198 52 169 -136 -30 164
1813A64k27k4K55j33j54J98m0j56J77P3k06O7Q3j11lR9q2l0P5kj09R0K2m7K0M6
$$ 164 -63 -87 168 35 -119 79 39 -117 60 133 -73 -6 77 -34 -37 62 -20 -50 25 23 -86 4 26 -21 -1 45
1839D5p7k3Q2m0mP0n0nNkJ9NOj9j9pJ7MJ2lJj8L1j1l5L2Lm4L1jnnL9n1J6Kjl6
$$ 45 -32 -55 27 -13 -17 53 3 -2 3 1 20 25 31 12 -7 -14 3 7 19 16 17 -1 30 19 -16 16 19 -25 6 5 0 -5 34 -17 -1 1 0 -36
1877c6M6JKmk5k4J9LKN2l5l9P8j1j1K0k3p0M2N3n3j5R0r4j2J54r8o8J11j1j06
$$ -36 10 11 13 9 -16 -40 -21 -18 -16 36 1 -38 40 29 18 38 15 -55 -13 40 -13 -28 62 -32 -44 110 12 -56 55 44 -62
1908f2J02M4j73R4Q9j71K5J77j33j09K02o8j56K04N3k94K09J20k82P1K68k57j11
$$ -62 40 84 -89 5 94 -77 -52 125 -8 -117 85 17 -139 65 118 -176 33 153 -129 -58 210 -47 -158
1931a58L39j77k12L93q4l29K96J40l93J39L19m16k7M59l17k11M88j49m17M58R3
$$ -158 181 4 -208 185 101 -228 68 208 -185 -46 273 -143 -170 289 -28 -239 249 100 -317 141 234
1952B34n42L00L49o07R6N33m99j72O35k61m78P03l2o87N13K98p25K38N95p68n9
$$ 234 -308 -8 341 -266 -170 363 -136 -308 327 66 -412 291 259 -428 85 383 -342 -104 491 -277 -336
1973c36P80m72m07Q48k09p42P44K22r19N08N50r30O3R12p27l55J027m61p31R58
$$ -336 444 -28 -435 413 204 -538 206 428 -491 17 567 -363 -300 612 -115 -470 557 96 -635 323
1993C23J04j029O60N50j119K59R46r59k26J138n92p19J136j13j109R44L74j249
$$ 323 427 -602 58 608 -511 -252 694 -265 -491 647 55 -664 472 359 -750 194 568 -681
2011f81N53R17j248qJ234q53n96J352m38j062J194K11j355Q44P33j410K55J268
$$ -681 -128 789 -459 -467 767 -86 -682 670 232 -830 364 575 -780 64 797 -613 -358 910
2029I10j162l71J414p34r22J447l8j426J062N72j500N46J171j435j76J515r11
$$ 910 -252 -623 791 57 -865 582 544 -882 180 752 -748 -202 969 -466 -642 873 -38
2046c8p87J553l99j377J345M50j596P74R78j584J78J551j211o38J621o75j198
$$ -38 -825 728 329 -1048 297 747 -849 -75 903 -681 -503 1048 -163 -801 820 145 -1053
2063a053J625J33j679J041Q38j690M87J405j519l90J763q42j058J686k90j611
$$ -1053 572 705 -974 67 905 -785 -298 1107 -412 -802 961 119 -939 747 457 -1154
2079a154J441O28j788O77J180j660M4J786j258q53J740n65j292J675J85j858R78
$$ -1154 287 915 -873 -196 984 -676 -632 1154 -104 -957 783 218 -1074 601 786 -1072 -94
2096i4J097j725L78J485j536n63J926p74j194J635j23j662J370Q33j869M76J342
$$ -94 1003 -722 -344 1141 -395 -958 968 194 -1000 635 512 -1150 220 1053 -816 -340 1002
2113A002j547j02J828j193j082J784k77j419J523L39j925Q40J281j613J16J530
$$ 1002 -545 -647 1181 -12 -1094 690 413 -1006 517 856 -1069 -229 1052 -561 -445 1085
2129A085j470o06J902n89j333J513N2j650J289Q74j859L44J427j437k10J744j083
$$ 1085 -385 -991 911 322 -1011 502 554 -1096 193 1067 -792 -448 979 -458 -668 1076 -7
2146gj119J733q4j415J269M09j812P61J341j487j04J425j171o59J782m46j374
$$ -7 -1126 607 523 -892 377 786 -1026 -265 1076 -411 -515 910 -261 -920 862 416 -958
2163i58J312K16j500J039R11j682J42J391j106m09J526p90j114J507J08j388R50
$$ -958 354 570 -930 109 1020 -662 -520 871 -235 -644 882 92 -1022 485 593 -795 155
2180A55N40j531N73J255j315k56J307q69o50J540l08j335J064M07j278P68Q40
$$ 155 695 -836 -263 992 -323 -579 728 -141 -791 749 441 -894 170 577 -701 67 907
2197I07j444J9J287q94m33J252n68r82J253J59j238P34N54j212L97J048j090l42
$$ 907 -537 -518 769 -125 -558 694 126 -856 397 556 -682 52 606 -606 -209 839 -251 -593
2215e93J127n42n91J136j76j111Q16M53j029M78O65j033o8J081o37m53R17k97
$$ -593 534 -8 -599 537 361 -750 66 519 -510 -32 633 -400 -468 613 -24 -477 440 143
2233A43p81Q87K34r75M33N47r20K42Q05p82k86Q79l33n48P96q5p91N88L92p63
$$ 143 -638 249 483 -492 -59 488 -432 -190 615 -167 -453 426 93 -455 341 256 -535 53 445 -318
2253c18K30N32p14r3Q05m15m04O63j74n74O44J68p04L10L57n51O3N63m51k78O50
$$ -318 -88 444 -270 -363 442 27 -377 286 112 -462 182 350 -354 -44 313 -238 -175 388 -63 -341 309
2274C09k17l98M69N3n37L65K81n08P9L86m20q1M93k25k86L86n5l42L36J63m20
$$ 309 92 -306 163 216 -321 44 325 -183 -104 282 -138 -219 274 49 -237 149 94 -248 88 251 -169
2295a69P9K96l01j0L13k16j99L68q5k67K23R1k85J44J66k71J5K37j56p9K12o4
$$ -169 -90 206 -95 -105 208 -8 -207 161 76 -191 32 123 -162 -18 148 -123 -108 129 -27 -106 106 42
2317D2j71J58K3j41J11R6k14P3J35j11n6J68r7j27J37L6j14N0R0j25J6O8n0l7
$$ 42 -129 29 52 -89 22 118 -96 -23 112 1 -55 113 16 -111 26 62 -52 -2 88 -37 -21 47 -3 -40
2341d0Q7m3q0J22l6q2O5L5m4k0M6n2J2M7rk3L1Mm7M4J9l0K0jl2J3L7%k2rMqlQ
$$ -40 47 4 -76 46 10 -72 -7 28 -16 -36 10 -42 -30 17 8 -15 16 20 -27 17 36 6 26 25 -7 6 43 43 21 12 16 8 5 13
2375A3J1jk1J0k8j5M8j0J6jm2J6K8k9mj3J8J5Kj7oM6k1mQj2m7M0K1k0MN0q1KP7
$$ 13 24 23 2 12 -16 -31 17 7 23 22 -20 -4 24 -5 -9 -22 -4 11 13 -4 -10 36 15 11 19 7 -40 0 21 1 5 55 -26 -24 53
2410E3l6j6M6m8k6R9l0q1P5K0r6O2M1j15K2J13j12m9J27n9m7J34k8j23N6P7j95
$$ 53 17 1 47 -1 -27 72 42 -39 36 56 -40 22 63 -52 -30 83 -29 -78 49 -10 -57 77 49 -74 -18 59 -136
2437a36J29J18j42k2J52j04q9K04q4j62J81N7k39J49J48k18L3K01k04p7K67j43
$$ -136 -7 111 -31 -53 99 -5 -94 110 26 -136 45 102 -137 12 160 -58 -25 176 -28 -105 162 19
2459A9j97K81J9l05J82J71l14R8K63l26o0L48j76k10M03r9l70L48J14m42K33K62
$$ 19 -178 103 122 -183 -1 170 -144 -46 217 -109 -169 179 3 -207 196 97 -273 75 189 -253 -20 242
2481B42m36M5M35l23k00M82j67l82N03K2n10L27K24m99J62M74n28j21N43k70l27
$$ 242 -194 -149 286 -37 -237 245 78 -304 199 221 -289 38 262 -237 -75 399 -129 -250 293 23 -304
2502c04N64o9o02M88K56o25K58M20o45RO70m33l82O97j90n30O31J13p38L74M08
$$ -304 260 191 -411 77 333 -292 -34 386 -259 -250 420 -13 -395 302 112 -418 213 326 -412 -38 370
2523C70o40J24O21o16k88Q29l12m91P17p5p65O01L78q19K44N98p46m2Q49m89n32
$$ 370 -270 -146 475 -141 -429 400 88 -403 314 239 -526 75 453 -366 -122 476 -270 -312 537 48 -484
2544d84Q34j46p28P45K26r63M32O04q48Q0Q36p27m19J033l04p02P89O2r24O60
$$ -484 350 204 -524 221 447 -516 -84 520 -328 -248 588 -139 -558 475 171 -531 258 320 -604 56
2564E6N48j028J85P99q17j95J071n61o48R52o1q86Q07L00j104L99Q36r39m3R55
$$ 56 604 -424 -239 560 -257 -452 619 58 -590 362 301 -585 222 522 -582 -183 653 -286 -329 626
2584F26p45m80J118k57q74Q84J39j033O80N66j051J08R40q48k38J093n18q14J062
$$ 626 -119 -599 519 262 -612 272 411 -622 58 624 -427 -319 621 -227 -465 628 110 -704 358
2603C58kr90P99L77j128L79R06j008j03J026p00n44J161k56r36R05K56j111N87
$$ 358 356 -634 165 542 -586 -207 699 -309 -412 614 -86 -630 531 275 -661 244 500 -611 -24
2622b4O77j079P5J053q48l53J098m53q43J025J14j022O79M81j081K78R26r54k13
$$ -24 653 -426 -351 702 -146 -499 599 146 -697 328 442 -580 99 580 -501 -223 703 -251 -464
2641d64J068n99o28J079j26r98Q33L38j070M76P57j032m4J043p35m47J064l58
$$ -464 604 5 -623 456 330 -668 165 503 -567 -91 666 -366 -410 633 -102 -549 515 157
2659A57q22R64J57j052N99O08j077K34Q76q37k83J028m85o72J025n9r64P30L87
$$ 157 -665 299 456 -596 3 611 -466 -232 644 -193 -476 552 67 -605 420 361 -603 127 514
2678E14r83L22P54r15p4R36o02m68R37k36p90P75K33r20M75N98r32R8Q35o99l17
$$ 514 -469 -147 607 -308 -382 554 -48 -516 421 185 -605 170 403 -517 -42 556 -376 -278 557 -142 -459
2699d59Q94l37o15Q10M3q37N50M51q84K16O86p16j30Q24m76m75Q09j12p46O58
$$ -459 435 98 -517 293 336 -501 49 500 -384 -168 518 -198 -328 496 20 -455 354 242 -504 154
2719A54K11p62L27N19p18K9O61n10l27P54k25n60O16R9o81M00L86o61J21N80n44
$$ 154 365 -397 -70 449 -269 -240 421 -89 -416 338 113 -447 169 268 -413 -13 373 -288 -167 413 -131
2740a31j91O79l13m11N91o0n47M40K58n78J88M37n19m4N12l24k88N39j07m47M41
$$ -131 -322 357 44 -367 224 164 -383 57 315 -263 -75 362 -157 -201 311 -13 -301 238 131 -316 125
2761A25J26n20K48L08m73N2M28l64j71M59j56l31L90K7m14K73K14m06J16L31l60
$$ 125 251 -269 -21 287 -186 -134 294 -70 -241 218 62 -269 121 148 -266 7 221 -185 -69 262 -98
2782i8q5L88j89k26L27k4l24L08J07k94Q2K41k85k5K73j91j34L10r8k04J99O1
$$ -98 -183 205 16 -210 117 93 -231 77 184 -110 -28 213 -72 -97 176 -15 -149 161 63 -141 58 119
2804A19k63J57J32k35L0K00j53j06K38p5j93K01K3j87R1J11j77N9J05j14n0J42
$$ 119 -144 13 145 -90 -60 140 -13 -119 119 44 -149 52 75 -112 -21 90 -87 -28 77 -37 -87 55
2826E5k9j26J56j0j30R5N9j41O4R1j44M1J08p7n5R7k8r4Q6M0j00N6J9n8J6O7p2
$$ 55 26 -100 56 46 -84 11 70 -71 -7 84 -60 -19 89 12 -43 54 26 -68 18 58 -42 14 33 -25 -9 58 -14
2853a4k8O6k4m2O4oq4K0O7m3J1M4o0JL5J2j9K5on3L3J7j5K8jk6mM3k6Kj6K1k6
$$ -14 -42 24 0 -42 22 16 -68 -48 19 -24 -13 31 -29 -28 7 19 0 25 19 -34 -1 16 1 29 28 2 -2 41 15 17 1 22 -4
2886dlM3n9K7K0k6k2J9J3kj3J9rk2K0j3mL0j6jlMj3QKrPJ8l7J8K9n0N2oqj9L8
$$ -4 -7 36 -23 4 24 -2 -24 -5 8 6 -7 12 3 -19 1 -12 -16 14 -2 -3 -6 -2 -15 -7 -5 -14 -7 11 -26 -8 21 -29 23 17 9 -10 28
2923B8j2nL3l1j6K9ll5J5Qm9L9M7m5n1R3n1m7Q6Nr0P9Rj02O8M4j28K4J17q9k2
$$ 28 16 11 44 13 -3 26 23 -12 3 11 -38 1 48 3 -48 45 -6 -53 33 38 -52 27 36 -66 2 46 -82 -58 59 -30 -52
2954e2J19o2j02J60Kj57J16O8j48N1J33j31o7J92j30p0J67m7j46J57K9j92J01
$$ -52 67 5 -97 63 65 -92 24 92 -56 -5 128 -3 -70 122 -8 -78 89 42 -104 53 82 -110 -9
2977iJ15j58k9K20j80o6K10n7j81J99L7k60J93R6k57M2K70k11j06K76j32j85L10
$$ -9 106 -52 -81 139 -41 -107 103 46 -135 64 101 -159 34 130 -127 -85 185 -26 -132 144 12 -173 137
3000A37n1k78K46R7l16J51K16l14KL06k22j45L49j07k81L17N7l31J70K35m02Q6
$$ 137 86 -192 54 151 -165 -14 202 -112 -110 196 -26 -171 178 71 -210 107 164 -167 3 238 -164 -78
3022g8L43l11j57L97j64k86M38o3l91L03J99m24J43L07l96n7M91k86k50M73j18
$$ -78 265 -46 -203 194 30 -256 182 119 -272 31 230 -194 -51 256 -140 -197 294 8 -242 231 113
3043A13l98M06J28n20K29L64n09M9M69l97j97N38j84l77M77J1n35L61K68n28J25
$$ 113 -285 121 249 -271 -42 322 -187 -138 331 -66 -263 275 91 -286 191 202 -333 28 296 -232 -107
3064a07M44n08o8N84k97m00N80o9n56N19J65o03K21M44n49lO03m84k89O39j18
$$ -107 337 -171 -239 345 48 -352 228 159 -397 122 287 -316 -95 349 -200 -203 400 -84 -373 266 148
3085A48m98N21Q9o40L78M27o75R4N53n40j76P34l31m81O37j6n74M61K55p29K13
$$ 148 -350 171 260 -380 -2 425 -250 -156 397 -143 -319 415 84 -397 240 224 -350 111 366 -363 -150
3106a50N51n62p1O24m46l41O95j07n82N46J15o75L86M42o80L4N81m83j97P07k69
$$ -150 401 -161 -232 392 -54 -395 300 193 -389 157 272 -403 -17 425 -255 -221 360 -123 -320 387 118
3127A18n89O77K4n88M59K64p03J54O44o08q8O34m07m12P44p5o53N22J96o81L31
$$ 118 -471 206 230 -358 101 365 -338 -184 460 -148 -236 398 -9 -421 323 248 -405 117 313 -368 -37
3148c7N02o95m8O82m47l02P00k54n63O08J43o52L74L44o68R0O27n07k20O45l08
$$ -37 465 -230 -278 404 -43 -345 355 101 -462 146 289 -363 11 355 -313 -223 404 -103 -323 322 14
3169A4m32O78l6o05M43K61o33K48M77o10r1O60l51l49O34j70n39N38J73o23K79
$$ 14 -418 260 224 -381 62 323 -310 -62 415 -195 -286 374 23 -326 308 138 -401 137 310 -313 -34
3190c4L64n79O8N71m54k63O11k14m20N33O4o05L50L38o04J41M75m86j49O18k57
$$ -34 330 -249 -181 390 -64 -327 284 70 -350 183 247 -358 -8 330 -274 -133 342 -144 -293 325 68
3211F8l82N13q1m58M17K41n81J83M04m79j0M85l17k91N11j08m11M53Q0n34K75
$$ 68 -314 199 118 -340 77 318 -263 -80 324 -155 -165 320 3 -288 223 115 -296 157 237 -297 -22
3232b2L19m75P9L61l68j42M89j90l23M03J1m17L34J93m61J20L19l37o8M04k31
$$ -22 297 -178 -99 262 -106 -248 241 51 -272 131 142 -275 59 252 -209 -89 230 -107 -175 229 -2
3253bk82M42o0l47L42Q5m13J78L08l79%L67k83j48L88j05k89L03M5l42J96J94
$$ -2 -284 158 98 -249 93 178 -235 -57 251 -128 -128 239 -44 -192 196 91 -198 105 150 -192 4 198
3275A98l22K1L12k62r2L17j66j85K56N4l34K22J26l01J19K08k43l9K42j58j09
$$ 198 -124 -103 209 -53 -145 172 6 -179 77 131 -203 19 145 -156 -37 171 -72 -111 131 -27 -136
3296a36K40n8j95J88P2k42J13J41j77nK00j51o6J85n7j29J11N5j80R4J02j63L1
$$ -136 104 46 -149 39 111 -131 -18 123 -54 -59 141 -10 -76 109 52 -77 34 89 -91 3 105 -58 -27
3319b7J49j29n8J52r4r2J58kj37P6P6j47N6R0j13j9J33q3p0J06k0p7Q8M9j10P3
$$ -27 122 -7 -65 87 -7 -99 59 57 -80 -4 72 -75 -19 71 -42 -61 72 -11 -81 25 5 -72 16 65 -45 28
3345B8K7q0MR1p9m4R3j8l7K9K9q2M8K5o2J0M1o3J2N2k7m1O0ol0J0J8j6oLj1KM6
$$ 28 55 -25 -21 70 -9 -53 40 22 -15 14 43 -39 9 34 -28 -18 23 -40 -28 24 -3 -44 16 10 -20 -10 8 -8 -14 -11 -22 -20 26
3378B6m8j0K1M0n5M1lj9L8k7NoJ4nj8L2j0k6L3J7n0K2Rk3RJ2mj0K4k0pLQj7nQ
$$ 26 -22 -32 -11 29 -26 15 12 -7 31 4 9 3 17 12 -6 26 16 -10 23 40 -10 12 21 -2 7 19 15 5 29 9 2 5 13 -4 -9 -1
3414ajj6L0l7j9M6j0j9M0L0o1K9J6m3KL4m8J7L2j1kj7PpK1K9m2J1K1m4OL4m5J
$$ -1 -2 -18 12 -25 -44 2 -8 -27 13 43 -18 11 27 -16 -14 20 -28 -11 21 10 8 -9 -2 -9 12 41 -1 10 31 -13 -7 27 -18 -17
3448a7N1j8l6N0l7l8P4mn5K2M9p9K7M4n1j8Q2k3q2P0J4o4M3L2q9O4M7q3j4J26
$$ -17 34 16 -20 30 -7 -45 29 25 -30 -8 41 -38 -11 33 -18 -36 46 23 -59 11 25 -39 4 36 -53 11 58 -25 -39 87
3478H7j13k3J45n8j03J04K3j12M6O6q8J2J10j31k4J25n5j04J32j7j08J22K3j51
$$ 87 -26 -49 96 38 -65 39 62 -50 -4 62 -26 -14 96 -35 -59 66 11 -93 39 22 -86 36 59 -92
3502i2P5R6j42j5J89j23j00J98m0j76J62M0j71J37Q9k19N1K14k08o1K31j05j64
$$ -92 -17 79 -63 -78 111 -12 -112 86 46 -130 32 72 -99 38 127 -92 -41 173 -35 -96 135 30 -134
3525a34K43kk35J73P1k28Q0J53j91k1K19j39j46K68q8j98K11R8l05J53J74k90
$$ -134 109 107 -128 45 116 -112 -32 121 -70 -91 128 -11 -157 111 23 -175 36 134 -171 -18 156 -134
3547a34M1K70k28j25L16j35j80K57M7l03J65J54k63M5K67k78o0L35j83j88L44
$$ -134 -93 177 -51 -176 140 5 -175 82 129 -174 -9 145 -118 -73 194 -84 -144 191 8 -180 164
3568A64o9k98K78J03l46J32K43l10j1L21k38j82L66j09k82L27L6l52K24K00l73
$$ 164 95 -203 75 178 -168 -36 207 -103 -114 207 -31 -213 153 44 -238 89 125 -227 -3 197 -176
3589a76Q3L05l05r7L92j94k53L84j2l43K47J83m34J73L05l72oL79k60k38M53j23
$$ -176 -93 212 -93 -190 202 8 -245 139 127 -216 31 214 -220 -47 258 -114 -120 259 -1 -239 214 91
3611I1l40L61O2m16K21K84m00K9L71l48j56M83k00l38M18K0m16L14J80m71J27
$$ 91 -249 112 174 -242 -21 263 -137 -108 263 -85 -241 242 42 -296 122 142 -274 40 220 -251 -124
3632a24L58l21j03M35k79k23M24m1m00L48J08m33K16L06m28JM20l10j87M84j61
$$ -124 234 -87 -190 245 -34 -257 167 126 -274 74 182 -251 -35 271 -157 -156 264 -46 -233 251 90
3653I0l76M02M2m00K98K10m79J08L74l79p5M25k63k40M53o9m15L24J66m45K00
$$ 90 -286 116 158 -242 56 266 -213 -105 269 -110 -185 240 -23 -263 190 121 -294 30 196 -249 -49
3674d9L37m45k6M39k77k31M54j54l40L66R9m16K62J83l74Q4L54l21j65M57k10
$$ -49 288 -157 -183 256 -21 -252 202 48 -292 74 173 -243 19 202 -172 -88 266 -55 -220 237 27
3695B7k84M19pl92K97J47l87J43K96l90m4M16k62j68L57r0l09L13Q8l69J62K61
$$ 27 -257 162 155 -237 60 207 -180 -37 259 -131 -175 241 -21 -189 168 78 -231 82 170 -199 -37 224
3717B24l67J4L81k99j47L52j10k75L49J4l54K44K02m11J25K91l46l1L69k04k03
$$ 224 -143 -129 252 -47 -194 158 48 -227 122 136 -218 26 228 -183 -58 233 -113 -144 225 21 -182
3738a82L19j7l24K66J13l31J25K21l03L3K58k02j40K86q4k42K45Q4l21J73J65
$$ -182 137 120 -204 62 175 -156 -31 190 -113 -80 178 -24 -164 122 38 -204 41 125 -196 -23 142
3759A42k89Q6K08k33q0L27j82j50K61k1k41J85J03k59R4J96k16m0K68j59j42K72
$$ 142 -147 -61 147 -86 -166 161 -21 -171 90 69 -172 13 116 -143 -49 147 -69 -109 159 0 -142 130
3781A30q5j77J94O2k62J17J40j97nK17j53j10K23n8j44J56L6k08J12J00j88M6
$$ 130 45 -132 62 124 -138 -21 119 -78 -83 134 -19 -129 94 36 -108 48 84 -124 -12 88 -100 -54
3803e4J66j42o9K12j18j33K18k0j64J13R0j81O6J25j52j8J61j01p7J52n7q4J22
$$ -54 112 -30 -99 113 -5 -138 80 60 -104 9 99 -82 -16 109 -43 -61 100 -1 -78 74 17 -67 55
3826E5j4r3O0O2r6J8O2p4m0J10l8o2O8J1q8P2N2j39N4P0r7qP8m2n1R2j6p9P5M6
$$ 55 41 -52 8 70 -26 -8 54 -20 -60 50 12 -50 18 29 -59 13 65 -74 -20 50 -47 -55 23 -19 -70 22 6 -73 2 48
3856D8r5L3M9n5k3N9k0k9M6k4pM1J8p9N6L3p1J5K4l8ML1j0k5K9k1kj0L2m7J9K9
$$ 48 -47 -14 35 -20 -43 16 -4 -33 13 -11 -18 23 41 -38 18 51 -20 -5 19 -19 -15 16 6 -19 10 -11 -13 -23 9 -38 -19 10
3888A0k8j7L0jl0N8n3J0jL2j7pM1ln1L2qJ2QJ9m1J3J1k1rJ6lj0J3Nk8L0k0pK1
$$ 10 -18 -35 -5 -6 -36 22 -31 -21 -22 10 -7 -14 27 24 -27 5 -3 9 17 36 -5 8 19 -2 -11 5 2 -8 5 10 -18 12 -8 -15 6
3923Fl0J8nKk1LL2k2qL8m5j1N4k4J5k2K4rlQm4L8N2m3k5M6k1k5MO3m3nM6k9rJ6
$$ 6 -24 -6 -11 -9 -30 -27 5 -17 -25 13 -32 -43 11 -13 2 -20 4 -5 -8 0 -44 -6 46 3 -22 24 3 -22 -18 45 2 -3 43 14 5 21
3959B1l0qJ9kj9M8k2m6M9j4pK7Mq6M8L4p2kO4Qr9R1J4o3K3L8n0J0O1n8mQ7o3m1
$$ 21 -9 -17 2 0 -19 29 7 -39 10 -4 -11 16 20 -66 -18 16 -56 -58 6 14 -85 6 20 -43 -20 18 -32 -22 39 -19 -23 64 1 -40
3993d0J08m7p3R1J2r6N0P0r5QP0q6m5J70q2r1J19k3j26J14M5j14J7J41j50k9J42
$$ -40 68 21 -52 39 51 -45 5 75 -20 -12 58 -28 -73 97 15 -76 43 20 -106 8 53 -61 -44 97 -53 -82 60
4020F0q9p6J72m4j26J52L7j69Q7Q0j40jJ34r1o6K06j29j29K18j5j95J54Q5k19
$$ 60 -29 -105 67 23 -103 49 86 -83 4 84 -56 -57 77 -14 -80 126 -3 -132 86 71 -124 30 115 -104
4044a04Q8J42k00rK16j44j18J99qj87J79M8k26J27J18k17mK60k08r3K89j32j39
$$ -104 -16 126 -74 -83 133 -11 -129 70 62 -125 54 102 -124 3 121 -96 -100 160 -48 -141 148 16 -123
4067a23K11J2k87K07J42k87P0K19k21q5L03j56j76K84m4k52K35J16l33J39K26
$$ -123 88 100 -187 20 162 -125 -55 164 -57 -142 161 5 -171 113 69 -183 52 168 -165 -26 200
4088B00k92j6K94k51j37L61j10k41K89K7l22J84J95l58P9L09l02p2L63j78k52
$$ 200 -92 -108 186 -65 -202 159 49 -192 97 124 -198 -14 181 -177 -98 211 -91 -163 200 22 -230
4109b30L58l1l37K91J30l68J54K74l72oL84k65k22M34j02l20L47O2l93J91K68
$$ -230 128 97 -240 51 181 -187 -33 241 -131 -137 247 -18 -240 194 92 -228 119 181 -212 -21 247
4130B47m04M9L56l15j14L75j59k93M02k9l66K89J60m12J25L24l67n7M12k46k22
$$ 247 -157 -108 248 -67 -181 194 35 -258 144 115 -251 38 198 -214 -89 235 -132 -189 223 -23 -245
4151b45M36j10l54L41J26m06J91K68m09K5M22l22j67M20j35l40L93M0l95K40K47
$$ -245 191 81 -273 68 194 -212 -21 247 -162 -137 285 -37 -204 216 81 -259 134 174 -221 19 266
4172B66m42J02L29l26j21M29k33k65M46p5l64L07J67m53J56L21l82k8M18k97j83
$$ 266 -176 -74 255 -71 -192 237 4 -261 185 110 -254 53 220 -233 -77 244 -138 -166 252 -45 -228
4193b28M29j25l45L66P6m30K64K56m48R5L55l40j05M22k12k49L74k5l42K89J34
$$ -228 201 76 -269 97 173 -257 7 263 -185 -90 265 -75 -180 242 30 -219 155 130 -212 77 211
4214B11m19J65K72l28m8L69k41j97L64n9l61L37J14m09J95K48l76N2L14k57j31
$$ 211 -208 -43 229 -99 -147 222 -19 -216 148 89 -272 65 179 -230 -35 213 -163 -111 203 -54 -185
4235a85L76j36l35L90K7l58K45J76m00J28L10l13o1L43j88k10L41m6l00K59J03
$$ -185 191 55 -280 110 137 -221 24 200 -200 -72 238 -75 -136 207 19 -191 150 104 -196 63 166
4256A66l34J62K20l45N0K89k41j50L54j19k42K57N1l13J80J91l42Q8K69k77o8
$$ 166 -168 -6 214 -131 -81 208 -33 -183 171 52 -190 67 118 -195 -15 176 -166 -78 191 -86 -154
4277a54K62r8j74K83k7k89K28J02k73J24J63k29l0L04k13j09K63o4k25K26L3k30
$$ -154 108 10 -164 119 92 -197 31 133 -140 -16 147 -82 -112 192 -21 -130 133 69 -156 70 103 -127
4299a27J24J34k11J7K18k15n8K11j23j24K07M5k51J44R5j88M8K07k17k0J97j12
$$ -127 -3 131 -80 -63 155 -60 -118 93 -30 -154 53 98 -153 -9 86 -102 -54 153 -64 -84 113 1
4321Aj10J96m3j49J45K9j58P7R0j37J8J41j05o7J59o9j16J43K3j47Q7J01j43O
$$ 1 -109 87 44 -105 40 69 -89 -12 78 -59 -41 100 -5 -72 87 18 -98 45 68 -79 8 109 -34 -28
4345b8J23j05l0J17m1r5P8j0m5K8M5r7N2R0j29qJ13q9l6J09l2p8O6K4p7N5M8p2
$$ -28 95 -10 -40 77 36 -59 19 9 -36 -8 37 -60 -8 82 -47 -55 58 -31 -67 42 10 -68 -2 22 -55 0 48 -24
4373b4MO4o5jL3J2q0J07k9n5L3M6p3J3M6m1lJ0j6MJ7Mm2K7N0p5J6N0l1k7QJ3l2
$$ -24 -20 44 -21 -22 11 23 -57 50 21 -34 -1 45 -28 -15 31 -10 -13 -3 -19 -15 2 6 -36 -9 41 -34 -18 32 1 -26 -18 -5 -37
4406c7N3k6k4%N0m5L0Rk3j9N1jk3J8J4k7J4K9n0K4%l6KJ1koK2j3k5M4Jn0kM9l5
$$ -37 16 -10 -34 -34 16 -29 1 10 -13 -32 19 18 -5 13 27 0 14 43 -7 17 17 -19 -17 -6 -8 -14 8 -5 -30 14 15 -35 -37 12 -23
4441b3QK7m6J3N3l5j8K1K6o5L9J9n3MK6k0oN5j6j3L1j8j4J1Om1J9N0m7qM5l2J0
$$ -23 -15 12 -34 -21 32 -3 -21 0 26 -39 0 19 -34 -30 -4 -24 -30 25 9 -4 27 9 -5 6 12 -29 -10 40 -7 -15 30 -2 8
4474HL3n6mL0k2l5O5k3m8L7M0o7LO4o4MP0l9p4O3M2o8P7%q4J9R1j16OJ07o7n0
$$ 8 41 -15 -19 11 -11 -46 19 -4 -52 -15 25 -42 -39 25 -39 -35 35 -4 -78 -15 27 -41 36 36 -48 -29 62 -54 -48 59 -8 -58
4506e8J08rj07J03J0j04O8P5j30K1J11j28k1J56j08q2J49k8j24J31J2j53R4J08
$$ -58 50 41 -66 37 47 -57 11 86 -44 -23 88 -40 -61 95 -13 -95 54 26 -98 33 45 -108 -14 94
4530I4j52j2J57j15q4J76m1j45J68K1j61R2J31k37O3J85k07j5K21j33j17K22k6
$$ 94 -58 -70 87 -28 -112 64 23 -122 46 67 -94 -2 129 -108 -45 140 -67 -82 139 6 -111 111 85
4553H5k25J98O2k40J00J25k02K1K19j63j10K58j15j56K16M3k95J85J31k75M7K47
$$ 85 -140 58 120 -120 -20 105 -97 -76 143 -20 -130 128 13 -143 73 116 -179 6 137 -138 -91 156
4575A56k25j04L26j52j62K79l7k69K51P5k89R8K48k78l2L18k26j29L02n5k70K64
$$ 156 -69 -173 153 1 -161 118 81 -188 63 138 -151 -53 195 -83 -115 203 -23 -152 150 95 -175 89
4597H9O9l32J91J81l41M8L04k69j24L71j58k70L80k2l33K48J69l85J13K95l61
$$ 89 158 -174 17 198 -143 -95 209 -60 -184 187 29 -241 139 117 -216 32 201 -184 -71 224 -137
4618a37m0M08k67j71L55r5k83L08R6l87J88K77m18M2L73k91j62M05j22l34M11
$$ -137 -177 231 -36 -207 148 53 -230 78 174 -213 -25 252 -166 -124 249 -42 -204 201 79 -255 156
4639A56Om26K70K73m65J11L73l97r1M54k43k81M53q8l81L19J80m72J79L37m48
$$ 156 162 -264 6 279 -186 -75 298 -99 -190 264 21 -260 193 105 -276 43 223 -249 -70 267 -181
4660a81rM47l18k07M95j61l53L97R2m60K57K70m85R3M10l96q9M74k32l09M69m1
$$ -181 -190 257 -61 -268 227 66 -287 110 202 -258 -1 269 -216 -123 287 -109 -198 276 44 -265 204 163
4682A63m42L45J68m82J85L41m41MM45l04k58M93j29l97M24J01n13K51L22m64N2
$$ 163 -279 66 234 -248 -63 278 -163 -159 286 -18 -276 217 88 -309 115 216 -297 -46 276 -188 -136
4703a36M04l56j63M93k03l36M52K2m69L40K01n04J75L73m16q5M94l12k29M71q1
$$ -136 268 -88 -251 242 39 -297 155 177 -292 48 249 -255 -80 293 -123 -208 286 -26 -255 216 135
4724A35m05L72J30m77K08L22m63J6M53l56j49M49j63l72M30M5m64L09K28m67J38
$$ 135 -270 102 232 -245 -37 285 -178 -162 291 -65 -214 235 72 -300 130 175 -289 20 248 -219 -81
4745h1L55l78q3M41k49k62L89j5l78L08J81m43J78K81l84QL93l09j69M15q9l62
$$ -81 274 -104 -187 254 5 -257 132 117 -261 47 228 -215 -37 244 -140 -132 261 -48 -217 198 109 -253
4767b53L84N7m25K70K05l86R1K71k73j16L73j40k83L49Ll52K67J83l77P4K77l26
$$ -253 131 188 -237 33 238 -148 -57 214 -59 -175 198 58 -225 124 127 -225 42 225 -152 -78 199 -127
4789a27j6L34k01j77L17n0k89K82P5l26J46K14k91J6K85k11j20K86p9k10K45M5
$$ -127 -143 191 -10 -187 130 80 -209 73 148 -178 -32 182 -109 -93 192 -19 -139 147 68 -142 103 148
4811A48k97J51J85k87K5K51k23r1K77j22j78K19Lk28J89P0k38R9J77k01k7K40
$$ 148 -149 2 187 -100 -75 176 -47 -138 139 17 -161 58 61 -167 22 92 -146 -47 130 -71 -98 142
4833A42j66r6K15n8j56J60N0k00R5J49j94k4K17j11j07J80n2j35J46Oj43P4R9
$$ 142 -24 -120 95 37 -119 41 91 -109 -14 135 -59 -83 134 23 -84 96 44 -91 55 61 -82 -8 91
4856I1j17j5J54j41l2J31o4r1J15K1j28R6M4j42M8R9r2m0J11l6o5P8J1r8P2L2
$$ 91 -26 -41 113 -28 -60 71 7 -84 31 52 -76 20 64 -78 -30 69 -23 -63 48 12 -53 25 36 -62 10 42
4882D2j02N3Q3j27OJ07o7l9R7l1m8L8M9q0L2N4m7j9M4m0k7P4m3l7O1Qr3K4O1m4
$$ 42 -60 -7 76 -51 -45 62 -5 -44 53 22 -26 12 61 -19 13 67 20 1 45 5 -22 52 9 -28 33 41 -52 -28 33 -11
4912a1l8O3m3kM7n2lM2J5n1L1J3l1K6J8l3K0L8j9n2L3K4o2L6Pj2j4N0j9k8K4k5
$$ -11 -49 14 -29 -31 16 -36 -39 3 18 -33 -2 11 -20 6 24 -9 11 49 30 -22 11 35 -27 9 16 4 -10 40 21 -7 17 -8
4944hoL8j4m2L7J2m5J4J4j8k9N0rl3L9qk9L1Ql9L2nk1L6%j3K1mqk6O8k1l2J2N3
$$ -8 -14 24 10 -32 5 17 -28 -14 0 -18 -47 3 -6 -39 0 -8 -37 -6 2 -37 -5 -10 -31 5 5 -8 13 9 1 -25 43 22 -10 2 55
4979E5q7K1M4o0J7L5m1pO5k6m8P7k1m0L9Qm6RK6o3J8P3q1j4O8k1o9N9J7n1M6M7
$$ 55 -32 -11 33 -27 -10 25 -16 -23 42 16 -32 45 24 -16 23 31 -15 -6 20 -43 -25 48 -33 -47 21 0 -69 -10 7 -44 2 49
5011D9j01M6O1r0qJ22q6k8P4j1q8R9Lj21Q0O0j16QJ47j17j7J23o6j18J42lj51
$$ 49 -52 -6 55 -35 -43 79 -7 -35 39 28 -60 39 42 -79 1 61 -55 -47 100 -17 -34 89 23 -95 47 44 -107
5038a07J04Q6j81O7J17j56J9J26p4j12J78n5j33J61L1j86J10J30k32M3J99j71
$$ -107 -3 83 -98 -31 86 -70 -51 75 1 -111 67 12 -121 40 71 -115 -5 125 -107 -64 135 -36
5060c6n7K09j00j49K38qk06J42N1j95J00J53k15k3K51j60j18K45q8j82K21L1k59
$$ -36 -93 116 16 -133 105 97 -109 33 84 -111 -11 142 -73 -96 155 -5 -123 122 34 -148 73 104 -155
5083a55J61J29k39J2K53k03r1K62j20j88K76K5k87J96J40l32J26K31k80n0L33
$$ -155 6 135 -104 -92 161 -42 -133 129 9 -179 97 122 -165 31 171 -161 -35 196 -84 -134 199
5104A99k19j57L46n4l08K61O9l00J65J97l42N9K78k51j27L76j43l12L80K6l68
$$ 199 -20 -177 169 115 -193 68 137 -163 2 199 -143 -84 194 -57 -184 192 49 -263 117 143 -225
5125b25K36J62l78J20K96l06p5L64j98k31L96p5l28K93J18l78J57K72l71L5L57
$$ -225 11 173 -205 -85 211 -95 -170 194 -4 -235 161 86 -242 51 169 -209 -52 220 -151 -116 241
5146B41k48k03M24j64k92L61N7l94K49K07m08P8L62l51j17M12j82l08M30k8m18
$$ 241 -7 -210 214 50 -242 119 176 -218 31 238 -170 -92 270 -81 -198 214 32 -276 154 126 -292
5167b92L48J24l98J93K63m10J5L71k57k11M30r1l66L81R5m34K44K56m21O8L63
$$ -292 56 180 -218 -25 238 -172 -157 214 -43 -254 176 85 -281 100 195 -239 5 261 -160 -92 271
5188B71l60j17M31j85k82L74L0m18K82J93m54J54L76m13m9M35k67k61M33m7m09
$$ 271 -89 -206 225 40 -242 132 162 -256 26 219 -235 -81 295 -118 -167 268 1 -260 173 126 -283
5209b83L41J42m67K37K67l96K3L99l64j72M74j44l24M00J4l99K76K23m07O1L58
$$ -283 58 200 -267 -30 237 -159 -136 263 -101 -273 201 57 -267 133 147 -252 24 247 -160 -99 259
5230B59l59p7M38k62k39M23m6l73L07J52m02J75K57l89J1L66k74j74L76r7l28
$$ 259 -100 -177 261 -1 -240 183 137 -236 71 223 -179 -4 253 -136 -125 241 -33 -207 169 72 -256
5251b56L53N9m01K27K32l85O5L44l05j31M20k14k26L33k2l25K82J42l79J44K66
$$ -256 97 156 -245 -18 214 -171 -106 238 -67 -198 222 8 -218 115 93 -232 50 192 -187 -43 223
5272B23l19p5M16k26k10L64q7k73K91P3l70K02K09l31nL12k28j29L50j65k20K98
$$ 223 -96 -171 245 19 -191 173 86 -187 104 177 -193 9 218 -113 -118 194 -34 -163 187 22 -198 100
5294A00J2k89J94J32k96R9K25k35p5K94j79j61K90p0k06K27O8k73J09K03k55j2
$$ 100 112 -177 17 149 -147 -48 177 -58 -133 161 -18 -179 111 41 -165 62 130 -143 -34 169 -86 -98
5316i8K53j80r9K71o2k18J87P9k44J11J14k11K8K09j78o8K41j16j36K17l3j93
$$ -98 155 -25 -124 147 85 -133 54 133 -111 0 114 -97 -69 140 -38 -106 135 19 -117 100 67 -126
5338a26J15J01j97N6J93j79m9J70r3j03J95m8j72J57N3j86J03J15j40PJ31r4r9
$$ -126 -11 90 -107 -51 142 -37 -86 84 -9 -112 83 35 -137 20 73 -113 -10 105 -35 -28 103 9 -90
5361i0J87o5j34J44jj36J15P4j25J7R4r8qR0n4o3P1Oj16J15J4r9L8P5r1j9J13
$$ -90 97 32 -102 42 41 -95 20 94 -31 -14 80 -18 -26 64 10 -53 18 24 -92 23 37 -62 -24 51 -40 -59 54
5388E4o1n4J00k4p6O6J4p3K9Q7r8mR8n2n2Q5j0n5M8K7o8K4N3n2j8O0p1k7O5mo9
$$ 54 -7 -61 39 15 -61 5 19 -54 -25 62 -36 -40 58 6 -46 39 29 -26 22 49 -19 5 58 6 -12 48 -23 -50 15 11 -58
5419e8M9M9p1K7N5p4LM2k8j3K8Jm2N0Jo0K6M2n2J2K0k0kL4jk0MJ2k2K3jj7M5k1
$$ -58 -9 40 -31 -4 51 -23 -20 22 -6 -19 9 10 -32 18 19 -41 -15 27 -25 -13 7 -13 -15 19 18 -2 2 14 -8 15 14 -3 42 21
5453B1l6k4M9lj7N2k9j4QNk2L1ml2j8M4k3j6N2j3k9J5nm4P7J1n7L0J2k8j8N6m8
$$ 21 -15 -39 10 7 -10 42 13 -1 7 12 -10 21 17 -15 -33 11 -12 -28 24 11 -18 -3 -8 -52 25 36 -21 9 21 -7 -25 31 -17
5486a7J1L2j2rMLl2K9J9m3J7M6o9mN2l9l0Q4l5m0M7j8j9J8J7n2lN1k6QL8n6k4
$$ -17 -6 26 14 5 9 12 -20 9 28 -15 2 48 -21 -25 27 -12 -42 42 7 -33 14 -4 -23 -5 12 -40 -43 8 -18 -10 28 -28 -52
5519e2P0J5j05R4J2p5L7N5q0K3M9m8m3Q9j8p4R7jp5L0O4q8J8R9j23j3J04n0p5
$$ -52 18 33 -72 22 34 -41 -4 51 -29 -6 43 -5 -48 41 23 -51 46 45 -30 0 64 -24 -6 93 -30 -43 61 11 -64
5548f4J29k0j33J08J0j09O0Q9j26k1J54j04o0J82q7r5J33k1j29J05R4j64L1J30
$$ -64 65 45 -88 20 30 -79 -19 70 -56 -77 77 -27 -87 95 8 -87 46 25 -104 1 95 -69 -38 92
5572I2j14l4J61r1q7J50k4j93J88M4j84O7J56j86k6J96j19j07J88l4j65J64L2
$$ 92 -22 -56 105 14 -73 77 53 -140 48 92 -92 -25 131 -55 -81 115 -4 -111 77 43 -122 42 74
5595G4k02J27J08j96J1J85j42q7K06n0j45J77Qk14J74P9k25Q8J35j65m0K33j43
$$ 74 -128 -1 107 -89 -78 107 -35 -122 84 34 -111 66 74 -140 34 113 -112 -24 111 -54 -94 139 -4
5618dj24K81r7k06K27N4k56J17J87k55LK42k07r4K58j00k06K56J3k52J67J39k62
$$ -4 -128 153 56 -150 77 131 -125 -8 179 -76 -73 169 -38 -132 126 26 -180 76 89 -163 4 143 -119
5641a19N1K15k37p4K89j24j73K64Mk87K33P5k76J23J72k34MK49j75j15L05j24
$$ -119 -68 147 -90 -164 125 1 -172 92 96 -191 42 117 -159 -36 136 -98 -94 155 -20 -135 170 46
5663D6k34L09Pl18J88J72l17P4K71k54q5L43j91j88K83k6k64K48R8l29R9K38l01
$$ 46 -188 121 128 -190 -2 170 -147 -73 198 -56 -141 202 11 -177 106 80 -184 64 162 -167 -68 170 -131
5686a31M7K74k34j26L42j05k78L11K0l07J75J85l18P1K52k62l9L09j60k08L06
$$ -131 -84 190 -44 -170 172 67 -211 100 120 -187 -12 173 -145 -74 178 -84 -123 186 26 -182 124
5707A24J0l30K48J11l32J25K78l17m7L33k01k05L55o9k69K55N9k93J52K04k99
$$ 124 134 -196 52 163 -169 -44 234 -83 -130 203 2 -203 152 83 -186 69 128 -165 -13 191 -108
5728a08j6L16k32j34L43j37k44L09Rk94K16J37l02Q0K50k66n2L29k09j46K79m2
$$ -108 -124 192 -40 -174 169 32 -212 97 106 -188 28 165 -137 -57 193 -73 -125 204 -5 -151 128 86
5750H6k35J87J18k92J06K14k86NK82k07j27K82r2k30K54K8k68J75J68k99M3K16
$$ 86 -149 38 156 -136 -30 184 -102 -97 185 -22 -149 133 41 -189 65 93 -175 0 168 -131 -88 128
5772A28k15m9K59j27j40K40qk16J68R0k76P9K32k63j0K52j68j09K66p3k11K25
$$ 128 -87 -136 123 -4 -144 96 88 -128 40 130 -146 -67 165 -98 -108 144 -24 -133 133 60 -151 74
5794G4K5k32J43J66k90L6K25j62q0K23p6k08K41k3k01J66Q2k37O1J91j49n2J95
$$ 74 99 -133 10 176 -114 -78 147 -15 -95 128 52 -156 85 62 -139 27 109 -128 -67 124 -25 -77 118
5817A18j20j28K02l6j75J84M5k12J30J19j82j6J97j58p9J97m6j60J78L4j66N2
$$ 118 -2 -130 72 36 -139 45 90 -122 8 127 -55 -71 126 -32 -111 86 40 -120 58 92 -74 -22
5839b2J17j76M7J75j66n5J70r7q1J24J4j53J19N9j50K1J30j30NR4n7o8J45m3j05
$$ -22 95 -81 -34 141 -25 -80 90 -7 -88 36 50 -103 16 75 -75 -54 76 -54 -49 45 -12 -80 65 22 -83
5864h3R9N4j33P1P6j31M8K9k7n8J07j7r4J00Nr7O6O7j23L4P6r0oP8k8o8J13m2
$$ -83 16 70 -63 8 84 -47 1 30 3 -55 52 35 -59 41 46 -51 15 82 -41 -7 69 -21 -27 51 23 -45 68 26
5892B6p8O1K5r0K5N2l3l2Q3o8j1N0lm6N2K7q2L0M5m8kP1n1k0M4l9qN4ll9oK6k6
$$ 26 -52 9 34 -56 -31 21 -12 -44 39 -29 -40 10 7 -39 13 40 -42 -12 33 -15 -17 54 3 -17 27 -12 -20 34 31 -8 -14 12 -14
5925a4K4J5j8pL9k4l7L9Rm6K3M6p9QM3k4k1K8k0j4K2J4n4N9L0r2L2O0o6J5K1J2
$$ -14 10 25 7 0 39 15 -22 17 26 -20 3 49 -30 -22 21 -3 -24 4 -16 -30 -8 6 -48 11 41 -51 -19 41 -25 -10 11 23
5957B3n0L5Rm3N8J0p6L5K4j1nNJ6k4J2Kk1M4j9n5QK5jj3J2kj4K0oJ3Rj9k5J9O
$$ 23 -27 8 17 -26 32 42 -34 1 25 14 9 14 30 6 18 20 -1 43 24 -31 -23 2 1 -12 0 -2 -16 4 -2 11 20 1 -24 -5 1
5992Am3K0M5Rl8J8rk0P0k2l3L6j2k8J4K8l0oJ4j1j1L2Nm7M2j7l0J5Rl0J3O0m9
$$ 1 -42 -22 23 32 -6 12 3 -17 53 31 -2 34 22 -6 8 36 6 0 14 3 -8 24 29 -18 24 7 -23 -8 1 -29 -16 44 -5
6025ejK1rl0L9J2o5N6m3j8R1j4o8J6Q2o3l9R0m4m4O0mn6O3L1p2QN2o0jP2o5j6
$$ -5 -6 15 6 -24 15 27 -38 18 -25 -43 48 34 -34 -18 64 1 -38 52 8 -36 24 20 -36 27 58 -14 -6 46 -14 -15 57 -8 -24
6058b4R5n7q1R6nq4O7J8n2L1N0p0l1J19r1m3J17m1r8J36j1q5mJ19j28M7P7j00
$$ -24 71 14 -67 29 24 -60 7 25 -27 4 54 -16 -47 72 -19 -62 55 14 -84 52 41 -44 -48 71 -57 -10 67 -33
6086c3j2J25o7q9J50rj29P8P6j48N4Q9j49L6J11q3q1J28k5j12J06M9j60O0J16
$$ -33 -45 80 13 -76 74 65 -64 14 90 -58 -4 85 -64 -28 83 0 -81 47 22 -90 16 65 -95 -35 81
6111H1j68L8J27r7m4J48r8o3J43l5j28J21M4j46O3J21j49j0J71j27q0J80n7j32
$$ 81 -87 -49 78 -19 -63 85 -13 -76 67 32 -96 25 69 -77 -14 107 -42 -52 119 -8 -88 92 35 -97
6135i7J45M1j74R1R6j68L2J70j98m6J77m7j50J97nj84J32N6j67N3J67j73m7K21
$$ -97 48 89 -85 6 102 -66 -34 136 -62 -108 69 22 -128 69 64 -120 12 68 -99 -46 121 -52 -99 122
6159A22j08j62K19m7j56J67N1j96Q6J46j79k1K32j78o8K07r4j44J92L6k34J51
$$ 122 14 -148 71 24 -132 35 86 -110 -24 122 -57 -78 154 -24 -92 115 21 -123 69 105 -129 22
6181B2R6j93L4J49j37m3J96j11j38J95rk07K04M7k76J42J56k06pK18j65r0K24
$$ 22 118 -75 -41 108 -29 -72 124 13 -125 70 61 -146 58 105 -171 -29 127 -79 -86 132 -33 -123 101
6204A01n6j81J81N7k48J47J17k10K6K06j88k1K24j22j26J97J5k31J52Q5k32J10
$$ 101 45 -136 45 102 -146 1 118 -92 -66 140 -48 -69 155 33 -93 104 119 -112 40 125 -107 3
6226CJ57k07k7K01j21j26K38q1j68J92L1k23J08J52k18J1J89j49o1J99o5j77K06
$$ 3 160 -47 -74 127 6 -120 118 37 -131 61 92 -131 -23 129 -89 -78 111 -38 -99 100 35 -142 64
6249F4jj81J49O6j94P2J68j91m3K16j11j22J93oj65J30O3j89P8J40j85j5J96j43
$$ 64 63 -118 31 97 -97 -25 143 -48 -91 125 14 -108 85 79 -86 44 107 -82 -4 136 -49 -64 132 -11
6273a1r2J96q5j61K34k4j86J35O5j82O8J57j71qJ61r0j15J88%j94J49P8k04P5
$$ -11 -103 93 8 -153 81 57 -129 6 71 -111 -43 114 -57 -65 96 6 -109 79 79 -115 34 112 -92 -17
6297a7J55j91l7J92r7p5J26lj34J32L3j89J03J23j66L0J36j34n0J48p8j30J94
$$ -17 138 -53 -90 102 5 -70 56 53 -81 51 84 -105 -2 121 -45 -15 121 -13 -63 85 7 -123 71
6320G1Rj70P5P4j33L0J38j27p1J94r5q8J49j0j20J07L6j46M2J35j51j3J54p5o8
$$ 71 80 -90 -15 59 -74 -44 94 -33 -104 90 -5 -93 56 46 -74 33 69 -77 -35 100 -51 -64 90 15 -53
6345e3J13jj30J03L9j18P5O2j28L0R2j09mR6q2n1J08qq3O0M6q4L2P0j00l7J08
$$ -53 60 59 -71 32 71 -47 28 90 -38 -8 84 -25 -29 67 -15 -66 42 34 -49 11 57 -27 5 75 -25 -62 46
6372D6o0m3P4k7q1Q7M5p2M5M7r5j8J34q7k2O5Jp9O3K3q8L2L5n2J6O2n5l2O6oo5
$$ 46 -14 -57 17 -10 -91 -4 41 -31 14 61 -34 -52 82 -5 -27 38 39 -40 23 46 -42 -10 25 -27 -11 51 -4 -36 30 24 -41
6403d1O8m3k4O1j2n7K1M9p5PP8p7OM5j1k5M1K0m7J3L2k4j2L6Lo7O6K2r0K9N7n1
$$ -41 27 -16 -40 21 9 -48 -27 22 -53 -46 32 -45 -39 6 -5 -30 11 31 -16 -3 29 5 -7 29 32 -35 31 53 -37 -8 49 -2
6435bLM5m6j9L6ln6O2rj3J2Qp9M8K5k4rJ2K3l7L4k0J2JJ4n1J6K4j3MrJ8m0L7J3
$$ -2 1 46 0 -19 17 14 -42 20 11 -2 10 18 -61 -13 12 -12 -21 -9 14 -23 11 -9 3 4 18 -33 -17 7 -6 -2 -11 7 -33 4 17
6470A7l8J7K3qmL0k9MK4rm6L7K4kj2m0K5jJ2k7PjJj1j5J5k7K8K2n7M1k3mJ7Mj6
$$ 17 -21 -4 19 11 7 37 8 12 36 27 -19 18 42 40 28 -12 13 12 24 -3 4 3 4 -7 -22 -7 -34 -6 16 -41 0 -23 -27 -10 -6 -22
6506b2JM4j6mJ3jl0L2Ml7M1k2mM5l4mk3L2qJlJ3k0J7Jm2L0L0n7NL2n0J6M1l0j3
$$ -22 -21 23 7 3 16 15 -15 17 21 -16 25 3 -1 44 10 6 -17 15 7 8 5 18 -2 15 16 -26 4 34 -23 -18 14 -36 -20 21 -9 -22
6542b2L9l2nM4l2k5K9K1m7M7K3n4lM6j2l5L9k5l8O2j1j7J5L9n0JK9m4J0N1l0m5
$$ -22 17 -15 -20 24 -8 -33 -4 17 -30 17 40 -14 -17 29 17 -18 21 -4 -42 20 9 -8 7 46 -4 -3 26 -18 -8 43 13 -32
6574c2N6lo8O1J0n4J8M7m3m5P5k2m7N6ln3Q4k5o4M5L5n7J1O7o8k5R8n1j9N9j5
$$ -32 24 21 -47 14 24 -30 -12 35 -8 -53 22 0 -47 9 6 -47 37 12 -52 -7 28 -29 -18 49 -19 -44 54 3 -16 43 28
6605B8o4N6L0q2L9L3o4ON9m3l0Q5m6n8O5K4j27O8Q1j18RQ8n5m9J16p9n2J20Kj06
$$ 28 -36 20 50 -32 7 40 -24 -18 41 -2 -32 53 7 -51 14 38 -89 -21 60 -58 -49 39 -16 -65 51 -28 -80 40 42 -64
6635f4P9K5q7L9Q1j13K0J11q5n3R0j8q0J08%j32J06P2j35MJ06q0o0J57p9r9J36
$$ -64 15 40 -47 -8 73 -40 -20 91 6 -47 43 25 -55 53 53 -79 27 99 -36 -32 74 -6 -66 91 12 -87 49
6662D9J3j50J24K2j23L8J15j34m2J83j01r4J26L5j63J44K3j61Q2J15j88M5J38
$$ 49 62 -88 36 58 -65 -27 88 -46 -88 95 -6 -100 26 61 -102 42 65 -96 -14 101 -87 -42 96
6685I6r6o5J31k7j38J45L9j63R3P6j49N0J14j16m1J59j00r8J41j1j31J22N9j70
$$ 96 0 -65 66 39 -99 46 85 -78 15 91 -58 -8 106 -10 -51 108 8 -90 51 40 -91 31 90 -80
6709h0L2J28j31l9J89j30m8J47n0j26J56Qj42P4R8j76M7J40j22m3J74q4j07J48
$$ -80 -48 80 -51 -90 99 -31 -79 68 18 -108 48 56 -86 -12 86 -90 -43 97 -25 -68 106 22 -85 63
6733F3Oj49J01Q6j79O8J29j46k6J54j37o7J60l8j04J21K2j56Q2Q2j27mJ47j03
$$ 63 69 -80 21 107 -72 -4 125 -21 -47 107 -30 -97 63 25 -79 42 64 -92 -10 72 -55 -59 88 -15
6757a5p6J84p7j19J45J8j56Q0R2j74O7J12j02m0J66r8q1J66j7j57J11N8j58N1
$$ -15 -91 93 16 -103 42 60 -96 -16 76 -98 -31 81 -21 -61 105 7 -74 92 75 -82 29 87 -71 -20
6781b0J15j23k2J44p8j01J56m8j27J15M4j47Q2J09j48L8Q5j01l8J18m7q8J23l
$$ -20 95 -28 -50 94 16 -85 71 23 -104 11 55 -92 -10 99 -49 -11 74 -27 -65 53 6 -82 41 38
6805C8j33J47Pr9K5Q7r9j6J04q5l1J18rj24J11Pj16O0Q3j16NJ42j18m2J27o0o0
$$ 38 -95 52 59 -40 -15 72 -27 -43 61 -24 -55 63 54 -70 41 48 -68 -8 75 -41 -36 106 -12 -54 73 13 -47
6832d7P8Mj15P9P9j31K1J02j02k3J02l7r3J58n2j02J10Rj04M3R4j08oJ10r2%N7
$$ -47 31 35 -80 -1 78 -53 -32 70 -32 -55 47 10 -83 75 23 -79 31 40 -64 -21 73 -35 -41 69 -23 -23 34
6859C4Rp6Q4Op9M2L7r5J0R4o8m4Q7k2o7O8K9r8N3M2r0K0O4n2l4Q9k5p5O1K0o6
$$ 34 43 -33 51 57 -22 20 57 -38 -28 66 -2 -46 41 19 -48 20 49 -49 4 46 -44 -24 40 -12 -46 43 18 -57 4 24 -42
6890d2M2L6p8M1M7q0J2M8l9j5O5mn1K9K8n0L5qk9L6J5m5J1K6j9l9M8K4p5PO0m8
$$ -42 0 36 -42 -1 46 -34 -22 26 -13 -28 37 33 -18 11 39 -11 24 16 -13 23 38 -7 4 30 11 -28 20 44 -31 -24 36 -12
6922a2k1O6m6j2L2L2q3N7j5m9M4K2j0j2MJJJ3Qk0J1J7j4QJ2n9K1L2l9L0j0J8k8
$$ -12 -33 33 -13 -25 7 39 -44 13 -2 -51 -7 15 5 -7 -3 -2 -1 12 20 0 11 28 14 22 34 -25 -4 28 -11 19 9 27 -1
6955aK0j0n1M8J1l4QL8k9j4QJ9l0N9k8n2J5M2o3M2J4nj5K3k9OJ7mk7N0kl6J6L1
$$ -1 19 9 -42 6 17 -17 -9 29 0 -14 -6 13 -17 42 14 -38 -23 19 -44 -2 12 7 -8 15 -14 -8 9 5 -22 28 26 -10 6 37
6989C7pj0J0j7j3J8k2OJ0J6l3L8jm9K9kk6RJ9k2Mj5jRJ8kj1j2QnJ1nQj3J0K3k7
$$ 37 30 20 30 13 0 18 -4 2 12 28 -5 33 32 -17 12 10 -16 -7 12 -10 -6 -21 -22 -13 5 3 -8 -20 -12 -17 -6 -11 -3 -16 -6 17 -10
7026a0J7l0J6K7j7lK4Rk3NlonK0Nm1L0j5l0K3J2pLmK2j9J0k8j2M9Mq2Q0J2o8M7
$$ -10 7 -23 -7 20 3 0 24 33 10 15 12 6 1 21 26 -15 15 0 -30 -7 5 -2 1 -3 19 0 10 -18 -30 19 23 -59 21 33 -35 12
7062A2Rm4RQK3j4L6l0n1P3jm5J4M0n4L9J5l6k8N7l8lK6k0%K2Rn3N9j9m9J7L4n4
$$ 12 21 -23 -14 -6 17 3 39 9 -42 31 30 -15 -1 39 -15 24 39 3 -25 32 -6 -9 17 -3 -3 19 28 -25 34 15 -34 -17 17 -37
7096c7J3O9m1m7M5J4n4L8K1o8J2P7o7J0O5m7k1Q5o9j2O7k2n8M9J6l4k9N5m2j2
$$ -37 -24 45 4 -43 2 16 -38 0 21 -47 -35 42 -25 -15 50 3 -18 67 -2 -14 53 31 -27 22 38 4 -25 30 -12 -24
7126b4Q1n7k6J7K3o5P3K2r2J8N5r5K5Q7q2J5N0k5n8O7K6r3Q8K7r4J8O8r3k5J24
$$ -24 57 0 -26 -9 14 -51 22 44 -48 -30 25 -70 -45 42 -40 -25 25 0 -58 9 35 -58 30 57 -37 -19 49 -44 -69 55
7156E5n2l9Q3j7q7R5J7r0J9Q2j03j4J24q3n1J25m3o5P4J4r4O3M0j08K7J02j25
$$ 55 3 -36 47 30 -57 38 55 -35 -16 66 -37 -51 73 -10 -61 64 21 -44 30 44 -50 13 53 -55 -28 74 -51
7183e1NR3m5j06J29Qj05R9K7j19N1Q4r7m1J42o1p2J38l3j26J23K5j29O3Q0j28
$$ -51 -46 47 2 -104 25 33 -72 27 54 -65 -14 70 -27 -68 74 13 -59 79 46 -80 43 68 -61 2 82 -46
7209d6K8P0p4k8J34p5p2J09Rj10M4P6j33O4Q1j33L0Q0o3n2J17j8r1J11j4j10M6
$$ -46 -18 52 -22 -50 84 9 -63 46 55 -55 -11 65 -68 -4 77 -56 -26 54 -9 -61 56 38 -53 58 44 -66 -20
7236b0J22j30j3J26p9n8J15n4o0J13K7j56R5N3j35M1J03j33j3J96j29o4J14k6
$$ -20 102 -28 -41 85 6 -52 63 9 -51 62 89 -67 28 81 -54 -13 90 -43 -56 140 11 -53 61 35
7260C5j20J13N9j45M9Q9j21k6J50j10l8J36l3j33J37Nj27O6J05j26PJ09j26l0
$$ 35 -85 28 87 -58 -9 80 -41 -67 83 -27 -65 71 38 -95 42 47 -80 -14 91 -35 -28 81 -45 -75
7284g5J34m4q5J10L0j23O8Q4j63L0J25j32NJ24j08o7J52m9r3J11M5j50N0J03j37
$$ -75 59 15 -70 40 70 -53 15 99 -64 -34 91 -41 -36 88 -20 -87 65 16 -77 34 79 -71 -21 82 -55
7309e5J2J19j21k1J08l4n8P0K2r7M7O4j10J2J39j21j1J16m8r0J29l4r1P3M2r9
$$ -55 -43 76 -45 -66 42 8 -50 20 42 -55 -8 56 -54 -42 97 -24 -35 81 33 -57 72 38 -53 20 62 -37
7335c7L4Q8j30kJ10o1o0J22m1q6Q5M2j38O3N1n9LP2r6k1J02n7m6Q8Lj12R3N5j14
$$ -37 -3 85 -45 -47 63 2 -58 64 23 -63 22 64 -74 -11 40 -19 -16 56 -40 -61 41 -16 -62 26 29 -83 10 65 -49
7364d9M5N4n4n1R6m2n1R3j6o4R1L1j15k7J10o0J0M2k6n0N9k0n9N9J5o3M9K9o8
$$ -49 -4 50 -4 -55 41 -1 -52 41 25 -39 52 83 -32 -59 51 -9 1 43 17 -33 26 6 -53 6 21 -42 7 36 -32
7393c2K7K4n1k2O0j3l6P8k6l2J3M7q6L5N3m2j2N4k2n1N7j7k7L5J1k5QM1n0J2L0
$$ -32 -5 19 -32 -54 6 -7 -43 35 9 -23 -10 37 -49 -14 39 -3 -15 39 17 -34 23 6 -21 14 25 0 8 49 -1 11 41
7424D1l7j0M0j0m1M8j3m2QN6p4KL2lj5K8k1k0K6M6o9L4J2j3J5J1n2m2R1k2j8K6
$$ 41 4 -6 34 24 -17 31 18 -24 -16 40 -34 -32 0 -3 -18 10 -11 -31 -5 41 -28 6 18 5 20 31 -21 -63 28 6 -12 14
7456A4J1qK0ql5JL1j8PN9n4l1O0l8l3L8k1j7K8J4m6KL4j4m1P2m6j6K6J5k6JJ5
$$ 14 25 17 37 29 -6 -5 26 8 15 74 20 -11 49 11 -22 16 -5 -22 6 20 -26 -24 10 -4 -45 27 -19 -35 -9 6 -20 -19 -4
7489dlj0M1k1j0J9rJ0J2pm9M9j4rj1J6lL3ok0pL0kk3J3lk1K4jk0OK3l0lJ0k0L
$$ -4 -7 -17 24 3 -7 12 3 13 25 18 -31 18 4 -5 -16 0 -3 30 24 4 -3 27 25 2 15 12 -9 15 14 -6 0 23 -7 -10 0 -20 -17
7526a7J0J6l8J9L5n9K8Rl1K5L0j6l1L5K6m2LK3l2K9oj7j0M3ml2OL2o1M1j8j3J1
$$ -17 -7 9 -29 -10 25 -34 -6 3 -28 -3 27 11 -20 15 41 -1 2 25 -7 22 16 -1 -11 32 28 -4 2 34 -27 14 -4 -17 -6
7559f%rJ3K7l7QRkl4L6k3k2K9j0j9J0M7l5j0N1n3LK9Pl0L9J3o0M7J8k3KL0o4J
$$ -6 -6 -15 -2 25 -12 -4 5 3 -31 5 -18 -40 -11 -21 -40 -30 17 -18 -28 23 -30 -27 2 9 -21 18 31 -29 18 36 13 15 45 -19 -18
7594a8M3k0j1L5Ln1O2k9n3L3M5o7NM5k4m8O8n5qP9k9m4P3j3n8K7K8l5mN4n5j8
$$ -18 25 5 -6 29 32 -19 43 14 -39 -6 39 -28 -23 22 -2 -50 18 -37 -45 34 5 -39 34 21 -37 -10 18 -17 -21 33 -22 -40
7626d0P8Mq8P0Qn3M3K2m1k8P8o8rQ3n9l1M7On7L4K9p0M2M2q4mQ5n6k3P2l0n8P8
$$ -40 38 42 -46 24 32 -21 22 44 3 -25 53 -15 -24 59 0 -31 16 22 -35 -1 28 -42 0 42 -42 -46 39 -17 -40 32 2 -56 22
7659B2j6o9O1N3j07M0N5o3l1R7n1l5J04k1q0N9L7j05M3O6o9RQ9j02k7Q8m8n5Q4
$$ 22 6 -63 -2 51 -56 -16 39 -24 -55 42 -9 -44 60 39 -41 18 55 -50 -7 59 -10 -1 88 -14 -41 47 -1 -56 28
7688B8Nq4N2P2j55L3R3n3l0J01o5n1P4J7j03O0N8r4L1N9r4K3J01r9m0J18k6q4
$$ 28 33 -51 1 73 -82 -49 44 -9 -39 62 -3 -54 20 37 -66 -6 52 -42 -11 48 -46 -23 78 -21 -61 57 31 -53
7716e3Q4M2j34P5O4j16K2J35j59j1J19l3j19J22j0r8P2N3j40N6J06j14oQ9n7n9
$$ -53 31 73 -61 14 78 -38 -16 119 -40 -51 68 35 -84 38 28 -70 2 55 -85 -29 77 -37 -43 46 -11 -70
7742g0J14jj19Q4K9r3M1J18j35j9J32p5n2J20m6p7R1Rj38J14M5j39L4J18j20J
$$ -70 44 43 -76 8 37 -56 -15 103 -32 -51 81 6 -46 74 28 -49 42 51 -87 27 72 -67 -33 85 -35 -34
7768c4J21r3q2J47mj08R1J2j07M4J29j77J3J31q9p8J47m0j15J18L4j04L1R5j16
$$ -34 87 -6 -88 59 55 -53 38 50 -57 -13 116 -61 -48 83 -6 -84 63 23 -92 26 60 -44 -13 82 -34
7793c4lJ01q3k1J04m6o7J07j5r0P2Q1j64M2J02j18J5J09q2o2R9k3r9R8L9j27L7
$$ -34 -37 64 -19 -40 64 18 -49 58 43 -47 25 106 -58 -16 86 -32 -17 92 10 -52 47 24 -75 23 62 -65 -28
7820b8J03j23pJ21j22jJ13m1q3J15Nj26P4O7j02MR4q0m7J10l7q3J41Pj07M9M3
$$ -28 75 -48 -55 66 -56 -57 56 15 -68 47 52 -74 0 67 -35 -31 63 -17 -64 46 9 -74 67 74 -33 16 59
7847E9j02M1P0q8j4J23n2q5Q0j8l7K4K4n5RP5q8j2R4n7k8P1m7o6J02Mq2Q7J3r0
$$ 59 -43 -2 68 -20 -34 89 37 -48 32 14 -23 1 25 -30 -21 54 -34 -46 48 -9 -37 34 -13 -79 23 27 -55 32 45 -45
7877d5L9N5o0j0N3k1l6P8l0l5J7M3j00M4Q1n6m6P4j4n0L9Qo1P0j3o6M8K9n2JO2
$$ -45 -6 49 -11 -21 32 11 -25 53 23 -12 5 48 -52 -8 73 17 -29 45 31 -19 20 28 -33 37 24 -42 6 35 -17 -16 46
7908D6q0j7N9nm2L6L9p5J5O8p5L2O0p1k6N4m1pP1kp9M1L5m8K0K9m1j5R0n4l9L8
$$ 46 -34 -51 8 3 -39 -3 36 -39 -24 44 -31 1 61 -10 -36 18 -23 -30 41 39 -40 1 36 -12 8 37 -4 -19 71 17 -22 16
7940A6J0n5L1K3m7M1J6n2OK2mn5O5k2m5N7nl0K5L3p3J1M7j3m2P6l3k9O4mn9J1
$$ 16 26 -29 2 25 -22 19 35 -17 -11 11 7 -48 17 -5 -50 7 2 -28 -3 30 -43 -32 15 2 -40 36 3 -26 38 34 -25 -14
7972a4L5l4J3K4j9J9J6j5n1K9K7k8j7M0l9PL2k8j7K5k5k7J8PjJ8K7n1K0L6m7p
$$ -14 21 -13 0 24 5 24 40 25 -26 3 30 2 -15 25 -14 -7 25 -3 -20 5 -20 -47 -29 -22 -23 -5 22 -29 -9 27 -20 -27
8004b7L7l6K9Kj4oNL0k6QK4n4K2K6k5JM5n8j0M7Km0J0K6k3NK8j8j6K0mj0J1k9
$$ -27 10 -26 3 5 -9 -15 -10 20 -6 2 26 -28 -6 20 -5 -4 41 -17 -27 20 22 -18 -8 18 -5 0 28 10 -6 14 10 0 11 -18
8038a8nK6J0l9LJ7mlRK1l3L7j0m5N1j0j3JJ5qpK4nk4J7Qj0J3j9j5M6pk8L3J7m9
$$ -18 -23 3 13 -26 -23 -6 -10 -13 -4 17 -16 21 11 -34 17 7 -6 -5 10 2 -5 19 14 -10 7 15 5 18 -1 -16 30 23 -5 28 45 -4
8074dj4L4l0%jJ2l7N2Mk4qll2K4L6j7j7L7m4nO0j0l7L4J2l3K1J5l5LN4n0JN5m7
$$ -4 -18 16 -14 -14 -15 -3 -40 12 16 -8 -16 -19 -51 -27 9 -8 -25 12 -32 -37 23 13 -24 10 22 -11 10 25 -10 -7 47 -3 -2 53 6
8109FoL4j0m9OL3n2M0J4nl7L9l0j1P0k9m2L0K2p4P1nm3J0N7n2j2O8n8l5Q2l3k9
$$ 6 0 34 24 -25 -19 14 -38 2 16 11 -26 13 -17 -28 42 13 -29 1 23 -51 20 15 -28 -18 39 -13 -25 43 -15 -50 32 -1 -30
8142c0M1J2n0L9M6p7N9K4p6j5P2k6m6M8j5o9P1Qn2J8O7o7ML4m2l2P9k7l6N3J4
$$ -30 11 23 -27 12 58 -19 40 64 -12 -27 45 19 -27 21 6 -63 8 16 -36 -18 49 -18 -14 20 -22 -54 25 -2 -38 15 29
8173B9p7M4N9p4K3M8r2j2Q4n0k1Q6l4m8P0J5r7M5
$$ 29 -48 -4 55 -19 4 52 -40 -52 32 -18 -39 47 13 -35 35 50 -47 -2
8191b
$$ Imaginary data points
##PAGE= N=2
##DATA TABLE= (X++(I..I)), XYDATA
0@%%%%%%%%%%%%%Qj6J6j6J6k4L2l2M0m8N6p1Q0q9J05j22J42j65J86k11K42k74
$$ 0 0 0 0 0 0 0 0 0 0 0 0 0 0 8 -8 8 -8 8 -16 16 -16 24 -24 32 -39 41 -48 57 -65 77 -88 98 -113 129 -145
35a45L06l44L89m36M85n38N98o66P39q19R05r98J102j213J335j472J622j789J973
$$ -145 161 -183 206 -230 255 -283 315 -351 388 -431 474 -524 578 -635 700 -772 850 -939 1034
54A034k177K411k673K969l312L714m190M768n487O403p619R326j1916J6346k5925
$$ 1034 -1143 1268 -1405 1564 -1748 1966 -2224 2544 -2943 3460 -4159 5167 -6749 9597 -16328
69a6328Q2474o8711j13819J14888m2317L6472J41795q7537j72495J00419N7485
$$ -16328 66146 -2565 -116384 -1496 -43813 -7341 134454 46917 -125578 -25159 32326
80C2326o2647P6683K8405j61725L0320J36937p2965n0503Q3797o5223m1312J45207
$$ 32326 -30321 46362 74767 -86958 -56638 80299 7334 -43169 40628 -24595 -65907 79300
92G9300q121j49713M2293N2816n6020Q1788O8637j58140n5866J15965m541o071
$$ 79300 71179 -78534 -36241 16575 -39445 42343 110980 -47160 -103026 12939 8398 2327
104B327R2674p9969j30741R3104P2374o0736M4034K1551j24965J4724J16860n3653
$$ 2327 95001 15032 -115709 -22605 49769 -10967 33067 54618 -70347 -55623 61237 7584
116G584m1494P6010m2491n5121R5878k918j03657N4300N9811o5293K4808M3942
$$ 7584 -33910 42100 -391 -55512 40366 37448 -66209 -11909 47902 -17391 7417 51359
128E1359j02683j5618J14142j3214m6364M8163m5390p3628R1524N6484p2894Q116
$$ 51359 -51324 -66942 47200 33986 -12378 35785 -9605 -83233 8291 64775 -8119 -3
140cK3465p5116J9633Q9659m6723m3549N8228k2014m5051O3378K924o8927M4829
$$ -3 23462 -51654 -32021 57638 10915 -32634 25594 3580 -41471 21907 24831 -44096 733
153G33M6054o0904j136L5201n3008L813Q3949k5308n9584K8474j0011k9527P1089
$$ 733 46787 -14117 -15253 19948 -33060 -29247 54702 29394 -30190 -1716 -11727 -41254 29835
166B9835K8430p6274q382L0257l0734K2627N8607m7480m5395M3207j583k4923
$$ 29835 58265 -18009 -26391 3866 -26868 -4241 54366 6886 -38509 4698 3115 -21808
178b1808M4554J87n4860K6581L4346m1618j078L0936l1203j043N1459k3171m4805
$$ -21808 22746 22933 -31927 -5346 29000 -12618 -13696 17240 -13963 -15006 36453 13282 -31523
191c1523K5970O622j6317M0312R970n8471m992L2311r711J2761L0568l8538l4916
$$ -31523 -5553 1069 -15248 25064 35034 -23437 -28429 3882 -5829 6932 37500 -1038 -35954
204c5954L1922J0056j0822K6004m348m1929J1577K6284j7385L171J9604k3697
$$ -35954 -4032 6024 -4798 21206 16858 -25071 -13494 12790 -4595 -1424 18180 -5517
216e517j0191K7791p924k0042K0134M362j7488J5561O569k8559K187K2521p891
$$ -5517 -15708 12083 4159 -15883 4251 8613 -8875 6686 13255 -15304 -13117 9404 1513
229A513qJ4501j9754j7879K1073Q419q007J1703l088k5271N079J8085n085K737
$$ 1513 1505 16006 -3748 -21627 -554 7865 -142 11561 8473 -16798 -11719 6366 1281 4018
243D018R241j7281j1437J5187L132m468J1011k416j7059M015Q786n680M546Q122
$$ 4018 13259 -4022 -15459 -272 2860 -1608 9403 6987 -10072 -6057 2729 -2951 1595 9717
257I717j0660n958Q175k119l431R050J01q194L624J882p440K570O781l112q3L573
$$ 9717 -943 -6901 1274 -845 -4276 4774 4875 -3319 305 2187 -5253 -2683 4098 986 903 4476
273D476o582n188O061L517j8L250l321r106N75O482K676K581m01q134m647M677
$$ 4476 -2106 -7294 -1233 2284 2266 5516 2195 -6911 -6336 146 2822 5403 5002 -3132 -7779 -3102
289c102N016K436J008m705o283R66M807K593J070j647m392j369K719K034L37l28
$$ -3102 1914 4350 5358 653 -5630 -4664 143 2736 3806 2159 -2233 -3602 -883 1151 1488 1160
305A160j332q57Q90O03q75n69N12J269J019o68k191j694O35K903K564n78l121
$$ 1160 -172 -1029 -139 464 -411 -980 -468 801 1820 1152 -1039 -2733 -2098 805 3369 2791 -330
322c30l009k14L047L835P77l006l887j288K174M003K080j900l791k136J209L206
$$ -330 -3339 -3553 -506 3329 4106 1100 -2787 -4075 -1901 2102 4182 2282 -1509 -3645 -2436 770
338G70K215n51k703k350N23K414J299k92j172j585L7K033P02j455n13J50j61J633
$$ 770 2985 2434 -269 -2619 -2096 318 1617 1325 153 -1432 -1395 638 1340 -115 -628 -478 -639 994
356I94J093k651j641J719P15O85J830k292l909J681K786k01J444j31n211o63M841
$$ 994 2087 -564 -2205 -486 229 914 2744 452 -3457 -1776 1010 809 2253 2122 -3089 -3752 1089
373A089L97o10J870l729m052M837L166k906J209K25n768J796O503k950k514L456
$$ 1089 1486 876 2746 -983 -5035 -198 2968 62 1271 1496 -4272 -2476 4027 1077 -1437 2019
389B019l457k775P400N88o870K714K200n491L968N715p915k621P275l059k421
$$ 2019 -1438 -4213 3187 3775 -3095 -381 1819 -3672 296 6011 -1904 -4525 2750 -309 -2730
404b730Q142l539r075P127M194p163M496L992j1256P12J1232n520l904Q623n951
$$ -2730 5412 1873 -7202 -75 4119 -3044 1452 5444 -5812 -5100 6132 612 -3292 5331 -620
419f20p911J2105K563j1085N541M050j1721M765J1613j0908m142J1411o636o213
$$ -620 -8531 3574 6137 -4948 593 4643 -7078 -2313 9300 -1608 -5750 5661 -975 -7188
433g188J4156k139j3682R717N016j2793O909R444j5147q58J4853r056o012J4961
$$ -7188 6968 4829 -8853 864 5880 -6913 -4 9440 -5707 -6565 8288 -768 -6780 8181
447H181o144j3109J4871L442j5429R198P885j7490L722J5994j3603m923J6894
$$ 8181 2037 -11072 3799 7241 -8188 1010 8895 -8595 -4873 11121 -2482 -7405 9489
460I489r534j1515J8790m08j7445J3028O403j9438Q068J5282j8203k151J8707
$$ 9489 -45 -11560 7230 6822 -10623 2405 8808 -10630 -2562 12720 -5483 -7634 11073
473A1073j2895r358K1357n201j7970J7274M404k0357J1955J2707k2005J930J9940
$$ 11073 -1822 -11180 10177 4976 -12994 4280 8684 -11673 282 12989 -9016 -7086 12854
486A2854j5916o702K1835j0288j6257K1549J592k0943J4711R073k3645P398J9538
$$ 12854 -3062 -9764 12071 1783 -14474 7075 8667 -12276 2435 11508 -12137 -4739 14799
499A4799j9832m136K1886j4011j2646K4510l592k1267J8551O309k4017J2035J6360
$$ 14799 -5033 -9169 12717 -1294 -13940 10570 6978 -14289 4262 10571 -13446 -1411 14949
512A4949k3851P28K2976j7740r747K5164r096j8810K3468K277k5186J5601J2880
$$ 14949 -8902 -8174 14802 -2938 -12685 12479 3383 -15427 8041 10318 -14868 733 13613
525A3613k5313O685K1595k2597o112K6108j3086j5552K5431l425k3807K0510R275
$$ 13613 -11700 -5015 16580 -6017 -12129 13979 893 -14659 10772 7347 -16460 4050 13325
538A3325k6695J0213J8189k4123M91K5267j8739j3127K6248o346j9140K3222K166
$$ 13325 -13370 -3157 15032 -9091 -8600 16667 -2072 -15199 11049 4703 -14437 8785 10951
551A0951k7831J4943J6666k3547M521K0284k3413p125K8618r745j7313K2252l349
$$ 10951 -16880 -1937 14729 -8818 -4297 15987 -7426 -14551 14067 4322 -12991 9261 5912
564E912k3675K1376J2206k7038O532J7922k2306N00K6166j8128j5748K5401l611
$$ 5912 -17763 3613 15819 -11219 -4687 13235 -9071 -8571 17595 -533 -16281 9120 5509
577E509j8638K1772K249k8551J4140J9305k2141J862J8761k2595o971L0066p645
$$ 5509 -13129 8643 10892 -17659 -3519 15786 -6355 -4493 14268 -8327 -15298 14768 7123
590G123j9393J8978k359k1797K1448J3421k6972L125J7335j9158M35K5058j6480
$$ 7123 -12270 6708 4349 -17448 4000 17421 -9551 -6426 10909 -8249 -7814 17244 764
603G64j6637K2924j341j7375J8719L174k5747J1924J8530j9804p85J7064j7903
$$ 764 -15873 7051 5710 -11665 7054 10228 -15519 -3595 14935 -4869 -5654 11410 -6493
616f493o280K6579o467j9495J5584P96j7828J7785J1847k4803P86J7061j4494
$$ -6493 -12773 13806 7339 -12156 3428 4224 -13604 4181 16028 -8775 -7989 9072 -5422
629e422q14K1206j4040j5772K0181P17j5933J4911M148k1812R422J6340j7713
$$ -5422 -6236 14970 930 -14842 5339 6056 -9877 5034 9182 -12630 -3208 13132 -4581
642d581k122J6317j3078o218K1232o260j7716J4401L852j4797J2367Q623k1083
$$ -4581 -6703 9614 -3464 -9682 11550 5290 -12426 1975 5827 -8970 3397 12020 -9063
655i063J163J6792j0689k978J5544j1017j2467J7357J939j3963J0143M155j6400
$$ -9063 -7900 8892 -1797 -4775 10769 -248 -12715 4642 6581 -7382 2761 6916 -9484
668i484O828J3086j4013k693J3763q446o006J4742m815j3478J2207N109j2038
$$ -9484 -2656 10430 -3583 -6276 7487 -959 -6965 7777 2962 -10516 1691 6800 -5238
681e238O516N771j5006K130J4697p949n191J0035p167q084J4269K131j2265N712
$$ -5238 1278 7049 -7957 -5827 8870 921 -4270 5765 -1402 -9486 4783 6914 -5351 361
695C61L829j1083N255J0168j0635l134J0413n404n090J0367k798r561Q920M162
$$ 361 4190 -6893 -1638 8530 -2105 -5239 5174 -230 -5320 5047 2249 -7312 1608 5770
709E770r621L249M665r207J953J0530o168n514O616l258m486R747J324r628K552
$$ 5770 -3851 -602 4063 -5144 -3191 7339 1171 -4343 2273 -985 -5471 4276 5600 -4028 -1476
724a476L512o051L593O766p122l403O503k553l058O675j127o405M607K646n880
$$ -1476 2036 -4015 -422 6344 -778 -4181 2322 -231 -3289 3386 2259 -4146 461 3107 -2773
739b773J929L884n069M37N640l928l594M622p43k744M991K50n971J468L009k887
$$ -2773 -844 3040 -2029 -1592 4048 120 -3474 1148 405 -2339 2652 2902 -3069 -1601 1408 -1479
755a479J720L523m388k435L723p02j332L739o24m136J696J587k367J536K388k859
$$ -1479 241 3764 -624 -3059 664 -38 -1370 2369 1745 -2391 -695 892 -1475 61 2449 -410
771d10r33K223j407j001K833r2k076J254J00k127J249J752j302n9R90j659p70
$$ -410 -1343 880 -527 -1528 1305 1213 -863 391 491 -1636 -387 1365 63 4 994 -665 -1435
788a435J828J15n95J002m27j732M50R99k78O69N56j398r24O74K98L95R23m06j338
$$ -1435 393 508 -87 915 488 -1244 -794 205 -73 596 1152 -246 -1170 -496 -198 197 1120 714 -624
807f24k56M16L14Q53L26q82p53n1K65N14N82r6n99l90r7K07L84K94j9k40l55j92
$$ -624 -880 -464 -150 703 1029 147 -606 -657 -392 122 704 608 9 -381 -478 -271 113 407 388 148 -207 -399
829c99P8J90M06K88k72m90k63j15M14O97J86m81n28l89P7O66O77q8n14o02l06
$$ -399 -321 -131 275 563 291 -199 -462 -577 -163 534 720 239 -289 -678 -601 65 742 654 140 -462 -768
850g68L69P32M11k40o35m05j4L50N61K71l54n52j04N7J23N48J75m86j04mm20K37
$$ -768 -399 333 744 504 -131 -536 -550 -200 361 632 278 -274 -378 -321 -198 350 525 39 -65 -69 -489 -252
872b52P08j54k68L22n28o03P76M55m93M19J37j259O2J072l94j9R93r41j190J074
$$ -252 456 302 34 356 -172 -775 1 456 -37 382 519 -740 -678 394 0 -19 974 33 -1157 -83
892h3L26p22J133L78j943J31J261r26K68J719j425j481J596Oj136J834L31k527
$$ -83 243 -479 654 1032 -911 -780 481 -445 -177 1542 117 -1364 232 238 -898 936 1267 -1260
910a260P13J626j813K33K142j958j101K657q02k104K317L22k558K034J449l466
$$ -1260 -547 1079 -734 -501 1641 -317 -1418 1239 437 -1667 650 972 -1586 448 1897 -1569
926a569L15K828k110l13L253k446k757L509M84k644K695N76m563J548L651k997
$$ -1569 -1254 1574 -536 -849 2404 -42 -2799 710 1194 -1450 1245 1821 -2742 -1194 2457 -540
942e40k86L259l383j895M964o34l806L251N28m225L009K890n073J32M371l219
$$ -540 -826 2433 -950 -2845 2119 1485 -2321 930 1458 -2767 242 3132 -1941 -1809 2562 -657
958f57j131M823k897m015N256R22m549L145J405n957K349N352m601j420M661l792
$$ -657 -1788 3035 138 -3877 1379 2301 -2248 897 2302 -3655 -1306 4046 -555 -1975 2686 -1106
974a106k445O818r43n906M191J477n502L804L902o942l4O267m116k083O285l438
$$ -1106 -3551 3267 2324 -3582 609 2086 -3416 388 4290 -2652 -2686 3581 -535 -2618 3667 229
990B29n112P059J158o697L706K475o915L003O542o484k461O503l621l100P919
$$ 229 -4883 2176 3334 -3363 343 2818 -4097 -1094 5448 -1036 -3497 3006 -615 -3715 4204
1005D204j571p778N366K922o465L700M466q252j53Q044m399l354O905l255n863
$$ 4204 2633 -5145 221 3143 -3322 378 4844 -3408 -3561 4483 84 -3270 3635 380 -5483
1020e483Q058J607q264L678L794p319K795P230p559l237Q053l008m111Q094j842
$$ -5483 2575 4182 -4082 -404 3390 -3929 -1134 6096 -1463 -4700 3353 345 -3766 4328 2486
1035B486q757O460M250p554L004M890q785J11R490m952m701P446k854o238Q703
$$ 2486 -6271 189 4439 -3115 -111 4779 -4006 -3895 5595 643 -4058 3388 534 -5704 2999
1050B999J792r573L764M978p559K312P493q071l461R123k621n183P757j394q826
$$ 2999 4791 -4782 -1018 3960 -3599 -1287 6206 -1865 -5326 3797 1176 -4007 3750 2356 -6470
1065f470O776M973q307K012N468q074j43R660m953n633P472j691o320Q033K009
$$ -6470 306 5279 -3028 -1016 4452 -3622 -3765 5895 942 -4691 2781 1090 -5230 2803 4812
1080D812r718L395N866p221J215P364p416l624R289k186n972P087m94q331O427
$$ 4812 -4906 -1511 4355 -2866 -1651 5713 -1703 -5327 3962 1776 -4196 2891 2397 -5934 493
1095D93M957q595J400O026p191m73R049m972n794P655q47o391P050J973r218L400
$$ 493 5450 -3145 -1745 4281 -2910 -3383 5666 694 -5100 2555 1708 -4683 2367 4340 -4878 -1478
1111a478O064o955L60P021o423l430Q745k048o152O465L63p480N316M590p970
$$ -1478 4586 -2369 -2009 5012 -1411 -4841 3904 1856 -4296 2169 2532 -4948 368 4958 -3012
1126c012Q99O216n966j200P737m085n347P013k9o226N477K190p763K715N734o174
$$ -3012 -2113 4103 -1863 -3063 4674 589 -4758 2255 2226 -4000 1477 3667 -4096 -1381 4353 -1821
1142a821n04O322m840l193P410j590n823N503J124o505M070L986o838O34N849
$$ -1821 -2325 3997 -843 -4036 3374 1784 -4039 1464 2588 -3917 153 4139 -2699 -2065 3784
1157C784m932j723O542l204m557O182J54n726M271K339o338K137M904n250q80
$$ 3784 -1148 -2871 3671 467 -4090 2092 2246 -3480 791 3130 -3208 -1071 3833 -1417 -2297
1172b297N530l552k930N905j090m988M392J417n307K693L474n313K28M883l620
$$ -2297 3233 -319 -3249 2656 1566 -3422 970 2387 -2920 -227 3247 -2066 -1838 3045 -575
1187e75j918N036j939l717M560N00m614K841K326m700J200L888l836j012M337
$$ -575 -2493 2543 604 -3113 1447 1947 -2667 174 2500 -2200 -1000 2888 -948 -1960 2377
1202B377k298k547M251n02l837L174J330m049J762K731l706r9L647k569j634L750
$$ 2377 79 -2468 1783 1281 -2556 618 1948 -2101 -339 2392 -1314 -1413 2234 -335 -1969 1781
1218A781j154k815L143M69l378J996J821l300O22K780k532q80L082j473j932K870
$$ 1781 627 -2188 955 1424 -1954 42 1863 -1437 -815 1965 -567 -1447 1635 162 -1770 1100
1234A100j71k612J978J044k661R71J977k373k43K373j509j171K399n42j958J829
$$ 1100 929 -1683 295 1339 -1322 -351 1626 -747 -990 1383 -126 -1297 1102 560 -1398 431
1250D31M92k066J116J306k065J72J733j394n86J816p61j279J634L7j527J049O87
$$ 431 923 -1143 -27 1279 -786 -614 1119 -275 -861 955 194 -1085 549 586 -941 108 795
1267G95j531M94J151j266k50J316p51o62J302k63j117Q93L63j046N51O66j047
$$ 795 -736 -242 909 -357 -607 709 -42 -704 598 335 -782 111 474 -572 -21 645 -402
1284d02L2Q78o04k85Q51l27o69P05J27o69M37L20o68J28N11m51j61N20k23l02
$$ -402 -370 508 -96 -381 470 143 -526 179 306 -363 74 394 -274 -146 365 -86 -247 273 50 -252
1304b52M11j7m14K89J64l54J32K15l01l8K60q6r9K12j07k11J41J26p7N4Q0k26
$$ -252 159 142 -272 17 181 -173 -41 174 -127 -165 95 9 -90 122 15 -196 -55 71 -6 48 128 -98
1326i8j4J32nL2L0p2m9k3P5qP9l5l8m7qN8N8o4K7j3o0JL5lL6M2n9o9J8lJ5P4L2
$$ -98 -112 20 15 47 77 5 -44 -67 8 0 79 44 6 -41 -49 9 67 3 30 17 -43 -42 -7 -10 26 68 9 -60 -42 -45 -30 44 76
1359G6q6m8Oj4Q3R7l3j16n6LP8N9M6l5j03p4J04L1J5N7l5j62N7J02j05O6J57j68
$$ 76 -10 -58 -52 -66 17 114 81 -35 -91 -88 -10 49 95 60 -43 -117 -13 18 33 90 55 -107 -50 52 -53 13 170 2
1387Bj24K14j19r0K53K4k64J08P0k97J51L03k41r4K91k92k09N28rm11L03Q9n84
$$ 2 -122 92 -27 -117 136 160 -104 4 74 -223 -72 231 -10 -104 187 -105 -314 214 205 -206 97 186 -398
1410c98L11M28m74k7N64n36k79P24j78m99O74N0q39M56M24p95K60Q18q38l40R21
$$ -398 -87 341 -133 -160 404 -132 -411 313 135 -364 310 360 -479 -23 401 -394 -134 684 -154 -494 427
1431D27m29n41J088j31j133P67M43j092N49Q65j221j22J234q12o36J387l67j142
$$ 427 -2 -543 545 414 -719 48 491 -601 -52 813 -408 -530 704 -108 -744 643 276 -866
1449h66J260K58j538P86R31j374K86J355j434o57J773n28j049J621k37j865J259
$$ -866 394 652 -886 -100 831 -543 -257 1098 -336 -993 780 252 -797 824 587 -1278 -19
1466a9J061j694M83J309j854k69K135r90j200J827l84j764J835O56k305Q58J549
$$ -19 1042 -652 -169 1140 -714 -983 1152 162 -1038 789 405 -1359 476 1132 -1173 -315 1234
1483A234j945J59K007j861j061K529m74j729J959r7k516J738J747k391J86J830
$$ 1234 -711 -552 1455 -406 -1467 1062 588 -1141 818 721 -1795 -57 1690 -701 -515 1315
1499A315k264l60L073j240k024K262k35k259K385J030l155Q59K171k334m8K654
$$ 1315 -949 -1309 1764 524 -1500 762 527 -1732 653 1683 -1472 -613 1558 -776 -824 1830
1515A830k167j591L248l87k468K238K64l014K023K274l129j60K464k283n52L562
$$ 1830 -337 -1928 1320 933 -1535 703 967 -2047 -24 2250 -879 -1039 1425 -858 -1410 2152
1531B152j432k824K616L47k603K423J332l777O59K970k425m90L002k216j980L720
$$ 2152 720 -2104 512 859 -1744 679 2011 -1766 -1107 1863 -562 -1052 1950 -266 -2246 1474
1547A474j86l107K263P69l248K019K570l646m63L166k088r17L692j637l305L152
$$ 1474 1288 -1819 444 1213 -2035 -16 2554 -1092 -1555 1611 -477 -1394 2298 661 -2644 508
1563E08Q82k979K180J400m058P58L562k548j001L114k103k151L980K1l600K223
$$ 508 1390 -1589 591 1991 -2067 -1309 2253 -295 -1296 1818 -285 -2436 1544 1565 -2035 188
1579A88J260l342J791K727l788o72L582j771j442L477j442l349L303J381l261
$$ 188 1448 -1894 -103 2624 -1164 -1836 1746 -25 -1467 2010 568 -2781 522 1903 -1358
1594a358J530J602l796P34L852k536j629L052j581k134L858J72l860J909J695
$$ -1358 172 1774 -2022 -1288 2564 28 -1601 1451 -130 -2264 1594 1766 -2094 -185 1510
1609A510l105J341K709l581q37L756j486j859L151j073l157L212J566l525J072
$$ 1510 -1595 -254 2455 -1126 -1963 1793 307 -1552 1599 526 -2631 581 2147 -1378 -306
1624c06J876l264O18L686k489j998L007r86k020L370K22l844J718K008k795Q68
$$ -306 1570 -1694 -1076 2610 121 -1877 1130 144 -1876 1494 1716 -2128 -410 1598 -1197 -329
1640c29K495l103r77L587j133k064K669m84k848K664J528l298O28K082k519J59
$$ -329 2166 -937 -1914 1673 540 -1524 1145 661 -2187 477 2005 -1293 -665 1417 -1102 -943
1656i43L155k130k036K813l01k026K536L35l344J405K170k431K96K226k478r25
$$ -943 2212 82 -1954 859 558 -1468 1068 1403 -1941 -536 1634 -797 -501 1725 -753 -1678
1672a678L174q49k060K230j00k447K106J336k836M19K050j988j77K502j683j703
$$ -1678 1496 647 -1413 817 717 -1730 376 1712 -1124 -705 1345 -643 -820 1682 -1 -1704
1688a704K506o7j936J840M23k627J130J934k028j28J869j689q21K488n85j857
$$ -1704 802 735 -1201 639 1062 -1565 -435 1499 -529 -657 1212 -477 -1298 1190 605 -1252
1704a252J712K25j916J384J140k198K38J788j461m17J833j039j299J936O1j654
$$ -1252 460 685 -1231 153 1293 -905 -667 1121 -340 -757 1076 37 -1262 674 735 -919
1720i19J161M88j778P69J519j577l27J478j054o25J765m17j501J247L56j425Q99
$$ -919 242 730 -1048 -279 1240 -337 -664 814 -240 -865 900 483 -1018 229 585 -840 59
1737E9Q74j568Q5J360r70m34J312o29r54J315J16j247P42N01j178M57R74j040
$$ 59 933 -635 -550 810 -160 -594 718 89 -865 450 566 -681 61 562 -616 -159 815 -225
1755b25l14J051n35m94J061k06j028P67L55q78M24N74q83m3Q49n22l23P47k36
$$ -225 -539 512 -23 -517 544 338 -690 77 432 -446 -22 552 -331 -374 475 -47 -370 377 141
1774A41o38O99J21p28L84L89o71J53N53n38j90O01k54l58N57o7m99L44K89m94
$$ 141 -497 202 323 -405 -21 368 -303 -150 403 -135 -325 276 22 -336 221 154 -345 -1 288 -206
1794b06J59L50m55m7M38k40j96L80j12l13K94J01l16J87J44k66J2K75k01j07K55
$$ -206 -47 303 -152 -199 239 -1 -197 183 71 -242 52 153 -163 24 168 -98 -86 189 -12 -119 136
1815A36q9j70J73M8k15J31R8j95O1J09j59JJ19m0j04J32j3q3K6P1n6lN7o1m5P2
$$ 136 47 -123 50 98 -117 14 112 -83 -22 87 -72 -71 48 8 -96 36 23 -60 -34 37 -19 -22 35 -26 -71 1
1841AK9m3K0J8l8J5L5j2qK3m6JK3J2k8k%k9ML5j3j9K5j5lJ8j2J7ooJ4k4K1k7P
$$ 1 30 -13 7 25 -13 2 37 25 17 40 -6 -5 18 30 2 0 0 -29 -25 10 -3 -22 3 -12 -15 3 -9 8 2 -4 10 -14 7 -20 -13
1876a3J4L3l9L3lm1L0J1mJ7j9k2J5K4k2J6Jo0QP1n1k9R2p0o0R7J0j11Q4M6j46
$$ -13 1 34 -5 28 25 -16 14 25 21 38 19 -3 12 36 14 30 31 -29 -21 50 -1 -30 62 -8 -68 29 39 -72 12 58 -88
1907h8M0J27j20NJ42j50m4J80o6j64K07Kk12K05P4k99J28J97k22p2K90j84j56
$$ -88 -48 79 -41 -36 106 -44 -88 92 26 -138 69 71 -141 64 138 -161 -33 164 -58 -130 160 -24 -180
1930a80L41o4l16L07J04l69J31K93l67OL76l13j66M50j74l30M15O1n56L46L33
$$ -180 161 97 -219 88 192 -177 -46 247 -120 -114 262 -51 -217 233 59 -271 144 205 -351 -5 328
1951C28n58Q7M65m55j51O07l11l85N78j5o04N50K12p14K35N95p20j3P41n25l51
$$ 328 -230 -143 322 -133 -284 323 12 -373 205 190 -414 136 348 -366 -131 464 -256 -269 472 -53 -404
1972d04P92j84o73P06J23q53N06N34r11J38P86p46k67R78m18o85R24Kr87P19M40
$$ -404 388 204 -469 237 360 -493 13 547 -364 -226 560 -186 -453 525 107 -578 346 348 -639 80 520
1993E20j054L16Q77r61j58J085o52o22J141k12j008R63L13j207N85Q20j159M0
$$ 520 -534 -218 659 -302 -460 625 -27 -649 492 280 -728 235 548 -659 -74 746 -413 -373
2011c73J143r44n03J337m28r79J169O3j277Q58P29j407L25J131j206k71J447p46
$$ -373 770 -174 -677 660 232 -747 422 485 -792 66 795 -612 -287 844 -362 -633 814 68
2029F8q72J347j74j263J144M99j552O01J081j392j4J449j076p16J590l93j248
$$ 68 -804 543 369 -894 250 749 -803 -202 879 -513 -527 922 -154 -870 720 327 -921
2046i21J323K19j556R04J003j585J56J398j268m58J728p58j193J532rj496J210
$$ -921 402 621 -935 -31 972 -613 -457 941 -327 -785 943 185 -1008 524 515 -981 229
2063B29O90j788N32J346j431k33J668j079r72J787k59j530J404L86j748R01J233
$$ 229 919 -869 -337 1009 -422 -655 1013 -66 -1038 749 490 -1040 364 750 -998 -97 1136
2080A136j756J5J604j298n59J836p21j417J586K27j681J233Q00j937M61J588j427
$$ 1136 -620 -605 999 -299 -858 978 257 -1160 426 653 -1028 205 1005 -932 -471 1117 -310
2097c10l87J715j049j116J882j04j678J290N83j793Q45J322j785j41J704j086
$$ -310 -697 1018 -31 -1147 735 631 -1047 243 826 -967 -122 1200 -585 -726 978 -108
2113a08p85J847n94j623J602M56j724R89R32j876L04J705j333o04J694q42j147
$$ -108 -893 954 360 -1263 339 795 -929 60 992 -884 -580 1125 -208 -812 882 40 -1107
2130a107J821rj745J154P02j682O70J387j702k70J737r39q67J665m38j548J459
$$ -1107 714 705 -1040 114 816 -866 -196 1191 -511 -781 956 17 -850 815 377 -1171 288
2147B88N99j675P27R82j685K34J672j221p91J580n88j111J620R8j688R16Q58j479
$$ 288 887 -788 -61 921 -764 -530 1142 -79 -870 710 122 -989 631 729 -959 -43 815 -664
2165f64L92J310j454m27J656o71r50J406k07j405J226O48j560M90R94j356P2J498
$$ -664 -272 1038 -416 -843 813 142 -808 598 391 -1014 212 860 -700 -210 784 -572 -500 998
2183I98j001q57J461l78j053J308J59j514P70Q91j284K55J121j192m15J469m92
$$ 998 -3 -860 601 223 -830 478 637 -877 -107 784 -500 -245 876 -316 -731 738 246
2200B46r53J156q8j205J004N89j332L02R68j065n5J194p63p65J171j01r32R19
$$ 246 -707 449 361 -844 160 749 -583 -281 687 -378 -433 761 -2 -767 404 303 -629 290
2218B90K45j223N15Q52r69j5R45q28m14J184l08q37Q12J02r58O81N37j010J42
$$ 290 535 -688 -173 679 -290 -305 640 -188 -602 582 274 -563 249 351 -607 74 611 -399 -257
2237b57Q10p50j60R08n24n79Q77k7p35N68K29q58L63O58p18q5O72n19k84Q03j98
$$ -257 553 -197 -357 551 27 -552 325 298 -437 131 360 -498 -135 523 -195 -280 392 -127 -411 392 194
2258A94o56O03J08o30L94L92o98Q5N91m76j71N79k74m38O10M3n77L67K37n58K03
$$ 194 -462 141 249 -381 13 405 -293 -208 383 -93 -264 315 41 -397 213 256 -321 46 283 -275 -72
2279g2M32m50j37M55k25k28M54o9m38L34J47m03K15K43l93k0L81k80j12L20j08
$$ -72 360 -90 -227 228 3 -225 229 160 -278 56 203 -200 15 258 -135 -155 226 -54 -166 154 46
2300D6k67L05N2l28J91J58k57KK68k27p3K60j02j44K20Jk59J71R3k03Q9J22j70
$$ 46 -221 84 136 -192 -1 157 -100 -98 170 -57 -130 130 28 -116 104 105 -154 17 110 -93 -4 118 -52
2323e2l6K03j14o5J53o5j15J02N1j23M1R1j09m6J36l8n6P9qq8N4oj4PO5q5RN0
$$ -52 -88 115 1 -64 89 24 -91 11 62 -61 -20 71 -38 -84 52 14 -42 37 29 -59 -5 -11 -25 -18 47 -38 -29 21
2351B1m2jN0j3k7J3K6m3nN5J1k9Mk2j4J4K6p%jj6n0N8J5p0M9j2rJ6J3m3j1L9J
$$ 21 -21 -22 28 15 -12 1 27 -16 -21 34 45 16 20 -2 -16 -2 24 17 17 16 0 -50 8 23 -47 2 -10 -19 -3 10 -33 -44 -5 -4
2385dk9K8j8J2L2m0j1J3J6PL2l4qNLj9L4K3n3L5l2jLN7m9l9M7oq6J22j8o4J9M6
$$ -4 -33 -5 -23 -11 21 -19 -30 -17 -1 6 38 4 -4 1 4 -15 19 42 -11 24 -8 -9 -6 51 2 -37 10 4 -82 40 22 -42 -23 23
2419B3q5J2Q3n3l6J15n8p1J20k3q7Q2M1j56O2Q5j06LJ83j52q3J94n0j69K00Qk20
$$ 23 -62 -50 33 -20 -56 59 1 -70 50 27 -60 22 63 -93 -31 54 -52 -49 134 -18 -101 93 43 -126 74 82 -138
2446a38J22J37k10P3J76k02l6K31j20j89K74n7k46K51J30l72J17K25k87qL52k49
$$ -138 -16 121 -89 -16 160 -42 -78 153 33 -156 118 61 -185 66 196 -176 -59 166 -121 -129 223 -26
2468b6k33M18r0l04L27P7m06K12K75m07K9L75l35j29M90k07l15L98M4m68L61J97
$$ -26 -259 159 69 -235 92 169 -237 -25 250 -157 -128 247 -88 -217 273 66 -249 149 193 -275 86 283
2490B83n32J42M23m41p2N35l62l31N77k1n42M94R8o01L02M36o06JN52m65k12O56
$$ 283 -249 -107 316 -125 -197 338 -24 -355 222 201 -341 153 251 -350 -48 388 -218 -217 335 -130 -342 314
2512C14j81n60N59R9o35M43L54p41J31O44n82j58P40m16n15P91l6o98N45K43p60
$$ 314 133 -427 132 231 -404 39 393 -348 -217 427 -155 -313 427 11 -504 287 251 -447 98 341 -419
2533d19L53O26p58j07P37n17l29Q36k33p33P28J86q42M99M75r04J19Q26o75k66
$$ -419 -66 560 -198 -305 432 -85 -414 422 189 -544 184 370 -472 27 502 -402 -283 543 -132 -398
2553c98Q93m54o56R29K9q88O10L71r20L10Q37r18j76R28n07n34J001k02q91P95
$$ -398 495 41 -615 314 343 -545 65 436 -484 -174 663 -255 -431 497 -10 -544 457 255 -636 159
2573A59L42r76M37O67j013L4J020p12m77J006l59p73R97J12j090O71N31j047K63
$$ 159 501 -475 -38 629 -384 -350 670 -42 -519 487 128 -645 352 464 -626 45 576 -471 -208
2592b08Q67r40k38J067m90o78J052j57r85Q43M14j105M27P56j027%J091p66n38
$$ -208 659 -281 -519 548 58 -620 432 275 -710 133 547 -558 -131 625 -402 -402 689 -77 -615
2611f15J087l09q27R59K09j126N89O46j059K15R50r18l25J099m55p53J025m0j039
$$ -615 472 163 -664 295 504 -622 -33 613 -446 -231 719 -199 -524 575 120 -633 392 352 -687
2630f87P77N25j142L04Q48r57j23J093o57o18J064j66r32R06K74j119N12P41j023
$$ -687 90 615 -527 -223 625 -332 -455 638 -19 -637 427 261 -671 235 509 -610 -98 643 -380
2649c80N8R77q43l58J096l83p95R56N8j017O92N53j083K39Q45q56j99J055n79
$$ -380 -322 655 -188 -546 550 167 -628 328 386 -631 61 614 -469 -230 615 -241 -440 615 36
2668C6o47J026j38q79P60L27j012M00P17r27k2R53o62n05J051k95p69Q14J60r55
$$ 36 -611 415 277 -602 158 485 -527 -127 590 -337 -359 594 -68 -573 478 183 -586 228 388 -567
2688e67N53N58r29J39Q05p24k70R32l96o38Q38j2q13O35L63q89K75O53p52q2Q08
$$ -567 -14 544 -385 -246 559 -165 -435 497 101 -537 301 289 -524 111 474 -415 -140 513 -239 -321 487
2709D87n11m22Q05j81o83O97J62q02M05N05p56M7O89n88k47P83k83n61O77L8o89
$$ 487 -24 -446 359 178 -505 192 354 -448 -43 462 -294 -247 442 -146 -393 390 107 -454 223 261 -428
2730d28M54L47o76J45N73n63j68O79l46m07O47o6n48M66J97o16K47M47n68PN39
$$ -428 26 373 -303 -158 415 -148 -316 363 17 -390 257 191 -357 109 306 -310 -63 384 -184 -177 362
2751C62l87k83N84j34m81M72Q9n50L32K99n15P6M38l84j61M77k20l17M41Qm16
$$ 362 -25 -308 276 142 -339 133 222 -328 4 303 -212 -136 302 -82 -243 234 14 -303 138 146 -270
2772b70K99J86m22J26L39l71m9L78k37k17M27p1l36K95R1l48J71K15k97LK77k12
$$ -270 29 215 -207 -81 258 -113 -162 216 -21 -238 189 118 -218 77 168 -180 -9 206 -91 -88 189 -23
2794b3j41L07r6k16K75K7k98J67J37k26J6K13k06p0K39r5j51K00K3j98J23R3k03
$$ -23 -164 143 47 -169 106 133 -165 2 139 -87 -71 142 -64 -134 105 10 -141 59 82 -116 7 100 -103
2817a03P1J41j92j6J85j15n7J42%j35J03M5j23M2R2j08j7J31j04k4J03j4j26J32
$$ -103 -32 109 -83 -99 86 -29 -86 56 56 -79 24 69 -54 -12 80 -28 -45 86 -18 -42 61 47 -79 53
2841E3Pj32O4N7o9nO8p6qO3ro4O4J4q4N0K5o7M7L8o2nM9m1j0L2K7m4K6Pj8nL1
$$ 53 60 -72 -8 49 -20 -25 43 -33 -41 22 13 -51 13 27 -57 -7 18 -49 -2 36 -26 -31 18 -23 -33 -1 26 -18 8 15 -3 -8 23
2874B3j9k6J4K5k3K8Ll4J6J7l9KK5j6oJ4Rk7J8J4k3onqj3K8J9j7LLkQJN%%K2m7
$$ 23 4 -22 -8 17 -6 22 25 -9 7 24 -15 -13 12 -4 -10 4 13 -14 4 18 -5 -11 -16 -24 -37 -9 10 -7 -4 -1 -3 5 6 11 11 11 33 -14
2912a4K1l3K8K2k6kN6l7o2O6j8j7M6ql3K2Ql4kO7n5kL4j4o0Q1k9n4P3J1r3M7Q1
$$ -14 7 -26 2 24 -2 -4 52 15 -47 19 1 -16 30 22 -11 11 19 -15 -17 50 -5 -7 27 13 -47 34 5 -49 24 35 -58 -11 70
2945G0j21K9O9q9k7J11l9o9P9Rq5R4M0j41M5J19j32j1J65r8j09J70n6j24J49N6
$$ 70 -51 -22 47 -42 -69 42 3 -66 13 22 -63 31 71 -70 -25 94 -38 -49 116 18 -91 79 23 -101 48 104
2971A04k31J39J11k22K8K04j74o2K06r2j67K23j4k01J83Q2k70Q5K15k37j1K62
$$ 104 -127 12 123 -99 -71 133 -41 -103 103 11 -156 67 53 -148 35 117 -153 -68 147 -90 -101 161
2993A61j63j60K65k7k43K59N9l29J65J87k86J9L04k54j21L53j19k53K87O2l53
$$ 161 -2 -162 103 76 -167 92 151 -178 -13 174 -112 -93 211 -43 -164 189 70 -183 104 166 -187
3014a87K22J48l72P9L27k89j02M04k15k87M03Ql99L10J48m62K06L25l92k8M14
$$ -187 35 183 -189 -110 217 -72 -174 230 15 -272 131 139 -260 50 198 -264 -58 267 -125 -153 261
3035B61k92k28N01r5m13M14N5m45K37L12m94K3M90m11j30N06k54l46M97K7n03
$$ 261 -31 -259 242 147 -266 148 203 -242 -5 307 -187 -164 326 -85 -215 291 37 -309 188 215 -288
3056b88L41J92n56K12M34m78j03N01k90k90O13j05n52M27J85n70L16L67o15L4
$$ -288 53 245 -311 -99 335 -143 -246 255 -35 -325 288 183 -369 58 243 -327 -11 356 -259 -225
3076b25N64m20j99N90k22m96O21O1o24L56L26o35J76N46n30j88O09k87l98O61
$$ -225 339 -81 -280 310 88 -408 213 274 -350 6 332 -303 -127 419 -111 -299 310 23 -375 286
3096B86p3o27M70K77o56K63M66o57l6P19m55l17O26k05n44O44J50p34L66L73o34
$$ 286 213 -414 56 333 -323 -60 406 -251 -287 432 -23 -340 286 81 -463 181 331 -403 -37 336 -298
3117b98J60N92n69k03O48k56m45O58l8p04N12L30o56J54N24o75l2P04l76l94O47
$$ -298 -138 454 -115 -318 330 74 -371 287 249 -455 57 387 -269 -115 409 -266 -298 406 30 -364 283
3138B83j39o00O50J59p30L02M88o62K3O61n56k98P28k15m79N97K2o84M60L94o73
$$ 283 144 -456 194 353 -377 -75 413 -249 -226 435 -121 -419 309 94 -385 212 234 -450 10 404 -269
3159b69J18N35n93j27P39l45m59O40n2n81N19K36p18K53N19o10k0O27m83l05O73
$$ -269 -151 384 -209 -336 403 58 -401 239 187 -394 125 361 -357 -104 415 -195 -215 412 -71 -376 297
3180B97j26n31N37Q1o41L87M05o47L8N39m97j40O55l04m44N52Rn31M26K34o28
$$ 297 171 -360 177 258 -383 4 409 -238 -200 339 -158 -298 357 53 -391 161 170 -361 65 299 -329
3201c29J92M86m92q8N79l68l14N82o6n16M53J35n55K90L64n13k2N00l91j80N48
$$ -329 -137 349 -143 -231 348 -20 -334 248 182 -334 119 254 -301 -11 353 -160 -182 318 -73 -253 295
3222B95j85m35M69P9n16L29K57n16Q0M50l91j22M47k41l15M74j3m38L11J82m33
$$ 295 110 -325 144 223 -293 36 293 -223 -143 307 -84 -206 241 0 -315 159 146 -292 19 201 -232
3243b32J64L06l73o3M53k73k02M06j04l47L59R0l91J98K50m18M0L80k71j46L45
$$ -232 -68 238 -135 -198 255 -18 -220 186 82 -265 94 184 -207 -9 241 -177 -137 243 -28 -174 171
3264A71j23k53L45J4l55K25J58l27P8K68k87q4L16j65j60K78l4k79K43J06k82
$$ 171 48 -205 140 154 -201 24 182 -145 -67 201 -86 -170 146 -19 -179 99 65 -214 29 135 -147
3285a47R3K08k53J0K31j61j33K46n1k03K31K4k21J52J22k32pK39j78p8K47j00
$$ -147 -54 154 -99 -89 142 -19 -152 94 43 -160 71 95 -126 26 148 -84 -91 148 -30 -108 139 39
3307C9j43J70K2j91J22P0k09P8J53j55k5J59j07q3J40kj38R6P3j42J7J26j35J0
$$ 39 -104 66 88 -103 19 89 -120 -42 111 -44 -69 90 -17 -100 40 38 -100 -4 69 -73 -56 70 -65 -55
3331e5J21q8p2J37k7o8P0L3j06P0L5j02L6P8p4k3Q7l0n5O1L0r1M2M3p9J6J9j5
$$ -55 66 -22 -94 43 16 -52 18 51 -55 15 50 -52 -16 62 -12 -35 52 22 -33 28 58 -33 9 52 -27 -11 8 -7
3359gk1N2l9m3N2Qm7L0L2p0K4L1j6mL4m6OJ5moJ7lnQL5l9MRK5n6K8J2m3K1J1j3
$$ -7 -28 24 -15 -58 -6 2 -45 -15 17 -53 -29 2 -14 -18 16 -30 -24 -9 -13 -19 -2 -5 -10 -2 33 -6 -2 7 32 -24 4 16 -27 -6 5 -8
3395hj7O2l9%JJ2k7Nj7ROJ6rj2Rmk1L9m8LK9K9m1K1k0K4J8j9lJ3pl2M7Oqj6J1
$$ -8 -25 37 -2 -2 -1 11 -16 -11 -28 -19 -13 3 -6 -18 -9 -13 -34 5 -43 -40 -11 18 -23 -2 -22 2 20 1 -2 11 4 -28 19 25 17 1 12
3432A2mJpMj0K8J1o4L9j8jpK8j4k2N4k6n3J9M2q2P0M2q5L6K3l2oJ6J5o2O9Kp0
$$ 12 8 9 2 6 -4 24 35 -29 10 -8 -9 -16 12 -2 -24 30 4 -49 -30 12 -70 0 42 -43 -7 16 -16 -22 -6 9 -53 16 18 -52
3466e2M9K9m6L2L5n4j7J12j07lR8o4o4Q7Pj15Q7K9q9%R1p0n9J53j00o9J56o2j06
$$ -52 -3 26 -20 12 47 -7 -24 88 -19 -22 76 12 -52 35 42 -73 14 43 -46 -46 45 -25 -84 69 -31 -100 56 -6 -112
3495a12J48L0j53M9J17j39pJ53j14q2J54j1j42J57J9j72J13J05k10O6J71j77p1
$$ -112 36 66 -87 -38 79 -60 -67 86 -28 -110 44 33 -109 48 67 -105 8 113 -97 -31 140 -37 -108
3518a08K11j08j32K12mk16J92M0k10J05J38k39NK61j65j35K68p4j96K24Lk46J38
$$ -108 103 -5 -137 75 71 -145 47 87 -123 -18 120 -119 -114 147 -18 -153 115 41 -155 69 72 -174 -36
3541c6J79k84M2K51k10j04L24j45j81K76k0k72K29J30l58J28K63k97m7L02j78
$$ -36 143 -141 -99 152 -58 -162 162 17 -164 112 92 -180 49 179 -179 -51 212 -85 -132 170 -8
3562hj45K97o7k98K82J20l49J39K03l32K1L52k77j48L80j45k73L71Pl50K39J75
$$ -8 -153 144 77 -221 61 181 -168 -29 174 -158 -137 215 -62 -210 170 25 -248 123 130 -220 19 194
3584A94l94J20K99l08q2L73k07k27L88n1l60L07J51m01J59K48l32k1L86k65j78
$$ 194 -200 -80 219 -89 -171 202 -5 -232 156 105 -255 52 203 -198 -39 209 -123 -144 242 -23 -201
3605b01M33j68l07L81N4m07J76K73m34R0L87l66j38M20j90k66M34o0l95L01J80
$$ -201 232 64 -243 138 192 -215 -39 234 -200 -110 277 -89 -227 193 3 -263 171 111 -284 17 197
3626A97m21J47L34m11m5M37k70k27M36j05l59L81J14m48K33K34l92M4M12l62j74
$$ 197 -224 -77 257 -154 -199 238 -32 -259 177 72 -287 94 208 -240 -7 227 -165 -121 291 -71 -245
3647b45N12k07k96L96Rm26K99K09m47J21L54m08o6M38k51k54M41r0l77L53J42
$$ -245 267 60 -236 160 169 -257 42 251 -196 -75 279 -129 -195 243 -8 -262 179 89 -288 65 207
3668B07m45J83L08m34L1L95k97j72M41j25l33L63L1m11K71K37l99N9L47l44q9
$$ 207 -238 -55 253 -181 -150 245 -52 -224 217 92 -241 122 153 -258 13 250 -149 -90 257 -87 -176
3689a76M32k35k80M28n5l53L25J41m39J57L05l67k5L53k92j52M06q6l43L75L2
$$ -176 256 21 -259 169 114 -239 86 227 -212 -55 250 -117 -142 211 -81 -233 173 87 -256 119 151
3710A51l89K04K59l99L0L41k84j00L81j31k77L15K3l45K48J81l95R8L10k91o0
$$ 151 -238 -34 225 -174 -144 197 -87 -187 194 63 -214 101 124 -221 27 208 -187 -89 221 -70 -130
3731a30L32k26j44L14m2l03K49J08l65J63K54l12k5L23k35j25L18j27k51K93M8
$$ -130 202 -24 -168 146 104 -199 50 158 -207 -44 210 -102 -127 196 -39 -164 154 27 -224 69 117
3752A17k99J78J53k95P0K59k74q3L23j81j42K92n3k46K19J01k70J11K11k77l4
$$ 117 -182 -4 149 -146 -76 183 -91 -174 149 -32 -174 118 65 -181 38 139 -131 -20 191 -86 -120
3773a20K76j79j11K74q8k01K22N9k84J30J58k62P4J65j63o5K14r3j22J73K0k10
$$ -120 156 -23 -134 140 52 -149 73 132 -152 -22 136 -126 -52 113 -50 -115 99 6 -116 57 77 -133
3795a33J36R2k13Q8J47j64l4J70r9j11J74mj50J37P6j89P4R4j57LJ67j26m6J51
$$ -133 3 95 -118 -30 117 -47 -81 89 -10 -121 53 49 -101 36 112 -77 -3 91 -66 -63 104 -22 -68 83
$$ [...]
8191G5
##END NTUPLES=NMR FID
##END=
