##TITLE=1H_Pr Et-R
 200.13MHz, CDCl3,
 8 sc
 
 26.5.2025
##JCAMPDX= 6.0         $$ Bruker NMR JCAMP-DX V2.0
##DATA TYPE= NMR FID
##DATA CLASS= NTUPLES
##ORIGIN= UXNMR, Bruker Analytische Messtechnik GmbH
##OWNER= pz
$$ XWIN-NMR		Version 3.5
$$ Mon May 26 16:22:10 2025 Russian Standard Time (UT+4h)  she@DPX200
##.OBSERVE FREQUENCY= 200.1313
##.OBSERVE NUCLEUS= ^1H
##.DELAY= (6, 6)
##.ACQUISITION MODE= SIMULTANEOUS
##.ACQUISITION SCHEME= undefined
##.AVERAGES= 8
##.DIGITISER RES= 18
##SPECTROMETER/DATA SYSTEM= spect
##.PULSE SEQUENCE= zg30
##.SOLVENT NAME= CDCl3
##.SHIFT REFERENCE= (INTERNAL, CDCl3, 0, 14.3821)
##AUDIT TRAIL= $$ (NUMBER, WHEN, WHO, WHERE, WHAT)
$$ ##TITLE= Audit trail, XWIN-NMR		Version 3.5
$$ ##JCAMPDX= 5.01
$$ ##ORIGIN= Bruker BioSpin GmbH
$$ ##OWNER= she
$$ F:/spectra/data/she/nmr/H-C/1/audita.txt
$$ ##AUDIT TRAIL=  $$ (NUMBER, WHEN, WHO, WHERE, WHAT)
(   1,<2025-05-26 16:20:31.70 +0400>,<she>,<DPX200>,
      <created by zg, POWCHK disabled, PULCHK disabled
       configuration hash MD5:
       00 E9 B6 7A A2 85 ED C7 34 08 36 98 17 FE 4E 26
       data hash MD5: 16K
       0B 3F F9 15 E3 49 73 7C 00 A1 50 1B A8 85 1D 9F>)
$$ ##END=
$$ 
$$ hash MD5
$$ C4 7F 90 17 48 D4 04 E0 86 38 04 8B 6A 94 22 A3
##$RELAX= 
##$RELAX= 
##$RELAX= 
##$RELAX= 
##$RELAX= 
##$RELAX= 
$$ Bruker specific parameters
$$ --------------------------
##$DU= <F:/spectra>
##$EXPNO= 1
##$NAME= <H-C>
##$PROCNO= 1
##$TYPE= <nmr>
##$USER= <she>
##$AMP= (0..31)
100 100 100 100 100 100 100 100 100 100 100 100 100 100 100 100 100 100 
100 100 100 100 100 100 100 100 100 100 100 100 100 100 
##$AQSEQ= 0
##$AQ_mod= 1
##$AUNM= <au_zg>
##$AUTOPOS= <>
##$BF1= 200.13
##$BF2= 200.13
##$BF3= 200.13
##$BF4= 200.13
##$BF5= 200.13
##$BF6= 200.13
##$BF7= 200.13
##$BF8= 200.13
##$BYTORDA= 1
##$CFDGTYP= 0
##$CFRGTYP= 5
##$CHEMSTR= <none>
##$CNST= (0..31)
1 1 145 1 1 1 1 1 1 1 1 1 1 1 1 1 1 1 1 1 1 1 1 1 1 1 1 1 1 1 1 1 
##$CPDPRG= <>
##$CPDPRG1= <>
##$CPDPRG2= <>
##$CPDPRG3= <>
##$CPDPRG4= <mlev>
##$CPDPRG5= <mlev>
##$CPDPRG6= <mlev>
##$CPDPRG7= <mlev>
##$CPDPRG8= <mlev>
##$CPDPRGB= <>
##$CPDPRGT= <>
##$D= (0..31)
0 0.7 0 0 0 0 0 0 0 0 0 0.03 0 0 0 0 0 0 0 0 0 0 0 0 0 0 0 0 0 0 0 0 
##$DATE= 1748262031
##$DBL= (0..7)
120 120 120 120 120 120 120 120 
##$DBP= (0..7)
150 150 150 150 150 150 150 150 
##$DBP07= 0
##$DBPNAM0= <>
##$DBPNAM1= <>
##$DBPNAM2= <>
##$DBPNAM3= <>
##$DBPNAM4= <>
##$DBPNAM5= <>
##$DBPNAM6= <>
##$DBPNAM7= <>
##$DBPOAL= (0..7)
0.5 0.5 0.5 0.5 0.5 0.5 0.5 0.5 
##$DBPOFFS= (0..7)
0 0 0 0 0 0 0 0 
##$DE= 6
##$DECBNUC= <off>
##$DECIM= 32
##$DECNUC= <off>
##$DECSTAT= 4
##$DIGMOD= 1
##$DIGTYP= 9
##$DL= (0..7)
0 120 120 120 120 120 120 120 
##$DP= (0..7)
150 150 150 150 150 150 150 150 
##$DP07= 0
##$DPNAME0= <>
##$DPNAME1= <>
##$DPNAME2= <>
##$DPNAME3= <>
##$DPNAME4= <>
##$DPNAME5= <>
##$DPNAME6= <>
##$DPNAME7= <>
##$DPOAL= (0..7)
0.5 0.5 0.5 0.5 0.5 0.5 0.5 0.5 
##$DPOFFS= (0..7)
0 0 0 0 0 0 0 0 
##$DQDMODE= 0
##$DR= 18
##$DS= 0
##$DSLIST= <SSSSSSSSSSSSSSS>
$$ [...]
##$SUBNAM0= <"">
##$SUBNAM1= <"">
##$SUBNAM2= <"">
##$SUBNAM3= <"">
##$SUBNAM4= <"">
##$SUBNAM5= <"">
##$SUBNAM6= <"">
##$SUBNAM7= <"">
##$SUBNAM8= <"">
##$SUBNAM9= <"">
##$SW= 18.0517328524113
##$SWIBOX= (0..15)
0 0 2 0 0 0 0 0 0 0 0 0 0 0 0 0 
##$SW_h= 3612.71676300578
##$TD= 16384
##$TD0= 1
##$TE= 0
##$TE2= 300
##$TE3= 300
##$TEG= 300
##$TL= (0..7)
0 120 120 120 120 120 120 120 
##$TP= (0..7)
150 150 150 150 150 150 150 150 
##$TP07= 0
##$TPNAME0= <>
##$TPNAME1= <>
##$TPNAME2= <>
##$TPNAME3= <>
##$TPNAME4= <>
##$TPNAME5= <>
##$TPNAME6= <>
##$TPNAME7= <>
##$TPOAL= (0..7)
0.5 0.5 0.5 0.5 0.5 0.5 0.5 0.5 
##$TPOFFS= (0..7)
0 0 0 0 0 0 0 0 
##$TUNHIN= 0
##$TUNHOUT= 0
##$TUNXOUT= 0
##$USERA1= <user>
##$USERA2= <user>
##$USERA3= <user>
##$USERA4= <user>
##$USERA5= <user>
##$V9= 5
##$VALIST= <valist>
##$VCLIST= <CCCCCCCCCCCCCCC>
##$VD= 0
##$VDLIST= <DDDDDDDDDDDDDDD>
##$VPLIST= <PPPPPPPPPPPPPPP>
##$VTLIST= <TTTTTTTTTTTTTTT>
##$WBST= 1024
##$WBSW= 4
##$XGAIN= (0..3)
0 0 0 0 
##$XL= 0
##$YL= 0
##$YMAX_a= 357627
##$YMIN_a= -415187
##$ZGOPTNS= <>
##$ZL1= 120
##$ZL2= 120
##$ZL3= 120
##$ZL4= 120
##$ABSF1= 10
##$ABSF2= 0
##$ABSG= 5
##$ABSL= 3
##$ALPHA= 0
##$AQORDER= 0
##$ASSFAC= 0
##$ASSFACI= 0
##$ASSFACX= 0
##$ASSWID= 0
##$AUNMP= <proc_1d>
##$AZFE= 0.1
##$AZFW= 0.1
##$BCFW= 1
##$BC_mod= 2
##$BYTORDP= 1
##$COROFFS= 0
##$CY= -3
##$DATMOD= 1
##$DC= 2
##$DFILT= <>
##$DTYPP= 0
##$F1P= 0
##$F2P= 0
##$FCOR= 0.5
##$FTSIZE= 0
##$FT_mod= 4
##$GAMMA= 1
##$GB= 0.15
##$INTBC= 1
##$INTSCL= 1
##$ISEN= 128
##$LB= 0.25
##$LEV0= 0
##$LPBIN= 0
##$MAXI= 10000
##$MC2= 0
##$MEAN= 0
##$ME_mod= 0
##$MI= 1.114404
##$NCOEF= 0
##$NC_proc= 0
##$NLEV= 6
##$NOISF1= 3.799351
##$NOISF2= 2.8
##$NSP= 1
##$NTH_PI= 0
##$NZP= 0
##$OFFSET= 14.38212
##$PC= 1
##$PHC0= -1666.43
##$PHC1= 176.5922
##$PH_mod= 1
##$PKNL= yes
##$PPARMOD= 0
##$PSCAL= 0
##$PSIGN= 0
##$REVERSE= no
##$SF= 200.129724274929
##$SI= 16384
##$SIGF1= 3
##$SIGF2= 2
##$SINO= 400
##$SIOLD= 16384
##$SREGLST= <1H.CDCl3>
##$SSB= 0
##$STSI= 0
##$STSR= 0
##$SW_p= 3205.1282051282
##$SYMM= 0
##$S_DEV= 0
##$TDeff= 0
##$TDoff= 0
##$TI= <>
##$TILT= no
##$TM1= 0
##$TM2= 0
##$TOPLEV= 0
##$USERP1= <user>
##$USERP2= <user>
##$USERP3= <user>
##$USERP4= <user>
##$USERP5= <user>
##$WDW= 1
##$XDIM= 8192
##$YMAX_p= 0
##$YMIN_p= 0
$$ End of Bruker specific parameters
$$ ---------------------------------
##NTUPLES= NMR FID
##VAR_NAME=  TIME,          FID/REAL,        FID/IMAG
##SYMBOL=    X,             R,               I
##VAR_TYPE=  INDEPENDENT,   DEPENDENT,       DEPENDENT
##VAR_FORM=  AFFN,          ASDF,            ASDF
##VAR_DIM=   8192,          8192,            8192
##UNITS=     SECONDS,       ARBITRARY UNITS, ARBITRARY UNITS
##FACTOR=    0.0002768,     1,               1
##FIRST=     0,             0,               0
##LAST=      2.2672688,     0,               0
##MIN=       0,             -415187,         0
##MAX=       2.2672688,     357627,          0
$$ Real data points
##PAGE= N=1
##DATA TABLE= (X++(R..R)), XYDATA
0@%%%%%%%%%%%%%%%qJ6j6J6j6J7k5L2l3M1m9N7o5P3q5R7j10J23j41J60j78J99
37A05k23K50k79L09l42L77m15M60n09N62o21O84p50Q26r12J006j111J230j364
56g17J515j693J903k151K454k834L322l972M886o264Q561j3065K5003j14801l17334
71d15187K62207L78871j1117k55657r5908R5207Q1097p387n57k1463n9699O6Q3023
84C3496L2554p2856o6137N5824Q1984k9502p6781J579M9014J9385j6855j7569
96e864o962j688J6359K5559j5213l6863M988L3081L691k2314o221J3768K016p407
110c070N976K986j2847k378J4975N777j2541r083R256R257p013o403M650L040
124B582m173O54M039l029n190N922O522q839p651Q516J0104n951j0531K879Q406
$$ plain form
0 0 0 0 0 0 0 0 0 0 0 0 0 0 0 0 0 -8 8 -8 8 -8 9 -16 16 -17 24 -25 32 -33 40 -45 52 -58 65 -76 84 -94 105
37 105 -118 132 -147 162 -180 197 -218 242 -267 295 -326 358 -392 434 -478 528 -583 647 -717
56 -717 798 -895 1008 -1143 1311 -1523 1799 -2173 2713 -3551 5010 -8055 16948 -97853 -415187
71 -415187 -152980 225891 214774 -40883 -136791 -41584 39513 32126 31569 10106 -49593 -49527 33496
84 33496 66050 -6806 -72943 -17119 64865 35363 -41418 -39839 9175 28560 11705 -5864
96 -5864 -12826 -14514 1845 27404 12191 -24672 -19684 13397 17088 -5226 -11447 2321 4337 -3070
110 -3070 2906 5892 -6955 -9333 5642 11419 -1122 -10205 -949 8308 1295 -5108 -458 2582
124 2582 -1591 -937 3102 73 -5117 805 7327 -1512 -9163 -647 9457 3506 -7025 -4146 4260
139D260j812m247J312P20k394K011M545k897o938K051Q853j177q984l80P507K184
155D614m983j738K086l24j093L410J171n642j478O244K743o574k630N401J901
170C108n006p20N226J86n737L7N832O28o386j113N665R35m053N72K903j959l434
187c316L701M331m335o246L944P404k041p742N52O436Q14m140j791J595J217N09
203H92R93j690k917J027M763k87m591k030M360K693k438k980J038K295k29n65
219C34n61j107N82K214K62k682j714L318K296k920k086J251K227m35j395n8N50
236G6j87L10K93j119n36Q87J960j102k377O56K389n65k135Q38J096M8q01J05J118
255I54r95j224J859P08j814o41J443N85r29q20P94O41j341K68J111m66k21m65
$$ plain form
139 4260 2448 -1799 -487 233 -2161 -150 4395 1498 -5440 -3389 5464 4287 -4697 -5077 2430 4614
155 4614 -369 -2107 -21 -345 -1438 1972 3143 -2499 -3977 2267 5010 -1564 -4194 1207 3108
170 3108 -1898 -2618 2608 2794 -2943 -2906 2926 3554 -2832 -3945 1720 2655 -1398 -826 2077 118 -3316
187 -3316 385 4716 381 -5865 -1921 5483 3442 -4300 -3748 2688 3502 -638 -2429 -834 383 892
203 892 1885 195 -2722 -1695 3068 2781 -1810 -3840 520 3213 775 -2205 -1167 1128 899 334
219 334 -227 -1334 -752 1462 1724 -958 -2672 646 2942 22 -2064 -813 1414 979 -416 -474 76
236 76 -111 199 492 -627 -1163 -276 1684 582 -1795 -1139 1250 685 -1450 -612 484 532 -269 -164 954
255 954 -41 -1265 594 1302 -512 -1153 290 875 -54 -874 -80 561 -780 -512 599 133 -88 -553
273e53J311M47j690o44J581L97j537Q6M38N21n73k15P79k41p28P81L41o67m19
292e85L56Q89l15j042J91Q76n4n93P2qL99q7M2j16m50J34R64n66m69j7P73K2r37
315e21K17N42ll33K58j66J00k17J69K03p03J67N43k08l44l4L70M21k22n96L91
336C4K42l13j14J64M6o5K84j50r5m13L21L51n02j44M40K05k92l92K52Q6R7q5J54
359A11q2k32K99J69j14l32M4P48n84l17M5L40%k15n6j8L12M4k9J16l56j59L65
382I9M13k38l73j02M28j52n4k37l3QL74L27o03J05m81N22K85j67l82L88K3Q0k50
405b0m79M24J22Q2J71k33o49P35M54p22J08j47J36L55k33l79L5N46o6r8l34KO5
428a25O41k70o70J16L85L00m04m00J21N17L84o06j50j08j71O03n3j95l88J72O89
$$ plain form
273 -553 758 1205 -485 -1129 452 849 -688 -602 -164 357 -216 -431 348 107 -621 160 501 -166 -585
292 -585 -229 660 345 -697 -506 370 316 -277 -205 -213 186 99 141 25 -425 -291 673 107 -362 -379 394 416 -521
315 -521 -304 238 235 -98 160 -6 94 -123 46 249 -454 -287 256 48 -296 -330 40 461 239 -357 34
336 34 276 -37 -151 13 59 -6 278 128 33 -380 -59 292 -210 -354 86 291 -1 -393 -141 -55 42 -43 111
359 111 29 -203 96 265 151 -181 -137 611 27 -290 -245 95 95 -120 -176 -194 118 162 133 249 -107 -266 99
382 99 512 274 -99 -201 227 75 21 -216 -249 -241 133 460 -143 -38 -519 3 288 121 -261 127 150 230 -20
405 -20 -499 -75 47 129 300 67 -582 153 607 -115 -7 -154 -18 337 104 -275 -240 306 240 142 -192 -190 -125
428 -125 516 246 -424 -308 77 377 -27 -427 -306 211 595 -11 -161 -269 -440 163 110 -85 -473 -301 388
449C88K89o42n71N4Q08M18p78n03J48P01j45k15p9j95M79R5J08n21l43J69M15
470H0L23k80o37N5P53K31q21m1L23O10k88m50k15L70q3J23J29m39Q7l0O63o8m92
493i7m37L06O51M1p22j45O83K50p68J44J9K84j07P5k6k26l2M30J04l69m63J36
515b69M69N8m27m63O02M29n0l55l13M97k7n8kk76J13k1L37k19K6n11J87N11K76
538E14o67j19O09J84K7j012P1O46k34K36l93R3oj90N73J25o08n4J03O55l53n01
560c01M2M49K04n94j30K7O20R8k64m10j8J11L12J08m28J93j16N31rn23l50L04
582a44M37M57q91l06M93L33j79m52j71M60K18j83O6k83L20l00K49k1j02n50M81
603f8O20m73l15k16K34K75K33m10P5K11l54n0J46J39p9nJ89r4l10M96N6j08j15
$$ plain form
449 388 677 35 -536 -482 326 744 -34 -537 -389 312 167 -48 -127 -322 157 252 360 -161 -504 -335 80
470 80 403 123 -514 -459 294 525 -296 -337 -14 596 308 -142 -357 13 -70 53 182 -257 -170 -200 463 395 -97
493 -97 -534 -228 423 464 -258 -403 280 530 -238 -94 -75 209 102 177 151 -75 -107 323 427 58 -405 -269
515 -269 200 258 -169 -632 -30 399 349 -6 -319 178 151 93 91 -185 -72 -93 244 25 51 -460 -273 238 514
538 514 -153 -272 337 521 548 -464 -393 253 19 255 -138 -45 -51 -241 332 457 -151 -205 -102 553 200 -301
560 -301 -259 190 394 -200 -330 -303 317 415 151 -259 -277 -166 146 254 -174 19 -97 434 425 -98 -448 -144
582 -144 293 750 -141 -447 46 379 200 -252 -423 37 255 72 138 -145 175 -125 124 103 1 -549 -68
603 -68 552 79 -236 -452 -218 57 290 -120 -45 166 -188 -238 -92 47 -32 -37 152 58 -252 244 300 192 77
626G7j24l1L48o3k15l09O3N49j53k9J17k46j45J2L41m53K2R9K53J1j54k21K11
649d0M02l11k46L0J53P3j42M4J1j93L95o5J45l34K21Kj5k14k36K7M48Q8j95k49
673b01J93J50k5k14J25j28J8L04q9m19J10K43j44K59l22j13J92k0J01J57k32K46
695A91j62Rj2j0q7K95n0l46J97j09Q4k8M7K6j4j70J61j42L42k73l7K16k46kM4
720g6K84j32r9k3j35N6L29J5m23O2J31O6q6j10O2K20j82KR1J6r9O5J34J04l01
745b9K64j72L7L5j34n1o4L30l46r8N4o0J47J31m3p4J70k39J3J76r0m9R0o7l4L23
771B20o6k08J06j75J40kk36K67L5l27Q07m74j05k7k23M18r4o8R4J78j23j17N1
794G1j3j68K84l84J27M1k46K90Q8m0j36L98l93N1k87L60NO1k7K2J87k66J96j28
$$ plain form
626 77 -47 -78 270 207 -8 -317 -254 295 142 113 230 -16 -161 -149 192 -261 -239 -140 113 124 -30 -251 -40
649 -40 362 51 -195 -165 -12 61 -81 -37 -26 -219 176 111 256 -78 143 145 130 -84 -320 -293 155 243 48 -201
673 -201 -8 142 117 -97 28 -100 -82 222 133 -286 -176 67 -77 182 -140 -253 -61 -81 20 177 -55 191
695 191 29 38 26 16 -71 224 174 -172 25 -84 0 -28 19 45 31 -139 22 -120 222 -51 -88 128 -118 -120 -76
720 -76 208 76 -23 -46 -181 -125 204 219 -204 -142 -11 55 -31 -141 -79 141 -41 -39 52 68 -31 34 168 272 -29
745 -29 235 63 100 135 1 -50 -114 216 -130 -228 -174 -234 -87 44 1 -73 97 -142 -129 47 -43 -92 -2 -69 -103 220
771 220 154 -54 52 -123 17 15 -221 46 81 -246 561 87 -18 -45 -268 150 56 -12 82 260 137 20 71
794 71 58 -110 174 -210 -83 -42 -288 2 90 50 -86 312 -81 -30 -317 43 48 109 82 104 291 25 221 93
818I3q6J98n01J50J46m1K37k03p3J47j55J88N7j16k25L38r2p2K2N9j77K58l11
841a59L22N5l83K16l4rk20R4O7j71J91J32l1j01J98k03m7Q7Q7j94L04r0j03j20
865a12k81N45j15k9n7K4K49j17j08K84l10j35J09K29j05n5qk3P2p3J25q1J37k53
889h8m1J94j19LO6K0J73k87K4l5J85k50J44K6kJ18L4k63j6K08j27J78q1l70K65
914d1j60L99k27J7J07r9O6J20k7J57m06R4j61K29k33j16K91n0J20K41j69pO2j72
938C5K8k93K42k44J79p3L18k92L6J17K25n13L30l1N4m9M7k02J50N0j22%j23J67
962C6j81k5J14J59o9J2K4j1l04K01n3J69l12J85K36J3k06j43j9P5J30P9K0J71
986C01m99K88N1k21K63%l15P2K66l54J28J13k02M5J86j97L5j07J13J43j74J93
$$ plain form
818 93 7 205 -296 -146 0 -41 196 -7 -80 67 -88 100 157 41 -184 154 62 -10 12 71 -106 152 -159
841 -159 163 218 -165 51 17 8 -212 -118 -51 -222 -31 101 70 -31 167 -36 -83 4 91 -103 201 111 8 -112
865 -112 -393 152 37 8 -49 -25 224 107 -1 283 -27 -162 -53 176 71 16 8 -15 57 -16 109 28 165 -88
889 -88 -129 65 -54 -51 15 35 208 -79 -55 -90 95 -155 -11 15 13 131 165 -98 -114 94 -33 145 64 -306 -41
914 -41 -201 198 -29 -12 95 -4 62 182 155 312 -94 0 -161 68 -165 -281 10 -40 80 321 152 145 207 35
938 35 63 -230 12 -232 -53 -126 192 -100 -64 53 278 -235 95 64 118 69 116 -86 64 114 -8 -8 -131 36
962 36 -145 -170 -56 103 34 46 70 59 -245 -44 -97 72 -240 -55 181 194 -12 -155 -174 -99 31 110 130 301
986 301 -198 90 141 -80 183 183 -132 -60 206 -148 -20 93 -109 -64 122 -75 -40 -147 -34 109 -65 128
1008A28p2j53N2J95Q6k2k92N4n2j13K22N1j87J60M5j3M9j26J52o8l4J15j20l85
1032c28J98J91pJ74j63k77K53J88j42k21K26K30n14L38j38J29j04J83l05J5R7
1053B3j09J08j77L73j96j0J41j44j30J84L8P4l02M03k56o2K47k63J1K89k59r0
1075a07J00L04q7k09o4K55k95Q4K04j16k81M13l47Q9J72j53P0J29j25j81L18k28
1097e5n3n4L34l38J9j06J50J51l20J96J05j92L56P4k47l3j8N2j66P9j01J50j47
1120a64K73m0p6J02j92K61l87L05j70Q4L43m68n4J84j63J26K70k30R6n8j94J11
1142d1r7K19L4J24n22J97J85j81J0J15o7N9J38r0R4j16k57M17k78J02N5k21J84
1165F3p2r7N8L6p4J8j11j03M51K8l57K62j7j13k16L2J69K19l61m4M00o1k28J28
$$ plain form
1008 128 56 -97 -45 150 236 214 -78 -24 -76 -189 33 84 -103 57 102 89 138 12 164 96 62 177 57 -328
1032 -328 -130 61 54 228 65 -212 41 229 87 -134 92 322 -192 146 8 137 33 216 -89 -74 23
1053 23 -86 22 -155 218 22 12 153 9 -121 63 101 175 -127 276 20 -42 205 -58 -47 242 -17 -107
1075 -107 -7 297 210 1 -63 192 -103 -19 185 69 -212 201 -146 -57 115 -38 32 161 36 -145 173 -55
1097 -55 -108 -162 172 -166 -147 -253 -103 48 -272 -76 29 -163 193 267 20 -13 -31 21 -145 -66 -167 -17 -164
1120 -164 109 69 -7 95 -97 164 -223 82 -88 -4 339 -129 -183 1 -162 -36 234 4 100 42 -152 -41
1142 -41 -138 81 115 239 -283 -86 99 -82 -72 43 -24 35 173 83 177 61 -196 221 -57 45 100 -121 63
1165 63 -9 -106 -48 -12 -86 -68 -179 -282 169 197 -160 102 85 -28 -244 -212 -43 176 -185 -229 171 110 -118 10
1189A0j7j27P9K4M4J51pk29L1J07j5N0m1K29k21j56l5J15R8k16K66k22k1J15J1
1214B3J95l75l8K74p5K5k0NJ40k37J77k98K76J01k63j1L80n25J44K13j01q9L0
1237d9Q3l02O1K00J0k98L66j08P6k10K02Q2M0o1l3q2J7l5n9M37p17J02K86J75
1261A83j04o9K6K0j29K1M2j83mK76R3k30k46M44j04p9J52j08o6J63j03L3j14K1
1285f5J02j50O1j58K12J78j76N3j35k13M64k63qL26k64M06m47J21oj39K89j79
1307In1j42M24j1j07L2n4m07L77k41J04J76m7p0M10k66k18J06L0Q9j42K15j42
1330G4J37k18k1j42J97j0j12N6M4O5Q7k84M44p9k13K22l83K18m12M69k32J38M
1353D9k79J34o1L05K10j78L2k3k31K14k57Q0k27K74n6n0p6K17J57l48K72l2k4
$$ plain form
1189 10 -7 -134 -55 -31 13 164 157 -72 -41 66 51 101 60 289 68 -88 -123 -8 90 -126 140 -82 -103 12 23
1214 23 218 -157 -195 79 4 29 9 14 154 -83 94 -204 72 173 -90 -101 279 -246 -102 111 10 -79 -49
1237 -49 34 -268 -207 -7 3 -295 71 -37 39 -171 31 113 153 92 59 -23 -6 -41 -100 337 -380 -278 8 183
1261 183 79 10 36 56 -73 -52 -10 -193 -197 79 172 -58 -304 140 36 -43 109 1 -65 98 -5 28 -86 -65
1285 -65 37 -113 -52 -210 2 180 4 57 -78 -291 173 -90 -98 228 -36 370 -77 44 38 -101 188 9
1307 9 -42 -184 240 229 122 154 100 -307 70 -171 -67 109 62 -8 402 136 -82 24 54 143 1 216 74
1330 74 211 -7 -28 -170 27 17 -95 -39 5 70 157 -127 317 238 25 247 -136 82 -330 139 -93 45 49
1353 49 -230 -96 -157 148 358 180 212 189 -42 172 -85 -5 -232 42 -14 -64 -140 77 234 -114 158 126 102
1376A02O0L7l55J27O8j06L65j48j32k14L60k03R0j1o7jJ06O3m00L09j65K23j29
1399b1p8m1N7m0K21L6r3J54j78l9n5rK82l43q2K22J61k32j76J61J43J08L7M5m7
1424A93m98J14K57j3r8r0K64m23M56k35j74K39j46K2J18k7p2J31J84j45j52O6
1446b9R1j26j32M47k71l80N20p9N1k45K37j38Q4M6j14M6j25J95j2p0m5J35m60
1469c74K38k49M39J1jj69J00J63J2j73j34J05j31j0L53l39n3K14q8J06J26o69
1491e23N40J06k95J13K30l80N00k95K21m27K19J80j21J08kl37K76O1l51J47m8
1512g8oR9p3j5K60m67L7K06l19M63n1o2j30j06K93R4l94K74J42j66n4J41j12j84
1536b08O04j34m46K26j25P9k9O8M4j05M1R0j50O7r1J99j21J16p7m1L2K5O5j33
$$ plain form
1376 102 162 199 -156 -29 39 -67 298 150 18 -196 164 -39 51 40 -27 -28 78 141 -259 50 -115 108 -21
1399 -21 -99 -140 -83 -123 98 134 41 195 17 -22 -77 -86 196 -147 -229 -7 154 -78 -254 -93 50 158 195 240 193
1424 193 -305 -191 66 53 -45 -135 129 -294 162 -73 -247 -8 -154 -132 -14 -41 -113 18 202 57 -95 -29
1446 -29 62 -64 -196 251 -20 -400 120 41 92 -153 84 -54 30 76 -38 8 -117 78 66 -4 -49 86 -374
1469 -374 -136 -385 54 65 64 -105 -5 158 170 -3 -137 -32 -163 -173 180 -159 -212 2 -86 20 146 -523
1491 -523 17 123 -172 -59 171 -209 291 -4 217 -210 9 189 68 176 174 -163 113 174 -177 -30 -78
1512 -78 -84 15 -58 -73 187 -280 -243 -37 -356 107 56 -6 -136 -242 51 145 -249 25 167 1 -53 88 -24 -208
1536 -208 396 262 -184 42 -83 -4 -33 35 79 -26 15 105 -45 22 -69 130 9 125 48 7 39 64 129 -4
1560dr7O2K6q4K80j41J68j90j02J26j12L71l46r0p8J41O6p5N7R5j51j7j58M2K60
1585D9j64K08pk5N1M3l21j37J96J06K49j58j89kL23l07Q8k3j65J03p7K08k33L44
1609A60J2q1m2M0k46O8Q6K2J30p5m2L20m18j78R7L05j66p0k55N43j25k35K59O6
1633A75j24m01K29L97j79J27n4j96J21K13q5k09J3O6Q0k51l0K22k07J17j70L86
1655B40n4k67M9J08j46o4N0J93r4J65p4q2j19Q2K06l24R0L09k11J61j22q4K5n9
1679b2j02J19k74M11jk89K43n3j86J18j56P4K6K35l08K81O8k44N9J03k2m20L14
1702b6J56n7LQ0o7J38l82M13l17K24j71p7j04L8K42k0j39l6N9N29n91L31n10L49
1726F5K45m82K51j79J71n2J2Q9l75l7J99P4j15j02L49P0k81N0j17K85J37l94J52
$$ plain form
1560 -4 -101 -39 -13 -97 183 42 210 20 -82 44 -68 303 -43 -133 -211 -70 -4 -79 -22 73 -78 -95 -253 -211 49
1585 49 -115 93 86 61 112 155 -166 -303 -107 -1 248 90 -99 -101 222 -85 3 -20 -185 -82 -159 49 -184 160
1609 160 172 91 49 89 -157 -89 -3 19 149 74 32 352 -66 -244 -147 158 -8 -78 -333 210 85 -150 109 175
1633 175 51 -350 -121 276 97 224 170 -26 95 308 223 14 27 93 173 -78 -108 114 -93 24 -146 240
1655 240 186 -81 -32 76 -70 -134 -84 109 15 180 106 24 -95 -13 193 -131 -41 268 57 218 96 12 37 -22
1679 -22 -124 -5 -279 132 131 -158 85 32 -154 -36 -192 -118 -92 143 -165 116 184 -60 -1 102 80 -340 -26
1702 -26 130 73 76 156 89 227 -155 258 -59 165 -6 -83 -187 -149 93 73 -66 -102 -43 486 -105 226 -284 65
1726 65 310 -172 79 -100 71 19 31 120 -255 -292 -93 -19 -134 -236 113 183 -98 -48 -165 120 257 -137 15
1749A5O3k02M5k2L14l3q4q6j11Q4L45n49P8J30K5K53k57j90j7L55j43J07l49K27
1773bj52L43j1j52k54L07l3k35J01L25k39k30L71k82J22Q2K1l03M24K5j07p5m0
1796Fj28K94j28k0o1j5P8Q1o8p8J10q9K27j62j74N16k86j87Q8j6j9K27j86K56
1820B66k09m5J73j96N3qJ13m34n7N28n2k42J6K48r5J3k15K97j68l5L14k01K65
1843C29m87J05J78K2r4l32M32j79K31j8l11J59j61J62K88l36L0J36j82jJ1n2J20
1866E0k59M12q1k2l46L25j50R6M1o4J49l26P2m7LR4l2J48j67P4Kj42L15N9n22
1891c18R2K32Q3j58K67k63l8K03j9k05M35r6l31L22r6L8Ol32L38L7j87j63L6j58
1915b75j5K47K20k53q2N2M82n13J13Q0j0j15j6J54j04N3J1R9j48J22N8k25J92
$$ plain form
1749 15 78 -124 -79 -101 213 180 96 10 -101 -17 328 -221 -143 -13 12 265 8 -182 -199 156 13 120 -229 -2
1773 -2 -154 189 178 26 -228 79 46 -189 -88 237 -2 -232 139 -143 -21 61 82 -221 203 228 121 46 6
1796 6 -122 172 44 24 -37 -52 26 107 39 -39 71 -18 209 47 -127 389 103 -84 4 -12 -31 196 10 266
1820 266 57 12 185 -11 42 34 147 -287 -344 184 132 -110 -94 154 59 72 -143 154 -14 -49 265 64 329
1843 329 -158 -53 125 147 53 -279 153 -26 205 187 -124 35 -126 36 324 -12 18 154 -28 -29 -18 -70 50
1866 50 -209 203 122 100 -246 79 -71 25 66 2 151 -175 -103 -150 -147 -53 -85 63 -104 -30 -28 -170 145 204 -318
1891 -318 -226 6 89 -69 198 -65 -103 100 81 -124 311 215 -116 206 110 148 154 -178 160 197 10 -153 -117 -275
1915 -275 -290 -43 177 -76 -158 -106 376 -137 -24 56 46 -69 -85 69 -35 18 29 128 -20 102 160 -65 127
1938A27k58J36O4k95K09o9m8mK44k02K50q6O7l01q2J69k04M18l25J55p1J20k32
1961b18n8K25N8r6K6o6K17J6l90L64k83J59j6K32j08K2j42J60k50R4p4N2k57K70
1985f3K06k55J63k61N6J34J09k93Qk5K44n5mk02J00L24j11k30J83p6K7J18j62
2008f5J05j76N41m45M4rj33J36k8j76L82k73J85k57M40k59J9J15n3p5j19K91l93
2031b03L02j30n3L1rj49J00R8j27J41j23N3J1M23o01L01n3R2Oj51k2K1j13K38
2055H3o7j74J88K2N9J7j48m1K%K39M3l13O4J05r8j64L73l17J07J57k71Q2K6L8
2080A2o0OO1K5k74J86Q3J50j19J32j14k31j0J30mK1J23J0JR2k88R0J06j30M1j28
2106h9K03k89J76q1j44M33l46R3j14l6K40j48k04L33rj80K83j89J40Pl07j5J15
$$ plain form
1938 127 -131 5 69 -226 -17 -86 -134 -138 106 -96 154 68 135 -166 -248 -79 -283 135 -190 -35 -106 14 -218
1961 -218 -276 -51 7 -89 -63 -129 88 104 -286 78 -205 -46 -62 170 62 84 -58 102 -148 -54 -128 -76 -333 -63
1985 -63 143 -112 51 -210 -154 -20 89 -204 -196 -221 23 -32 -36 -238 -138 186 75 -155 28 -48 -21 97 -65
2008 -65 40 -136 405 -40 4 -5 -138 -2 -30 -206 176 -97 88 -169 271 12 31 146 93 18 -101 190 -203
2031 -203 99 -31 -84 -53 -62 -211 -111 -13 -140 1 -122 -69 -58 365 -236 65 12 104 110 -41 -63 -42 -155 83
2055 83 16 -158 30 52 111 128 -20 -61 -59 -59 180 223 -90 -26 79 -19 -183 190 -127 -20 137 -134 -52 -26 12
2080 12 -48 -42 19 44 -230 -44 39 189 70 202 88 -143 -153 -23 -27 -6 117 127 128 220 -68 22 128 -2 39 -89
2106 -89 114 -175 1 -80 -224 209 -137 -44 -158 -194 46 -102 -306 27 18 -162 121 -68 72 79 -228 -243 -128
2129a28O0R2j11N7L26j53k07J8k79L25J2k32K14N9K90j96j87o4K39j29Q2n1oj30
2153i9j36L85J18l42L3r5OK71j89O1R5N1j33r4k6J32L19m42K74k63K26j08J40
2176A84J15j60J77n00L85j37j52j39J2J09o8J17L33k54k15K63o6O1J4p0J88l38
2198a41L4J6J49p7M5J24l27J92N5k70J04K7j18L18k29r0K77j86N5j28K29m4p5
2221f0J71j71r7k1J91L2j13m9L6mO1m0j8rJ35j8P2r8j63L05l16L03J56j98j0K1
2247I8l22J07l3L05j66N2Q1k56K03j34J06Oo6Q1r7R6Q3l6k40J98q6l17L31P3j34
2272f7j2J34P1J02k97J90j81J20K7R9j96j73L75j20l2l67M01j59r9J29J27nj91
2295a24J86n2Q4o2k54M04j70j0j55M77m89m4L14j21J04j7L3q8p0j19M62m25L20
$$ plain form
2129 -128 -68 24 -87 -30 296 143 -64 -46 -325 0 12 -220 -6 53 343 147 -40 -104 135 6 88 37 31 -99
2153 -99 -235 150 268 -74 -41 -136 -130 141 -48 13 108 159 26 -68 -94 38 357 -85 189 -74 152 44 184
2176 184 299 139 316 -184 201 64 -88 -227 -215 -106 -174 -57 276 22 -193 70 4 65 79 9 197 -141
2198 -141 -107 -91 58 -19 26 150 -177 15 70 -200 -96 -69 -187 131 -98 -188 89 -97 -42 -170 59 15 -60
2221 -60 111 -60 -157 -178 13 45 -68 -117 -81 -85 -24 -64 -82 -91 44 26 98 0 -163 142 -174 129 285 87 77 98
2247 98 -224 -117 -150 155 -11 41 122 -134 69 -65 41 47 -19 62 -35 61 144 108 -132 66 -20 -337 -6 67 -67
2272 -67 -79 55 126 228 -69 121 -60 60 87 186 -10 -183 192 72 40 -327 74 -85 -184 -55 72 67 -124
2295 -124 62 10 94 32 -222 182 12 2 -153 324 -165 -209 105 -16 88 71 104 16 -54 -173 289 -136 184
2318A84l17K71o2N2j85J00k09L17j39K1Q5L7j78J29k01J39J14k74Q5r2J73J62
2340B12k23P9o2PK10M7k10k33K21m4N5l81M54l65L98l45K83r4Q4J77Jk95j68K73
2364H1l2j08j76M10l22j17K67j09N8J31l25M28j64k3J70n7Pk80J69P6M7l7N8l08
2388a56J16j38K41P9j77j69L12k14Q3l25Q1M69k86J84k4j16oJ24j61L23j05k17
2410h2j34M60k43j33P0K74j76n9j5J82k20K45l76P7J18Q2l9j49QK4p8L11m36K75
2434a4j20L63k90K46m24L41k27r7k6K84k6Nk09J51J07k4O4K0p9l54J49J16P2j60
2458a32J41r9N34l61m06N45j6j51p8j82J51J17l57K43J97l18L64o0k23J74k05
2479a22J71l7k21K55k7P7q9Mj78M03l08K37j36K06j52j03N8K92l99o3M7O1J23
$$ plain form
2318 184 -133 138 76 128 -57 43 -166 151 12 33 118 155 -23 106 -95 44 158 -116 -31 -123 50 212
2340 212 -11 68 6 13 223 270 60 -173 48 4 59 -322 132 -233 165 -180 103 9 93 270 271 -24 -192 81
2364 81 49 -59 -235 175 -147 -264 3 -106 -48 83 -242 186 22 -1 169 112 119 -161 8 84 131 94 152 -156
2388 -156 -40 -178 63 142 -35 -204 108 -106 -23 -348 -267 202 -84 100 76 -40 -46 78 -83 240 135 -82
2410 -82 -216 244 1 -132 -62 212 36 -23 -38 144 -76 169 -207 -130 -12 70 31 -118 -110 -86 -164 147 -289 -14
2434 -14 -134 229 -61 185 -239 102 -125 -222 -248 36 10 15 -194 -43 64 40 104 124 45 -309 -160 -44 28 -132
2458 -132 9 -90 444 83 -323 222 206 55 -23 -205 -54 63 -294 -51 146 -172 192 132 -91 83 -122
2479 -122 49 12 -209 46 19 96 7 11 -167 236 -72 165 29 235 83 -20 38 330 -69 -132 -85 -24 99
2502I9j15R8k33l9R9MM0o9J44k32J11k2K4M3L65l85J40q5j86K31J06n3j50J38
2526G3l6k1r4Q6r7j64J01K61L9j69J0J03j98K73r6L8m11L65j79J43J47J08k11
2549G1r4j38R4L25l57K6k09K73l24M84l2j50j93K62j05K75k1j31P2o4K33l61m0
2572a04O0K97l97J74J8j58L4J27k20L75j46k0o4J24j6j4J52l71K30J2l30K55J7
2595C5j47k23M64j50j64P7M6J03l9K16k49J75Ko2K62k49m9J48j82J08K08o72K22
2618a20K17k63L78r5j54Q1mj64L25k39j26J58q7j8L65m6k43M7Or6J93m2k95J77
2642d5J1J64pq9k9j26m8J66j3q6N6J04n0j21j77M65k40r9K97k97K28j65q9J55
2666c5k00O33m64K59o4p6J7J35k42J8N0o7K51j52j50L3J3L62k58M2P0j52j37M1
$$ plain form
2502 99 -16 82 -151 -190 -91 -87 -47 -116 28 -204 -93 -115 -91 -48 317 -68 72 -13 -199 32 138 85 -65 73
2526 73 37 16 -78 8 -89 -253 -152 109 148 -21 -11 92 -106 167 71 109 -302 63 -116 27 174 282 71
2549 71 -23 -161 -67 258 -99 -73 -282 -9 -333 151 119 -31 -224 38 -67 208 187 56 128 64 297 -64 -104
2572 -104 -44 253 -144 30 48 -110 -76 51 -169 206 60 40 -24 100 84 70 222 -149 81 93 -237 18 35
2595 35 -112 -335 129 -21 -185 -108 -62 41 2 218 -31 144 146 84 346 97 48 196 14 122 330 -342 -120
2618 -120 97 -166 212 117 -37 44 40 -124 201 -38 -164 -6 -93 -111 254 208 -35 12 18 -78 115 73 -222 -45
2642 -45 -34 130 123 34 5 -121 -169 -3 -16 -102 -46 58 8 -113 -290 175 -65 -164 133 -164 64 -101 -190 -35
2666 -35 -235 398 -66 193 129 53 70 205 -37 -19 31 -36 215 63 -87 -54 -41 321 63 105 175 23 -114 -73
2690g3P4j06J47j80K84l20o6L47k9j26J83k34m3j09K77J0N9O7K5k56K9P0o3j55
2714a88L40j1l03N1K04k87J67L09m66M23j82J40j99m1k5J49j08j25K42n1j5j33
2736a09K34j74j90L72l1l91K60j07K23pq9j2l7L41j78k5k31K22k29P5K85j18n2
2759C2M2j90MK28l05L87m00k1K27p1J47n0L04n47O9K31k07R2%J70k20K28n8l66
2783b74J2K21K53l41L41k02np3o4J04O7J7N7O3J1j93R7j2k27K40j56L69l60J13
2807E8K23m78K26k26K28k64L23j01J50l30K99K5M8j15k65K70R5k67o0K68o6Jj32
2830i0J38j30j06J64p5L36m64N70o04L3J80J10k72K50j59L96j35j87M0J69l12
2851a48l5K8J03J79l19N9N3j45L59k96Q0K27m4p2j07J54k07P7J2J49j02J5l8L26
$$ plain form
2690 -73 1 -105 42 -138 146 -174 -240 107 78 -48 135 -99 -142 -251 26 36 95 162 187 -69 -40 30 -33 -188
2714 -188 152 141 -162 -111 93 -194 -27 282 -184 239 57 197 -2 -43 -68 81 -27 -152 90 39 24 -109
2736 -109 125 -49 -239 133 102 -289 -29 -136 87 80 -9 -21 -58 283 105 80 -151 71 -158 -83 202 84 32
2759 32 74 -116 -112 116 -189 198 -202 -223 4 -67 80 30 334 -213 -144 87 -120 -28 -28 142 -78 150 92 -274
2783 -274 -262 -41 212 -129 212 10 5 -68 -132 -28 39 56 113 176 187 -6 91 79 -148 92 -64 305 -55 58
2807 58 281 -197 29 -197 31 -233 90 -11 139 -191 108 133 181 66 -199 71 166 -101 -161 107 41 42 -90
2830 -90 48 -82 -188 -24 -99 237 -227 343 -261 -228 -48 62 -210 40 -119 277 142 -45 -5 164 -148
2851 -148 -183 -155 -52 127 -192 -133 -80 -225 134 -162 -82 145 101 29 -78 76 -131 -54 -42 107 5 20 -18 308
2875C08j64k27J72j21j26l8M36l75J09K62k97P4J14k5J0j41L04k92L0J90k40j33
2897a70J97L9o5J89J11l40Q2M4j8n8j0n7P4n7j74L22k18M57k08j35J93l23J73
2920D8j24J44l19K59j46J85K18l41R8j03j28N02k97n5L98m04J15l93N88l93J5
2941a33q0M33n8m20N1pJ98R9j55K37L9j01j49J03j12J12l90O71n05M2K26j90J94
2964A05k12L04k43K00k07m9K38l41J87p0J43j55N2J20kK7n0Q7j44P9j01J21m1
2987D8q6k94O50j57l90J87j56J53k14L56j48R4r4J60J4r2j45K82j21p7j88J57
3009f1M6ML3k94L04k5L7j68M11m26j23J86j18L14J28n37L43pk50K15j49N5P4p8
3033h6m9J26P0J34O0k24j21K8k65M06j24N1o4j6J17j87K42p1j40R0j77J67J50
$$ plain form
2875 308 144 -83 89 -32 -158 -196 240 -135 -26 236 -61 13 127 102 112 -29 275 -17 13 203 -37 -170
2897 -170 27 66 1 190 301 -39 43 87 69 11 1 -56 18 -39 -213 109 -109 348 140 5 198 -125 48
2920 48 -76 68 -251 8 -138 47 265 -76 22 -81 -209 293 -4 -59 339 -65 50 -343 245 -148 -133
2941 -133 -213 220 162 -258 -207 -214 -16 83 -72 165 204 103 -46 57 -55 57 -333 338 -167 -125 101 -89 105
2964 105 -107 197 -46 154 -53 -102 136 -205 -18 -88 55 -100 -48 72 70 97 47 134 -10 69 -32 89 48
2987 48 -38 -332 318 161 -229 -42 -198 -45 -259 97 -51 43 -51 109 123 31 -114 168 47 -30 -218 -61
3009 -61 -15 -11 22 -272 32 7 44 -124 287 -139 -262 -76 -194 120 248 -289 54 47 -203 12 -137 -82 -8 -86
3033 -86 -135 -9 61 195 255 31 -90 -62 -327 79 -45 6 -58 -74 43 -144 98 27 -113 -23 -200 -33 117
3056A17q0m3k00K39P3J9o9k00P4lJ57j36l64L96j93J60K6K26L2j65J54k81J65
3079A04q2N4j73k6K14j41L81j98k89K23J7j12J68l74j53K93o1K3j4J79j06r6j73
3102c42L99O8Pr0j3q3r5M0J05o4K13pl36J49J64nJ54m9q6j37O7N5o9R6O7p5j59
3129b6m35M96j55K15J33k99r9K36j14J53j9M7j28n5J6n4N0K37k69J83o3p4L5j17
3153a06M30j92l4n1K17j60p0J5j00q4L61l11J69K8m92J18K36M4rmR7m2P9o9q4
3178a4k41K74J01p4n2j58l8J13K96k30n0j6M0L7k21L8L03q7J30k90J22J59k03
3201f1J17j35J25M6j16l08L25r3L00j65J90j41K6R9l99O7M6M1J17j88k5L70m09
3224a71O02m12M3j31Q3m1J94k31k0K47J32k33j51J0K8r9k7K40O1k33j18P7Q3J79
$$ plain form
3056 117 37 -6 -206 33 106 125 56 -144 -70 -73 84 -52 -416 -20 -213 -53 -27 199 231 66 220 -61 104
3079 104 22 76 -97 -123 91 -50 331 133 -156 67 84 -28 140 -234 -387 -94 -155 -132 -146 33 -73 -169 -342
3102 -342 57 125 132 42 29 -54 -149 -109 -4 -68 145 138 -198 -49 115 110 264 215 129 -8 59 114 45 141 208 133 -26
3129 -26 -461 35 -120 95 228 -71 -170 66 -48 105 86 133 5 -50 -34 -88 -38 199 -70 113 50 -24 11 -106
3153 -106 324 132 98 47 264 104 34 49 -51 -135 226 -85 84 112 -380 -262 -26 18 9 5 102 60 139 70 -14
3178 -14 -255 19 120 46 -6 -164 -202 -89 207 -23 -73 -89 -49 -12 -233 -195 108 21 151 -139 -17 142 -61
3201 -61 56 -79 46 92 -24 -332 -7 -100 200 35 225 84 110 209 -190 -123 -77 -36 81 -107 -132 238 -171
3224 -171 431 19 62 -69 14 -27 167 -64 -84 163 295 62 -89 -79 -51 -150 -177 63 124 -109 -227 -150 -67 112
3248A12P4p8j70L57j40j99J49L28l95J40k20K28k42j70O31p13M64j79p8J27k52
3269b26J55K64l87kJ06K9j5j2L38j67%%m9qJ0J13m7j4m9j54J23o8p7p4K21n2q3
3296a25L2n1k6L15l04L25j73k94M47l21j46L11o4k39M13k3j9j33J1J55j94M61
3318C58m95P3M7M4k5j73L60k15K50j06L3l21K89j91J86N5R3k69K9P2J29m87M58
3341A94k21j30q0K50Q0l6o0n3l6K6J51J29k16j40K23o3mn7j6M07l72R2P8j33j05
3366i2K57j48K9O2p8K57j59k01K25j55Rk6k16M42l17J28j05oj41K13K34k42Q0
3389E0p6J81l11L50j86n9J82m22L35j36Q8j03M7M9K64j82q6n7J50N1q8J25K6j46
3413D6N5j36Q1k9J9J00q5k71K95q3J47K3l34K47lj82m5J7K06K69k61k9J9p3Q7
$$ plain form
3248 112 186 108 -62 295 155 -44 105 433 38 178 -42 186 -56 -226 405 -308 156 -23 -101 26 -226
3269 -226 -71 193 -194 -196 -90 -61 -76 -88 250 83 83 83 34 26 36 149 102 88 39 -115 8 -60 -137 -211 10 -42 -125
3296 -125 -93 -144 -170 145 -159 166 -7 -301 146 -175 -321 -10 -74 -313 100 77 58 -75 -64 91 -103 358
3318 358 -137 -64 -17 27 2 -171 189 -26 224 118 151 -170 119 -72 114 169 262 -7 22 94 223 -264 194
3341 194 -27 -157 -237 13 93 57 -3 -56 -92 -66 85 214 -2 -142 81 18 14 -43 -59 348 -24 68 146 13 -92
3366 -92 165 17 46 108 30 287 128 -73 152 -3 6 -20 -236 206 -111 17 -88 -94 -235 -22 212 -30 50
3389 50 -26 155 -156 194 8 -51 131 -291 44 -92 -4 -107 -60 -11 253 71 -15 -72 78 129 41 166 192 46
3413 46 101 -35 46 17 36 136 51 -220 75 -8 139 162 -172 75 72 -110 -155 -138 68 337 76 47 66 -7 80
3438H0j85R8L2j4N9k05Q7K79l70l8K60qJ61n4k99o0P8K75j69o4N9q2J57p2J35
3463A40k7Oj86Q2k73K95J41j94R8o3j27J02j7K3M0n7j56J60Q2K13j23k80N2K3
3487d6j7J11k67M23j18J11l40M92o41J95K27k78J36J44J00j78k6N3j34j92M27
3508A82l80J61J11J48k10J70l32j97K22P0k11K75l7N5n5J73K95m34r0j45M9M08
3530B28j68M9r6j21j97L34l0J06L0J6j99K63j44lj03k1o0O5N2k8j83J73j22M74
3554C15m15n1Q5K33J01k97J40l95K81J89j42Q6j20J80k29J76k58J84J2r3q3J14
3576A3Mr9J49k64L67l39K97JK27o45J78kJ65j40R9j15R0p3P7p8J36J50o8k77K92
3601A45m7j70O5Jk10K8K5L23j68r5NJ18K8k80K18J59%J0k58P1j84L83l22J55J74
$$ plain form
3438 80 -105 -7 25 11 70 -135 -48 231 -139 -177 83 75 236 182 -117 -177 -99 176 7 -57 2 -80 77 5 140
3463 140 113 119 -67 15 -258 37 178 -16 82 19 -108 -6 -23 0 40 -17 -173 -13 69 282 159 -121 -69 -46
3487 -46 -63 48 -219 204 86 197 -143 349 -292 -97 130 -148 -12 132 232 54 28 81 -53 -245 182
3508 182 -198 -37 74 222 12 182 -150 -347 -125 -55 -266 9 -28 27 -28 145 440 6 -84 -229 -180 228
3530 228 60 109 13 -108 -305 29 -1 105 135 151 -48 215 71 68 -35 -56 -116 -51 1 -27 -210 -37 -159 315
3554 315 -100 -151 -66 167 268 -29 111 -284 -3 186 44 130 10 190 -39 137 -121 63 75 -18 -101 13
3576 13 17 -82 67 -197 170 -169 128 129 356 -289 -111 -113 52 -88 11 -104 -14 -87 -10 -88 48 198 130 -147 145
3601 145 98 -72 -7 -6 -216 -188 -163 160 -8 -103 -98 20 48 -232 -14 145 145 155 -103 -32 -216 167 -155 0 174
3626A74K8k87q3J92J5j60k22M11j87J09q2j46O8K21l6K8j35K12k31Q3M6l7k44
3649b63L10k32j96K93R3L7j5m6j9L0k47J98Ql3K13k94J16k9K2R3j18K12k01K70
3673B02k2k2l5M2O4m60L20j80r5J77L9O1l5j59J90r8q7j27L02k62M01k00K3N7
3697I6j26j1J52l35J57J41l6M5j09J44k27J74j92J48j26K10k45M2K45l29J03K86
3719B07m05K1l2L4J64k11M81o21L96o9KQ3m06M45l0l1l2J7Q3j92K22r7q1J0N6
3744A4j93J52o9N4J67l1q5O5N9k43K07j76RL5Q2r3j02o8J17O5j36Q7o5J61J48
3769A61j00j4o2k6j18j08J31J44k22J04K12O4l36L22p1L5K39l48R2ql52J35O49
3792E23n32J62j49j26J09m3K62k83L1l3L1J8q1J9M06p1k72rj64L18k43K03m5l9
$$ plain form
3626 174 202 -85 -168 24 39 -121 -343 68 -119 -10 -92 -238 -170 51 15 43 -92 120 -111 -28 18 -19 -263
3649 -263 47 -185 -381 -88 5 42 27 -19 -38 -8 -255 -57 -49 -82 131 -163 -47 -76 -54 39 -79 133 -68 202
3673 202 180 158 123 165 229 -231 89 -91 -186 -9 30 91 56 -103 87 -11 -98 -225 77 -185 216 16 39 96
3697 96 -30 -41 111 -224 -67 74 38 83 -26 118 -109 65 -127 21 -105 105 -140 -98 147 -182 -79 207
3719 207 -198 -177 -209 -175 -11 -222 259 -362 34 -35 -33 50 -356 89 59 28 -4 13 96 -96 126 29 -52 -42 14
3744 14 -179 -27 -96 -42 125 94 9 74 133 -110 97 -79 -70 -35 47 -46 -148 -216 -99 -34 -170 -83 -148 13 161
3769 161 61 47 -15 -41 -159 -267 -136 8 -214 -110 102 166 -170 152 81 116 355 7 99 91 -261 -126 523
3792 523 -9 153 4 -122 -13 -56 206 -77 -46 -79 -48 -30 -111 -92 314 243 -29 -38 -202 116 -127 76 31 -8
3816hj04J17j5j53K97j08o3j11J93k69L03j25J18n2K77l73l1o6K33P6k21K87k13
3839a1J27k28M7k91K81k2o8L2K11J5m7n9J05j70K06n7q8m2L32Ml17Q1j41M10j65
3864A45j54m6L5k7O2j87j6Q9K56j78rN6k00K85j4k06J2J94j22N9J6j66K73K9Q1
3889B67n25J89N2J9N2l54N34k67J49k85L25j27kJ1j09k5J41k41J40j26m9J44K46
3912A59m6mj38J28o5J23j88r5R0O3n0j62L59m42K90P8k10j8J45N5o7n0n3j20J00
3937a18J55J5J58k19J71m7j13j4J25r4p6Q3P5o8k39K29q7k04M61lr6j4r6J15j22
3962b3N0J8k0j24K4J18M12o86L35j49j19J05O6O1r3J88j27k3K85l88J78p8k57
3985b47N17l5m00L42k22O7n9k51K63J83j69j33L14J13j78j41K6M7r9K09k10l2
$$ plain form
3816 -8 -112 5 -10 -163 134 26 -37 -148 45 -224 79 -46 72 20 297 -76 -107 -173 60 136 -85 202 -11
3839 -11 116 -112 -65 -356 -75 -97 -165 -133 78 93 46 -13 92 -78 128 71 -17 -59 273 277 -40 41 -100 310 145
3864 145 -9 -55 -20 -47 15 -172 -188 -99 157 -21 -30 26 -174 111 97 -109 -97 97 -25 34 50 -116 157 186 267
3889 267 -258 -69 -17 2 54 -300 234 -33 116 -169 156 29 27 38 -71 -96 45 -196 -56 -182 -231 -87 159
3912 159 113 109 -29 99 34 157 -31 -126 -36 27 -23 -185 174 -268 22 100 -110 -128 17 72 5 -45 -98 -218 -118
3937 -118 37 52 210 -9 162 115 2 -12 113 19 -57 26 101 33 -206 23 -64 -268 193 190 94 80 -16 99 -23
3962 -23 27 45 25 -99 -75 43 455 -231 104 -45 -164 -59 7 68 -25 163 36 13 298 -90 88 10 -247
3985 -247 270 235 -165 177 -45 22 -37 -288 -25 158 -11 -144 170 283 105 -36 -10 37 -62 147 -63 -95
4007i5J17j0j49K29j5K1j23p8J2Q0k8mm8K6K22k14J3oK8j3J11r2rR9j25K12j75
4034a4r1P1j04N19n06j95N56l21K46k62nJ35Nj35J40L2k36L94j01K6l00R4K25
4057A73j20j46j54J05L07k34n5J51L3j63J20J41j00k30J28J65J65k19j25J13J48
4078B03j31j29l6J27J18p3k9l37K09L28j70q2Q5j2L0j86J19j51j7J72K14J02l98
4101d4J54J9nn0P0k16mJ04r9L6J55r0p4J46j70R1O7q4j31j1J22o2p2L14J9m36
4127b51L36j53jk2J34O5k64J81N3J2j84j12K40l16N18j52J56j64m8K16k26Q1l9
4150F0k59jL14j83l9K43j37j71j44J28K42j11K88j53m50J87K96n5k81L68O6m49
4172b41J81N8J51j65j24k1L52k52L9N2q6m26M81j23J09O8j04K18k70J90k55K1
$$ plain form
4007 -95 22 12 -137 92 77 98 -25 -103 -91 -11 -39 -43 -91 -65 157 -57 -44 -50 -22 -35 76 -16 -25 74 -51 161 -14
4034 -14 -105 -34 -138 381 -125 -320 236 -85 161 -101 -106 29 34 -101 39 71 -165 229 128 154 -146 -52 173
4057 173 53 -93 -247 -142 165 -69 -124 27 60 -103 17 158 58 -172 -44 121 286 67 -58 55 203
4078 203 72 -57 -93 34 152 79 50 -287 -78 250 80 -2 83 71 101 -85 34 -117 -134 38 252 354 -44
4101 -44 110 129 124 74 144 -72 -76 28 -71 -35 120 30 -44 102 -68 23 90 6 -125 -136 -14 -76 -148 166 185 -251
4127 -251 85 -68 -69 -91 43 108 -156 25 78 90 -94 -206 34 -282 236 84 240 76 28 244 18 99 60
4150 60 -199 -200 114 -69 -108 135 -2 -173 -317 -189 53 -58 230 77 -373 -186 110 55 -226 142 208 -241
4172 -241 -60 -2 149 -16 -140 -161 191 -61 -22 30 -56 -482 -1 -124 -15 53 -51 167 -103 87 -168 -147
4194a47O4N9K05j13r3J92l59J69J7K34k88N8j63K48K68n06m3J00P7j83K71j12
4216d5J51P3j14k13P0O7k0N5o6pJ31Mk46o6PqP3r7L44q8K29j76o6M9m6j28J44
4243A1j10K26l41K18N6J11k37l3Q6j36l9K24jQ3n1p8O4r2K80l79K74l53N0J21
4267d6J7J40j00M9p5M08l72n7J86r2Nq0k95K64J56J5k60J19J29j40N0P3M0N8k43
4292e1o0k86M4L51K58k11J83k7l40J05J97k50j37L56o7M6r0k35J42L0r9K47l40
4315b34J33o3J44Q4j25K9Kp2R4M2q8J7q7k2K2m2J95j32K93j65j24nJ74r7K2l7
4341d2m8J70k30kJ11J05M7n6j42L08j67j87J03J1J99r3k01J33P9l69L00n2j79
4364b02J12Q3J73k41K43L7k92K09k24P3K76n16L01J26j0j21K02r1K4k12O0J38
$$ plain form
4194 -147 -83 -24 181 68 -25 167 -192 -23 -6 228 -60 -2 -165 83 351 -155 -198 -98 -21 -204 67 -45
4216 -45 106 179 65 -148 -78 -11 -31 24 -42 -49 82 86 -160 -226 -219 -227 -154 -251 93 5 234 58 -8 41 -5 -133 11
4243 11 -99 127 -214 4 60 171 -66 -99 -13 -149 -188 36 35 118 67 -11 53 -39 241 -138 136 -217 -167 -46
4267 -46 -29 111 11 60 -15 393 21 -36 150 58 63 -17 -312 -48 108 123 -137 -18 111 -29 21 94 134 192 -51
4292 -51 -111 -397 -353 -2 256 45 228 201 -139 -34 163 -87 -224 132 65 111 21 -214 -72 -42 -141 106 -234
4315 -234 -101 -164 -20 64 -61 -32 -30 -102 -8 34 -54 -37 -124 -146 -124 -166 29 -103 190 25 -99 -104 70 -27 -5 -42
4341 -42 -90 80 -150 -152 -41 64 111 55 -87 221 54 -133 -30 -19 180 87 -114 19 98 -271 29 -23 -202
4364 -202 -90 -7 166 -75 168 205 -87 122 -102 -29 247 -269 32 158 148 27 229 138 162 -50 10 148
4386A48k20K3J2j17J39N6k30K65O4k5l22M02l42j56R3L80j58k24L32n32L23J18
4408B9J98k02M4k16J35O8j71L05j52o8l9rjO7j38K00J32j85J51j45J84k40Q1l96
4432c68K35J33l4k07J44J73j81K59l51J54k67P3J08M70k74j5k28L29j44K01J6
4453B26j00j88O2P1m8o1J47K35j17k78K76k49O3l3j07K24j56q7O1nK29n4k10K30
4477A31j65J14P7l34j03K48J85m0j19M1J56j53J63r6k23Q2O0k36J15J69J62n21
4499b87K20R8k42J72K6K37j84k11J30m4jK6Q7k55K87q9q5K47o3j5J07j89q3R2
4523a9p1J43k7j32rL03j80K77j88o7L09n62J99J96o2M8m71K94j26K23l9K02l82
4546a41J98l91N05j89j17M2J02J35k1qk12J19j28K4k14K46J13l45K56K09l03j3
$$ plain form
4386 148 -72 -49 -37 -154 -15 41 -189 76 140 115 -207 195 -147 -303 -210 170 12 -212 120 -412 -89 29
4408 29 227 25 69 -147 -12 56 -115 190 38 -30 -69 -78 -79 -12 -150 50 182 -3 148 3 187 -53 28 -368
4432 -368 -133 0 -34 -241 -97 76 -105 154 -197 -43 -310 -237 -129 341 67 52 -176 153 9 210 226
4453 226 126 -62 0 71 23 -38 109 344 227 -51 225 -24 39 6 -101 123 -33 -120 -59 -64 165 111 -99 131
4477 131 -34 80 157 -177 -280 -32 153 113 -6 35 191 38 201 105 -118 -36 24 -212 -97 72 234 -287
4499 -287 -67 31 -211 -39 -13 224 40 -171 -41 -85 -86 -60 27 -228 59 -30 -115 132 69 54 161 -28 -111 -19
4523 -19 -90 53 26 -106 -115 188 8 285 97 30 339 -223 -24 172 110 158 -313 -19 -145 78 39 241 -141
4546 -141 57 -334 171 -18 -135 -93 9 144 123 115 -97 22 -106 -82 -296 -50 63 -282 -26 183 -120 -133
4568a33R8n1N8m3K10k06p2J55j94P1J43K9J60r4j67J26l80J09L13j54M7K3o4J29
4592A13P0mm05M73k25q3K02O2k81K8L6J7P5J45k65j20K7P4K43j08J32k79J10p1
4616c4j1J44j83K25p6j99K20k69R8J62o3l8J03O1k25J98k26J75o4j35J7j88L78
4639G0l0j42J51p6L07m32L51k05m8Q0r0L70k02J87j79K28k41j28J46MJ2j70Lp9
4663a13J45k00J92m24N70jk95L21l24J27J40J55k54j48L57n14L63j42L31K7m36
4684a23PJ52j19J26j12J94m98o1L03N5n9P3Q8q8M9L7k77J17Q3O3J73k77L53n7
4708B02o3O4n35N01r4j90pK11j84K36j68O2J14j72J02k07J74J84L8l0m02K01L4
4731G1j61P1K55j98j44R9J27l92M01j06m39K61L03j96K32k01n2N0P6J31l0r0R4
$$ plain form
4568 -133 -35 -86 -28 -71 139 -67 -139 16 -178 -107 36 65 225 131 -36 90 -290 -181 132 -22 25 48 -16 113
4592 113 183 179 -226 247 22 -61 141 203 -78 -50 -14 3 78 223 -42 -162 -135 -61 182 74 206 -73 37 -34
4616 -34 -45 99 -84 141 65 -134 86 -183 -85 77 14 -24 79 140 -85 113 -113 62 -2 -137 -120 -308 70
4639 70 40 -102 49 -27 280 -152 199 -6 -54 26 -64 306 104 291 112 340 99 -29 117 121 133 -37 -34 -113
4663 -113 32 -168 24 -400 170 169 -126 195 -129 -2 138 293 39 -109 248 -266 97 -45 286 313 -123
4684 -123 -116 36 -83 43 -69 125 -373 -434 -131 -76 -135 -62 26 -62 -13 24 -253 -136 -53 10 183 -94 259 202
4708 202 139 203 -332 169 75 -115 -122 89 -95 141 -27 35 149 -23 79 -128 46 230 268 238 -164 37 71
4731 71 -90 -19 236 38 -106 -7 120 -272 129 23 -416 -155 148 -48 184 -17 -69 -19 57 188 158 68 162
4754A62r4l11J92K24N3m01K08p0J41l83N60j70j95K04M5k25n4J72l6O8o6k57L35
4777A02l25N6K29j5L0o6J26j62N8j31MJ5K80k00J9Q3n7l88N40l3n22J3M84Rj59
4802a0Oo9K45p1k76K54J37j99j2l0l7k21L03P7p7R7j87m7K74k28J01m8mJ03j22
4827d1l7L04k70N3k15J94N9j79K13k16J38k4j38K19l7J39j45q3k1M2PJ10K03j87
4851H8j8l6N3o8j70O2J7J48J65j26j27K73j64j21J83j01j82J17l2NR4r8N0J16
4875A28MJ7O0L9J08n58K40j62L35l10k9J85k3j17j59L07j13j24j21K67P7j64O5
4898d8L3l4j32J14j65J21J07j81K07J13O8k15J4NK24l48r3K17R9k53J39j7p0N2
4922d3J23J11k98Q2J14n3j39J52j68n7J9K65j24J87m04K71O1k88J95j49K38k3
$$ plain form
4754 162 68 -243 -51 173 226 -175 33 -37 104 -279 281 111 -84 120 165 -60 -114 58 22 90 24 -233 102
4777 102 -223 -167 62 47 77 11 137 -25 33 -98 -94 -79 201 1 20 103 46 -342 198 165 -357 -344 140 149 -10
4802 -10 -4 -73 172 101 -175 79 216 17 5 -25 -62 -283 20 97 20 117 -70 -117 157 -71 30 -18 -22 81 -41
4827 -41 -78 226 -44 9 -206 -12 47 -132 81 -135 3 -21 -159 60 23 162 17 -66 -87 -45 -38 72 275 88
4851 88 70 34 87 19 -151 -89 -72 76 241 115 -12 261 97 -24 159 58 -124 -7 -39 -34 60 -38 12 128
4875 128 132 149 209 248 356 -202 38 -124 211 -99 -128 57 34 -83 -242 65 -48 -172 -293 -26 51 -113 -48
4898 -48 -15 -49 -181 -67 -232 -111 -4 -185 22 135 203 -12 2 7 231 -117 -210 7 106 -147 -8 -25 -95 -43
4922 -43 80 191 -107 -25 89 36 -103 49 -119 -176 -157 108 -16 171 -233 38 99 -189 6 -143 95 72
4944G2l3q8l9k90L01j16M44k67L02m52J49j17j5K45m4n2k73L48k50L83m40K74
4966D2j97K37J95rk60Q3Q2j51J37P4l72K61j24j51J30J61l9k04J94k3j17K23K11
4989C83k82p2p3K84j56l08K98j03j38M50k46l53M20J14k88J7j81M54l51N00l45
5010B4j23k0Q9K50r3k85J60J41k04K02j52k1L59k97j33j6K55J54n21K30O6q8K13
5033A90oj98J42N5m41J87J61l2J88k86J02r4K17l27j0O1K14K5l0k10L11l9k65
5056h5Q0N3k47J07K5J06j63N4K35k61J57PJ73m73K16o6J82k9j23K21j87oO8Q9
5080A33k64j6LK18l47K19O3O6j60J85k44K60k59L92k58N6M0l28K53Q1K37m60K20
5103I0K6l54J98k54R3J84R4k90k3K77j57L01l05j74N77n07J10j20N07l25J3n3
$$ plain form
4944 72 39 -49 -88 -378 -77 -193 251 -16 286 -166 -17 -134 -149 96 52 0 -273 75 -175 208 -232 42
4966 42 -155 82 277 268 8 91 173 22 159 233 -139 122 -2 -153 -23 138 99 -105 89 66 -51 172 383
4989 383 101 29 -44 240 84 -224 74 -29 -167 283 37 -316 104 218 -70 -53 -234 220 -131 369 24
5010 24 -99 -119 -30 220 127 -158 2 143 -61 141 -11 -32 327 30 -103 -119 136 290 -231 -1 65 -23 190
5033 190 184 -14 128 183 -258 -71 90 58 246 -40 62 -32 185 -142 -152 -91 123 148 118 -92 219 180 -85
5056 -85 -5 48 -199 -92 -67 39 -124 -70 165 -96 61 68 241 -232 -16 -82 100 71 -52 169 -18 -24 44 133
5080 133 -131 -147 -144 74 -273 -54 9 75 -85 100 -144 116 -143 249 -9 47 87 -241 12 93 330 -130 90
5103 90 116 -238 -40 -294 -201 -17 77 -213 -236 41 -116 185 -120 -294 283 -224 -114 -234 273 -52 -39 -92
5125i2l2L37m5K19k13j61J92l66J95k56P8K14J79j62p7P6M2l54J33J66m3J00j63
5148c3O4j02J56J24m45J44P8P6J03j83K07k00J2P2j9l3o2j45K48J11q5l90L13
5171A1j51Q2k22J96M39k93Qq2K5J11j74J42k07N7K32j7m15Q9J28J74o3p8K29r5
5195A26n1N7j93J13p8r1J05K24j64J85k52K04k41N5J39j91J84j09k0K30k89j8
5217g5K15j64j17J3L15l60K92k93R8j03K57P9l87K55q0N1O2j19J08j42K40m69
5239c24O36j12l17J49k16l3P1L28n32M86k12k58L13Q4nJ45k42m7mJ46M3j52PK32
5263A86k03o8k42K30J3J41l24M59k23O8n0n1j59M47k00o5j75J45J56l90L00k31
5285b36M8r2K20M6j85R0J14JMO9k46N3K08NR9j62j52j27L33j86k00R1M57k06q2
$$ plain form
5125 -92 -124 213 168 387 174 13 205 -161 34 -222 -144 70 249 87 10 86 128 -226 -93 73 30 130 -33
5148 -33 31 -71 85 209 -236 -92 -14 62 165 -18 189 -11 1 73 54 21 -41 -186 62 173 88 -302 11
5171 11 -140 -58 -280 -84 355 62 70 -12 13 124 -50 92 -115 -58 174 157 -258 -169 -41 133 70 -8 221 126
5195 126 75 132 -61 52 -26 -117 -12 212 48 233 -19 185 -56 -1 138 -53 131 22 2 232 -57 -75
5217 -75 140 -24 -141 -128 187 -173 119 -174 -76 -179 78 157 -230 25 -55 -4 58 -61 47 -95 145 -324
5239 -324 312 200 -117 32 -184 -217 -146 182 -350 136 -76 -334 -21 63 58 203 -39 -86 -90 56 99 -53 -46 186
5263 186 -17 -85 -327 -97 -84 57 -267 192 -31 37 -13 -64 -223 224 24 -41 -216 -71 85 -305 -5 -236
5285 -236 -188 -280 -60 -14 -199 -109 5 6 10 79 -167 -114 94 99 198 36 -116 -243 90 -96 -296 -205 252 46 -36
5310c6O8j8K57n52R3J04p0M04k71p6R8j91J51m8K5o2J75m1l1K57k46o5j46M57
5334B36m07J83R3J21k11P7j07p7P3J85l13K50k20L2LJ18j60L00n7k09M8j7p0J8
5358a11J93k20K62l41K29J77o1O4m3J4j05p5K6P9q9N9j11K36j79j09k77N40j59
5381aJ06k92J10K50k98J74j06J01n5R4K7k6l14j04L34k44Q4L26j93j5j30J08L3
5404c1M2j00K28R1k95N9J71j17J13k46l9L12J53k16R2k02j87L40r1o4p0N8k36
5427b35J80J81k30K3K4K30k22k00L03j4n6o9J70j80P8o8J79O5n3k23L95m7m35
5450b04J49L21j42j37j4p2K31p5L2j92P3O1K7j52K84l25K41N4j46J3k15J11K08
5473A31p5k14J17Q7k2N1p9Q5k40p3L24j85k73J66K21K8l3o0K87l40J49j80j64
$$ plain form
5310 -36 32 14 271 -281 -188 -84 -154 250 -21 -97 1 -190 -39 -87 -62 -124 51 10 -21 236 -10 -75 -221 236
5334 236 -171 12 105 226 15 92 -15 -92 -19 166 -147 103 -117 -85 -82 36 -124 176 119 -90 -42 -59 -129 -111
5358 -111 82 -138 124 -217 12 189 128 192 149 163 58 -17 9 88 -1 58 -53 183 4 -105 -382 158 -1
5381 -1 105 -187 -77 173 -125 49 -57 44 -11 83 110 84 -230 -334 0 -244 -160 166 -27 -42 -172 -64 -31
5404 -31 11 -89 139 230 -65 -6 165 48 161 -85 -124 188 341 125 217 15 -172 168 77 13 -57 1 -235
5427 -235 -55 126 -104 -81 -57 173 -49 -249 54 40 -16 -85 85 -95 -17 -85 94 159 106 -117 278 231 -204
5450 -204 -55 266 124 -13 -27 -99 132 57 89 -103 -30 31 58 -94 190 -135 106 160 14 27 -188 -77 131
5473 131 56 -158 -41 46 24 75 -4 81 -159 -232 92 -93 -366 -200 21 49 16 -44 243 -97 52 -128 -292
5496b92K71J60p2j54J67j5j16j50K24K2l37J18Q2N5J66l31K15l6l09L96Rk48l
5519a78K62K7j6o0j62j8n3M1OQ0J02j01K37k75K06M4r8O7m1k85P0K27k57J83j94
5544a86J03j5q2K83j90P5K7k49K10j18J36j43N86p33L00j8o5k8k1L1M2J00J51
5567A96l60L46j04l31K56q9J60k17J27J17j67k22L71J2k06O0J52j42J33Q3j95
5588b0j61K16L7j7J08k34K95q9j59P0K47l10J15k46J83k71L56j03j96L12O5k20
5610b2P9k22P2P0kj99K19j85K61j36J02j53L90j36j87k79Q5M19j79R3n1L7NK7
5634A08p5k07J55k45N01l8j60N8k74J70m4nJ07j36J66P9j06j46J27j00N2o8J49
5657F8j2j50K19k48l9Q3K24k29N7j23L2J44K23l12o8J97k49o8K28Q0O7k76N33
$$ plain form
5496 -292 -21 139 67 -87 80 65 -51 -201 23 45 -292 -174 -92 -37 129 -202 13 -23 -332 64 73 -175 -178
5519 -178 84 111 95 35 -127 -145 -198 -157 -151 -71 31 -70 167 -108 98 142 44 111 70 -215 -145 82 -175 8 -186
5544 -186 -83 -98 -180 103 -87 -12 15 -234 -24 -142 -6 -149 437 -296 4 -14 -79 -107 -128 -97 -55 45 196
5567 196 -164 182 78 -253 3 -86 74 -143 -16 101 -66 -288 83 95 -111 -51 101 -41 92 175 -20
5588 -20 -181 35 72 55 163 -71 224 135 -24 46 293 -17 98 -148 35 -236 120 17 -179 133 198 -22
5610 -22 57 -165 -93 -23 -25 -224 -5 -190 71 -65 37 -116 274 138 -49 -328 -243 176 -3 90 39 76 81 108
5634 108 33 -174 -19 -264 237 199 39 97 -177 -7 -51 -56 51 -85 81 160 54 -92 35 -65 -13 -81 68
5657 68 56 -94 125 -123 -162 -79 145 -84 -27 -150 -118 26 249 -63 -131 66 -183 -251 -23 57 124 -152 381
5680C81m61J44j9j56J7m6K66k61J78L0j15o3P3j23J06K09k41N4m7j71K47n0K9
5703a9j26oL31q2M6k25L27n54Q2J47p2J26P6j40J52k34K28j64l3J51r4pJ86l8
5727E8k1J35n1k53N4k29M87j77j61O3M4P4J82j62R4m2j10J14P8O4l87J69J13J3
5751A49k69K54k18P2o5m6L1L3M6J7j56L4J83J5j47J11O2j22R5k38J67j6o1P1j18
5776a16j3R8j59L49j38K6p3N0j74K66j00j80J80R9j95j66K02o4K53p2K6j66J69
5799A02L4j75Q4o9J77k44O9J90q4O6j26K0k17J54J59k60K88j75K36j55j04K03
5821A73m4j10q8LJ4N3K0j81jL1O0J8J24r7p2J85r7j59K9P1J48p4l49K61M4J49
5847A11l57J50J50j37nmj79L12m7l0P2j06L68m61J65K0K33l13M4pj2k40K8J94
$$ plain form
5680 381 -80 64 45 -111 -94 -140 126 -135 43 73 -42 -105 -32 -155 -49 160 -81 -27 -74 -245 2 -48 -19
5703 -19 -145 -151 180 98 144 -81 246 -308 -226 -79 -151 -25 51 -89 63 -171 57 -107 -140 11 -83 -90 96 58
5727 58 37 172 121 -132 -78 -307 180 3 -158 -95 -51 23 205 43 137 95 -15 99 177 241 -146 23 136 149
5751 149 -120 134 -84 -12 -77 -123 -92 -59 -13 4 -152 -118 65 80 -67 44 106 -16 79 -159 8 -8 -69 2 -116
5776 -116 -129 -31 -190 159 21 47 -26 24 -150 116 16 -164 16 115 -80 -246 -44 -108 145 73 99 -67 102
5799 102 136 -39 45 -24 153 -91 -22 168 84 150 24 44 -173 -19 140 -120 168 -7 229 74 -30 173
5821 173 129 19 -69 -66 -52 1 21 -160 -161 -130 -70 -52 72 -25 -97 88 -9 -168 -139 -68 80 6 -343 -82 -38 111
5847 111 -246 -96 54 -83 -88 -92 -271 41 -6 -36 36 -70 298 -163 2 22 255 -58 -14 -21 -33 -273 -245 -51
5871e1j13MJ86l9pO6j00j24M6K88j18r5L91m05K42j40j2J43J1j29n9n1J48L2j88
5896g4mP7j42K62k09j67M58k26j38J15O9J08R7j12J7j86j33M87j01j95j2L8J3
5919D2k06Q9M7q0J66k5l34J65R3K75j27j13k94N35j99K8L0P0l53J93RJ22j61J53
5943A25k55J90O8j76K10l78rL11n1j33OJ96l06J95L02n00nK93j60n3K01j31Q2
5966B2J27j42M3j67L39k00J40k10J42J72l62K75j59J78l61J35J73J31m21L21j6
5987A60l3k66j66O03n12J85N3k09K68j32J21R8k3o5J55l07k6N4j72L54j67j84
6009b11O9j28L07j21J67j24k20L65j16l9R6J0j57J88J84k92O0Q3l25%R0J74p6
6032a6l00N51j38k14K03j86J04j7j75K90j33R9n6m3M1q3j13L14Q7l32j72M45r7
$$ plain form
5871 -51 -164 -160 26 -13 -20 46 -54 -178 -132 156 38 -57 334 -71 171 31 19 162 173 44 -15 -66 82 114 -74
5896 -74 -78 -1 -143 119 -90 -257 201 -25 -163 -48 21 129 226 114 131 -55 -188 299 198 3 -9 29 42
5919 42 -164 -75 -28 -108 58 33 -301 -136 -43 232 105 -8 -302 233 34 62 92 162 -191 2 11 133 -28 125
5943 125 -130 60 128 -48 162 -216 -225 86 35 -98 -92 104 -202 -7 295 -205 -210 83 -77 -130 71 -60 22
5966 22 149 7 50 -117 222 22 162 -48 94 266 -96 179 20 198 -163 -28 145 276 -145 176 160
5987 160 127 -139 -305 298 -214 -29 24 -185 83 -49 72 170 147 82 237 -70 -96 -42 -214 140 -27 -211
6009 -211 -142 -270 37 -84 83 -41 -261 104 -12 -51 45 55 -102 86 270 -22 38 121 -204 -204 -114 60 -16
6032 -16 -316 235 97 -117 86 -100 4 -13 -188 102 -31 68 12 -31 10 -73 -186 128 215 -117 -289 156 59
6055E9n5j31p5J02L51k18lj65J38l6J27m6l7j14m3K79j82J64j84j67K34J67q4
6078H1J45k01L2J97j77l23L88j11j46j86N21l18N3L7j52m9L55l87J24K69l35L82
6100A99l71J93P9k40K03J54o8J6k38J22J57o8j36J38k31K7j20R1r4P5K08j19k34
6123b57J98K00kr0o2P2j85L95k53K75k76q3q6J03Qr0P6J23j26j28L10J60k21o8
6147gkO%kK92m18J64J35k17J04O0l0j17Q3r2k66K15L60k53j28K27j36k37M69l11
6172a01K00j61K72j83k30J78j76p5K15P5Q2j53J06J05l00J95k30K26l7l44K37
6193i9J89K05l29L3%m1Q5l9K2k02L18J4l73K32l30J93K92l10L24n10L43j05L0
6216e8Mj32O8J60j03K20m19J82o5J89j02O5N1O9q9J34k63Oj57J40l7K54k91K6
$$ plain form
6055 59 4 -127 -202 -100 251 33 30 -135 3 -33 94 48 11 -103 -146 133 -49 115 -69 -236 -2 165 81
6078 81 226 25 57 254 77 -246 142 31 -115 -301 220 -98 -45 -8 -160 -209 146 -241 -117 152 -183 199
6100 199 -172 21 100 -140 63 217 149 165 -73 49 206 138 2 140 -91 -64 -184 -93 -187 -112 96 -23 -257
6123 -257 -59 141 139 49 -13 59 -126 269 16 291 15 -68 -154 -51 -43 -133 -57 66 -60 -188 122 282 61 -7
6147 -7 -9 -3 -3 -5 287 -131 33 168 -49 55 115 85 -32 51 -41 -307 -92 268 15 -113 114 -22 -259 210 -101
6172 -101 99 -62 210 27 -203 -25 -201 -276 -61 14 96 -57 49 154 -146 49 -181 45 8 -336 -99
6193 -99 90 295 -34 -1 -1 -42 43 4 26 -176 142 156 -217 15 -315 -122 170 -140 184 -326 17 -88 -58
6216 -58 -54 -186 -118 42 -61 159 -260 -78 -143 46 -56 9 60 129 40 174 -89 -83 -240 -100 -137 117 -174 -148
6240a48J93o0J40O0j05k4p6J48L4l34J31j66P8L3J0J2P3J57k54K08O7k74J73m
6264G2n5J72l41j06L66k7n0L1K9K6l2j8j09mJ14j24J58l8J96j15j05j41j54K81
6288B6J22j73K08k02o5J60R1k69J7Oj49J99j25M8J65l7L0M6k51K41q3j15J39M4
6312G3Q9j17L58m08j55L17j92oj30K50J67o01M75q6j79K02R3m6k24J66j14J75
6334A07l08K64J52m14MJ53n5M1J36m6Q1n21N22k45K80j11j22J35J22j86J12p1
6356C0p9K70j02k87L43k64m7J62n1o8R4n8N7j27j03J50K44j47k01M9O7J01j30
6379i7L38k2l19j01O8R7m2k1J66j57N8j17J24J60k41j10L08r6K7j8K67m53M96
6402C15k04j65L6J63m48K75l91L81l33J11O8Q8k22L16k70L91J96k32K0k13L30
$$ plain form
6240 -148 45 -15 125 185 80 56 -20 128 162 -172 -41 -207 -129 -96 -86 -74 -1 156 -98 110 177 -97 76 72
6264 72 17 189 -152 -258 108 81 31 62 91 117 85 67 -42 -46 68 -56 102 64 260 145 40 -101 -255 26
6288 26 148 -25 183 -19 -84 76 167 -102 -85 -79 -228 -29 -154 -106 59 22 52 98 -153 88 5 -110 29 73
6312 73 162 45 403 -5 -160 157 -35 -41 -171 79 246 -355 120 34 -145 57 150 104 -120 46 -68 107
6334 107 -201 63 215 -199 -195 -42 -97 -56 80 34 115 -406 116 -129 151 40 -82 53 175 -11 101 30
6356 30 -49 221 119 -168 175 -89 -136 26 -25 -93 1 -57 0 -127 -230 -80 164 17 -184 -135 -68 33 -97
6379 -97 241 219 -100 -201 -133 -36 -78 -99 67 -90 -32 -149 -25 135 -106 -216 92 -4 23 5 272 -181 315
6402 315 111 -54 -18 145 -303 -28 -419 -38 -371 -260 -192 -104 -326 -10 -280 111 307 75 95 -118 212
6423B12k78P8n6j23O8J37k99L27j05J86N6K4n64L29K0j73K16J11j50r1K06j4j32
6446a5N7k71K38J58o5k60L8J45j9k95J83K69m06L72k77M0J29j6J3J08J9r8m40
6469c93K55k2K56j65K56n2k12Q8L4R7j8p3j96K84J20l58J90l1K01j1m88L29j36
6492d5K3K0k41J78j40K61L8k30J99m8rN5mj29j18J98r9o9K89j26J8j02K16j85
6516e0K80l27KK6N2JQ8jj87N27m12O0j22K17l64J96R3m3j05P7k54J05K25K79j72
6541A91m44L63j05q2L17k39mJ04j60J55L6j11j21J93Rk62L48J7k12M9Rl0J51k15
6565d3J72o13L28K05pn2r3Q4RJ16k58K52j71K25k12Q4j15N4N5n4k3K21k59J08
6589A3q5J82K2m53M78l43J48J79l77K63R3P7k81j7N2J2j37J67J11j55k0j69K00
$$ plain form
6423 212 -66 12 -44 -167 -99 38 -261 66 -39 147 203 227 -337 -8 12 -161 55 166 16 -75 131 117 -15
6446 -15 42 -229 9 167 102 -158 -120 25 6 -289 -106 163 -243 129 -148 -108 21 5 18 126 145 47 -393
6469 -393 -138 -160 96 -69 187 135 -77 11 45 142 124 51 -145 139 259 -99 91 60 261 250 -238 91 -45
6492 -45 -22 -2 -243 -65 -205 56 94 -136 63 15 6 61 57 -72 -190 8 -91 -160 129 3 21 -81 135 -50
6516 -50 230 -97 -95 -69 -17 -16 72 71 -116 411 -1 59 -63 154 -210 -14 79 36 -69 8 -246 -141 84 363 191
6541 191 -253 110 5 -77 240 1 -3 101 -59 96 132 21 -100 93 102 -160 188 205 -7 42 51 21 172 -43
6565 -43 129 -484 -156 49 42 -10 -103 -19 -10 106 -152 100 -71 154 -58 26 -89 -35 20 -34 -57 164 -95 13
6589 13 -72 110 132 -321 157 -186 -38 141 -236 27 120 197 -84 -101 -49 -37 -174 -7 104 -51 -71 -240 -40
6612d0j45L29j85oK73l33k7J65m0p3Q5J48K8j78k68K62j0j12j14L40j70J99j63
6635c5m4J91k23J80N7J79k18j6j31J47j49J70l90J19K49j92J13j51L06k28m7J69
6657E6j34J84k85P2K34l54P8M0J26q4N7J6L3l8M6ln5j4j54R8l4j75j0L33J11j67
6683b3J0J51k34J54J43k38O9k11L50k73J3J73j12N0j39O8O7N4Ok32J54J98k63
6706f5r8J71L8k56J24Q2k02K88l42M76l14k6J73J16j82j01J30m7J04j78P1J81
6728A43m24K17L93j78q2M3j21J02O8j57K45p6l83J93M4k43J66j4Q3J46j43j54
6750a32l9M10j60Q2j21J21P7j81k21l2J8k7Q9J03K52k30K36l05J62j92K48l50
6772a92J26K32o4m1L1J29k16lm8p2j95K9L59P5m02L46j27O4K8K6k27L6Q7r3K52
$$ plain form
6612 -40 -185 144 -41 -47 226 -107 -134 31 -9 -82 3 151 179 1 -267 -5 -15 -127 -241 99 -71 128 -35
6635 -35 -79 112 -111 69 126 305 87 71 -60 87 -62 108 -282 -163 86 -106 7 -144 162 -66 -113 56
6657 56 -78 106 -179 -107 127 -227 -149 -109 17 -67 -10 6 39 1 47 44 -11 -25 -179 -81 -115 -290 -300 33 144 -23
6683 -23 -13 138 -96 58 201 -37 32 -179 171 -102 -89 84 -28 22 -117 -49 18 72 78 -154 0 198 -65
6706 -65 -163 8 46 -210 -86 -4 -206 82 -260 216 -98 -124 49 165 -17 -118 12 -35 69 -109 -38 143
6728 143 -281 -64 329 151 69 112 -9 93 161 4 249 173 -210 -17 27 -216 -50 -64 19 165 22 -132
6750 -132 -171 239 79 161 40 161 238 57 -164 -196 -178 -205 -116 -13 239 9 245 -60 102 -90 158 -192
6772 -192 -66 166 102 61 92 221 5 2 -46 -118 -313 -284 75 150 -252 94 -33 31 59 85 -142 -106 -19 -112 140
6797A40j0j61O2KJ4j17o6R4p1J09nm7K10Q0j52l41L32k57M19n2j50K6j52K05O6
6822A78l23K26r5m0O7j78M3L68l37M2J48j11J6J57j06k92K37j30K31n0j00J95
6844A46J47l18J51Lj93J13j16n3K58n4k16K45j39j40K78j51j8r5K59J31k48k96
6866c06L02L9o1k3J11l1m1j95j28K55n1k35L00J85k4j46r3l1k1R5L36j80j76k0
6890a39K90k41Q2P6r3l56L16p3k39K76K32J46k33P8n4J16j91M6j35J74l0j10M1
6913b1Rp7o9O6J53j32J52j04J6P7k18J4j50J91K57n76N78j0k47K35K0J23r4k09
6937a6k18K21q6R3N3j46J98q1m04O2N11k93%L99k14Q9m01K39Mj74K25l05N1J91
6961bL3l0K5K7R3k68J03n4j17K22rK00l45J5K30l69K04J55p6j2k34K93k6k49J85
$$ plain form
6797 140 130 -31 31 33 47 -70 -136 -42 -113 -4 -9 -56 154 234 82 -259 73 -184 235 183 33 59 -93 112 178
6822 178 -145 81 -14 -54 13 -165 -122 246 -91 -49 99 -12 4 161 55 -237 0 -130 101 51 -49 146
6844 146 293 -25 126 129 -64 49 -67 -120 138 84 -132 113 -26 -166 112 -39 -57 -152 107 238 -10 -306
6866 -306 -4 35 -26 -49 62 31 -10 -205 -333 -78 -129 -364 -64 121 97 -49 -142 -173 -194 -99 237 57 -119 -139
6890 -139 151 -90 -8 68 -25 -381 -65 -138 -377 -101 131 277 44 122 68 184 -7 39 -96 78 48 -62 -21
6913 -21 -12 -89 -158 -92 61 -71 81 -23 -7 70 -148 -134 -284 -93 164 -412 166 156 -91 144 164 287 193 -16
6937 -16 -234 -13 -99 -6 47 -99 99 18 -386 -324 187 -106 -106 293 79 168 -233 6 10 -164 61 -244 -193 -2
6961 -2 31 1 26 53 146 -122 -19 -73 -190 32 23 223 -122 -107 123 -246 -42 113 37 25 -209 84 58 -191 -6
6986fJ17j09j43J19q7M5J07J45k65K22l22K16J49l96L79n5j01j93M03k28Q1j55
7008g7O0M1n4K2J50j58j96K04k2K4j67m9L26n7Q9n1m46K87L55l47j29N9k04M59
7032A19p9J82m58K22Q5j50L39l13m5Q1K05q9k18J75o7J25j74J20k74O5K69k22
7054a02J3k3P3K7r6J34r6J80j13L02j33k93K60k5j51J92j03J13p7N3k18J38j68
7077a13K24k1j08j06p8M6J07K10q5K51k97N0kl61j37J88L56k22Q6K59k17j91Q0
7100h1L45j44J67j42l82J95K00k71p6N0K80m32K82J85l77j25k8L55j94j2J57R4
7122D6m8p3j14L37l9L4J58k39k12J83k2k10n2K97K1q0L1j55L33j78J1l9K24k94
7146h0J17l8K4j13p6K44lj0n4P2q7j28M7J77l5k85J62K31k16n9J68j34k01K64
$$ plain form
6986 -6 111 2 -141 -22 -109 -64 43 188 -77 145 -177 39 188 -208 171 116 15 -178 225 -3 78 -77
7008 -77 -17 24 -30 -8 142 -16 -212 -8 -30 -6 -173 -222 104 47 136 85 -361 -74 281 -66 -195 -136 -340 119
7032 119 40 222 -236 -14 71 -79 260 -53 -98 -17 188 99 -119 56 -11 114 -60 60 -214 -149 120 -102
7054 -102 -89 -112 -39 -12 -108 26 -70 110 -3 299 166 -127 133 108 -43 149 46 159 82 135 -83 55 -113
7077 -113 111 90 -18 -124 -202 -156 -49 161 76 327 30 80 78 -283 -420 -232 124 -98 -12 247 30 -161 -81
7100 -81 264 120 287 145 -237 -42 158 -113 -189 -139 141 -291 -9 176 -201 -326 -354 1 -193 -205 -48 46
7122 46 -2 -75 -189 148 109 143 301 62 -150 33 11 -199 -251 46 67 -13 18 -137 196 18 29 -10 214 -80
7146 -80 37 -1 23 -90 -166 78 75 65 11 83 -4 -132 -85 92 57 -228 -66 165 -51 -110 58 -76 -277 -13
7170a3J40j37j64K54j19p5J92j75K77j76R7j50O2j24J51j13L83k25j05J05o8m7
7192c0k9J10j44P4j35J97P0p6M8l39K84P8j46n2J16K8k70L37k35J62R0m46L31
7215B3K15j69jj81J52O1k47J97Mj16J41n4J07L4m5k18J47J79k64L0J07j13L8q
7239A9j93J07K65j14p1K57j48O2k68M0M2k51J68K35J08l63M97p22K13J12P3j93
7261a25J79K24m49L36j68n3P9M9k24K02k78J11K20J26o6j19j98L65j11m3J95l17
7283f5P4R5nr6n8k0L19q0j13k4r6Q7l8m0K52j85J11k99K69j00jm5k55M61j66M6
7309B8K4o5r5j0K45l78L91l61L03j61K99j57j37j61K3J85J88j24m2j5J93j20J4
7332F7n0j05J20j19k1J21o9j13M5l3L65j42l2j17K39r2j99L1L24l32p2R6N8k1
$$ plain form
7170 -13 127 -10 -174 80 -39 -114 78 -97 180 4 101 -49 13 -111 40 -73 310 85 -20 85 17 -30
7192 -30 -59 51 -93 -19 -154 43 113 37 85 -254 30 108 -38 -90 26 54 -216 121 -114 48 138 -308 23
7215 23 238 69 68 -113 39 100 -147 50 54 -62 79 25 132 166 121 -97 50 229 -35 -5 102 -11 27 19
7239 19 -174 -67 198 84 13 270 122 184 -84 -44 -2 -253 -85 150 258 -105 392 -330 -117 -5 68 -125
7261 -125 54 278 -171 165 -3 -56 23 72 -152 50 -228 -117 103 229 163 44 -154 211 100 57 252 -65
7283 -65 9 104 99 3 -55 -75 244 164 51 27 -69 18 -20 -60 192 7 118 -181 88 -12 -13 -58 -313 148 -18 28
7309 28 52 -13 -108 -118 127 -251 140 -221 82 -79 220 63 -74 -235 -212 -27 161 37 -5 -20 173 53 67
7332 67 17 -88 32 -87 -108 13 -56 -169 -124 -157 208 66 34 -83 156 64 -135 -104 220 -112 -184 -88 -30 -51
7356e1j24K9K57m4Lj29J61r5N2J79l69J26R3j16pJ78j60J8k9j49o0k4J57K7J33
7381E6l7j72K51j65k0N4m02N09l9j7J52J4k45j57L2P4L12k28J56l41L5L72k32
7404c8K94k05j38K0J67m7m5O5n7l8j1j23J95j17r1J86K7r3L5L42k89p9m9K6K18
7429A55j40j05Q1l15K87K5j21ll1K92k56O9n2K7l6K68l74K58n8K11n6k10q5K58
7453H9k02J15R5n6j33Q1K34j66ql15L79l1l42K51K74j48lk00p4pK08k3m03L72
7477a3M3j17J87J12j33j20J58n22N21R9j51L1k06K93j43q2L3J40j94O3P5r4Q2
7500F2Lk0n7J41j1l29J97j9j19J57k78J96L02k29l34M34k50q4K05k63J32J71j2
7523eo2K07k02N0K28l05K26j00k29L67r2K09j89j55K53l52J30j52K19n6p7L17
$$ plain form
7356 -51 -175 -146 111 67 70 -59 102 7 59 238 -131 -5 88 -28 -35 143 -17 1 -28 -177 -237 -261 -104 -77 56
7381 56 19 -153 98 -67 -87 -33 -435 74 35 18 170 184 -61 -218 -186 -112 200 -28 128 -213 -178 194 -38
7404 -38 256 51 -87 -67 100 53 8 73 16 -22 -33 -156 39 -78 -169 17 44 -49 -14 328 39 -40 -89 -63 155
7429 155 15 -90 -9 -324 -37 -12 -133 -136 -167 125 -131 -62 -114 -87 -123 145 -229 29 -29 182 126 -84 -169 89
7453 89 -113 2 97 41 -92 -11 223 57 49 -266 113 82 -260 -9 265 117 114 -86 -160 -167 41 18 -385 -13
7477 -13 30 -87 100 212 79 -41 117 -405 116 215 64 95 -111 182 39 -43 -10 130 -64 -1 74 -20 62
7500 62 65 45 -12 129 118 -211 -14 -33 -152 5 -273 -77 225 -4 -338 96 -154 -238 -33 -296 -164 7 -5
7523 -5 -67 140 -62 -12 216 -89 137 37 -192 175 83 292 103 -52 201 -151 -21 -173 46 -10 -87 230
7545B30l44K25n9k10K19j06Q2l5j95K17J35j22R1k60lK06n5k58J71M60m68J80
7567A01j18O0j39p4M22k65m8J03k26J81K6J01N7j40l5M5o0k7m41L37N35k71k26
7590a02J58Kn4n7J66j2j04j66M5J94j9R5nN7o8k18L33k35R8O8J19k32P2k79O9
7615g5J61j51L9J96k03K26k48K67j12l09K07N0J85k56K5Q2Jk38K40j39k64L77
7637F1n9k40L26j93M5P6j85K21J0j11j12k5J67m7O9k44L49l86L3K67k48L54R7
7660B25l31J14j1l99K43N29m33J7o2J15m7P9k0J46M1k99m3J75M6M5j15Jm9N1k22
7685b04j32L01k66L22L29j96k65j14L14J56k04p6JK00M5j08j62o4O8K57k60J79
7707A21o8r5jJ5P4j25J18l1j64K28m21L84j25J53j18J26j32k75K30j75M02j34
$$ plain form
7545 230 -114 111 52 -158 61 -45 37 2 -193 24 159 37 128 -132 -135 71 16 -242 -71 389 -79 101
7567 101 -17 43 -96 -170 252 -13 -61 42 -184 -3 23 124 181 41 6 51 -9 -36 -477 -140 395 124 -102
7590 -102 56 58 4 -53 113 101 -3 -169 -124 70 51 146 141 198 130 -88 245 10 108 176 295 63 135 -144 -75
7615 -75 86 -65 -26 170 -33 193 -55 212 100 -209 -2 48 233 -23 2 84 85 -153 87 -52 -316 61
7637 61 2 -238 88 -105 -60 16 -169 52 62 -49 -161 -186 -19 -66 3 -241 108 -278 -245 22 -226 128 225
7660 225 -106 8 -3 -402 -159 370 -63 -46 -108 7 -40 39 19 165 206 -93 -136 39 85 130 15 16 -33 18 -204
7685 -204 -336 -35 -301 21 350 154 -111 -225 89 245 41 -35 -34 166 211 103 -59 -123 -55 202 -58 121
7707 121 53 -42 -43 -28 46 -79 39 8 -156 72 -349 35 -90 63 -55 71 -61 -336 -106 -281 121 -13
7729a3N1j25K75l24K02R6k22J57r6MP9ml20K02J50j23J24j75K7J23k4L7l92K40
7753e1O6N3qj62q3R6K51j66J6o9K4j14l8K83nk11r2L61j96q2R1j26J45K2L7j02
7779f0k46J19J59O5k8k06K49j13K11j21J67l14K9K53j45J21l10K70M2k74J81N7
7801A06R2l58L67p3p6j64j19L52J42m26J62q9p5K16n7J25j54j78J61L50l34l7
7823f7k83N10m60J94l7K55j95K17r2q0L12j74k53J56O7o7Q6j71J1r8K13m1K10
7846B13j25K1j94K59k40K25m64L60L48l65q8L51j36k89K43k48N8Q4l9L3l0J39
7868A16q7q4l7K37k60O5j0j02J2q8L69j90J71k03L4L0K3r0K9J25q4%%J02q0O4
7894F2J05k23q8J16j38KJ51k81K15P0m1L30o7l03J36j12j78J65K67l51K68N8k09
$$ plain form
7729 -13 38 -87 188 -136 66 162 -60 97 1 5 84 80 -240 -38 112 -11 113 -62 -35 88 64 101 -291 -51
7753 -51 15 68 60 -102 -185 -89 162 -4 12 -57 -33 -147 -185 98 93 -118 -210 151 -45 -127 -36 -162 -17 5 42 -60
7779 -60 -306 -187 -28 37 9 -197 52 -61 150 29 196 -118 -89 164 19 140 -170 100 142 -132 49 106
7801 106 198 -160 207 134 58 -106 -225 127 269 -157 5 -84 -159 57 0 125 -29 -207 -46 304 -30 -67
7823 -67 -350 160 -300 -106 -143 112 -83 134 42 -38 274 100 -153 3 70 3 89 -82 -71 -169 44 3 213
7846 213 88 109 -85 174 -66 159 -305 55 403 38 -50 301 165 -124 119 -129 -71 13 -26 7 -23 116
7868 116 29 -55 -92 145 -115 -50 -60 -162 -150 -238 131 -59 112 -91 -57 -27 -4 -94 -65 60 -24 -24 -24 78 -2 62
7894 62 167 -56 -144 -28 -166 -164 -13 -294 -79 -9 -50 280 213 -90 46 -66 -244 -79 188 -163 105 163 -46
7917d6m0J16p8O2j81m9M82j96n3r6J05l66M54k81J68j73L94m0j48Q0l10M20k87
7940f3J2NJ34m9K61l65j75L37j83l59K69P6K47l33K82l02J98J9j04L47q6k63o7
7963a62J73j18L62j54j29n2J79k53J87J6J07k91L5l6m1K87q7k06J42j55M57j70
7985I1j29M6l0J08l50N08j72K22j61p8P1o1j29k57K75J93l33J08M4r7J80l5j44
8008a30K98o8j35N2M6q5j31j14R8J28j28L5N19m48J34kj15j22J43j25K42j01Q6
8031G7j09l5n9M9O7r2M9q5K65K12l47J65j78J34M1l4k17k01K69o4J46JJ85k72
8055c3K00RJ58k24o7j19q8J40n0k1L26J56m73J19j94K2J08J45Ql09J2J37K78j74
8079F6m3l1q1P0O1Nk73Q6K80j05j64L0O1K0j39NK99Q9m16j63L40r1M06n22n4L22
$$ plain form
7917 -46 -86 30 -48 14 -167 -216 266 70 17 -79 26 -340 114 -167 1 -172 222 182 34 114 -196 224 -63
7940 -63 -51 -46 88 39 300 -65 -240 97 -86 -445 -176 -100 147 -186 96 -206 -8 11 -93 254 168 -95 -162
7963 -162 11 -107 255 101 -28 -80 99 -154 33 49 156 -135 -100 -136 -177 110 23 -183 -41 -196 261 91
7985 91 -38 8 -22 86 -264 244 72 294 133 55 126 65 -64 -321 -46 147 -186 -78 -34 -131 49 14 -130
8008 -130 168 100 -35 17 63 -22 -153 -267 -169 -41 -169 -134 385 -63 71 69 -46 -168 -25 -150 92 -9 77
8031 77 -32 -67 -126 -77 -10 -102 -53 -138 127 339 -8 157 -21 113 154 120 -97 -298 -29 -93 53 54 239 -33
8055 -33 167 176 334 110 43 -76 -164 -24 -74 -95 231 387 -86 33 -161 -139 -31 114 122 -187 -175 -38 240 66
8079 66 23 -8 -89 -19 42 47 -226 -140 140 35 -129 -99 -38 -18 -157 -152 147 236 -180 -343 -3 -94 312 -210 -264 58
8105E8K11k66j70M9K08j38K35p7r6N4o5K01l24J03m9l0r4K38J85m40J58j46L00
8128A05q2j8J19j68K09j62k1n1J03j26M9L3j6Jj68J6K11l4J41k19J40P6j92J85
8152A31j30j33L74k78m4n1K41k47R6j13J38n6K19K9k96L84k83l45K80J76k38N8
8174h8L5K74k19J12l09l3J04p0O15k61k35K77k58JJ17Kl60
$$ plain form
8105 58 269 3 -167 -118 90 -48 187 110 14 68 3 204 -120 -17 -66 -96 -190 48 233 -207 -49 -195 105
8128 105 23 5 124 -44 165 3 -18 -69 34 -92 -43 -10 -26 -25 -193 -177 34 0 141 -78 62 138 -54 131
8152 131 1 -132 242 -36 -80 -131 110 -137 -41 -154 -16 -72 147 176 -120 264 -19 -364 -84 92 -146 -88
8174 -88 -53 221 2 114 -195 -228 -124 -194 421 160 -75 202 -56 -55 62 64 -296
8191b96
$$ Imaginary data points
##PAGE= N=2
##DATA TABLE= (X++(I..I)), XYDATA
0@%%%%%%%%%%Qj6J6j6K4l2M0m8N6p2Q8j04J20j37J61j92K24k57K97l44L93m47
32b38N08n78O56p39Q30r31J043j164J296j440J598j774J965k171K394k642K915
49A528l212L538l897M296m737N230n784O411p129P958q932J0090j1494J3244j5490
64h380J8493k2750K9281m0687O6299k30268Q6143M59496j68188k98068q4951J89550
76d030Q5780k8675n4504m571m3984K2051O9044K1467q6137m5228O0457Q1007m7722
89B4955p9051J2408O7733Q575k9630k3358N240P918J4682J2672j5810l4314J1815
102a6165L5526M49k8925n349J7037N625j0673K054M321r425k506J4957L944j4169
116c299q050J1350R627q021q136N693M586m269q70L866j837m721M223O026p691
$$ plain form
0 0 0 0 0 0 0 0 0 0 0 0 8 -8 8 -8 16 -16 24 -24 32 -40 48 -56 64 -73 88 -104 120 -137 160 -184 209 -238
32 -238 270 -308 348 -391 439 -492 551 -613 683 -757 841 -933 1032 -1139 1255 -1387 1528
49 1528 -1684 1854 -2043 2253 -2484 2746 -3038 3373 -3756 4202 -4730 5360 -6134 7110 -8380
64 -8380 10113 -12637 16644 -24043 42256 -188012 -101869 357627 189439 -108629 -193580 -4030
76 -4030 81750 53075 -1429 -6000 -49984 -27933 41111 62578 -23559 -68787 -8330 72677 24955
89 24955 -54096 -41688 26045 34620 4990 -18368 -13128 -5210 9472 22144 6334 -27980 -16165
102 -16165 19361 19810 -9115 -14464 2573 8198 -2475 -421 3900 -5525 -8031 6926 10870 -3299
116 -3299 -11349 1 9628 1607 -6529 -836 3750 -519 -1389 2477 640 -4081 142 6168 -1523
131a523o705R125Q590p660j0413M422R554j931o312J338K199j730J331L096k399
146I82n852K223Q267j554q944J74Q201J285n793k781L546O08j438K165J304m556
162b163j687O272K218o577k695O011K560n505j341N464O8n662L80N749O9o135
178b974j089O233J095m683p51L646q48l165K464M339m498n303M539O587k780p829
194e017J104P077P76n721j431L178J218j45k55j555j896J586M058o37m914j125
210c699M857K521l429l085J869K630q38j370J14l55M13J645j25k642n88K563K014
227B495l022k071J970K332p04j973kJ195J5M5N18j329m17J349J110j279j904J016
245f56K226q17j983L74J767l80j126M45R08p61j343J894O53j649m14J058P21n90
$$ plain form
131 -1523 -8228 897 9487 1827 -8586 -4164 5390 3459 -2853 -1515 684 -1046 285 3381 982
146 982 -4870 -2647 5620 4066 -4878 -4704 3497 4782 -1011 -3792 -246 362 -1076 1089 2393 -2163
162 -2163 -3850 2422 4640 -1937 -4632 1379 3939 -1566 -2907 2557 2625 -3037 -2657 3092 3161 -2974
178 -2974 -4063 2170 3265 -1418 -2169 1477 629 -2536 -72 4267 -231 -5534 -995 5592 2812 -5017
194 -5017 -3913 3164 3940 -1781 -3212 -34 1184 1039 784 -771 -2667 -1081 2977 2340 -2574 -3699
210 -3699 1158 3679 250 -2835 -966 1664 826 -544 -430 -785 -372 1273 1148 -1494 -2082 481 2495
227 2495 -527 -2598 -628 1704 1000 -973 -975 220 235 280 798 -531 -948 401 1511 232 -1672 -656
245 -656 1570 753 -1230 -856 911 531 -595 -150 758 -3 -1346 548 1201 -448 -862 196 917 327
263C27j236Q59P16j060l39J406l25r27NJ281P6j498p89K022P09j625j81Q58O38
282I17q48n28P44o7j080R91O20r47k98O22M55l50r88M63R66m55n87M80kN7r5j83
304a13M80p26L58O46l78m00J17L85N1q16K15M29m6m35L78j95k5J69j72L3j20J1
326a54M24Q4m07R5P0J6m09j77M46K52k13j76L58j10q4Q2l4%l54J92P57l76p04
349d22L95K95l14k25K50K11q7k44J94j30J41l4p4L26m33J94K10k3k32j38K63R4
371B17m02j48R6L16j03j45M44n50J37J18J86k14l08R9M80J01r0l57R6J95K6m5
393A49j93j84JN40o5m03j36J31K16R4k62k83K64L75Q5l14k88oL01L84m80k76L48
416bj56L88l18l85L96j21M58l37m80L92M51O1n04k12n0O39J87o28j79l5P30J67
$$ plain form
263 327 -909 -50 666 -394 -733 673 348 -579 -574 707 783 -715 -1504 518 1227 -398 -579 279 917
282 917 69 -459 285 218 -862 129 749 -198 -496 126 581 231 -757 -294 672 217 -370 110 108 165 70 -113
304 -113 367 -359 -1 645 267 -133 -16 369 420 -396 -181 248 202 -233 145 -50 -75 94 -78 -45 -165 -154
326 -154 270 354 -53 42 112 128 -281 -458 -12 240 27 -149 209 99 15 97 63 63 -291 -99 658 282 -422
349 -422 -27 268 -46 -271 -21 190 103 -141 53 -77 64 30 -44 282 -151 43 253 230 -2 -140 123 217
371 217 -185 -333 -237 79 -24 -169 275 -275 -138 -20 166 -48 -356 -257 223 324 234 -123 -27 168 194 149
393 149 -44 -228 -227 313 248 -155 -291 -160 56 150 -112 -395 -131 244 329 15 -273 -279 22 406 -74 -350 -2
416 -2 -158 230 -88 -473 -77 -198 260 -77 -557 -165 286 347 -157 -369 -419 220 407 -221 -400 -435 295 462
438D62l09n01J27L17pJ73l57l45K85L53l3l00n21M84N53K68q32l45J88P11Q1p21
460b69k00J05M72L19j67o62Q4J90M63P2m88l02L77K62L43q01n38O51P07k83p06
481c71L4K99pJ64l62j80L85j40L41K56n42k08L16O12l51p54q7Q46K05m61m15O15
503A95k88L26k07mj70J35M96l30j58l44L75L84K41j071r0P10K24p9p25r6O40J88
525C52k89k70j3j11L13K10m0k40r7N3P00m12l67l76Q28K96k98j001N97O52k16
546B71o5k35Q0j16J49M76j33q15m4M63M61l84q99L43J162l10n91k98M52J42N14
567F23p25m5N1N6P0j59L03m66o2P48M6l97o21L80N79j92k15l54N29N12n36n29
589d04J22M49L4M4l64J01K8l7J57M7l76K5J76N53m89n61M16J12J43m2m98L21K47
$$ plain form
438 462 153 -348 -221 96 89 262 -95 -440 -155 198 165 -135 -656 -172 381 649 -183 -528 -340 371 452 -269
460 -269 -469 -364 108 427 260 -402 -318 -128 335 407 -81 -383 -6 256 599 -202 -740 -89 618 335 -371
481 -371 -337 -38 -45 119 -243 -423 -38 -178 163 419 -123 -331 -15 597 246 -508 -595 251 456 -5 -420 195
503 195 -93 233 26 22 -148 -13 483 153 -5 -349 26 410 651 -420 -510 200 424 345 -380 -476 164 352
525 352 63 -207 -220 -331 -18 192 152 -88 -185 -132 568 156 -211 -587 241 537 239 -762 -165 487 271
546 271 206 -29 51 -65 84 560 427 -388 -432 31 492 108 -791 -448 714 404 -187 -485 -33 109 623
567 623 -102 -147 -96 -40 30 -129 174 -292 -354 394 440 43 -578 -198 381 189 -26 -380 149 661 125 -404
589 -404 -282 167 201 245 -119 -18 10 -27 130 177 -199 -174 2 555 66 -495 -79 33 176 134 -364 -43 204
612B04J14j19l04k07K45K72k20r5p4L14k13K48k43j99P1M08q7l31K41K21k28n4
634c6O8k38J49K38j09j14J38p3K91m25p7j27J77P4K82j3n0l34J49M0j77K28j23
657f2k4J80L25m45n8J74r3Q5j30j19P5L11J37n45K75q6n7J78j31l6k37K93O8m9
681B9k20K45j42J69o3n9J48J35j39k09Q4J33k45K02P5j92q2L7K75k61J83J3l81
704b65M9L96k06q0J48Kj85l1L25J0k46J41jk41Q1K7R2J17nk86K02Q6J16j49k32
729a35K40K8N4j62k06J33l2J33r5P4k9k06K85l91N13j83j34L63l32q7J00K05k58
752a22J29j80j37M59mk07L0K94k00j0j72K96K4q6qK2j51MJ34r7j42Q0k19M42r3
777H6Q5k25R1j4q5P0j42K83k11J50k60j11K71k1J04K69n44J59J08j07J77N4j15
$$ plain form
612 204 318 199 -105 -312 -67 205 -15 -110 -184 130 -83 165 -78 -277 -206 202 115 -216 25 246 18 -36
634 -36 32 -206 -57 181 72 -42 96 23 314 -111 -188 -315 -138 -64 218 205 155 -179 -30 10 -167 61 -62
657 -62 -86 94 419 -26 -84 90 -3 82 -48 -167 -92 219 356 -189 86 0 -57 121 -10 -46 -283 10 78 29
681 29 -191 54 -88 81 18 -41 107 242 103 -106 -22 111 -134 68 143 -49 -131 -94 181 -80 103 116 -265
704 -265 -216 180 -26 -106 42 44 -141 -172 153 163 -83 58 57 -184 -103 -76 16 133 128 -158 44 130 246 97 -135
729 -135 105 133 187 25 -181 -48 -80 53 -42 32 3 -203 82 -309 204 21 -113 250 -82 -169 -69 136 -122
752 -122 7 -173 -310 149 145 -62 -32 262 62 52 -120 176 200 114 106 128 -23 -19 115 18 -124 -44 -263 179 86
777 86 171 -54 37 23 -62 8 -134 149 -62 88 -172 -283 -12 -33 71 340 -204 -45 63 -44 133 187 72
800G2k2j2K31k90nK57k34L51l73J94j84l6J86j40j5%K63j36j31j27J59j41J76
823D3m3K6j74P3J4JlK00k29R2q1Pj51K44m3k13M63k29J72j54j4j55L26Q5q0k06
849b9R8m3l0N2j35K26j33J70j92j69L0J80j69J22j91L22O1k10j67J07M9p3N34
872D10n13J33K0O4l07K39p7J89k19k1K81j25j8J98j97j9L2l14O10m05N1K8J49
895A89k12q1J90nq5j01J17l1J81l38R4J40O0L91l44J06j89j62L43m48J30J12J61
918B18m69K03mJ08r7n0M6M3J45l77N8P2J11LR8P9p8p1q2k95L10J07j90Q3p4M9
944e4j7N5J9K31ql26K66j47R8L7k61K42l49K75n1K71l62k8K19j9K69n61K32J23
968A54J4l14K30l68L22n0l2R4j62L8J94P9j27J38l83K15n0R4p1j84j27N64k41
$$ plain form
800 72 50 38 269 -21 -26 231 -3 348 -25 169 -15 -51 135 -5 -20 -20 243 107 -24 -151 8 -133 43
823 43 0 26 -148 -75 -61 -60 -63 137 -92 0 -81 -74 -225 19 -24 -237 226 -3 169 15 1 -154 172 257 177 -29
849 -29 69 26 -4 48 -87 139 6 176 -16 -185 -155 25 -144 -22 -213 109 170 -40 -207 -100 -51 -124 410
872 410 -103 30 50 114 -193 46 -31 158 -61 -82 199 74 56 254 57 38 70 -244 366 -39 12 40 189
895 189 -23 -104 86 81 -4 -105 12 -19 162 -176 -82 58 118 509 165 271 82 -80 263 -185 -55 57 218
918 218 -251 -48 -52 56 -41 -91 -45 -2 143 -234 -176 -104 7 10 108 187 109 38 -44 -339 -29 78 -112 -29 -103 -54
944 -54 -71 -16 3 234 226 -100 166 19 117 154 -107 135 -214 61 10 281 -81 -109 110 91 360 -201 31 154
968 154 168 -146 84 -284 38 -12 -44 50 -112 -74 120 199 72 210 -173 42 -8 86 15 -169 -296 268 27
991B7k85J94j11L00l37K29Q5j91j39N13j66k82r0L95l38j9M28k18R9n3j21K94
1013B14l07k72O42k92j85K14J8Q3J49j10j46K6J7O0k01Q1Q6J2q8j43M3J58l02
1036b43J29K82R7l39N9q5L8l3R4k6p5J49l8q6j50K60J2k45K52J13k39K06k9m9
1060E4j28P6J93l55K98k07j30K95j92K24r7OQ0Q5l94O8J15J62k10J4K05J23j40
1083A45o6j93K50j25lJ95m18J21J05j50M02j53j21J13k3j42J07m7K17j10k58K28
1105G4j26k06J87K02l20K52qJ04k72j63L01L5k7K9Q9k10q4J16J06Q9j24l03J24
1128a35J36J0j7No5K19j37o2m4J05L7N5n9k02M49k01J69k30J00k01N9Q6J78p4
1152A81j94RQ6k4j72J69K51l58R4r2N3J66l94L00j88L2k4L6Ml12M41j98Q7J69
$$ plain form
991 27 -258 -64 -175 125 -212 17 102 -89 -228 285 119 -163 -253 142 -196 -215 213 -5 94 41 -80 214
1013 214 -93 -365 277 -15 -200 14 32 115 264 154 8 34 51 111 -90 -9 77 89 1 -142 -99 59 -243
1036 -243 -114 168 265 -74 -15 -100 -62 -95 -1 -27 -102 47 9 -77 -227 33 45 -200 52 165 -74 132 103 54
1060 54 -74 2 195 -160 138 -69 -199 96 -96 128 31 37 117 202 -192 -124 -9 153 -57 -43 162 285 145
1083 145 79 -114 136 11 8 203 -215 -94 11 -139 263 110 -11 102 79 -63 44 -3 214 104 -154 74
1105 74 -52 -258 -71 131 -189 63 55 159 -113 -276 25 60 33 62 151 -59 -143 -27 79 168 44 -259 -135
1128 -135 1 11 -6 -1 -66 153 16 -46 -90 15 52 107 48 -154 295 94 263 33 133 -68 -9 77 255 181
1152 181 -13 -4 82 58 -114 55 306 -52 42 -50 3 169 -225 75 -113 -81 -105 -69 -65 -377 64 -134 -47 122
1176A22k7J78k32J50j22Pj17L7Q9J27l3o7k21O9Q7k14J27k36L53J48k09J32l25
1199a77J25J01L4j79N6k3J04j56J73j68J29j64N5K07k90J51l3J90q6n7M3k70K63
1222B8P8p7P8j8J56k23J36r0L8k02K00o7k68L10q2l2N38k86l52J8J77m7N1j36
1246g2K25k39R0O1K5r6j21M2Q0K86k62o1J31l11K32M8m1l8R3j28m6LK15J55k89
1271a8R5k02J27O1n8p8k35J13K09J16k36j55L49q0M9Nl7j71J41j76L52l29k6J29
1295e5NJ35k32J26M7j09J27K6n6j30J70j83J51J50k65K63k12J54k18J03K00m00
1317b03L45k07L4K20j93J5N5J32J11l82K12lj30m1k0J43J36m0l30L3J9j08J79
1340b3j95K73k32N1K92l61%M43l63J22l41K44J95K90m18K81l82R3L9j04N10l75
$$ plain form
1176 122 95 273 41 191 69 76 -41 -4 85 212 179 112 -109 -40 47 -167 -40 -276 77 225 16 148 -177
1199 -177 -52 49 83 -96 -40 -63 41 -115 58 -110 19 -145 -90 117 -173 -22 -55 135 49 -8 35 -235 28
1222 28 106 29 107 89 245 22 158 68 106 -96 104 37 -231 79 -3 -35 503 217 -135 -117 60 13 64 -72
1246 -72 153 -86 4 65 90 -6 -127 -85 -5 281 19 -42 89 -222 10 58 17 -21 72 -56 -102 -99 116 271 -18
1271 -18 77 -125 2 63 5 -73 -308 -195 14 130 -106 -261 88 8 57 62 25 -146 -5 -181 171 -158 -184 -55
1295 -55 -50 85 -147 -21 26 -83 44 70 14 -116 54 -129 22 172 -93 170 -42 112 -106 -3 197 -203
1317 -203 142 -65 -31 189 -4 11 66 198 309 -73 139 136 6 -35 -55 88 224 184 -146 -113 -94 -202 -23
1340 -23 -218 55 -177 -126 166 -195 -195 248 -115 7 -334 -90 105 395 -23 258 -124 -31 8 -96 414 39
1362C9K79l03o2p9J61k38K27j67L05q3R1j42k5j18J18l0P1j23K99l12M0J6L32
1385B96l14r9k7M8L60k88J15M0j05n4J45j52j18Q4J38k16L50j6k20O7k46L40k04
1408g6R1r1P0J04j13r0J67J45k04m9J33R1p7k37n8L50r2k88M18O6k22J36j30j14
1432g0P3M5Qm9K47m00L05L7j41j06PJ55l1j15J89k87k08L90j55j84L94l90L22
1455C6L65m78m9K90j35k4o2N6j42LL46l36M1M8P4j05L38l19p9R1J15J04k14j59
1479a95pP7n7L04R9k76R8j21k95L34L5J19J00p2o7j13k1Q7J07n20M20l3j26K93
1503A70m24R7M1M1K9J26l00K04j37K92j4J16l81M51l48k9Q4Qk15J83j2N6r3j89
1527b44J97q4l5J4J17j65L71j87k6J17Qj17p8J23r9M2K01l73OK45J46k02j4J49
$$ plain form
1362 39 318 15 -47 -126 35 -203 24 -143 162 79 170 28 3 -115 3 -27 44 -79 220 -92 -52 -36 296
1385 296 -18 -117 -144 -96 264 -24 91 131 26 -28 117 -35 -153 -69 69 -147 203 187 -33 34 -212 128 -76
1408 -76 15 -76 -6 98 -15 -105 62 207 3 -46 87 178 101 -136 -194 156 64 -224 194 260 38 174 44 -70
1432 -70 3 48 56 7 254 -146 159 196 55 -51 -44 111 80 -35 154 -133 -341 49 -106 -290 104 -286 36
1455 36 401 -77 -126 164 29 5 -57 -1 -143 -140 206 -130 -89 -41 33 -72 266 -53 -132 -41 74 178 -36 -195
1479 -195 -202 -125 -182 122 221 -55 43 -78 -373 -39 -4 115 215 143 76 -37 -58 29 136 -384 36 3 -123 170
1503 170 -254 -157 -116 -75 -46 80 -220 -16 -153 139 125 241 -140 311 -37 -66 18 26 -189 -6 -18 38 -55 -244
1527 -244 -47 -131 -166 -152 -35 -200 171 -16 -42 75 83 -34 -112 11 -88 -46 155 -218 -212 33 179 -23 -37 112
1551A12k56P1K86j20j08K52k04O8l44K01j6m2L0O6J17Q3n1j70j24R1J51j3j43
1574f3J44J3Mj87N3P4m8Pl1l1mj68L20l09K25j94K93k70J09L9k7jq7n6L38j62
1600a9K05l61K0J90j63J64k11M08l2Jk27m4n7J00M1j1j4L34j61j49J29mk04L3
1624c2O1O4m11L11k8j2J12j47L1L9q9J85M2l13M15j11j70J40j89Q8K44k10p6L1
1648b5j53J94P2L1O7j74J06Q9k27k1J96j59j66Q2j89K79m8J89k54O0J07J84l6
1671B04N5l70q8QM18l58P1J8Q0j17J84k2J17k36K6R2q2R9j78J10o0R3q2L42m10
1696h6L11j56J30l75M41k26j60L20k08r6K09l20K76K16k84j19Q8j01K90K04k71
1717H3l09j15N65j08q1l54K45L7l6KN3j34J35J77k54R9J05N1p7l5j13M1M4K32
$$ plain form
1551 112 -144 -73 213 93 -15 237 33 101 -243 -42 -58 -100 -70 -4 113 196 145 -25 -149 -58 93 80 -63
1574 -63 81 94 98 -89 -36 38 -10 -3 -34 -65 -69 -237 83 -226 -1 -195 98 -172 -63 -24 -51 -52 -139 -195 143 -19
1600 -19 186 -175 -155 35 -128 36 -175 233 201 202 -25 -69 -126 -26 15 4 -10 324 163 14 143 139 -65 -32
1624 -32 29 93 -318 -7 -35 -47 65 -82 -51 -12 -101 84 126 -187 228 117 -53 87 -102 -14 230 20 -56 -25
1648 -25 -178 16 88 119 186 12 118 207 -20 -41 155 -4 -170 -88 -277 2 -46 143 -111 -51 56 240 204
1671 204 259 -111 -199 -191 227 -131 -60 -42 38 -79 105 83 200 -36 -10 82 0 99 -79 31 -29 64 -18 324 -86
1696 -86 225 69 199 -176 265 39 -121 199 -9 -105 104 -216 60 276 -8 -127 -39 -140 150 354 83
1717 83 -226 -341 224 116 35 -319 -74 -37 -73 -71 -18 -152 -17 160 -94 5 110 161 84 49 -64 -23 21 253
1741B53j83l02J64q7J33J70q7j19p0J28L6k7J00M8k71N03m09K58l01Q6k0j68K20
1764E5j60j53K02K33j44r6M5j55P4M43l85M7N4j26J40J5j96K08nl4o7L12p37J51
1788b79J99J53j64O1L5K66o32M30j66k9J62l28L23q8N4j03N9K29k28j00o7L00
1810H7QM5l2l7L1l08M18n4l84L37P1q3J05j73Q4j81K42k50j58L64q8K42j86l1
1834F9J95k90K7q2J70r4O8O6r3j24L35l08J2J6J89k0L4n2j3k03Q0M3P0k06k3J85
1860E1j99L19j45k94L34J27k7k63J35k17K85k09P4L31m77K19O8k78P7J4j4J72
1882H3o9rJ23k32K35lj53j57J10K80m23J69J64k87J48J26j80K56k84oJ75J45l09
1905i8J37k27L22l1L4j28K09l14K83m7l9k33N8K6j77K79J53j89n7K4L3J64l98
$$ plain form
1741 253 70 -232 -68 -155 -22 148 61 -58 -128 0 36 9 109 157 -114 389 -20 238 -63 23 3 -165 55
1764 55 -105 -258 -56 177 33 -63 -18 -173 -99 344 -41 6 60 -66 74 89 -107 101 96 62 -5 307 -430 -279
1788 -279 -80 73 -91 -30 5 271 -361 69 -97 -126 36 -292 31 -57 -3 -106 -47 182 -46 -146 -213 87
1810 87 95 140 108 71 102 -206 212 158 -226 111 182 99 204 31 115 -66 176 -74 -232 132 44 286 100 69
1834 69 264 -26 1 -81 89 -5 63 129 36 -88 247 -61 -49 -33 156 136 170 118 105 -98 -18 25 95 -111 -134 51
1860 51 -148 171 26 -268 66 193 166 -97 38 -179 106 -103 -29 302 -175 44 112 -166 -89 -75 -89 83
1882 83 14 5 128 -104 131 128 -25 -182 -72 208 -215 -46 118 -169 -21 105 -75 181 -103 -109 66 211 -98
1905 -98 39 -188 134 103 137 9 218 -96 187 140 101 -132 -74 -48 -225 54 207 18 -39 -15 18 182 -216
1928b16J43l8K64j36O9R4j52j1j21K70r5J36k43P5k78L37p7J53n7R5k87K55J92
1951C72k30q6Pj07j92K81j00m5P7p0P3k51M30k95J1J52j79J41K60l76pK07pj74
1975a08l0K6K11m6J2l9k19M24K9j84n4k1K6M0K02j73J6j06OJ21j25j26K1J77k15
2000a35K00r2j43J65J7j18J54m6N3l8M1K35l81r7rK43k98L12K19k92J46P1l32
2023a25J50j68j15J53L2Q9MK67k84J15k25N7K8LL3N7R7Jl9j26l3J35RN2qk27J44
2050G6J22nr9J93k20r9K78j33j46J31kj24J63k60k1J78j17M10p6m32K00l38M59
2073A38p4n7k76K57Q9p2O4M3Lp7n8q4J38k43M42l33L58k80O1L7q7k25K06K99j76
2098I3k65n5L05m9j07J37k21J17K53j02m8J89r4k70n6N8L38k74K72k41l5L13n0
$$ plain form
1928 -216 -73 -111 153 17 86 180 28 17 -104 166 71 207 -36 39 -239 98 21 174 117 212 -75 180 372
1951 372 142 56 63 -44 -236 45 -55 -100 -23 -93 -20 -271 159 -136 -125 27 -152 -11 249 -127 -134 73 66 -108
1975 -108 -138 -112 99 53 65 26 -193 231 260 76 22 1 27 67 269 96 112 6 12 133 8 -118 -97 80 -135
2000 -135 65 -27 -170 -5 12 -106 48 2 55 17 58 293 -88 -185 -194 49 -249 63 282 -10 136 207 -125
2023 -125 25 -143 -258 -105 -73 16 20 287 3 118 -107 -50 -22 -19 14 71 168 169 130 4 -29 106 115 167 159 -68 76
2050 76 198 193 94 287 67 -32 246 113 -33 98 96 -28 135 -125 -146 32 -85 325 249 -183 17 -321 138
2073 138 64 7 -269 -12 77 5 69 112 115 38 -20 -104 34 -209 233 -100 258 -22 39 76 -11 -236 -30 269 93
2098 93 -172 -227 78 29 -78 59 -162 -45 208 106 58 247 153 -117 -173 -115 223 -51 221 -20 -55 258 208
2121B08j75M6R7l6q6r0K92n47M22l78L10J9k56P2J52n3j9k11L91l08l9J82R4n
2145H2q6q8J6K48j27j5k51K78j48m7Q0j9N8k77L09j51K20j57l1J21l14K17j50
2168b32J59l7J11j90R5k7J92j8pj38J50q7J9J32k29K8j29K00M3p1J83j36Mn8l12
2193c55M59J56j44j17L13r4k54J24m8j24M1j65L13k40J80rl5q7ro8K72N2k36o8
2217a43P6J33k36J61R8L4n5k79K25JJ44j18p8J40o2Jp5N5K0K2j27K22m30M32l15
2242a54J99J41m14L03R5Q5j96R4j40L8J2q5m5l02K20L86j77k40L12rk86J55M36
2265D28o55J21p7K58p6j34K96n6J07j04j27J69O8n14K06K53l50K86j65J32j04
2286c8k74N19k49J34o4j16op5K27K9j01k16J14J9K52l59j31L38J72m0J56n03K92
$$ plain form
2121 208 33 79 176 140 54 -36 256 -291 131 -247 63 82 -174 -102 50 -3 -22 -233 158 -150 -189 -7 87 82
2145 82 -4 -92 -76 172 45 30 -221 57 -91 -138 -58 -77 -19 -296 13 -138 82 -75 -106 15 -299 -82 -232
2168 -232 -73 -110 1 -189 -94 -121 71 53 46 -92 58 -29 -10 122 -107 -79 -208 -8 35 -36 147 11 15 -43 -355
2193 -355 104 260 116 -1 312 218 -36 88 40 -84 -43 -208 105 -135 45 36 1 -86 -95 -163 109 161 -75 -143
2217 -143 -67 66 -170 -9 89 123 68 -211 14 15 159 41 -37 103 41 42 -33 22 42 64 -63 159 -271 161 -154
2242 -154 45 186 -228 75 170 255 59 153 13 51 63 -22 -67 -369 -149 237 60 -180 132 123 -163 -8 428
2265 428 -227 -106 -183 75 -1 -135 161 105 212 108 -19 150 218 -296 -90 163 -187 99 -66 66 -38
2286 -38 -312 207 -42 92 28 -88 -94 -169 58 87 -14 -230 -116 -97 155 -204 -335 3 175 135 291 -212 80
2309H0j74J6J23m9k8K12m73J80R5L0k58N26j3j34n0k14L42j61O5j15j75L33k29
2332g1K03k75RpL5N2J11l72L4K06Rj0r6n2L00j20p7J58QR9m00L95J9k72O2l6J91
2359A03j49L81l94M5J66j41j68N4OQ6N2Q3j98P7K06j20k10J90o6p5K74k06k16
2382b20J93k9N8j65L56r1k75L41rN5J26m07M27n83K17J85l2K6k61K78jl55P9K30
2406A43Q2j90q0k43J93k0K68J81m92L9R4oK64j67J9j73J4m0J1J24k69L37j00K5
2430A4j30L37k84K4L40l17J4J65j62J99m19K15O7R1l03N0K66l36M91l72L01l94
2452a43mP3O5j46J96J66k55k0j76K06m20N24k78O3J95j05o1K90j54j42J10P2j19
2475f3K2r4J08l4J84l98K47N8N7L3m0L8j01n0oO2m2J16jr4R0r7j45K93k46J87
$$ plain form
2309 80 -94 -78 45 -4 -32 180 -293 -113 -18 12 -246 280 267 133 83 -131 211 50 115 0 -175 158 -71
2332 -71 132 -143 -134 -141 -106 -54 57 -315 -281 -75 -66 -76 -172 -224 76 -44 -121 37 45 144 -256 139 158 -114 -52 -88 103
2359 103 -46 335 -59 -14 152 11 -157 -103 -97 -11 41 124 -74 3 209 89 -121 69 3 -72 202 -4 -220
2382 -220 -27 -56 2 -163 193 102 -173 168 159 214 340 -67 360 -223 -6 179 147 173 -88 190 189 -166 -87 143
2406 143 225 35 -45 -288 -95 -115 153 334 -158 -119 -25 -31 233 66 85 -88 -74 -114 -103 21 -248 89 -11 14
2430 14 -116 221 -63 -39 301 -16 -2 163 1 200 -219 -4 63 154 -149 -99 167 -169 322 -50 251 -143
2452 -143 -147 -74 -9 -155 41 207 -48 -68 -244 -38 -458 66 -212 -149 46 -59 -120 170 16 -126 -16 56 -63
2475 -63 -41 -135 -27 -61 123 -275 -28 30 87 120 80 118 17 -33 -39 23 -19 97 96 2 92 -5 -150 143 -103 84
2501H4j0j39J77j14oK55k83k99O03m66R0Q5k11J87K45j52Jl4m5L03k58m8oj23
2525a64K00l20N02j3o3m0j18p1OJ35n9k49J22J96k03R9K0J56n8k6P6k20N7p4K56
2550A47l6k59J72k53J39j02J71j43K95K7j83p2J89j32n8J72Q3n9M4j47L37n48
2572b16J83J74j71o5o5K1L85k91K66k52O4k56M61k69N8j09J24q1o8L01r5l01M04
2595B02j47j0p4j61R3j51L30q5J98k12L33m03pR3R4l29J60o6P6M6n6K4J87j95
2619f0K2J06r6P6l3j3K1j43K10n8k61L02mj80Q2J13k29Q9P5j42J95j66J73j99
2643a20L49m21L08j01k94K61R0j66j29O4J8L52J4j84m33J87O8K73j6m3j17j23
2665a63J06j48O7o6J67q4K41q3J06j07L17l54K42j86j91K88m46M30k05j27K59
$$ plain form
2501 84 74 -65 112 -2 -8 247 -36 -335 268 -198 -108 -23 -234 -47 198 46 47 13 -32 271 13 -35 -41 -164
2525 -164 36 -284 218 205 142 102 -16 -87 -81 54 -5 -254 -132 64 -139 -40 -20 136 78 52 128 -92 -35 -109 147
2550 147 111 -148 24 -229 -90 -192 -21 -164 131 158 -25 -97 92 -40 -98 74 157 98 142 -5 332 -216
2572 -216 -33 141 -30 -95 -160 -139 246 -45 221 -31 33 -223 238 -31 27 -82 42 -39 -107 194 99 -202 202
2595 202 55 45 -29 -190 -97 -248 82 -3 195 -17 316 -87 -94 -1 93 -236 -76 -142 -66 -20 -76 -52 135 -60
2619 -60 -38 68 -28 48 15 2 23 -120 90 32 -229 73 69 -111 -29 84 -145 -56 19 -123 72 -94 79 -120
2643 -120 229 -192 116 15 -279 -18 72 -94 -223 -159 -141 211 225 41 -392 -205 -137 136 120 77 -40 -163
2665 -163 -57 -205 -138 -204 -37 -121 120 37 143 36 353 -1 241 55 -136 152 -294 136 -69 -196 63
2686F3k7M9k90K12n4K9q6K54p7k6l60K13R5j55j31L34n5J06J55l29j62K64J57
2709A79l00K29r5L17l14J27j09j52P0J5J70k14m2J36k90M22k62J90J30l73M40
2730B74m85J89k17M20l59J40K1jo3J38q3p3J00J69j2Kl8r0j98oQ2J9J83j62m8
2755i8k8J78pL6j05J04l37M41k52J24K41l92k21K90J29r8j09M42j73m4l9N5j67
2778c0L3N8nk88L86k43J43j11l3J62j70k4J14K14j68L3l44L73o5l3n4q0r5M00
2802A73J04l38K70j39p1J07Q3m40K43KJ69j00k34K32n0j57K86j29n0J05J27k87
2824i4qK55r5o5L0J93j82K61m72K69r6J01j60J04j87J96j70j9P2l7L56M0k95j
2848dJ7K1J01N0j38j29J49K18k69K25q2j50J3o5kJ15j06k05K78oQ3k21j51N60
$$ plain form
2686 63 36 85 -205 7 -47 -18 -104 150 73 47 -313 -100 -5 -160 -291 43 -12 94 249 -80 -242 22 179
2709 179 -121 108 13 330 16 143 34 -118 -48 -33 137 -77 -119 17 -273 149 -113 77 207 -166 274
2730 274 -211 -22 -239 181 -178 -38 -17 -18 -81 57 -26 -99 1 170 158 160 122 32 -166 -172 -90 -71 112 -50 -98
2755 -98 -126 52 45 81 -24 80 -257 184 -68 56 297 -95 -316 -26 103 5 -104 338 165 121 82 137 -30
2778 -30 3 61 56 -232 154 -89 54 -57 -90 72 -98 -122 -8 206 38 71 -273 100 35 2 -52 -132 -227 173
2802 173 277 -61 209 70 -1 106 189 -251 -8 -6 163 63 -171 61 11 -146 140 11 -39 66 193 -94
2824 -94 -102 153 58 -7 23 216 34 295 -177 92 -4 97 -63 41 -146 50 -120 -139 -67 -104 252 292 -3 -4
2848 -4 13 34 135 185 47 -82 67 285 16 241 159 9 22 -43 -45 70 -36 -241 37 31 114 -107 -258 302
2872C02j70k88K76K8p5k44R8J91l7m6K6k18L59l8k93l2J12J25J21m99L50J84L
2895B35l64K34j40q6P9M8P7K35k48lJ53l41J05J50R9j30k11J69PK53m77J8J29
2918iK4L5l65K28J68j61L5o4J51N8l67J43M03n30M65k56K4K13l46J80J18K4k61
2941i0L4m2L41k6j80k19J66J36k54J07P1j18j46K75J04nj4L2p9n4j84K24P1j2
2965A38l5j05R1k55L88j15r8J20K1j24J14j51o5K07j16j4q8q3J86l50L46q1J79
2988A10k0q3M62l97j1M4o4j83J82k33j2J63L3k64L35k0K2j18l8L9K49m83K97m6
3012c6n7r9K95q4k26j32L66l42K14L7q1J07J5K8o3j70R5K88M1l07J2K00q0Q2J26
3037B29k35j06M81l73j80L03j84p3l8L60k65J5J35J8m17K09J42K7j29l4k02J28
$$ plain form
2872 302 132 -156 120 148 73 -171 -73 118 81 35 61 -157 202 164 -129 -161 -49 76 197 -302 48 232 235
2895 235 -129 105 -35 -121 -42 6 83 318 70 67 220 -121 -16 134 233 103 -108 61 68 321 -156 -138 -9
2918 -9 15 50 -315 -87 81 -80 -45 -109 42 100 -267 -124 279 -251 214 -42 -18 195 -151 29 147 171 -90
2941 -90 -56 -98 243 217 37 -182 -16 120 -134 -27 44 -74 -220 55 159 154 140 172 93 39 -145 79 150 138
2965 138 103 -2 89 -166 222 107 9 129 150 26 140 -11 -76 131 15 1 -87 -170 16 -334 12 -69 110
2988 110 90 7 469 72 61 105 41 -142 40 -193 -205 -42 -9 -273 62 42 64 -54 -92 -53 196 -287 10 -36
3012 -36 -93 -192 103 19 -207 -339 27 -315 -101 -64 -145 -38 -23 5 -58 -228 -133 155 196 -111 -99 101 21 103 229
3037 229 -6 -112 369 -4 -184 119 -65 -138 -176 184 -81 -66 69 87 -330 -121 21 48 -81 -115 -317 -189
3059a89M76m59l4L48l7r0m0N3Q0k32J26K38k65m3j39K71k55K44O8l21J00J13r1
3082g8O6K6M4k6o5J38J21j29R0m63K33J16k30L16k69J55L0j21M0r0P8j8P0m1j74
3107a81K5L55k43j53M47n26J61J25J54j28j75J31j29P3K91j42k52OK81N8k79M8
3129e3J24j38J5L16k21l1K71l63L41k68j61J26J86k28r5K96l96M97j30R0j24j65
3151a11K48r4J06N8j16K1j05n4J78P9k68L12k84J41j03N0q6J3k4n0j13K49k50
3174b03L9M34j53m0k82K22K3J19j55J41j46P5k46J60J54k81M07l13K42K4l78L18
3196A61r1q6j5L6J43j49J15m9L5r3j67J05M2j65K27j79K26P2l76q9N42j02j34
3219IK14jj18j88N9j03K62j62q7M00l91J94q7j43kK38Q4J0k41l0K2J1L04l43O5
$$ plain form
3059 -189 287 -172 -206 142 105 15 -25 28 108 -124 2 240 -25 -68 -207 64 -191 53 121 -200 -100 13 -78
3082 -78 -12 14 58 32 -33 105 226 97 187 -276 -43 73 -157 159 -110 45 75 -46 -6 -96 -18 -36 34 -7 -181
3107 -181 -156 199 -44 -197 250 -276 -115 10 164 36 -139 -8 -137 -64 227 85 -167 -161 120 178 -101 -53
3129 -53 71 -67 -52 264 43 12 283 -80 261 -7 -168 -42 144 -84 -179 117 -279 218 88 178 54 -111
3151 -111 137 43 149 207 91 112 7 -47 131 210 -58 254 -30 111 8 58 -28 -15 -39 -89 -202 47 -203
3174 -203 -164 270 117 77 -205 17 40 159 4 145 -1 74 -172 -12 142 -139 268 -45 197 221 -157 161
3196 161 70 -16 -31 5 148 -1 114 65 100 7 -160 -55 -13 -178 49 -130 96 168 -208 -297 245 143 9
3219 9 223 222 104 -84 -25 -128 134 -28 -115 285 -106 88 1 -142 -144 94 178 188 -53 -83 -61 -50 254 -89 -24
3244b4J13r6Q9j74J74j80n4PJ47L3J71l76K81kl06L50k8r0J88j37j48K80l63M74
3268C29l49J21r2R4j71K59j26j17R9k5J47j84n6j02j0M45k40j42J90l62J57J37
3290BJ36j59J85M6k78J24R1O1l21R8j23l4K52r6J71L44n39n8n2M2K99l32O3J27
3314D9l1j99L14k77J8Nl59K05M18j51%K24q7j04k7j31R2K45k32N6K20j21j28R6
3338I5j32J30J56l54J42K57j36L3l6j83R0J23l27J93J42k51j75K63J37k61R3j58
3360a59j0P8Q0J85k63J09J56k32J06o5P3J49k89J68k39J21J36n58N66O6k62k9
3382a13K5L41j42J28j45J45j90j22K46k24j04J96j0j55m4J67j30K53k18J41j79
3403a34QK80O5k93K04j60K33k10J0j18K9J54k90L29j14N8k16L49l30j29J74J78
$$ plain form
3244 -24 89 -7 82 -92 82 -98 -152 -145 2 35 206 -170 111 109 -197 153 125 35 223 86 -62 218 -145 329
3268 329 -20 101 9 103 -68 191 65 -52 47 22 169 -15 -71 -173 -183 262 22 -120 70 -292 -135 2
3290 2 138 -21 164 210 -68 56 147 208 -113 -15 -138 -172 80 -16 155 499 -40 -98 -150 -108 191 -141 -78 49
3314 49 18 -181 133 -144 -126 -121 -480 -275 143 -8 -8 216 129 25 -2 -133 -41 204 -28 28 248 127 -1 95
3338 95 -37 93 249 -105 37 294 158 191 155 -28 62 185 -142 51 193 -58 -233 30 167 -94 -1 -159
3360 -159 -169 -91 -11 174 -89 20 176 -56 50 -15 58 207 -82 86 -153 -32 104 -454 112 178 -84 -113
3382 -113 -88 253 111 239 94 239 49 -73 173 -51 -155 41 31 -124 -168 -1 -131 122 -96 45 -134
3403 -134 -126 154 219 -74 130 -30 203 -7 3 -115 -86 68 -222 107 -7 51 -165 184 -146 -275 -101 77
3425G7j84K12p5nO1j25j02O7K48l80K93J20j49r4k01K68R6ln7k06m1K73k00K69
3449A62l20Q3J42l31L28J0PM1o2O8j85J19K4r8p2L65k59p3r7N11l23Lp8K35j62
3474C8p6J30J06m4p4k3q6Nl20L29pn4m9R6k1R9L5jjm9m32M56o0J74l3q9J15l41
3502a77L49k35J5l1J08L3p0M39k84j57p9K78j4k25j25L63k91J17J8j48K07l19
3524b28j7L27k85J10J91k64M33k04J40k56L32l91R4K1k2l4J8K03r0j26P9k61K31
3547Apj01j29K52N9j36o2J2J32Kj28K82l01N8r5J0p3LR6J41q6Q1J73k76Q9j48
3573a51N13k93q9m9J36k14K9K31l61M29J60m29J17q4N6j38K78k43K2j00K23j98
3595a55K7K00j70J50j51J38Qj58L1j31J8K29n6J26j99M69l07j11j7J47K1l8R7
$$ plain form
3425 77 -107 105 30 25 86 -39 -141 -74 174 -206 87 207 58 -36 -237 31 127 124 67 -139 -180 93 -107 162
3449 162 -158 -75 67 -264 64 74 81 122 60 128 -57 62 86 -12 -84 281 22 -51 -148 363 40 43 -35 200 38
3474 38 -38 92 198 154 80 57 -29 -24 -344 -15 -22 -76 -125 -29 -50 49 84 83 82 33 -399 57 -3 171 138 49 164 -177
3502 -177 172 -63 -48 -79 29 62 -8 431 147 -10 -89 189 175 -50 -175 188 -103 14 32 -116 91 -228
3524 -228 -245 82 -203 -93 98 -166 267 63 203 -53 279 -112 -18 3 -19 -53 -35 168 78 -48 31 -230 1
3547 1 -6 -107 -236 16 75 -61 -123 -111 21 23 -105 177 -124 -66 -161 -151 -224 -221 -125 16 -70 11 184 -92 -3 -151
3573 -151 362 69 -20 -69 67 -147 -118 113 -248 181 341 -88 29 -55 1 -137 141 -102 -80 -180 43 -155
3595 -155 -128 72 -98 52 -99 39 47 -111 -80 -211 -193 36 -20 106 -93 376 69 -42 -59 88 109 71 168
3618A68mq1l6J55l49L07p9q6j15K43K3j24j68J32K30k23j10K28j15r7K22rm14
3641c02L36k1J4o3j6J73k08L1rM7k18LK01n7J7J2o2J80jL6J06j85K76m79L69j57
3667B3on4K0k9J77n33M21NK2N6l4j52K37l38K05m5j53P0R1q4K33p7J16r2O4j20
3693B3o3J06l94M26m4j58N2J63k88L88m35K08pn6K4J47P2l43N10m69K58j7M0k26
3717h3J74o4N2j28L6J72j80M2Q7k50J56p4M15l11k26J24k90K47p6J68j5j31M14
3740B59m17J38P5j62qq9l5J17M4J47K2R9k08Pj57K52j50J54r6m41M42%K6o1j1
3765e3Q3J41j59J89k19O0j46J7n5J49j6o9J54q4J26j89j86M0K39l20M04j20n3
3788f7J93l60K91j07J82k39K61k49J57K53p2k25j46J12j22R1L9J93K3m36J52M7
$$ plain form
3618 168 164 83 47 202 -147 160 81 -5 -120 123 146 22 -146 -14 216 -7 -117 111 -4 -101 121 112 -302
3641 -302 34 13 27 -36 -52 121 -87 -56 -65 -18 -236 -233 -32 -89 -72 -60 -122 58 57 93 199 14 290 -189 180 23
3667 23 17 -37 -17 -46 131 -402 19 24 46 102 68 -84 153 -185 20 -25 -178 -108 -17 -101 132 55 171 79 143 23
3693 23 -40 66 -328 98 54 -104 -52 111 -177 211 -224 -16 -23 -79 -55 92 164 -179 331 -138 120 103 143 -83
3717 -83 91 27 79 -49 -13 159 -21 21 108 -142 14 -60 355 44 -182 -58 -348 -101 -177 -9 -24 -155 259
3740 259 -158 -20 55 -107 -115 -204 -239 -122 -78 69 91 190 -18 -11 -168 84 -66 88 -8 -449 -7 -7 19 -42 -53
3765 -53 30 171 12 201 -18 42 -104 -87 -142 7 -9 -78 76 -8 118 -71 -257 -217 22 -298 106 -14 -67
3788 -67 126 -234 57 -50 132 -107 154 -95 62 315 243 18 -128 -16 -138 -47 -8 185 208 -228 -76 -29
3810b9M8p8J28N6k64K51O5Q5j78L8j08k52M7K16k35K11PK9k08NM58m13J31Qm5
3835b7j51K97O9k36l0Q2m00M99J22k86J7p0k1K63j12J3K4j69j09N00l26O5J44
3858A58k21K42j50k02K53k55K23j25K09j02lK1j57J33K3k13K40L05k12m3j77j46
3880a99j28L02O5l38M36j67o1j42M11l38K37K07m02P2P3Q0P5p8m8l3k73K66j10
3903i3J2Q5M3j16N7k13K10r8M4k6j58K54J25l19L74k68J47k29K2J90J62j75J17
3926A47l95J03K67p0L1k6l9j65j54M12j89k9j48L25L8j29P7n2p0M1J88k66K07
3949A04k60K10j33l9K80k46N4m1J05lk33M3J28L16k7o7l38L32l21O4J16j68L59
3972B35r7k84J58R3k82L45Rj1j34m4M8K9P0j45O4j93O9OJ24j24J28l06K62L24
$$ plain form
3810 -29 19 -59 69 125 -139 112 177 262 84 122 14 -238 -191 25 -210 1 8 37 -171 -166 292 -121 10 18 -27
3835 -27 -178 119 188 -48 -78 4 -396 103 225 -61 -44 -114 -135 128 16 29 53 -116 -225 275 -51 14 158
3858 158 -63 179 29 -173 80 -175 48 -77 132 30 27 48 -109 24 47 -166 74 379 167 124 -53 -199
3880 -199 -327 -25 40 -298 138 -29 -90 -232 179 -159 78 285 -117 -45 28 108 183 105 57 24 -249 17 -93
3903 -93 -81 4 47 -69 -12 -225 -15 -113 -69 -95 -253 1 126 -193 181 -87 60 -169 -147 43 205 30 147
3926 147 -248 -145 122 52 83 57 18 -147 -301 111 -78 -107 -255 70 108 -21 56 4 -66 -25 163 -103 104
3949 104 -156 54 -79 -118 162 -84 -30 -71 34 31 -202 -159 -31 285 258 191 -147 185 -136 -72 44 -124 235
3972 235 138 -146 12 105 -177 168 177 166 32 -12 36 65 135 -10 54 -139 -70 -64 60 -64 64 -242 20 344
3996C44l15j78J44J38l18K57j31J31m8j33L58k56j15L96j83k34N57m14l8lJ12
4017G1j6o6K63l82K5l5L82l05o0K57j01m1Q2K23k79J70p9L2l01k28M7K78J91J18
4041B46k65n3K89r5N7j23k79K02L6k02J06J50j36J04R2j35l5O8r2K25m3j03j06
4064i2O2j77J90k03J18J12l3j09N8j08K81j10j01K07k78R2J70j79J04p4J61j0
4086H1L2j41L69k48%j06L2O8k23K37M54m62r8J32j10p9J73j17K99k45j10J78j53
4109c7O8j21j00K6J49l0j8L7j25j15J30L22k58J00n8%K5J04k28J57o8L13l64K07
4133A16l24L90j60o3K1j21K81J89m09L8k51K20j39P1K0L41j70k82rM2O4o2J69
4156b8K8J4r1K63L8l95J27K3o7K58k2q4l01K09J6Q0R9q0o8J77Oj61j0o8N9j41
$$ plain form
3996 344 29 -149 -5 133 -185 72 -59 72 24 -109 249 -7 -122 274 91 -143 414 0 -38 -41 71
4017 71 55 -11 252 -130 -105 -140 242 -63 -123 134 33 -8 74 297 18 188 109 141 -160 -388 -341 -63 128 246
4041 246 -19 -72 217 122 179 56 -223 -21 15 -187 -81 69 -67 37 129 -6 -41 27 -65 160 117 14 -92
4064 -92 -30 -207 -17 -220 -102 10 -23 -132 -74 -182 99 -11 -112 95 -183 -91 79 -100 4 -70 91 81
4086 81 113 -28 341 93 93 -13 19 87 -136 101 555 93 -5 127 17 -62 111 -6 293 48 -62 116 -37
4109 -37 31 -90 -190 -164 -15 -45 -63 -26 -151 -266 -136 186 -72 28 -30 -30 -5 99 -129 28 -40 273 -91 116
4133 116 -208 182 22 -41 -20 -141 140 329 -80 -42 -293 -73 -212 -141 -121 220 50 -232 -241 -199 -135 -197 -28
4156 -28 0 14 -77 186 224 -171 -44 -21 -88 170 148 64 -237 -28 -12 68 167 87 19 196 202 41 31 -37 22 -119
4182a19K31j66Kjk8q1J58m5n5j27K17J67m2j38m8QK06k37J84k81K37M8k63J67
4206fJ20j15mj7L0J42k68rQ2K79j92q0k7K90n3l01o2J86K0rk58N26k22l26K23
4231e1j2L88l12p5r3K98J3k46Mj23L55j86L64m83M38m79J80O6N6Pn8J28K7k36
4255c0j32J99k78J24J37J74j73%J2pk46J95K95k87J02J53n16M36j20J42q8j84
4277i2p5J33j30k4J46j00K13q8J15k79J64j64J73J40j03J87l72J24O6J35j26q5
4299d2J22l3r6J33J37k0n0l4k12K35j04J1K52l75J36k17K91j25K8J52m12K23j58
4322a58Q8l5mK97k56j76L45l8j66K11j62J35m0r2K7j22J35n9K2J55j89K18j04
4345C2J45k45J36j07j53K63j14J21j47q8K02P5Q3l34M43k97k59j1J42qq5K29j10
$$ plain form
4182 -119 112 -54 -52 -53 -81 -162 -4 -49 -104 -231 -14 153 111 -27 -75 -67 139 -98 86 -195 42 90 -173 -6
4206 -6 114 -1 -5 -22 8 150 -118 -127 -45 234 42 -38 -65 225 172 -129 -191 -5 15 6 -252 274 52 -274 -51
4231 -51 -63 325 13 -62 -155 143 156 -90 -86 -209 146 -40 324 -159 279 -200 -20 46 102 109 51 179 206 -30
4255 -30 -162 37 -241 -117 20 194 21 21 33 26 -220 -25 270 -17 85 238 -278 158 38 180 92 -92
4277 -92 -167 -34 -164 -188 -42 -142 71 -17 98 -181 -17 -181 -8 132 29 216 -156 -32 34 169 43 -42
4299 -42 80 47 -49 84 221 201 151 117 -95 140 36 47 299 -76 60 -157 134 9 37 189 -223 0 -158
4322 -158 -70 -105 -109 188 -68 -244 101 63 -103 108 -54 81 41 -51 -24 -146 -11 -70 -48 107 -82 136 32
4345 32 177 -68 68 -39 -192 71 -43 78 -69 -157 45 120 203 -131 312 15 -244 -255 -113 -121 -206 23 -87
4368h7O7K07k94J60p6O7Q7l06k4j87K10L93J43m72l7P7L03j48Lk78M03j94j07
4391i0J29k12J38j61N29m23o5K54jj25k09K15o2L38l53Ok8L38k55j15J32J57l08
4414a71K61m7L9k8Q7k06k23K46p2L06k84P1J34k94K39r8K28Q8k89j00N5J68n2
4437E8j92J96R8l46J91K7j0J0l34J47J44P9k3j04l6M3J01p1o3j41M35l1l09P4
4461e7J55j44J25P2l34K85r7k14L11o6j64J99k39p3M39l32K23j46k69L56k07K55
4483G8k50K60j29R6r2Q1j06Mo2L15k02K34l38JJ27R8r1j43J79Q0j72J47l2J12
4507A95k17J48l01M5K16o9j47J04P1k41Q1J47q7R6o0Q2j01L08N0m81J58nJ70k36
4531g4K08pk25P8n0K8j8q1Q6l3M12j91l50L10K56n74Q1J23J93n5l59L74r4J39
$$ plain form
4368 -87 -20 187 -107 53 -23 44 131 -175 -199 -386 -176 217 360 -112 -149 -72 231 83 86 -192 211 17 -90
4391 -90 39 -173 -35 -196 333 -90 -155 99 98 -27 -236 -21 -83 255 -98 -92 -120 218 -37 -152 -20 137 -171
4414 -171 90 43 82 54 141 -65 -288 -42 -114 192 -92 -21 113 -181 58 -40 188 276 -13 -113 -58 110 58
4437 58 -134 62 160 -186 5 32 22 32 -302 -155 -11 68 45 -59 -95 -52 49 -22 -85 -226 209 178 -131 -57
4461 -57 98 -46 79 151 -183 102 5 -209 102 36 -128 71 -168 -241 198 -134 89 -57 -326 30 -177 78
4483 78 -172 88 -41 55 -37 44 -62 -58 -120 195 -7 227 -111 -110 17 115 24 -119 60 140 -32 115 83 195
4507 195 -22 126 -175 -130 86 17 -130 -26 45 -196 -115 32 -55 41 -19 63 -38 270 320 -161 -3 -8 162 -74
4531 -74 134 127 -98 -20 -70 -42 -60 -141 -55 -88 324 133 -217 93 349 -225 -144 -21 172 117 -242 132 38 177
4555A77K13m44n8K61k02j2K29l50J86j01L3j2K85k38J44l32P7J62O4k2j89q1M39
4578B29l70J09Q0J45j10k21M99n53L74j08J8O7k91R8n6J73j84J32j39P4j25JJ19
4601c9K7J82q5J2j72L17k92J66l32M24q7j54J84l62K53n0j01R1Qq6J45k80J70
$$ plain form
4555 177 390 -54 -112 149 -53 -65 164 -186 0 -101 -68 -80 205 -33 111 -221 -144 18 82 60 -129 -210 229
4578 229 -141 -32 48 193 83 -138 361 -192 182 74 92 159 -132 -34 -90 83 -101 31 -108 -34 -159 -158 -39
4601 -39 -12 170 85 97 -75 242 -50 116 -216 208 121 -33 151 -211 42 -8 -109 -18 -10 -96 49 -231 -61
$$ [...]
8191A54
##END NTUPLES=NMR FID
##END=
