##TITLE=1H_Pr Et-D
 200.13MHz, CDCl3,
 8 sc
 
 26.5.2025
##JCAMPDX= 6.0         $$ Bruker NMR JCAMP-DX V2.0
##DATA TYPE= NMR FID
##DATA CLASS= NTUPLES
##ORIGIN= UXNMR, Bruker Analytische Messtechnik GmbH
##OWNER= pz
$$ XWIN-NMR		Version 3.5
$$ Mon May 26 16:27:57 2025 Russian Standard Time (UT+4h)  she@DPX200
##.OBSERVE FREQUENCY= 200.1313
##.OBSERVE NUCLEUS= ^1H
##.DELAY= (6, 6)
##.ACQUISITION MODE= SIMULTANEOUS
##.ACQUISITION SCHEME= undefined
##.AVERAGES= 8
##.DIGITISER RES= 18
##SPECTROMETER/DATA SYSTEM= spect
##.PULSE SEQUENCE= zg30
##.SOLVENT NAME= CDCl3
##.SHIFT REFERENCE= (INTERNAL, CDCl3, 0, 14.3821)
##AUDIT TRAIL= $$ (NUMBER, WHEN, WHO, WHERE, WHAT)
$$ ##TITLE= Audit trail, XWIN-NMR		Version 3.5
$$ ##JCAMPDX= 5.01
$$ ##ORIGIN= Bruker BioSpin GmbH
$$ ##OWNER= she
$$ F:/spectra/data/she/nmr/H-C/1/audita.txt
$$ ##AUDIT TRAIL=  $$ (NUMBER, WHEN, WHO, WHERE, WHAT)
(   1,<2025-05-26 16:26:07.89 +0400>,<she>,<DPX200>,
      <created by zg, POWCHK disabled, PULCHK disabled
       configuration hash MD5:
       00 E9 B6 7A A2 85 ED C7 34 08 36 98 17 FE 4E 26
       data hash MD5: 16K
       68 51 03 F6 A0 F3 0F ED BA 0A 4E D0 D0 E5 99 E1>)
$$ ##END=
$$ 
$$ hash MD5
$$ 19 CA 19 70 0D 38 EB 6D 70 F4 37 C1 1F 0C BA 9B
##$RELAX= 
##$RELAX= 
##$RELAX= 
##$RELAX= 
##$RELAX= 
##$RELAX= 
$$ Bruker specific parameters
$$ --------------------------
##$DU= <F:/spectra>
##$EXPNO= 1
##$NAME= <H-C>
##$PROCNO= 1
##$TYPE= <nmr>
##$USER= <she>
##$AMP= (0..31)
100 100 100 100 100 100 100 100 100 100 100 100 100 100 100 100 100 100 
100 100 100 100 100 100 100 100 100 100 100 100 100 100 
##$AQSEQ= 0
##$AQ_mod= 1
##$AUNM= <au_zg>
##$AUTOPOS= <>
##$BF1= 200.13
##$BF2= 200.13
##$BF3= 200.13
##$BF4= 200.13
##$BF5= 200.13
##$BF6= 200.13
##$BF7= 200.13
##$BF8= 200.13
##$BYTORDA= 1
##$CFDGTYP= 0
##$CFRGTYP= 5
##$CHEMSTR= <none>
##$CNST= (0..31)
1 1 145 1 1 1 1 1 1 1 1 1 1 1 1 1 1 1 1 1 1 1 1 1 1 1 1 1 1 1 1 1 
##$CPDPRG= <>
##$CPDPRG1= <>
##$CPDPRG2= <>
##$CPDPRG3= <>
##$CPDPRG4= <mlev>
##$CPDPRG5= <mlev>
##$CPDPRG6= <mlev>
##$CPDPRG7= <mlev>
##$CPDPRG8= <mlev>
##$CPDPRGB= <>
##$CPDPRGT= <>
##$D= (0..31)
0 0.7 0 0 0 0 0 0 0 0 0 0.03 0 0 0 0 0 0 0 0 0 0 0 0 0 0 0 0 0 0 0 0 
##$DATE= 1748262367
##$DBL= (0..7)
120 120 120 120 120 120 120 120 
##$DBP= (0..7)
150 150 150 150 150 150 150 150 
##$DBP07= 0
##$DBPNAM0= <>
##$DBPNAM1= <>
##$DBPNAM2= <>
##$DBPNAM3= <>
##$DBPNAM4= <>
##$DBPNAM5= <>
##$DBPNAM6= <>
##$DBPNAM7= <>
##$DBPOAL= (0..7)
0.5 0.5 0.5 0.5 0.5 0.5 0.5 0.5 
##$DBPOFFS= (0..7)
0 0 0 0 0 0 0 0 
##$DE= 6
##$DECBNUC= <off>
##$DECIM= 32
##$DECNUC= <off>
##$DECSTAT= 4
##$DIGMOD= 1
##$DIGTYP= 9
##$DL= (0..7)
0 120 120 120 120 120 120 120 
##$DP= (0..7)
150 150 150 150 150 150 150 150 
##$DP07= 0
##$DPNAME0= <>
##$DPNAME1= <>
##$DPNAME2= <>
##$DPNAME3= <>
##$DPNAME4= <>
##$DPNAME5= <>
##$DPNAME6= <>
##$DPNAME7= <>
##$DPOAL= (0..7)
0.5 0.5 0.5 0.5 0.5 0.5 0.5 0.5 
##$DPOFFS= (0..7)
0 0 0 0 0 0 0 0 
##$DQDMODE= 0
##$DR= 18
##$DS= 0
##$DSLIST= <SSSSSSSSSSSSSSS>
$$ [...]
##$SUBNAM0= <"">
##$SUBNAM1= <"">
##$SUBNAM2= <"">
##$SUBNAM3= <"">
##$SUBNAM4= <"">
##$SUBNAM5= <"">
##$SUBNAM6= <"">
##$SUBNAM7= <"">
##$SUBNAM8= <"">
##$SUBNAM9= <"">
##$SW= 18.0517328524113
##$SWIBOX= (0..15)
0 0 2 0 0 0 0 0 0 0 0 0 0 0 0 0 
##$SW_h= 3612.71676300578
##$TD= 16384
##$TD0= 1
##$TE= 0
##$TE2= 300
##$TE3= 300
##$TEG= 300
##$TL= (0..7)
0 120 120 120 120 120 120 120 
##$TP= (0..7)
150 150 150 150 150 150 150 150 
##$TP07= 0
##$TPNAME0= <>
##$TPNAME1= <>
##$TPNAME2= <>
##$TPNAME3= <>
##$TPNAME4= <>
##$TPNAME5= <>
##$TPNAME6= <>
##$TPNAME7= <>
##$TPOAL= (0..7)
0.5 0.5 0.5 0.5 0.5 0.5 0.5 0.5 
##$TPOFFS= (0..7)
0 0 0 0 0 0 0 0 
##$TUNHIN= 0
##$TUNHOUT= 0
##$TUNXOUT= 0
##$USERA1= <user>
##$USERA2= <user>
##$USERA3= <user>
##$USERA4= <user>
##$USERA5= <user>
##$V9= 5
##$VALIST= <valist>
##$VCLIST= <CCCCCCCCCCCCCCC>
##$VD= 0
##$VDLIST= <DDDDDDDDDDDDDDD>
##$VPLIST= <PPPPPPPPPPPPPPP>
##$VTLIST= <TTTTTTTTTTTTTTT>
##$WBST= 1024
##$WBSW= 4
##$XGAIN= (0..3)
0 0 0 0 
##$XL= 0
##$YL= 0
##$YMAX_a= 81978
##$YMIN_a= -112923
##$ZGOPTNS= <>
##$ZL1= 120
##$ZL2= 120
##$ZL3= 120
##$ZL4= 120
##$ABSF1= 10
##$ABSF2= 0
##$ABSG= 5
##$ABSL= 3
##$ALPHA= 0
##$AQORDER= 0
##$ASSFAC= 0
##$ASSFACI= 0
##$ASSFACX= 0
##$ASSWID= 0
##$AUNMP= <proc_1d>
##$AZFE= 0.1
##$AZFW= 0.1
##$BCFW= 1
##$BC_mod= 2
##$BYTORDP= 1
##$COROFFS= 0
##$CY= -3
##$DATMOD= 1
##$DC= 2
##$DFILT= <>
##$DTYPP= 0
##$F1P= 0
##$F2P= 0
##$FCOR= 0.5
##$FTSIZE= 0
##$FT_mod= 4
##$GAMMA= 1
##$GB= 0.15
##$INTBC= 1
##$INTSCL= 1
##$ISEN= 128
##$LB= 0.25
##$LEV0= 0
##$LPBIN= 0
##$MAXI= 10000
##$MC2= 0
##$MEAN= 0
##$ME_mod= 0
##$MI= 1.114404
##$NCOEF= 0
##$NC_proc= 0
##$NLEV= 6
##$NOISF1= 3.799351
##$NOISF2= 2.8
##$NSP= 1
##$NTH_PI= 0
##$NZP= 0
##$OFFSET= 14.38212
##$PC= 1
##$PHC0= -1561.624
##$PHC1= 23.59221
##$PH_mod= 1
##$PKNL= yes
##$PPARMOD= 0
##$PSCAL= 0
##$PSIGN= 0
##$REVERSE= no
##$SF= 200.129724274929
##$SI= 16384
##$SIGF1= 3
##$SIGF2= 2
##$SINO= 400
##$SIOLD= 16384
##$SREGLST= <1H.CDCl3>
##$SSB= 0
##$STSI= 0
##$STSR= 0
##$SW_p= 3205.1282051282
##$SYMM= 0
##$S_DEV= 0
##$TDeff= 0
##$TDoff= 0
##$TI= <>
##$TILT= no
##$TM1= 0
##$TM2= 0
##$TOPLEV= 0
##$USERP1= <user>
##$USERP2= <user>
##$USERP3= <user>
##$USERP4= <user>
##$USERP5= <user>
##$WDW= 1
##$XDIM= 8192
##$YMAX_p= 0
##$YMIN_p= 0
$$ End of Bruker specific parameters
$$ ---------------------------------
##NTUPLES= NMR FID
##VAR_NAME=  TIME,          FID/REAL,        FID/IMAG
##SYMBOL=    X,             R,               I
##VAR_TYPE=  INDEPENDENT,   DEPENDENT,       DEPENDENT
##VAR_FORM=  AFFN,          ASDF,            ASDF
##VAR_DIM=   8192,          8192,            8192
##UNITS=     SECONDS,       ARBITRARY UNITS, ARBITRARY UNITS
##FACTOR=    0.0002768,     1,               1
##FIRST=     0,             0,               0
##LAST=      2.2672688,     0,               0
##MIN=       0,             -112923,         0
##MAX=       2.2672688,     81978,           0
$$ Real data points
##PAGE= N=1
##DATA TABLE= (X++(R..R)), XYDATA
$$ [...]
1831A50J02o1k41m9j9J03k57M73k51K28k41p9M52p3l16k22K82k12J86Ol08J82
1853a65J02QL9k34J54K20j75lp4j6R9K55m5j12q6M5j08J9n1J66J14j37k66R5L14
1878A58k51QK36k87n2K96J49l27k33M15k49L7J34J23r5r3k20M44j6j67m0j8k5
1901g3q5OK01p2j26J61k8j67J78K9j04L0J82j9o6jm5J24j07M2p2j05o9K81j30
1926c5J07j09M4K3J58j69K1j52nJ47m07J83L52l10L64k54J44J56l43J29j64K97
1948A77j32m4J77l3l34J63k39K76J49Q6Qk96k73N10n5k14K58k86M0j8K57k61p6
1971a60K21j24k52L24l46N51k69k05J80L2r1M2OQ0J10l07J18K68n8k49Q8J51k81
1994a71J71J84r7P0r3J6l13M64j94j03j29J33l39K22K62J77q6l58J05L2k86M80
$$ y = [150, 252, 191, -50, -99, -118, -15, -272, 201, -50, 178, -63, -142, 310, 237, -79, -301, -19, -231, -45, -39, -347, -165, -63, -55, -16, -250, -96, 124, -51, -54, -128, -144, -45, 210, 165, 53, -33, 12, -96, -77, -128, 38, 152, 15, -251, -156, 158, -93, -85, 151, -136, -188, 108, 257, -70, -303, 112, -137, -100, 34, 157, 62, -31, -251, 193, 177, 10, -30, -48, -73, -158, -152, 49, -23, -149, 12, -16, -183, -5, 24, -80, -50, 132, 113, 47, 46, 1, 125, 18, 60, -12, -117, -186, 95, -35, 72, -37, 7, 30, 188, 19, 40, -112, -117, 30, -377, -194, 158, -152, 212, -42, 102, 258, -85, 44, -120, 177, 45, 1, 178, 145, -189, -26, -265, 11, 160, 246, 254, -42, -315, 195, 140, -74, 184, -102, -62, -80, 177, -84, -160, 61, -63, -315, 9, -337, 214, -55, -260, -80, -48, -139, -97, -91, -11, 99, -208, -90, 178, 120, -129, -41, 110, -171, 0, 184, 87, 157, 64, 80, -233, 231, 37, -66, -195, -62, -401, -179, 83, 260, 174, -184, -79, -47, -333, 147]
2016A47m07J48J97K8k08j86K20J76kj56O4r9m2M02k90j11J37J17l09K4J86k2q6
2039g2J65Rr0QJ09p0j78M26l61Qj82M4K93j17J31k99K53R9q8Q2j63J57j77M4k
2064B9n9J01R8m61L18Q9j36Lk5q6Q0K91n0l86J44K5J39j05K08j1j33m7j31lm4
2089a52J2j18L18o3L5j3l27K17J17j17k9r7J36J29p2J0j78J78K88l10K33k70K94
2112B21l6p7K8P9j64k3q0j24J84J36J53m18P0K06k35%J7J94j96q2L20k22O0j12
2136a01O3J59k20Q3L05k49k74lK59k52K21k3J28j83P2K13m30P7J43l9K2J10L1
2159A12j07o2N8J1r0K30k83MP1J76p1N6k03P4M2q2J62k2O7k32J63l02K74k95K32
2184a7N7j22K7L2j83L47Rj75k9j6J41k69L0K77j1k10J28J14M9l50K72l9m6K05
$$ y = [147, -260, -112, 85, 113, -95, -281, -61, 115, 113, -43, 21, -78, -120, 282, -8, -119, 18, 135, -174, -150, 36, 14, -72, 93, 102, 12, 20, 129, 59, -119, 307, -54, -46, -228, -184, 109, -8, 123, -176, 77, 176, 88, 170, 7, 164, -13, 31, 29, -30, 71, 169, -292, 26, 115, -21, -18, -43, -129, -49, 242, 192, -194, -50, -25, 114, 9, 217, 206, 73, 26, -105, -108, -152, -140, -258, 60, -3, 32, 19, -308, -91, 26, -91, -120, -217, -81, 48, -24, -14, -192, -14, 274, -36, 197, -73, 221, 185, 108, 136, 215, 51, 28, -52, -176, 8, 144, 297, -121, -51, 155, -80, -80, -63, 131, -65, -147, 173, -49, 11, -101, -38, 121, -99, -16, 289, 40, -234, -237, 22, -230, -9, -32, 96, -87, -15, 198, -232, -155, -12, -51, -29, 81, 112, 5, -57, 1, 12, -78, 152, -131, -127, -56, 120, 49, 105, -98, -24, 18, -64, 98, 76, 143, -89, 74, -228, 46, -249, -17, 40, -82, -55, -23, -206, 141, 150, -25, -54, -70, 71, -198, -168, 109, 98, -112, 16, 130, 179, -171, 101, 62, 16, 221]
2208B21k69k39K19J30k62L42k81J40J7R4k26p9K65J82m32L4Q9j90K92j6J05l05
2230a69l9P0N8J09j21M9n6J99k33K16p5j22J60r8L07m28J45K83j65j19J69j00
2252D0k6j89L22l12J83M9n6J19J93k30j72o8J66j48K3j61J58Q9J53q6k90Q7L69
2275B13j75j63K18j67J39j8k26K52k18K95l12J37j10M31n23J33J87j27M2K44j89
2296F3J80l58m2K0mL94k93j33O6K51k4J43q9m35O7L95k35O1q5%J11j43MN5J45
2321A14o4j79K35M3k66K20J10k9l47R4rR0J18j81J23P8l96L51K7k89J28N2k25
2344b02K79l62K42n2O3J11j11N5m5K43l39J49j82J31R8n6k13M13j20j15n9qJ74
2367I4j38q7J29J26k12K10p9o9k8j3q6k3n9M75j35q4k80K73k49K55j32J24j12
$$ y = [221, -48, -287, -68, 62, -200, 142, -139, 1, 18, 112, -114, -193, 72, 254, -178, -144, -55, -245, 47, 31, 136, -169, -208, -138, -80, 29, -92, -43, -99, 100, -133, 83, 8, -114, 46, -52, 255, -173, -28, 255, 90, -29, 140, 40, 14, -175, 147, -165, 18, 67, 11, 130, 323, 93, -79, -147, 19, -129, -106, -267, -109, -20, 133, 47, -243, -156, 213, 38, -125, 93, -74, 65, 47, -179, 73, -145, 150, -162, -25, -135, 296, -227, -94, 93, -34, 8, 252, 63, 243, -115, -157, -137, -141, 253, -40, -173, -107, 144, 120, 263, 174, -261, -194, 201, -34, 27, -58, -58, 53, -90, -86, -31, 114, 50, -129, 106, 149, -117, 103, 213, 184, -163, -69, -78, 12, 130, -51, 72, 150, -246, 105, 132, -157, -29, 23, -202, 77, -285, -43, -95, -32, 79, -32, 23, -22, 221, -118, 31, -151, -20, 78, 22, -191, 222, 102, -13, -72, -80, 94, -44, -131, -2, 124, -88, 122, 43, -26, -54, -67, -153, -176, -235, 240, 105, 21, -259, 14, -235, 20, -112, 12, -100]
2390a00K50k73K05K65n30J61J89p0l31K21k08K59P6j71N2J8n4Q6K26m33J44Q4
2412F6j92N4R0M8l17R4M24j28j08P8J2nm77K94l5N3J99l26kM54j49m91K92J12
2436D0k27J48L15l23k17J65O8R5l3j84n3M81l81K19o5j57K09Nj31J70j04j15k53
2459c28K70Q7K37k63j4R3j82K81m32M42l24O1l2K16j84r3O1Q5J44j09j0k5J93
2482A74k64L65j20m7j11R7N8l52J93j84J04L6R3J9o9m1R6k9J08r1k6qJ54k53J45
2507D7K04k85k8Q9J44l95R6J37k57J94Jj56Q1L45k4l46J70k19L31rk0j51n1m1
2531a43m9L6K80N6n2l67L5MJ80M6l8rk68J77L01k21m3J21j58J18k09K39j28Q9
2555cR6q4K79m46K03k8k27K3K10l28K53Kp0K35p9K33k14q9K08j69J40o4K49l84
$$ y = [-100, 150, -123, 82, 347, -183, -22, 167, 97, -234, -13, -221, 38, 114, -57, -5, 13, -41, 45, 271, -162, -18, 66, -126, -72, 18, 66, -251, -157, 267, 139, 31, 109, 121, 116, -361, -67, -102, -49, 150, -176, -178, 276, 127, -364, -72, 40, -187, -39, 276, -47, -264, -99, -31, 64, 31, -153, -206, 275, -106, 113, 48, -109, 100, 105, -26, 144, 40, -75, -328, -58, 29, 266, 3, -11, 82, -100, 181, -251, 191, -133, -72, -104, 112, -72, -165, -104, -19, 125, 16, 6, -19, 174, -90, 275, 155, 108, -3, 94, 152, -200, -7, -191, -87, -51, 42, 61, -8, -49, 47, 18, 126, 35, 9, 1, 155, -98, 47, 251, -34, -62, 27, 171, -224, -128, 9, -248, -54, -53, -209, -128, 217, 193, -153, 17, -202, 129, 120, 100, -51, -102, -143, -192, -156, 124, 180, 128, -239, -204, -200, -20, 26, -12, -21, -289, -112, 189, -32, -75, 46, -112, 6, -203, 36, -92, -3, 93, 9, 288, -158, 45, 17, -210, -187, 23, -305, -52, -50, -120, 115, 36, 269, 55, -34, 174, 5, 145, 81, 330, -54]
2579e4j08K22m9L3k52M30l92Q6p0K44r3J52R0l78J65Q8ol82M22j92j84J55N0R5
2603G2o1n2O4J73k8j14k2J99l31P0Q5j6j83R4Q3P7o6M9j11j03J39l23L15j2J12
2628A10l98K59J54j87r9K21l0J00J62l05K12k84J09N1J2k49M35k85n8J10M4L3
2650A17j11k8K34l01J79%O2k71K79j74J92l68q7L48k28K07q9M9J30j71P1M2k42
2673a60J57J60j54J3R5l0j0j40K12m5j56J29p8J87R9m30j1J06L5K25j82j09J33
2696D6j84L84j56j79J34k12K51O5k94K84r3l8j09M50l69n1j32K58l11M02l82K91
2718E5K52k35l3N4j75Rm6k3K56j66j01Q8N0l0k2j13l4J46R5j92K29P6j01K66l18
2743a3K44j96p1j17OL09k28K0K3J49k37J91j14P1K08j67j64J87n18N11k03K88
$$ y = [-54, -162, 60, 11, 44, -208, 222, -170, -84, -154, 90, -3, 149, 239, -139, 26, 114, 108, -274, 148, -44, -228, -73, -23, 72, 11, -41, 23, 196, 168, 54, 32, 231, -100, -30, 55, 39, -144, -50, 33, 110, 44, 93, -18, -121, 18, -305, 10, -2, 110, -288, -29, 125, -62, -161, 60, 30, 130, 292, -13, 199, -85, 24, 75, 87, -162, 273, -12, -70, 40, 84, 117, 6, -22, 212, -89, 90, 90, 152, -119, 160, -14, 178, -190, -277, 71, -157, 50, -39, 10, 140, -31, 40, 82, -160, -3, 157, 3, 16, 111, 81, 71, -69, 143, 98, -58, 71, -7, 180, 279, -151, -162, -56, -21, 204, 22, -87, 46, -138, 246, 90, -89, 45, -167, 84, 149, -145, 139, 46, 8, -101, 349, -20, -71, -203, 55, -256, 146, -236, 55, 307, 72, 39, 93, -82, -73, -119, -142, 114, -52, -153, -65, -15, -45, -67, -180, -214, -68, 27, -165, 64, 140, 39, 305, -13, 231, 35, -36, -153, -147, 162, -66, -46, -23, 126, -111, 80, -34, 37, 245, 78, -86, 101, -417, 94, -109, 179]
2765A79m4j02l76K74J24j80Q3K56j32j59J84j02L8J90m0k57J47J4k90J30m2J4
2787i1J36k12K35n8j61Q4ql5L60k64rm6M1L25l30r7L67k78N2q0M5J05j30n8k08
2812c15M01j83k61L82J35l11J75R0j37q7R1l1o0oJ63r1R5j12J98j70J64l24K02
2835Hj26K02j38K58k77r4J71r5K38j87jj05L9j88M01pj66n8K66l5j60j71Q4mJ93
2860D8J34L4j01m48K59J82j39N1mJ96n8k5l21R5L71k70o0O5K9j63k7J03P7R4m8
2885G4j26k08O8M75m48l2l3K45j6l5J23m3j80K88j33j80L78j6k55lp2J17R9l61
2909b74L04Q5j45J0R0n7J17k59K11o3Q8nn6O4q9r8J53J00j37nK72l12R3K57n6
2934B88n36L96k5l10K0K12NJ9k90L73j81J09M9m94O72j01o1l74K15J11j15NJ38
$$ y = [179, 135, 33, -343, -69, 55, -125, -42, 214, 82, -77, 107, 5, 43, 233, 193, -64, 83, 97, -193, -63, -105, -91, 45, -167, 68, 10, -151, -67, -75, -110, 250, -14, -23, -69, -28, 297, -33, -130, 237, -41, 11, -69, -24, 81, -49, -107, -315, 86, -97, -358, 24, 159, -152, 23, 113, -24, -111, -20, -51, -111, -117, 46, -45, 50, -62, 136, -34, 130, -194, 8, -118, 84, -54, 204, -73, -167, 4, -91, 147, -40, -41, -146, -107, -295, 106, 99, -67, -125, 141, 106, -54, -225, -141, -145, 48, 182, 216, 115, -333, -74, 108, -31, 20, 16, 212, 154, 129, -192, -97, 274, 4, -56, 9, 38, -125, -152, -49, 28, 122, 74, -52, -260, -192, 283, -165, -197, -230, 15, -1, -36, 87, 44, -136, 152, 19, -161, 217, 201, -54, -57, -129, -12, 87, -274, 30, 115, -30, -20, 70, 13, 130, -129, 82, 19, 107, 102, 46, 110, 21, -77, 76, 176, 39, 34, 306, -6, 87, 344, 288, -248, 148, 123, -187, -167, 45, 50, 69, -221, 152, -29, 80, 129, -365, 307, 206, 145, -229, -14, 97, -18, -13, 125]
2957A25q8k60J5L13K27p4j20l5j76J12j23J93j27K05m08K20r3j01J41J35k47K50
2979H4p9J0k77K00K05%q4k24K7J34j69Q4L61l08J55l45K77R6j40j89N32j89j33
3002B8o4J9j65O8L5k4M36m00J20p9n4J00k14J83J36l4k4j21J93j68j58K59k76
3025b04J26N6j3j17L06o4j86L18l25K17j76m5J99K8m4q8J10J5m16J72L61l12j2
3048i4k1J46J31l17L58j54j83J95J9k76J58LK6j41L51k55r9K24n8k10pK44q6J21
3072G5n5o6J35l7J12k58nj23R9N12k67q9M7k51J92Rj66K80k78N8j21L0K58p1K7
3097D7K93k70l3j15J08j23M30l18m5j70J51K69k4j82j76m4J35L65k79J32j04p5
3119b8o8j03K32J78l42J61K56l10j31L59j61K7N2J54k63k3j74K94j21Q9k32k0
$$ y = [125, 37, -223, -208, 105, 332, 258, 138, 103, -73, 39, -84, 109, -18, 187, -221, -1, -94, -195, -54, 81, -166, 84, 5, 15, -262, -62, 143, 143, 59, -165, -138, -4, -173, -89, 272, -36, 119, -226, 51, 147, 7, -182, 350, 161, 28, -36, -17, -182, -114, -79, -103, 333, -67, 53, -26, -80, 20, -194, -11, 125, 91, 67, -54, 139, -29, -187, 72, -204, -78, -22, -35, -152, 154, 90, -96, 222, -103, 114, -62, -107, 92, 120, 76, -12, 98, 113, -303, -131, 230, -82, -94, -115, 31, 162, -155, 203, 49, -134, 61, 80, -196, -38, -35, -9, -150, 201, -54, -153, 71, 13, -197, -204, 40, -46, 75, 20, -46, 89, 52, 164, -94, -99, -222, -123, 389, 122, 33, 80, -171, 21, 30, -136, 144, -134, -76, -197, -167, 91, 20, 47, 340, 70, 37, -78, 30, -93, 337, 19, -26, -196, -45, 224, 200, 18, -158, -202, -67, 298, 19, 151, 47, -28, -96, -199, 33, 211, -131, 30, 286, -24, -155, 204, 43, 70, 122, 276, 13, -10, -184, 110, -11, 78, -154, -174]
3141a74K57r5J52k77m6K08j72J69q9p5l0M46m04j17Q3k8L43j68N9K6K19l05J5
3164cN3J67k09J80j97J62k13jLJ6P8k4J00j07K8j3Mk56L4L44j77j21M20j74j7
3189G7Kj17K07M9o9m17L38k10L5J92n9j67L43O3m74L18l19L65m3k32K14Q3qn21
3213c50J74m5K54m01K64r7l3N3L39j79k85M2M69k78JK48k15m3j53J94J23k26K8
3236a16K73Q5l00Q5j03R1j4j23J4k1j01L09J73j58k39J40p4J75K29k90j49J14
3258@j30L6j66L37k25J50J74k12JJ22l53j8K67J11k89J54j42M91l65J37j30J47
3280I7p6K7K4j40q3L97l80M39q1o08J90K9L85l0l89J54J70j24o9O9J76l9j84j
3304d7l2jp5K02k39N51k99Nj46j61O43m99K29k90J25P4j98J91J18l13j22M69J6
$$ y = [-174, 83, -12, 140, -137, -183, 25, -147, 22, -67, -142, -172, 274, -130, -247, -164, -192, 151, -17, 42, 68, 287, -18, -3, 50, 217, 8, 188, -9, 153, -60, -61, -58, -42, 36, 12, 112, 5, 33, 20, 24, -232, -198, 146, -31, -152, 268, 94, 77, 79, -38, 169, 218, 149, -268, 70, -140, -105, 87, 28, -139, 204, 267, -207, 111, -208, 157, 114, -118, 96, 179, 171, -350, -176, -221, 33, -368, -104, -201, -234, -181, 158, -21, -306, -264, 205, -73, -72, 176, -39, -82, -235, -41, 82, -144, -116, 157, 242, -58, 27, -76, 15, 1, -122, -108, -129, -230, 79, 252, 94, -145, -5, -79, 96, 325, 35, -114, 0, -130, -94, -260, 77, -148, 2, 176, -36, -35, 87, -266, -284, -17, 94, -195, -41, -183, 308, -57, 80, -50, 97, 21, 48, 72, -68, -151, 246, -134, 305, 224, -384, -194, -165, 220, 190, -199, -45, 125, 1, -68, 1, 177, 138, -46, -47, -79, -80, -155, 47, -192, 359, 60, 65, -81, -242, 401, -98, 131, -159, -34, 40, -158, 33, 151, -162, -284, 185, 201]
3327B01j63L8r8M3r9M4K08m04M19j04q9j02K39r1k59K68J64k68N1Q0p9j48L17
3350A68k40O0l51K78q9m9K81j85L62k91L8m0L08rj90Q0L5k65J05K49r8l25J34
3373c4j67L35j36J21l29J46K11j25nj10R7J47l56L27k23O7R0m9p5J15L84n64L16
3396A83l9k62K33J36j27m1Jr5J36l34L44k9j67k9j89RM6J39J46k40j04J67K04
3419H8j08k05L29J05k94K16lk21J76k22J95p7J61r0o7k99J50J2L8K24l54O4L9
3442a43J55k2J76L0j38o2k27J4K85j34K39k53o4L74m33K40l96K52k81L16J82k4
3464H6J4j82R5J32p4j03Jk00M90m48J46m5K61p8j88L39m18J48K8r9j0J58k61K70
3488F2J59m54p3M13r8j20KJ49K2j56J63j15P8N3j46n8J93l10K13J19P9j38M8j40
$$ y = [201, 38, 76, -22, 21, -78, -34, 174, -230, 189, 85, -4, -106, 133, 42, -217, 51, 215, -53, -2, 78, -1, -149, 168, -72, -12, -363, -85, -174, -223, 58, -127, 235, -56, -18, -58, 250, 241, 51, 131, 166, -99, 6, 255, 157, -168, -34, -201, 134, -2, 119, -210, -64, 147, 22, 17, -93, 4, 151, -205, 122, -101, -34, 56, 7, -68, 47, 431, -133, 183, 144, -118, 115, 251, 124, 83, 84, -11, 125, -209, 135, 106, -61, -90, -279, -270, -224, -85, 61, -179, -283, -116, 88, -20, -225, 104, 209, -85, 131, 128, -93, 83, -139, 56, -21, 140, 50, -17, -316, -166, -154, -116, 108, -246, -182, -143, 12, -10, 166, 196, 58, -4, -231, -217, 68, -66, 173, -80, -144, 230, -203, 37, -359, -107, -388, -72, 110, 86, 100, -82, 13, 145, 71, -32, -31, -231, 259, -189, -43, -88, 173, 95, -93, 246, -172, -24, 4, -95, -105, 53, -208, 62, 221, -233, -306, 107, 9, -111, -109, 40, 62, -94, 69, -46, 32, 85, -61, -119, 74, -236, -23, 96, 175, 37, 85, -55]
3512e5j23J37K0q4m6K76n6q1J48J2K7j1l01J09j5K47j99r7J6J46l1K9k46J96j31
3537a13M8L0R9lj47J0J00Jqk10M13O6p8m30L34j77k43K53qk09M07j85Q0q4k20
3562b74M55k15j23J75l4k9L27q9J25k56p0j52q3L42p8o2J53l2J59k44k54M88k60
3585c1qJ71l70J34L25jk59p4J21K69p5j80j41J08K1k03L23j43JJr4J02mR4j84
3610i7j60R1P4k8J60J17oj70m4O4J13l06J17J48l84J71K04j1j84O7O5J2j48J19
3634a6J31j79R2J90l25K27J00j41j9j51K72m37M49k0q6j80L16m10K33M5J37k89
3656f1K47N2o04N11k10Q6r7R1J14l81J09mK98k75K22K00k11k08N0K42nk28L35
3679B73j00k66K71k98Nj93N51k22r4pR8j72K54k84K19n4j27P6j39K7L37j80j87
$$ y = [-55, -178, -41, -21, -105, -151, 125, 69, -12, 136, 148, 175, 164, -137, -28, -43, 204, 5, -92, -76, 70, 39, 68, -178, 18, -113, -65, -35, 64, 61, -86, -76, 24, 25, 17, -193, 220, 286, 208, -222, 112, -65, -308, -55, -63, -272, 135, -50, 30, -54, -274, 181, -34, -157, 18, -16, -45, 282, 193, 318, 62, -8, -160, -243, 99, 21, -41, 112, 80, 239, -5, -259, 229, -31, -39, 132, -238, -104, 221, 220, -39, -113, 8, 277, 202, 22, -119, -11, 10, -193, 130, -13, -12, -11, -105, -3, -7, 87, -97, -257, -166, -92, -120, 40, 157, 151, -19, -63, 1, 114, -192, -75, 73, -311, -140, 64, 53, -131, -64, 1, 13, -135, -16, 115, -64, 28, 218, -107, 120, 220, 79, 60, -91, 181, -256, 193, 173, 87, -93, 223, -187, 46, 91, 228, -61, 186, 238, -366, 145, -65, 21, -76, 15, 129, -252, -143, -147, 151, -124, 98, 298, 87, -121, -71, 171, 166, -62, 273, 173, -93, 178, -120, -115, -308, 243, 21, -73, -80, 18, -154, 100, -184, 35, -19, -146, -70, -209, -182, 155, -25, -212]
3702b12L72k2p5N7m62L03j14J11K52k21m9K64k04M2K01l48K61j82n2Mj10L75n7
3725A34k91J74j75K86k63m2J56O0k18M1J34o3R2k14J13L6j48J4r9L11j97K19N2
3748A12l34J87n2K76j01k31j86J42J32J14Q7m26K80J88l06R9j6M1j72Q3J46j70
3770a07O9p3P7M07n12l8L7L43l67N1L16l74O9K87k31j09JQ6K72j37k58K63o5l7
3794c0M8O0k85J34l5K12K4j08j59J84j24K55l76K50l7j41oK14nj12J29p2O8j56
3818f8j12K68k46r7K83L42m49k85M34m0n1J90k38M8J69k67nj47M9L71R8k98J69
3841A18R5j92J05l17J43L7m5K23j0k38L0j14j42K87J64n2j39N1J5N4q9J53l27
3864a90L43l88m0J91R6k41L07l57M28j24L5k06Q0o6J71j49K00J40q2j14K73j11
$$ y = [-212, 160, 138, 63, 120, -342, -39, -153, -42, 210, -11, -60, 204, 0, 42, 243, -105, 156, -26, -78, -74, -184, 191, 134, -157, 17, -158, 128, -135, -177, -21, 39, -179, -138, -4, -67, 25, -189, -76, -40, -188, -174, -273, 38, -159, 60, 112, -222, -35, -87, 189, 88, -143, -329, -187, -55, 59, 146, -280, 0, 188, -118, -19, -35, 6, -166, -83, 63, -107, -38, -111, -34, 373, -139, -177, -140, 203, -164, -113, 203, -171, -102, 185, -46, -155, -154, -68, 204, 67, -191, 72, 7, -30, 18, 78, -207, -73, -108, 104, 128, 20, -139, 45, -79, 176, -200, 50, 13, -128, -134, 80, 75, -37, 92, 20, 88, -68, -180, 88, -158, -255, 28, 370, -79, -364, 70, 30, -21, 169, -69, -21, 148, -119, -124, -271, -222, 149, 247, -51, 118, 213, 21, 126, -191, -48, -11, -56, 167, 157, -81, -51, -165, -307, -20, 144, 92, -47, 4, 19, 73, -16, 137, -190, 153, -235, -275, -84, 12, -229, 78, -279, 149, 25, 60, -146, -66, -132, 39, -110, 90, 230, 148, 34, 307, 196]
3886A96n06L74n4k31L48k97j32K50j7J06j61LL7P9L29l25k79K10J80M9r3j57J49
3909E8j93J57O3j29K2L43m57N9j30K53J0j01P7L8j54q5K13k50J14j41K30j17j14
3932b34K84mo8J70j59j78L80k58J39l8lO6p1L3k47J25K1n9p6o6K36j61j95M34
3956G1K85j23l65L11j85j97J78k5l2m7K32K77m59K21j10n8J7j12J06N1q0j16J69
3979Il1N6j90J35j5J45j58J6L6j06J05j35M02l60J95pj90N4O2j32J89J0l2l94
4003c36L85j6k02L48k09q8j77K47j08J70K7R4mr5k09K1K42m6j31M6K4j02K79k92
4027a32Q2L54j62k35p7J63q9K6Mk5M0J34J11j38N7j94j77K03p6J26K03k70O1J69
4051A58j20k8K05l63K48k15J11k40K51j29J09q8K51l81L05j11r3J08J87l34R2
$$ y = [196, -310, 64, 10, -221, 127, -170, -302, -52, -69, 37, -124, -121, -84, -5, 324, -1, -280, -70, 110, 159, 66, -91, 58, -135, 22, 85, -44, -22, 321, -136, -77, -207, 46, 56, -45, 32, 70, -84, -169, 44, -206, -92, -233, -3, -120, -234, 50, 46, -22, 148, -11, -189, 191, -67, 72, 34, 31, 97, 26, 59, -188, -63, -42, -101, -177, -243, -7, -168, -363, 71, 356, 233, -132, 179, -6, -203, -25, -50, -82, -129, 103, 380, -79, 142, 32, -26, -9, -121, -15, 36, -44, -160, 9, -22, 34, -156, -21, -36, 109, -49, -33, 3, -103, 2, -133, 269, -91, 104, 97, -93, -39, 23, -109, 80, 90, 58, -336, 49, 33, -169, 179, -30, -118, -295, -48, -156, 14, 41, 135, 131, 36, -173, -152, 90, 44, -87, -41, -17, -119, 160, -132, -50, 304, 142, -93, -170, -7, -96, -70, -66, -91, -51, 83, 194, 56, 113, -81, -258, -55, -131, -5, 198, -72, -11, 158, 38, 10, 215, -148, 100, -115, -4, -244, 7, -122, -13, -101, 150, -231, 74, -37, -130, -22, 165, -169, -77]
4072g7J6J58l30K26K1l02M20jj3n9k46J68K58k54R5q6K3j44K8l66K41RK76n8J2
4097A5j46J26oJ88j28j78Q0P7p5P2j89K55J8l09M74l00L7K06l04PL9K64k95J51
4121G9m9k11J01P1LP9l45L74k44rN89m75q6J36j24J10J23O7j33m14L84O1k46J08
4145e1K76l89K96r4j29J82m6j89J03r2M83l69j77L73J57m50L37Rl63K47k08K03
4167A09j90O5J64m72K38M28l78j1k5Q6O4J10J8l94J64J03J10q3j2JN8j69j21J89
4191E2j30k1QJ25n3J63j29q7m9J65K1M00n71J51Q3j67J53o8%j77N1q1jJ85J54
4216A77k03L5J79m48K80j54J69m1m4j39K13j56R3k8PR2J07j68j80K30l06L22L3
4239G0j18R1j52K9J59j49K82j28o6J3L4j29J82j02k1k63J20K31j00r9J33R9j93
$$ y = [-77, -61, 97, -233, -7, 14, -288, 132, 131, 118, 59, -187, -19, 239, -15, 80, -6, 17, -127, -99, -465, -224, -215, 61, 3, 15, -131, -5, -11, 177, 49, -129, -49, 28, -47, 25, -164, 91, 109, -200, 274, -26, 11, 217, -87, -80, -41, 223, -72, 79, 30, -181, -80, -9, -6, 73, -272, 102, -142, -151, 438, -37, -123, 13, -111, -1, 122, 189, 56, -358, 26, 87, -159, -51, 225, -164, 132, 38, -91, 91, 45, -144, -41, -133, 350, -19, -196, 177, 334, -116, 221, 230, -133, 114, -94, 109, -81, -16, 148, -324, -86, 342, -36, -47, -72, 14, 78, 188, 206, -188, -24, 79, 189, 106, 94, 95, 153, -16, -137, 52, -78, -99, -91, 34, -19, 144, 15, -72, -121, 44, 65, 465, -106, 45, 128, -39, 114, 46, 46, -131, -80, -161, -162, 23, 177, -26, 9, 188, -260, 20, -134, 35, -6, -50, -189, 24, -132, -39, -67, -60, 32, 139, -29, -209, 21, -285, 37, 70, -48, 43, -109, -80, 79, -70, 212, 84, 18, 31, 65, -64, 118, 16, -5, -268, -148, 83, -17, -116, 17, 116, -77]
4262g7J75Q6j12n5o1N6J22J67k55j30Q8j11j33K36j2m43O37j33j77K61j45j81
4284a97J01j13K74j80Q3P9j96k8J97Q4k5j11l6K33l00P8k36K59k01K11R5j42L03
4307B32j09j50j42L01Km0k54k4L26k71J02Mr6QK6J38k29K10l55O56o3k54k59q8
4331c29L28j13M6j07L01k05J03j18K20o8J2J08p4k52J5K82N9l01M17k89L6k36
4353a65Q6J53L5q8p3O8L7j86K20j45J32k06J02N7O5j14l6%j68K55J23j19p7j9
4377f3K55l04oO4J22R3J5j38j5K40n22J26L53j40J21k64R3j49K36j67K25k11R3
4400E7j50RJ55j78j81J97J50j72J24J75j55kj35k78N43m9n5k18K83n3j21m5L33
4423B34j03k1m12J60J89q7q3J19J71j67J15j9l6q7J00p9j6o6j37K50j94j65L69
$$ y = [-77, 98, 184, 72, 17, -44, 12, 134, 301, 46, -84, 4, -107, -240, -4, -16, -459, 178, 45, -132, 129, -16, -197, -96, -209, 65, -115, -32, 47, -149, -177, 20, 104, 79, -32, -68, 165, -135, -57, -293, -34, -235, -24, 71, -71, 232, 123, -27, -169, 132, 134, 94, -160, -184, 142, -129, -27, -23, -119, -111, -85, 53, -176, 34, -321, 335, 272, 18, -241, -329, -1, -114, -68, -175, 126, -79, 24, -94, 126, 58, 70, 178, 104, -148, -133, 149, 208, -93, 324, 35, 71, -165, -79, 74, 109, 21, -52, 16, 53, -133, 87, -58, 74, -132, -30, 27, 92, -22, -58, -58, -226, 29, 152, 33, -44, -63, 192, -112, -118, -54, 68, 161, 176, 38, 23, 263, -259, -133, 220, 80, 201, -63, 30, -119, 117, -50, 175, -36, 57, -93, -84, 71, -107, -288, -91, 59, -113, 11, 186, 31, 29, -106, -384, 159, 110, 55, -163, 120, 67, -54, -99, 234, 131, 110, -302, -142, 47, -40, -123, -4, 167, 0, 115, 96, 60, -27, 73, -6, -22, -88, -225, 25, -169, -334, 35]
4446C5j83J42N5J65k86p6M49oj06k60p3K1K07l3j20J22K8n4l19L47j73J98j60
4469h0k1J83mM2j91N9J21j37J45l2k53P6J67o4j44OJ10M5N8J10J5k35l91M56l85
4494c44L46R0m96K88J26j78J85j77L05k94j5L79j64j24L1L15m91R1M59l26n8p3
4516a25J06j71J26J16R5K20m33kK84k53L4K25m47L15l51K89n7p8J68j51J15K15
4538B40o31N37M0j13J18L0m08l9J57L6N4l40L64K6oN3l67J35M26j21n2j32k51
4561b44N13k44n4k2k2J44j82P4q2L59l63R7l02M33q6pR8l43J79k86J88J83j22
4584i1K21m18K80M5jL2j24J5j04M6q2M60l43P3l2J77n9l7q6J53l9j25KJ20j69
4609h6K0R9k54K33k47K80J65l08K72l91J32J65k94J14K98l72R5K14l55R5j4J70
$$ y = [35, -148, -6, 49, 214, -72, -148, 301, 295, 189, -71, -144, -123, 84, 51, -69, 53, 81, 27, -292, 55, -118, 80, -80, -101, 82, 78, 120, -71, -12, 109, -28, 117, 85, -168, -92, 75, 11, -133, -127, -17, 28, 86, 196, 211, -24, -415, 41, -344, 2, 92, -404, -116, 10, -168, 17, -160, 145, -149, -164, 215, 51, -73, -42, 273, -218, -127, 332, 6, -52, -125, -19, -190, -64, 52, 147, 367, -66, -68, 216, -37, -3, 222, -225, 90, -261, 28, -29, -107, 61, -90, 25, 240, -391, 146, 186, 73, 191, 221, -187, -226, -69, -33, 21, -319, 45, 71, 65, 118, -249, -114, 312, 191, 139, 7, -244, 269, 25, -29, -51, -73, 71, -111, -37, -119, 240, -123, -26, -328, 105, 19, 12, 110, -233, -54, -340, -152, 31, -91, 130, -288, -8, 37, 36, 68, -56, -41, -145, -99, -181, 279, -64, 9, -23, 154, 95, 58, -28, 125, 86, -39, -37, 83, -86, -66, 33, -221, 12, -235, 45, 210, -98, 174, -217, -85, 80, -214, -100, 198, -174, -79, 135, -220, -125, -139, 31]
4631C1K3j92m9L64k06J33l53K14J64j11K10j75P7j32j33J71n5j8j01K6K47j67
4653c2p8Q5J65l66K10K60k02m6j39j04L17k36rK97k22L97k09K3M8l82K44m6k9
4676e4J83l10J49J15j73J29l53M07j45N0L26l72j19J69J68P0j18k15r7J14J10
4697C4M9o7k85J23K49k17J66Qn8p4O5J5r4J6L4J67O6m9j50p5J06j18Q6q2J93k37
4723a29J72p8M0m1j28L82k63J83J0lp4J48k96J77P4k94J40J85l48K28j63L40k17
4746D5J5k75J53J00r1k3j4J61m1j16j4K03l5l46L35M77p45M51j76l1q0J54l22
4769b15K45J27l07J02Mj17L18j86L2j07J95m6M9m6P5r3l01M15k27N9q4K13j51
4792d6k8J07r2R1l48M69L5l03J94k64N2L5J85j95J35j4K52m14M1J45m31M70J76
$$ y = [31, 54, -138, -187, 177, -29, 104, -249, -35, 129, 18, 228, 53, 130, -2, -135, 36, -19, -37, -138, -112, 135, -32, -110, -25, 140, -226, -16, 244, 42, -4, -143, -247, 70, -166, -175, 122, -100, 297, 88, 111, 159, -223, 21, -25, -54, 129, -181, -32, 83, -90, 39, -314, 93, -52, -2, 324, -48, -167, 2, 170, 240, 122, -93, -190, -76, 34, 83, 16, -269, -146, 103, -114, 52, 60, 2, -72, -7, 8, -86, -70, -36, 131, 197, 148, -2, -77, 29, -89, -3, -85, 108, -129, 43, -35, 5, -36, -164, 218, -45, 138, 148, 145, 71, 219, -77, 100, 174, -120, 20, 205, -143, 85, -78, 262, 45, 60, -215, -62, 38, -53, -76, -90, 71, 30, -86, -100, 103, 68, -278, 57, 534, -211, 240, 64, 33, -47, 107, -215, 30, 157, -150, -48, -44, -161, 157, -29, 3, -104, 91, 45, 94, 48, 123, 30, -271, 144, -83, -24, -108, 105, -46, -74, 33, -59, 32, -316, 153, 188, -115, 79, -185, -133, -98, 87, -108, 27, 13, 265, -149, -108, 37, -394, 76, 252]
4815B52l67J11N1J59j91k38K89m2j15J25qj28L08l5k53K00M3k53j12K91Q3j33
4837C7j39m9q4M8J10L47k63N0k66J15K29l83L60l59O94m29l2Q6O0m0M3k40M8P6
4861A9k7o9k48L90j9J22j90kj93K28K01l01p9J64J10j68n6p2J8L64m10J30J52
4884F4j05j26L07j81J57j2k20j26K45M1k41J47R1j44L35k40m6L6J7J03r8K06l4
4907A76j24j03J23P1l73K64O5p4K64m28J14J12m7j60q5K33kJ09j67J03j26p7q
4930a40J82p4J92j92j71J48j15L72l06m4m1L42n76O56k11N2j19j04K99J7k56J06
4952A7J09j39L9k26L23j51p3l5o2O8K42j03qJ62m3l32J04J50j60J89m17N64j44
4975G4k18%qq1R8J44J87l35J97k84K16M5n3K56l10N8K5k18L34j95O5r3K01p2q4
$$ y = [252, -115, -4, 47, 206, 15, -223, 66, 24, -91, 34, 26, -102, 206, 171, -82, 118, 161, -92, -204, 87, 170, 37, -102, -151, -235, -187, -77, 270, 7, 57, -209, -94, 135, -248, 112, -247, 447, 18, -14, 72, 132, 92, 135, -105, -57, 19, -8, -77, -325, 65, 46, 168, -22, -24, -217, 11, 212, -89, -168, -4, 106, -62, -118, -190, -172, 192, -218, -88, 64, -41, -167, 140, -41, 116, 104, -116, -242, 3, 44, -197, -50, 41, -103, 232, -8, -54, -18, -1, 102, 4, 210, 176, 52, -51, 72, 143, -230, 34, 99, 25, 289, -139, -25, 87, 40, -120, -205, 28, 26, 135, -32, 71, -55, -132, -140, 42, -32, 160, -32, -203, -55, -170, 202, -104, -148, -189, 153, -423, 233, 22, 74, -45, -149, 150, 167, -89, 17, 126, -13, 26, -200, 123, -28, -101, -136, -198, -130, 112, 9, 1, 163, 120, -212, -108, 42, -118, 71, -346, 218, 74, -144, -144, -152, -233, -135, 9, 196, -139, 58, -226, -10, 35, -18, 238, -72, -14, 11, -207, 127, -68, -3, -96, 105, 33, -51]
5000e1p5K3J54j37R6J1R4M6k48R1j4m5J75l0R0k50K51k02jk99N13k21K08j86J91
5025A84k10J11l99Q8M33m32K71J04m79K26K04k96L54j54R5J12j45J44j91M5j99
5046a34L17l38K11k70k01M97j34O4n3K95j03J8j75m0O8O1Q9j73j43L86l65Q7J53
5069A17O5k78L85l79L13k36J02k81J42j51l1P1j01M60m12L55j53P8j5p5J2n5P8
5092A1K6k05J95K68k22j19K01l9k25L17k88J97k63J14K05k46M8J28j20p6M8p3
5114a18J70K28m93L28o9K16Ol93J48l08K78m8J67J55m53K82j71k2L3J15k55K87
5136H3p0j55K41j45L6j15J43J1L4J86m20R6R1k19J83j24L36N2k49j06J70j7J06
5159A48l9J35l79M3R2J04l61K56K88k99J09j77J10O7j33L17k43P0R8k51rJ39o5
$$ y = [-51, -126, -103, 51, -86, 10, 21, 115, 161, -87, 4, -10, -55, 120, 90, 180, -70, 181, -21, -22, -321, 192, -29, 179, -7, 184, -26, 85, -314, -226, 207, -225, 46, 150, -329, -103, 101, -195, 159, 5, 100, 212, 67, 211, 20, 65, -134, 183, -155, 56, -214, -415, 82, -52, 12, -41, 254, 151, 169, -6, -46, 22, 83, 172, -1, -144, 242, -123, -36, 117, 182, -96, 289, -90, 223, -13, 89, -192, -50, -201, -232, -161, -262, 198, -214, 141, -12, 66, 51, -24, -12, -67, 11, 37, -168, 27, 295, 73, -46, 155, 116, -109, 208, -80, 117, -146, -32, 173, -73, -25, 103, -17, -93, -45, -118, 52, 280, -213, 115, 46, 262, 268, -125, 23, -285, -7, -55, 112, 267, -186, 96, -75, -97, -64, 51, -204, 83, 13, -142, 99, -46, -10, -125, 18, 29, 63, 249, -171, -75, 16, -203, -20, -144, 192, 244, -5, -111, 59, 42, 148, 109, 244, -135, -92, 0, 104, -257, -1, 287, -12, 97, -80, 30, 97, -36, 281, 38, 108, 206, -45, -54, 85, 20]
5182B0mK88k27J48j40M7p7k76K79J31m55L10Qk09L83o9k93J10j06K04j37j00J87
5205B2j26Oq6L12l75K28k05K79j6p0j51O4n0J83l3J36j85K17m25N40l6m87K33
5228b5l4K71n49L49J92j42K34m14jk4L09p0j42Q3n8j84J23J91m8m3J62q6k85K71
5252H0kp4j16Q6j78M49k96n2J71k11K38j25m3n1K55l38L72N0m55J10N7k48M74
5275A53l23J69j8j7j81K21J21k00J10O3j68p8K27pj24J88N8j95j38n8r6K87Rm8
5299d5K09j37O8k99J91k16n7Q0J79j0P9j88J49j92K41p5L6L07o5m12L79q5m5r2
5323@q9J71QM2L9l95L51j68r8O9L0l6J25j07J24o3k7%j76K19K35k95j81K86J78
5348B42J22l96j47J78K24r3k01J13j09Kj6J6R7j36J50k7J02l4k48OM46l86J64
$$ y = [20, 16, 304, 77, 225, 85, 132, 55, -221, 58, 189, -266, 44, 52, -157, 226, 157, -136, -26, -132, 72, -65, -165, 22, -104, -98, -184, 128, -247, -19, -224, 55, 39, -31, -182, -118, -168, 15, -18, 118, -67, 150, -275, 265, 229, -258, -25, -59, 212, -337, 12, 204, 62, 296, -118, -119, -143, 166, 96, -46, 37, -21, -205, -82, 109, 61, 18, 180, 94, -191, 80, 78, 4, -112, -26, -204, 245, -51, -103, 68, -143, 95, -30, -73, -124, 131, -207, 165, 215, -240, -130, -73, -321, 153, -170, -1, -19, -36, -217, 4, 125, -75, 35, 98, -70, -148, 79, 72, -52, 136, 194, -1, -139, -197, -293, -6, 3, -45, 164, 27, 95, -204, -13, -229, -286, -206, -27, -37, 42, -146, 3, -189, 52, -23, 13, 320, 255, -157, 222, 137, 92, 0, -89, 82, 90, 132, 171, -224, 127, -41, -139, -70, -40, -76, 49, -58, 66, 3, -24, -24, -200, 19, 254, -41, -222, 64, 242, 364, -32, -179, -1, 223, 130, -71, 42, -67, -65, -81, -65, 32, -104, 46, 19, 121, 87, -161, -155, 291, -95, 69]
5371F9k05J84M7J22j19j56n3K01Q6m23K73o6K10q2KJ33k18k46kN37k79J06k66
5394a45N6n4K78m0k88L93k70P6K53p2k2n5N8k87P3J64k95o7J04J73j54L63k79
5417c7J19l12Q3K67r2K58k70J3j47Q8o4L8m6QL42R4m06k36J63qK86o5k34L9K40
5442A21k83J17K16k59J37J5n4o2ln5O6R7k16J79Q8l6k90K49j35J9N2O5J92k13
5466Gk49K73K24j92P3l75L67p8k1j8M23m13j28K46j72K1Nl32K72r1J69L7j15J08
5490D1l17J20J54KpLJ20n6m9k1Q2j32O5j16P4j32Q0L4J39L01m36m5K40k14j29
5515a99J29M81j76j67k28K22P2k06J28J3j69K35P2j45j52K14k39l0j60K79j85
5536b11j13O20m04L24m16O3j54N15k38J53Po6o9rr8P3J07j54K01j14r5qM0n4K33
$$ y = [69, -136, 48, 95, 217, 98, -58, -111, 90, 176, -247, 26, -40, 170, 88, 90, 223, 5, -241, -243, 294, 15, 121, -145, -89, -143, 135, 95, -193, 200, -70, 6, 259, 187, 165, 110, 168, -119, -46, 118, -177, -244, -140, 33, -121, 242, -37, 82, -230, -147, 120, 28, 286, 16, 29, -118, -30, -94, -56, -102, -94, 248, 342, -64, -300, -137, -145, 141, 76, -158, -119, 121, -162, -45, 171, -88, 49, 64, 10, -52, -55, -110, -44, 53, -163, 16, 104, 68, -222, 27, -108, -89, -37, 28, 220, 7, -242, 31, 255, 63, 136, -239, 128, 50, 29, 11, 434, 21, -107, 139, -33, -12, -7, -339, -67, -158, 11, 48, -67, 41, -276, -156, -2, 0, -7, -4, 116, 60, 11, -10, 72, -60, 5, -111, -37, -169, -89, -55, 84, 385, -51, -96, 144, -70, -199, -70, 411, 235, 68, -160, 62, 134, -72, 56, 69, -100, 135, 207, 62, -90, 124, -115, -145, -305, -26, -211, -324, 296, -108, 216, -200, -137, -291, 224, -14, 139, 146, 80, 11, 2, -96, -23, 84, -70, 131, 17, -78, -86, -46, -100, 133]
5561A33K4m1J16k73O9k54J57O0k60Q2L08j69Q7k29N04j49j95R7k0P8j77K46Ql29
5585a27M0K9J25R8no7j13N0l3j85L53j31k99M44j28o2o7L18q5j89O8J58k0J22
5609B94l07J31k65n1L70j05j95J98l81R5J88J3l8M6L5KR3l20K01o6K27m27K17
5632d5J82k65K06p8n6K80k20j50J19N7k8k66P3J63q2K04o2j93N19k69q4n6k5R1
5656A5k69J90M5J13k50J68j39K34K18k70j71J57K4j35J11J10j5l19J28J12L5J33
5678B25j54o1k33L37k46J19j47K7J92r9P5JJ38j91Q8k18J95j44J44J9o0N3r4j20
5702a54K38p5p0J2o4J13p9L87m97j05O61l18P5k61K35m8L3J18j21j80J8p1J21
5725c2j70K02J31k61J88j63K28J94m55j51L37M1o2J73l83K82k4j32j56J14O4n1
$$ y = [133, 157, 116, 232, -41, 28, -226, -69, -9, -269, -187, 121, -48, 39, -190, 314, 165, -30, 67, 47, 125, -52, 194, 202, -127, -87, -58, 67, 165, 160, 93, -20, 30, -3, -188, 165, 34, -265, 179, 51, -11, -78, 240, 155, -34, 34, 192, 172, 294, -13, 118, -147, -198, 172, 67, -128, 70, -311, -216, -28, -15, -53, -7, 28, 30, 123, -197, 4, -62, 165, -262, -45, 137, -128, 78, 0, -56, 224, 4, -146, -27, 30, 2, -264, -191, -28, -110, 94, 32, -161, 358, 89, 5, -51, -76, 15, -254, -64, -19, 94, -156, 12, -127, 107, 325, 55, -116, 41, 65, -70, 41, 151, 136, -183, -55, 57, 92, 225, 71, 10, -223, 114, -132, -13, -160, -133, 59, -40, 35, 36, 174, -17, 71, -147, 48, -96, 48, 67, 7, 60, -34, -154, 84, 9, -61, -49, -113, 0, -79, 308, -189, -294, 367, 49, 124, -137, 98, 50, 83, 201, 80, -100, -82, -153, -32, -202, 0, 131, -130, 58, -105, 123, 317, -138, -289, 48, 89, 27, 200, -183, 99, 75, -57, -213, -99, -35, -86]
5747h6J03k41K09Kj10L20m30L92Km41L07K52m36J89k63mO8N32n11o1J71J1j73
5770a98L87j03j93L12k09p6K51l47M30j93k46M21j46p6q7q1K05j98J73J70j02
5791I4j65l3M7p7J08O8J58J03k36m7M4l41K77J7N5M3k28J36n6J64r1k13M5p9J96
5816a1N2J71l86J44K7J37r2j55J28J79k97J60L24m05O5j6j9l52J53M9m7Q0K58
5839A47o1Q2k93L09l12O3J88j09jJ51J01k84J30Q8l03K06j00J58q0J0l5m6K27
5862B36M7n16J36K19N8j34J89k14L4p4J05J75l63J04k0n2l0J13Olj37K01J52j50
5886H2J9L5Ml69K96k35J33K29l26J54j17j46K56q1o7l7M3J7J85J13j73J20o9q9
5910b3n3K43j80M7L9J8k26j8r0J99jp6q7K95r2k76L31J22k9k41K11N7j26J93m3
$$ y = [-86, 17, -224, -15, -13, -123, 197, -233, 159, 161, -280, 27, 279, -157, 32, -231, -235, -167, 365, -146, -207, -36, -25, -198, 189, 86, -107, 205, -4, -80, 171, -176, 254, 61, -185, 236, 90, 14, -73, -154, 51, -147, 26, 196, 94, -71, -104, -57, -134, -26, 42, 200, 303, 67, 20, 64, -277, 0, 17, 72, 115, -113, 23, -33, 131, 40, -173, -128, -207, -11, 41, 212, -174, -30, -3, 134, 42, -113, 15, 194, -103, 57, 381, -24, 41, 25, 6, -346, -193, -144, -191, -111, 147, 86, 168, -125, 184, -128, -65, 123, 14, 13, 164, 265, -19, 111, 199, -104, 102, 2, 160, 80, 90, 55, 9, 236, 283, -233, -97, 122, 180, 46, 235, 21, 55, -19, 86, 261, -102, 2, -18, -70, -100, 13, 19, 16, -121, 80, 232, 82, 101, 136, 140, -229, 67, -168, -35, 194, -132, 22, -95, -241, 15, -66, -133, -170, -127, -110, 75, 188, 15, 135, 66, -23, -76, 167, -13, 34, 73, 91, -135, -153, -243, -44, -45, -121, -208, 87, -5, -281, 50, 172, 143, -98, 113, 170, 44, 237, 194]
5935A94j63j71J64M1j28M14k83NQ2j03j86L37j83m9LK20l15J02j57K74k60m4J24
5958h2M54l33j34M5r6J31j90N8M55J80l01j51j55J47N1l17J64J8J35L1l7j82K80
5981A71j95q9K45l28K58O3j9j49M28m54J48n2l44M71k52J51Q5l95L12nk58J95
6003a3L7P7J30n54J52o1J88L14l05L79j94J38j83l89K25n6oL6Q5M9N2m9j4j60
6027a22K97O6l71Q0J58K55k37l15NK29l6M7k58k1Q6o5K17L23n86R2K56k40L24
6050A84j17q2N1l30J00L63j21j23O8K83q2l22M15j85r7J08j3k45J52J56j14j29
6072h0J34p0N5j44J92j51M0J99j18K5k43K66L0j35J93J09l42oK28l00K68k52r8
6095b00K74J10j55M5l7k21K06Mj86j75J85K7K01j62k48N63l17l0J56K25l28J81
$$ y = [194, 31, -140, 24, 65, -63, 351, 68, 73, 155, 52, -134, 203, 20, -29, -26, 194, -121, -19, -176, 98, -162, -206, -82, 372, 39, -95, -50, -146, -15, -205, -147, 308, 488, 187, 36, -119, 28, 79, -238, -74, -56, 79, 110, 73, -109, 171, -24, -113, 132, -196, 62, 125, 106, -43, 385, -69, 79, 27, -317, 154, -98, 53, 138, -257, 55, 50, -208, -13, 24, 101, 231, -323, -171, -232, -44, 270, -35, 344, 150, 288, 105, -284, -59, -115, -121, -85, 0, 49, 101, 52, 38, -122, 175, 241, -130, -50, 108, 363, 126, -189, -184, 45, 9, 56, -202, -223, -137, -202, 15, 338, -248, -156, 100, -140, 184, 67, -15, 36, -294, -194, 169, 48, -75, -7, 276, 194, -128, 287, 102, 5, 113, 100, -145, 7, 163, 49, -80, 54, -16, 39, -105, 87, -64, -24, 175, 57, 82, -161, 105, 135, 0, 193, 302, -40, -46, 182, -118, 150, -102, -200, 74, 184, 29, 74, 37, -184, 22, 26, -160, -335, -150, -123, 78, -84, -332, 231, -86, -116, 40, 265, -63, 118]
6117A18jR5k53J87l16L45j65m0Rl0j58K86j88k7J67K26j49k95L90qk67N3q2J32
6141B9Q4k02L37L2k42J61j84j62J20K60j95ok13K31j0p1K70k84L01k93J17k40
6163a60J66j42K93j86J55N2j32l02J07J61QR6j10L4K11j19k73J50Nj10J00K12
6185B16l00M0K37j67K52k31k06J95J9ok6K11j28j55l2J16j12J43j28J47l94L80
6207G1rK4k15j22M17l58n9M10k25j50L20j18K6L4k6k41L17r8J10j80o6j24M26
6230A64l22r9K50J0k13JP2L8L71m18J96k23R1K02M3k96N4J86q8k53L34q3MJ92
6254B13l11qK41k05j17K63O5m04J23L52n53L82n2o9l4K11J28k37r6J59J39l39
6276a49J0J23r1q9K82M9n0j27J0Q8Q2k60J12o1K13j5k47J79o3k24M94l52J27j36
$$ y = [118, 117, 212, -41, 146, -170, 175, 10, -30, -21, -51, -209, 77, -111, -138, 29, 255, 106, -189, 201, 193, -74, -21, -103, 29, 113, -89, 248, 280, 38, 199, 15, -147, -27, 233, 38, 32, -181, 50, 40, -31, 239, -45, 256, -37, 80, -160, 6, -136, 157, -29, 126, 178, 46, -256, -149, 12, 20, 116, 6, 40, 251, 132, -141, 9, 14, -96, 4, 216, -84, -44, 193, 26, 278, 47, -159, 36, 55, 49, 23, 234, 106, -49, -81, 35, -77, 66, -62, 85, -309, 71, 62, 86, -129, -251, 166, -192, -251, 159, -66, -216, 104, -14, 12, 46, 20, -221, 96, -2, 108, -72, -138, -262, 164, -158, -257, -7, 3, -210, -209, -137, -99, 272, -146, 50, -173, -82, 120, 163, -133, -79, 107, 19, -234, 100, 17, 21, 213, -98, -106, 135, -70, -187, 76, 141, -263, -140, 212, -341, 41, -11, -80, -114, 97, 225, -12, -108, 51, 190, -149, -139, -16, -107, -196, 86, 135, 85, -42, -32, 56, 138, -122, -10, -71, 142, 127, -120, 59, -4, -228, 266, -86, 41, -95]
6300i5J01j12J67lj42J01r4J89k12J53n4q0j54O8J76J50M6k32j2P0O8P9R6k34
6324D0O0N9j14N0J06j70L77o12P0j07M35k71P6k04J18k5J35M4k95K33L2p2K72
6347B37j68j48k9k56L04l7P1J31j97q0K40J46j56P2k58M4j94L59J42k35j24J37
6369AJ35j07Q4k15J63k47K12p9J21k9K4K40o09K79J15l6l29M43o3o2o0j6K06l71
6393b00L33j74K0r7J93l12rL73j48k45L4K32j45K60J03l28K9q9O1P1p6J05k3R1
6417E9J01j75R6j39L89m63J20j58K75q4J15Q3k98J00k4J89l39L0K48m29K60J07
6439F3r8k6L8m4O4J14j09N6j05J62J8j75J24r3P4J01j47K12j90l6R6j65J18o6
6463a4n6o4J33Q9k98J87m9j07J04L46k78l0n6M1l48N22k82k3L22o7J46m06J73
$$ y = [-95, 6, -106, 61, 58, -84, 17, -77, 112, -100, 53, -1, -81, -235, -167, 9, 159, 205, -27, -39, 31, 99, 178, 274, 40, 100, 159, 45, 95, 201, 31, 408, -204, -134, -241, 194, -77, -1, -205, -87, -112, 23, 67, -228, 5, 37, -35, 237, 69, -79, -108, -364, -60, -97, -26, 105, -92, -172, 68, 214, 58, 130, -128, -84, -278, 81, 223, -12, -136, 1, 136, 29, 113, -102, 61, -186, 26, -53, 68, 39, 63, 303, -306, -27, 88, 52, -277, 166, 103, 41, -19, -35, 171, -200, 133, -41, -21, -118, 75, -237, -246, 127, -21, -266, -232, 0, -145, 115, 218, -110, -81, -170, -109, -38, -114, -9, -32, 59, 160, -15, 81, -58, 331, -132, -12, -170, 105, 21, 136, 219, -79, 21, -3, 186, -153, -123, 125, -304, -44, 63, -35, -61, -23, -67, -3, 111, 2, 58, -47, 115, 133, -42, 82, -11, 63, 164, 17, 229, 39, 3, 99, -66, 52, -14, -70, -134, -1, 88, -210, -23, -72, -179, -75, 271, -7, -37, -93, -52, -400, 122, -160, -183, 139, 72, 218, -188, -15]
6486a5l6N9K3Jk22j44J73j29L31Q6k31l3R2J67J96l31q8n0J00M9j68n8J17J36
6510B5j22O1p8K50j17Pj16p2n0K45J42j67J52k04J05k07J07j27L49k1k91L56l18
6533i1J03k30J21J56K7r0k08J51J42j33J05J64k59L09m50L06l92L44J88j40P6
6554A99j56L7j02J62p3j7Qj24K21o6P3Jk75q6J83K2k89K34L89m52J14L8J0p8j55
6579a82J23Q2pK3J4j88J44K8jm7M3J67l50K33q6J45j16k04L01j44j16J45K20Q0
6603C07m02J18j09p2n3K20M6j79k20N23l47K42l13R8O7j01L52m72M06j92R1K52
6625B62j53J37k34j1j67J60J86r2k3q6J4j88K78l6J21k6m3k17K9j03K21o6n7J64
6649G0m2L1P7j34Lo0R2k56K1J54L33l58n9L88l51K55j77o9KP2q5j42K21L3j71
$$ y = [-15, -51, 8, 31, 32, -190, -334, -161, -290, 41, 127, -104, -137, -45, 122, 318, -13, -101, -151, -51, -2, -170, -228, -111, 25, -97, -36, -114, 136, 19, 26, -90, -162, -212, 33, 175, 8, 160, -44, 61, -146, -39, -166, 183, 162, -129, 227, -91, 12, -218, -97, 59, 86, -4, -212, -61, 81, -52, 53, 217, -42, 267, -183, 123, -269, 75, 263, 123, 199, 43, 80, -22, 140, 67, 50, 58, -66, 155, 89, 162, 163, -112, -198, -15, 7, -282, -48, 341, -111, 3, 41, 51, -27, -182, -59, 23, 16, 39, 53, -135, 9, 37, 36, -11, 32, 199, -151, 82, -4, 141, 25, -179, 122, -22, -138, 7, 227, 307, -95, 23, -86, -158, -211, 9, 55, -124, -344, 179, -168, 74, -239, -141, -74, -175, 177, -295, 111, -81, 10, 262, 109, 246, 12, 1, -166, -6, 180, 88, 65, -21, -7, -195, 83, 47, 168, 142, 99, -118, -89, -192, 29, -37, -94, 70, 28, 59, 136, 2, 5, -55, 37, -219, -198, -44, 289, -69, -128, 260, -91, 164, -13, -82, -80, -8, -93, -235, -14, 19, -152]
6674a52j1K3K36n4k63K21J29j10l8j11k8M72l08J41l50J14K31M1k35j19J13J11
6696E3j75Q7J77j73L45l94k7J31K05r6Rl18K28r1J11O1k50mM6j71J33k9J57j77
6720a62J44j63K44J64j77r9q5K49l9Qo4ok2n4J48O5j74l4J89l22k6J90J24k37
6744a39N7K39j77J85p1j33J10j37r9J37Q0o2K3j21L9j95L52kj64K40l08M8J66
6767F8j2j13K70j32l9k0j48j08J13J32j9OKj38l2K92k30k3K88Q8l13J36J7j01
6791a6N7p2J13q9N7L1l2Q1Q5l20J6L29l61M2K15k93J82l0Rq1R0j56P4L60k41k13
6817a63N8k4J19J08j57q3J84r4J03M4l52J52J17J72p5j63K44J97n67R6L64p8j10
6840I2J60m48P8K59k71K58o5J7J53l09J39J40l05o5K12J69j67j06K0J00J55q8
$$ y = [-152, -163, -140, 96, 42, -221, 0, 129, 19, -19, -130, -158, 314, 6, 147, -203, -89, 142, 183, -52, -171, -58, 53, -122, -35, 142, -31, 314, -80, -107, 24, 229, 133, 142, -176, 52, -39, 72, 133, -117, -121, -75, -246, -113, -142, 15, -162, -18, -181, 63, 227, 50, -49, -134, 115, 76, 84, 20, 14, -8, -62, 86, 151, -23, -57, 132, -190, -216, -26, 98, -139, -82, 157, -20, 165, 94, -39, 71, -66, -165, -28, 52, -10, 13, -108, -69, -264, 88, 86, -78, 162, -146, -98, 68, 56, -57, 213, 81, 42, 22, -126, -234, -121, 11, -8, -2, 0, -138, -170, 122, -108, -131, 157, 245, -68, 68, 85, -16, 41, -31, 82, -7, 50, 81, 49, 130, 215, -105, -89, 240, -121, -79, 136, -157, 25, -5, 4, -77, 13, -143, -69, 291, 50, -163, -105, -129, -10, 98, -59, -142, 42, -52, 51, 95, -257, -105, 12, 184, 109, -54, 190, 387, -180, -84, 280, 202, 92, 252, -196, -118, 141, -130, 128, 63, 80, 233, -76, 63, 203, -102, -167, 45, 214, 47, -59, -39, 61, 216, 128]
6862A28k06J68o0j59k04K77j2J19l79M52p7k14j23M84l13K07q1q8J86q5Q7j77
6884g0Q9j93K43j16J5j5k3L70o5k76P2n9P4j39k4K92lk29K88m11J15L18m1k09
6908CJ15j79j42J86K82j89k54j90N01j45ml0J47J13k88j2J39m7N2Q6j05k72N6
6931a77K00o4j18K10M6l48J30k5L21k76R9k1K3L3Q7k6J27l27%L1o3Q7qR5J10k72
6957a26J49LK3j9J14j91J89j51j18M20j72k51K02q7l66K46K38q1j19J99r6J45
6979A51Q6q1l30K66n7m3M4M9M2j77J49n5O5m32J98J22K9k8k20L68k67N2p0K76
7003A37J47r9m2l17K97j14J5k30J79r8J78o6l6k4o8K16l03L57m2q8K4J00j00k50
7027b27K79J10M1k61K47j26j5j24R8k15K75j70J3K32j31k07q1L14M8k19O5j70
$$ y = [128, -78, 90, 30, -129, -333, -56, -68, 51, -328, 124, 47, -167, -290, 194, -119, 88, 7, -81, 105, 20, 107, -70, 19, -174, 69, -47, -32, -47, -70, 300, 235, -41, 31, -28, 46, -93, -117, 175, 172, -57, 231, -180, -65, 253, 212, 3, 118, -61, -203, -17, 265, 76, -178, -368, 133, -12, -16, -46, 101, 214, -74, -86, 53, 6, 58, 144, 39, -233, -177, 23, -41, -159, 51, 97, -251, -121, -146, 175, -101, -2, -23, 0, 33, 120, 94, 221, -106, -106, -75, -138, -51, -59, 36, 146, -126, 23, 26, 49, 30, 144, -47, 142, -9, -127, 293, 121, -130, 72, -15, -381, -135, 103, 22, -97, 102, 6, 151, 237, 156, -174, 92, 35, -8, 36, 85, 127, -50, 99, 44, 109, -323, -125, -3, 26, -2, -222, 146, -121, -69, -139, 137, 284, 185, 143, -174, 123, 9, 24, -206, -27, -125, 53, -13, -49, -73, -141, 75, -228, 129, 87, -1, 23, 123, 23, -227, 52, 162, 203, -58, 189, 63, 48, -76, 22, -193, 82, -88, -75, 157, 26, -181, -262, 52, 100, -119, -54, -224]
7049b24M21j38j51J27j09J30L0j71j96K44j2l4J54J5k97O0J84n3Q6j06J84m8l5
7072F1J90n08M57k23Q2K08m13J09j24J86l9j7Rk03M65k62m1J85m00J99J42j77
7094a14J34onl0j57J93p6J02l9J76l24l8L03J50m19K35l91J30j05K49P3K45m43
7117a57k34L83R1J69k5j44J10r4j29L8J07k11K83j06n4J58k93R6l3j70L25k1j34
7140d5k65L00L1j11J96N2k96K25j5l57K66J5j00L8N1l21L0M55Kl82O06k97j04
7163b6n0j84K32L8K20k37L3k0n7Jm9K35l82M04l65p7L13j42K37k31J16M9R9j61
7187dr7J58Ol2r4k2Q9m3K04j01J48j63K32m35J69j87L52k62O9m3N8K08M4n10J39
7212a17L7r7Q4K36n21L95k08P9K0Q5nk15K91l5j15O5L26n18K20mQJ0R7k55pJ25
$$ y = [-224, 197, 59, -92, 35, -74, 56, 86, -85, -281, -37, -49, -83, 71, 86, -211, -151, 33, -20, 66, -40, 144, 96, 61, 251, -257, 200, -23, 59, 267, -146, -37, -161, 25, -14, -31, -22, -225, 240, -22, -63, 122, -278, -79, 63, -114, 20, 14, 9, -21, -178, 15, -61, 41, 2, 178, -146, -184, 119, 269, -150, 85, -306, -176, -281, -32, 41, 286, -157, -391, -8, 83, 252, 227, 83, 193, 99, -30, 8, 115, -96, 187, 81, 27, 185, -108, -12, -45, -215, 110, 89, -45, -310, -10, 21, -90, 106, 158, -138, 87, 72, -285, -19, -4, -104, -66, -15, -336, -306, 149, 151, -231, 375, 78, -26, -76, -260, -28, 10, 230, -7, 26, 6, -51, -50, -99, 136, -246, 158, -207, -284, 29, -113, 124, -107, 9, 58, 157, -4, -101, 57, 63, 31, -63, -85, 4, -39, 165, 64, 212, 49, 281, -154, 15, -172, 180, -82, -13, -56, 2, 210, 254, -256, -117, -80, -177, -93, 143, -378, 17, -191, -112, -92, -7, -12, -227, 64, 29, -86, -21, 305, -213, 7, 3, 11, 21, 118, -137, -144, -19]
7238a9J0k28P1m4J15K55j17j38j20L58j15J21l80K63m1L9o5o7J20N1N8k46q9K17
7262Ij13R3nJ94j63lO4j4j0Mj32k2K17P0k34R3J17p6k63q3K85n5K25j57L5j08
7288c2J78j13Qo9n6L26l28O2j75K01j90ML21o3lN3q4j34l7j77J17NL6J83L3k98
7314b32K61L5l80J97K48j55o2L4N3l4o4L73o04M92o3J7p7k46K99Q3l96L25k87
7337a83j08J8K92j16J74l6K1k71L7j39K90K5k36M69l03J82j30Pl8P3R1K10j2k04
7361A13pJ54l92p2k1N2J14L06k62r6J54l28J39j06L23k61K88m07L45O9j23p0l5
7384a23L26l16J46j75L96j96Jr0rK01K4j69L5j06j24L74K4k60J16j04l4j77M69
7407B29l96L0M12j55j33n0M7M1k12P4L80j93k64K35n2K5j01J21L0j55K38j48J09
$$ y = [-19, -9, -237, -166, -210, -95, 160, 43, -95, -215, 143, 28, 149, -231, 32, -9, 30, -35, -102, 18, 69, 127, -119, -208, 9, -104, -11, -16, 178, 15, 12, 76, 62, 52, 56, -76, -98, 119, 189, -45, 48, 165, 89, -174, -257, 28, -27, 198, 41, 76, -32, 146, 33, 41, -28, -84, 242, -86, -24, -199, 2, -188, -184, 137, 74, 71, 124, 40, -94, -131, -308, -191, -186, -150, 33, 66, -232, 29, 64, -316, -119, 129, -26, -88, -54, -1, -35, -99, 274, -330, 162, 99, 116, 39, -207, 92, 175, -221, 104, -183, -291, -273, 19, -97, 77, 41, 62, -209, -172, -311, -21, 4, -232, 237, -66, 116, -14, -7, -45, 28, 119, 329, 317, 113, 106, 260, -132, -204, -225, -173, -59, 247, -15, -111, 43, -285, -146, -252, 71, -190, 98, -309, 36, 105, -18, -88, -123, 203, -113, 33, -142, 254, 58, 59, -31, -40, 161, 185, 16, 51, -55, -179, 195, 219, -41, 75, -29, -63, -240, 229, -167, -137, 275, 120, -13, -63, -16, 25, -187, -113, 267, 74, -190, 45, -7, 18, -83, 38, 68, -87, 151, 3, 112]
7430A12k51k26J90K02j7l0J31l37q4K34P8J38l13M12j50L5n65M30O3O6j38L3r6
7453h3k47L76R5k83J84j00q3J24L10l29j55J78R1j62P5P9j8p1K65j27j89N8O4
7476E2N0k53K81j51qP3j16p7m6J80R7j99J75j03M1k4k14J84K77l32K15k03L40
7499B39k58p7K25j21M3j1k5MK25l13k42J71K92m35L57j66L00L7j52j27K00j30
7521C6j65Q4o6K18n03K61K34R3l94N4p0L15m06K14K5rp3K25rq9j08P4k76K28L04
7546A97k35O8j31J05p8J54j62K65j89J48j22J54l25l8J83r5O6J28n6k21N62m55
7568g7M38j78p0l37L53q3j4j44k8J72j72j47KJ04L37k89j13L55j54K21l71J54
7590d1l6J14L0J36N5m73K33K38l27O7l7L26n13K08L89k93L8l47J46J42p7K34l73
$$ y = [112, -139, -365, -175, 27, 10, -20, 111, -226, -310, -76, 2, 140, -173, 239, 89, 124, -441, -11, 52, 118, -20, 13, -83, -330, 46, 141, -142, 42, -58, -141, -17, 293, -36, -191, -13, 78, -84, -9, 70, 52, -19, 246, 119, -70, -12, 52, 102, -151, 130, -21, -29, 44, -72, -149, -195, -15, 82, -117, 58, -45, -4, -28, -242, -58, 219, -113, 102, -101, 239, -19, -96, 129, 8, 51, 40, 15, 19, 244, -69, -311, -140, 152, -283, 74, -92, 208, 245, 93, -34, 166, 36, -129, -45, -111, 107, -396, -135, 99, 192, -202, -148, -218, 97, -309, -95, -70, -79, -152, 73, 64, -25, -133, -59, -335, -107, 197, -38, 30, -101, 4, -74, 80, -82, 183, -6, 142, 20, 174, -151, -189, -6, -101, -35, 93, 37, -184, 378, -77, 361, 183, 113, -224, 129, 46, 32, -112, -140, 32, -140, -287, -285, -181, 156, -133, -246, 109, -45, 176, -195, -41, -77, 37, 67, 203, 258, -215, 18, 256, -71, -4, -41, 285, -228, -20, 369, 76, 114, -233, -87, 55, -22, 212, -161]
7613a61L8L76l01n3J10j92j06L94O2o8q1k7K25O7n8K0l06n2p9J46j9J47mQ9k50
7638h3N4k8j81M90j0k42mn9L8J53k09P6n7k84L62J09l73jL49j26J22j81K23n8
7662H0k00J74J82m2j99K58m89K94K06k70N6l55K79N1K0M1j22q8K57o9Mr0jr9R9
7687b3J9J80j68J10k22j34L39m96M31q9J28P4k71J81k03O4J41Q8r8j52L04k14
7709a1q4j8Q6M5q1N8L25l63j42K52J22j13q5r7L95l46l2Q8m2M6J09k60o0K13q6
7734h1K18l06K80j68n0j6J37nq7L88l51j66L07r4j34K74j23j47j92J52L58l04
7756a10M23j41j30o8l5nl1pL9J66n4LJ61j74m2L06k15j96j99L71j18R2m87M19
7780c2j48N1O3J49m9L5m4j31r8L9L95l74K49K08j67j23j40n0K78j93J65k93K52
$$ y = [-161, -123, 253, -48, -101, 9, -183, -289, 105, 167, 99, 18, -9, 216, 283, 225, 245, -61, -113, -192, -46, -65, 82, 78, 167, -83, -29, -57, -238, 252, 242, 0, -4, -63, -25, 128, -81, -5, -62, -346, 16, 125, -248, -249, 100, -26, 96, -85, 138, 80, -120, 54, 236, 194, -5, 253, -236, 58, 264, -6, 50, -305, -26, 25, 45, 86, -36, -124, 133, 64, 68, -22, -23, -122, -23, -4, 176, 8, 118, -104, -238, 101, -395, 36, -53, 75, 149, -122, 59, -144, -80, 61, 149, 51, -101, 203, -11, -95, -113, -27, 18, -63, -5, 320, -43, -185, 67, 189, 76, -9, -106, 289, -57, -89, -1, -43, 3, 112, -148, -208, 5, -81, 137, -169, 111, -57, -107, -123, 14, 9, -78, 310, -41, -207, 100, 6, -128, 146, 23, -124, -316, -164, 194, -110, 313, 172, 42, -26, -61, -66, -97, -104, -65, 101, 47, 50, 211, 37, -5, 301, 86, -110, -309, 62, -56, 36, -451, -32, -180, -129, -66, 83, 34, 69, 25, -106, -204, -165, 230, -144, 105, 313, 146, 23, -117, -167, 111, -82, 83, -210, 42]
7803D2O0ml59K17L07r8m22J6J19J62r0J26K15p7k88K32k45K19n6j86J96k13K81
7826A54l34J9j39J48K44l3p9J17j55p1N8J46o6j31P3K6L1R4k63K24j42L23l94
7849a50L9J27K9NP6k73P4j6N5j76K22J18q5m4j00K91Pj82o3P6j10N1J85j46J06
7874A16M8j56lJ72k31k03L11%M9k53J30N8Q2j48L53k86nk3J01k63k37L46q9j32
7898b63K50P2o2j43L50m07K24j01l8q4L15k54K40o0rk47L7K5L1J53l9K35l96J20
7922e1J74ok43J76j56J69Q1j30j99L70k79q2P9M6K02O6k30K23l36R6R4k27J64
7945Ak5m2J34j95L10k5N6o07L50J77k34J28P2J68l45J56J21k84J01J12o8O4j29
7968dK02k96M33l38K58j75k30K66k71J24j61n1j1J67P6L1L70k86L0k95N4K12j32
$$ y = [42, 102, 98, -261, -44, 263, 165, -257, -241, -122, 40, -50, 76, 291, 214, -74, 158, -87, 132, 76, -110, 86, -127, 154, -180, -161, -300, -152, 92, 59, -20, 97, -58, -129, -71, 75, 9, -122, -49, -23, 8, 102, -161, 63, -79, 244, -150, -111, 16, 45, 50, 126, -147, -73, -89, -34, -210, 12, 130, 45, 1, -99, 192, 199, 17, -46, 30, -80, -29, 156, 10, 116, 164, 8, 5, 177, -54, -257, 54, 54, 103, -150, -20, 38, 120, -28, 325, 39, 34, 11, 112, -151, -388, -42, -131, -263, -13, 59, -3, -146, 204, -203, 21, -80, -118, -202, 113, -141, 99, 39, 30, -217, -180, -155, -124, 29, -10, 225, -171, -51, 123, 117, -126, 50, -106, 63, 144, 14, -185, 185, -94, -176, -97, -51, 151, 217, -13, 210, -126, -30, 64, -163, 1, -24, -66, 68, -127, 183, 158, 214, -393, -43, 134, -100, 28, 100, 268, -77, 79, 200, -84, 17, 129, 61, 125, -4, 198, -98, 335, -3, 255, 80, -150, 116, -155, -31, -192, -243, -254, -87, -11, 20, 390, 104, 134, -161, -107, 105, -27]
7991b7k17J83K51k45K87k67J16j67l9j4M7J57J44l49k8L4n7Rl9R9K15m8k67j01
8015c23N42k24J28J66m35J21O9L2j70J26j18K8Q7P6q9K82k41K16l89j41J55Q4
8037a8j08O9K48l73K11K05k28J24J43m09q9L52p5l64K98j8l4q8L60k24o5m1K96
8060A72l39m9L54k93N7j73K89J48N6M0l9k13L71l90j62J0K33p5j94K5O3J51k60
8083b18J91j51K81k72l2M00k00k15N17m20L94p1l99J23R4k8q6j30R4NJ63j47k
8106a09N14l11J1J0j92J2JJ28k54J81j08n2J50JJ49k84L66j48Q8j87m9p6J03M8
8130hj19K64N8k63k3K35k25M5L8K08k02R7J72m76N6K90l2Nk68K07k20L82l84L01
8154A38N9j86l07J41J54Jo0q2J17K11o3r3q1K8J69r7k13J85K29l46j91K31J96
$$ y = [-27, -244, -61, 190, -55, 232, -35, 81, -86, -125, -139, -92, 65, 209, -140, -168, -134, -191, -182, -221, -122, 93, 45, -222, -323, 219, -5, 123, 289, -146, -25, 44, 76, -94, 32, -86, -58, 29, 105, 16, 298, 57, 273, -116, -257, -102, -18, -126, -57, 191, -182, 29, 234, 6, 130, 273, -136, -225, 127, 52, -312, -14, -32, -66, -154, 206, -18, -83, -124, 172, -167, -216, 138, -155, -98, -271, 18, 166, 222, 262, 223, 10, 381, -9, -171, -161, 72, -3, -197, -172, -109, 42, -218, -27, -178, 103, -169, -201, 199, -1, -216, 301, -119, 275, 204, -195, -72, 22, -6, -92, -222, -128, -123, 40, -107, -109, 405, 94, 105, 115, -77, -65, -64, 64, -190, -9, -117, -169, -19, -18, 131, -153, 213, 65, 153, -34, -83, -159, -56, -8, -127, 137, 195, -68, -91, 144, -81, -36, 2, 210, 8, 105, 277, -199, -143, 147, 115, 120, -148, 59, -161, 221, -163, 138, 197, 11, -296, -155, -1, 0, -60, -142, -25, 186, 123, 30, -51, -23, 146, 49, -164, 21, 250, -96, -287, -56, 140]
8177A40j65J25k43Q5J27l72L05r6L13r2k01L05l42J07
$$ y = [140, -25, 100, -143, -58, 69, -303, 2, -94, 219, 127, -74, 231, -111, -4]
8191d
$$ Imaginary data points
##PAGE= N=2
##DATA TABLE= (X++(I..I)), XYDATA
0@%%%%%%%%%%%%%%Qj6J6j6J6k2L0l2M0m8N4o2P2q6J00j15J31j48J66j90K15k39
36a26K68l01L40l80M22m70N22n79O41p10P83q61R50j048J155j272J400j545J706
55H95j885K091k327K598k916L292l748M319n054O035p422R556j3299K1773q0766
70f6858K0949J27887m3055o9962k5998M9111K5492o932j2891O446j0599K567J3888
83A0045O259j7563j1540P749K0135o836j6355o6R298O63q04k929L47k294J144
98b747O602Q6q952J462P112J473n409k117L588J821l520j32L014k286j922K146
114B19J188j208k053J044K587k024j095J663R32j603q07J677J229j760j252K210
130I47K45j772j15R96L45j269n03J602l23r12M43J14k18N72M21K58r35n60J426
$$ y = [0, 0, 0, 0, 0, 0, 0, 0, 0, 0, 0, 0, 0, 0, 0, 8, -8, 8, -8, 8, -14, 16, -16, 24, -24, 30, -32, 40, -46, 54, -61, 70, -78, 88, -102, 113, -126, 142, -159, 181, -199, 223, -247, 275, -304, 337, -373, 410, -451, 499, -549, 606, -666, 734, -811, 895, -990, 1101, -1226, 1372, -1544, 1748, -2000, 2319, -2735, 3300, -4122, 5434, -7865, 13908, -66858, -45909, 81978, 38923, -31039, -57037, -7926, 17566, 10634, -2257, 4189, -6410, -3843, 10045, 16304, -1259, -12799, -5050, 15085, 8249, -8106, -8172, 1126, 1789, 985, -1944, -1597, -3891, -2747, 3855, 3941, -5011, -3549, 3563, 5036, -373, -2490, 1098, 2919, -601, -733, 2281, -5, -1927, 219, 1407, 199, -1854, -810, 1777, -247, -1342, 321, 1253, -350, -1157, 520, 1749, -11, -1263, 947, 1192, -580, -695, 301, 646, -623, -1126, 476, 153, -759, -316, -202, -420, 152, 573, 831, -104, -664, 762]
149G62M87j377l37Q64M54r42p91O98M02j425N44J316j075r62O71J426P9j616M
168h18J627r9n78L05k22j47K23K78L38j587r91J972J030j657j244P01J353K82
186G66j857P05Q93o37J27O62m35k8l78O66O13j080l41N04k75K02j11k81j5r6M20
207B4K26n66p49P95P06j3p09q6P94L53p21rJ28j95Q6j76K02k22k49O51l71n61
229f62L60N09p8k19J06J47M4n37N33K70k35k43J18L02k00m61ON19k86l34J85j11
251b67K0K83j82M24k64J47j7N9j44O0J75k03q2k31N47J62m36l1j46j34O9rK17
274A7M90n89j94L60n0k71N1l5M61J1kro4m49K88r6J02q7Q2j41L71m79L48J2Nk52
300a20J00O5n4o0J82O0l09J36J01k2k0n3r1K13l58K74O6j95kJ55j15RJ19l13L77
$$ y = [762, 1249, -128, -465, 399, 853, -89, -880, -182, 220, -1205, -661, 655, -420, -1382, -711, 715, 794, -822, -818, 809, 710, 132, 437, 215, 68, 291, 569, 907, -680, -1671, 301, 1331, -326, -1570, -869, 484, 766, -1091, -386, 507, -130, -3, 659, 224, 196, -182, 484, 1097, 17, -324, 180, -95, 107, -4, -285, -300, -396, 24, 250, -316, -1065, -270, 436, 423, -286, -372, 422, 775, 54, 45, 173, -22, 64, -112, 90, -132, -381, 270, -101, -662, -302, 207, 129, -90, 16, 163, 207, -330, 203, 473, 238, -5, 113, 415, 215, -246, -240, 279, -7, -341, -156, -267, -247, 36, -146, 278, 14, 161, 144, 203, 59, 119, 294, 91, 9, -222, 325, 487, 51, 20, -126, -260, -191, -200, 17, 507, -82, -276, 84, 34, -237, -186, -221, 240, 251, 249, 240, 176, -273, 15, -81, 21, -66, 16, -125, 246, -233, 115, 127, 132, -120, -20, 45, -9, -69, 113, 173, -136, 0, 101, 79, 59, 6, -85, 128, -230, 44, 110, -85, -87, 68, -47, -38, 81, -232, 145]
325A45N7o55M69K04k04P5k14K02J29n57J72M70k93J57k47n7M1r1j99N12j24J15
347A07r0j33L16j73J73j65q3K28k20M2j54L99Q5l58j73J90M6J7j72J50Oj08k51
370c21J53K02J85l12k74M12l70K12M9J83j75k75L45J40j95j06L21m64K33J11k03
391a49J79k52L11R7k00l9k59J51J23mj0K70r7k20L03j61k90j00L62O1n1k26J06
414i5J49J0M1k82K33j47K15k58j5L10k63j4M3J3O9n4M6L2o1J44m67K37M1o6j4
439a53K55m7j98p9L19p4K36n09K42k19J88J44j26M3qrJ00Q8j58K43l91K02o5R5
463A19l38K54P0j22j11r0J49K74m33J04J15k64O56k20l68O5J07o5J14k12j50L56
485A0j72K65k3Pm9k16K25R7k63R0q0K05k95J66J6R4j09J17m7k31M39l38J78L7
$$ y = [145, 202, -453, 16, 220, 16, 91, -123, 79, 208, -349, -177, 293, 0, 157, -90, -147, -106, -197, -396, 116, -8, 107, 17, -116, 200, 27, 200, 35, -48, 180, -40, 2, -152, 247, 332, -26, -199, -9, 37, 54, -118, 32, 38, -70, -321, -168, 34, 219, -93, -367, 45, -325, -113, -64, 119, -56, -331, 14, 154, -41, -147, 174, -290, -57, 54, -149, 30, -222, 89, 186, -14, -53, -312, -161, -38, -42, -52, 218, 121, -99, 204, 43, -247, -347, 15, 76, 25, -201, -95, 54, 64, 105, -177, 56, -91, 124, -134, -149, 161, -102, -116, -73, -60, 9, -45, 1, 33, -28, 116, -351, -114, -73, -139, -153, 102, 55, -143, -222, 97, 23, 259, -250, -8, -227, -39, 105, -21, 22, 14, 5, 105, 193, 35, 278, -113, 89, 24, 119, -219, 35, 105, -17, -128, -218, -69, 205, -228, -124, -9, -273, 383, 163, -205, -140, -33, -98, 16, -196, -346, 10, -162, 103, 80, 87, 38, -178, 47, 144, -119, -29, -109, 96, -199, -33, -17, 77, -32, 85, 38, -193, 246, -92, 86, 123]
509A23O3j98j47n6M59m14K33m5J53j73o5K57l63j2M38j74K7j68M5q6L7r9M95m99
533a69K4J46p0o3L49j58k40K80P8j93J19l1jJ54j76J57j95k28J32K76k93K39l45
556b08J16J03J32j74J1l0j91K61J27j75r0K65k11O6j0Q4k11M70r3m93J68r9J12
579g0L65m47K12j91k1J90L03o16K95p1J8J65k01L35l37J87n6o6j46j15M62q1j19
602eK38m8j62n7K19n8k58R9m3J52P7n2n3O7j01j3K04l04pJ18Q7q7K15l44J55m2
628cK61m07L98k37P8m9M5Q6j84M4m00M46l98K63L7L02l99J22J81j90J91l06J68
651D9j13L1q7OK58j63N9l06L53J48k59Pp8J21K33n05R4J57P4k7J27j94p5K13j71
676d8O4R8k02L02m23J08L72k86p6L5J03j53K72o9l32K70j44J60k2j53p3J31m0
$$ y = [123, 186, -12, -159, -215, 244, -170, 63, 18, 171, -2, -67, 190, -173, -185, 253, 79, 106, -62, -17, -103, -66, -165, 330, -169, -145, 1, -69, -132, 217, 59, -181, 99, 177, -16, 103, 72, 71, 225, 49, 206, 11, -217, -85, 191, -102, 137, -208, -92, 11, 143, -31, -20, -50, -241, 20, 147, -28, -118, 147, -64, 2, -8, 76, -135, 335, 242, -251, -83, -182, -70, 295, -152, 60, -131, -152, 38, 341, -275, 20, -51, -33, 132, -69, 266, -71, 116, 60, -6, -152, -267, 195, 114, -5, 233, 185, 23, -34, 185, 127, -131, -32, -75, 77, 154, 102, 49, 116, 15, 2, 206, -98, -105, 13, 100, 13, 228, -116, 39, -3, 258, -149, 249, 12, 90, 41, 86, 172, -12, 32, -368, 78, -320, -57, -20, 282, -117, 5, 186, -4, 187, -119, 49, -64, -33, -120, -114, 144, -19, 40, -266, 87, 235, -24, -17, -95, 26, 259, -246, -152, 5, 79, 52, 179, -15, -90, 123, -48, 16, 114, -88, 214, -209, -101, 271, -15, -91, -56, 47, -106, 166, 97, -235, 35, -109, 51, 29, -124, -197, -66, -106]
699a06j6J84k2O4l20K27M1q5j27L80j21k05L02J02j02j86k33K66J59l11l4J93
721E0O2k61L04l38K02j39L49l90K47j21Q5j19k64L71n2Q1p6J53M4j41j24qO5m2
745f2J72l3k14R9J31j07j29J4K61N5k86R3K20k05r9J49P9j52j65O7K21r1L8p8
769b2Q6n9j19K87k22J55n16L30M2q6m6o2p9K73K7J01J69l16o5L22k95M38k55j23
793c5r3M6LJ54m2j38J03J20j45R7k34k9K41l20L20k65KJ86Q4j14J84j17j2Q0J21
818A97J8q5r6o2j49K14j92J84Q1j16J85k74J29j17J09j42J88j70J79j15j9J48
840I5j28q5J05n5K10L0l75P4K80j83o8K92j97J26j62j76M47l97j76K99k9K6K19
863A72n8k22K61J50m40o1K09r6Qk8R8n3l7L59j28o3k84K59K2lP6j08L9p7L3k52
$$ y = [-106, -122, 62, 40, 104, -216, 11, 52, -33, -160, 220, 99, -106, 196, 298, 196, 10, -223, 43, 202, -109, -143, 50, 112, -149, 155, -183, 19, -120, 229, -161, 86, -35, 50, -69, -333, 38, -14, 67, -9, 144, 188, 47, -77, -85, -20, -62, 110, 77, -137, -38, 93, -14, -143, -129, 132, 187, -99, -6, 214, 9, -90, 59, 138, -14, -179, -112, 109, 18, 56, -22, 64, 5, -114, 173, -49, 106, -410, -80, -38, -124, -170, -232, -311, -38, -11, 90, 259, -57, -122, 200, -95, 343, 88, -35, -128, -82, -79, 75, 33, -105, -2, 118, -27, 70, -164, -193, 48, -272, 48, -217, -215, -29, 55, -59, 125, 8, -4, 76, 197, 215, 130, 34, -28, -177, 37, -155, 29, 110, -6, 179, -95, 34, -83, 26, -116, 72, -98, 81, -34, -53, 95, -33, -118, -13, -68, 142, 172, -203, -129, 151, -32, -100, 192, -5, 121, -41, -217, 230, -167, -343, -44, -73, -47, 172, 114, -108, 153, 303, -137, -198, 11, -85, -77, -105, -7, -60, -97, 262, 134, 71, -213, 46, 68, 65, 141, 33, 72, -5, 28, -224]
889b24L32n5k07P5J09K4M9j34K55j24k54L26p8L2n4k55J08K0K95k13j47K00J8
912I8l63K69k59K32q9K68m7k2o9L8j30M21l59k26k7M09k14l4J58P2k87J11J28
935G8j01k59M89j08r1k08N1K33r9O2m0j22RO9k29J53q1o2L78j91M5l0j4oL45l03
961c2O3m5K43j92r7L50j45j92J16J49l4m9l86L75k54J87j79J83K40m31K18k8n3
984GK36j92j12j29K35L7j94L57k24o2K60j05o0k4o3L00o1j82M07k87n0K91n01
1007a16L88l56J64j45M23m23R1n0p5K25J73n7r3l18J02K91l12K49j24J42j86j47
1029a54J10j7l4L05j50j48L0O0L3j48K41l20L91l20L43n8l16K70l0J29j91o6J44
1052A04k38N6K97m51M20j67k08J05J34P4q0j30ol1K82l2j24r0J51j13K53m13J81
$$ y = [-224, 108, 53, -154, -79, 30, 54, 103, -31, 224, 100, -154, 172, 94, 126, 72, -183, -75, -55, 240, 27, -120, 80, 98, -265, 4, -255, -23, -112, 156, 109, 87, 18, 56, -74, 347, -12, -238, -265, 144, -70, -104, 54, 126, -161, -50, 78, -23, -282, 207, 99, 8, -200, -149, 84, -15, 47, 7, -115, -106, -37, -266, -113, -194, -256, 122, -69, -24, -54, -68, -74, 271, -32, 31, -14, 229, 37, -60, 290, 145, -47, 69, 218, 184, 135, -251, 124, -130, 57, -122, 61, 301, -130, 88, 60, 7, 243, 51, -61, -190, 45, 82, -112, 245, 21, -41, 219, 114, 54, 30, -33, 267, 206, 24, 431, 144, 94, 385, -116, 272, -84, 80, -65, 358, -65, 26, -24, -99, 126, 299, 242, 149, -169, -67, 224, -88, 161, 37, 179, -7, -154, -44, -61, -95, 210, 60, -88, -58, 2, 35, -113, 128, -192, 199, -121, 222, 164, -152, 118, 88, 217, 26, -40, 104, -134, -78, 219, -232, 188, 21, -187, -82, 52, 126, 46, -84, -90, -121, 161, 129, 5, -85, 66, -47, 206, -207, -26]
1075b6J10m02K36j22M27k12m2k04JL74o0R5k15J8K11l01J64j9K71o21L64k45L69
1098A71k63lJ07o2K9k1O7j27M4P2k12J63j5K37k23J06p5J57n7K25k47j92J73q
1122D6k43L30j66j41K26j37M5r5L57j58J03k24N4l6K17l01R0J4k78L33kl79M35
1145I0l01N5K26q7J25m0K12l07L8K53m72M2J34Oj53K52o5K0j79K20k00J87q0r3
1169a17O2k50K10J17N8j10L8J66j9j58j25M33k27k45J70J97j29l53L26m5K9M1
1191F9r6K60l9r3j72R2M4j95J07o0K61J40k61p4j92L94k09K8j33J81J06m17L63
1214A04o6L0jr7j37J60k03L70l53L07j04j11q2K36o5o6K45k34L16k22J8jL2p5
1238AK78q3k77M1O4Mj22K31k24J06n4j19J7L7J34J06k52j52J71L01j64L0j0k5
$$ y = [-26, 84, -318, -82, -204, 223, 11, -31, -235, -234, 140, 80, 175, -40, -22, 189, -112, 52, 33, 304, -317, 47, -198, 171, -92, -95, 12, -50, -21, -42, 25, -102, -58, 14, -198, -35, -50, 187, -36, 70, -5, 152, 95, 320, 73, -119, 54, 46, -197, 133, -33, -174, 52, -85, -40, -135, 222, 64, 167, -57, -3, -39, 178, -123, -33, -19, -297, 36, 34, -345, 90, -211, -156, 70, -17, 108, 68, 280, -27, 11, 264, -208, -166, -32, -26, -179, 73, 8, 28, -151, 69, -131, 56, -24, -117, -55, -305, -95, 22, 80, -30, 8, 174, 155, -3, -128, 305, 78, -167, 3, 200, 71, -282, 44, -1, 28, 69, -27, 233, 194, 101, -71, 21, 65, -130, -23, -83, 178, 318, 57, -17, -209, 185, -24, 4, -129, 52, 158, -259, 104, 38, 68, 67, -30, -167, -7, -210, 160, -193, 114, 10, -101, -183, 53, -12, -78, 167, -67, 249, 27, 45, 44, 76, 1, 279, 196, -81, -40, 24, 28, -94, 137, -87, 19, -35, -154, -137, -100, 34, 140, -112, -264, -93, 208, 44, 74, 64, 39]
1262C9o6J50j21j7K7J47l49J26R1j29Q0jPJ04J22m03L06k99L50k65K55k19J84
1285A19l26m2K16J47k76J09k52M54m7j65K94j38j45j09J0K70j1j4q0K8R7k77o
1308a44J50J6pk33l1L62n21O58m25jK21j74K3N0J1j39L85k57K7K21k56R5Q3k60
1332a46K66J08j00l00L06Q4k74Q6J64k75K27l63N94l74L1m4K4m9%K16n9j19J34
1355A37j54m1J23k91N21m38N6q1J85j02K0K52nl21Q7n3m7J53nP6j23J14k9N1q
1380G7j94L07m22L04m3m64M64k41M38j38k9k98J04P1K19o7q9J32j8j31j73J11
1402h0lJ69J23n8q2k9J3O0j57l0J54N0j46J4J26l07M7jL09l06L40k19j32J93k48
1427b00K79m64N54L6k29L2lm8q9J42R7j58J77k61K20J09j89J13J00l48J18O1k73
$$ y = [39, -27, 123, 2, -15, 12, 159, -190, -64, 27, -102, -22, -23, -16, 88, 210, -193, 113, -186, 164, -101, 154, -65, 119, -207, -249, -33, 114, -162, -53, -305, 149, 102, -63, 231, 93, -52, -161, -151, 119, 108, 94, 14, 42, 139, -138, -144, 6, 22, 15, -218, -249, 113, -408, 250, -175, -176, 45, -129, -106, -56, -45, -184, 201, -56, -29, 192, -64, 31, 114, -146, 120, 228, 128, -172, 134, 218, -56, 30, 194, -81, 146, -217, 377, 3, 34, -10, 14, -35, -35, 181, 122, 3, 137, -17, -58, 65, -226, 295, -143, -87, -168, 17, -85, -65, 187, 182, -139, -52, -105, -152, 1, -4, 72, -51, 63, 34, 85, 77, -117, 190, -232, 72, 29, -435, 29, -212, 226, 88, 59, -239, -135, -64, 155, 88, -1, 131, 113, -18, -191, -80, -83, 86, 209, 151, 69, 40, 53, 113, -44, -74, 80, 130, -16, -2, 124, -183, -136, -137, 172, -134, 206, -13, -145, 48, -200, 79, -385, 169, 205, -24, 8, 5, -43, -132, 10, 107, -51, 126, -135, 85, 194, 5, 118, 218, -130, -12, 49, -224]
1450b24K00moj76K75q4k62O2K40p6L17k86K31k41M85m63J1l15K63L7j13L88k17
1473D2r8O2k20L90j78l7L9J94m02K25J72j27R2l23K01J55k06j44J71J67j78j25
1495a28J40K43j34j7Kk50K27k17O1K38k38p2R9p9J14L2l2m3q6L22n2l7j94K23
1519A22j7j79J2r4J50O7k47J84J4J47o8j40j63J23J73o0j22OK78m1k22J24J93
1542B40o3l15R6j26M16j83j12M26k34k36J03j74K73L0m1q4q7J4K13j90J96j5k41
1565i4L68l59J01k7P0n6N3J91l63k2j9J88r1j6m8K40k30k7J91k4j63J31KR3j77
1590h8K86j24O4l6k18L84L4m81K68Q5l11J26o8J48o0J08l16K01M5l08K31jm6P4
1614cJ65k57J23q2J30qp3k47K30K18k24K21m16J52k21J34J86Qm8j9j03O0k5J17
$$ y = [-224, -24, -28, -34, -210, 65, -19, -281, -219, 21, -55, 262, -24, 207, -34, 451, -12, -1, -316, -53, -16, -129, 259, 42, -56, 6, -214, 176, -2, -39, 0, 194, -208, 17, 189, 62, 154, -169, 32, 187, -19, -163, 8, 175, -3, -128, 12, 255, 121, 104, 106, -144, 83, -134, -73, 165, -73, -145, -46, -125, -11, 21, -11, -54, -140, 182, 130, 93, -101, 122, 105, -74, -62, -156, -6, 61, -186, -2, 12, 159, 91, -49, -212, -89, 84, 24, -98, -92, 186, 145, -77, 47, 240, 177, -138, -42, -168, 248, 65, -47, 379, 145, -91, 12, -162, 111, 141, 100, 16, -71, -57, 156, -34, 162, 147, -94, 274, -85, 16, -11, 59, 3, 56, 247, -116, -138, -157, 31, -60, -76, -124, 116, -114, -141, 50, 26, -137, -6, -4, 89, -88, 198, 74, 138, 102, -116, 268, 302, -179, 89, 174, -137, -11, -79, 69, 9, 117, -199, 2, 47, -261, -30, -31, -77, -3, 162, -95, 28, -54, 76, 68, -5, -252, -22, 196, -28, 193, -223, -71, -292, -158, 28, 36, -12, -31, -134, -74, -99, 18]
1638A8J73j47J18k05l6K52k28P7j19J94%q8K6j50O7j99L42k1J54l77K75k61K22
1661H7r5O8j07o6L2J85l07K18M1k83J97L58j68k31J69J07p8m0k99J99%J82r4k99
1685b24N85j74j30J47j44K9J8L2l06l9J85k40L44p2k37L68j34N7k40N8J28M6n9
1708bJ14j27J37l81M96k20l24L18K0k58R7J87k81J59K06K29k42l2j43O6k5J25
1730A19j43J23p5j95J50j28j20O24m13n7N77n14K13%j23o0J28j90Q9j20N5r0k8
1753a78J42%L20n21O3L20j55r3K13j56J89j38k30P1J29J45j81J38k77K30J12k41
1775i8L6M7K6m3j03L56n28K91P6N3j5k76J62J04k31O2o2J63m4k6l59L86R2q1K88
1800B76k28l6Q6l40K35J61l05K93k35M0j14J0K87k16J34O1l0N9j47K90l87Q0o3
$$ y = [18, 191, 44, 162, -43, -79, 173, -55, 22, -97, 97, 97, 9, 35, -115, -48, -247, 95, 74, 228, -149, 126, -135, 87, -8, 60, -47, -113, -81, 104, -203, 15, 56, -227, -30, 328, 160, -71, 98, 205, 127, 87, -212, -13, -13, 169, 75, -224, 361, 187, 57, 204, 60, 89, 107, 139, -167, -206, -21, -261, 83, 11, -226, 142, 8, 65, -175, -117, 11, 57, -2, 112, -15, 122, -259, 237, 17, -307, 11, 31, -227, -130, 57, -224, -65, 141, 370, 128, 96, -47, 19, -6, 119, -24, 99, 24, -171, -21, -149, -269, 355, -58, -115, 462, -52, 161, 161, 38, -22, 106, -84, 5, -115, -60, -150, -178, -36, -36, 284, -237, -174, 146, -9, -102, 111, -45, 144, 6, -224, -153, -24, 121, -60, 78, -199, 31, 143, -98, -62, -15, 11, -32, -135, 221, -307, -16, 60, 113, 98, -178, -16, 88, -143, -81, -143, 20, -24, -50, -409, -23, 69, -12, 276, 48, 12, 98, -242, -7, 154, -151, 142, -93, -53, -167, -157, 130, -86, 48, 109, 79, 138, -9, 281, -106, -26, -89]
1823h9o0L96l54M31l55j1k37K29L51o11M41j62J65j29m6m0J23n56O32k74L36m
1845A76j44l00J39n6R5K10j13N7j16P4p9J61p0j81J75O3J3k0j16Q0j60J61m0j25
1869a16j9J82j03R2j98K71M2j34R0m13M07m5l87M42j39L31l43Q2J5J5j47m2K55
1892A38j41K1J70l03QK22o1q4J6K55l93J6K85j30k16J43J08k0j59K28j83L66l15
1915b9K97k25l40K71J95K2k01J85n12M55j52L2o0pR4r3r4K75k34p3J8J34L3j62
1939a71L14J43n06J80j13K22J95j92j61l8J68j33J27p8L4Q9j71J76j93j0M20n13
1961b11K94j61k0K22k29K65k7k09%J5M3k26K83J14j46R5j17P6K42k83K6r7J27
1984G6l28J30J4J04Q2k93K64k38M0J34j20j2J38R4O2r1J04j18k05M93j03j05l02
$$ y = [-89, -149, 247, -107, 324, -31, -42, -279, -50, 301, -310, 131, -31, 134, 5, -41, -81, 42, -514, 118, -156, 180, 176, 32, -268, -129, -185, -90, 120, 7, 64, -52, 22, -57, 104, 34, -147, 28, 91, 104, 84, -32, 48, -112, 49, 9, -116, -135, 47, -56, 36, -162, 109, 151, 17, 107, -306, 101, 56, -331, 111, -28, 303, -40, 42, 57, 72, -75, -117, 138, -3, 18, 188, -115, -107, 115, 54, -30, -14, 241, -152, -136, 149, 19, -197, -54, 54, 34, -125, 103, -80, 286, -29, 268, 43, -297, -26, 169, 191, -10, 175, -337, 118, -34, -2, -62, -69, 25, -68, -162, 113, -121, -194, -176, -42, -9, -171, 143, 286, -220, -40, -153, 69, 264, 72, -89, -127, 41, -92, 35, -43, -9, 80, -91, 85, -108, -118, 302, -211, 83, -78, -98, 124, -105, 160, 133, -76, -76, -61, -18, -244, 39, 153, 7, 102, -15, 61, 303, 20, 46, -51, 76, -252, -122, -108, -4, 78, -215, 49, -189, -149, -15, -135, -147, -9, 85, 147, 56, 160, 42, -163, 330, 227, 122, -180]
2007a80O5L98k92J6K22L3l64l2K43qql0j29P5j22k1R2J11j98K22j75K7J06j73
2031a22J87l4J5m8J39l03M35l99J5k36J5J25P9L83k62J14j71N4k74K36NR9j78
2054a26K18N1l83Q4L01j78L07j77n0j96J45r0J09K03qJ06m10r0o3K72J5k45K22
2077A7oj79L7J33l2J94k31RJ1N9k07r8L41k83J70P4J01J11k1L8l40K66j48k21
2101b05K82k18K79k45n1JR3R0j72J97J55m09L11Km0k40K16Q0l07K97l35K72nj60
2125a12P3J08m5K70l70l0J98r2Q5l3J0J05l05J32j7l7J63k45L48k08K76k49p5
2148e0K88m64L04k24Q4N4L8R5j42J00j46L03o70N16m2j61N0j84L89Kj19M5j24
2171e8L5M0MOMm0j01j68J84p1M38m38k2J45K70k59Q8j03J08l39K88K8J31j97J14
$$ y = [-180, -115, 283, -9, 7, 229, 262, -102, -134, 109, 101, 93, 63, -66, 9, -113, -134, -42, 69, -129, 93, -82, -55, 51, -122, 65, 31, 46, -2, 137, -166, 269, -130, -115, -351, -336, -211, -132, 251, -11, 103, -68, -14, -288, -52, -47, 52, -126, 92, 143, -240, -156, 145, -33, 274, 97, 47, -149, -4, -94, 15, 218, 210, 316, -94, -184, -247, 25, 40, -205, 17, 11, -168, -131, 2, -30, 164, -67, -58, -47, 12, -195, -293, 48, -235, -65, 9, 110, 221, 200, 238, -102, 164, 16, -205, 77, -141, 138, -107, -158, -157, -64, 26, -146, 51, 206, -203, 108, 110, 70, -170, 46, 126, -181, 116, -219, 53, 48, -112, -39, 69, 24, 294, -76, -106, 92, 0, 85, 52, 62, 167, -138, -6, -23, -60, 103, -142, 206, -2, 274, 25, -50, 238, -226, 78, -146, -62, -8, 30, 125, -17, 83, -63, 240, -430, 86, 44, -117, -67, -251, 138, 140, 21, 66, -58, -23, 17, 21, 27, 31, -9, -110, -278, -94, -165, 273, -165, -187, -42, 228, -31, 57, -46, 62, -277, 11, 39, 170, -27, 87]
2196H7L5l89L16k34J53J5Q6j88L42k24R6j06k7J19p9m7mK1K45q8m0k39K08M8K5
2221A31l36K04K27j46j55L52n6k55K31j25R3k4j99L02k63j73N7J27n1j31J91m5
2243d4J06M1k11K09l0j31L60l22J18k97K20M5m5mj10J30Q0r6J07M8k11K9k67L69
2267I4n00M19J04m6j25J05j49K60j63P1M5k35O8J57q4j43J17n3Q5K00m98M62j50
2290D1j25j3M4J16k79M68j09k20K32j12O6j80J02j43J22J72k01J6l7P7n4R9p7
2313Ek3j1J11j03J97j52O1j45j77K30j68K21Jk2mkq8K33j16r3j20L30k32l35K59
2338a43Q5K79k85k33M69j18j85K37Qk89J11J86k67J72N9J04r7j44J62q8r5P3J61
2361A62j37J37r1O3j22p9p5K71qM8k43J52%k31M12k66q3j15J33%L8k97M73m9m7
$$ y = [87, 122, -267, 49, -185, -32, -17, 69, -119, 223, -1, 95, -11, -38, 81, 2, -45, -49, -28, 217, 129, 89, -150, 58, 106, 131, -205, -1, 226, 80, -75, 277, 221, -34, 197, 72, 165, 141, -58, 244, -19, -192, -135, -8, -59, -190, 1, -44, 62, 103, -108, 101, 71, -60, 300, -22, 96, -201, 19, 64, 19, 15, -95, 35, 115, 19, 126, 174, -37, -8, -275, 94, -406, 13, 117, 71, -54, 51, -98, 162, -1, 70, 115, -120, -52, 105, 21, -122, -5, -58, 27, 227, -271, 191, 41, -84, -97, -53, 63, -216, 252, 143, -77, 155, 43, 109, -71, 31, -112, 10, 182, -19, -3, -40, 37, -17, 82, 5, -18, -29, 82, -21, 176, 24, 85, -60, -237, -7, -175, 46, 47, 25, 21, 19, -69, 164, 48, -45, -165, 165, -67, -402, -143, -58, 221, -64, -297, 172, 54, -131, 106, 114, -175, -64, 122, -145, 27, 86, 190, 93, -51, 111, 23, -72, 1, 162, 25, 162, 71, 134, 12, -67, -142, 129, 121, 169, -74, 78, 78, -153, 259, -7, -90, -205, -72, -72, -34, -331, 142, 93, 46]
2386D6L%J5k34j6j33L18J52m44N09k60P9L4j13o7O1K51l84L14j14r9J51P8n0k76
2411a79K09j56K45N3k08K35k39j18m1M41k65L70m99J7m2L58k40k48L98k25J16
2432a8j07L73j44j13k43N95k40j54k06N0L20L5j74%Q8k27L14j80j97N60l44l3
2454d5k26L50j84J91l83O86l24j06n8nL09k21N3q3K18j76k51K80q5j76K25p6j8
2477a05J95k72K74j34K66p2K3P4k81RK05l85L09J65k85j56J66N2j27q4M7L75j72
2500H7p8J00k58q0N2K53K96j77q2k80K52m5J3l7P3k1L45m47M5j35J92p4J03o1
2524C6k26J64j09L06J08j51k26k11M22k90J20O5j06l1M5K80l64J95K07k02r3J95
2546A34n3j46j12J37P2O4k21j5K95k54n4K84m3r3O1l9m5j06K14Q1j53j3n0J20
$$ y = [46, 49, 49, 64, -170, -186, -319, -1, 151, -293, 216, -44, 35, 69, -44, -111, -50, 201, -183, 131, 17, -82, 69, 147, 97, -179, 30, -126, 119, 172, -36, 199, -40, -158, -199, 242, -23, 347, -152, -135, -177, 181, -59, -307, 91, -134, -18, -125, 248, 104, -9, -252, 343, 103, -51, -257, -207, 113, 148, -26, -26, 62, -165, 149, -31, -228, 332, -12, -45, -271, 79, -105, 86, -297, 389, 65, -41, -99, -104, 205, -16, 37, -46, 172, -4, -255, 25, -60, -236, -11, -87, -105, 90, -182, 92, -42, 224, 152, 175, 249, -32, -23, 182, -203, 106, 271, -14, -170, -4, 48, -79, -163, -116, 259, 87, 9, 109, -149, -229, -177, 76, 372, 195, 113, -167, 85, 40, 53, 16, 89, 68, 413, -34, 11, -124, 68, -6, 97, 36, -190, -26, -135, 171, 279, 128, -98, -309, 113, -177, -57, 8, -98, -129, -84, 196, -168, 27, 234, 32, -61, 134, 81, -65, -177, -40, 32, 96, -125, -140, 155, -99, -153, 131, 88, -5, 56, 17, -28, -134, 80, 161, 8, -5, -55, 65]
2570F5k00J47K04j17l6j39l3P2J03j61K55j35k8j56j83L49J95J21o41K57K75m2
2592A72k14Q7j95N1j25J44m0l9M19k63O1K32q6k72K10K35l58j41L22l55J53J74
2614A72l67M0o1L66j36J97K7k99J06O8j14J24j59K74j83j40J97l37L67o6n6Nj83
2637a58k12K75k05M88k14j44J99K07j34M5l1k4l12L59k14Q2J77l55K6L4L43j98
2659C4K06l19l09O07k80K48pk28K0J31k62K98k06J30k32J13K88n08L61n9j72Q7
2681e9K54j50j7j42L99k55P7k13N2R5J69n8l63J36J28M63l69k87J85j46K46j46
2703aO6J88k89k02M52m17K63o4k24J62L07k0j25j25M2J40k39j60J00J69K32J5
2725B70j63m2O5q5k1J81j70j6o6m0j22Q2L60j99l6J03j33K8M2q3k36K40j60K58
$$ y = [65, -135, 12, 216, 99, 63, -76, -109, -37, 66, -95, 160, 25, -3, -159, -342, 7, 202, 323, -318, -61, 214, 172, -42, 45, -150, -99, -224, -80, -120, -159, 260, -3, 58, 290, 204, -68, 142, 377, 19, -122, 200, -155, -2, 172, -195, -155, -216, 150, 14, 211, 238, -61, 45, 113, -1, 123, -36, 238, 55, -85, 112, -225, 142, 76, 20, 25, -158, -370, -95, -300, 188, -26, -170, 29, 236, 102, 147, 116, 92, -220, 139, -75, 7, 184, -171, -145, -111, 232, 34, 240, -79, -388, 219, -61, 187, 180, -48, -28, 103, -159, 139, -67, 63, -169, -56, 232, -276, 85, 26, -146, -59, 195, 45, 28, -114, 285, 30, 107, -106, -54, 41, 210, 152, -211, -75, 53, 516, 147, -140, 45, -101, 145, -1, 65, 253, -36, -238, 214, -203, 60, -4, -228, -66, 241, 221, 96, -29, 13, 153, -86, -246, -146, 23, 255, 270, 107, 65, 130, 45, 24, 205, 35, 19, -47, -87, -209, -127, 233, 34, -2, 101, -32, -4, 38, -45, -281, -41, -201, 57]
2749E7J24ql47K16m5J01k00N9J75k52P1J74j52J12m85K19K21J80j68j54M6J08
2771E2k8R4r3Q2q5K11k05p5L47k23%m0l5J17j47M8K28m10M13Mj51l90M51k11O7
2796B1J54l63K38m01K32J16r4JJ65q9M6J31k9l47L27l52K22O8J45k54R4k46J04
2819a11J29Rj06Q5K23k04r0M3K06k7j83p4O3j03L86p2k14L44k00j21j24J10J16
2842H5k17l46M42p7J29l3j11K35M1p3K47m75o4J54L19k93N9l36J42K36k07p3J96
2865b0j49P8K06Q9j1j75q4o1L18k01K64k14K32m07J06J25K1PJ31l71M07R3l59
2888B5rj72K63n7p2R9o8L0o9J1L34k97J1R3O4k30j02J86qj76J62j08L1j43q2M29
2914A45r7l09k1L90j52L5L57l28k9K0r1K85l19J98m8m5J0r5K58j68J56l0rj43
$$ y = [57, 181, 173, -174, 42, -3, 98, -102, -43, 132, -120, -49, 125, -27, 85, -400, -181, 40, 220, 52, -102, -56, 52, 24, 118, 25, 107, 22, 233, 28, -47, 300, 77, 77, 37, 2, 119, -28, 20, 248, -162, 251, 255, 104, -286, 165, -46, 21, 175, -188, 50, -351, -119, -3, -97, -96, 69, -20, 26, 157, 128, -219, 108, -244, -22, 46, 191, -63, 31, -215, -111, 18, 27, -79, 6, 229, 25, -65, -22, 184, 157, -26, -100, -37, -140, 246, 174, -40, 304, 104, -17, -141, -31, 85, -132, -478, -36, -113, 16, -17, -128, 107, 148, 75, 322, -153, -217, -63, 256, -37, 22, -314, -172, 64, -143, -216, -20, -169, -91, 115, 204, 193, 18, -66, -127, 191, -10, 254, 40, 272, -135, -29, 96, 117, 124, 255, -116, 291, 384, 25, 16, -156, 107, 50, -22, 77, 9, 39, -30, -19, 315, 18, 29, 122, 186, -44, -146, 40, 32, -144, 18, -90, -59, -202, -284, 145, 48, -261, -282, 108, -44, -9, 348, 20, -9, 11, -80, 205, -114, 84, 36, -9, 1, -94, 164, -4, 152, 122, 113, -30]
2938c0P7J9k27L07j81j16J68J73k78L5J07m2K32k32J88k12j01JO6m6J8J72q1m5
2962b8j6L11k97O1K09n2mj48p5J15J19k77j42M77l15K03j57k99K26O0l16L80j02
2985f7j12K30l2P6k83J88J22j98J22j87L2J68p0j4PL1L3J70j08m0J88m83M78k21
3009C0J84o4l05j32K55N9k49J97K30j50j73p9J4J34J09j14k4J96j81l8M13l89
3031g7P5o7lP1j76n1K63R9J31k40j10m6p8K41O7o6J30k40J56r1j59J66m8K45q4
3056A08j69o1K82j25Q6p5K87m53L37k50J91P0n38K50R9J75j87K82q8k96R4K3K90
3079C32l68P9M7M8p3j19j70P5K10J85l09J31k9Nn4j11O9k01R4J26M5M2L35n12
3103a23J82j37J62j23P2J76l32L90j70k07L04m96J77J7L18l95J50q7J14J62p0
$$ y = [-30, 47, 66, -161, 146, -35, -151, 17, 190, -88, -53, 54, 12, 244, 12, 200, -12, -113, -112, -46, -92, -74, 98, 17, -28, -44, 267, -30, 31, 240, 188, 184, 36, -39, 76, 195, -82, -224, 253, -62, 141, -16, -315, -89, -29, -345, 35, -67, -179, 51, 19, 95, -188, 0, 122, -76, 46, -141, -109, 59, -11, -25, -18, 13, 46, 216, 108, 68, 256, -227, 251, 30, 214, 150, -155, -287, -32, 27, -222, -25, 205, 55, -118, -197, -183, -49, 60, -54, -78, 118, -63, -101, 312, -77, -2, -69, -72, -1, -177, -228, 35, 134, 265, 25, -85, -131, -209, 32, 99, 33, 163, -77, 79, -12, -171, -5, -53, 192, 108, -61, -122, 160, 35, 121, 46, 333, -120, 217, -33, 158, 228, -310, -60, 39, 214, 27, 309, 221, -75, 19, 42, 332, -36, 43, 90, 138, 65, -54, -224, -149, 61, 246, -63, 68, 39, 44, -10, -121, -52, -253, -159, -33, 12, 54, 389, -123, 59, -78, 84, -39, 33, 209, -123, 267, 97, -110, 194, -302, -125, -108, 210, -185, -35, -122, -8, 154, 84]
3124H4j91K52l36K50Q1l15O8K79j86R7j49j25J06J80k53K83l42J2M77p2m89L30
3146D1K17k12q2J92l15J05Q2rO1L8k08L19l94OJ63k61M87r2j46j0j66L35k24L7
3170c6K47n09L94j99J30k93K64q4p1j00K70K38n60K1K07J83k56K37P4l40M8K32
3192I7m19M21j72M7O5j97M11j29M3N7l36P3j09L36j43j53p8J34K18j61j84J07
3214g2J07Np9j5m0q5j7L32n6J06n51J78L08k0l06L32q0k18M92l31J52m3M0l25
3238a86J67J09p7J14p3j09J03j12J88J79k54q7j59K59O1M0M3m4j69j70J53q8J34
3261B2J08K7j23j60J48M0j49J6k34N67k76L73m14N3l1n5Q6l9K15j47k17J44J88
3284A42j6m9m4P4j53No8K22Q9j46ko1mm1j85O5K93n4pj24p6P8J59J34j41J53j76
$$ y = [84, -107, 145, -191, 59, 140, -175, -107, 172, -14, 83, -66, -191, -85, 95, -158, 125, -217, -205, 272, 200, -289, 41, 258, 46, -36, 156, -159, -54, 28, 19, 80, 118, -90, 229, -165, -159, 4, -257, 230, 138, -8, -18, -184, 151, -73, -36, 211, -298, 96, -103, 27, -266, -2, -86, -157, -257, 13, 251, -309, -288, -81, 102, -154, 83, 157, -183, -135, 97, -322, 99, -73, -26, 39, -158, 253, 124, 167, 224, -112, -39, -148, 188, 45, -108, -186, -52, 166, 5, -179, -72, 35, 40, -39, -54, -94, -179, -196, 136, 80, 186, -365, -187, 121, 101, -205, 127, 47, -171, 321, -10, 142, 99, 139, -186, -19, 90, 13, 127, 54, -55, 48, -64, 124, 303, 49, -38, -197, 62, 123, 163, 206, 162, -7, -177, -24, -112, 22, 130, 157, 34, -126, 22, 62, -87, -71, -305, 262, -14, 359, -55, -2, -33, -88, -2, -41, 174, 27, -190, -46, 142, 126, 77, 33, 107, -46, -41, -109, 113, 202, 56, 54, -7, -11, -52, -237, -172, 121, 67, 60, -64, -140, -62, 97, 231, 90, 243, 67]
3311F7l48L21k25K21N1p1m0j91L61Ql1k43J6J73o9j20K39k23L7o3J38jr4j23Q0
3336a30P3J47k39L67l61m7K62j94l3K83l74N27j12l72O0J88k6p3K64j50k6J00
3358A34j84J34q4J08M0m00K65l0J2q5o9N7K64l58K16J62k0k48j6%p3L06qm3q8
3383hK0J7J6j60J07L3o7j21J06J69k13J43n2j16L42q4k77lJ09j4J19m2j4k0m4
3408e4L4J92l14KK02j09J72m0no5l3J45j71j74J40R8j09m8R8j34j6L73j62k04
3432a82K19J6Q4k90k1j11J64P8J97j18J08k30K0M17j81J18j31Q6k87q5l3K00j68
3455a30L08j80k8K30m18L14r6J55k9n0J22l24Q1Q8M3r1P2j53j70J90K60j79Q5
3478A00J03k78N03m67P2O1k80L03l16M5K4P8K28l31K19m4P7J51k54J20J20k53
$$ y = [67, -281, 40, -185, 36, 87, 16, -24, -215, 146, 154, 123, -120, -104, 69, 0, -120, 119, -104, -67, -130, 8, 7, -87, -210, -130, -57, 90, -149, 218, -143, -190, 72, -122, -155, 128, -246, 281, 169, -203, -143, 45, 19, -54, 210, 60, 34, 134, -50, 84, 0, 108, 148, -252, 13, -17, -5, -90, -159, -102, 162, -196, 20, 182, 162, -86, -102, -102, -175, 131, 123, 80, -8, 12, 29, 45, -115, -8, 25, -42, -163, -57, 112, -101, 42, -10, -126, 216, 132, -145, -148, -39, -53, 66, 24, 10, -10, -54, -20, 172, -142, -140, 62, -47, 125, 85, 80, 15, -18, 127, -44, -218, -78, 20, -89, -137, -39, -173, -189, 184, 22, -182, 37, 53, 137, -153, -174, -285, -121, -43, 154, 36, 144, -86, -66, 351, 170, 288, 157, 243, -44, -129, -162, 38, -130, 178, -2, -30, 200, -218, 96, 0, 155, 126, 76, 198, -126, -45, 43, 86, -5, 67, -86, -256, -66, 194, 15, 100, 203, -75, 428, -39, 33, 94, -186, 117, -199, -154, -130, -52, 176, -155, 64, 20, 97, 248, -6, 114, 234, -19]
3500a9j49J22J07K28k04K58n45M4L70j58k03l5P0J64k70J29n5J08N9Q6j70rq7
3523a59L51J5k78n0PM95n27K38o6j04J27r4K32j81q5L13j50k75L65k10O9k16J90
3546Gj67Q3m9P2K04l25R4K22l39P0J61J8r0l4J74k00j2j2n3K64l79M31r7j44K78
3571A77j97k2rJ69j83J52K2p9o6m9JJ81l02L00k54K76Q7j12j16J85k05Q8k03J55
3595dK19l85J98j19J55j48j07J30M28k41k7Q4j68J51j18l63M20q4j88L82l41Q0
3617d6j15K91l41J75j06J66K65j16n1j64r3J68M01m30r8M6M3J28j71K35Po0q8
3640D6M3L6l06M50k59k10k9N5K79j96K20O9k06J61k04J44j36K01R2m23K78k15
3662a10PR4j29p4L15r5j13L2m2J76j44j27O3L17l13J25jN6n9L3p8J09R2n8j14
$$ y = [-19, -168, -46, 61, 289, 85, 343, -202, -158, 212, 54, -149, -184, -114, 50, -220, -91, -146, -38, 21, 107, -63, -72, -159, 192, 207, -71, -121, -114, 381, -146, 92, 26, -78, 49, -45, 187, 6, -79, 234, 84, -191, 174, -36, 33, -183, 7, -160, -77, -126, -54, 150, -175, -81, 141, -198, -128, 33, 51, -39, -73, 101, -99, -111, -123, -176, 88, -291, 140, 43, -101, 177, -20, -42, -51, 118, -65, 87, 109, 30, -36, -85, -84, 97, -205, 95, -159, 117, 204, 92, -24, 161, -44, 44, -159, -4, 215, -170, 28, -91, 64, -84, -191, -61, 367, 126, 99, 183, 15, 166, 48, -315, 105, 21, -167, 215, -126, -46, -161, 130, -211, -36, -142, 24, 289, 173, 122, -42, -135, 33, 434, 4, -94, -48, -5, 123, -48, 187, 194, 134, 46, 89, 125, -181, 269, 10, -200, -229, -174, 105, -91, 129, 198, -8, 153, -51, 93, -43, 158, 250, -173, 105, -110, -103, -9, -138, -212, 103, 8, -105, -73, -115, 61, -83, -210, -147, 170, -143, -18, -19, 37, -22, 11, -67, 42, 134, 76, -38]
3687c8K36o25M79J6j94J74k41J7K94k64J74p1j12K81m65L79j82J28j29N0K20n2
3709G5m8j6J00j38J61k10j52M14k0Nk52J79j17j53J24J64k6Q2k82M67j35m15J20
3732g3q7l9M4O1Q4P0o2j24N5kJ43l56J68p8J07L2L6P2k11J26J58p7k70K67m17
3757c73M50j19J07j48J12j8m6p6n0N4J88l2j22K17j99K03k10J5J16j50L02k81
3779f0KL51m40L55l44j4K65l32K4O2J31K75n28Q3K65j22K1o0l40N08p0N9l2m5
3803A4l06K2M35K5k8j44p1K17K07k93m40J22K08j9K03k18J10K19k95J38l15L62
3825A53r1l01J01J37j14J04M8M7j91j01K49l38L36j52K67n4J49m31r8J27m5K63
3847F5j80K6L7j09J88r0K25p8J2p8j85J46R4j39L63m20R8j10m5k2M46j79l52K82
$$ y = [-38, 198, -427, 52, 68, -126, 48, -193, -176, 118, -146, 28, -43, -155, 126, -339, 40, -142, -14, -143, -93, 127, 75, 27, 11, 111, -27, 134, -76, -228, 186, 166, 171, -81, 98, -19, -172, -48, 116, 90, 172, -110, 357, 222, -193, -73, -160, -199, -155, -94, -10, 60, -2, -126, -71, -73, 70, -286, -118, -196, -89, -57, -21, 51, -160, -34, 124, 47, -223, 44, -373, 77, -42, 65, -83, 29, 11, -35, -111, -161, -107, 81, 49, -73, 144, -55, 148, -62, -47, 69, -81, 221, -60, -58, 293, -147, 208, -136, -150, 115, -217, -193, -131, 0, 275, -253, -170, 95, -27, -6, -66, -406, 102, 32, 91, 59, 14, -292, -270, 165, 190, 162, 18, -53, 164, 371, 78, -362, -240, -32, -51, 152, -66, 44, 263, -32, 106, -209, 153, 62, -239, -138, -1, -115, -11, 37, 84, -107, -208, 41, -297, 39, -113, 154, 100, 249, -182, -280, -153, -198, 65, -115, -89, -52, -161, 27, -63, 162, 84, 96, 18, -167, -21, 73, -66, 297, -123, -25, -135, -180, -202, 244, 65, -287, -5]
3871eJ19k94P5K18j78J46j7j70R2M7p7K61k35j80K07l7pJ44j08k00J47K35r2K5
3895A16k17J7M5m9%P2K8jJ64k07k0M71p30L86Kl99J01L48r8J08jj9j9l64J99K7
3921d0J24j04N2r7J50m4O9k41L72j32j07K33r9R4m09J90J25k95o7M52m18J20J22
3944E0l3o7m7K22j49m1K80k87J23j47K54j87q5M15k14o3L5K34k70k0K22k41K75
3967B59k68rO0k9J87k08P1k1q1P6r1q1qL77k69J1j36J18j20K16K5j70J23o8L2
3992dJ3L1l9O8K3o9r5L5K51n08J92L28j71j30M2J16j60J27J3J9J77l60K21K4R
4017A53l38K19k97J80R8J01k33l26O26J1k92j66J49K14o8J96j21k47J51k18J92
4038a6N1K6j9j45j51K74p9J78k93K10k59K84j23K49m81j83N30P6j86K04p1m09
$$ y = [-5, 114, -180, -105, 113, -65, 81, 64, -106, -14, 33, -44, 217, -18, -198, 9, -28, -35, 109, 1, -199, -52, 183, 91, 116, -101, -84, -39, -88, -88, -16, 12, 11, 175, -32, -52, 419, -311, 75, 77, -322, -221, 127, 29, 137, 136, 117, 98, -266, -67, -40, 84, -20, 32, -65, 85, 41, 110, -131, 241, 109, 2, 235, 136, 230, -179, 11, 136, -159, -226, 226, -192, -72, 50, 17, -50, -97, 125, -24, -65, 215, -72, 51, -96, 158, -29, -114, 301, 87, 24, 59, 293, 23, 3, 225, -16, 259, -9, -18, 42, 13, 200, -8, 63, 42, -39, 37, -54, -135, -143, 234, -35, -24, -160, -42, -162, 54, 79, -91, 32, -36, -4, 9, 40, 1, 69, 92, 23, -72, -37, 214, -294, -102, 226, 55, -75, -33, 83, -77, 50, 63, 82, 259, -101, 120, 144, 153, -185, 34, -263, -83, 15, 116, -117, -443, 183, 194, -98, -264, -115, 99, 31, 227, 106, -141, 10, -208, -16, 35, 61, 42, -103, -254, 20, -59, 119, -174, 36, -223, 61, -62, 187, -294, -477, 53, 129, -57, 147, 76, -333]
4060c33L09L06r5J44j38k26R1Jj9p0j23L41l30K82j41K1K5n1L1K1k16J27J76k44
4084a11K73l07N08l42k9j06K99j25j11k4j59K33j41R2L71m16J33j23J01k03N5
4105a32K43o5K02k68L6j67J05K04l32K5K4J63n9MR1k95K06J04n4M7j47O6q6K07
4129A22m01N75l50J3L77m14R4l7M5Q9L2q2j7j96J17K86m30J30r6J64k39K26J54
4152A62k91J50K3Q2rk56p3K88L7m72O57m79O7M87n04K01j17l20K43J78l08K14
4174d0j12J67n8L5J51j52L2k76M78l23L63J2n9j23j41L32j43rj0k78j5J68Q3j06
4198b4k14K87k25J87k76M35l47j18J92r4P8L20j12l13L50k20J83lLJ2j22P3j34
4221h2P4J90j90J35j74N0m3J18j80R4j17J62j11L8j27J64J77l15J03j35J86M3
$$ y = [-333, -24, 282, 187, 331, 193, -33, 58, 59, 40, -30, -153, 188, -142, 140, -1, 20, 45, -6, 25, 46, -170, -43, 133, -111, 162, -145, 363, 21, -8, -114, 185, 60, -51, -75, -234, -1, -142, -50, 321, -95, 38, -85, 16, -187, -132, 111, 46, 248, -20, 16, -151, -46, 158, -174, -149, -125, 38, -21, -17, 74, -221, -15, 89, 35, 82, -65, 1, -85, 122, -279, 296, -54, -41, 336, -78, 16, -21, 24, 113, 145, 63, 46, -150, -33, 253, -177, -47, -143, 21, -218, 8, 162, -129, 21, 44, 126, 117, -139, -212, 76, 113, -359, 298, -181, -114, 373, -131, 70, -47, -367, -124, 54, -254, -40, -152, 15, -43, -8, 143, -9, 23, -253, 225, -98, 265, 277, 218, 95, -46, 286, 143, 134, 124, -154, -169, -1, 82, -24, -238, 49, -176, 11, -265, 170, -177, -295, -103, -197, -119, 201, 89, -224, 126, -94, 89, 86, 89, 101, -21, 52, -82, -8, 182, -8, 127, -47, 3, -40, 78, -102, -8, -125, 37, -74, -36, -163, 1, 178, -137, -34, -169, 17, 60]
4243F0J90n2kj46NJ14P1j24O8O0k36J60k95JJ14j31O7j22K34J9l08m2L22l13K28
4268e8K11J04m76K43O0%k50Q5K53m0k03M16m45o6J81k99J40J21r6k6J30J92J4
4291A91k90nJ25j25J68k16J12j2J2j25nK07K7J64k48K12l2k35J84q5l43Q8L98
4314A67j23m8K44k54J60l1p6N5j08K11J91k5m29R2l80M11M1N3j40j38k40J55M94
4337B82m39L73j82O5k28M22j89k1l37L29J30m01M84l79K4P8K15p9j78Q6J03j70
4359a2J01n9Lj19P8M9o8M1J09j31n4Q3j48m0l3k6K61j45O9J6j14lK21o8p1R3n7
4386b4j14j39K30J70j56j36L32J25m19k7L95j86j56N5J15R8j20j56K56k04o7O7
4408f1N51o5n29K28J98m72O4J63J25j57O8M8l65J46j27L23k16K00j74K37k2k28
$$ y = [60, 250, 198, 196, 50, 55, 169, 240, 116, 184, 244, 8, 168, -127, -126, -12, -143, -76, -198, 36, 55, -253, -295, 27, -286, -58, 153, 257, -219, 24, 84, 84, -166, -81, 172, 132, -71, 345, -100, -166, 15, -284, -144, -23, -119, -145, -15, 177, 191, -99, -104, 21, -104, 64, -152, -40, -52, -40, -165, -170, 37, 64, 228, -20, 192, 160, -75, 109, 24, -319, -231, 167, 44, -4, 240, -14, 146, 115, 39, 94, -14, 197, 388, 363, -66, 26, -354, 57, 98, 151, 11, -127, -367, -212, 282, -157, 216, 34, 99, -129, 293, 104, 83, -254, 75, 205, -196, 288, -91, -67, 11, 226, 147, -31, 55, 158, -12, 89, 30, 33, -86, -8, 41, -27, 14, 123, -8, -62, 21, -127, -167, -200, -226, 35, -110, -41, -25, -139, -142, 79, 11, -60, 33, -24, -138, -277, -47, 123, -33, -169, 163, 288, -131, -158, 237, 51, -105, -50, 65, 163, 43, -113, 143, -61, -128, -61, 490, 425, -104, 124, 322, -150, -86, 77, 202, 45, 113, 161, -204, -58, -185, 138, -78, 122, -52, 185, 163, -65]
4430f5J0M5p1k04L53K19j0j68L4J6j39JJ7l0j18J09j23K7j67N48m26r0J45J90
4454A03k11M5m6J5K16k48M6p3M65k88j39J55J10j04J07j39o0L44p20L55J63J43
4476B39k13k9j57J56l1j35M7K01N2l14K23n7N7m3J34J7q7j77J04m5n6Q3j02j13
4500b46K70K39l08m1lK25k90J62n4K88l60J37j09K09j20j98L91k85L5L5J40k82
4522a65J96j30J19J8No0l6J62n1m0M69n02RP0O6q4l15K59J35L9j29M6k16Q0J56
4547A01K9j04p5j63L35k16J68k4k39j00J11J29j05K72j58J56k05p0Q4K06J68k52
4569D8J7m5n4J30j08j00R7j14J63k09K36q9lK04m73L8K32J4J24qj61J66k09K66
4593A62k38K91j23L03l14j83pR6J0p7N1L0k11J67K67l40J37k2k62K52J8J48j07
$$ y = [-65, -55, -10, -81, -285, 68, 287, 277, 109, 143, 159, 20, 21, 38, 8, -110, -1, -124, -97, -264, 284, -142, -232, -87, 103, -108, -63, -109, -94, 122, -126, -80, -153, 312, 24, -115, 40, 150, 46, 153, 14, -46, 298, -422, -67, 96, 239, 26, -3, -160, -4, -35, -170, -123, 78, 130, -184, 39, -18, 39, -4, 130, 147, 60, -117, -13, -58, -114, -31, -133, -246, 24, 263, -45, -86, -89, 136, -154, 8, -46, 242, -118, 19, -90, 119, -1, -199, 192, -93, -58, -23, 117, -165, 31, -99, 20, 38, 43, -17, -53, 109, 58, 18, 487, -15, -6, 64, 130, 46, -269, -10, 125, 164, 35, 81, -135, -55, 101, 130, 26, -49, -212, 123, -93, 75, 51, -188, -288, -177, -48, -153, 119, -39, 117, -88, -158, -74, 132, 300, 48, 65, 20, -34, 96, -12, -112, -15, -129, 34, -175, 61, -28, -31, 173, -300, -262, -30, -16, 108, 100, -61, 105, -104, 162, -76, 215, 92, 395, 81, -102, -109, -13, -3, -80, -29, 1, -210, -43, 224, -116, 21, -1, -263, -11, 7, 155, 48]
4616D8o1l96J24M34k90l9L73m07j38O53m53o6J46j85L87j75j23J50J66m8l21L22
4638A01k75K91r3J81l2k71J19j54j96M32L2j67J16J54j66j32K17j41q2M3K24k63
4660f2j90L64k29K18k00J11J5J93m08L18J64j73n0k27J92J62k32o3K35n54K83
4681a33P3K42Ml34J61j25M9j19L78P5l6k38N2j54k8K31o7j07l5J62N3j80J67k5
4705F6j45J22J22k66K93j67N7N3l19K17P0k89J07J55j67m8N3L5R0k7k1J73l66
4728b02R7J43K50l07j23J73K2k00J90k79J65J34j73J81j0m3K5j07K04o4m39K15
4750a48J37L08q3n0L0r3J23k62q6p7J94J62k06M9K5j33J85j03J42j21l33J97P0
4773g3J00l3m0L01l44J52R8k37O3l0j46L21o9J52k96J71k06J39n1K34j24j62j31
$$ y = [48, -13, -409, -285, 149, -141, -180, 193, -214, -352, 301, -152, -218, -72, -257, 130, -45, -168, -18, 148, 100, -221, 101, -174, 117, 24, 205, 173, -98, 21, -133, -329, 103, 135, -32, 84, 238, 72, -60, 157, 16, -66, -23, 201, -62, -252, 112, -117, 101, -99, 12, 27, 220, -188, 130, 294, 121, 71, -156, 36, 198, -34, -97, 138, -416, -133, -60, 182, 186, -148, 13, -112, -63, -182, 196, 271, 235, -3, 49, -105, -133, 98, 31, -76, -111, 51, 104, -76, 91, 66, -79, 43, 165, -101, 192, 25, 82, 135, -184, 33, 103, -186, -79, 76, -91, -139, -86, -51, 39, 12, -9, 164, -202, -105, 38, 288, -19, -142, 31, 53, -147, 43, -236, -71, 63, -110, 71, 61, 18, 43, -64, 140, 76, -363, -148, -11, 297, 214, 164, 194, 101, 224, -38, -124, -201, -7, 155, -51, -2, 23, -110, 75, -28, 114, -7, -340, -143, -73, 27, -6, -46, 255, -89, 63, 161, -76, -13, -43, -189, 132, 63, 215, -81, 90, -116, 23, -28, 206, 82, -80, -211]
4796b11L40k79L51m15j0R3K76p3k3Ok99L95l12K81k11J46k18K22J56m17J03K51
4818A52J07q0k39J87J0J55j22j74j7j24L28q0j51j40N3m3R8J96k07J5mL17l36
4841i9p0K56M0j27j90j5L46j67K46n9m52K43N3J42k45j6j19P19n39L5j1J54k89
4864a64K46j9r0RJk3j42R7kp5L04j35q4n0R9j49K32o8QJ85m07K46j80K19r8J18
4890G8l07P0N0j15j7K40N9k6j19J38k27J17K83m89O8K51j05k59K97j18KK24m4
4913E1k3jq1n5K7O2J03o5K9L2k08l5J85j13k14K84L2r0J46N7Q5k44J89q5L1J7
4939A16J9j23p5P0k1J08O7k53J91K48j24j18J92n22M7K77l93O54k70QJ9j11O5
4962G1Q4k37J11j57N0J74J20j65M3j80K01j83R4l75K68P5J31j84j62Q4K53j40
$$ y = [-211, 129, -150, 201, -214, -224, -131, 145, 72, 49, 55, -244, 151, -161, 120, -91, 55, -163, 59, 215, -202, -99, 152, 259, 179, -60, 127, 137, 292, 170, -4, -21, -145, 183, 103, -48, -188, -135, -178, -80, 116, -91, -76, -80, 237, -99, -169, 87, 127, 0, -190, -205, 141, -26, 220, 161, -291, -48, 5, 147, -98, -114, -233, 486, -53, -18, -29, 125, -164, 82, 63, -27, -18, -17, -40, -182, -85, -87, -162, 142, 7, -77, -127, -28, -177, 55, -13, -5, 180, -227, 19, -161, 58, -40, 78, -229, -159, -109, -224, -241, -1, 58, 32, -87, 51, -176, -59, 224, -265, -197, 54, -51, -310, -13, -131, -129, 95, 51, 28, 27, -54, -109, -82, -20, 83, 18, 47, 79, -129, -164, 21, -92, -306, -22, 10, -80, 66, 123, 208, -36, 153, 68, 99, 116, 135, 12, -63, 7, -14, 94, 161, -92, 99, 347, 223, 105, 297, -225, -178, 99, -294, 360, 90, 98, 117, 6, 71, 155, -82, 29, -128, -78, 96, 216, 51, 94, -86, 115, -68, 26, -349, -81, -6, 125, -59, -221, -137, 116, -24]
4984b4J8L60l31J70k94k5L44j27k52Q7L7p3k73O90k69j70Q9o2J16M8J26m71L24
5007C8q8j35K86q1l6J80k91J1J21l63M81j42K78m45K52j57O9k25J37K44k33p2
5029a71J73P2k16m7K82n12P38k98r0J85j34K31l54R0j22K28p6r9J40r9k11K54
5051c6O7j23J11P8j69J81J94k43k67K56N9k02M0K30k3r7o0k24J08j50L45j75K59
5074A59j22j27K15N6j10K1j5p9M9l5m2p3J17O8lj92J0rJ12j29L9K72J06l85M5
5099e2L32m54J76j60L70k20L8M7Rk27J60k01J14j13Q7j61P4M26j37l33K93l63
5121b95L79m4k82K5K03k58L67m8p7j9jJ30p8K96k18k92M17J9k86P3j30l0K77j42
5145a4l6J77m31J07J64P6o1R9k65K73j3P1k64R9K34l14P8J4J4L9l0K5j67K23N4
$$ y = [-24, -6, 354, 23, 193, -101, -126, 218, 91, -161, -74, -37, -110, -383, 307, 38, -132, -43, -105, 11, 59, 185, -286, 38, -50, -185, 101, 20, -16, 164, -127, -116, 5, -358, 123, -19, 259, -186, 66, -91, -22, -247, -110, 134, -99, -171, 2, 74, -142, -189, 93, -419, 319, 21, -69, 116, -18, 213, -141, -51, -173, 55, -21, -120, 20, -79, -290, -36, 31, -92, 19, 97, -72, 109, 303, 60, -207, 49, 108, -94, -54, 176, 153, 56, -4, -228, -120, -270, 75, -100, 159, 37, -90, 125, 181, 71, 92, 77, -2, 47, 12, -30, -103, 14, 82, 79, -113, -103, -112, 0, -129, -90, 182, 288, -97, -52, 280, -174, 2, -158, 212, -8, 30, 77, 86, -141, 19, -182, -68, -181, -94, -255, -181, 245, 108, -225, 68, -295, 84, 40, -242, -217, -14, -272, 95, 47, -30, -49, -50, 80, 2, 298, 80, -212, 205, 224, -62, 11, -119, -149, 128, -14, -50, 127, -304, -197, -33, 43, -18, 81, -184, 89, 76, 147, -117, -18, 216, -98, -20, -6, 8, 47, 17, 42, -125, 98, 152]
5170A52j38o7j51J37j02N80n64K02K59j45k14K35n4jk31P3O3m0J31j10K3l6j60
5193a58N4l7J46J16k83L21k44J06M0k11K44j21J0j40r2o8J72J17j51L04k78K13
5215F0j67K34k10K4j34K55J35j19pJ15k61N2K0j18K9j1M5M72k79j12O6L3j21l87
5239c86M99p0k3L7%j02J02K6j42N9j0m1K46k90J35j60K48M8j49N5J61l74j18J54
5263i5M0J97Q7j49l34K05L22o33N20k8l19K42j78J59m3j09K3j60R5L78k88P0L88
5286C90k34J04j45o1J67k69K95k06J27j46r4J18j43J95l9r4k08L43J94k55N8j86
5308h9j8j19J22K27j70K47l41M7K07J7j6J81j27j00l04QK24j21q4K75J85j83n0
5331A8k2k31J44J64l48N26k68K95k61l5l5q1Q9J35k41M12j42j74j52J0O0J02N0
$$ y = [152, 14, -53, -204, -67, -169, 411, -153, 49, 308, 163, -51, 184, 130, 129, -102, -29, 34, -6, 125, 15, 38, 2, -158, -104, -141, 5, 121, -162, 159, -85, 21, 61, -150, 94, -27, -17, -157, -249, -317, -145, -28, -179, 125, -153, 60, -107, 127, -83, -59, -193, 62, 197, 78, 71, 186, -75, -23, -3, -121, -92, -103, -58, 414, 135, 23, 89, 122, 1, -386, 113, 43, 20, 57, 57, -45, 57, 83, -59, 0, -10, -51, 195, -95, 40, -120, 128, 176, 27, 82, 243, -131, -249, -95, -55, 142, 229, 80, -254, -49, 273, -360, 160, 132, -187, 55, -123, 36, -7, -116, -93, -253, -158, 220, -68, 2, 390, 156, 260, 115, 54, 221, -48, 247, 41, 168, 22, -72, 46, -97, 98, 59, -35, -243, 100, 294, 39, 97, -89, -107, -226, -104, 123, -47, 200, -141, -94, 113, 130, 114, 295, 168, 68, -236, -228, -4, -125, -209, 66, 251, 68, 18, -4, -235, -91, 73, -275, 251, -17, 278, 17, -18, -53, -134, -45, 90, -151, 261, 119, -55, -207, -197, -137, -35, 15]
5354A5p0o7J35O7o2j92M97m04J67k6M9k55J58J34k7o1l2J09j28J73j53m4o8R1
5378Fpm3J83j73k24K92l5k2J50ql34L68j57J51j52m9K06n4m3r1J9n0Q9j06J34
5403E0k19J68L0j48J19j86K57j99K46k62j55K81k0J2P6J14j16k36oK58j83R6J17
5426I4q4q4J23l3j12kr0J94k60l4M40j06Q6q1K7R3j34j68R5R4m5R7j14N6k43J03
5452h8K60k05j42M37K4k80L16j49Q7k28j42K31q7Mo9K9L82k66K4l51J08K23l0
5475H8l1j73K10j31J03j43jR9m7J26l85K34K2J16k51K73j32J4K8j11J74J3n9l43
5499c07K67N5N3J09l21K54j23j31K20k28K89n32L34q6J49L7j9k57J97K00j88j35
5521a63J4L53l84J05r3J01q4K44j67k57J12L47M2l08K2K1n7R4O7J9M2P3k60o2
$$ y = [15, -55, -122, 13, 80, 18, -174, 323, -81, 86, 60, 109, -146, 12, 146, 119, 58, 26, 135, 7, 180, 27, -17, -85, 6, -1, -44, 139, -34, -258, 34, -1, -23, 127, 119, -215, 153, -4, 147, -5, -54, 152, 98, 55, -36, -17, -67, 22, -84, 50, -169, -1, 29, -119, 0, -186, 71, -128, 118, -144, -299, -18, -38, -26, 50, 164, 48, -188, -194, 64, -119, -23, 94, 10, -74, 49, 16, -96, -98, -188, 6, -254, -288, 152, 46, 132, 51, 78, 171, 37, -131, -36, 58, 13, 110, -4, 52, -191, -88, 172, -33, -175, 262, 286, 6, 322, 173, 260, 32, -110, 121, 34, 38, -31, -2, 380, 114, 138, -213, -105, 118, 88, 57, -116, 94, -37, 66, -77, -78, 21, -26, 100, -285, -51, -29, 87, -164, 109, -23, -9, 19, -92, 82, 95, 36, -307, -40, 15, 68, 177, -144, 110, -13, -144, 76, -152, 137, -395, -61, -147, 2, 39, 20, -237, -40, 160, -28, -163, -149, 204, -180, -75, -168, -67, -151, 93, -74, -331, -219, 128, 170, -138, -116, -95, -152, -58, 9, 28, 70, 143, -117, -179]
5545a79N3K01j55N3m7l17L49J43qj3j01K38q6r0j79K91j08l16J32K38r2qO8J36
5569B03l62j8j52L26J80l82J92j71J75n8q6K87j31P8j14l67K57K41l1j99J59o4
5591c7J4m7pK54p4k53J1J15j1J21J27j79O6J6p7J0k14P5J52r2j56n7P6K13J14
5616A60m52L01N9k28J6q8K95j89mL7J26p3k16J71K27r6N0k33m4K08j23J78K7k33
5640a24K11k13J63n7qM7j91j04K84j44K14O8j72M68m96J07j31q1J93l6R8K5l0
5663I1l21L31m6k3j32J61j46n3mM61l25J5m3j12J71r6J25J28k18J87j76r2K00
5686H3k37J51o5O2k34M25j38o6J15l5j49l5J01k27O4j29M07r3P8p7K55l85J76
5709D7l42L49j22l5N4K48j45k80N8M6J60J95k50K59k9j39j71J04j1j3J5Q0k36
$$ y = [-179, -126, 75, -80, -27, -74, -391, -42, 101, 93, 80, -21, 217, 131, 41, -138, 153, 45, -271, -139, 99, 7, -1, 67, 203, -159, -177, -329, -3, 177, -205, -13, -184, -9, -67, -153, 134, 3, 81, -33, -400, -143, 98, 67, -132, 27, -37, -23, -70, -77, 177, 103, -150, -139, -24, -35, 86, 213, 34, 100, 116, 39, 49, -165, -90, 62, -30, -186, -243, -167, 46, 160, -292, 9, 68, -160, -144, -232, 63, -126, -130, -93, 33, -40, -256, -85, 142, 46, 96, -137, -181, 27, -96, 82, 109, -124, 87, -126, 37, -20, -28, 19, -172, -276, 8, -136, 78, 146, -26, 442, -54, 53, -78, -159, 34, -2, 96, 121, 91, -230, 101, 55, 32, -100, 61, -85, -138, -142, 319, -6, 9, -34, -146, 25, -71, 54, 182, -36, 151, -25, -117, 83, -154, -3, -68, -6, -240, 185, 47, -19, 96, 61, -88, -123, -22, -249, -185, -314, 93, 0, 78, 1, 256, -129, 47, -295, 54, -68, -103, -49, 199, 54, -226, -168, -122, 38, 233, -17, 242, 213, 74, -97, 7, -4, -17, -2, 78, -158]
5732a58j34N70j56k09N7m8J31J68k78J3k6r4l4jj5O0J90j05L9R0l12K90K5q8J52
5757A27L7p4k31J7J23M1k64J40R2J32k33Q1q3J3K81j00J81r3k65j37K26M9j49
5780h9j66R7K20o2j45K90k07J66j16j75K33mK11j94rj21J80j81o1L38l37J30k10
5803b12K89O4m5M2j26k6k44m8M51j2j52R9q9J61j58KJ30k9k15J64J39m49M17n1
5827A02M8j39J44j27K07j59k84M7m2Q1Q4K64j32n8JK4q1N6m3Oq9K1k4o9K68k94
5853a88j59J39J51r1O1J34P6j69J83m51L18k74L86k32P0j36Q6Rj45K70L3j61J26
5876C6j78R0o0L1K66r0j23K03m37K17K22k12M1p6P7K1o5K9l01L25K31k86QL69
5900C38m34r7L96l23O5k32L46K38l76R5J54j80P8k4k5j90M40k75r5k3j07K72k38
$$ y = [-158, -292, 278, 122, -87, -30, -78, 53, 221, -57, -44, -70, -164, -198, -199, -214, -154, 36, -69, -30, 60, -252, 38, 63, -25, 127, 164, 90, -141, -124, -1, 40, -224, -84, 8, 140, -93, -12, -95, -82, 199, 99, 280, 187, -78, -215, 11, 60, -89, -255, -158, 62, 0, -145, 145, -62, 104, -12, -187, 46, 42, 253, 59, 50, -71, 109, -72, -133, 205, -132, -2, -212, 77, 141, 96, 138, 12, -14, -258, -306, 145, 133, -19, 80, -9, 152, -6, -4, 126, 97, -118, 46, 185, -264, 153, 102, 150, 11, 155, 28, 235, 76, -208, -161, -203, -122, -38, 226, 94, 36, 37, 61, -20, 36, -7, -1, -90, -69, -93, -162, 106, -188, -347, -208, -57, -148, -87, 47, 123, -46, 137, -314, 4, -270, 116, -116, -46, -182, -96, -87, -232, 38, 71, -90, 36, -142, -52, -112, -81, 185, 95, -28, 175, -262, -45, 177, -35, 6, -70, 7, 28, -37, -8, -309, 16, 247, -39, -31, 338, -96, -193, 203, -120, -55, -287, 59, 297, -79, 16, 170, -10, 68, 44, 19, -171, 269, -6, -101, -124, -231, 41, -197]
5923a97L9K46K52n39Q7J70l01K02O4j45K89k47J46K25k50Mn0j06K56o1r5j90l7
5946b38L1K92l74K36L81l05j8K34l95Q5m4K22Q9l06j03K41k2N6J84k38k58K22
5968b8M8j67K25L1q7K9j17O5J8r2J54o8J36j60jm3k4J17M6J2Q1k35M5K89k98O3
5994C9o2L5l5M9O%J08K58k72k20L68j3k53J76k89M4J36q7j7j67j25L38J07j76
6018e2L65n26J6J69j57K15j64J21j64J2L02l33K81j62N0L2N4P6k81kJ21j65O4
6041a28K06j84N5J29M0j37Q5o2j27K6R2k30K76J13k09J77j88OJ44J57k31J91j73
6064B8k8K23m80K55j41J52j17K31k97L89k60N2Pk04J47n8k28N12j14j72L4n6L74
6087B49m7l65K45k12L04j23K21k50J21j9J38n31l3K46J41N4J32l47J28q3J6j27
$$ y = [-197, -158, 88, 340, -199, -112, 58, -243, -41, 23, -122, 167, -80, 66, 291, 41, 45, -5, -111, 145, 84, -11, -201, -238, -207, 85, -289, -53, 328, 23, 5, 239, -156, -71, -115, 107, 196, -110, -213, 28, 6, 62, 246, 8, -250, -28, 20, -147, 78, 109, 22, 51, -66, -1, 17, -75, 79, 11, 147, -13, -14, -57, -81, 36, 82, 94, 175, -60, -15, 274, -24, 39, -23, 12, -23, 26, 32, 32, 140, 398, 126, -94, 274, 261, 8, 184, -105, -61, 75, -12, -29, -196, -321, 17, 124, -52, 313, -213, -197, -28, -185, 30, -134, -13, -177, -165, 137, -196, 85, -77, -27, 5, 59, 135, -146, -148, -27, -192, -128, 78, -106, -51, 78, 118, -19, 66, 4, -123, -97, -5, -235, 41, 154, -55, 122, -66, -60, 84, 241, 10, 201, 28, 0, 223, -257, -2, -143, 9, -108, 123, -174, 215, -45, 7, 14, -190, -43, -101, -329, 183, 69, -103, -69, -125, 249, 202, -163, 82, -130, 174, 51, 272, 22, 143, 124, 262, -269, -302, -56, 85, 139, 271, -76, 52, -31, -15, -142]
6109a42J82q9M9K23k22K00j86J19k16K3K43J4k41M4k64J26q2L96l39J08L21k63
6131Dk9q7J62j10l8j18N55m30O8J45j43j69L41n1j95J18K8j61l6N9N7L1R5k49
6155a53M1J9PJ15K37l01k8l1J00n6k9J12lJ8r1N0j13K58j07k37K33M1j38q1K23
6180H6k30K52j55N1J3k11L91k40l1K73m68L95l2m17K05M8J48J10n72L32l4J50
6202F4J27l22K78n1Ml32M12R6j80k91K45n9p9n2J41J78k79j67K06j41M52k07J85
6225B28Pk36j68J84q9P8K1L3P5j85L05k77J62j78n1L15m52K88Q3o8j19K99j93
6248F2j92J38r7P2r1k71J84J64J24N3j84k00J92q7qK14r9K67k84j10J72J87j68
6271C8J32l02K36J77m07n6K9K42J95j97K9l5K46l65k6O3K51k73Q7n6k69R8J37
$$ y = [-142, 40, -49, 0, 223, 1, 201, 15, 134, -82, -59, 184, 198, -43, 1, -263, -137, -219, 177, -162, -54, 267, 4, -25, -112, 50, -60, -98, -216, 339, -91, -23, 122, -21, -190, 151, 100, -95, 23, 51, -110, -146, -87, -30, 1, 96, -153, -112, -93, -86, 29, 266, -35, -63, -94, 6, -50, -79, 33, 30, 48, -43, 7, -106, 152, 45, -192, 41, 82, -56, -137, 86, -144, 108, -47, 4, 17, -194, 197, -43, -74, 199, -269, 126, 94, -323, -118, -70, 78, 188, -384, -52, -86, 64, 191, -131, 147, 96, 100, -232, 180, 276, 96, -195, 50, -9, -88, -140, 1, 179, -100, -267, -61, -202, 250, 43, 228, 235, -1, -169, 15, -74, 4, 25, 58, 133, -52, 253, -24, 138, -40, -91, 224, -228, 60, 143, 75, -44, 255, 62, -130, 8, -89, -17, -108, -379, -195, -31, 93, 146, -38, -238, -46, -133, -141, 73, -26, 241, -43, -153, 19, 206, 38, 170, -132, 104, 281, -126, -182, -153, 89, 284, 87, 116, 81, 327, -38, -64, -1, 250, -23, 64, 8, -261, -163, -26]
6294b6l2J72r3k72J65J64k60P3J7K40J8m72N33n12K76N26n07nj85O2OM4k07K74
6318aj90J76%k47J54O0p1K50R9k01j09q2J56l4K04k84r2l9M92k17K10j25L8k56
6342a09M6m1n7k20M86l06J48m3L72l17n1K22j96o4n6J40l7J83Q4k03Q4k29O9K84
6366A89j95K91k93J7M5K03j76j33j6R7O7k37m6L49j43K60l00m4j38J36P7j9K19
6389B10l08J05J6k00L01m9M4K0L3k29j94K07p8K50j09J06j73L02j92N4m1l1k76
6412b32J87k47J91m8K32p8q3K2J78J47j78p8M9j58L40k25p8M3K18j75l2j0J98
6435A83l56N6K52l70L31j07rJ21j53L0K3Q6p4r5J24M5j81M8m4j75L68Q4n0k35
6459i8l6M22k61o4J74l0k63N2M7K52j93KM8j78J89J10k66L1J37J0j3o6j92M16
$$ y = [-26, -58, 114, 21, -251, -86, 78, -182, -109, -92, 148, 166, -306, 227, -285, -9, 517, 10, 5, -180, -118, -112, -68, -275, -1, -191, -15, -15, -262, -108, -48, -119, 131, 230, 29, -80, -162, -6, -40, 164, -120, -212, -251, 241, 24, 234, 109, 147, -109, -63, -104, -161, -381, 105, -201, -53, -96, 276, -41, -92, 130, -66, -130, -186, -46, -83, 100, 184, -19, 65, -164, -95, 189, -6, 285, -8, 9, 54, 257, 81, -52, -68, 29, 96, -141, -187, 162, 19, 279, -21, -65, -203, -67, 10, -9, 210, -98, 7, 23, -177, 124, 75, 119, 139, 172, -57, -251, -44, -122, 128, 19, 125, -48, 254, 62, 116, 75, 44, -232, -45, -292, -101, -149, 83, 5, -78, -56, 122, 269, 91, 13, 62, -96, 244, 19, -59, -16, 202, 27, -5, -15, 183, -173, -117, 135, -235, 96, -11, -20, 101, -52, -22, 1, 87, 13, -82, 42, 87, -94, -46, -90, -265, 103, 187, 137, -98, -134, 288, 27, -37, 137, 107, -156, -104, -57, 195, 2, 4, 52, -126, 63, 173, -93, -62, 75, 85, 72, 6, -186, 230]
6483B30j5j78o2K9K56j98r4m2j5L0J52QL7j59J30L8k89J94j29P4k7N2m31M70j62
6508a01j26J44ML26k51j08o2J00K17k71K05j39J20k09J8P0j33K44p6J69k87P4
6530g2n0J11L1k27J26J40k11Q0k11J72j5J19j07J81o9k3P5R1p4p4j08K48j53P8
6554E8j33k8K93l00K17n7L4j01q5J10Q0J44k01q8J86J24k42l0j34N2R0k48J07
6577a52j81L79J38j80q4L28k27J84k42r9J12L4J64k66j0k9M61l55nM6N6L77l86
$$ y = [230, 215, 37, -25, 4, 260, 62, -32, -74, -89, -59, 93, 101, 138, -21, 109, 147, -142, 52, -77, -3, -30, 22, -409, 61, -101, -227, -83, -79, 247, -4, -112, -174, -74, 143, -128, 77, -62, 58, -151, -133, -63, -196, 48, -28, 141, -146, -72, -122, -11, 20, -207, -81, 59, -152, -72, -283, -111, -126, -7, -114, 67, -2, -25, 50, 141, 67, -7, -115, 133, -20, 58, -75, -103, 190, -110, 107, 50, 84, -17, -102, 8, 88, 232, 31, -57, 129, 253, 11, -19, -153, -101, -11, -259, -152, -333, 46, 184, 4, -80, 248, 21, 205, -37, -136, -24, 10, 174, -92, -102, -131, 330, -25, -30, 16, 72, 449, 63]
$$ [...]
8191C9
##END NTUPLES=NMR FID
##END=
