##TITLE=1H_Pr Et-53
 CDCl3
 8 sc, 
 21.09.2022
##JCAMPDX= 6.0         $$ Bruker NMR JCAMP-DX V2.0
##DATA TYPE= NMR FID
##DATA CLASS= NTUPLES
##ORIGIN= UXNMR, Bruker Analytische Messtechnik GmbH
##OWNER= root
$$ XWIN-NMR		Version 3.5
$$ Wed Sep 21 15:29:06 2022 Russian Standard Time (UT+4h)  she@DPX200
##.OBSERVE FREQUENCY= 200.1313499994
##.OBSERVE NUCLEUS= ^1H
##.DELAY= (6, 6)
##.ACQUISITION MODE= SIMULTANEOUS
##.ACQUISITION SCHEME= undefined
##.AVERAGES= 8
##.DIGITISER RES= 18
##SPECTROMETER/DATA SYSTEM= spect
##.PULSE SEQUENCE= zg30
##.SOLVENT NAME= CDCl3
##.SHIFT REFERENCE= (INTERNAL, CDCl3, 0, 15.7039)
##AUDIT TRAIL= $$ (NUMBER, WHEN, WHO, WHERE, WHAT)
$$ ##TITLE= Audit trail, XWIN-NMR		Version 3.5
$$ ##JCAMPDX= 5.01
$$ ##ORIGIN= Bruker BioSpin GmbH
$$ ##OWNER= she
$$ F:/spectra/data/she/nmr/H-F/1/audita.txt
$$ ##AUDIT TRAIL=  $$ (NUMBER, WHEN, WHO, WHERE, WHAT)
(   1,<2022-09-21 15:28:11.29 +0400>,<she>,<DPX200>,
      <created by zg, POWCHK disabled, PULCHK disabled
       configuration hash MD5:
       00 E9 B6 7A A2 85 ED C7 34 08 36 98 17 FE 4E 26
       data hash MD5: 16K
       A8 76 DC ED D1 5B D5 AC 8D EE 33 13 5E A6 00 EE>)
$$ ##END=
$$ 
$$ hash MD5
$$ 19 13 3A 5F CC DF AF 20 34 66 38 AA 12 2C 5C 1E
##$RELAX= 
##$RELAX= 
##$RELAX= 
##$RELAX= 
##$RELAX= 
##$RELAX= 
$$ Bruker specific parameters
$$ --------------------------
##$DU= <F:/spectra>
##$EXPNO= 1
##$NAME= <H-F>
##$PROCNO= 1
##$TYPE= <nmr>
##$USER= <she>
##$AMP= (0..31)
100 100 100 100 100 100 100 100 100 100 100 100 100 100 100 100 100 100 
100 100 100 100 100 100 100 100 100 100 100 100 100 100 
##$AQSEQ= 0
##$AQ_mod= 1
##$AUNM= <au_zg>
##$AUTOPOS= <>
##$BF1= 200.13
##$BF2= 200.13
##$BF3= 200.13
##$BF4= 200.13
##$BF5= 200.13
##$BF6= 200.13
##$BF7= 200.13
##$BF8= 200.13
##$BYTORDA= 1
##$CFDGTYP= 0
##$CFRGTYP= 5
##$CHEMSTR= <none>
##$CNST= (0..31)
1 1 145 1 1 1 1 1 1 1 1 1 1 1 1 1 1 1 1 1 1 1 1 1 1 1 1 1 1 1 1 1 
##$CPDPRG= <>
##$CPDPRG1= <>
##$CPDPRG2= <>
##$CPDPRG3= <>
##$CPDPRG4= <mlev>
##$CPDPRG5= <mlev>
##$CPDPRG6= <mlev>
##$CPDPRG7= <mlev>
##$CPDPRG8= <mlev>
##$CPDPRGB= <>
##$CPDPRGT= <>
##$D= (0..31)
0 1.2 0 0 0 0 0 0 0 0.06 0 0.03 0 0 0 0 0.0002 0 0 0 0 0 0 0 0 0 0 0 0 
0 0 0 
##$DATE= 1663759690
##$DBL= (0..7)
120 120 120 120 120 120 120 120 
##$DBP= (0..7)
150 150 150 150 150 150 150 150 
##$DBP07= 0
##$DBPNAM0= <>
##$DBPNAM1= <>
##$DBPNAM2= <>
##$DBPNAM3= <>
##$DBPNAM4= <>
##$DBPNAM5= <>
##$DBPNAM6= <>
##$DBPNAM7= <>
##$DBPOAL= (0..7)
0.5 0.5 0.5 0.5 0.5 0.5 0.5 0.5 
##$DBPOFFS= (0..7)
0 0 0 0 0 0 0 0 
##$DE= 6
##$DECBNUC= <off>
##$DECIM= 32
##$DECNUC= <off>
##$DECSTAT= 4
##$DIGMOD= 1
##$DIGTYP= 9
##$DL= (0..7)
0 120 120 120 120 120 120 120 
##$DP= (0..7)
150 150 150 150 150 150 150 150 
##$DP07= 0
##$DPNAME0= <>
##$DPNAME1= <>
##$DPNAME2= <>
##$DPNAME3= <>
##$DPNAME4= <>
##$DPNAME5= <>
##$DPNAME6= <>
##$DPNAME7= <>
##$DPOAL= (0..7)
0.5 0.5 0.5 0.5 0.5 0.5 0.5 0.5 
##$DPOFFS= (0..7)
0 0 0 0 0 0 0 0 
##$DQDMODE= 0
##$DR= 18
##$DS= 0
##$DSLIST= <SSSSSSSSSSSSSSS>
$$ [...]
##$SUBNAM2= <"">
##$SUBNAM3= <"">
##$SUBNAM4= <"">
##$SUBNAM5= <"">
##$SUBNAM6= <"">
##$SUBNAM7= <"">
##$SUBNAM8= <"">
##$SUBNAM9= <"">
##$SW= 18.0517283424941
##$SWIBOX= (0..15)
0 0 2 0 0 0 0 0 0 0 0 0 0 0 0 0 
##$SW_h= 3612.71676300578
##$TD= 16384
##$TD0= 1
##$TE= 0
##$TE2= 300
##$TE3= 300
##$TEG= 300
##$TL= (0..7)
0 120 120 120 120 120 120 120 
##$TP= (0..7)
150 150 150 150 150 150 150 150 
##$TP07= 0
##$TPNAME0= <>
##$TPNAME1= <>
##$TPNAME2= <>
##$TPNAME3= <>
##$TPNAME4= <>
##$TPNAME5= <>
##$TPNAME6= <>
##$TPNAME7= <>
##$TPOAL= (0..7)
0.5 0.5 0.5 0.5 0.5 0.5 0.5 0.5 
##$TPOFFS= (0..7)
0 0 0 0 0 0 0 0 
##$TUNHIN= 0
##$TUNHOUT= 0
##$TUNXOUT= 0
##$USERA1= <user>
##$USERA2= <user>
##$USERA3= <user>
##$USERA4= <user>
##$USERA5= <user>
##$V9= 5
##$VALIST= <valist>
##$VCLIST= <CCCCCCCCCCCCCCC>
##$VD= 0
##$VDLIST= <DDDDDDDDDDDDDDD>
##$VPLIST= <PPPPPPPPPPPPPPP>
##$VTLIST= <TTTTTTTTTTTTTTT>
##$WBST= 1024
##$WBSW= 4
##$XGAIN= (0..3)
0 0 0 0 
##$XL= 0
##$YL= 0
##$YMAX_a= 501673
##$YMIN_a= -610666
##$ZGOPTNS= <>
##$ZL1= 120
##$ZL2= 120
##$ZL3= 120
##$ZL4= 120
##$ABSF1= 10
##$ABSF2= 0
##$ABSG= 5
##$ABSL= 3
##$ALPHA= 0
##$AQORDER= 0
##$ASSFAC= 0
##$ASSFACI= 0
##$ASSFACX= 0
##$ASSWID= 0
##$AUNMP= <proc_1d>
##$AZFE= 0.1
##$AZFW= 0.1
##$BCFW= 1
##$BC_mod= 2
##$BYTORDP= 1
##$COROFFS= 0
##$CY= 11.3945322036743
##$DATMOD= 1
##$DC= 2
##$DFILT= <>
##$DTYPP= 0
##$F1P= 2.36226072786647
##$F2P= -0.459571619588291
##$FCOR= 0.5
##$FTSIZE= 0
##$FT_mod= 4
##$GAMMA= 1
##$GB= 0.15
##$INTBC= 1
##$INTSCL= 1
##$ISEN= 128
##$LB= 0.24
##$LEV0= 0
##$LPBIN= 0
##$MAXI= 10000
##$MC2= 0
##$MEAN= 0
##$ME_mod= 0
##$MI= 1.114404
##$NCOEF= 0
##$NC_proc= 0
##$NLEV= 6
##$NOISF1= 3.799351
##$NOISF2= 2.8
##$NSP= 1
##$NTH_PI= 0
##$NZP= 0
##$OFFSET= 15.70392
##$PC= 1
##$PHC0= -18032.4
##$PHC1= 9.20069
##$PH_mod= 1
##$PKNL= yes
##$PPARMOD= 0
##$PSCAL= 0
##$PSIGN= 0
##$REVERSE= no
##$SF= 200.130013532006
##$SI= 16384
##$SIGF1= 3
##$SIGF2= 2
##$SINO= 400
##$SIOLD= 16384
##$SREGLST= <1H.CDCl3>
##$SSB= 0
##$STSI= 0
##$STSR= 0
##$SW_p= 3612.71676300578
##$SYMM= 0
##$S_DEV= 0
##$TDeff= 0
##$TDoff= 0
##$TI= <>
##$TILT= no
##$TM1= 0
##$TM2= 0
##$TOPLEV= 0
##$USERP1= <user>
##$USERP2= <user>
##$USERP3= <user>
##$USERP4= <user>
##$USERP5= <user>
##$WDW= 1
##$XDIM= 8192
##$YMAX_p= 0
##$YMIN_p= 0
$$ End of Bruker specific parameters
$$ ---------------------------------
##NTUPLES= NMR FID
##VAR_NAME=  TIME,          FID/REAL,        FID/IMAG
##SYMBOL=    X,             R,               I
##VAR_TYPE=  INDEPENDENT,   DEPENDENT,       DEPENDENT
##VAR_FORM=  AFFN,          ASDF,            ASDF
##VAR_DIM=   8192,          8192,            8192
##UNITS=     SECONDS,       ARBITRARY UNITS, ARBITRARY UNITS
##FACTOR=    0.0002768,     1,               1
##FIRST=     0,             0,               0
##LAST=      2.2672688,     0,               0
##MIN=       0,             -610666,         0
##MAX=       2.2672688,     501673,          0
$$ Real data points
##PAGE= N=1
##DATA TABLE= (X++(R..R)), XYDATA
0@%%%%%%%Jj%qJ6j6K4l2M0n6P2q6J02j20J44j72K02k38K80l26L75m34N01n73O55
$$ 0 0 0 0 0 0 0 0 1 0 0 -8 8 -8 16 -16 24 -32 40 -46 56 -64 80 -92 110 -128 152 -174 201 -233 268 -305 350
32C50p48Q45r58J086j218J364j527J706j901K114k348K605k884L186l519L884
$$ 350 -398 447 -511 575 -643 721 -806 900 -1001 1113 -1235 1370 -1514 1672 -1847 2037
48B037m282M717n195N723o308O955p677Q490r408J0457j1666J3080j4760J6794
$$ 2037 -2245 2472 -2723 3000 -3308 3647 -4030 4460 -4948 5509 -6157 6923 -7837 8957
62H957j9315K2537k6825L2833m1925N7462r0959K89700l39254m91625O99545L18059
$$ 8957 -10358 12179 -14646 18187 -23738 33724 -57235 232465 -106789 -598414 101131 419190
74D19190l81856l12524K08386J44349L1344k7185j30997j85492J91248L38503
$$ 419190 37334 -275190 -66804 77545 108889 81704 -49293 -234785 -43537 294966
84B94966j31590m77350O7780M98461L0523m60667r2480L31021J45014j78176j33135
$$ 294966 163376 -313974 -246194 252267 282790 -177877 -270357 60664 205678 27502 -105633
95a05633J5121Q8710J08002P72j96639q4467K33207J46798k30361j46640J89470
$$ -105633 -90512 -1802 106200 106972 -89667 -174134 59073 205871 -24490 -171130 18340
106A8340R3309j32414j066O5447j01615j7378J94949l343k60100j1104K86178
$$ 18340 111649 -20765 -21831 43616 -57999 -75377 119572 116229 -143871 -154975 131203
117A31203L1250k77737l7145K42541J2071j81485M5921J05545j29492l2807K19680
$$ 131203 162453 -115284 -152429 90112 102183 -79302 -33381 72164 -57328 -90135 129545
128A29545j5016k88643L6440L29015l1887l34198J4808L02254L415k33069n750
$$ 129545 114529 -174114 -137674 191341 159454 -174744 -159936 142318 145733 -87336 -93086
139i3086J38902j2779m0604M2084m7332p8548J06992J14355j31684j45264J22027
$$ -93086 45816 33037 -7567 34517 -12815 -91363 15629 129984 -1700 -146964 -24937
150b4937J57881r7090j49262P0063J17771m6762o3657K8992j821j5243O6203N286
$$ -24937 132944 35854 -113408 -43345 74426 27664 -35993 -7001 -8822 -24065 42138 47424
162D7424j08999Q568J28908k3422j25639L9721J06321n7433q1096Q0668N6662
$$ 47424 -61575 -53007 75901 52479 -73160 -33439 72882 15449 -65647 15021 71683
173G1683j04700l9301J20000K2963j23428r166J09184n900q1369K2982M3395m7898
$$ 71683 -33017 -72318 47682 70645 -52783 -61949 47235 41335 -40034 -17052 26343 -21555
185b1555o629P9392k1634j12856L9334J45515m5167j65240M0840J65893k5995
$$ -21555 -28184 51208 29574 -83282 -43948 101567 56400 -108840 -68000 97893 71898
196G1898j39480R681R2562O481l5011j4379k3894R414P4988P462j09475l5359
$$ 71898 -67582 -57901 34661 41142 6131 -8248 -32142 -22728 52260 59722 -49753 -85112
208h5112J23750O0760j20485p9490R9470Q2745o7441o9278K9009L9556O687m39
$$ -85112 38638 99398 -21087 -100577 -1107 81638 14197 -55081 -26072 13484 20171 19732
220A9732l2655m0381M7994P7231n0280j00343M4858J07712l3566r6301K3481P1775
$$ 19732 -12923 -53304 -5310 71921 21641 -78702 -33844 73868 40302 -55999 -32518 39257
232C9257j4263l9852R753N971j0423K1661J5365m1304k3975M9795L0997n3127
$$ 39257 24994 -14858 -5105 866 -9557 12104 27469 -13835 -37810 11985 42982 -10145
244a0145l5064N0413L0974m5126k0536L9329L803l2913J4003K7656k9322k0767
$$ -10145 -45209 5204 36178 -8948 -29484 9845 13648 -19265 -5262 22394 -6928 -27695
256b7695M1133J4708m4651p309M3228R8l5103Q555K4046j6802j1886K4762L13
$$ -27695 13438 28146 -16505 -23814 19414 19512 -15591 -7036 17010 208 -11678 13084 13397
269A3397l1464O733L5723j1173l9044J1576L8516j2629l5459J2367K7736j3315
$$ 13397 -18067 -11334 24389 13216 -25828 -14252 24264 11635 -23824 -11457 16279 2964
281B964j6800J4207L288j4571J1564J5119k4567j3857L5358J3525m0349j0877
$$ 2964 -13836 371 3659 -10912 652 15771 -8796 -22653 12705 26230 -14119 -24996
293b4996M0213R998l5106p012K6455M290j6460r77N800l785K452R387j0592j6571
$$ -24996 15217 25215 -9891 -16903 9552 13842 -2618 -3595 2205 -1580 872 10259 -333 -16904
307a6904J4547K2796j7793k8454J8579K9373j7481k7304J6081K0414j2870r961
$$ -16904 -2357 20439 2646 -25808 -7229 22144 4663 -22641 -6560 13854 984 -8977
319h977R635l33m853J0946J818j8058J407K2893k200k3774J957K2148p75j8835
$$ -8977 658 325 -4528 6418 8236 -9822 -8415 14478 12278 -11496 -9539 12609 11834 -7001
333g001q26J4250N51j0529J91N358k680k139N463k562q668P085J0119j0959j0971
$$ -7001 -7827 6423 6974 -3555 -3364 1994 -686 -2825 2638 76 -8592 -1507 8612 -2347 -13318
348a3318J4066J0258j4789p294J4001M682j0320p6O412k472k162N467j391o625
$$ -13318 748 11006 -3783 -11077 2924 7606 -2714 -2790 3622 1150 -1012 4455 3064 -3561
362c561L156Q387m016r328K001R398m74j0008o71P423k76m634K046j81n286M072
$$ -3561 -405 7982 3966 -5362 -3361 6037 5563 -4445 -5116 2307 2031 -2603 -557 -738 -6024 -1952
378a952Q877p272j1095Q170J2179n942j0496K690Q227K352l222n868j644Q147
$$ -1952 6925 -347 -11442 -3272 8907 2965 -7531 -4841 3386 5738 2516 -3352 -4996 3151
392C151O668o347j0230J662J1457N006j0893j2017O474J5896m79j6653p043J1778
$$ 3151 9819 3472 -6758 -5096 6361 11367 474 -11543 -5069 10827 10348 -6305 -13348 -1570
406a570J2187l343j6997o900J8451J5730j5779k0701J0166K1187j885j5470o055
$$ -1570 10617 7274 -9723 -16623 1828 17558 1779 -18922 -8756 12431 10546 -4924 -10979
419a0979P016J1918N278j3037j5276R195K2428m65k4851j0375K2053J9951j5277
$$ -10979 -3963 7955 13233 196 -15080 -5885 16543 16078 -8773 -19148 2905 22856 7579
432G579k6676N498K6660L258k2437r532J2416J1319j158q306j0571J011J8175
$$ 7579 -19097 -13599 13061 16319 -6118 -15650 -3234 8085 6927 -1379 -11950 -10939 7236
445G236Q734j8324j8275J3429K5870l241k8492q554K7692J8350k0410k2151J0599
$$ 7236 15970 -2354 -20629 -7200 18670 15429 -13063 -21617 6075 24425 4015 -18136 -7537
458g537K0687j259j4391o006M835Q475N154m926j4146n457J7328J7348j6600k8405
$$ -7537 13150 11891 -2500 -8506 -3671 4804 9958 5032 -9114 -14571 2757 20105 3505 -24900
472b4900J0799L6661l313l9370n187L4818J1227k4562j0923J3294P018k424J352
$$ -24900 -14101 22560 19247 -20123 -25310 9508 20735 -3827 -14750 -1456 5562 3138 4490
485D490m555j1629O459K3117n60l1206r808L4457K1139l3671l1393K8114L5909
$$ 4490 -65 -11694 -5235 17882 17322 -13884 -23692 10765 31904 -1767 -33160 -5046 30863
498C0863j9093l3967Q864K3630k105j1082j196j747k21J2203P452j8562j7681
$$ 30863 11770 -22197 -13333 10297 8192 -2890 -4086 -5833 -6054 6149 13601 -4961 -22642
511b2642J7430K8817j0012l5022M88L8042J0589l5744k0184K9478K4841j9503
$$ -22642 -5212 23605 13593 -21429 -20941 17101 27690 -8054 -28238 1240 26081 6578
523F578k2135J1630J3530p431l584O629p658j1346J6916J9859k2325l0253K0914
$$ 6578 -15557 -3927 9603 2172 -1412 5217 -2441 -13787 3129 22988 663 -29590 -8676
536h676L7361j6659m0690J0161M0280k769l4163k555K3921K858j3147L715O101
$$ -8676 28685 12026 -28664 -18503 21777 19008 -15155 -17710 6211 9069 -4078 -363 5738
549E738j2628j247K4230J089l6245m821M4150J1880m4585j9029L8871K2379k9357
$$ 5738 -6890 -8137 16093 17182 -19063 -23884 20266 32146 -12439 -31468 7403 29782 425
562D25k4715J6857K1776l624j4975n972M981P705L848l638j0983m866J6005J7630
$$ 425 -24290 -7433 14343 10719 -4256 -10228 -5247 2458 6306 2668 -8315 -13181 2824 20454
576B0454j6119k9773J1057L8741l872m0134l624L8280J1459l1606j6767K1137
$$ 20454 4335 -25438 -14381 24360 20488 -19646 -23270 15010 26469 -5137 -21904 -767
588g67J8208j1067j4659M462P388k169N06K232j0391p089J8850J4087k3511k1148
$$ -767 17441 6374 -8285 -3823 3565 1396 1902 4134 -6257 -13346 5504 19591 -3920 -25068
602b5068K4475K3654k2243k4489J8756K2970j2800j8372Q806J2285o639n831P518
$$ -25068 -593 23061 818 -23671 -4915 18055 5255 -13117 -4311 7974 1335 -4496 3022
615C022P52q175K941J1081m934j3248L303J3951p13j2734k292J0539L972q576
$$ 3022 3774 -4401 -1460 9621 4687 -8561 -5258 8693 7980 -4754 -7046 3493 7465 -1111
629a111n954M892N476k942k879K458L16l996J866N131l559o408N295R475m409
$$ -1111 -7065 -2173 3303 361 -2518 -60 256 -3740 -1874 3257 -302 -6710 -1415 8060 3651
644C651j1114J992J1196J547j0073l827R964N731r091o388P556L777n966m74M598
$$ 3651 -7463 -5471 5725 7272 -2801 -6628 3336 9067 -24 -6412 1144 4921 -1045 -1519 3079
659C079l411l700O520J455r323q09J0225O73j0093j93Q213Q75o435j371M628J997
$$ 3079 -332 -4032 2488 3943 -5380 -6189 4036 4709 -5384 -5577 2636 3511 -2924 -4295 333 2330
675B330k139k225K506K501k045k835J952K813j628j155P45L7N45J7k241r97L256
$$ 2330 191 -2034 472 2973 928 -1907 45 2858 1230 75 820 857 1402 1419 -822 -1819 1437
692A437R73l592j379K184J679j395k756o35L405L002l174m014J923M964M73n522
$$ 1437 2410 -1182 -2561 -377 1302 -93 -2849 -3484 -79 2923 -251 -4265 -2342 2622 3095 -2427
708b427j332N157L832m127m640K481M725k30l952j722K700L258p35n070j860N308
$$ -2427 -3759 1398 5230 1103 -3537 -1056 3669 3439 -513 -2235 465 3723 2988 -2082 -3942 1366
724A366L617n074m930L348M740j838m037o88K390L431j346m745N94N138J056m589
$$ 1366 4983 -91 -5021 -1673 3067 1229 -2808 -3496 -1106 2325 979 -3766 -3172 1966 3022 -1567
740a567j242K661K483K2k727j674K810L166k488l344J603L032q41k072q18J094
$$ -1567 -2809 -148 2335 2357 -370 -2044 766 3932 1444 -1900 -297 2735 1894 -178 -996 98
756I8R18l75j802o37K002M90j366j130R29O72l19O0m49J30R90o5o11P79L47p36
$$ 98 1016 641 -1161 -1798 204 694 -672 -1802 -873 -201 -520 -460 -909 -779 211 146 -465 314 661 -75
776g5K26J013P4o80J67kJ51o0p34j12R14j02j476j76J310m10q57n24J68M74L99
$$ -75 151 1164 1238 558 725 723 874 814 80 -32 882 780 -696 -872 438 28 -829 -1353 -1185 -711 -312
797c12l68q36Q40R05l53o10J86Q59p3Ln65N21J343j15j550O07J227p60j392R46
$$ -312 -680 -1516 -676 229 -124 -734 -548 311 238 241 -324 197 1540 1425 -125 482 1709 949 -443 503
817E03M14m36n30j2p9O7J55p01q01R21R26j281j103O17J838J9j643n33J798J408
$$ 503 917 481 -49 -61 -140 -73 82 -619 -1420 -499 427 -854 -1957 -1340 498 517 -1126 -1659 139 1547
837A547j453j149J100J085L26m57j420m18K746Q69k765k357L452J811k989j766
$$ 1547 94 -1055 45 1130 1456 999 -421 -839 1907 2776 11 -2346 1106 2917 -72 -1838
853a838J334J428o57o75l98q96J032J534j008j915L20K299J57k288j4K551M05
$$ -1838 -504 924 267 -408 -806 -1702 -670 864 -144 -2059 -1739 560 717 -1571 -1585 966 1371
870A371j360n17J239k17K73R04j250j316J752J962k413j983K162R62j883j72J143
$$ 1371 11 -506 733 516 789 1693 443 -873 879 2841 428 -1555 607 1569 -314 -486 657
887F57j090j494K117J326k953j957L589K519m213k500M435K165l678j699L965
$$ 657 -433 -1927 190 1516 -1437 -3394 195 2714 -1499 -3999 436 2601 -1077 -2776 1189
902A189P13l688J795L331l340l025N017L059n748l126N698K339m980j824L221
$$ 1189 1902 -1786 9 3340 0 -3025 1992 5051 -697 -3823 1875 4214 -766 -2590 631
917F31J481k081j277R54l3m95N43K81o50r67J041J162m91j680jK213J347j426
$$ 631 2112 31 -1246 -292 -325 -820 -277 4 -646 -1613 -572 590 99 -1581 -1582 631 1978 552
935E52k553J150M037o36n218P38N698p92n722J905M999l820m225N248L273p091
$$ 552 -2001 -851 3186 2550 -2668 -1930 3768 2976 -2746 -841 4158 338 -3887 1361 4634 -2457
951b457k955Q992K144j0691k423J1425J893j1542q34J1043K5j0126J885Q616l547
$$ -2457 -5412 3580 5724 -4967 -7390 4035 5928 -5614 -6448 4595 4620 -5506 -3621 4995 1448
966A448o814N807O035p020m981P926M406q471l899P684M535o741m406M814L670
$$ 1448 -5366 441 6476 -544 -5525 2401 6807 -1664 -5563 2121 6656 -85 -4491 323 3993
981C993l767l828K695L174k433k129K242J248l238r32L559J559l131k551L312
$$ 3993 226 -3602 -907 2267 -166 -2295 -53 1195 -2043 -2975 584 2143 -988 -3539 -227
996b27M511l463o448L919Q503m135r232N611R028o649q550Q528O261j0440l491
$$ -227 4284 821 -5627 -1708 6795 2660 -6572 -961 8067 1418 -7132 1396 7657 -2783 -6274
1011f274J1994J446j3983j17J4580j917j4409K804J3801l321j2622L286J1217
$$ -6274 5720 7166 -6817 -6934 7646 5729 -8680 -5876 7925 4604 -8018 -4732 6485
1024F485m625q975N624P605o575n419P690L889q706l106R987K936r182k363Q093
$$ 6485 1860 -7115 -1491 6114 -461 -5880 1810 5699 -3007 -6113 3874 6810 -2372 -4735 3358
1039C358K219p375k194N396J795l017j171R05N66k69j128o98J128J559k165r8
$$ 3358 5577 -1798 -3992 1404 3199 182 -989 -84 482 213 -915 -1613 -485 1074 -1091 -1189
1055a189K934j522n249L849O391m858p149O728Q163q210p916R247O377r329l707
$$ -1189 1745 223 -5026 -1177 5214 356 -6793 -65 8098 -112 -8028 1219 7596 -1733 -5440
1070e440R372K014r699p6R374k090r743L891R428m612r500N143Q417o087p744
$$ -5440 3932 5946 -3753 -3829 5545 3455 -6288 -2397 7031 2419 -7081 -1938 6479 392 -7352
1085g352O250O613o455m092O811J894p687N59P515j947o299L858N233m331m172
$$ -7352 -1102 5511 -944 -5036 1775 3669 -4018 -3459 4056 2109 -4190 -332 4901 570 -3602
1100c602M319K334l683L63K383j613j294K661q09l722J541M117k316l615L151
$$ -3602 717 3051 -632 -269 2114 501 -793 1868 1059 -2663 -1122 2995 679 -2936 215
1115B15J922m243p61M289m76m671K814M760m275m581N439L810n515k917O562K102
$$ 215 2137 -2106 -2867 1422 946 -3725 -911 3849 -426 -5007 432 4242 -1273 -4190 2372 4474
1131D474o201j320O284p67n733K361N377l301n054M375M024n830l346O402J823
$$ 4474 -1727 -3047 3237 2470 -3263 -902 4475 1174 -3880 495 4519 -1311 -4657 1745 3568
1146C568o706K3O624k126o396L614N035m742l032O155J523o565N85N613j887m505
$$ 3568 -3138 -3115 3509 1383 -5013 -1399 3636 -1106 -4138 2017 3540 -3025 -2440 3173 1286 -3219
1162c219L508L676m313j940M305Q59m769J34M883j718l542K145K660k917k511
$$ -3219 289 3965 -348 -2288 2017 2876 -1893 -1759 3124 1406 -2136 9 2669 -248 -2759
1177b759L155J520l624k04L514o25m035J769L639k927k743L928K240m569l39M619
$$ -2759 396 1916 -1708 -1912 1602 977 -3058 -1289 2350 -577 -3320 608 2848 -1721 -2060 2559
1193B559j195m348K457M548l857k951M421J685m710r93N491j267m590K151M308
$$ 2559 1364 -2984 -527 4021 164 -2787 1634 3319 -1391 -2384 3107 1840 -2750 -599 3709
1208C709l574l933M185K626n104j248N167J97m935P59M515j752l581K884K433
$$ 3709 135 -3798 387 3013 -2091 -3339 1828 2025 -2910 -2151 2364 612 -2969 -85 2348
1223B348l291j151M232K24m287N41M135p09l856J698L016k628k071K617J190l170
$$ 2348 -943 -2094 2138 2362 -1925 -1384 2751 2042 -1814 -116 2900 272 -1799 818 2008 -1162
1239a162j10L425j228l814K061L590l521k304L575J428l709j52L354r71k848K493
$$ -1162 -1272 2153 925 -2889 -828 2762 -759 -3063 512 1940 -1769 -1921 1433 462 -2386 107
1255A07K376l092j683L992N36l784O6L970q57l378J296K873j906j939K304J242
$$ 107 2483 -609 -2292 1700 2236 -1548 -1482 2488 1631 -1747 -451 2422 516 -1423 881 2123
1271B123k995m88K930k34l834J084L165j642k853K275J841k536q85L324k48k967
$$ 2123 -872 -1360 1570 1336 -2498 -1414 1751 109 -2744 -469 1372 -1164 -2049 1275 1027 -1940
1287a940J015L071j518k345K035J871k001j795K735N15k141k54K538r56k117J433
$$ -1940 -925 2146 628 -1717 318 2189 188 -1607 1128 1643 -498 -752 1786 830 -1287 146
1303A46J449j973j472K078J340k825k52K075m36j630Q60J448j485o98J704J56
$$ 146 1595 -378 -1850 228 1568 -1257 -1509 566 130 -1500 -640 808 -677 -1375 329 485
1319D85j608P41J548q16j047O95J254r61n46P97N09j356k17J705l48j913Q63J536
$$ 485 -1123 -382 1166 350 -697 -2 1252 291 -255 542 1051 -305 -522 1183 835 -1078 -215 1321
1337A321j380j412J344Q35j729l25J693Q7j679L18J675r68q50Q43J119q93o08
$$ 1321 -59 -1471 -127 708 -1021 -1346 347 434 -1245 -927 748 -220 -1070 -227 892 -1 -609
1354f09Q69M35n16k14N59k43L4O4N21q88j89O49n0o96J90M04m14m32K91J06n91
$$ -609 260 695 179 -35 524 281 315 379 900 12 -177 472 422 -274 -84 320 -94 -526 -235 -129 -720
1375g20P3J004m17r74N49J044l77r28P65N03l26k79J80M23l96k10N69P01j123
$$ -720 -647 357 -60 -1034 -485 559 182 -746 19 522 196 -83 97 520 124 -86 483 1184 61
1394F1l75O68O26j140j15R81p4q52n62P33N45m64j314Q49J059p88q49P02P24m29
$$ 61 -314 354 980 -160 -275 706 632 -220 -782 -49 496 32 -1282 -433 626 -162 -1011 -309 415 -14
1414a4p58P66Q00j256n77J636M14j555J5J712j48j537J12J215J99j549j10J261
$$ -14 -772 -6 794 -462 -1039 597 1011 -544 -529 1183 1035 -502 -390 825 1024 -525 -635 626
1432F26J97j444l19J082N03j702J50J407K7j731J5K138n07j765L35K231p4k435
$$ 626 823 -621 -940 142 645 -1057 -907 500 527 -1204 -1189 949 442 -1323 -988 1243 1169 -1266
1450a266N55K431p46k023M68K375p35j970R45J548j308j806J301K444j830k548
$$ -1266 -711 1720 974 -1049 -581 1794 1059 -911 34 1582 274 -1532 -231 2213 383 -2165
1466b165J910K212k104k277K533J449k635j372K976J156k827q74K895J97k172
$$ -2165 -255 1957 -147 -2424 109 1558 -1077 -2449 527 1683 -1144 -2018 877 1074 -1098
1481a098J61K295j8k103j14K015K99k059l04K228N70k644m00K375j8k280k2K376
$$ -1098 -937 1358 1340 -763 -877 1138 1437 -622 -926 1302 1872 -772 -1172 1203 1185 -1095 -1117 1259
1499A259j5k528M15J520j58k111M16K203l37k243N13K101Q0k788L02L229m60l335
$$ 1259 1244 -1284 -869 651 493 -1618 -1202 1001 664 -1579 -1066 1035 1115 -1673 -1371 1858 1398 -1937
1517a937J269L339j622l117J916K956k423k149K610J288k945j337L057J108l067
$$ -1937 -668 2671 1049 -2068 -152 2804 381 -1768 842 2130 -815 -2152 905 2013 -1054
1532a054m74K675J94k804k94K397m1k248J84K349m0j941J24J727k46j335L69J841
$$ -1054 -1528 1147 1341 -1463 -1757 640 599 -1649 -1465 884 844 -1097 -973 754 508 -827 -458 1383
1550A383o65j220O06J046o00j036K85J296l87j186Q4N33K14r43n67J476Q25j376
$$ 1383 718 -502 104 1150 550 -486 -201 1095 708 -478 -394 139 353 -590 -1157 319 1144 -232
1568b32j178J941L87k303l28L055p05k400J388K462j914k123K389J688k144j253
$$ -232 -1410 531 918 -1385 -1713 1342 637 -1763 -375 2087 173 -1950 439 2127 -17 -1270
1584a270K465L45k316k66K297m64j997Q38J683n39j811N76J313r80j357J006J591
$$ -1270 1195 1540 -776 -1042 1255 791 -1206 -368 1315 776 -1035 -459 854 -126 -1483 -477 1114
1601A114j229j166J335L95j351j20J729m21q88Q62Q14j505q3R24O5r40P69P24
$$ 1114 -115 -1281 54 449 -902 -1022 707 286 -602 260 1074 -431 -514 410 475 -465 304 1028
1619A028j354Q2J057n99j410J347J304j467r73J443P6j423l08J983m51j897J580
$$ 1028 -326 -244 813 214 -1196 151 1455 -12 -985 458 534 -889 -1197 786 335 -1562 18
1636A8J064j454j337J560J047j455k92J690K69j848L55J537m67j494O83J631r58
$$ 18 1082 -372 -1709 -149 898 -557 -849 841 1110 -738 -383 1154 687 -807 -124 1507 549
1653E49j527J239Q36j409j001J928J24j492j54K037q62j766J155J418j611p21
$$ 549 -978 261 1097 -312 -1313 615 739 -753 -907 1130 268 -1498 -343 1075 -536 -1257
1669a257J820J14j732L75J669j337o73J405M87j137j36J234p19l87N46Q50j005
$$ -1257 563 677 -1055 -680 989 -348 -1021 384 871 -266 -402 832 113 -274 272 1122 117
1686A17q60J113M26j329J07J171n44r83M92R32p99q25N79J130j358k75J440K27
$$ 117 -743 370 796 -533 -426 745 201 -782 -290 642 -157 -982 -403 727 -631 -906 534 761
1704G61j620L86J331m70j424J141R24r34r68J489N51j618k19J781j82j760J027
$$ 761 -859 -473 858 388 -1036 105 1029 95 -873 616 1167 -451 -670 1111 929 -831 196
1721A96J180j282j046J046N02j191k8R42j48j129Q72M68p46o61J301J88r32o1
$$ 196 1376 94 -952 94 596 -595 -623 319 171 -958 -86 382 -364 -1025 276 464 -468 -529
1739e29J181l43r43N11J106m12j060R41L21j000k84J237M1j467L75J078o88q10
$$ -529 652 309 -634 -123 983 571 -489 452 773 -227 -511 726 767 -700 -325 753 65 -745
1757g45M74P16p22o85J334N2j370J99J272o13r23J179L52p85n18J208K66j105
$$ -745 -271 445 -277 -962 372 424 -946 -747 525 -88 -1011 168 520 -265 -783 425 691 -414
1775d14%J502r46p85J068Q13j524n40J528J85j597K47J419p07j311R54N71q70
$$ -414 -414 1088 142 -643 425 1238 -286 -826 702 887 -710 -463 956 249 -1062 -108 463 -407
1793d07o47J171M53j257l35J694k88j257L45J479r37p26R37N43q32k75R12Mj214
$$ -407 -1054 117 570 -687 -1022 672 384 -873 -528 951 14 -712 225 768 -64 -339 573 577 -637
1812f37M18J049l58r34P28K14o87l64R28k12p96N11N11o88j38O65J25j332L21
$$ -637 -219 830 472 -462 266 480 -207 -571 357 145 -651 -140 371 -317 -455 210 335 -997 -676
1831f76J042K02j456O39J139p19r68R26J038j499l36J318J04j090J93J280p06
$$ -676 366 568 -888 -249 890 171 -797 129 1167 -332 -668 650 754 -336 -143 1137 431
1848D31j101L34J364q70r78Q75M98j388J83J025l74r29O55O23o78l09Q39L1p26
$$ 431 -670 -336 1028 158 -820 55 553 -835 -652 373 -1 -930 -275 348 -330 -639 200 231 -495
1867d95P6Q93k88n82L01P28o07k89Q24r4o60Q6J076m16j238M97Q95r35n18R61
$$ -495 -419 474 186 -396 -95 633 26 -263 561 467 -193 -107 969 553 -685 -188 707 -228 -746 215
1887B15M90r65o32J201k31j090K36J215m04r47O43N89k70q10O13P94o56l60Q40
$$ 215 705 -260 -892 309 78 -1012 -776 439 35 -912 -269 320 50 -760 -147 647 -9 -369 471
1906D71L5n82j56M98J98l28j34M08l67l28N13l88m4K20L4o86N30K73p16J6O77
$$ 471 506 -76 -232 266 464 136 2 410 43 -285 228 -160 -204 16 50 -636 -106 167 -549 -533 144
1927A44J94j004K27R26l30o47L87P63q1q15K10Q64n68n24M54Q12o10j027J112
$$ 144 338 -666 -439 487 157 -490 -103 660 579 -236 -26 838 270 -254 200 1012 402 -625 487
1946D87N09r71p94R45M26p11n82Q60L32j100k55R21L63j178J02J141r2j036K37
$$ 487 996 25 -769 176 602 -109 -691 169 501 -599 -854 67 430 -748 -646 495 403 -633 -396
1965c96P86o6p46k19J145N9o23l22J096k03r63n7J444k64j358O09Q29n42j132
$$ -396 390 324 -422 -641 504 563 -60 -382 714 511 -452 -509 935 671 -687 -78 751 209 -923
1984i23Q19P42n20r75N45P44r49k97M63R89r66j31N92J9q1n01L60O38l08p59Q36
$$ -923 -104 638 118 -857 -312 432 -517 -814 -351 638 -328 -459 133 152 71 -430 -70 568 260 -499 337
2005C37M09o57m88N62M11n71n76R28M40j358k05Q55K84p37m83R58J12p23k59P66
$$ 337 746 89 -399 163 574 3 -573 355 795 -563 -768 87 371 -366 -849 109 221 -502 -761 5
2025EN48j389L08J265N7j324J27J240n82j046N12J457r59r50Q34Q57r37p48R69
$$ 5 553 -836 -528 737 794 -530 -403 837 255 -791 -279 1178 219 -731 103 960 23 -725 244
2044B44N34j008k17J129m65n41m6N28n19k04K76L26k9l88J72L0N10m62K8K99J63
$$ 244 778 -230 -447 682 217 -324 -370 158 -361 -565 -289 37 8 -380 -208 -178 332 -130 -102 197 360
2065C60m04j9J80J33q7j54K66R0j52m29N4O59m01o86P20N22j089n10J050L75j347
$$ 360 -44 -63 117 250 163 9 275 365 213 -216 -162 497 96 -590 130 652 -437 -947 103 478 -869
2086h69l9J615j93j399L41J602j124j064J165R98j135o43J280K46j321J85O54
$$ -869 -908 707 514 -885 -544 1058 -66 -1130 35 1033 -102 -745 535 781 -540 -355 299
2103B99O0p97K03Q42k20l77q6L49l83k84K96L42k80k55L24K1m90L88R6kl43L77
$$ 299 359 -438 -235 607 387 10 -76 273 -110 -394 -98 244 -36 -291 33 54 -436 -48 48 46 -297 80
2125H0j24k41J53L28k87j22R62n7j013N9P76l64o53N74R68j193n93J161M0j267
$$ 80 -44 -285 -132 196 -91 -213 749 692 -321 -262 514 150 -503 71 1039 -154 -747 414 454 -813
2145h13K91J281n04j171O65R53q55p00P58M98o57j51P04j05j17n20Q63J21r29
$$ -813 -522 759 255 -916 -251 702 -153 -853 -95 403 -254 -405 299 194 77 -443 420 541 -388
2164c88K24N47M1m47K35K30o22j97O49K95o85P2L94o24m08N63Q2o60N32O12o23
$$ -388 -164 383 424 -23 212 442 -180 -377 272 567 -118 -46 348 -276 -684 -121 -39 -699 -167 445 -178
2185a78o11Q55K65o05k51J172k94q59J72P47l81l35N70P47j135l01R09K03p44
$$ -178 -789 66 331 -274 -525 647 353 -506 -334 413 32 -303 267 1014 -121 -422 487 690 -54
2204e4k40P75J1r11J81P91o54o64N51Q27q74m22J060j08p42J09P57k90n83M52
$$ -54 -294 481 492 -419 -238 553 -101 -765 -214 613 -261 -683 377 269 -473 -364 393 103 -480 -28
2224b8K76R4m78L40L53p78L4P95l85o07N40M75q85j71P60r8q09L87O22n02l66
$$ -28 248 342 -136 204 557 -221 -187 608 223 -384 156 631 -254 -425 335 237 -572 -185 437 -65 -431
2245d31M73K70p12n5P47j86p45N02M98l41p59P00K22q1k03L23N2m66J05M58M5
$$ -431 42 312 -400 -455 292 106 -639 -137 361 20 -739 -39 183 102 -101 222 274 -192 -87 371 416
2266D16q96P30L24l84p46N27L84l95l19Q56k87q34L71M70k53l97N33O0k70m12
$$ 416 -480 250 574 190 -556 -29 355 -40 -359 497 210 -624 -253 217 -36 -433 100 160 -110 -522
2286e22O39r1n74P05K30k27n90O66L97q03N6L53j18k10J56L16l60l40M90P4j99
$$ -522 117 26 -548 157 387 160 -430 236 633 -170 -114 239 121 -89 67 383 23 -317 173 247 48
2307D8n17Q54l55k43J62M4j45k50J19N98l11j26L16r5k99J65M67m35K1K35j4l42
$$ 48 -469 385 30 -213 -51 -7 -152 -402 -283 315 4 -122 194 99 -200 -35 432 -3 18 253 239 -103
2329a03K0M90M5o34L2N98m54n04M80Q8j85j63M05K3n07J36J87K35m58k46M51R8
$$ -103 -83 407 452 -182 -150 448 -6 -510 -30 58 -127 -290 115 138 -369 -233 -46 189 -269 -515 -64 34
2351C4k1o8M64m65L3P6K16l78Q8K70q9k23K59j18j40K52r6N1k90K07L09p21K67
$$ 34 13 -55 409 -56 -23 53 269 -109 -21 249 160 -63 196 78 -62 190 94 145 -145 62 371 -350 -83
2374h3L26m52oJ43j2k02Q6J79K73l20l63N77L29p17J16M49N4n82J68N00l03m69
$$ -83 243 -209 -215 -72 -84 -286 -200 -21 252 -68 -431 146 475 -242 -126 323 377 -205 -37 463 160 -309
2396c09L97M09l58j79J72L1l63r6K92O5l93K53N4O1l28P5K67M6m1m65K14K73j9
$$ -309 88 497 139 -40 132 163 -200 -296 -4 61 -332 -79 -25 36 -292 -217 50 96 55 -410 -196 77 58
2419E8k74K6L07JJ74m89N21q7l96L84K4k76j42J39N14n56n06M55L92l83l49M53
$$ 58 -216 -190 117 118 292 -197 324 237 -159 225 249 -27 -169 -30 484 -72 -578 -123 269 -114 -463 -10
2441a0O01q31k03N64j80l76K65N55j91m16K59M25o5m33l6K45M2m40M5M48q7l35
$$ -10 591 -240 -443 121 -59 -435 -170 385 194 -222 37 462 397 -36 -72 173 215 -225 -180 268 181 -154
2463a54PL37j7j96l1K92l62l37M68O3k89k50N09J24p1l81K30L37k95k0o1M77q4
$$ -154 -147 190 173 -23 -54 238 -124 -461 7 70 -219 -469 40 164 93 -288 -58 279 -16 -36 -97 380 296
2486B96l17J1K66o0m22N99j8m38j18N8O92r68L06L12q3r8j54J17l2l3j18J71K36
$$ 296 -21 -10 256 196 -226 373 355 -83 -201 -143 549 -419 -113 199 116 18 -136 -19 -51 -84 -202 -31 205
2509B05j83q1J16P2l33j85N76J53m15M2R9L92q06J22M00J0k97J92K91l37j23k3
$$ 205 22 -59 57 129 -204 -389 187 340 -75 -33 66 458 -348 -226 174 184 -113 79 370 33 -90 -113
2531a13J77J51l87KN14l41n50M59K75j92n10M70L89n89q7M15m5k36n4N95P8n41
$$ -113 64 215 -172 -170 344 3 -547 -88 187 -5 -515 -45 344 -245 -332 83 38 -198 -252 343 421 -120
2553a20O5M60m18j2J21J07q6r2L49n75J43J95k87j67L01m4j63J29M37m81n9J85
$$ -120 -55 405 -13 -25 96 203 117 25 374 -201 -58 137 -150 -317 -16 -60 -223 -94 343 -138 -197 -12
2575a2Q7OM1J30P4k04k55j56N65p2j26K16K18o28J22P7K69q29L95M29k11m92K69
$$ -12 75 81 122 252 326 122 -133 -289 276 204 78 294 512 -116 6 83 352 -477 -82 347 136 -356 -87
2598h7L59n36r5O70k41k78k6M03k03j36J64M07m01k27K43J06K28k64L7k24J64
$$ -87 272 -264 -359 311 70 -208 -234 169 -34 -170 -6 401 0 -227 16 122 350 86 123 -101 63
2619F3K04M8n85M97l6k90R6L3J54l13M5k9j12o2K37O8P7l84O4L13l56j7N2O20
$$ 63 267 315 -270 227 191 -99 -3 30 184 -129 -84 -113 -225 -287 -50 18 95 -289 -225 88 -268 -285 -233 387
2643C87l27m17M04K74o52j20Q36j0n79L78M03o33k72K17K71k44J14N2Q1k47K16
$$ 387 60 -357 47 321 -331 -451 385 375 -204 174 577 -56 -328 -111 160 -84 30 82 163 -84 132
2664A32J24j87k43J93p3J58l96M43o0j27j2%k46K76K32k85k07K55L00m59Q8L72
$$ 132 256 69 -174 19 -54 104 -292 151 91 -36 -48 -48 -294 -18 214 -71 -278 -23 277 -182 -94 278
2686B78nl98l3J61Q6m29N4L31o7k55M99J6k79m83N16K38k46l19N29J78o79J9O47
$$ 278 273 -125 -158 3 89 -340 -286 45 -22 -277 222 238 -41 -524 -8 230 -16 -335 194 372 -307 -288 359
2709C59l82l50N15L06l99J37o0M8l24J53L83k66k72K58j20m0j71L17J77k07m51
$$ 359 -23 -373 142 448 49 186 126 174 -150 3 386 120 -152 106 -14 -54 -225 92 269 62 -389
2730c89K63J64j62J95J66k03q3J5K21l07j02L13j03k47M48L59m37o3J04J31n40
$$ -389 -126 38 -124 71 237 34 -49 -34 187 -120 -222 91 -12 -259 189 548 111 48 152 283 -257
2751b57j44O89P8o99L10L73k42k87L04j5k59k8N88j07m36jK19j27R9k1J01k69
$$ -257 -401 288 366 -333 -23 350 108 -179 125 110 -149 -177 411 304 -132 -133 86 -41 58 37 138 -131
2773a31%M90k62j26M6J07l4l46M92j68l72J58L34J58p97K10N22k52m92L44J92
$$ -131 -131 359 97 -29 17 124 90 -256 236 68 -304 -146 188 346 -451 -241 281 29 -463 -119 73
2794G3Lj43K2K42j46l49K16J05k66K18K86j54j74K44L08o35K9L83k26k3P0J86
$$ 73 76 -67 -45 197 51 -298 -82 23 -243 -25 261 107 -67 177 485 -150 -121 262 36 13 83 269
2816B69k59o3K21j80j99J54J7r0M7J9L79l12l27K69L12m56K3L28j84j31J64J35
$$ 269 10 -53 168 -12 -211 -57 -40 -130 -83 -64 315 3 -324 -55 257 -199 -176 152 -32 -163 1 136
2838A36j91j81N87j1m21k0L10J35n28O7M30m34q3L65N8k99k86K90L46o63l5M48
$$ 136 -55 -236 351 340 -81 -101 209 344 -184 -117 313 -121 -204 161 219 -80 -366 -76 270 -393 -428 20
2860B0N8j95J26l2k30L74l56L50Mj99K68j00k6j67K97j06r9L46m51k1o5N39j41
$$ 20 78 -117 9 -23 -253 121 -235 115 119 -80 188 88 62 -105 192 86 -13 333 -118 -139 -204 335 194
2883A94l43L17N2m41m7M82K10n25l7L86l34j31J95J41q4k35K88o0p4N7J25p9k02
$$ 194 -149 168 220 -221 -268 214 424 -101 -138 248 -86 -217 -22 119 35 -200 88 28 -46 11 136 57 -145
2906a45J29N9K97l11j15M87k46k01J13J63k97K02K6j28L8j06j26NJ43j26r0J90
$$ -145 -16 43 340 29 -86 401 155 -46 67 230 -67 135 161 33 71 -35 -161 -156 -13 -139 -229 -39
2928c9K01m8p2j46L98j12k37J04O4j5j48J20R4q0l9J14lk2l42L74n9m85M2P79
$$ -39 162 114 42 -104 294 182 -55 49 113 98 -50 70 164 84 45 159 156 134 -208 166 107 -378 -336 443
2952D43r5o41M88p8N2o47J96K87q0k09N60j00q5k88K10J23Q0k51K25m82K02J8
$$ 443 348 -293 195 117 169 -478 -282 5 -75 -284 276 176 91 -197 13 136 216 -35 190 -292 -90 -72
2974g2J04R4k15K35m1o7l5k3j65M36n64L25j53N2K8k45M01j99L85l53j04K32Q9
$$ -72 32 126 -89 146 105 38 3 -20 -185 251 -313 12 -141 -89 -61 -306 95 -104 281 -72 -176 56 145
2997A45k63M9J78o0j60K59J44l53Q6J51q8l28M84q8r7n7j11L45k96p1R9Q4j32
$$ 145 -118 -69 109 49 -111 148 292 -61 25 176 88 -240 244 156 59 2 -109 236 -60 -131 -32 52 -80
3020h0j88L13j71L17n02J50K73j00L3qJ73r5k18J35p2J22L9J72k39m6k7j41N19
$$ -80 -268 45 -126 191 -311 -161 112 12 45 37 210 115 -103 32 -40 82 121 293 54 8 -19 -160 359
3043C59l45k17J29J09Q5j73R6P1k24J28n6K84l11p1K76L30p10K30L2J06l17L16
$$ 359 14 -203 -74 35 120 -53 43 114 -110 18 -38 246 -65 -136 140 470 -240 -10 22 128 -189 127
3065A27Q0J05k33R9l31K01K2l59M05j26K28p03L76K19j55m1J40J00j59k43J42
$$ 127 207 312 79 178 -153 48 70 -289 116 -10 218 -485 -109 110 -45 -86 54 154 -5 -248 -106
3086a06o0J7o3L34k28Rk02M69p5j71m3L61rm22O3L4K71l75K71qN0k86K75J85k02
$$ -106 -166 -149 -212 122 -106 -97 -299 170 95 -76 -119 242 233 -189 -126 -92 179 -196 75 67 117 -169 106 291 89
3111H9k26J40J10k72n6J57J67j46q5L0J22j35N1l5L47R1o66J88J44Po1j50J94
$$ 89 -137 3 113 -159 -215 -58 109 -37 -122 -92 30 -105 -54 -89 258 349 -317 -129 15 22 -39 -189 5
3134EL60n89M19L5l41K04j28K21l47kJ14nk23K90J90j93jk63N18r9l65J04M17
$$ 5 365 -224 195 230 -111 93 -35 186 -161 -163 -49 -54 -277 13 203 10 9 -254 264 165 -200 -96 321
3157C21m90J32J12J0j36l44J91J10l54J96N42j91k11j08K05j40L7M82l91J9p0
$$ 321 -169 -37 75 85 -51 -395 -204 -94 -448 -252 290 99 -112 -220 -15 -155 -118 364 -27 -8 -78
3178g8K18k89o5L44l03L2R2m1o9p6L78r0l94O35j51j62k56J26M8J31p1J77n7K2
$$ -78 140 -149 -214 130 -173 -141 -49 -90 -159 -235 143 53 -341 294 143 -19 -275 -149 -101 30 -41 136 79 101
3202A01k98J44J63m8j60K4J99p0j42j7J31l6J1O3lr7l1J53j85J27J14pkj32K60
$$ 101 -197 -53 110 62 -98 -74 125 55 -87 -104 27 -9 2 65 62 -35 -66 87 -98 29 143 136 134 2 262
3227B62k95q5K37j94RJ69k93L3M52j99K9l8k64K41q3j26K5K43k33j28P0K06j04
$$ 262 -33 -118 119 -75 -66 103 -190 -157 295 96 125 87 -177 64 -19 -145 -120 123 -110 -238 -168 38 -66
3250f6p0N0L87m03J17J47l18L38j35J44k82J97l2Q6j91L1L11l57LK03N2j06N0
$$ -66 -136 -86 301 -102 15 162 -156 182 47 191 -91 106 74 160 -31 0 311 -46 -43 160 212 106 156
3273A56k07k53K16J22r2k7K0q8J62p4j1q5K69o5l34L78P0k34L7k00K14q2J33O7
$$ 156 -51 -304 -88 34 -58 -85 -65 -153 9 -65 -76 -161 108 43 -291 87 157 -77 -40 -240 -26 -108 25 92
3297I2m5J60L8J9k68n7L00J73l40r3J77k89K67j19l3J19q1P9m07K13J92j04j49
$$ 92 47 207 245 264 -4 -61 239 412 72 -21 156 -133 134 15 -18 101 20 99 -308 -95 97 -7 -156
3320a56J15l0N5J18N7P0J45m25J75m8kj81J0K07j21J36l1k3J43j96p0Q6M3J97
$$ -156 -41 -71 -16 102 159 229 374 -51 124 76 74 -107 -97 110 -11 125 94 71 214 18 -52 34 77 274
3344B74m13J0J60M5j0j39J5J14O3j15K09J3o8k29N2k3l5K59r6Q3p0N7j94J75k46
$$ 274 -139 -129 31 76 66 -73 -58 56 119 4 213 226 158 -71 -19 -42 -77 182 86 169 99 156 -38 137 -109
3369a09J40P9o1k22L39j87j34K27j21o1q7K71j35k88K54K79m03J77P0N8j94K97
$$ -109 31 110 49 -173 166 -21 -155 72 -49 -110 -197 74 -61 -349 -95 184 -219 -42 28 86 -108 189
3391A89j15m5k23J56L83j72j77R8K4j16k02J63k12J80l59K41J74j16k9K56j2j21
$$ 189 74 29 -194 -38 345 173 -4 94 118 2 -200 -37 -249 -69 -428 -187 -13 -129 -158 98 86 -35
3413c5j14J43J9j15K13k27K99l1j41P7j77K63k0m54L69K73j90k13J59j65Q4Q4
$$ -35 -149 -6 13 -102 111 -116 183 152 11 88 -89 174 154 -300 69 342 152 -61 98 -67 17 101
3435A01m5o9j2M9Q8j08j77M1J05K66L6k91L57m58J91nJ7m4j71K66j89nj08J28
$$ 101 56 -13 -25 24 112 4 -173 -132 -27 239 275 -16 341 -117 74 69 86 42 -129 137 -52 -57 -165 -37
3459c7J38k23J38QR4ko7j13J96j43J22j62J15J55l52M44m06m5j40K90q2k78M63
$$ -37 101 -122 16 24 118 116 49 -64 132 -11 111 -51 64 219 -133 311 -95 -140 -280 10 -72 -350 113
3482A13QL01l2n16J43J75q5j19m4Q7k36J94%L25k1j96p8K0J2m2Lq5R3m9M4j01
$$ 113 121 422 390 -126 17 192 107 -12 -56 31 -205 -11 -11 314 293 97 19 39 51 9 12 -73 20 -29 15 -86
3508h6m8J71j56J09ml9j34j1J73Q2j75K31J62j10J49l79Q5J10j34m7r3J51r4K08
$$ -86 -134 37 -119 -10 -14 -53 -187 -198 -25 57 -118 113 275 165 314 -65 20 130 -4 -51 -144 7 -87 121
3532A21k84K24k13K89k25K33j06l70K68K66p2j84O2n2L9r4L7j23J34K48k70L2
$$ 121 -163 61 -152 137 -88 145 39 -331 -63 203 131 -53 9 -43 -4 -98 -61 -184 -50 198 -72 -40
3554d0k7K79l32k7K83or7q3K5k89M37q6L6k41J99l2P9o3j61J65O7N0l05L48m7
$$ -40 -67 212 -120 -147 136 130 33 -50 -25 -314 123 37 73 -168 31 -1 78 15 -146 19 86 136 -169 179 132
3579A32j28J02k08J48M0j23O8K0k35L04M3k43J64K15n86L22k5p2j05J30J27n9
$$ 132 4 106 -102 46 86 -37 31 51 -184 120 163 -80 84 299 -287 35 10 -62 -167 -37 90 31
3601C1M6j61L6k88M00o2j53K88j33j6M4J74j6k10N0J8qK9j63J54k1p8J00Q2k76
$$ 31 77 -84 -48 -336 64 2 -151 137 4 -12 32 206 190 -20 30 48 40 69 -94 60 39 -39 61 143 -133
3626a33J29r1K92k04nJ32J28m40l2J29J05o8J15J25j10j74j14K85oJj06O7Q3j09
$$ -133 -4 -95 197 -7 -12 120 248 -192 -224 -95 10 -58 57 182 72 -102 -216 69 63 64 -42 25 108 -1
3650aJ22Q8l34P7P0K39j26j69j65L31q0j47J3K74k88J4K26J40n05O1M1K32p8P9
$$ -1 121 209 -125 -48 22 261 135 -34 -199 132 52 -95 -82 192 -96 -82 144 284 -221 -160 -119 113 35 114
3674A14N7NJ17k99k70J50K43j31L21k54n9j31J42m0R8j78J88J3L5p0m4Pm4N1R4
$$ 114 171 176 293 -6 -276 -126 117 -14 307 53 -6 -137 5 -35 63 -115 73 86 121 51 7 14 -30 21 115
3699A15j30O0j33j11J96k4K8J04L0j79N9L6r7M0j75m8J99P8j94L22J3j29k70J37
$$ 115 -15 45 -88 -199 -3 -27 1 105 135 -44 15 51 -46 -6 -181 -229 -30 48 -146 176 189 60 -210 -73
3723g3Q0j88L70J19m35M74m65L58l22K07l27K75J15j34J77l28K51j98K70k1k18
$$ -73 7 -181 189 308 -127 347 -118 240 -82 125 -202 73 188 54 231 -97 154 -44 226 205 -13
3744a3P9O5j32j46K38j73N4K7j17K99l64K74j81j23K10n7R3l44J50J24nK48m55
$$ -13 66 131 -1 -147 91 -82 -28 -1 -118 181 -183 91 -90 -213 -3 -60 33 -311 -161 -37 -42 206 -249
3767b49L13j50L1j58O4n5J55n0j55J21j70K93J42k81J78l2j21M51k94l8L32j64
$$ -249 64 -86 -55 -213 -149 -204 -49 -99 -254 -133 -303 -10 132 -149 29 -3 -124 327 33 -5 327 163
3789A63k40O8P9K12k80o7R3j64n9L12j20M5q3j55j4J47J76k44P8N1J58j57o9N7
$$ 163 -77 -9 70 282 2 -65 28 -136 -195 117 -3 42 -41 -196 -210 -63 113 -131 -53 -2 156 -1 -70 -13
3813a3P5j09Q9K47n9j22o2M4J32j29j4j07L2K7j04L11k64J39o6KJ14k83N6m7L41
$$ -13 62 -47 42 289 230 108 46 90 222 93 79 -28 4 31 -73 238 -26 113 47 49 163 -120 -64 -111 230
3838B30l64J99j9o8L44k23L4k27J17N2k79J55J74n3p9N3J6k5j1j41J1M4j65M29
$$ 230 -134 65 46 -22 322 99 133 -94 23 75 -204 -49 125 72 -7 46 62 37 26 -115 -104 -60 -225 204
3862B04l1k95K36J64l59J71k9k25J54R2jj21j08R4J40k2j06m7j21J80j95J48J29
$$ 204 173 -122 114 278 -81 90 61 -164 -10 82 81 -40 -148 -54 86 64 -42 -89 -210 -30 -225 -77 52
3885E2J55k61j8K3j1M2l2J3r4M05l32J24j4l6m07N11J0q3p5J36j55l5J28Lo8K09
$$ 52 207 -54 -72 -49 -60 -18 -50 -37 -131 274 -58 66 52 16 -391 120 130 47 -28 108 -47 -82 46 49 -19 190
3911A90j75m1l4j36L35m41K91KJ43m7J8j70K0L4k12M11k79P8r5m0K22p0j51J23
$$ 190 15 -26 -60 -196 139 -302 -11 -9 134 87 105 -65 -45 -11 -223 188 -91 -13 -108 -148 74 4 -147 -24
3935b4L46l30J73m4n9j24j4J18LK27j31k35j81L71j43K37Pk05j91K19r9r9J53
$$ -24 322 -8 165 121 62 -62 -76 42 45 272 141 -94 -275 96 -47 190 197 -8 -199 20 -79 -178 -25
3958b5J27k53L12j29j91J59P4k12K99m13M70J66k53j8J6k02j85J83K9M5p9K09
$$ -25 102 -151 161 32 -159 0 74 -138 161 -252 218 384 131 113 129 -73 -258 -75 -46 -1 -80 129
3980A29j05K0j5m5j57J15n7K50r7k9k00L80j1k02J25j36K78k19o4LK06r1r1k2
$$ 129 24 44 29 -16 -173 -58 -115 135 38 9 -191 189 178 -24 101 -35 243 24 -40 -37 169 78 -13 -35
4004c5m30N91j95K75k00n8j06JK35q1m5j01J16l3L08k47j94N0L88j13j8j03L11
$$ -35 -465 126 -69 206 6 -52 -158 -157 78 -3 -48 -149 -33 -66 242 -5 -199 -149 239 126 108 5 316
4027C16k36K7j77L9P0m5j35K35k85m4M14k78R1M06k87O9j82K66J06k60L3m9j67
$$ 316 80 107 -70 -31 39 -6 -141 94 -191 -235 179 -99 -8 398 111 180 -2 264 370 110 143 94 -73
4050g3QL4j54K15J9k9J00p8mK7j09J54l02J82j79K38o4K93j05j27M8l0m6n3j18
$$ -73 -65 -31 -185 30 49 20 120 42 38 65 -44 110 -192 -10 -189 49 -15 278 173 46 94 64 18 -35 -153
4075a53K77M7k58L04j46k07K63j23J24j5P0k38j16K36J60j31K3J07R9m55J48O6
$$ -153 124 171 -87 217 71 -136 127 4 128 113 183 -55 -171 65 225 94 117 224 323 -132 16 82
4097H2j70O9j2mJ18k02J55J12k50K37p7J8J77m93K57P9L6m31K27p1M36m46J12
$$ 82 -88 -19 -31 -35 83 -119 36 148 -102 135 58 76 253 -240 17 96 132 -299 -72 -143 293 -153 -41
4120d1j83K33p0J45N5j89J62q8k63N6J34M88k49k13J39k12K91l9j03j14K49QK1
$$ -41 -224 9 -61 84 139 -50 112 24 -239 -183 -49 439 190 -23 116 -96 195 156 53 -61 188 196 217
4143B17k91n2j05K63k39j0K06R9j17J97j81O1J42k10r5L97k90K4p8%J24J08k01
$$ 217 -74 -126 -231 32 -207 -217 -11 88 -29 168 -13 48 190 -20 -115 282 -8 16 -62 -62 62 170 -31
4166c1J22r5K29j84J3j34J5K36m86O20j25k98rJ44J22mk0kk84J47M4k25M34j53
$$ -31 91 -4 225 41 54 -80 -65 171 -315 305 180 -118 -127 17 139 135 115 113 -171 -24 20 -205 229 76
4190G6j82L21k87K09j05j84n2J24%K6J7q9J11Q4l3Q0l2p0J0L9j65J35J3K5j2l7
$$ 76 -106 215 -72 137 32 -152 -204 -80 -80 -54 -37 -126 -15 69 36 116 84 14 24 63 -102 33 46 71 59 22
4216B2k91O9J52j3K14k13K86k84r3J38J27P6l03J13q6N9k3lk5J03N6j55J73J52
$$ 22 -269 -200 -48 -61 153 -60 226 -58 -151 -13 114 190 -113 0 -86 -27 -50 -53 -78 25 81 -74 99 251
4240B51l84j5K06j37K7J05j73J66PJ53j76L59j93k79P6qK6q2K09m08N6K32N6J83
$$ 251 -133 -148 58 -79 -52 53 -120 46 53 206 30 389 196 -83 -7 -15 11 -71 138 -270 -214 18 74 257
4264B57k66M4M9k18J05j1n1J66j02m9l9J65nR7l4J26J11k31j60J8K72j56J17J5
$$ 257 -9 35 84 -134 -29 -40 -91 75 -27 -76 -115 50 45 142 108 234 345 114 -46 -28 244 88 205 220
4288B20j80q3J88k76j21L21Oj08J24m4l1K9J45j97K37j28K3J8k23J07pj00J88
$$ 220 40 -43 145 -131 -252 69 75 -33 91 47 16 45 190 -7 230 102 125 143 -80 27 20 -80 108
4311A08k7M6M7l29P3l4J46N6M5k08m7L26k7j64K0K1n8j85Q0k54M79M1m67L43l3
$$ 108 81 127 174 -155 -82 -116 30 86 131 -77 -124 202 175 11 31 52 -6 -191 -111 -365 114 155 -312 31 -2
4336bj14R0m3m8L75m07K74k34j0L56m49J51R0j4q3J99l01N9O8j21K22j31j31J80
$$ -2 -116 -26 -69 -117 258 -149 125 -109 -119 237 -212 -61 29 15 -68 131 -170 -111 -43 -164 58 -73 -204 -24
4360b4M2K30r6n7j78j9o7L74j88k30J35K77j88l21L72J27j11pO4k71jL14l03J76
$$ -24 18 248 152 95 -83 -102 -169 205 17 -213 -78 199 11 -310 62 189 78 71 135 -136 -137 177 -126 50
4384E0J22k07k7J4M5j62Q2J14N1M4J8j62J85J48l99J01k5J54J2q7o3J30r7m4o5
$$ 50 172 -35 -62 -48 -3 -165 -83 31 82 126 144 -18 167 315 -84 17 -8 146 158 71 8 138 41 -3 -68
4409f8K33m6j48j16Q3m1J63j44K80l52j29K73k3J16j56K10p7P5K21l04M0r1J55
$$ -68 165 119 -29 -145 -62 -103 60 -84 196 -156 -285 -12 -35 81 -75 135 58 133 354 50 90 -1 154
4432A54k10n7K04k07J32k32J27J27j3k1j39J82L5k3K32j62p7o4k37L1J81j70L36
$$ 154 -56 -113 91 -116 16 -216 -89 38 25 4 -135 47 82 59 291 129 52 -12 -249 -218 -37 -207 129
4455A29j20Q0k90J61n4J48j02l12K61J1j21K34k65M60N0m0j32j81q8K86k9p9K86
$$ 129 9 89 -201 -40 -94 54 -48 -360 -99 -88 -209 25 -240 220 270 230 98 -83 -171 115 86 7 293
4478B93k37j2M6k8O5j84Q4o6J02Rl00L76q4K01j59k76K77n15L68oJ54l77K47j13
$$ 293 56 44 90 62 127 -57 27 -39 63 72 -228 148 64 265 106 -170 107 -408 -40 -46 108 -269 -22 -135
4502a35j8L29j30j45j4L2L3J16j26J34N7J20n51L38rq8J35J12j41K11l50J21Q9
$$ -135 -153 176 46 -99 -113 -81 -48 68 -58 76 133 253 -298 40 31 -57 78 190 49 260 -90 31 120
4525A20k54K43j39L1j31L51k96q0Q3J00j67l3J19LqJ22j10N6J03M9r9j99J53M9
$$ 120 -134 109 -30 1 -130 221 -75 -155 -72 28 -139 -172 -53 -50 -58 64 -46 10 113 162 63 -136 17 66
4549F6RJ14k03j03L42k67J26k93J45q3L64j01p1Mj45K32Q3k59J07Q1J03k09j13
$$ 66 75 189 -14 -117 225 -42 84 -209 -64 -147 217 116 45 49 -96 136 219 -40 67 148 251 42 -71
4572g1P8J56o4j89K20l52M11p3k05l7j6J74K3j70K67J35l95J61r5P7j69QJ16J4
$$ -71 7 163 99 -90 130 -222 189 116 -89 -126 -142 32 55 -115 152 287 -108 53 -42 35 -134 -126 -10 4
4596DK40k39j16O0K45l04L12k13J72p4n7J24n37M26m14K90N8J96L9j34o8J25J02
$$ 4 244 5 -111 -51 194 -110 202 -11 161 87 30 154 -383 43 -371 -81 -23 173 212 78 10 135 237
4619B37m02L18k39J74j63qo7j41O9L28N5K0j59j57m9kJ62J18P6j08j71k21K89
$$ 237 -165 153 -86 88 -75 -83 -150 -291 -222 106 161 181 22 -135 -184 -186 -24 94 170 62 -109 -330 -41
4642d1L9j10N2Q7L6o0j66J09q4J40K2o9M3J83j28Mn4p1J44k45K59p3K02j35O7
$$ -41 -2 -112 -60 27 63 3 -163 -54 -138 2 24 -45 -2 181 53 57 3 -68 76 -169 90 17 219 84 151
4667A51l36L12M9R1O6l50j54J69L0P0k10N9J02j6O6N6L9k20j88J62m5L22J23l47
$$ 151 -185 127 176 267 333 -17 -171 -2 28 98 -112 -53 49 33 99 155 194 -26 -214 -52 -97 225 348 1
4691AK0J4J53j46N0k24J41N5j39j90K90k00K48q3O4o8q9J11j32J15K71j38m9p0
$$ 1 21 35 188 42 92 -132 9 64 -75 -265 25 -175 73 -10 54 -14 -103 8 -124 -9 262 124 75 5
4715EQ5r5L0Lq4J30N7k51J77O2j64j3P3J95l23M0K92k65j8R5J33k20K7R3J9j48
$$ 5 90 -5 25 28 -56 74 131 -120 57 119 -45 -58 15 210 -113 -73 219 -46 -64 31 164 -56 -29 64 83 -65
4741f5K59k40J83o7O9o1K1j59K10Nk27L4L6J03J3j77j19Q4N7J37k49K45J7K0o
$$ -65 194 -46 137 70 139 78 99 -60 150 155 -72 -38 -2 101 114 -63 -182 -98 -41 96 -153 92 109 129 123
4766A23j19j5j68L23o5J31k66j48M41l12K56k31r9K34pj27j2J22K29l81K26p4
$$ 123 4 -11 -179 144 79 210 -56 -204 237 -75 181 -50 -149 85 78 -49 -61 61 290 -91 135 61
4788F1o7Q3j09O0o2r2J77o7J91j36K21k66J21j33o5QO7J71l51K40J4N5o9qk17
$$ 61 -6 77 -32 28 -34 -126 51 -16 175 39 260 -6 115 -18 -83 -75 -8 163 -188 52 66 121 52 44 -173
4813a73K03q4j50M09k20l8kJ55k5j39L5j50J72O9p0J0Ql45L31L8J30q6l5k39K67
$$ -173 30 -54 -204 205 -15 -53 -55 100 75 -64 -29 -179 -7 62 -8 2 10 -335 -4 34 164 78 43 -196 71
4838G1l07R2J36J51k84L20m16K96J78l02PM2N6r9oL19j35pk95J84j11K99l06J16
$$ 71 -236 -144 -8 143 -141 179 -237 59 237 -65 -58 -16 40 -59 -65 254 119 112 -183 1 -110 189 -117 -1
4862aJ32k58j72J61L4q7J69j57K57j6J98j81K1j19r9J42Q4j96K21j42N0j06R0
$$ -1 131 -127 -299 -138 -104 -191 -22 -179 78 62 260 79 100 -19 -118 24 108 -88 133 -9 41 -65 25
4885B5K57r6J07l26k07K37K19m36L12m5J98p1k07M6m7J25o1K21k02j08J7Mm2j19
$$ 25 282 186 293 -33 -240 -3 216 -220 92 47 245 174 -33 13 -34 91 30 251 49 -59 -42 -38 -80 -199
4909a99K18Q8q0R8r9n9J70k23J84j72J28K6j14k08J04L54k41q4q7k39M82O0k70
$$ -199 19 107 27 125 26 -33 137 -86 98 -74 54 80 -34 -242 -138 216 -25 -109 -196 -435 47 107 -163
4932a63L42j57K95l05l4j19M7J30K25m11J99k09J23J56j37K01n01O53k65k38j43
$$ -163 179 22 317 12 -22 -141 -94 36 261 -150 49 -160 -37 119 -18 183 -318 335 70 -168 -311
4953c11J03P9K58j20o6J01q4Q2Mj81J31J15j39J37j91K01q3j42k31Q3J45N2j67
$$ -311 -208 -129 129 9 -57 44 -40 42 46 -135 -4 111 -28 109 -82 119 36 -106 -337 -254 -109 -57 -224
4976b24J93J68l77L77j07O7J42n75L56J76j64r0N9N0j77K70j18j7j70n1N39j81
$$ -224 -31 137 -240 137 30 97 239 -336 20 196 32 -58 1 51 -126 144 26 9 -161 -212 327 146
4998A46j12j61K91j63j54K6K49k11K84j78k16M97m18J31M4N9r4Q5N5l3j82l4M3
$$ 146 34 -127 164 1 -153 -127 122 -89 195 17 -199 298 -120 11 55 114 20 105 160 127 -55 -89 -46
5021d6K33n29J71J65j67J51M3on43K94M80J3N9j84j80J05j49rl3K98j73O8j16
$$ -46 187 -342 -171 -6 -173 -22 21 15 -528 -234 246 259 318 134 -46 59 -90 -99 -132 166 -7 61 -55
5044e5M1m8M1j50L07l96J70K34k01J7q4L01l26M4q0R5K16m6k46J31r9L46q0j22
$$ -55 -14 -62 -21 -171 136 -260 -90 144 -57 -40 -124 177 -149 -105 -185 -90 126 80 -166 -35 -134 212 132 10
5068A0j24n2J02L2nO7p9K50j3l8k56q1K27Q7j94l0K80o7k65J36r5M96l25j6o3
$$ 10 -114 -166 -64 -32 -37 30 -49 201 188 150 -106 -187 40 127 -67 -97 183 116 -149 -13 -108 388 63 47 -16
5093a6j03l1K04J40n1j92N5%k28K11J62j76O6j11O0J80j72K37j85l22K90j03j38
$$ -16 -119 -150 54 194 143 -49 6 6 -222 -11 151 -25 41 -70 -10 170 -2 235 50 -272 18 -85 -223
5116b23M71j53n8J73o20L82J62k98K70m8j09N5J16l6m52M09k52L19k93j33L42
$$ -223 248 95 37 210 -410 -28 134 -164 106 58 -51 4 120 84 -368 41 -211 108 -185 -318 24
5137B4l4P5n4K4N7n8p9J48o6O6k49R3J50j28K05k57j7m9K25j61nK87k40L37j70
$$ 24 -10 65 11 35 92 34 -45 103 37 103 -146 -53 97 -31 174 -83 -100 -149 76 -85 -90 197 -43 294 124
5162A24j12oj20J74O8K2j30l4J8P2j71J17j1pn2P4J4l18M86l46J82J31qN0l20
$$ 124 12 6 -114 60 128 150 20 -14 4 76 -95 22 11 4 -48 26 40 -278 208 -138 44 175 167 217 -103
5187a03l4j72K38J36j87K92j91M4q0L05k62J80j3j06k10J27K09k38L58j15j17
$$ -103 -137 -309 -71 65 -122 170 -21 23 -57 248 -14 166 153 47 -163 -36 173 -65 293 178 61
5208F1l3J37j57K34m60K01J62q2m5Q2pl9J55k71J68j70P8J77l34M1J77j39L3j15
$$ 61 28 165 8 242 -218 -17 145 63 18 100 93 54 209 -62 106 -64 14 191 -143 -102 75 -64 -31 -146
5232a46J36k45M57k96ko5J39k50K39l5P8L0L0j96m3R9K5J15l07M56l56J76NJ6
$$ -146 -10 -255 202 -94 -96 -161 -22 -272 -33 -68 10 40 70 -126 -169 -70 -45 70 -237 219 -137 39 44 60
5256F0r3jL9K24m9j19p2R7k23K27k82K37q4j00L05R6l82p6M47k22Q1j78O9J75
$$ 60 -33 -34 5 229 180 61 -11 86 -137 90 -192 45 -39 -139 166 262 -120 -196 251 29 110 -68 1 176
5280A76l30M16k46j22l2O7k6P3R6l29K51K31j94l84J86J37n6K59k99J54M8O5o6
$$ 176 -154 262 16 -106 -138 -71 -97 -24 72 -257 -6 225 31 -353 -167 -30 -86 173 -126 28 76 141 75
5303G5J59Nk64J62J6j09L3k4j31P7k20Q2R1J04l00L43l0j35J80r1J09r0Lo8M8
$$ 75 234 239 -25 137 153 44 77 53 -78 -1 -221 -139 -48 56 -244 99 69 -66 114 23 132 42 45 -23 25
5328B5k37J53K83j57L4k04l5J41O6om4J36l1j35n3O9r2K31j40J4l7k63P5J78L5
$$ 25 -212 -59 224 67 101 -103 -138 3 69 63 19 155 124 -11 -64 5 -87 144 4 18 -19 -282 -207 -29 6
5353FQ8j22j07J05O5q8k11M65l78L4K42K0o2o7PL75m81J48j21L5l0L8K20k00M6
$$ 6 94 -28 -135 -30 35 -53 -264 201 -177 -143 99 119 57 -10 -3 372 -109 39 -82 -47 -77 -39 181 -19 27
5378B7p0J62l49L94o3m5nl4j97J48NJ61P8K6k23K21k42j81L61l10J85R5q0k06
$$ 27 -43 119 -230 164 101 56 51 17 -180 -32 -27 134 212 238 15 236 -6 -187 174 -136 49 144 64 -142
5402a42R8o0l6rN2N4L22k97KK38l10J53L8J38l55P0o1J17J9K00l23J07j1j85K77
$$ -142 -44 -104 -140 -149 -97 -43 279 -18 -16 222 -88 65 103 241 -114 -44 -105 12 31 231 -92 15 4 -181 96
5427I6j30K7J38k0j4j00j64K11p3O2MO0r9j68J09o9N2M3J10j81Q8q5K88k02o6
$$ 96 -34 -7 131 111 97 -3 -167 44 -29 33 37 97 -2 -170 -61 -130 -78 -35 75 -106 -18 -103 185 -17 -83
5452h3J48j70J88K8j32K84j72k19M08k91L17l85J17J91j91N6j83j30J83l%q5o8
$$ -83 65 -105 83 111 -21 263 91 -128 280 -11 306 -79 38 229 38 94 -89 -219 -36 -39 -39 -124 -192
5475a92j63L83pR7n9l07N39j97j02n3j5J45J18l03M5P7j5j08L1J65j38o5K14k81
$$ -192 -355 28 21 118 59 -248 291 94 -8 -61 -76 69 187 -116 -71 6 -9 -117 -86 79 -59 -124 90 -191
5499a91N15l33r4J75k80L99l36J56Kl61L35r3Mj61L42j60J26j0j01P5m1m3K16
$$ -191 324 -9 -103 72 -208 191 -145 11 13 -348 -13 -106 -102 -263 79 -81 45 35 -66 9 -32 -75 141
5522A41l6r5L5rJ15m67M29j49r7j26K56p1m0q2P9J63k58L15L7k27J46J00l44L21
$$ 141 105 10 45 36 151 -316 113 -36 -133 -259 -3 -74 -114 -196 -117 46 -212 103 140 -87 59 159 -185 136
5546A36j27j46P6J70ko4J01j46M1J02j53J4J58k30j79N19j61l9pJ11m8l16O6J91
$$ 136 9 -137 -61 109 107 43 144 -2 39 141 -12 2 160 -70 -249 270 109 70 63 174 126 -190 -124 67
5570F7M9k23K63k45n0L78l51o4K42q4J68m43j00M62k46K67N0O6p2j22j12p9L78
$$ 67 116 -107 156 -89 -139 239 -112 -176 66 -18 150 -293 -393 69 -177 90 140 206 134 12 -100 -179 199
5593A99l64K09j34p6J90k64K57m8p1L69l12L28j86n0k51J98k2K1Q2k45K95j87
$$ 199 -165 44 -90 -166 24 -240 17 -31 -102 267 -45 283 97 47 -204 -6 -28 -7 75 -170 125 -62
5615f2K13l66J81K1q8J23J67k25j30K93j29p6J43m2Q9j71O3j84kK44L1JP4k21
$$ -62 151 -215 -34 -13 -101 22 189 -36 -166 127 -2 -78 65 23 112 -59 4 -180 -182 62 93 94 168 -53
5639e3P5p8q5J14L7J88n7j70l55M52o2J87l00K0J39k05K00j87j33K77P3j2K1k4
$$ -53 22 -56 -141 -27 10 198 141 -29 -384 68 6 193 -107 -87 52 -153 47 -140 -273 4 77 65 86 62
5663F2M2k12K08J41o4j89%l1j21M34k11j64K30k67j61K60j05J30k5j25K51o1K28
$$ 62 104 -108 100 241 177 -12 -12 -43 -164 270 59 -105 125 -142 -303 -43 -148 -18 -43 -168 83 22 250
5686B50k08Kl78L72j69J24J8Q7j91l06M13J20r9P1K31k86p0O2j81K03k3j48j21
$$ 250 42 44 -334 38 -131 -7 11 98 -93 -399 14 134 35 106 337 51 -19 43 -138 65 42 -106 -227
5709b27K16q1J65j42J45k16K49j33K11l22L1P2K07k18j0K34j31k08n0M74k49K09
$$ -227 -11 -92 73 -69 76 -140 109 -24 187 -135 -104 -32 175 -43 -53 181 50 -158 -208 266 17 226
5731B26j62l65L86o8J42l74J28J77J49k15j43N5K33l58l3K09K44j78k15L36j47
$$ 226 64 -301 85 17 159 -215 -87 90 239 24 -119 -64 169 -189 -222 -13 231 53 -162 174 27
5752B7M8j75k3R6K22l24J32P9j44q4K26j11J25j20O8j30n8K32k17n5MR0J63k37
$$ 27 75 -100 -123 -27 195 -129 3 82 -62 -146 80 -31 94 -26 42 -88 -146 86 -131 -186 -182 -92 71 -166
5776a66K44p2j23K52j85q6K07j08l7J64k01J15j4k6O8j73L94l64J39o9k21J31
$$ -166 78 6 -117 135 -50 -136 71 -37 -74 90 -111 4 -10 -36 32 -141 253 -111 28 -41 -262 -131
5798a31J88oj3j59J00kJ73k25J90P6j63J2r4k5J51P3j06q9L7j2j18J74k18J56
$$ -131 57 51 38 -121 -21 -23 150 -75 115 191 28 40 -54 -79 72 145 39 -50 -13 -25 -143 31 -187 -31
5822c1J1q1m8Q8LK2J83Q9l39J60M9q4j81O8r6K28n6r6J08N8O5r6j18M7Q4J74l13
$$ -31 -20 -101 -149 -61 -58 -36 147 236 -103 57 106 22 -159 -91 -187 41 -15 -111 -3 55 120 24 -94 -47 37 211 -102
5849a02K39l66K63pj12o8J56J27j0k35M5j7K73l38K1J8L8J09L3p9N7K21m16K55
$$ -102 137 -229 34 27 -85 -153 3 130 120 -115 -70 -87 186 -152 -131 -113 -75 34 67 -12 45 266 -150 105
5873A05m6k27M1QP9j42Q0M0J61J79q0l10J28Q3K2l2m0k44L75k81J75J23j73N0
$$ 105 59 -168 -127 -119 -40 -182 -102 -62 99 278 198 -112 16 99 121 89 49 -195 180 -101 74 197 24 74
5897G4o0K83m59J92K15J5k47j5k26L66j18j6rk45K12J84k32J24j33K29k02K46
$$ 74 14 297 -162 30 245 260 13 -2 -228 138 20 4 -5 -250 -38 146 -86 38 -95 134 -68 178
5919A78q7k44J84k22L25l18J99l4o3M1K38k10j03J34k50L01M3K08k60j73q9j08
$$ 178 91 -153 31 -191 134 -184 15 -19 -82 -41 197 -13 -116 18 -232 69 112 320 60 -113 -202 -310
5941c10L47p8K24j07j98q2J6N54k97P7j74J4k4J96j17J9j23Q4K4q8k62R9K85j35
$$ -310 37 -41 183 76 -122 -204 -188 366 69 146 -28 -14 -38 158 41 60 -63 21 45 -43 -305 -206 79 -56
5965e6k8m0L12l94J25J66k29r1K13J22N3j63j03J03P1K01j77P8k5k13J93Mp3M8
$$ -56 -84 -124 188 -206 -81 85 -144 -235 -22 100 153 -10 -113 -10 61 262 85 163 138 -75 118 122 49 97
5989I7k32n5J21K05k41P2m3J03n5j97J09P8j38K69k44J73k35r2L43J70k12m4K80
$$ 97 -135 -190 -69 136 -105 -33 -76 27 -28 -225 -116 -38 -176 93 -151 22 -213 -305 38 208 -4 -48 232
6012B32l48K37j25j01K26j24l4J45j86O4P7j88n2J48J55k6j03j57jJ68k09K42
$$ 232 -116 121 -4 -105 121 -3 -37 108 -78 -14 63 -125 -177 -29 126 100 -3 -160 -161 7 -202 40
6034D0l87J53Q8J2K53k51K56o2j46L6L4k45L62j10K72m5l34K29j64L0J39k06j27
$$ 40 -347 -194 -106 -94 159 -92 164 102 -44 -8 26 -219 143 33 305 260 -74 155 -9 21 160 -46 -173
6057a73O5J88J1n9JR8l50L20k42L01l53m1K81k75J84K28o1j58J11m6J26J19l08
$$ -173 -108 80 91 32 33 131 -219 101 -141 160 -193 -234 47 -228 -44 184 123 -35 76 30 156 275 -33
6080c3J06j7q4mn7J16o8j6J22j64J49N1O8j61k38K58j12j91K27l0L16k09J81j84
$$ -33 73 56 -28 -32 -89 27 -41 -57 65 -99 50 101 169 8 -230 28 -84 -275 -48 -78 238 29 210 26
6104B6N5N8p0K18l06L00l37N0l2k82N42l33R1J09q6j25J4j6L37m2j74P0K4N3j21
$$ 26 81 139 69 287 -19 281 -56 -6 -38 -320 222 -111 -20 89 3 -122 -108 -124 213 171 -3 67 91 144 23
6129B3kO7k06K02K9j42j47M2K70o7l71K50k2NJ73n4J89k24j95j67M15J71l97J74
$$ 23 21 88 -118 84 113 -29 -176 -134 136 69 -302 -52 -74 -69 104 50 239 15 -180 -347 68 239 -158 16
6153A6k3k42K43j56L11q8k2j67K62j89l03M26q2N5q4j32kJ42Kj88l2J42Q9J23
$$ 16 -7 -249 -6 -162 149 61 39 -128 134 -55 -358 68 -14 41 -43 -175 -177 -35 -33 -221 -253 -111 -22 101
6177A01j55J4P6J02j78j01N0l0M1J56J80l66O7p4j9J09M7j17M37k00j24Q7R1j96
$$ 101 -54 -40 36 138 -40 -141 -91 -121 -80 76 256 -110 -43 -117 -136 -27 20 -97 340 140 16 103 194 -2
6201bQ7j81J63jl54K94r1J08j0K3j95J33J04o1L6R0l36J92p5j71J42M4Q6l0J10
$$ -2 85 -96 67 66 -288 6 -85 23 13 36 -159 -26 78 17 53 143 -193 -1 -76 -247 -105 -61 25 -5 105
6226A05j84J87j05M3q7n0J93l3j36K22j36j9k23L72o1k04K30k52kK12p7j38L70
$$ 105 -79 108 3 46 -41 -91 102 69 -67 155 19 0 -223 149 88 -116 114 -138 -140 72 -5 -143 227
6249B27k49J1q4K0O7o2j18L6P4J79r3J15k05l6J0O5p7K21j94J46k40J93n3J40
$$ 227 -22 -11 -95 -75 -8 -70 -188 -152 -78 101 8 123 -82 -118 -108 -43 -120 101 -93 53 -187 6 -47 93
6273I3m7o7j8o5Q6j86J15K85j3l44J78J5R1j98j63L8L14k44J09N6J62j58j42K73
$$ 93 46 -21 -39 -104 -18 -204 -89 196 183 -161 17 32 123 -75 -238 -200 114 -130 -21 35 197 39 -103 170
6297A70j20nl5j88J13L3m4J15K39k61J04p4K05N1l32J53R9k51K7j38K04q8M7k
$$ 170 50 45 10 -178 -65 -32 -76 39 278 17 121 47 252 303 -29 124 223 -28 -1 -139 65 -23 24 22
6321B2j67n0J81j38J79N7k93K45k4j55n9R8j99N71k94j7l6pk59R5J61Q4O4j08
$$ 22 -145 -195 -14 -152 27 84 -209 36 12 -143 -202 -104 -303 268 -26 -43 -79 -86 -345 -250 -89 -5 59 -49
6345d9J49o6r5Q2Q7j35J96k47J44m0P1j39j22j6J57L0j9jj28P5K10j89j68K31
$$ -49 100 34 -61 21 108 -27 169 -78 66 26 97 -42 -164 -180 -23 7 -12 -13 -141 -66 144 -45 -213 18
6369A8KJ34l78L22j18m2j41K70J08j56j22J52j11K87k57P5p3N5q8JP8k87L06m5
$$ 18 20 154 -224 98 -20 -62 -203 67 175 19 -103 49 -62 225 -32 43 -30 25 -63 -62 16 -271 35 -10
6393a0Pl9J05l2j68O4J79p8k42L58K0k16J45M9L9k04J17k12P6J33j32P5k62K80
$$ -10 -3 -42 63 31 -137 -73 106 28 -214 144 164 -52 93 142 181 -23 94 -118 -42 91 -41 34 -228 52
6417E2NO9p3r6K00k25J71J22j86k2o0J4j30L04j84J19q9R5j32j8l3L21l90J28
$$ 52 57 126 53 -43 157 -68 103 225 39 17 -43 -29 -159 145 -39 80 -9 86 -46 -64 -97 224 -166 -38
6441c8JR1p9J47k18L9K40L5k46J67k37J79j05J19K20n44K84k1m0J38k40Q2J19
$$ -38 -37 54 -25 122 -96 -57 183 218 -28 139 -98 81 -24 95 315 -229 55 34 -6 132 -108 -26 93
6464I3j82J99k88J31Nj32L88k13Pm5J42j48K69k96Q6J4J53k80L86j07l35n5J18
$$ 93 -89 110 -178 -47 -42 -174 214 1 8 -37 105 -43 226 -70 16 30 183 -97 289 182 -153 -208 -90
6487i0J40r9J79ol74K86p1K5J05n7j06K41l64K44k53k2J58K27o3l29K02P9l9J97
$$ -90 50 -49 130 124 -250 36 -35 -10 95 38 -68 173 -191 53 -200 -222 -64 163 100 -229 -27 52 13 210
6511B10om11L82j98J6m3R6J95m33K54k09K13j54L38p8o2m1q5L2o8k31J79M6PK37
$$ 210 204 -207 175 -23 -7 -50 46 241 -192 62 -147 66 -88 250 172 110 69 -16 16 -52 -283 -104 -58 -51 186
6536A86p5J34j48%l27N24l33K8j40K29j2L3j48Q0r5J15P1q0j05P2J29l03K71O1
$$ 186 111 245 97 97 -230 294 -39 -11 -151 78 66 99 -49 31 -64 51 122 42 -63 9 138 -165 106 167
6560A67k60j60N50m38RK3L07k07j59n9%N4L92j88m3J1j73J24r5P2J70l79K01j32
$$ 167 -93 -253 297 -141 -132 -109 198 -9 -168 -227 -227 -173 219 31 -12 -1 -174 -50 -145 -73 97 -282 -81 -213
6584b13J37J46j55J8J36k99J66M0J27j07l8K28k02j05L86k00k34L05k40l2%J97
$$ -213 -76 70 -85 -67 69 -230 -64 -24 103 -4 -42 186 -16 -121 265 65 -169 136 -104 -136 -136 61
6606F1j09m1J27J52k50N8K0k55K93O6k71P7j1J28NJ0r5p2K24j10j8p0N0K94k25
$$ 61 -48 -89 38 190 -60 -2 18 -237 56 122 -149 -72 -83 45 50 60 -35 -107 117 7 -11 -81 -31 263 38
6631C8k21L05K8j81J21P5j3k76L76k00j30L33l30J6j66J55J31J98p2k2j41l00
$$ 38 -183 122 150 -31 90 165 152 -124 252 52 -78 255 -75 -59 -225 -70 61 259 187 165 24 -276
6653b76L65p1N5r6l1L9j08J94j15o3K83J75k26j63j0j24M27j76k77Q1n2l2K07
$$ -276 89 18 73 -23 -54 -15 -123 71 -44 -107 176 351 125 -38 -48 -172 255 79 -198 -117 -169 -201 6
6676FL15l18L09j88k84mJ32K15k01kJ51k04K68K3l58O5M07n02J6N3k4R4K42k44
$$ 6 321 3 312 124 -160 -164 -32 183 -18 -20 131 -73 195 218 -140 -75 332 -170 -154 -101 -125 -31 211 -33
6700c3O6rk5n9m5J84L3j29L3j6k49L82l52L16j5pJ44k36j26K07K6J36j70M3k44
$$ -33 33 24 -1 -60 -105 79 112 -17 16 0 -249 133 -219 97 82 75 219 -17 -143 64 90 226 56 99 -145
6725a45K46M6K4k15m8J03k93O58m70O2j42M23l74j56M09j18n3J06k06J35k57L59
$$ -145 101 147 171 -44 -92 11 -282 376 -94 -32 -174 249 -125 -281 128 10 -43 63 -143 -8 -265 94
6747I4k03j5L62j53j25l2J65J5k29J5J10j58l4K31k61L44j79l2OJ3K63Lk60j98
$$ 94 -109 -124 238 85 -40 -72 93 108 -121 -106 4 -154 -188 43 -218 126 -53 -85 -79 -66 197 200 -60 -258
6771b58K93l13J36K24Rl05J66J23K8J21p9k66j6K4J33J1j91K9J39J7r6J22J46
$$ -258 35 -278 -142 82 91 -214 -48 75 103 224 145 -121 -137 -113 20 31 -160 -131 8 25 -71 51 197
6794A97k67J4Q3LM4j57n4J65J32J14k52Kq3P1q1r5Pk8K07J22j10Q4J29l40n2J34
$$ 197 -70 -56 27 30 74 -83 -137 28 160 274 22 24 -59 12 -69 -164 -157 -185 22 144 34 118 247 -93 -145 -11
6820a1p9k48K76lr9L71j11l9P3j74l9p3K67l20O4J83J17m0q2P1j8n23L50M3N8
$$ -11 -90 -338 -62 -65 -164 207 96 57 130 -44 -83 -156 111 -209 -145 38 155 115 33 104 86 -437 -87 -44 14
6845A4L38k10j56k50R3J14j7R4J02J1m30Q1K32k38N34k07l4l23K16q8K00j33m7
$$ 14 352 142 -14 -264 -171 -57 -74 20 122 133 -297 -216 16 -222 312 105 71 -252 -36 -124 76 -57 -104
6868a04P2j6o5P8j5K58q8J9J92k70k5j30P8Q6N5n4N6j20J8p7J96k28K2o5J55M4
$$ -104 -32 -48 -113 -35 -50 208 120 139 331 61 36 -94 -16 70 125 71 127 7 25 -52 144 -84 -62 -127 28 72
6894G2r0q0j64J97Q1J1j57L5N4R7l7j16J14n3J90k72M63l75k4o9n3N20m12K8J96
$$ 72 -18 -98 -262 -65 16 27 -130 -95 -41 56 19 -97 17 -36 154 -118 345 -30 -54 -123 -176 344 -68 -40 156
6919A56l33K85N2J53l58o7O4o5K8p3L44k31j75K60p3J33L1j27K02m06J47K80l73
$$ 156 -177 108 160 313 -45 -112 -48 -113 -85 -158 186 -45 -220 40 -33 100 131 4 206 -200 -53 227 -146
6942a46J1L4J04p1J36o2l11O05l79R3j35J60J44j24j84M8J35j42j37K41j33L07
$$ -146 -135 -101 3 -68 68 6 -305 300 -79 14 -121 39 183 59 -125 -77 58 -84 -221 20 -113 194
6964A94j13p2J85k60J8qK48j06K60m41K22l07J65j45K90n6K13k61J19l17K32J4
$$ 194 81 9 194 -66 -48 -56 192 86 346 -95 127 -180 -15 -160 130 74 287 26 145 -172 60 74
6986G4j66K2j72K71M5M3j02K05r0k78M9N5L38r8k77P7k7K16j94J09o8%L4j31J95
$$ 74 -92 -70 -242 29 74 117 15 220 130 -148 -99 -44 294 196 -81 -4 -31 185 -9 100 32 32 66 -65 130
7011A30j50m01L72J18q1J69j87R2Q4j68O6P2k36N2j35K17j37L59j07j20J14O3
$$ 130 -20 -421 -49 69 -12 157 -30 62 146 -22 44 116 -120 -68 -203 14 -123 236 129 9 123 186
7033A86l83K61N5k4L9j70O8j03N9K33k64O8J27j07L46n42R1P1o7K87j91R8l09
$$ 186 -197 64 119 95 134 -36 32 -71 -12 221 -43 25 152 45 391 -151 -60 11 -56 231 40 138 -171
7056a71K45J35l63J7K6j50J2L43L8l88J94L9m8L5kJ21k30K57k7j70K51j18P2J6
$$ -171 74 209 -154 -137 -111 -261 -249 94 132 -256 -62 -23 -71 -36 -38 83 -147 110 83 -87 164 46 118 134
7080A34j62J26k09L31k84r4K10j71K27m3j85Q0j57L71k01r3L07k35j53N14m13
$$ 134 -28 98 -111 220 -64 -158 52 -119 108 65 -120 -40 -197 174 -27 -120 187 -48 -201 313 -100
7101a00N2j29K11j77K05rR2k55L79l57J94j66K89P0k97lj58K78j53J47l9m2j84
$$ -100 -48 -177 34 -143 62 53 145 -110 269 -88 106 -60 229 299 2 -1 -159 119 -34 113 74 32 -152
7124a52L22j86o0J37j89n2J13K23J8k85j26J26M51l25Q4j23l4K07p1j81J16m1
$$ -152 170 -16 -76 61 -128 -180 -67 156 174 -111 -237 -111 340 15 99 -24 -58 149 78 -103 13 -28
7146b8K56j17l37L44l3n0Pk8k6nR0K6P7k81l4J70j10J83q3L27k65l6O7j55m3j53
$$ -28 228 111 -226 118 85 35 42 14 -12 -17 73 99 176 -105 -139 31 -79 104 21 348 83 47 114 -41 -84 -237
7172b37J62J30k59K12k64L83j52K05j42P4J40m0m9l15J73k17L58o4j81J20P4k23
$$ -237 -75 55 -204 8 -256 127 -25 180 38 112 252 212 163 -152 21 -196 162 98 -83 37 111 -112
7194a12K2M37l59j99J53K22l83J49N5K67j92k9Q3j87K63l31J63J13j23p7J89j39
$$ -112 -90 347 -12 -211 -58 164 -219 -70 -15 252 60 31 114 -73 190 -141 22 135 12 -65 124 -15
7216a5L02l30l58O24k75j44K82j99L9k3J02j81K18j13O8l6J07n8n8o9R1K8J15
$$ -15 287 -43 -401 223 -52 -196 86 -113 -74 -97 5 -176 42 -71 -3 -39 68 10 -48 -117 -26 2 117
7239A17j29n2Q6j03R4J69j87J7k0K41l7k61J70N0k99O2JJ10J1j14J35JK17k39
$$ 117 -12 -64 22 -81 13 182 -5 12 -8 233 196 -65 105 155 -144 -82 -81 29 40 -74 61 62 279 40
7263D0n7J61j33Q3n6m5j21q8Q3L27j70J28n4j5q2k0j16J99o9p0Jm2pJ92l1O8m8
$$ 40 -17 144 11 94 38 -7 -128 -216 -133 194 24 152 98 83 1 -19 -135 64 -5 -75 -74 -116 -123 69 38 106 58
7290E8J5J54k80J74q7n5j80K03J67k04J15j13J07K05l04J20o6M6k13L46k34O2
$$ 58 73 227 -53 121 34 -21 -201 2 169 -35 80 -33 74 279 -25 95 29 75 -138 208 -26 36
7312C6m2O6O4j35n7J86j0N4j37q6QK55j00j43J56j97K48l16J50j86k3K34q4r8
$$ 36 -6 60 124 -11 -68 118 108 162 25 -61 -53 202 102 -41 115 -82 166 -150 0 -186 -209 25 -59 -157
7336a57R3Q7k0j05J22J52q9r4K53k26j21L6J73q6r3p4L44j3l28P4rJ68mRp9q0
$$ -157 -64 23 3 -102 20 172 83 -11 242 16 -105 -69 104 18 -75 -149 195 182 -146 -72 -81 87 83 92 13 -67
7362f7j28K44N5j40oj6j15J71K81m17J60N5k13L04j92N5j20J90p6M9o8j93M3q2
$$ -67 -195 49 104 -36 -42 -58 -173 -2 279 -138 22 77 -136 168 -24 31 -89 101 25 74 6 -187 -144 -226
7386b26M21k5j83R4J00j07j18Q2j06K14J76l25QK46k19K0o4N0j01KP3J48m3k97
$$ -226 195 170 -13 81 181 74 -44 38 -68 146 322 -3 5 251 32 52 -12 38 -63 -61 12 160 117 -180
7410a80K8M0q9L95k07p5J16J1P6Oj80J28PO0n8n2J09p4OJ4J73l05k41L71K0k0
$$ -180 -152 -112 -201 194 -13 -88 28 39 115 121 -59 69 76 136 78 26 135 61 67 81 254 -51 -292 79 99 79
7436G9j09m7J11j11J73J93m54N26k03p6R4j94J64j13p2Q9J10j97J90k20j01k4
$$ 79 -30 -77 34 -77 96 289 -165 361 158 82 176 -18 146 33 -39 50 160 -37 153 -67 -168 -192
7458a92J33J38m5ok44K75o5JN33m50k38r9L84q5O8m4l7j27J30J46m6j27K60l14
$$ -192 -59 79 34 28 -216 59 -6 -5 528 78 -160 -259 125 40 108 64 27 -100 30 176 130 3 263 -51
7482e1k02N10N6j67l93P9L34k68K68j21r3J40k49J95J0Nj56J71M6m0n7L7l30K25
$$ -51 -253 257 313 146 -247 -168 166 -102 166 45 -48 92 -157 38 48 53 -103 68 114 74 17 54 -276 -51
7506e1J00j20O6q2r6L98Qj69j35K80o4M3j68q3O9Oj12J97P5j39j71m0R6K97j43
$$ -51 49 -71 -5 -87 -183 215 223 54 -81 199 135 178 10 -73 -4 2 -110 87 162 23 -148 -188 -92 205 62
7531F2j11Lj06M90l27j02J83l57K02K73j19k36K3L48m53L48Rj47L6k7j01M3J02
$$ 62 -49 -46 -152 338 11 -91 92 -265 -63 210 91 -145 -122 226 -227 121 130 -17 19 -8 -109 -66 36
7554C6K6L6o0L1J29k16q3J9O1O2p9R6K32n35L08M1k31j12K20j31J15N0Kk6K14
$$ 36 62 98 38 69 198 -18 -101 -82 -21 41 -38 58 290 -245 63 104 -127 -239 -19 -150 -35 15 17 -9 205
7579B05k50pj8L9J25k61J62K7nk04K39r7J66j57j21L91k39J8j43K54j33q7r6L00
$$ 205 -45 -52 -70 -31 94 -167 -5 22 17 -187 52 -45 121 -36 -157 234 -5 13 -130 124 -9 -96 -192 108
7603A08j28j16K19o7l2j75J79k3J91r5k29M69k85p2J72j51Q0j72K8K85j72j5K6
$$ 108 -20 -136 83 16 -16 -191 -12 -35 156 61 -168 301 16 -56 116 -35 45 -127 -99 186 14 -1 25
7626B5Q8K2k65J76j25J7J54K4k03L05j52n1M7R4o7o8QK4k85K37k6O8r9j04j63
$$ 25 113 135 -130 46 -79 -62 92 116 -87 218 66 15 62 156 89 21 29 53 -232 5 -21 47 -52 -156 -319
7651c19M29j84K08k26j13J05Q7j35J96L1j2k7j13r4lJ02R4j44J20l6O3M7k24J35
$$ -319 110 -74 134 -92 -205 -100 -13 -148 48 79 67 40 -73 -167 -170 -68 26 -118 2 -34 29 76 -148 -13
7675a3j18J19J25q3J56m6J7j15j70L60J04m93J61O7k35L79k8j72m2J62L5j74L39
$$ -13 -131 -12 113 30 186 140 157 42 -128 232 336 -157 4 71 -164 215 187 15 -27 135 170 -4 335
7698C35k78j96J23J48J22j07q2j84K62l13K3L21j10j70J96L0j68L34k53k57K59
$$ 335 57 -139 -16 132 254 147 65 -119 143 -170 -147 174 64 -106 90 120 -48 286 33 -224 35
7719C5m4L9J62j02M5j57J89k56J30j26L60l45O6K02k60N5o4J71j87L50m08J16
$$ 35 -9 30 192 90 135 -22 167 -89 41 -85 275 -70 -4 198 -62 -7 -71 100 -87 263 -145 -29
7741b9l1N0o2J68n4k01J22R3PJ9j52M3k44K64O2J15j16j05Q7J37l71J50RR4J72
$$ -29 -60 -10 -72 96 42 -159 -37 56 63 82 -70 -27 -271 -7 55 170 54 -51 36 173 -198 -48 -39 55 227
7766B27k67M29k74k53J14M6N6rlj42j57J20M3J9J29l2j54K22o9M0o4k4k79K90
$$ 227 -40 389 115 -138 -24 22 78 69 66 -76 -233 -113 -70 -51 78 46 -108 114 45 85 21 -3 -282 8
7790Hk44J45K08n5O7k55K11p5k47N64k98O1j56L9k06L78Mj15j1j50L1J04Qj50
$$ 8 -236 -91 117 62 129 -126 85 10 -237 327 29 90 -66 -27 -233 145 149 34 23 -127 -96 8 16 -134
7814a34K43j77p4M15l37r2J81P6op8K54l67L16l71J78l9k2O1J9O6l2J37k79K82
$$ -134 109 -68 -142 273 -64 -156 25 101 95 17 271 -96 220 -151 27 -12 -34 27 46 112 80 217 -62 220
7838B20l18J45k16L68k86Q8J0k88L91l60L22j12J39L6j73J40n4l4k89L78l39K31
$$ 220 -98 47 -169 199 -87 1 11 -277 114 -246 76 -36 103 139 -34 106 52 18 -271 107 -232 -1
7860ao9K88M5k64l8R0n2q2J82J46m07K85j8L5J49j91l7P7j11n6O3l84L08N2r3
$$ -1 -70 218 263 -1 -39 51 -1 -83 99 245 -162 123 105 140 289 98 61 138 27 -29 34 -350 -42 10 -83
7885h3o2R2J5O0PJ43k18J53k40O4J63j39j58K8N26m46K4J13K00j18k07K10j06
$$ -83 -145 -53 -38 22 29 172 -46 107 -133 -69 94 -45 -203 -175 351 -95 -71 42 242 124 -83 127 21
7908B1J67j68j1nj54J83R1m15K60j06m3J76K10k24K0K20J26l87j3K56l50J91N
$$ 21 188 20 9 4 -150 33 124 -291 -31 -137 -180 -4 206 -18 2 222 348 -39 -52 204 -146 45 50
7931E0o9K20l62J31K01o9r7p8j26L21K7j05p3J36R0k83J8n4J90k05K46m7k80k1
$$ 50 -19 201 -161 -30 171 102 5 -73 -199 122 149 44 -29 107 197 -86 -68 -122 68 -137 109 62 -218 -239
7955b39R9K46k12K5Q9J4o4J40K1Mm17L06j65L09q3j22K09m42K50l8J90j24J58
$$ -239 -140 106 -106 -81 8 22 -42 98 119 123 -294 12 -153 156 73 -49 160 -282 -32 -70 120 -4 154
7978A54L1Lj40j84K12m15K50J56J37m51J37K54j62o9L17l40O1k32O7J83P9k46
$$ 154 185 188 48 -136 76 -339 -89 67 204 -247 -110 144 -18 -87 230 -110 -49 -281 -214 -31 48 -198
8000a98J59q5J39k57K32j17L47j91mj05O9J7J06m9J6K6Q8j71k57J71L6n1J63j36
$$ -198 -39 -124 15 -242 -10 -127 220 29 25 -80 -11 6 112 63 79 105 193 22 -235 -64 -28 -79 84 -52
8024e2O4j87J87j65J72n4P9J9m8K9Q8k67K3O8J4L27l45k4L0j08K69k43K00k28
$$ -52 12 -175 12 -153 19 -35 44 63 15 44 132 -135 -112 -44 -30 297 -48 -72 -42 -150 119 -124 76 -152
8048a52l6K35k36K92p7J12j36R2k04L5L44l24K08r2n7J48k87j8K8j04N5K17n3
$$ -152 -188 47 -189 103 26 138 2 94 -110 -75 269 -55 153 61 4 152 -135 -153 -125 -229 -174 43 -10
8071a0j27J40j60K9J3n7K69j83j50L20k81J01p2J58N4j67L16R0n58J39R9L7M1
$$ -10 -137 3 -157 -128 -115 -172 97 -86 -236 84 -197 -96 -168 -10 44 -123 193 283 -275 -136 -37 0 41
8094D1k99M87j83K41l08J69j14O8m9L2n7NL6k0j64K82l74j82L36n1J60j68J49
$$ 41 -258 229 46 287 -21 148 34 102 53 85 28 33 69 49 -115 167 -207 -389 -53 -104 56 -112 37
8117C7k29L92l10P7J67k54k81M77q3R5J31k16J06j67r0J34m8K8K63l63M57q5l38
$$ 37 -192 200 -110 -33 134 -120 -401 76 -7 88 219 3 109 -58 -148 -14 -62 -34 229 -134 323 238 -100
8140a00R5p4K71m84J25L84j43j55K82j61j91L4L19l31J31K11j56l15N50l37j4
$$ -100 -5 -79 192 -292 -167 217 74 -81 201 40 -151 -117 202 -129 2 213 57 -258 292 -45 -59
8161e9p1K53l87L98O9k83jJ06j59o0J98k52K93q2p1j8j3L20r5j6j24J86k73Q1
$$ -59 -130 123 -264 134 203 -80 -81 25 -134 -194 4 -248 45 -37 -108 -126 -139 181 86 70 -54 132 -141 -60
8185f0L4j07M65l97j20Q4
$$ -60 -26 -133 332 -65 -185 -101
8191a01
$$ Imaginary data points
##PAGE= N=2
##DATA TABLE= (X++(I..I)), XYDATA
0@%%%%%%%%%%Qj6J6j6J6k0K8l2M0m8N6p2Q4j00J20j36J54j78K05k33K68l07L47
$$ 0 0 0 0 0 0 0 0 0 0 0 8 -8 8 -8 8 -12 16 -16 24 -24 32 -40 44 -56 64 -72 82 -96 109 -124 144 -163 184
33A84l92M43m96N54o22O95p74Q62r58J062j173J296j432J579j741J920k114K328
$$ 184 -208 235 -261 293 -329 366 -408 454 -504 558 -615 681 -751 828 -913 1007 -1107 1221
51A221k567K829l121L453l827M251m742N319o000O821p838R133j0844J3208j6701
$$ 1221 -1346 1483 -1638 1815 -2012 2239 -2503 2816 -3184 3637 -4201 4932 -5912 7296 -9405
66i405K2376l3092N9968k44912m05601P42942L69397n17107l39624L09524K21122
$$ -9405 12971 -20121 39847 -205065 -610666 132276 501673 -15434 -355058 -45534 175588
77A75588p1613r9346q4623q3822J78088K61036j65150m21953J05157M94801j5626
$$ 175588 103975 4629 -79994 -163816 14272 275308 110158 -311795 -206638 288163 272537
88B72537m93390o2324M00200J25029k59353j44244R2670J17359N0023m5006j58701
$$ 272537 -220853 -283177 117023 242052 -17301 -161545 -68875 48484 98507 53501 -105200
99a05200m2833K20973J22615k37143j52889K13248J27467j62240m9117R8770n0124
$$ -105200 -148033 72940 195555 -41588 -194477 18771 146238 -16002 -65119 33651 -16473
110a6473l8211J51279K026k32014j391K77503K1531k86021l7985K62585K8177
$$ -16473 -54684 96595 98621 -133393 -134784 142719 164250 -121771 -159756 102829 131006
121A31006k15754J2527J43764q6021o7608J75772N159k57970K9139L13612l6967
$$ 131006 -84748 -72221 71543 -14478 -82086 93686 98845 -159125 -129986 183626 146659
132A46659l35447K5457L23548l946k71372p020J88994r63q8836K7196n728o0036
$$ 146659 -188788 -163331 160217 156271 -115101 -122121 66873 65910 -22926 4270 -1458 -61494
144f1494Q1515R6399j24173j31645J29305J53662j11163j56574Q2732J35834n8237
$$ -61494 20021 116420 -7753 -139398 -10093 143569 32406 -124168 -41436 94398 36161
155C6161r3747L6532L1416k1850L5342J0615r0458J328J22445j5603j28766L1482
$$ 36161 -57586 -21054 10362 -11488 23854 34469 -55989 -54661 67784 52181 -76585 -45103
167d5103J17995m7220r3356O8987O8545r2505m7377J13918L1183j23424j6280
$$ -45103 72892 25672 -67684 1303 69848 -22657 -70034 43884 75067 -48357 -64637
178f4637J18204J313r7284J3485O2257l4841k4590O2353r266r6453L1431J29599
$$ -64637 53567 54880 -42404 -28919 33338 -1503 -26093 36260 26994 -69459 -38028 91571
190I1571m4166j57114M4074J68748l4123j55111J7906J18477n54o4026j1007M881
$$ 91571 47405 -109709 -65635 103113 68990 -86121 -68215 50262 49708 -14318 -25325 -20444
202b0444J4316N1901k077r4124k0919J18899M8955j24158p1981J11828Q2594q4907
$$ -20444 -6128 45773 43696 -50428 -71347 47552 96507 -27651 -99632 12196 94790 9883
214I883p8671M8034N5195j0619k0872k1604k0467M1445N9526n0784r0391M8405
$$ 9883 -68788 -20754 34441 23822 2950 -18654 -39121 2324 61850 11066 -79325 -30920
226c0920J06169l8845j03792K8361Q6222j7967n6192J1930K3248r226Q987J2863
$$ -30920 75249 36404 -67388 -39027 47195 29228 -26964 -15034 8214 -1012 7975 20838
238B0838l2601j9399M6792K7458n2420l3515N2072L3205m8217k7009M1842J2228
$$ 20838 -11763 -31162 15630 43088 -9332 -42847 9225 42430 -5787 -32796 9046 21274
250B1274l6310M678K9470k2061k4438L5548J7813m3503j1034M4850M066l9239
$$ 21274 -15036 -10358 19112 -2949 -27387 8161 25974 -17529 -28563 16287 20353 -18886
262a8886M614L0119j2288j7360K1242O131k7957L787L4170r261l7943J1647L9097
$$ -18886 -14272 15847 3559 -13801 7441 13572 -14385 -10598 23572 14311 -23632 -11985 27112
275B7112j2156l7409J1668L1902j2776k3429J3459R976j4762L663J4895j8831
$$ 27112 14956 -22453 -10785 21117 8341 -15088 -1629 8347 -6415 -2752 12143 -6688
287f688j4827L0985J2956l8112j1958M1190J0569l7911q166L1852N897k1282k350
$$ -6688 -21515 9470 22426 -15686 -27644 13546 24115 -13796 -21962 9890 15787 -5495 -7845
300g845J1369j192r77O410o915j2572J2678K0000j6555k6540J8190K8948j8357
$$ -7845 3524 2332 1355 7765 850 -11722 956 20956 4401 -22139 -3949 24999 6642
313F642k9072J6092K3804j4780j5278J0555M930p459N879L305j4447kK0858j359
$$ 6642 -22430 -6338 17466 2686 -12592 -2037 2893 -4566 1313 4618 -9829 -9831 11027 9668
327I668k3478K478K3632j072k0180L5J7302Q54j2336l80Q288j863l892M263n49
$$ 9668 -13810 -11332 12300 11228 -8952 -8917 8385 9239 -3097 -3477 4811 2948 -944 3319 2770
342B770p271M303R358r448j1308J2317J0548j4891r187J4553N966j2533k060Q523
$$ 2770 -4501 -198 9160 -288 -11596 721 11269 -3622 -12809 1744 7710 -4823 -6883 1640
356A640j071m118M381M02n823K657P779k922q370K792J0070j007j0107m97R688
$$ 1640 569 -3549 832 1234 -4589 -1932 5847 2925 -5445 -2653 7417 6410 -3697 -4194 5494
371E494j56o460P72K404m137J780O986o206j0521P539J1603p359j1619M138R878
$$ 5494 5338 -1122 -350 2054 -2083 -303 6683 477 -10044 -2505 9098 1739 -9880 -5742 4136
386D136l93o022m146J219P535M672p198q664M633J1655J819j1156q679R242J4322
$$ 4136 3743 -2279 -6425 -5206 2329 7001 -197 -8861 -4228 7427 9246 -1910 -10589 -1347 12975
401A2975l276j7166k931J4820R002q108j5104k035J7856J1189j7553j9070J2855
$$ 12975 9699 -7467 -10398 4422 13424 5316 -9788 -11823 6033 17222 -331 -19401 -6546
414f546K1169o328j8614k222J1313R776q05j2959j0158J1349J9889m515k4271
$$ -6546 14623 8295 -10319 -12541 -1228 8548 7743 -5216 -15374 -4025 15864 11349 -12922
427a2922m431K4363J5499j8917k3683J0931K7278j244k5297o468J7161J0867p313
$$ -12922 -17353 7010 22509 3592 -20091 -9160 18118 16874 -8423 -14891 2270 13137 5824
440E824j0568n270N021J4803L651j9676j3784J6652K1716q464k8017k569K9153
$$ 5824 -4744 -10014 -4993 9810 13461 -6215 -19999 -3347 18369 9905 -18112 -20681 8472
453H472J3971k4027k1131J6068K2259n412j7651k731J0432Q046J21p322r814M07
$$ 8472 22443 -1584 -22715 -6647 15612 10200 -7451 -10182 250 8296 8417 1095 -8719 -8312
467h312J6010J1238j7338k3467J3774L3207q057l9187j158L7603Q501k9983j2164
$$ -8312 7698 18936 1598 -21869 -8095 25112 17055 -22132 -23290 14313 22814 -7169 -19333
480a9333J8372R983p787l198j497o086O336J7703l706k7336m404L3864J5843l4233
$$ -19333 -961 9022 1235 -1963 -3460 -9546 -3210 14493 10787 -16549 -20953 12911 28754 -5479
494e479k6764L1784L4628k4207l5622J3752K9220n011j7599k67M140P22P089L609
$$ -5479 -32243 -459 34169 9962 -25660 -11908 17312 12301 -5298 -5565 -1425 -703 6386 9995
508I995j6572j3216J9016K3187j4002l2474N051L7172N252l7573j5611L3676K3441
$$ 9995 -6577 -19793 -777 22410 8408 -24066 -19015 18157 23409 -14164 -29775 3901 27342
521B7342k4414k4084J5454J8536q692q522O709k250q069J2909J4970k0401k5329
$$ 27342 2928 -21156 -5702 12834 4142 -4380 2329 79 -7990 4919 19889 -512 -25841
534b5841K1934L4264j9260m0003J3662M0519o735l8116l94K9379L182j8279l44
$$ -25841 -3907 30357 11097 -28906 -15244 25275 18540 -19576 -19970 9409 12591 -5688 -6032
547f032R147p618l279J8427O19k9769k267M0909Q740m4915j5792M2490K1319l4702
$$ -6032 3115 -4503 -7782 10645 11264 -18505 -20772 20137 28877 -16038 -31830 10660 31979 -2723
561b723k3278K3211K3434r667j9203j857R951P299m68o505q071l84J3955J0623
$$ -2723 -26001 -2790 20644 10977 -8226 -10083 -132 7167 6699 194 -7877 -8261 5694 16317
575A6317j6979k4332J4009L5552p799m0035NL9992P613l5032j4467K7019J8456
$$ 16317 -662 -24994 -10985 24567 16768 -23267 -23262 16730 24343 -10689 -25156 1863 20319
588B0319j5823j6428P236J1263k520l674J899n170m550J4925J0528k2454j8061
$$ 20319 4496 -11932 -4696 6567 4047 373 2272 -2898 -7448 7477 18005 -4449 -22510
601b2510K4717K2181k3761k4421K0496K3804j6065k1489J0766J5459p808q757
$$ -22510 2207 24388 627 -23794 -3298 20506 4441 -17048 -6282 9177 1369 -7388
613g388P538K837p503J658R621m137j2130M692J4298j918j3328p30J1530L441
$$ -7388 150 2987 -4516 -2858 6763 2626 -9504 -4812 9486 7568 -5760 -6490 5040 8481
627H481r720n063O768N740l691m585J896J846l674O43M021k618o209M818Q424
$$ 8481 -1239 -6302 466 6206 2515 -2070 -174 1672 -2002 -1359 2662 44 -6165 -1347 7077
642G077n805j1061L749J1428K15j0525k250R736N003r188o328Q310O013o344k409
$$ 7077 1272 -9789 -6040 5388 5603 -4922 -7172 2564 7567 -1621 -7949 361 6374 30 -2379
657b379N871j904m239N222K266p886j031R936q8j0532p17Q893M07p221j037N642
$$ -2379 3492 1588 -2651 2571 4837 -3049 -4080 5856 5768 -4764 -5481 3412 3819 -3402 -4439 1203
673A203J105l669k026K569J845j661k623K367L123j821j583R22R80J81Jj437m69
$$ 1203 2308 -1361 -3387 -818 1027 -634 -3257 -890 2233 412 -1171 -249 731 912 913 -524 -993
690i93L343J294l843j523K716J831k045k478J0L227J663l831l970K914M312p72
$$ -993 2350 3644 -199 -1722 994 2825 780 -1698 -1688 1539 3202 -629 -4599 -1685 2627 1855
706A855n504r31N485K907m724m334L465N145j092m610k72L706K298j635l921m56
$$ 1855 -3649 -4580 905 3812 -912 -5246 -1781 3364 2272 -2338 -2610 1096 3394 1759 -2162 -2618
722b618N297K841n210m462M024N445l341m487J54L500J913k149m160P57M479L39
$$ -2618 2679 5520 310 -4152 -128 5317 1976 -2511 -2357 1143 3056 907 -3253 -2496 1983 2322
738B322n135j196L655K405j710k578p87L056K707k415l128K133L627j596k037
$$ 2322 -2813 -4009 -354 2051 341 -2237 -3024 32 2739 324 -2804 -671 2956 1360 -677
753f77K66J447Q28n82j554J68J437O57k379o57J313P02r00n91m9n08R86j05j100
$$ -677 -411 1036 1864 1282 -272 -104 1333 1990 -389 -1046 267 969 69 -522 -571 -1079 -93 -198 -1298
772a298K70O03m03l47J086o3m86K93P28M2K47m69k60R73K63r85m7Q30L39j031
$$ -1298 -1028 -425 -828 -1175 -89 -152 -638 -345 383 425 672 203 -57 916 1179 194 147 977 1316 285
792B85j07J90J34p7l14q11o7J038k19j186l0P16P4l35j33n3P91j03j038P90J713
$$ 285 178 368 502 425 111 -700 -767 271 52 -1134 -1164 -448 -374 -709 -842 -895 -104 -207 -1245 -455 1258
813A258q99j238J143J004o62n41N60K25l4N1l82m78N45J066j337j495O67J601
$$ 1258 359 -879 264 1268 606 65 625 850 816 867 485 7 552 1618 281 -1214 -547 1054
831A054n65j821m98J531J150j753j194Q11J704m45l11n39j60K078Q12k488j230
$$ 1054 489 -1332 -1830 -299 851 -902 -2096 -1285 419 -26 -337 -876 -1036 1042 1854 -634 -1864
848a864L111J851k755k032K082J682q74j138j28l2Q70Q71j430j835Q30K062n44
$$ -1864 1247 3098 343 -1689 393 2075 1201 63 -65 -97 773 1644 214 -1621 -791 1271 727
865G27k569k32K475K19j892m92J412Q7j26M97o85r24J572K168j900j832K008J698
$$ 727 -1842 -2074 401 620 -1272 -1764 -352 -265 -391 106 -579 -1503 69 2237 337 -1495 513 2211
883B211j546q98J604o13j467J758J120k404j823K805K070l844k472L838K425l800
$$ 2211 665 -233 1371 758 -709 1049 2169 -235 -2058 747 2817 -1027 -3499 339 2764 -1036
899a036k433L626J394l613J82L906k555l167M522L237n206l099N763L153n397
$$ -1036 -3469 157 1551 -2062 -1880 2026 -529 -3696 826 4063 -1143 -4242 1521 4674 -723
914g23k184M282J914l159j300J756N14p23j86L12o06l53Q05L92p85j767J49K097
$$ -723 -2907 1375 3289 130 -1170 586 1100 377 191 503 -103 -456 349 741 -44 -1811 -1662 435
932D35N44j427k094J199L306q48m261N42N690m27n790J525N611k641m856M716
$$ 435 979 -448 -2542 -1343 1963 1115 -3146 -2604 3086 2659 -3131 -1606 4005 1364 -3492 1224
948A224L842o322l007Q303K078j0060k202J1094J900j1957j213J1100K23j0573
$$ 1224 5066 -1256 -4263 4040 6118 -3942 -6144 4950 6850 -5107 -6320 4780 5003 -5570
962e570R30R390l129p472M855O394o544n440P815M659q236l741Q050M589p275
$$ -5570 -4640 4750 1621 -5851 -996 5398 -1146 -6586 1229 5888 -2348 -6089 1961 6550 -725
977g25m203N527M241m078l693L293L328k763k615K227J221k840r43L175J131l155
$$ -725 -4928 599 4840 762 -2931 362 3690 927 -1688 539 1760 -1080 -2023 1152 2283 -872
993h72k377K966L477l446n152L402P782m204q623M773R228o071q625P823P466
$$ -872 -3249 -283 3194 -252 -5404 -2002 5780 1576 -7047 -2274 6954 883 -7742 81 7547
1008G547r128n060J1542K524j3010o62J4408j134j4825K465J4171l071j3667L055
$$ 7547 -1581 -6641 4901 7425 -5585 -6247 8161 7027 -7798 -5333 8838 5767 -7900 -4845
1022d845J1974m226r780M786Q335o206o455O885M306q218l311J0090K530r307
$$ -4845 7129 2903 -6877 -2091 6244 38 -6417 468 4774 -3444 -6755 3335 5865 -3442
1036c442k505Q942K048p733k012O772K023l790j739J929O07n73l60o57J113J259
$$ -3442 -5947 2995 5043 -2690 -4702 2070 4093 303 -1436 493 1100 527 167 -490 623 1882
1052A882k072p65K252o61m131K174N951m122p326N961P910p894q094Q902P442
$$ 1882 -190 -955 1297 636 -3495 -1321 4630 508 -6818 -857 7053 -841 -8935 -33 7409
1067G409r275m958R897K878r904p27R509r10r067K502R990m269r502M610R109
$$ 7409 -1866 -6824 3073 5951 -3953 -4680 4829 3919 -5148 -2646 7344 3075 -6427 -1817 7292
1082G292n802q427O474P515p388n217O471L027p414m80P470j214p037L031N782
$$ 7292 1490 -6937 -463 7052 -336 -5553 918 3945 -3469 -3949 3521 2307 -4730 -1699 4083
1097D083m016m936M786L056l518r33L084p41k199K352K53l010J493M001k309l862
$$ 4083 67 -4869 -83 2973 -545 -1478 1606 865 -1334 1018 1271 -1739 -246 3755 1446 -2416
1113b416K713K777l971j603M437R1m789J556M717l799m500M431M081n261l071
$$ -2416 297 3074 -897 -2500 1937 2028 -2761 -1205 3512 -287 -4787 -356 3725 -1536 -4607
1128d607N969K461o501j470O090O19n883J649N646k558n249L923M734n546l476
$$ -4607 1362 3823 -2678 -4148 1942 2561 -3322 -1673 3973 1415 -3834 89 4823 -723 -4199
1143d199O345K670o869o72O660j559o806L103N778m699l997N553K083o446m92
$$ -4199 2146 4816 -2053 -2725 3935 2376 -4430 -1327 4451 -248 -4245 1308 3391 -3055 -3547
1158c547O468j540n281L060M038l811k753M481J475m817O2N204j231m034J525
$$ -3547 2921 1381 -3900 -840 3198 -613 -3366 1115 2590 -2227 -2165 3039 1808 -2226 -701
1173g01L496k561k499L489J520l569q41L748n55m174J712L449k491l055L072K569
$$ -701 2795 234 -2265 1224 2744 -825 -1666 2082 1527 -2647 -935 2514 23 -3032 40 2609
1189B609m703j008M607J12m984J872M883l442l501M061K674m478j431N244M2m844
$$ 2609 -2094 -3102 1505 1617 -3367 -1495 3388 -54 -3555 506 3180 -1298 -2729 2515 2557 -2287
1205b287J448M651k898m492M182L315m761k067N115O55n075n2M472j309l825K064
$$ -2287 -839 3812 914 -3578 604 3919 -842 -2909 2206 2861 -2214 -2266 2206 897 -2928 -864
1221h64L110l379j733L690J113m212r8M550j043l604J617L273j776k691K612J818
$$ -864 2246 -1133 -2866 824 1937 -2275 -2373 2177 1134 -2470 -853 2420 644 -2047 565 2383
1237B383l106l85L288n67l510J631L355k735l218L446K054l864j007L599m93l074
$$ 2383 -723 -1108 2180 1613 -1897 -266 3089 354 -2864 582 2636 -1228 -2235 1364 871 -2203
1253b203J113L032k698j835L255J114l439o27M092n49l167R01K903j298k433K223
$$ -2203 -1090 1942 -756 -2591 664 1778 -1661 -2288 1804 1255 -1912 -1011 1892 594 -1839 384
1269C84K049k658q96K615M33l459N67L497j413l105J722K621k854j600K916L99
$$ 384 2433 -225 -1121 1494 1927 -1532 -965 2532 1119 -1986 -264 2357 -497 -2097 819 1218
1285A218l116K44L135j249k415J596K205k234j453K279J303k224n32K439k26j990
$$ 1218 -1898 -1654 1481 232 -2183 -587 1618 -616 -2069 210 1513 -711 -1243 1196 970 -1020
1301a020J094J874j741j615K359R91k364m89J997K15k257M55J850j557j185J751
$$ -1020 74 1948 207 -1408 951 1942 -422 -911 1086 1301 -956 -501 1349 -208 -1393 358
1317C58J31j886L90J653p05j687J356J256j279o27J145N73j361Q5J714k33j526
$$ 358 489 -1397 -1007 646 -59 -1746 -390 866 -413 -1040 105 678 -683 -598 1116 883 -643
1334f43M79J803j264j166J039J111j507j035K087n3j771M57J481r99j249P65J438
$$ -643 -164 1639 375 -791 248 1359 -148 -1183 904 851 -920 -463 1018 19 -1230 -465 973
1351I73j369p45J044M34q55k3M63P3m32N18L64n83m0M08M65m65j72P54k94n43
$$ 973 -396 -1141 -97 337 -518 -541 -78 -5 -437 81 445 -138 -178 230 695 230 58 812 518 -25
1371b5L38J00m85j36O97l84q34O10M22m60p63M08O29k34p59Q07N2m9l53M13M03
$$ -25 313 413 -72 -208 489 105 -729 -119 303 -157 -920 -512 117 -117 -876 -69 -17 -66 -419 -6 397
1392C97n84l96P47K08k48m38P77L98o05m33Q67K32o01p54M53R14o03j024L17Q66
$$ 397 -187 -583 164 372 124 -314 463 861 256 -177 690 922 321 -433 20 934 331 -693 -376 490
1412D90n58r53Q97N41j389l26J343N82j435j00J319K38j290jJ149M49j176l17
$$ 490 -68 -1021 -124 417 -972 -1298 45 627 -808 -908 411 649 -641 -642 507 956 -220 -537
1430e37J214O44j218n35J397N5j534m3J766l66j891K63J846m17j874L59J892l36
$$ -537 677 1321 103 -432 965 1020 -514 -557 1209 843 -1048 -785 1061 644 -1230 -871 1021 685
1448F85k275K93K369n70k072M90K142k44k288Q20J978o67k180J386K145j580k160
$$ 685 -1590 -1297 1072 502 -1570 -1080 1062 818 -1470 -650 1328 661 -1519 -133 2012 432 -1728
1465a728J637K620k402k056K376J999k504k089K964J252l121j083L012O26k666
$$ -1728 -91 2529 127 -1929 447 2446 -58 -2147 817 2069 -1052 -2135 877 1503 -1163
1480a163l70K329j32k103j68K176L02k072JK367J84k250k23K314N25k645k45K998
$$ -1163 -1533 796 664 -1439 -1607 569 871 -1201 -1200 1167 1351 -899 -1122 1192 1717 -928 -1173 1825
1498A825m88k312K12J835k12j966R47J576p08k197M68K285o61k327L59K901n91
$$ 1825 1337 -975 -763 1072 860 -1106 -159 1417 709 -1488 -1020 1265 604 -1723 -1364 1537 946
1515I46l146P53L650j607l087J625L679k561k683K944J794k823j586L278J209
$$ 946 -2200 -1447 2203 596 -2491 -866 2813 252 -2431 513 2307 -516 -2102 1176 2385
1530B385k675j079K798K81k797l01K580l35j802J27J576r0j836j16J669j93j262
$$ 2385 -290 -1369 1429 1710 -1087 -1388 1192 857 -945 -818 758 668 -1168 -1284 385 192 -1070
1547a070M99J285m35j531L98J487k76j126M68J108K09j201l90J273J11q28k88
$$ -1070 -571 714 279 -1252 -854 633 357 -769 -301 807 1016 -185 -575 698 809 -19 -307
1564c07J113O47j749j001J959L02k134J68K343l25k995J185K413j887k340K364
$$ -307 806 1453 -296 -1297 662 964 -1170 -1002 1341 1016 -1979 -794 1619 -268 -2608 -244
1580b44K128k365j262K415O99k585J23K244p8j806M43J709n29j480K97J467o26
$$ -244 1884 -481 -1743 672 1371 -1214 -1091 1153 1075 -731 -288 1421 892 -588 -291 1176 550
1597E50j484J017J252j190j306J166N86j470J74J201M3j136L37O19j099l96J172
$$ 550 -934 83 1335 145 -1161 5 591 -879 -705 496 539 -597 -260 359 -740 -1136 36
1614C6K67q81O92N42j055m04J254k7r70P56J166q73j238J098O86j566j95J916
$$ 36 303 -578 114 656 -399 -803 451 424 -546 210 1376 503 -735 363 1049 -517 -712 1204
1632A204l26j876Q42J394j520j271J713N31j500j49J331K84k033N49J597k09j552
$$ 1204 878 -998 -156 1238 -282 -1553 160 691 -809 -958 373 657 -1376 -827 770 561 -991
1649i91N51J362o47j412J106J313j592o55J872M01j532l56J900o21j713N99J666
$$ -991 -440 922 275 -1137 -31 1282 -310 -965 907 1308 -224 -580 1320 699 -1014 -415 1251
1666A251j032j128J281M43j849J08J940r10j062J047N73j564PJ133j09q86O96
$$ 1251 219 -909 372 815 -1034 -926 1014 104 -958 89 662 -902 -895 238 129 -757 -61
1683f1Q98r25n28J084K22j120P5J411m14j089K25J271n85j118P46M52p08n75J147
$$ -61 837 -88 -616 468 690 -430 -355 1056 642 -447 -222 1049 464 -654 92 544 -164 -739 408
1702D08J49j332k28J605k07j648O26J704j040j347J422N56j396l68J749L28j942
$$ 408 557 -775 -1003 602 395 -1253 -627 1077 37 -1310 112 668 -728 -1096 653 981 -961
1719i61Q34J237j033r62J233Q38j244o97J454j02j156L71Q31j046n46Q76N57r93
$$ -961 -127 1110 77 -885 348 1186 -58 -755 699 597 -559 -188 643 -403 -949 -73 484 -509
1737e09n84J296p2p56K00Q58m44q80Q53M96q69k91J081M52j112Q0J233o03j053
$$ -509 -1093 203 131 -625 -425 433 -11 -891 -38 458 -411 -702 379 831 -281 -201 1032 429 -624
1756f24P90R10q94p92J333j9j428L62J014m69j145P87Q78j206n70J476m6j212
$$ -624 166 1076 182 -610 723 704 -724 -362 652 183 -962 -175 703 -503 -1073 403 357 -855
1774h55J74J048k27q71O99P63p95o15R70O26j381K1J195j68j119M98J281j144
$$ -855 -681 367 140 -731 -32 731 -64 -679 291 917 -464 -443 752 584 -535 -37 1244 100
1792A00q67R65P22j091p03J441k01j359M43J202o53r20O17P46o29p68J153K15
$$ 100 -767 198 920 -171 -874 567 366 -993 -550 652 -1 -921 -304 442 -187 -955 198 413
1810D13r26J69O83j35p49M76R55r02j95Q29Rr12K17P03k73q27J020K2j025l24
$$ 413 -513 -344 339 204 -545 -69 886 -16 -211 618 627 -285 -68 635 362 -465 555 577 -448 -772
1830g72J253k77q81J14J170q30q41R94Q11r88n33J016N35j346L9J282k90j071
$$ -772 481 204 -677 -563 607 -223 -1064 -70 741 -247 -780 236 771 -575 -536 746 456 -615
1848f15L73J352q32p15O82P19r38p37J316k23q46K47P96o22p72R33J97q74j30
$$ -615 -242 1110 278 -437 245 964 26 -711 605 382 -464 -217 579 -43 -815 118 315 -559 -689
1867f89P73p3o52L91R17q58l43O42L64r82K81O74l00o11N96J038r26p86R88N02
$$ -689 84 11 -641 -250 667 -191 -534 108 472 -510 -229 445 145 -466 130 1168 242 -544 444 946
1887I46j105l34R00M44j423j56J182j06j155N41Q26o69l71K14O88o92m94O84K38
$$ 946 -159 -493 407 851 -572 -728 454 348 -807 -266 560 -109 -480 -266 422 -270 -764 -80 158
1906A58j24o13P35K55o43J87L42m09K56P4k44K17K79r1m40K03N65p90l09O27J26
$$ 158 34 -579 156 411 -232 -45 297 -112 144 218 -26 191 470 379 -61 142 707 -83 -392 235 361
1927C61j019J53P04Q0j223L93R45l88n97L49O79m62p16N04R48m24p57P12N64q98
$$ 361 -658 -505 199 279 -944 -551 394 6 -591 -242 437 -25 -741 -237 711 287 -470 242 806 -92
1947i2l44Q54M15p13o47J129L81j305m09J198J89j223l58J342j44j114NR89J06
$$ -92 -436 418 833 120 -527 602 983 -322 -731 467 656 -567 -925 417 273 -841 -836 153 259
1966B59p46r3J139r4p41j17P36j10o57L21Q42m3j156J44J238m54r76L39J094o91
$$ 259 -487 -580 559 465 -276 -393 343 233 -424 -103 739 696 -460 -316 922 468 -508 -169 925 234
1986B34p99O59N21o64o96R02N36r15m43M90L32m79l76N26N95n47m14N72M61n33
$$ 234 -565 94 615 -49 -745 157 693 -222 -665 -175 157 -322 -698 -172 423 -124 -538 34 495 -38
2006c8p35O36Q49p37k54Q95J01p93n45J029M51q04k89N87M19j052n55J041N27
$$ -38 -773 -137 712 -25 -279 616 717 -76 -621 408 859 55 -234 353 772 -280 -835 206 733
2025G33j334m02J282K74j313m2J329m45j170O06J504q63j093J215P16j220n48
$$ 733 -601 -1003 279 553 -760 -802 527 82 -1088 -482 1022 159 -934 281 997 -223 -771
2042g71J170N10j097J02O79q3j016L37N12k11m00N90j34k86m50J38L22K16j64
$$ -771 399 909 -188 -86 593 510 -506 -169 343 132 -268 322 188 -98 -548 -410 -88 128 -36
2061c6o66O28K18k39n32O24K6m6Qn7K90p1j75j8O32m49m60O44L92q12q07J273
$$ -36 -702 -74 144 -95 -627 -3 23 -23 -15 -72 218 147 -28 -46 586 137 -323 321 713 -99 -906 367
2083C67L43j096l30J594j84j444N2J241n85j174J106Q82r91o61J066K66j361K14
$$ 367 710 -386 -716 878 694 -750 -698 543 -42 -1216 -110 772 -219 -880 186 452 -909 -695
2101f95J250l10o96Q9Q70p4o78qQ99l56k67M78j82n20k43Q49k62k26J32N32k66
$$ -695 555 245 -451 -362 508 434 -244 -252 647 291 24 502 320 -200 -443 406 144 -82 50 582 316
2122C16m07R1j5l90K3O83l47m51Q49j80o89N6J200k64j134P15Q21j135l52J108
$$ 316 -91 0 -15 -405 -382 301 -46 -497 352 172 -517 -461 739 475 -659 56 877 -258 -610 498
2142D98J72j267K66J267j82j251O11N95o23r11P76Q13j142k36N28M8m22K0M73
$$ 498 670 -597 -331 936 754 -497 114 709 86 -825 -49 764 -378 -614 -86 -38 -460 -440 33
2161C3r3l14K67L87l55l28K3P17j15n12N61P9k88N5P9K5m47M10K69n54j22M85
$$ 33 -60 -374 -107 280 -75 -403 -380 337 222 -290 271 350 62 117 196 221 -226 184 453 -101 -223 262
2183B62l6r85N64O65o28k18Q41j08q10rP72n45m24O56N69o49l61N73K32m66k51
$$ 262 226 -759 -195 470 -158 -376 465 357 -453 -462 310 -235 -659 -3 566 -83 -444 129 361 -105 -356
2204c56J161l49n78J84M21n61m58M72Q10p00m39O18O4n79J84K29j36k66M3M88
$$ -356 805 456 -122 62 483 -78 -536 -64 746 46 -393 225 289 -290 -106 123 -13 -279 -236 252
2224B52n23l6M14rl54k19M94J60m90M26j24J30n93J079J66j200O01O24p13n14
$$ 252 -271 -307 107 98 -256 -475 19 179 -311 115 -9 121 -472 607 773 -427 174 798 85 -429
2244d29N47M09j044K56P67j19q22Q5Q28n70l37L12N19m60q30P91P3l32K79J91
$$ -429 118 527 -517 -261 506 387 -435 -350 478 -92 -429 -117 402 -58 -888 -97 -24 -356 -77 114
2264A14P3m28J79M59m55j08L83L14l56k42K22L2o28L79L05k50m44N75j42j42l4
$$ 114 187 -241 -62 397 -58 -166 217 531 175 -67 155 187 -441 -62 243 -7 -451 124 -18 -160 -194
2285a94L47J4o65K82O60l72o92O43L03m32j91N14K31q83L77O40l52m04L98K89
$$ -194 153 167 -498 -216 444 72 -620 23 326 -106 -297 217 448 -435 -58 582 230 -174 224 513
2305E13m30k89N51P3o26J4O96n16k70M21k7r3o4KJ19k72J24K7j44N9K57J19n44
$$ 513 83 -206 345 418 -208 -194 502 -14 -284 137 110 17 -47 -45 74 -198 -74 -47 -191 -132 125 244 -300
2328c00O9O07m7n41K73M74m47l90O34N3k80k49L11K02o10M3L78P7o97L38N88k94
$$ -300 -231 376 329 -212 61 535 88 -302 332 385 105 -144 167 369 -241 -198 180 257 -440 -102 486 192
2350A92n37P7N26l29j8J03o4p9J03J18J04m72P0M84l31K2M50m63K60n3J94k13
$$ 192 -345 -268 258 -71 -89 14 -50 -129 -26 92 196 -276 -206 278 -53 -31 419 -44 216 163 357 144
2372A44k2K12j73k94J7L85K6o61L84J26j73l43N76P1q47K56M20j19k19J20M73
$$ 144 122 334 161 -133 -116 269 295 -366 18 144 -29 -372 204 275 -572 -316 104 -15 -234 -114 359
2393C59j87n46L12M30k26m02K85O14q13N1M26L7m85o3K13L6k15j28J95M92n55
$$ 359 172 -374 -62 368 142 -260 25 639 -174 -123 303 340 -145 -208 5 41 -174 -302 -107 385 -170
2414a70K59j22J31l83N7J72j21K52Ok74K08j89K37k59N13l39j88K91K21j81k34
$$ -170 89 -33 98 -285 -228 -56 -177 75 81 -193 15 -174 63 -196 317 -22 -210 81 302 121 -113
2435a13M81J96n74q2M88q3n52j67O94o2o96Q5O60m3m63q4N03j53o14N08O6J76
$$ -113 368 564 -10 -92 396 313 -239 -406 288 226 -470 -385 275 232 -231 -315 188 35 -579 -71 -5 171
2457A71k39k58P69n53r0L9L71J16m87L00J91l23k43K47M22n72q8L18K9o0m01K33
$$ 171 -68 -326 443 -110 -200 -161 210 326 -161 139 330 7 -236 11 433 -139 -227 91 120 60 -341 -108
2479a08K37j83j97J78k73K56l51K90K57k62J44J10L73o98KL87J55m15J01K35j40
$$ -108 129 -54 -251 -73 -346 -90 -441 -151 106 -156 -12 98 471 -227 -225 162 317 -98 3 238 98
2500I8k90N7L24M6l67K91q1M02m98l36L20R2j84j05K41J18k08j11M12l07j90P0
$$ 98 -192 -135 189 235 -132 159 78 480 -18 -354 -34 58 -126 -231 10 128 -80 -191 221 -86 -276 -206
2522b06P73k67k64m7J86k75j60L56K07m3l02J79J08j46k72o6L45o1on4K40k63
$$ -206 567 300 36 -11 175 -100 -260 96 303 260 -42 137 245 99 -173 -239 106 45 39 -15 225 -38
2544c8n57O92N0m43k86O60K11o36J97L26j44l1K15J6j17j17J08j07K11k0j51J06
$$ -38 -595 97 147 -296 -582 78 289 -347 -150 176 32 1 216 232 115 -2 106 -1 210 190 39 145
2566A45j71K12m35K15N44n66p4j12N24m93j73K80p4l6p1J69K13j03pj02K99l01
$$ 145 -26 186 -249 -34 510 -56 -130 -242 282 -211 -384 -104 -178 -214 -285 -116 97 -6 -13 -115 184 -117
2588a17l30J033O9p16k8O25k32q37M41M89m85j93M71pl02j08L31p1m29K81K57
$$ -117 -447 586 655 -61 -89 536 304 -533 -92 397 -88 -281 190 183 -119 -227 104 33 -396 -115 142
2609A42k62n39N64M1j05J90P4j48M9Q1R2m45M59k41J77j19J04K37o61K33L10l67
$$ 142 -120 -659 -95 -54 -159 31 105 -43 6 87 179 -266 193 -48 129 10 114 351 -310 -77 233 -134
2631a34k56J26K93J43l62Q7J74M3o73L82O75k83o64L56K59o83O7P65j02k54l49
$$ -134 -390 -264 29 172 -190 -103 71 114 -559 -177 498 215 -449 -93 166 -517 -450 315 213 -41 -390
2652c90O69r1n16L68O8k62k16Q52l00l21J18L06k55k80L56jk71j0K56o9p1R2k47
$$ -390 279 188 -328 40 108 -154 -370 482 182 -139 -21 285 30 -250 106 105 -166 -176 80 11 -60 32 -215
2675b15J59M9r7k6j49K1N1L51r7J77k28q4l25K65L36j61k11N55o6m05J66J18k94
$$ -215 -56 -7 -104 -130 -279 -258 -207 144 47 224 -4 -88 -413 -148 188 27 -184 371 305 -100 66 184 -110
2698a10j19J21L08l46r9P1L84m22k10N43j68j87J12M15l53j75J12L71m74m7M64
$$ -110 -229 -108 200 -146 -245 -174 210 -212 -422 121 -47 -234 -122 293 -60 -235 -123 248 -226 -273 191
2719A91j7l74K43o2m7J18P0L7r3L47j83qk95O9J52k7l69J68J30j2M1P2j49l04
$$ 191 174 -200 43 -19 -66 52 122 159 66 413 230 222 -73 -4 148 121 -248 -80 50 38 79 151 2 -302
2743c02P7M93p03N2M55M2k02l98Q01r5j13k18M06l12k80M60M26o63k48L87J06
$$ -302 -225 268 -435 -383 72 114 -88 -486 315 220 107 -111 295 -17 -297 163 589 -74 -322 65 171
2764A71j86j90L28l23j8L00M0k33o8K44J0j49m1R5K41n34L00L17k79r3K00J36
$$ 171 -15 -205 123 -200 -218 82 122 -111 -179 65 75 -74 -115 -20 221 -313 -13 304 25 -68 132 268
2786B68m73K87J08m5k19pK86l00n2J42J48k01k18J80o9j56J38K51j02m34M97J91
$$ 268 -205 82 190 145 -74 -81 205 -95 -147 -5 143 -58 -276 -96 -165 -321 -183 68 -34 -468 29 220
2808B20o08QK72K58j99Q1K02r5k75K18L17l27j52K32K84q31L51J66r7j63L71k37
$$ 220 -388 -380 -108 150 -49 32 234 139 -136 82 399 72 -80 152 436 -395 -44 122 25 -138 233 -4
2830dk43j04N46k41l33L98J66j40l26J75M80m13j92L64J42l63o0K81j87j91N77
$$ -4 -247 -351 195 -46 -379 19 185 45 -281 -106 374 -39 -231 133 275 -88 -148 133 -54 -245 332
2851C32j39l28n3K85L09l57j32K56K7k13j13L26L3n64M2N94n30K1L45j71k87J97
$$ 332 193 -135 -188 97 406 49 -83 173 200 -13 -126 200 233 -331 -289 305 -225 -204 141 -30 -317 -120
2873a20K53j86j13K31l48J82K33o9l04j31L87P7j77P4J34K17p53J64Q25n72k54
$$ -120 133 -53 -166 65 -283 -101 132 63 -241 -372 15 92 -85 -11 123 340 -413 -249 576 4 -250
2894b50K20L08n31p7L14M65p05Q3L25p2l65l8K79J46j54q6O24o37N3q4L97j68
$$ -250 -30 278 -253 -330 -16 449 -256 -173 152 80 -285 -323 -44 102 -52 -138 486 -151 -98 -182 215 47
2916D7jpL0L6j08L26N0m47N2P6j16Q1k6m9k2J3j71K11j11L24k90J73M4j07k14
$$ 47 46 39 69 105 -3 323 373 -74 -22 54 -62 19 -7 -56 -78 -65 -236 -25 -136 188 -102 71 115 8 -206
2941b06K68J4J68l07k18N81M4m32O4K26r4k24R1K32k71M0lJ86l25k05K86J13m45
$$ -206 62 76 244 -63 -281 300 344 -88 -24 202 108 -116 -25 207 -64 -24 -27 159 -166 -371 -85 28 -417
2964d17J48M39k39j85jM82j74Lk16J75K16r3l37j4M65k19Q4P3m9p0j30R0J82r9
$$ -417 -269 170 -69 -254 -255 227 53 56 -160 15 231 138 -199 -213 252 33 117 190 141 71 -59 31 213 114
2988A14j1k9J27j89k24L50n6J32o71L24K48k92jN5M11n79J02L41k92Q4k90N21
$$ 114 103 74 201 12 -212 138 82 214 -457 -133 115 -177 -178 -123 288 -291 -189 152 -140 -56 -346 175
3010A75J18l51J06Q0j60P9J99J4K1m12J55J12M6l83R9Mj43n4M42J50k91r1k29
$$ 175 293 -58 48 128 -32 47 246 260 281 -131 24 136 182 -201 -102 -98 -241 -295 147 297 6 -85 -314
3033c14L30Q5l31J52j45M64k24l5j21j2%M89q6J0k17PK19K0o06K81J95j68k83
$$ -314 16 101 -230 -78 -223 241 17 -18 -139 -151 -151 338 252 262 45 52 271 291 -315 -34 161 -7 -290
$$ [...]
8191h0
##END NTUPLES=NMR FID
##END=
