##TITLE=1H_Pr End
 200.13MHz, CDCl3,
 8 sc
 
 30.5.2025
##JCAMPDX= 6.0         $$ Bruker NMR JCAMP-DX V2.0
##DATA TYPE= NMR FID
##DATA CLASS= NTUPLES
##ORIGIN= UXNMR, Bruker Analytische Messtechnik GmbH
##OWNER= pz
$$ XWIN-NMR		Version 3.5
$$ Fri May 30 16:16:27 2025 Russian Standard Time (UT+4h)  she@DPX200
##.OBSERVE FREQUENCY= 200.1313
##.OBSERVE NUCLEUS= ^1H
##.DELAY= (6, 6)
##.ACQUISITION MODE= SIMULTANEOUS
##.ACQUISITION SCHEME= undefined
##.AVERAGES= 8
##.DIGITISER RES= 18
##SPECTROMETER/DATA SYSTEM= spect
##.PULSE SEQUENCE= zg30
##.SOLVENT NAME= CDCl3
##.SHIFT REFERENCE= (INTERNAL, CDCl3, 0, 14.3821)
##AUDIT TRAIL= $$ (NUMBER, WHEN, WHO, WHERE, WHAT)
$$ ##TITLE= Audit trail, XWIN-NMR		Version 3.5
$$ ##JCAMPDX= 5.01
$$ ##ORIGIN= Bruker BioSpin GmbH
$$ ##OWNER= she
$$ F:/spectra/data/she/nmr/H-C/1/audita.txt
$$ ##AUDIT TRAIL=  $$ (NUMBER, WHEN, WHO, WHERE, WHAT)
(   1,<2025-05-30 16:14:50.56 +0400>,<she>,<DPX200>,
      <created by zg, POWCHK disabled, PULCHK disabled
       configuration hash MD5:
       00 E9 B6 7A A2 85 ED C7 34 08 36 98 17 FE 4E 26
       data hash MD5: 16K
       60 2C 40 D7 90 3D EB DD DF A3 94 4B B2 E4 59 98>)
$$ ##END=
$$ 
$$ hash MD5
$$ BC 78 E4 1B 6D C2 B7 D0 C3 D2 52 F5 0F 8B 84 C8
##$RELAX= 
##$RELAX= 
##$RELAX= 
##$RELAX= 
##$RELAX= 
##$RELAX= 
$$ Bruker specific parameters
$$ --------------------------
##$DU= <F:/spectra>
##$EXPNO= 1
##$NAME= <H-C>
##$PROCNO= 1
##$TYPE= <nmr>
##$USER= <she>
##$AMP= (0..31)
100 100 100 100 100 100 100 100 100 100 100 100 100 100 100 100 100 100 
100 100 100 100 100 100 100 100 100 100 100 100 100 100 
##$AQSEQ= 0
##$AQ_mod= 1
##$AUNM= <au_zg>
##$AUTOPOS= <>
##$BF1= 200.13
##$BF2= 200.13
##$BF3= 200.13
##$BF4= 200.13
##$BF5= 200.13
##$BF6= 200.13
##$BF7= 200.13
##$BF8= 200.13
##$BYTORDA= 1
##$CFDGTYP= 0
##$CFRGTYP= 5
##$CHEMSTR= <none>
##$CNST= (0..31)
1 1 145 1 1 1 1 1 1 1 1 1 1 1 1 1 1 1 1 1 1 1 1 1 1 1 1 1 1 1 1 1 
##$CPDPRG= <>
##$CPDPRG1= <>
##$CPDPRG2= <>
##$CPDPRG3= <>
##$CPDPRG4= <mlev>
##$CPDPRG5= <mlev>
##$CPDPRG6= <mlev>
##$CPDPRG7= <mlev>
##$CPDPRG8= <mlev>
##$CPDPRGB= <>
##$CPDPRGT= <>
##$D= (0..31)
0 0.7 0 0 0 0 0 0 0 0 0 0.03 0 0 0 0 0 0 0 0 0 0 0 0 0 0 0 0 0 0 0 0 
##$DATE= 1748607290
##$DBL= (0..7)
120 120 120 120 120 120 120 120 
##$DBP= (0..7)
150 150 150 150 150 150 150 150 
##$DBP07= 0
##$DBPNAM0= <>
##$DBPNAM1= <>
##$DBPNAM2= <>
##$DBPNAM3= <>
##$DBPNAM4= <>
##$DBPNAM5= <>
##$DBPNAM6= <>
##$DBPNAM7= <>
##$DBPOAL= (0..7)
0.5 0.5 0.5 0.5 0.5 0.5 0.5 0.5 
##$DBPOFFS= (0..7)
0 0 0 0 0 0 0 0 
##$DE= 6
##$DECBNUC= <off>
##$DECIM= 32
##$DECNUC= <off>
##$DECSTAT= 4
##$DIGMOD= 1
##$DIGTYP= 9
##$DL= (0..7)
0 120 120 120 120 120 120 120 
##$DP= (0..7)
150 150 150 150 150 150 150 150 
##$DP07= 0
##$DPNAME0= <>
##$DPNAME1= <>
##$DPNAME2= <>
##$DPNAME3= <>
##$DPNAME4= <>
##$DPNAME5= <>
##$DPNAME6= <>
##$DPNAME7= <>
##$DPOAL= (0..7)
0.5 0.5 0.5 0.5 0.5 0.5 0.5 0.5 
##$DPOFFS= (0..7)
0 0 0 0 0 0 0 0 
##$DQDMODE= 0
##$DR= 18
##$DS= 0
##$DSLIST= <SSSSSSSSSSSSSSS>
$$ [...]
##$SUBNAM0= <"">
##$SUBNAM1= <"">
##$SUBNAM2= <"">
##$SUBNAM3= <"">
##$SUBNAM4= <"">
##$SUBNAM5= <"">
##$SUBNAM6= <"">
##$SUBNAM7= <"">
##$SUBNAM8= <"">
##$SUBNAM9= <"">
##$SW= 18.0517328524113
##$SWIBOX= (0..15)
0 0 2 0 0 0 0 0 0 0 0 0 0 0 0 0 
##$SW_h= 3612.71676300578
##$TD= 16384
##$TD0= 1
##$TE= 0
##$TE2= 300
##$TE3= 300
##$TEG= 300
##$TL= (0..7)
0 120 120 120 120 120 120 120 
##$TP= (0..7)
150 150 150 150 150 150 150 150 
##$TP07= 0
##$TPNAME0= <>
##$TPNAME1= <>
##$TPNAME2= <>
##$TPNAME3= <>
##$TPNAME4= <>
##$TPNAME5= <>
##$TPNAME6= <>
##$TPNAME7= <>
##$TPOAL= (0..7)
0.5 0.5 0.5 0.5 0.5 0.5 0.5 0.5 
##$TPOFFS= (0..7)
0 0 0 0 0 0 0 0 
##$TUNHIN= 0
##$TUNHOUT= 0
##$TUNXOUT= 0
##$USERA1= <user>
##$USERA2= <user>
##$USERA3= <user>
##$USERA4= <user>
##$USERA5= <user>
##$V9= 5
##$VALIST= <valist>
##$VCLIST= <CCCCCCCCCCCCCCC>
##$VD= 0
##$VDLIST= <DDDDDDDDDDDDDDD>
##$VPLIST= <PPPPPPPPPPPPPPP>
##$VTLIST= <TTTTTTTTTTTTTTT>
##$WBST= 1024
##$WBSW= 4
##$XGAIN= (0..3)
0 0 0 0 
##$XL= 0
##$YL= 0
##$YMAX_a= 269067
##$YMIN_a= -306305
##$ZGOPTNS= <>
##$ZL1= 120
##$ZL2= 120
##$ZL3= 120
##$ZL4= 120
##$ABSF1= 10
##$ABSF2= 0
##$ABSG= 5
##$ABSL= 3
##$ALPHA= 0
##$AQORDER= 0
##$ASSFAC= 0
##$ASSFACI= 0
##$ASSFACX= 0
##$ASSWID= 0
##$AUNMP= <proc_1d>
##$AZFE= 0.1
##$AZFW= 0.1
##$BCFW= 1
##$BC_mod= 2
##$BYTORDP= 1
##$COROFFS= 0
##$CY= -3
##$DATMOD= 1
##$DC= 2
##$DFILT= <>
##$DTYPP= 0
##$F1P= 0
##$F2P= 0
##$FCOR= 0.5
##$FTSIZE= 0
##$FT_mod= 4
##$GAMMA= 1
##$GB= 0.15
##$INTBC= 1
##$INTSCL= 1
##$ISEN= 128
##$LB= 0.25
##$LEV0= 0
##$LPBIN= 0
##$MAXI= 10000
##$MC2= 0
##$MEAN= 0
##$ME_mod= 0
##$MI= 1.114404
##$NCOEF= 0
##$NC_proc= 0
##$NLEV= 6
##$NOISF1= 3.799351
##$NOISF2= 2.8
##$NSP= 1
##$NTH_PI= 0
##$NZP= 0
##$OFFSET= 14.38212
##$PC= 1
##$PHC0= -1551.115
##$PHC1= 8.592201
##$PH_mod= 1
##$PKNL= yes
##$PPARMOD= 0
##$PSCAL= 0
##$PSIGN= 0
##$REVERSE= no
##$SF= 200.129724274929
##$SI= 16384
##$SIGF1= 3
##$SIGF2= 2
##$SINO= 400
##$SIOLD= 16384
##$SREGLST= <1H.CDCl3>
##$SSB= 0
##$STSI= 0
##$STSR= 0
##$SW_p= 3205.1282051282
##$SYMM= 0
##$S_DEV= 0
##$TDeff= 0
##$TDoff= 0
##$TI= <>
##$TILT= no
##$TM1= 0
##$TM2= 0
##$TOPLEV= 0
##$USERP1= <user>
##$USERP2= <user>
##$USERP3= <user>
##$USERP4= <user>
##$USERP5= <user>
##$WDW= 1
##$XDIM= 8192
##$YMAX_p= 0
##$YMIN_p= 0
$$ End of Bruker specific parameters
$$ ---------------------------------
##NTUPLES= NMR FID
##VAR_NAME=  TIME,          FID/REAL,        FID/IMAG
##SYMBOL=    X,             R,               I
##VAR_TYPE=  INDEPENDENT,   DEPENDENT,       DEPENDENT
##VAR_FORM=  AFFN,          ASDF,            ASDF
##VAR_DIM=   8192,          8192,            8192
##UNITS=     SECONDS,       ARBITRARY UNITS, ARBITRARY UNITS
##FACTOR=    0.0002768,     1,               1
##FIRST=     0,             0,               0
##LAST=      2.2672688,     0,               0
##MIN=       0,             -306305,         0
##MAX=       2.2672688,     269067,          0
$$ Real data points
##PAGE= N=1
##DATA TABLE= (X++(R..R)), XYDATA
$$ [...]
$$ plain form
1849 693 -386 -848 358 -454 -494 76 -905 -321 519 -308 -37 442 154 324 -146 492 914 -84 -32 875
1869 875 -271 -200 255 -642 -282 40 -386 -159 -533 -82 364 -515 -322 646 -93 46 671 -73 221 685
1889 685 -276 89 260 -45 -126 -628 215 94 -1058 -296 287 -648 -377 235 36 5 104 121 164 410 639
1910 639 431 74 502 151 -173 278 195 -330 -313 -188 -91 -387 -268 216 -389 -162 290 -282 -278 471 467 47
1932 47 4 371 335 -296 227 373 -252 -128 4 -415 -190 -92 -314 -74 -161 21 -18 -235 399 533 -189 409
1954 409 564 3 501 568 -201 128 -114 -139 -257 -601 34 -334 -727 64 119 -713 473 202 -222 449 579
1975 579 47 509 297 420 382 -657 505 486 -870 56 -147 -520 162 -405 -651 261 -370 -220 99 -123
1995 -123 689 125 -469 1216 684 -570 640 214 -86 419 -329 -117 172 -683 -260 -148 -571 546 -371
$$ packed form
1849F93j079m62J206q12m0N70r81N84Q40q27K71M79k88J70m70O38M22r98N2R07
1869H75j146P1M55q97L60L22m26K27l74M51M46q79J93R68p39J39O25p44K94M64
1889F85r61L65J71l05q1n02Q43j21j152P62N83r35K71O12j99l1R9J7M3K46K29
1910F39k08l57M28l51l24M51q3n25J7J25R7k96J19M84o05K27M52n72MP49mm20
1932D7m3L67l6o31N23J46o25J24J32m19K25R8k22K40q7J82l9k17O34J34p22N98
1954D09J55n61M98O7p69L29k42k5j18l44O35l68l93P91N5q32J186k71m24O71J30
1975E79n32M62k12J23l8j039J162j9j356R26k03l73O82n67k46R12o31J50L19k22
1995a23Q12n64n94J685n32j254J210m26l00N05p48K12K89q55M23J12m23J117r17
$$ plain form
2014 -371 -868 591 162 -411 760 -8 104 713 -206 391 402 -40 423 -291 -711 583 -579 -982 610
2033 610 -137 -818 51 -577 176 142 -618 656 592 -305 846 137 48 934 -224 -308 841 -670 -528 151
2053 151 -688 82 -346 -593 699 -336 -331 752 -207 -212 707 -78 233 466 -156 435 141 -452 757 -186
2073 -186 -554 373 -781 -369 236 -996 -151 242 -489 -84 430 -22 671 147 -235 966 -197 -108 693
2092 693 -372 -99 477 -316 -77 -12 -664 2 -603 -547 236 -392 -408 309 -218 297 303 -220 478 619 -67
2113 -67 114 184 56 431 -624 -325 319 -373 -299 237 -370 -317 -153 -273 301 113 71 478 116 180 493 -94
2135 -94 158 498 -234 -6 -58 -465 -86 -242 -443 -127 -350 -345 215 -384 36 182 -223 109 328 281 76 260
2157 260 261 430 -55 -36 407 43 -231 -132 -234 -39 -438 -346 -80 -33 75 -177 -78 403 239 -1 246 278 458
$$ packed form
2014c71m97J459m29n73J171p68J12O09r19N97J1m42M63p14m20J294j162m03J592
2033F10p47o81Q69o28P53l4p60J274o4q97J151p09q9Q86j158q4J149j511J42O79
2053A51q39P70m28k47J292j035NJ083r59nR19p85L11K33o22N91k94n93J209r43
2073a86l68R27j154M12O05j232Q45L93p31M05N14m52O93n24l82J201j163Q9Q01
2092F93j065K73N76p93K39O5o52O66o05N6P83o28j6P17n27N15On23O98J41o86
2113f7J81P0j28L75j055K99O44o92P4N36o07N3J64j20N74j88m2M07l62O4L13n87
2135i4K52L40p32K28n2m07L79j56k01L16k23NN60n99M20J46m05L32K19m7k05J84
2157B60JJ69m85J9M43l64k74R9j02J95l99R2K66M7J08k52R9M81j64k40K47L2J80
$$ plain form
2180 458 -45 165 307 -47 -149 26 -237 -478 6 -294 -452 28 19 -34 -227 -3 384 130 -124 497 88
2201 88 332 392 -98 278 310 -489 -48 53 -390 -308 -498 -43 210 -462 -397 417 -77 -122 362 138 579 336
2223 336 106 687 69 -189 517 -398 -60 304 -511 -284 76 -439 -241 -59 -402 317 102 -107 413 -203
2243 -203 512 544 -420 157 905 -176 -85 245 -155 316 -439 -454 196 -543 -317 254 -754 -19 261 -399
2263 -399 234 680 -175 354 364 -187 309 -210 39 407 -604 87 273 -1012 -150 278 -787 -132 -212 -317
2283 -317 479 -515 60 771 -289 -25 489 -375 248 353 -549 463 -58 -732 62 21 -259 -45 -631 43
2303 43 259 -666 -109 378 -475 426 262 -225 463 393 105 471 -295 467 109 -575 57 103 -809 96 -27
2324 -27 -533 184 -188 -327 383 -89 -108 387 -294 644 332 -328 472 482 -479 348 73 -343 112 -384 -177
$$ packed form
2180D58n03K10J42l54j02J75k63k41M84l00j58M80rn3j93K24L87k54k54O21m09
2201H8K44O0m90L76L2p99M41J01m43Q2j90M55K53o72O5Q14m94m5M84k24M41k43
2223C36k30N81o18k58P06r15L38L64q15K27L60n15J98J82l43P19k15k09N20o16
2243b03P15L2r64N77P48j081R1L30m00M71p55j5O50p39K26N71j008P35K80o60
2263c99O33M46q55N29J0n51M96n19K49L68j011O91J86j285Q62M28j065O55q0j05
2283c17P96r94N75P11j060K64N14q64O23J05r02J012n21o74P94m1k80K14n86O74
2303D3K16r25N57M87q53R01j64m87O88p0k88L66p66P62l58o84O32M6r12R05j23
2324b7n06P17l72j39P10m72j9M95o81R38l12o60Q00J0r61Q27k75m16M55m96K07
$$ plain form
2345 -177 -5 -534 -18 28 -559 422 143 -310 429 282 0 439 1 39 211 146 26 19 -159 320 -88 -617
2367 -617 -11 1 -511 42 47 -75 81 54 196 325 120 335 -109 -150 451 -217 -297 51 -64 -346 -18 -171
2389 -171 -154 -75 -363 96 -73 -176 125 -164 -107 331 60 -109 188 285 8 -276 -103 100 -169 -363 41
2410 41 -314 -180 51 -292 -68 78 32 -174 187 441 -30 -17 489 246 -79 189 117 62 -33 -15 -212 -218 78
2433 78 -274 -610 -313 88 26 -304 177 -64 127 44 247 304 385 38 87 244 78 135 -285 -172 305 -103
2455 -103 -405 -113 -237 171 -78 -232 -56 106 177 187 61 -93 587 -36 -9 713 -92 -119 175 -187 35
2476 35 -82 -163 190 -178 -516 343 -175 64 365 -358 -217 479 -1 219 182 256 433 -105 132 528 -257
2497 -257 -189 185 -437 -206 27 -637 -120 102 -148 208 -144 1 288 13 226 562 -42 95 319 -299
$$ packed form
2345a77J72n29N16M6n87R81k79m53P39j47k82M39m38L8J72o5j20pj78M79m08n29
2367f17O06J2n12N53Nj22J56k7J42J29k05K15m44m1O01o68q0L48j15k82L28j53
2389a71J7P9k88M59j69j03L01k89N7M38k71j69K97R7k77k84J73K03k69j94M04
2410D1l55J34K31l43K24J46m6k06L61K54m71J3N06k43l25K68p2n5r5J8j97oK96
2433G8l52l36K97M01o2l30M81k41J91q3K03N7Q1l47M9J57j66N7m20J13M77m08
2455a03l02K92j24M08k49j54J76J62P1J0j26j54O80o23K7P22q05k7K94l62K22
2476C5j17q1L53l68l38Q59n18K39L01p23J41O96m80K20l7P4J77n38K37L96p85
2497b57O8L74o22K31K33o64N17K22k50L56l52J45K87k75K13L36o04J37K24o18
$$ plain form
2517 -299 222 252 -29 246 -219 -205 65 -608 -126 134 -251 174 346 -223 274 318 -145 313 207 98 323
2538 323 -7 -121 319 -526 -85 138 -632 65 50 -611 126 -112 -244 130 -48 -162 264 -63 199 462
2558 462 -70 349 173 -164 171 -2 -409 235 -135 -256 136 -199 -16 -50 -323 213 261 -459 430 212 -75
2579 -75 460 -15 50 285 -203 -202 101 -335 21 -144 -447 120 -85 -353 105 -17 -210 54 -134 -2 313
2600 313 -90 204 74 23 515 -11 -166 283 -110 -264 -179 -311 222 -58 -523 -63 109 -245 -11 28 -101
2621 -101 451 31 -140 201 156 207 247 82 1 -197 -241 -6 -34 -113 -111 -270 -142 -32 4 -120 -49 200 112 269
2645 269 176 365 111 -199 98 -22 87 107 -213 241 16 -80 -316 -179 95 -274 -239 134 -54 -57 41 -67
2667 -67 -50 206 299 119 89 158 252 -61 -297 235 93 -136 -56 -68 -61 -184 -418 -21 40 74 -49 12 198 333
$$ packed form
2517b99N21L0k81K75m65J4K70o73M82K60l85M25J72n69M97M4m63M58j06j09K25
2538C23l30j14M40q45M41K23p70O97j5o61P37k38j32L74j78j14M26l27K62K63
2558D62n32M19j76l37L35j73m07O44l70j21L92l35J83l4k73N36M8p20Q89k18k87
2579g5N35m75O5K35m88JL03m36L56j65l03N67k05k68M58j22j93K64j88J32L15
2600C13m03K94j30n1M92n26j55M49l93j54Q5j32N33k80m65M60J72l54K34L9j29
2621a01N52m20j71L41m5N1M0j65q1j98m4K35k8p9Kj59J28J10L6j24P1K49q8J57
2645B69r3J89k54l10K97j20J09K0l20M54k25r6k36J37K74l69L5L73j88lR8j08
2667f7J7K56R3j80l0O9R4l13k36N32j42k29Q0j2Pj23k34L97O1L4j23O1J86J35
$$ plain form
2691 333 -89 144 268 248 90 205 84 -107 -11 -213 -65 -248 -219 249 -235 -260 119 62 375 143 -23 259
2713 259 191 -147 99 113 -300 197 -19 -220 -6 -218 -197 181 -517 -76 -127 -149 235 -272 -53 184 -34 -235
2735 -235 300 61 167 130 -197 181 144 -390 154 -146 -104 199 -73 9 9 -209 -151 316 -393 241 340 -14 456
2758 456 82 -68 436 -159 86 451 -395 -169 154 -102 -191 -29 -307 221 -207 -290 260 -71 -89 542 -77
2779 -77 73 325 -283 19 276 -291 253 -95 -388 54 -98 -186 283 -197 -342 121 -529 82 94 -142 167
2800 167 -43 73 433 -105 -79 424 -191 -148 254 -126 93 98 -564 86 110 -178 206 -123 -77 132 -214 96
2822 96 637 -162 131 323 -198 78 -54 -217 262 -69 18 -136 -378 -84 -49 -443 26 45 -260 77 -122
2843 -122 -107 216 18 -93 141 -125 180 260 -162 123 158 -410 -104 248 -311 -158 -183 182 176 -280 -65 155
$$ packed form
2691C33m22K33J24k0j58J15j21j91R6k02J48j83K9M68m84k5L79n7L13k32j66K82
2713B59o8l38K46J4m13M97k16k01K14k12K1L78o98M41n1k2L84n07K19K37k18k01
2735b35N35k39J06l7l27L78l7n34N44l00M2L03k72Q2%k18N8M67p09O34R9l54M70
2758D56l74j50N04n95K45L65q46K26L23k56q9J62k78N28m28q3N50l31j8O31o19
2779g7J50K52o08L02K57n67N44l48k93M42j52q8M69m80j45M63o50O11J2k36L09
2800A67k10J16L60n38K6N03o15M3M02l80K19No62O50K4k88L84l29M6K09l46L10
2822I6N41p99K93J92n21K76j32j63M79l31Q7j54k42K94L5l94M69J9l05L37j99
2843a22J5L23j98j11K34k66L05Q0m22K85L5n68L06L52n59J53k5L65om56K15K20
$$ plain form
2865 155 -39 95 322 -311 310 454 -93 168 62 158 179 -229 -130 18 -371 -171 -45 -175 -44 139 38
2886 38 -189 234 45 73 250 311 164 -129 233 236 3 130 -70 -37 -70 31 38 -19 11 -102 5 140 229 -53
2910 -53 -35 368 159 146 322 75 33 -104 233 175 -120 -142 118 -205 -301 31 -67 -141 56 -136 -127 -113 34 208
2934 208 -106 271 220 -92 94 168 -201 -45 292 99 -226 -269 63 82 -287 -78 -72 -224 51 120 -243 277
2956 277 330 -6 244 89 183 212 -177 259 27 -298 47 -29 -348 140 -9 -271 34 168 -58 -71 43 235
2978 235 214 -169 379 113 -206 185 198 -167 269 -160 -99 -66 97 -139 -24 -325 121 -78 -419 344 225
2999 225 -169 324 29 -56 324 19 164 123 108 129 -72 -461 398 -125 -610 131 -8 -418 -20 -155 94
3020 94 354 -98 -83 234 75 344 44 -173 423 -80 -275 192 -45 -304 -32 -345 -261 -46 -296 91 -157
$$ packed form
2865A55j94J34K27o33O21J44n47K61j06R6K1m08R9J48l89K00J26j30J31J83j01
2886C8k27M23j89K8J77O1j47k93L62Lk33J27k00L3l3J01Pn7L0j13J07J35Q9k82
2910e3J8M03k09j3J76k47m2j37L37n8k95k2K60l23r6L32r8p4J97j92RJ4J47J74
2934B08l14L77n1l12J86P4l69J56L37j93l25m3L32J9l69K09Oj52K75O9l63N20
2956B77N3l36K50j55R4K9l89M36k32l25L45p6l19M88j49k62L05J34k26j3J14J92
2978B35k1l83N48k66l19L91J3l65M36m29O1L3J63k36J15l01M46j99l41P63j19
2999B25l94M93k95q5L80l05J45m1j5K1k01l89Q59n23m85P41j39m10L98j35K49
3020I4K60m52J5L17j59K69l00k17N96n03j95M67k37k59K72l13Q4K15k50L87k48
$$ plain form
3041 -157 -119 249 -198 -284 402 -22 -335 437 261 223 193 -11 260 -205 -115 322 -122 -196 190 -79 -280 149
3063 149 -274 -272 7 -69 352 3 19 276 -285 23 282 4 250 282 -256 -132 128 -340 -178 -187 -126 -27 -320
3086 -320 -182 312 69 -41 426 -97 265 322 -51 203 115 198 163 -154 11 146 -305 -235 285 -357 -117 138
3108 138 -120 214 35 -110 221 136 156 268 113 184 144 64 168 156 -54 -8 24 -303 -158 -219 -160 -9 -149
3131 -149 122 201 -333 34 275 -44 146 164 -101 141 8 24 41 -1 109 -208 -438 122 -156 -162 -94 -52 50
3154 50 57 106 -127 60 -134 -8 75 183 139 -115 -268 20 -38 -67 -440 -175 -161 -95 -121 -35 -63 147 228 -89 147
3179 147 6 -166 252 22 265 -53 -99 42 50 -127 -230 200 -258 -173 -120 -506 -39 -117 15 -76 49 188
3201 188 244 -115 311 232 176 28 146 -135 -78 -98 -71 207 1 -139 -230 -82 59 -108 -445 353 218 -4
$$ packed form
3041a57L8L68m47q6O86m24l13P72j76l8l0k04K71m65R0M37m44p4L86k69k01M29
3063A49m23KK79p6M21l49J6K57n61L08K59k78K46L2n38J24K60m68J62rO1R9k93
3086c20J38M94k43j10M67n23L62N7l73K54q8Q3l5l17J65J35m51P0N20o42K40K55
3108A38k58L34j79j45L31q5K0J12j55P1m0q0J04j2k10M6L2l27J45o1N9J51j40
3131a49K71P9n34L67K41l19J90J8k65K42j33J6J7m2J10l17k30N60k78oO8M2J02
3154E0PM9k33J87j94J26Q3J08m4k54j53K88n8k9l73K65J4O6k6Q6k8K10Q1l17K36
3179A47j41j72M18k30K43l18m6J41Qj77j03M30m58Q5N3l86M67p8J32r1J25J39
3201A88N6l59M26p9n6j48J18k81N7k0K7K78k06j40r1J48J41j67l37P98j35k22
$$ plain form
3223 -4 232 170 175 348 127 297 219 -255 56 -28 -100 -61 -61 -394 12 -186 -139 92 -65 -60 198 -76 207 220 -2
3248 -2 189 -112 -27 328 -43 -308 90 -179 -3 72 -327 67 4 -393 62 59 -162 144 16 -65 266 91 36
3271 36 317 -106 350 111 -174 182 33 -173 -98 -111 -237 165 -156 -61 347 -190 69 131 10 227 164 -23
3293 -23 155 8 74 375 -104 -147 281 -396 -161 266 -167 131 -79 -318 79 -135 -163 315 -144 -143 -4 -243
3315 -243 352 365 -83 201 239 13 271 -80 -97 131 -123 -82 237 -154 -65 -91 -166 -98 187 -58 148 47 84
3338 84 395 -84 2 196 -141 -82 230 -11 89 84 -292 14 -261 -261 217 5 58 94 -73 112 177 -125 29
3361 29 79 -47 109 -82 -54 -82 155 -275 138 -275 -175 -166 -173 68 118 -74 168 21 17 315 110 92 230 181
3385 181 17 -25 -130 33 -253 51 73 -190 -80 52 -230 -167 -118 54 17 -53 104 228 197 -43 331 209
$$ packed form
3223dK36o2NJ73k21J70p8m74L11q4p2L9%l33M06j98M7K31j57NK58k74K83J3k22
3248bJ91l01Q5L55l71k65L98k69J76P5l99L94o3l97M55lk21L06j28q1L31j75n5
3271C6K81m23M56k39k85L56j49k06P5j3j26M02l21R5M08n37K59O2j21K17o3j87
3293b3J78j47O6L01m79m3M28o77K35M27m33K98k10k39L97k14k8M78m59JJ39k39
3315b43N95J3m48K84L8k26K58l51j7K28k54M1L19l91Q9k6p5O8K85k45K06j01L7
3338H4L11m79Q6J94l37N9L12k41J00nl76L06k75%M78k12N3L6j67J85O5l02J54
3361B9N0j26J56j91K8k8K37m30M13m13J00RpK41N0j92K42j47mK98k05j8J38m9
3385A81j64m2j05J63k86L04K2k63J10J32k82O3M9J72l7p0J57J24l1k40L74j22
$$ plain form
3407 209 -67 277 28 209 130 -272 12 24 174 -85 -297 -242 -13 9 -252 -163 211 141 72 198 204 231 49
3430 49 141 63 187 -61 -139 24 -142 -110 129 -35 -58 -72 -135 -25 -38 34 155 125 133 458 62 18 170 48 56
3455 56 -62 -277 -84 86 -251 -113 -369 -132 -90 -200 -47 171 -61 95 324 154 251 202 9 57 109 49
3477 49 122 -320 30 78 -369 1 169 -353 90 24 -126 200 -74 -17 176 140 95 339 3 -27 383 -139 -78
3500 -78 57 -35 2 85 92 160 -90 -165 134 -301 157 172 -63 111 129 -296 279 284 70 186 197 153 -86 -128 169
3525 169 126 -337 -212 52 -246 135 -42 -319 138 -41 166 175 27 283 195 -221 187 67 -34 -11 28 -192
3547 -192 192 -12 -84 1 -8 -56 204 -160 47 88 -126 207 123 -52 295 3 -237 181 -168 -89 -58 -115 -22 -274
3571 -274 -288 125 164 -192 134 -116 -101 167 17 -61 193 277 370 85 -62 375 81 -216 151 -22 -47 -165
$$ packed form
3407B09k76L44k49J81p9m02K84J2J50k59k12N5K29K2k61Q9L74p0o9J26OK7j82
3430D9R2p8J24k48p8J63j66L2K39j64k3j4o3J10j3P2J21l0QL25l96m4J52j22Q
3455E6j18k15J93J70l37J38k56K37M2j10J53K18k32J56K29j70R7m9j93M8N2o0
3477D9P3m42L50M8m47L70J68n22M43o6j50L26k74N7J93l6m5K44l36l0M10n22O1
3500g8J35r2L7Q3PO8k50p5K99m35M58J5k35J74J8m25N75Nk14J16J1m4k39m2K97
3525A69m3m63J25K64k98L81j77k77M57j79K07Rj48K56q8m16M08j20j01K3L9k20
3547a92L84k04p2Q5rm8K60l64K07M1k14L33q4j75L47k92k40M18l49P9L1n7R3k52
3571b74j4M13L9l56L26k50J5K68j50p8K54Q4R3k85j47M37k94k97L67j73k5j18
$$ plain form
3593 -165 -243 -106 -103 -287 -318 -4 19 -22 3 -46 47 138 96 241 33 -2 188 109 111 -164 125 155 -146 190 279 -215
3619 -215 -123 125 7 -78 -116 100 -127 24 -94 -26 -29 100 3 -181 -55 150 -118 -129 122 -138 -138 -12 -24 -126
3643 -126 -48 39 14 39 25 59 55 4 -80 -100 44 49 198 -39 182 -145 -114 -186 -127 38 -57 -74 82 -78 10 80 104
3670 104 27 56 102 191 50 325 174 -158 134 106 5 -263 -121 -133 48 -155 9 -314 -309 129 -159 -58 285
3693 285 -62 167 93 -169 118 44 133 -58 98 2 59 -116 -18 23 -86 -82 111 -100 13 -196 18 211 115
3716 115 94 202 117 148 222 -272 68 177 100 -234 -220 -285 102 -207 -152 -220 -67 -116 55 -179 58 285 -336
3739 -336 -48 499 -37 309 -51 153 -16 -44 -32 33 -327 38 58 -14 -126 -148 -244 47 17 -53 151 39 111
3762 111 356 -99 207 -12 -362 -36 130 70 13 298 -135 25 -168 1 -151 -351 -99 232 -357 161 173
$$ packed form
3593a65p8J37Lj84l1L14K3m1K5m9R3R1m2J45k08l5J90p9Kk75K89L0l01L36Q9m94
3619b15R2K48j18q5l8K16k27J51j18O8lJ29r7j84J26K05k68j1K51k60%J26j2j02
3643a26P8Q7k5K5j4L4mn1q4k0J44NJ49k37K21l27L1p2N9J65r5j7J56j60Q8P0K4
3670A04p7K9M6Q9j41K75j51l32K92k8j01k68J42j2J81k03J64l23NM38k88J01L43
3693B85l47K29p4k62K87p4Q9j91J56r6N7j75R8M1j09MJ93k11J13k09K14J93r6
3716A15k1J08q5L1P4m94L40J09p7l34J4o5L87l09N5o8J53m9J71k34K37K27o21
3739c36K88N47n36L46l60K04j69k8J2O5l60L65K0p2j12k2r6K91l0p0K04j12P2
3762A11K45m55L06k19l50L26J66o0n7K85m33J60j93J69j52k00K52L31n89N18J2
$$ plain form
3783 173 61 235 -24 -241 105 16 209 -17 -122 -138 42 -164 9 40 -213 176 -23 -230 -51 15 82 146
3805 146 104 106 59 -320 303 128 -140 137 -42 -159 55 -219 3 79 -435 39 -17 -246 34 176 -20 298
3827 298 189 -61 250 43 -6 165 -226 25 47 -87 -51 73 -282 40 -122 -338 -190 -201 31 256 -34
3848 -34 222 335 -94 -32 25 84 230 118 96 127 -229 -63 -203 -225 89 212 -92 96 33 -82 234 67 154
3871 154 70 69 84 -75 44 -117 -29 -49 -69 -149 -178 -12 -84 36 -32 88 -121 92 -121 25 -157 96 36 -70
3895 -70 65 153 -129 7 215 87 -93 36 95 19 267 -2 102 11 -168 -318 -178 8 17 84 -41 -48 108
3918 108 209 -40 -94 207 -39 -115 27 124 116 -222 -337 -53 -60 -55 -147 -455 45 -15 -150 196 180 41 91 80 354
3943 354 -10 41 56 57 -73 -70 -73 -138 217 -106 -356 -154 -29 -17 164 -210 62 191 -74 -70 386 -48 -49 108 -148
$$ packed form
3783A73j12J74k59k17L46q9J93k26j05j6J80k06J73L1k53L89j99k07J79O6O7O4
3805A46m2Km7l79O23j75k68K77j79j17K14k74K22P6n14M74n6k29K80J42j96L18
3827B98j09k50L11k07m9J71l91K51K2j34L6J24l55L22j62k16J48j1K32K25k90
3848c4K56J13m29O2N7N9J46j12k2L1l56J66j40k2L14J23l04J88o3j15L16j67Q7
3871A54q4jJ5j59J19j61Q8k0k0q0k9J66p2J20o8J20k09K13k13J46j82K53o0j06
3895g0J35Q8k82J36K08j28j80J29N9p6K48k69J04r1j79j50J40J86RO7j25pJ56
3918A08J01k49n4L01k46p6J42R7ql38j15K84pNr2l08N00o0j35L46j6j39N0j1K74
3943C54l64N1J5Jj30Llo5L55l23k50K02J25J2J81l74K72J29k65MM56m34jJ57k56
$$ plain form
3968 -148 234 131 -164 -131 71 21 -70 -142 96 25 -148 22 -62 126 110 127 -165 316 -162 -85 308 -180 -10
3991 -10 -28 -87 205 -190 -35 355 -85 -120 162 -70 -103 396 78 99 246 90 171 254 -70 37 130 -26 172
4014 172 -29 -44 153 -131 -43 55 -51 84 66 -232 70 16 -48 156 -281 -98 305 -82 317 97 -207 224
4036 224 192 -127 27 -16 -91 -10 -129 132 183 -146 -14 208 -221 188 78 -115 192 -52 222 60 -151 -92
4058 -92 268 -214 -102 -1 -457 103 -179 -390 84 31 -63 74 -75 114 155 -89 283 443 -103 94 -39
4079 -39 -82 125 13 -126 84 -121 -187 -22 -260 38 164 -100 146 83 -35 -91 231 67 -78 23 -81 225
4101 225 -192 -91 171 -250 -176 120 -198 -118 -53 262 -118 -73 148 -24 -14 118 285 -83 156 212 198 138 177
4124 177 -150 62 184 -40 70 -266 -29 -313 25 7 -69 -43 -54 -16 77 116 153 -213 -63 107 317 8 -57
$$ packed form
3968a48L82j03k95L3K02n0r1p2K38p1j73J70q4J88j6J7k92M81m78P7L93m88J70
3991a0j8n9K92l95J55L90m40l5K82k32l3M99l18K1J47j56Q1Q3l24J07R3j56J98
4014A72k01j5J97k84Q8R8j06J35j8k98L02n4o4K04m37J83M03l87L99k20l04M31
4036B24l2l19J54m3p5Q1j19K61N1l29J32K22m29M09j10j93L07k44K74j62k11N9
4058i2L60m82J12J01m56N60k82k11M74n3r4J37j49J89M1k44L72J60n46J97j33
4079c9m3K07j12j39K10k05o6J65k38K98J26k64K46o3j18n6L22j64j45J01j04L06
4101B25m17J01K62m21P4K96l18Q0O5L15l80M5K21j72J0J32J67l68K39N6j4o0L9
4124A77l27K12J22k24J10l36K37k84L38j8p6K6j1L8R3L9L7l66J50J70K10l09o5
$$ plain form
4147 -57 -22 -108 -10 -48 -110 -253 -76 36 -7 4 118 30 -21 -84 88 -69 -136 230 -71 182 -63 -180 -58 16
4171 16 -37 186 -129 59 97 -326 -66 69 -153 -21 -61 124 -71 -23 153 132 71 10 42 -179 370 53 -270
4194 -270 -26 -39 -301 264 -228 44 -143 -204 137 -47 -259 346 247 -137 153 -26 -5 -167 53 75 71 7 69
4217 69 -14 -311 52 -195 -365 3 -96 -168 44 -153 30 148 -42 89 30 -33 153 142 -159 439 24 -153
4239 -153 150 -121 -157 79 -114 -132 -158 -11 234 -128 31 153 -108 17 227 -45 113 93 -309 173 2
4260 2 -9 4 25 -134 53 -267 -294 46 -76 -109 109 -107 -10 182 -85 215 -301 -196 369 -139 -55 163 -136
4283 -136 57 19 -239 32 -85 -180 132 -245 -122 227 -84 15 219 -27 -75 278 -25 -43 328 -186 61 49
4305 49 -156 -26 74 -80 -1 -340 -93 -34 -335 -95 133 -159 20 183 169 79 154 -19 229 3 -17 185
$$ packed form
4147e7L5q6R8l8o2j43J77J12m3J1J14q8n1o3J72j57o7L66l01K53k45j17J22P4
4171A6n3K23l15J88L8m23K60J35k22J32m0J85j95M8J76k1o1o1L2k21N49l17l23
4194b70K44j3k62N65m92K72j87o1L41j84k12O05r9l84K90j79K1j62K20K2mo4O2
4217F9q3k97L63k47j70L68r9p2K12j97J83J18j90J31n9o3J86j1l01N98m15j77
4239a53L03k71l6K36j93j8k6J47K45l62J59J22k61J25K10k72J58k0m02M82j71
4260Bj1J3K1j59J87l20k7L40j22l3K18k16R7J92k67L00n16J05N65n08Q4K18k99
4283a36J93l8k58K71j17r5L12l77J23L49l11R9K04k46m8L53l03j8L71n14K47j2
4305D9k05J30J00j54P9l39K47N9l01K40K28k92J79J63j4r0P5j73K48k26k0K02
$$ plain form
4327 185 -546 209 33 -204 -177 -165 148 104 -281 -48 365 -75 196 50 50 300 336 -132 32 -119 56 69
4349 69 -194 60 -45 -87 -76 83 -327 135 82 -104 14 166 -128 -11 386 201 43 -112 135 -68 -129 114
4371 114 9 -160 29 107 -251 94 29 -258 -20 13 71 -144 -28 291 -36 -32 197 93 28 7 19 303 7
4394 7 -304 48 41 -144 -199 -212 -4 63 44 138 64 113 136 193 101 75 -111 277 104 47 132 111 32 -203 -7 -142
4420 -142 18 59 5 55 -128 -76 33 143 81 21 129 131 17 116 -95 -63 -30 75 -59 -47 0 -297 -11 -181
4444 -181 -206 39 80 -258 -48 -60 -129 166 -10 -52 2 112 178 56 -213 288 31 -27 -17 -104 1 100 -184 54
4468 54 133 -70 96 -184 163 22 128 -15 169 109 172 237 -90 40 70 -317 -139 12 -83 -109 -195 -232 142
4491 142 -115 -73 132 -269 84 150 -152 304 -86 -125 91 -33 255 16 78 -96 42 -171 -42 17 -296 200
$$ packed form
4327A85p31P55j76k37K7J2L13m4l85K33M13m40K71j46%K50L6m68J64j51J75J3
4349F9k63K54j05m2J1J59m10M62n3j86J18J52k94J17L97j85j58j55K47k03o1K43
4371A14j05j69J89P8l58L45o5k87K38L3N8k15J16L19l27MK29j04o5k1J2K84k96
4394Gl11L52pj85n5j3K08O7j9R4p4M9K3N7r2k6j86L88j73n7Q5k1p9k35J96j35
4420a42J60M1n4N0j83N2J09J10o2o0J08Kj14R9k11L2L3J05j34J2M7k97K86j70
4444a81k5K45M1l38K10j2o9K95j76m2N4J10O6j22k69N01k57n8J0q7J05R9k84K38
4468E4P9k03J66k80L47j41J06j43J84o0O3O5l27J30L0l87J78J51r5k6q6l7L74
4491A42k57M2K05m01L53O6l02M56l90l9K16j24K88k39O2j74J38k13J29N9l13M96
$$ plain form
4513 200 0 -120 33 -27 27 415 -129 72 0 -126 115 41 -73 147 -78 -221 248 -186 -283 -90 -106 180
4535 180 145 79 -19 68 -196 350 179 -134 197 -45 -73 154 1 -52 137 -100 43 -95 -166 -156 -126 -120 162 -172
4559 -172 -63 143 77 -172 75 -12 144 255 -126 380 81 -142 80 -213 -113 -1 6 -56 -182 -135 65 -102
4581 -102 -12 247 116 -283 150 -33 -104 266 21 -172 133 -260 284 182 -116 -249 -156 -245 -237 -112 26 79
4603 79 -73 -245 64 -82 -85 28 -109 43 96 -108 193 -90 37 103 -5 159 63 -148 99 45 113 -3 23
4626 23 -266 -112 113 177 97 -113 222 -88 -38 286 250 -31 30 86 -34 -259 -59 -247 -230 -270 68 -19 164
4649 164 -79 -26 -189 192 -20 253 329 54 188 -120 -147 13 193 -8 216 42 -161 6 70 62 106 -59
4671 -59 108 35 -155 -9 -202 -2 136 145 -8 233 30 -18 -236 107 114 -124 -219 175 -169 -31 195 -285 41
$$ packed form
4513B00k00j20J53o0N4L88n44K01p2j26K41p4j14K20k25j43M69m34r7J93j6K86
4535A80l5o6r8Q7k64N46j71l13L31k42k8K27j53n3J89k37J43j38p1J0L0OK82l34
4559a72J09K06o6k49K47q7J56J11l81N06k99k23K22k93J00J12Po2j26M7K00j67
4581a02R0K59j31l99M33j83p1L70k45j93L05l93N44j02k98j33R3q9QJ25J38N3
4603G9j52j72L09j46lJ13j37J52N3k04L01k83J27O6j08J64r6k11K47n4O8j16K6
4626B3k89J54K25O4q0k10L35l10N0L24l6k81O1N6j20k25K00j88J7m0L38q7J83
4649A64k43N3j63L81k12K73P6k75J34l08k7J60J80k01K24j74k03J67O4qM4j65
4671e9J67p3j90J46j93K00J38Rj53K41k03m8k18L43Pk38r5L94l44J38K26m80L26
$$ plain form
4694 41 -150 -297 156 149 55 88 57 -1 187 73 63 382 -131 75 31 -190 57 152 -101 117 -156 -139 -107 29
4718 29 65 157 -88 303 400 7 108 -51 18 146 32 -51 44 -277 -53 21 -148 118 -29 -155 29 45 -277
4741 -277 129 94 -16 -118 -102 155 63 -260 -43 87 -471 203 55 -70 143 -125 -8 75 -199 -30 -70 -58
4763 -58 -32 -121 -63 210 -83 -45 168 -2 -90 462 117 2 -11 -354 135 -93 -209 120 -61 -55 205 -80 -84 119
4787 119 116 2 249 118 382 164 -85 60 93 -145 85 90 -250 80 -128 -27 -117 -271 113 -82 -173 56
4809 56 -2 -20 -54 -37 165 116 59 -134 87 -35 -76 -17 -147 34 -166 -126 110 -403 -20 149 -61 19 264 -33
4833 -33 130 46 236 170 73 32 28 -100 -72 275 -368 -90 50 -59 -164 11 -41 295 -7 -41 57 -136 69 340
4857 340 -181 105 210 -35 208 15 186 46 110 34 -72 16 4 -78 -107 -179 15 -61 61 243 -39 31 44
$$ packed form
4694D1j91j47M53pr4L3l1n8J88j14j0L19n13K06m4k21K47R5k53K18k73J7L2J36
4718B9L6R2k45L91R7l93J01j59O9J28j14q3R5l21K24P4j69K66j47j26J84J6l22
4741b77M06l5j10j02J6K57r2l23K17J30n58O74j48j25K13k68J17Q3k74J69m0J2
4763e8K6q9N8K73k93L8K13j70q8N52l45j15j3l43M89k28j16L29j81OK60k85mK03
4787A19lj14K47j31K64k18k49J45L3k38K30Nl40L30k08J01r0j54L84j95r1K29
4809E6n8j8l4J7K02m9n7j93K21j22m1N9j30J81k00M0K36n13L83J69k10Q0K45k97
4833c3J63q4J90o6r7m1mj28K8L47o43K78J40j09j05J75n2L36l02l4R8j93K05K71
4857C40n21K86J05k45K43j93J71j40O4p6j06Q8j2q2k9p2J94p6J22J82k82P0J3
$$ plain form
4880 44 65 77 23 69 85 95 -135 -37 -89 -72 96 -199 -192 -42 257 74 -120 114 -179 -68 185 6 -52 316
4904 316 52 -10 99 -49 -135 7 -98 -21 4 -42 -355 4 20 -183 134 134 10 -115 -60 -87 -157 129 186 231
4928 231 51 -234 -54 4 -77 49 -18 60 -9 -196 -17 190 -169 108 271 41 131 97 10 55 68 -112 64
4951 64 54 114 -40 -237 -222 74 -111 -64 85 -34 237 102 -133 -10 80 25 300 -7 142 -118 -52 187 119
4974 119 5 77 -86 -118 96 46 -324 -211 131 -235 103 -115 159 -2 -238 417 -60 46 106 58 24 -147
4996 -147 -60 -23 138 -163 -136 42 -349 118 -50 -271 229 -122 -91 189 -29 -86 318 -117 180 -214 23 277
5018 277 61 -85 -37 -152 -365 101 -86 -66 51 -102 2 -7 -45 256 118 -155 77 79 -68 324 -165 74
5040 74 196 2 28 67 -246 93 275 -82 -102 -91 122 61 56 -60 59 184 83 45 85 247 207 -112 93 -107
$$ packed form
4880D4K1J2n4M6J6J0k30R8n2J7J68k95PJ50K99j83j94K34k93J11K53j79n8L68
4904C16k64o2J09j48q6J42j05P7K5m6l13L59J6k03L17%j24j25N5k7p0K86N7M5
4928B31j80k85J80N8q1J26o7P8o9j87J79K07l59K77J63k30R0l4q7M5J3j80J76
4951F4j0O0j54j97J5K96j85M7J49j19K71j35k35J23R0n5K75l07J49k60O6K39o8
4974A19j14P2j63l2K14n0l70J13L42l66L38k18K74j61k36O55m77J06O0m8l4j71
4996a47Q7L7J61l01K7J78l91M67j68k21N00l51L1K80k18n7M04m35K97l94K37K54
5018B77k16j46M8j15k13M66j87K0J17j53J04rl8L01j38k73K32Kj47L92m89K39
5040G4J22j94K6L9l13L39J82l57k0J1K13o1nj16J19J25j01l8M0J62m0l19K05k00
$$ plain form
5064 -107 -86 157 2 57 -108 -137 -23 -69 -103 100 -128 -160 -85 105 -8 374 -123 186 -86 -140 93 232 171
5087 171 39 -29 -93 110 -117 -12 79 -72 -19 84 -226 8 -84 189 218 -99 -140 397 81 39 131 -59 -81
5110 -81 70 -80 -88 -143 -85 91 -15 -52 -78 4 -86 172 -37 261 -124 50 27 178 -57 296 -43 -179 132
5133 132 14 -38 113 -139 -121 -144 -128 100 -10 -88 411 -174 -67 120 -56 227 42 46 132 0 50 31 -217
5156 -217 63 148 -229 -20 -74 42 -7 -100 -102 -54 105 145 -55 -91 88 40 0 34 113 23 -102 18 -233 -42 20
5181 20 78 77 -130 -67 -60 -33 136 95 -105 114 227 88 251 177 146 166 76 -21 117 48 108 -137 -84 73 -10 -133
5207 -133 55 -138 102 17 86 194 -45 -5 131 -25 -161 21 114 42 68 -234 -28 -33 -99 33 13 9 6 37 -179
5232 -179 141 -45 73 368 -173 69 235 -198 268 192 70 44 -170 -108 85 -106 -89 -21 -251 42 156 -247
$$ packed form
5064a07K1K43j55N5j65k9J14m6l4K03k28l2P5J90j13L82m97L09k72n4K33J39o1
5087A71j32o8o4K03k27J05R1j51N3J03l10K34r2K73K9l17m1N37l16m2R2j90k2
5110h1J51j50qn5N8J76j06l7k6Q2r0K58k09K98l85J74k3J51k35L53l39j36L11
5133A32j18n2J51k52J8k3J6K28j10p8M99n85J07J87j76K83j85MQ6j32N0j9k48
5156b17K80Q5l77K09n4J16m9r3kM8J59M0k00l6J79m8m0L4P9r0j25J20k51J91O2
5181B0N8jk07O3PK7J69m1k00K19J13j39J63p4l1K0r0r7J38o9O0k45N3J57q3j23
5207a33J88j93K40q5O9J08k39M0J36j56j36J82R3p2K6l02K06no6J32k0mlL1k16
5232a79L20j86J18K95n41K42J66m33M66p6j22k6k14O2J93j91J7O8k30K93J14m03
$$ plain form
5254 -247 159 272 -152 133 82 102 219 -207 112 193 -45 103 140 -249 88 168 -306 165 94 -141 17 -158
5276 -158 38 -1 3 197 204 39 142 71 78 33 139 16 2 16 -220 -85 55 120 213 -214 168 115 -74 150 153
5301 153 -107 157 -58 -2 120 -95 -54 172 -13 96 137 -225 26 -81 -107 -118 -4 -168 -47 -83 85 -2
5323 -2 -114 304 -10 -9 254 91 -15 -42 26 -84 8 71 78 -53 -40 43 23 -58 102 -56 -10 174 40 -60 83
5348 83 -49 86 44 118 11 -61 137 117 -219 -205 -38 -253 -34 -71 32 -104 -49 -42 -137 -149 -64 47 -136 61
5372 61 147 172 117 117 -174 -31 -117 33 137 -77 -139 -9 18 -11 -120 -132 88 85 -78 13 42 37 265 84 323 12
5398 12 49 40 -29 59 233 56 -1 -23 12 11 -75 87 67 98 47 -57 187 -110 102 369 -129 89 0 -36 -188 -123
5424 -123 69 -108 -76 127 -13 116 54 -97 -81 244 47 -53 124 23 165 118 124 -44 137 63 132 180 -54
$$ packed form
5254b47M06J13m24K85n1K0J17m26L19Q1k38J48L7l89L37Q0m74M71p1k35J58j75
5276a58J96l9MJ94Pj65J03p1Pm5J06j23j4J4k36J35J40O5R3m27L82n3j89K24L
5301A53k60K64k15N6J22k15M1K26j85J09M1l62K51j07k6j1J14j64J21l6J68q7
5323bj12M18l14JK63j63j06k7O8j10R2O3Pj31J3Q3k0q1J60j58M6J84j34j00J43
5348H3j32J35m2P4j07p2J98k0l36J4J67k15K19l7J03j36N5Pr5j2Q5J11j83J97
5372F1Q6K5n5%k91J43q6J50J04k14o2J30K7k9j09j2K20lj63R1K9nK28j81K39l11
5398A2L7ro9Q8J74j77n7k2L5jq6J62k0L1n1j04K44k97K12K67m98K18q9l6j52O5
5424a23J92j77L2K03j40J29o2j51J6L25j97j00J77j01J42m7Oj68J81p4O9M8k34
$$ plain form
5447 -54 -52 -198 -92 130 125 53 -109 40 -161 93 -12 2 -122 121 189 -29 49 -162 121 161 97 -19 -197 -133
5471 -133 -57 -112 -117 -231 -22 -223 -29 47 -234 301 -66 85 126 44 -83 364 -143 -61 100 -278 -94 23 -126
5494 -126 -117 171 -124 -67 53 -65 327 -55 -135 64 -149 5 -62 35 -6 53 -103 -26 -180 -92 -91 -257 -72 248
5518 248 -132 -305 -23 -134 170 30 -78 179 70 82 127 -30 79 277 -75 150 75 -114 210 -334 -224
5539 -224 -84 -33 -134 8 -93 84 116 22 -1 62 21 255 230 -5 337 97 8 260 284 -47 42 -56 29 -76
5563 -76 -52 77 -25 149 73 218 -73 21 171 41 28 -166 121 -4 -115 16 78 64 -24 -169 -39 45 -175
5586 -175 127 -199 -86 -2 -105 -14 96 228 -44 -201 117 216 134 -32 -77 67 111 -53 -134 -183 -315 136 -81
5609 -81 50 38 56 289 -26 -5 185 -136 108 -81 47 59 -200 6 48 81 83 40 -287 26 -76 33 74 -113
$$ packed form
5447e4Kj46J06K22np2j62J49k01K54j05J4j24K43O8k18P8k11K83M0o4j16j78O4
5471a33P6n5nj14K09k01J94P6k81N35l67J51M1q2j27M47n07Q2J61l78J84J17j49
5494a26RK88k95N7J20j18L92l82q0J99k13J54o7R7m1N9j56P7j54Q8Jj66J85L20
5518B48l80j73K82j11L04j40j08K57j09J2M5j57J09J98l52K25p5j89L24n44J10
5539b24J40N1j01J42j01J77L2r4k3O3m1K34k5k35L42k40q9K52K4l31Q9r8Q5j05
5563g6K4J29j02J74p6J45k91R4J50j30j3j94K87j25j11J31O2j4q8j45J30Q4k20
5586a75L02l26J13Q4j03R1J10J32k72j57L18R9q2j66m5J44M4j64q1m9j32M51k17
5609h1J31j2J8K33l15K1J90l21K44j89J28J2k59K06M2L3Km3l27L13j02J09M1j87
$$ plain form
5633 -113 141 59 349 130 91 62 57 -32 116 141 -104 104 -70 -99 -71 -66 -257 102 -76 -254 -30 -98 -44 -18 6
5658 6 -190 11 -72 113 92 36 -27 131 -34 201 87 -237 47 -311 -166 -43 -188 -66 32 -266 -129 53
5680 53 45 121 159 -385 162 -52 154 87 -209 115 36 -91 -29 53 -230 23 -28 -98 -256 -65 73 114 -154 44
5704 44 -18 180 72 34 251 104 -62 172 96 -195 50 -83 -164 45 57 -126 16 37 -71 -48 -242 -5 -31
5727 -31 -162 -38 177 114 108 190 -124 133 27 76 169 30 -58 -13 -51 -122 228 -73 11 -24 36 66 -24 141 122 -80
5753 -80 130 269 46 -9 26 -65 30 -248 -123 -4 -12 -12 89 -67 -173 39 -362 -13 -8 -2 13 147 134 100 -154
5778 -154 6 161 -250 -237 2 183 195 3 -112 -28 20 -78 159 11 0 63 241 120 85 -122 233 177 103
5801 103 89 -100 -22 -130 -159 -56 227 -115 134 54 -222 30 -112 -132 17 113 -13 79 -2 -59 223 -54 45
$$ packed form
5633a13K54q2K90k19l9k9nq9J48K5k45K08j74k9K8Nj91L59j78j78K24o8N4K6K4
5658Fj96K01q3J85k1n6o3J58j65K35j14l24K84l58J45J23j45J22R8k98J37J82
5680E3qP6L8n44N47k14K06o7k96L24p9j27O2Q2k83K53n1p0j58J91J38M1k68J98
5704D4o2J98j08l8K17j47j66K34p6k91K45j33q1K09J2j83J42K1j08K3j94K37k6
5727c1j31J24K15o3oQ2l14K57j06M9R3j39q8M5l8p1L50l01Q4l5O0L0r0J65j9k02
5753h0K10J39k23n5L5r1R5k78J25J19q%J01j56j06K12m01L49NOJ5J34j3l4k54
5778a54J60J55m11J3K39J81J2j92j15Q4M8r8K37j48j1O3J78j21l5k07L55n6p4
5801A03j4j89P8j08k9J03K83l42K49q0k76K52j42k0J49R6j26R2q1n7K82k77R9
$$ plain form
5824 45 52 -250 41 151 -100 29 -67 -157 -31 4 140 101 10 113 222 -95 35 85 19 -136 41 -4 -81 17
5848 17 64 -14 -38 -104 103 -168 -8 -139 -86 3 -92 -109 -15 91 76 -87 -154 69 -148 -83 16 -19 -169 240 25
5873 25 -55 -98 -61 -117 12 77 43 -131 -93 76 -57 -157 182 -87 -33 47 -91 58 170 96 -71 48 -163 -121
5897 -121 -106 -31 60 40 -149 20 176 112 117 145 165 -64 153 97 -8 28 282 -98 -112 -86 -116 72 -222 -335 -92
5922 -92 -26 41 28 -100 20 47 -63 -28 28 79 228 166 53 -112 -95 66 55 -211 -30 -7 12 114 -81 70
5946 70 120 105 124 -61 52 229 -34 -63 110 30 -108 87 -62 -93 73 -15 -124 -72 -172 -226 55 -135 43
5969 43 171 138 103 -190 -214 289 227 3 -106 175 -120 109 -73 -38 -374 -75 118 -84 6 91 -55 -250 98
5992 98 10 -48 -7 -34 70 -63 -215 337 -91 -13 214 74 39 59 -157 107 45 -109 60 2 9 -113 109 -11
$$ packed form
5824D5Pl02K91J10k51J29r6r0J26L5J36l9r1J03J09l17J30N0o6j55J77m5p7R8
5848A7M7p8k4o6K07k71J60j31N3Q9r5j7R4J06j5j63o7K23k17O5R9l5j50M09k15
5873B5q0m3L7n6J29O5l4j74L8J69j33j00L39k69N4Q0j38J49J12p4j67J19k11M2
5897a21J5P5R1k0j89J69J56o4NK8K0k29K17n6j05L6K54l80j4K6l0J88k94j13K43
5922i2O6O7j3j28J20K7j10L5N6N1J49o2j13j65J7J61j1k66J81K3J9J02j95J51
5946G0N0j5J9j85J13J77k63k9J73q0j38J95j49l1J66q8j09N2j00n4K81j90J78
5969D3J28l3l5k93k4N03o2k24j09K81k95K29j82L5l36K99J93k02R0Q5j46j95L48
5992I8q8n8M1k7J04j33j52N52m28P8K27j40l5K0k16K64o2j54J69n8Pj22K22j20
$$ plain form
6016 -11 5 47 -22 84 123 -13 -31 -223 -32 98 1 91 -191 79 35 -34 71 188 -108 -186 131 -47 -73 91
6040 91 25 105 57 -53 168 -64 -27 60 52 -121 -79 -171 130 -15 19 -4 34 45 100 148 37 -32 -178 18 196 -6
6066 -6 -120 79 -23 127 -96 -67 -41 -281 -32 -155 -170 -125 -48 -39 31 -50 -160 109 -130 64 242 56 0 7 177
6091 177 66 -92 57 98 -72 126 84 -118 -110 -91 -94 48 308 -11 95 7 -118 133 -22 26 -231 148 -124
6114 -124 -3 -103 -84 -124 -58 -111 -89 -57 77 -164 4 201 -68 26 -158 59 -1 111 149 293 180 -3 175
6137 175 23 -143 179 -90 -7 81 -259 43 84 -6 -48 69 148 -23 28 56 90 19 48 82 -2 -83 87 21 133
6162 133 -15 -70 -79 144 -183 -80 -85 4 -99 -107 -229 95 -41 -90 -22 70 -2 -62 17 11 129 -87 -182 -60 28 -5
6188 -5 -140 -24 -53 -133 28 37 79 -55 104 -64 -39 85 183 32 27 -130 242 19 -117 -60 48 10 -33 -82 63
$$ packed form
6016a1J6M2o9J06L9j36j8j92J91J30r7R0k82K70m4o9J05J17k96p8L17j78k6J64
6040I1o6Q0m8j10K21k32L7Q7qj73M2r2L01j45L4k3L8J1N5M8j11o9j46J96J78k02
6066fj14J99j02J50k23K9K6k40K49j23j5M5P7RP0q1j10K69k39J94J78j86n6PJ70
6091A77j11j58J49M1j70J98m2k02QJ9lJ42K60l19J06q8j25K51j55M8k57L79k72
6114a24J21j00J9m0O6n3K2L2J34k41J68J97k69R4j84K17o0J12L8J44j13j83J78
6137A75j52j66L22k69Q3Q8l40L02M1r0m2J17P9j71N1K8L4p1K9L4q4q1J70o6J12
6162A33j48n5rK23l27J03nQ9j03qj22L24j36m9O8R2p2o0P9oJ18k16r5J22Q8l3
6188ej35J16k9q0J61RM2j34J59j68K5J24R8j51nj57L72k23j36N7J08l8m3m9J45
$$ plain form
6213 63 109 138 -163 97 1 41 161 144 102 -117 86 6 211 20 -142 -89 -258 -41 -151 2 142 -175 -135
6236 -135 109 59 56 -53 -38 -122 120 123 97 -9 -95 -54 -114 -70 134 163 -295 139 -145 -221 133 -122 82 36 -23
6261 -23 212 255 28 122 8 122 146 2 61 -52 -66 -183 -76 -16 181 -107 86 78 -131 -209 -55 -49 23 66 109
6286 109 156 103 -147 161 -189 16 150 -103 -111 145 -72 -154 72 -155 -33 206 -219 145 -111 -46 338 8
6308 8 74 271 -183 -202 124 127 91 8 -140 154 76 53 -62 -161 -52 36 18 -102 -55 70 106 -152 -5 16 189
6333 189 -9 133 14 -65 6 -67 -79 -113 93 61 37 -112 -17 159 -148 207 32 -112 47 -128 177 113 -185
6356 -185 -41 28 -58 -71 56 -9 33 -56 -28 64 -127 61 183 38 224 107 -91 -75 -138 -30 -40 -29 12 -9 186
6381 186 -256 -3 159 -82 -81 67 383 112 119 -234 -195 198 -228 -97 143 91 252 12 122 70 209 107
$$ packed form
6213F3M6K9l01K60r6M0J20j7m2k19K03q0K05j91j62N3j69K17j10J53J40l17M0
6236a35K44n0lj09J5q4K42Lk6j06q6M1o0M4K04K9m58M34k84p6L54k55K04m6n9
6261b3K35M3k27R4j14J14K4j44N9j13j4j17J07O0J97k88J93qk09p8J54OP2M3M3
6286A09M7n3k50L08l50K05J34k53qK56k17q2K26k27J22K39m25L64k56O5L84l30
6308HO6J97m54j9L26Ll6q3j48K94p8k3j15r9J09Q8j8j20M7J25L6k58J47K1J73
6333A89j98J42j19p9P1p3j2l4K06l2k4j49R5J76l07L55j75j44J59j75L05o4k98
6356a85J44O9q6j3J27o5M2q9K8R2j91J88J22j45J86j17j98J6o3J08j0J1M1k1J95
6381A86m42K53J62k41JJ48L16k71Pl53L9L93m26J31K40n2J61k40J10n2J39j02
$$ plain form
6403 107 -45 -129 -198 -139 -7 42 -25 -234 107 -37 -103 -29 -110 -78 -14 59 -119 145 41 -9 32 97 10 368 -48
6428 -48 -299 215 27 1 24 -56 -77 18 47 125 -71 -82 -57 173 -128 -6 26 -30 -6 71 -32 214 -95 -12 14
6453 14 -84 -38 -27 -32 22 -2 71 231 72 45 5 -160 105 -61 31 90 -11 0 3 -6 90 -128 37 -123 90 -40
6479 -40 -58 38 -234 120 -24 -149 -70 -203 76 222 19 0 -10 -2 -175 48 -40 117 -102 233 -144 -88 159
6502 159 -183 -222 270 21 -43 173 86 122 80 -18 127 23 123 62 -40 154 112 -99 -125 185 -242 -192 83
6525 83 -56 -78 16 -211 23 203 50 -237 40 -80 -37 174 -108 218 -152 -60 -107 -218 137 -32 70 -131
6547 -131 -118 -101 20 37 -72 236 -25 13 -10 -161 126 -87 -85 71 -121 -101 111 158 111 -163 -94 -29 -141 -26
6571 -26 -225 48 204 43 137 16 59 -203 33 267 -182 -113 71 -103 77 -166 -23 -67 -14 12 -202 -189 49
$$ packed form
6403A07j52q4o9N9J32M9o7k09L41j44o6P4q1L2O4P3j78K64j04n0M1O5q7L58m16
6428d8k51N14j88k6K3q0k1R5K9P8j96j1K5K30l01J22L2n6K4P7j03K46l09Q3K6
6453A4r8M6J1nN4k4P3J60j59k7m0j65K65j66R2N9j01J1LrR6k18J65j60K13j30
6479d0j8R6k72L54j44j25P9j33K79J46k03j9j0Qj73K23q8J57k19L35l77N6K47
6502A59l42l9M92k49o4K16q7L6m2r8J45j04J00o1j02J94m2k11k6L10m27N0K75
6525H3j39k2R4k27K34J80j53k87K77j20M3K11k82L26l70R2m7j11L55j69J02k01
6547a31J3J7J21J7j09L08k61L8k3j51K87k13KJ56j92K0K12M7m7k74O9O5j12J15
6571b6j99K73J56j61R4j21M3k62K36K34m49O9J84j74J80k43J43m4N3K6k14J3K38
$$ plain form
6594 49 28 128 20 168 -13 163 -113 -140 -62 165 -31 -12 -63 124 -131 96 52 -94 -87 28 173 267 48
6617 48 -47 -72 24 89 242 67 -133 232 51 -43 153 162 -21 32 -7 -24 -30 35 -186 10 19 127 -195 -178 -15 60
6643 60 82 61 1 -22 72 191 125 -26 94 -72 -246 -44 44 -198 -101 -150 -36 122 -150 64 225 -219 7
6666 7 -30 -146 74 18 45 -140 164 197 209 12 -298 68 -110 85 33 178 145 36 152 74 5 61 -145 -138 27
6691 27 -18 -98 72 -168 -232 12 33 -136 -107 -4 -119 -27 -172 4 5 56 -16 6 -105 125 -58 -22 22 168 244
6716 244 17 157 -158 -11 68 115 6 -183 -263 69 -44 -4 60 70 -21 -29 40 111 -236 28 -142 -290 85 36
6740 36 127 -99 -200 -169 53 91 34 234 53 104 -165 -22 172 114 149 227 -18 -18 -48 67 -50 101 -103 -81
6764 -81 -115 97 89 -140 -81 177 -42 -217 -91 71 -44 -149 8 -86 27 47 80 304 12 31 44 22 -110 12
$$ packed form
6594D9k1J00j08J48j81J76k76k7P8K27j96J9n1J87k55K27m4j46PJ15J45R4k19
6617D8r5k5R6O5J53j75k00L65j81r4J96Rj83N3l9j7oO5k21J96RJ08l22J7J63P5
6643F0K2k1o0k3R4J19o6j51J20j66j74K02Q8k42R7m9J14J58k72K14J61m44K26
6666Gl7j16K20n6K7j85L04L3J2j97l10L66j78J95n2J45l3j09J16p8o9N6k06PJ65
6691B7m5q0J70k40o4K44K1j69K9J03j15R2j45J76JN1p2K2j11K30j83L6M4J46P6
6716B44k27J40l15J47P9M7j09j89q0L32j13M0O4J0r1qO9P1l47K64j70j48L75m9
6740C6R1k26j01L1K22L8n7K00j81N1k69J43J94n8L5P8k45%l0J15j17J51k04K2
6764h1l4K12qk29N9K58k19j75J26J62j15j05J57r4J13K0L3K24k92J9J3k2j32J22
$$ plain form
6788 12 -46 -124 -35 150 -26 51 116 94 -43 185 47 -93 155 5 64 7 -56 196 245 78 -1 -28 -101 183 55
6813 55 -207 74 106 -27 -116 -66 106 31 77 -175 30 -37 162 -68 -44 -56 -34 -3 249 -45 40 79 -51 -124 -96
6838 -96 -243 -25 23 -149 46 -137 -7 74 102 90 21 -42 -46 10 -174 -59 -39 114 20 86 117 46 -169 250 58
6863 58 -52 62 -106 -171 40 -15 -87 221 59 -87 -24 67 18 -119 -103 -59 2 -57 -115 24 -86 -274 -188 -28
6887 -28 163 -204 -52 146 -28 -95 120 23 68 -242 140 199 53 -9 77 -45 20 20 83 -28 -25 19 -103 48 98
6912 98 192 -4 13 -160 36 -77 124 190 194 71 -9 -73 -125 218 -36 -79 -72 81 39 38 19 -17 235 23 30 146
6938 146 -39 213 18 -33 330 -69 163 -107 -12 104 220 -18 -7 -38 -153 235 -7 -130 -143 -201 20 -50
6960 -50 -41 -191 -23 -171 4 -31 63 -17 -77 61 120 -170 -123 296 -105 6 -17 94 -137 -124 28 -53 0 -116
$$ packed form
6788A2n8p8Q9J85j76P7O5k2j37K28j38j40K48j50N9n7o3K52M9j67p9k7p3K84j28
6813E5k62K81L2j33q9N0J72p5M6k52K05o7J99k30K4j2K2L1K52k94Q5L9j30p3K8
6838i6j47K18M8j72J95j83J30Q1K8j2o9o3mN6j84J15K0J53r4O6L1p1k15M19j92
6863E8j10J14j68o5K11n5p2L08j62j46O3R1m9j37J6M4O1n9n8J39j10j88Q6J60
6887b8J91l67J52J98j74o7K15r7M5l10L82N9j46o2Q6j22O5%O3j11LM4j22J51N0
6912I8R4j96J7j73J96j13K01O6Mj23q0o4n2L43k54m3PJ53m2jj9l6K52k12PJ16
6938A46j85K52j95n1L63l99K32k70R5J16J16k38J1l1j15L88k42j23j3n8K21p0
6960e0Rj50J68j48J75l5R4q0o0J38N9k90M7M19m01J11k3J11k31J3J52q1N3j16
$$ plain form
6984 -116 24 -10 65 -112 -255 -79 157 -1 70 -212 -76 110 118 -104 99 106 87 -126 -45 181 56 -214 57
7007 57 183 191 -56 -151 29 -77 -85 -118 -21 19 -83 33 -201 159 228 52 -30 52 121 179 278 -26 176 98 -65
7032 -65 90 96 120 49 140 26 -92 -176 22 -194 -212 -115 -74 20 -28 -119 22 83 5 -19 -48 29 16 45 -155 56 85
7059 85 65 -113 -154 -90 -132 -209 157 120 11 274 55 -94 54 -125 63 -70 -33 -131 -226 -203 63 -152 -122 81
7083 81 -61 -65 -248 -137 109 137 -55 -89 24 -22 133 46 22 130 248 88 13 -98 109 -75 -185 66 -166
7106 -166 -30 -85 -196 47 63 -47 101 199 27 92 21 33 99 345 5 -114 38 186 -44 219 -51 196
7128 196 41 -93 -64 272 135 -40 65 169 -121 -26 28 -94 -41 174 27 32 -290 -108 54 -93 26 -291
7150 -291 -101 84 57 -42 -48 -66 -267 -121 74 -277 19 69 98 -28 -24 -31 -27 20 212 -45 -41 -122 57 38 -10 -96 119
$$ packed form
6984a16J40l4P5j77j43J76K36j58P1k82J36J86Qk22K03Pj9k13Q1K26j25k70K71
7007E7J26Qk47r5J80j06ql3R7M0j02J16k34L60O9j76q2Q2O9N8R9l04K02p8j63
7032f5J55OK4p1R1j14j18q4J98k16j8R7M1R4m8r1J41O1p8k4k9P7j3K9k00K11K9
7059H5k0j78m1O4m2p7L66l7j09K63k19j49J48j79J88j33L7r8r5K3K66k15L0K03
7083H1j42mj83J11K46K8j92l4J13m6J55q7k4J08J18j60p5j11K07j84j10K51k32
7106a66J36n5j11K43J6j10J48R8j72O5p1J2O6K46l40j19J52J48k30K63k70K47
7128A96j55j34K9L36j37j75J05J04k90R5N4j22N3K15j47Nl22J82J62j47J19l17
7150b91J90J85k7r9oj8k01J46J95l51K96N0K9j26MpMM7J92k57Mq1J79j9m8q6K15
$$ plain form
7177 119 215 108 -7 -13 27 296 35 56 145 132 218 -42 -131 -206 123 -25 155 -24 -93 -89 -61 56 100 -37 111
7202 111 4 91 -133 83 -115 -115 -27 -188 27 -116 1 -106 -67 69 -191 -196 -195 -162 67 103 -114 -109 265 -111
7226 -111 -11 8 -4 -133 137 -16 -97 37 -63 -135 -26 -56 1 101 44 -8 -83 45 208 -83 -13 132 92 39
7250 39 29 0 -86 -27 29 -83 -55 116 -104 -175 -41 28 -119 -203 -292 -76 91 -166 59 -177 -176 76 16 4 -9
7275 -9 -48 -48 122 -287 -104 35 8 101 97 -33 -16 -220 -132 -38 109 -108 179 127 -112 30 -37 93 -144 -187 -26
7300 -26 108 -111 22 -254 7 -27 123 -213 46 43 78 -28 244 183 24 -127 -105 -180 6 14 -89 -156 116 297
7324 297 133 146 -38 295 -46 217 145 93 40 -219 215 9 88 -49 13 224 -155 -220 -65 117 167 116 132
7347 132 75 -43 -69 79 224 -85 -35 -26 221 -175 39 30 153 145 -27 93 -135 75 -55 -64 -106 -293 -61 -205
$$ packed form
7177A19R6j07j15oM0K69k61K1Q9j3Q6k60q9p5L29j48J80j79o9MK8J17M4j37J48
7202A11j07Q7k24K16j98%Q8j61K15j43J17j07L9J36k60nJL3K29L6k17NL74l76
7226a11J00J9j2j29K70j53q1J34j00p2J09l0N7J00n7n2p5J28J63k91P0J45m0n3
7250C9j0k9q6N9N6j12K8J71k20p1J34O9j47q4q9K16J67k57K25k36JK52o0j2j3
7275il9%J70m09J83J39k7R3mj30J7k04Q8R4J47k17K87n2k39J42o7J30k37m3J61
7300b6J34k19J33k76K61l4J50l36K59lL5j06K72o1j59j51K2p5J86Qj03o7K72J81
7324B97j64J3j84L33l41K63p2n2n3k59M34k06P9j37O2K11l79o5J55J82N0n1J6
7347A32n7j18k6J48J45l09N0RK47l96K14rJ23qj72J20k28K10j30rm2j87K32j44
$$ plain form
7371 -205 33 54 -227 197 -51 26 -44 165 113 168 199 -186 -233 -20 37 164 83 42 -50 -154 -182 7 -221 -47
7395 -47 -3 -70 185 -10 -132 -5 -95 95 100 -48 -99 127 183 254 128 -72 -152 -1 -46 281 -9 50 -130 204
7419 204 -47 -316 186 -39 24 27 94 127 0 -87 57 245 -336 -427 37 -285 102 5 -188 -57 60 92 113
7442 113 -63 58 115 144 260 -99 -78 20 -113 77 -11 -41 144 26 -3 -75 64 -11 -62 84 98 -127 -270 39
7466 39 86 -6 -185 -25 -134 -68 92 -201 -9 9 -70 22 12 -16 -19 236 -42 -128 -116 -126 49 -53 -35 -100 -2 7
7492 7 81 -338 -48 7 -38 37 158 -45 95 -55 -69 129 -10 -78 -80 27 -57 -84 -70 -126 -74 162 193 -96 98
7517 98 127 22 -138 249 128 -53 -5 -162 109 -12 -211 27 -94 63 -99 -135 -29 84 34 -174 12 210
7539 210 -199 89 -157 -16 -26 -69 -168 -17 19 -77 149 -63 -90 -19 157 -66 -109 51 -20 155 131 108 203 132
$$ packed form
7371b05K38K1k81M24k48P7p0K09n2N5L1l85m7K13N7J27q1m1r2j04k8J89k28J74
7395d7M4o7K55j95j22J27r0J90Nj48n1K26N6P1j26k00q0J51m5L27k90N9j80L34
7419B04k51k69N02k25O3LO7L3j27q7J44J88n81r1M64l22L87r7j93J31J17L2K1
7442A13j76J21N7K9J16l59K1R8j33J90q8l0J85j18k9p2J39p5n1J46J4k25j43L09
7466C9M7r2j79J60j09O6J60k93J92J8p9R2j0k8lK55k78q6J2j0J75j02J8o5R8R
7492GP4m19K90N5m5P5J21k03J40j50j4J98j39o8kJ07q4k7J4n6N2K36L1k89J94
7517I8K9j05j60L87j21j81M8j57K71j21j99K38j21J57j62l6J06J13n0k08J86J98
7539B10m09K88k46J41j0m3r9J51L6r6K26k12k7P1J76k23m3J60p1J75k4k3R5p1
$$ plain form
7563 132 -367 11 12 137 163 -39 -59 58 8 -52 189 31 -50 244 -26 78 -172 -241 22 -55 33 -15 -87 77
7587 77 242 43 56 99 124 92 40 -27 40 99 -54 -96 71 287 61 94 169 80 154 116 -108 37 36 -227 23 -94
7613 -94 130 -45 53 -7 -12 -167 -2 -130 -22 -24 79 105 140 -54 101 -36 -51 -14 148 43 59 56 28 -67 -111 12
7639 12 -83 108 213 20 -157 -52 79 50 98 105 -105 53 142 -71 144 101 -272 127 -45 -71 32 -17 58 -161
7663 -161 38 87 10 -319 148 28 -11 195 -7 -122 -95 126 -71 32 -67 195 156 -60 112 254 143 -32
7685 -32 -90 54 220 17 -46 34 -111 -70 76 86 49 169 -22 -78 190 -178 34 -9 -83 44 -81 -93 -85 67
7709 67 -34 7 49 -43 1 2 97 139 85 117 -82 114 7 -14 78 -2 7 -233 -322 85 197 -82 -55 153 -110 127
7735 127 -28 244 -172 -130 -38 -4 127 -64 0 64 160 116 -186 -59 -88 -221 -117 94 68 120 32 -83 126 -83
$$ packed form
7563A32m99L78JJ25K6k02k0J17n0o0K41j58q1K94k70J04k50o9K63p7Q8m8p2J64
7587G7J65j99J3M3K5l2n2o7O7N9j53m2J67K16k26L3P5q9P4l8k24J45jk63K50j17
7613i4K24j75R8o0nj55J65j28J08kJ03K6L5j94J55j37j5L7J62j05J6lk8r5m4J23
7639A2r5J91J05j93j77J05J31k9M8Pk10J58Q9k13K15m3l73L99j72k6J03m9P5k19
7663a61J99M9p7l29M67j20l9K06k02j15K7K21j97J03r9K62l9k16J72J42j11j75
7685c2n8J44J66k03o3Q0j45M1J46J0l7J20j91n6K68l68K12m3p4J27j25j2QJ52
7709F7j01M1M2r2M4JR5M2n4L2j99J96j07k1R2q0Rk40q9M07J12k79K7K08k63K37
7735A27j55K72m16M2R2L4J31j91O4O4R6m4l02J27k9j33J04K11k6N2q8j15K09k09
$$ plain form
7759 -83 86 83 142 -22 32 136 -19 -4 -32 199 11 -34 -89 13 72 30 1 -190 -203 50 -107 -30 68 164 -94
7784 -94 -78 21 68 -37 -24 54 -92 -216 -159 -190 -106 -62 115 -88 -62 -322 -133 -169 -98 -118 4 63 -109 39 -66
7809 -66 -1 44 -124 249 -173 -173 96 -69 118 116 295 -36 126 -59 20 47 60 256 87 -28 134 284 -7
7832 -7 -13 -6 -200 122 -85 -235 35 -140 -42 150 111 -42 -48 147 24 -97 17 139 -149 -58 64 -49 -50 72
7856 72 126 -69 53 18 99 -51 126 20 58 153 41 170 -52 -12 23 -38 -388 216 -95 9 -37 39 51 104
7880 104 -38 92 -14 -101 9 14 -38 -7 116 -70 -119 -118 -36 -295 1 -113 6 -134 -105 13 -19 94 -11 -109
7904 -109 23 80 -78 172 -260 -108 -83 -24 117 35 80 -71 -66 -187 -17 -15 -23 -47 24 -5 181 26 -62 -106 -166 -178
7930 -178 87 -136 7 64 -17 -51 97 -137 66 143 207 -73 -1 108 -71 225 -148 164 -89 -104 85 -15
$$ packed form
7759h3J69lN9j64N4J04j55J5k8K31j88m5n5J02N9m2k9j91j3K53j57P7R8R6k58
7784i4J6R9M7j05J3P8j46j24N7l1Q4M4J77k03K6k60J89l6P1k0J22N9j72J48j05
7809f6O5M5j68L73m22%K69j65J87kJ79l31J62j85P9K7J3J96j69j15J62J50k91
7832goPj94L22k07j50K70j75R8J92l9j53oJ95j23j21J14J22k88R1J22j13jJ22
7856G2N4j95J22l5Q1j50J77j06L8R5j12J29k22M0L5o1l50O04l11J04m6P6J2N3
7880A04j42J30j06q7J10Nn2L1J23j86m9JQ2k59K96j14J19j40K9J18l2J13j05r8
7904a09J32N7j58K50m32J52K5N9J41q2M5j51Nj21J70Kqk4P1k9J86j55q8m4o0j2
7930a78K65k23J43N7q1l4J48k34K03P7O4k80P2J09j79K96l73L12k53j5J89j00
$$ plain form
7952 -15 136 -14 -120 -51 12 -49 -94 -89 -15 -105 -58 -144 1 -45 125 192 -37 -150 -20 -98 -186 47 264 -10 -50
7977 -50 -120 99 -49 204 -60 51 57 -27 -31 -82 -260 160 -2 38 -172 -42 -10 66 36 -172 52 116 -87 76
8001 76 -138 209 236 11 -307 -138 -4 -229 -202 -126 181 -105 -218 -48 122 32 134 106 44 -233 -4 -158
8023 -158 -70 -59 108 -36 145 118 3 86 -44 -145 -108 146 228 96 -39 117 104 71 -22 11 -86 -5 151 -89
8047 -89 -108 -118 12 -56 126 16 -126 22 -207 -20 47 0 -127 -38 128 -22 63 -3 -18 -41 -70 -208 67 200
8071 200 78 105 65 73 -92 103 46 195 105 128 -94 151 23 -72 27 -73 -40 129 174 -58 49 16 3 -242
8095 -242 17 11 -15 -19 -118 31 35 81 -15 171 -58 -77 -216 209 -188 -122 68 -5 5 -21 -151 185 246 113 -74
8120 -74 -29 -27 185 165 86 167 -80 -66 37 35 98 -27 3 -81 -326 -102 111 91 105 -127 -91 -91 -8 71 -3 -14 52 13
$$ packed form
7952a5J51j50j06O9O3o1m5NP4r0M7q6J45m6J70O7k29j13J30p8q8K33K17k74m0
7977e0p0K19j48K53k64J11Oq4mn1j78M20j62M0k10J30L2P6l0k08K24O4k03J63
8001G6k14L47K7k25l18J69J34k25K7P6L07k86j13J70J70r0J02k8o2k77K29j54
8023a58Q8J1J67j44J81k7j15Q3j30j01L7K54Q2j32j35J56j3l3r3L3r7Q1J56k40
8047h9j9j0J30o8J82j10j42J48k29J87O7m7j27Q9J66j50Q5o6j5k3k9j38K75J33
8071B00j22K7m0Qj65J95n7J49r0K3k22K45j28r5R9j00L3J69M5k32J07l3j3k45
8095b42K59ok6mr9J49MM6r6J86k29j9j39M25l97O6J90p3J0k6j30L36O1j33j87
8120g4M5KK12k0p9Q1k47J4J03kO3j25L0q4k45K24K13k0J4k32L6%Q3P9p4j1O6l9
$$ plain form
8148 13 -196 -67 140 -39 40 -57 20 -177 158 -90 97 -143 -62 -18 32 -29 20 -7 -69 -15 -88 -84 -150 -208 -142 274
8174 274 -60 -245 -226 95 68 -111 -57 153 -19 -58 -50 77 150 -85 -76 66 -10
$$ packed form
8148A3k09J29K07j79P9r7P7j97L35k48J87k40Q1M4N0o1M9k7o2N4p3Mo6n8O6M16
8174B74l34j85J9L21k7j79N4K10j72l9QJ27P3k35RJ42p6
8191a0
$$ Imaginary data points
##PAGE= N=2
##DATA TABLE= (X++(I..I)), XYDATA
$$ plain form
0 0 0 0 0 0 0 0 0 0 0 0 4 -8 8 -8 8 -16 16 -24 24 -32 40 -42 52 -64 72 -82 97 -113 130 -150 170 -194 223
33 223 -251 285 -320 361 -402 449 -504 561 -622 691 -766 847 -935 1031 -1137 1253 -1382
50 -1382 1521 -1675 1847 -2038 2251 -2494 2768 -3081 3446 -3874 4389 -5019 5812 -6843 8245
65 8245 -10274 13474 -19314 33412 -143450 -28782 269067 14818 -135569 -59641 76290
76 76290 45825 -12812 -25815 -24222 -35591 60305 88895 4231 -76286 -58253 56502 112653
88 112653 -47755 -125833 7323 88125 25859 -40079 -45082 -599 352 7956 36888 -32740
100 -32740 -71432 53003 91363 -21798 -68132 -51 45970 -231 -24552 30569 7086 -44595
112 -44595 18969 44144 -26369 -47980 -17296 31138 42596 -26101 -38261 30500 25760 -27670
$$ packed form
0@%%%%%%%%%%Mj2J6j6J6k4L2m0M8n6P2q2R4j16J36j54J79k10K43k80L20l64M17
33B23m74N36o05O81p63Q51r53J065j183J313j457J613j782J966k168K390k635
50a382K903l196L522l885M289m745N262n849O527p320Q263r408J0831j2655J5088
65H245j8519K3748l2788N2726j76862J14668K97849k54249j50387P5928J35931
76G6290l0465n8637j3003J593j1369R5896K8590q4664q0517J8033J14755N6151
88A12653j60408p8078J33156Q0802o2266o5938n003M4483R51P604K8932o9628
100c2740l8692J24435L8360j13161m6334O8081M6021m6201k4321N5121k3483n1681
112d4595O3564K5175p0513k1611L0684M8434J1458o8697j2160O8761m740n3430
$$ plain form
124 -27670 -18385 32034 16501 -52083 -2088 93266 5411 -97670 -11442 71057 14286 -57740
136 -57740 -32935 39740 30301 -22705 -8952 2808 -18425 -478 22523 12676 -8522 -17242 19277
149 19277 39823 -11721 -41004 -2953 27163 10317 -18769 -4525 16165 -16000 -21152 20709
161 20709 -646 -39227 392 37204 6114 -23097 159 22629 -1649 -14327 12573 14014
173 14014 -7244 -1441 13313 11678 -6608 -22531 -6556 12037 -4458 -15334 3844 8745 -12441
186 -12441 -11521 15720 6996 -31143 -14149 42518 32805 -27172 -25016 26853 28123 -13575 -21395
199 -21395 1578 11285 5714 1586 -5223 -16413 -11077 8470 6706 -12366 -15484 2162 22959
212 22959 13233 -18711 -13488 14106 10625 -1308 1825 1830 -1545 2607 13088 1777 -28145 -13859
$$ packed form
124b7670R285N0419j5533o8584M9995R5354q7855j03081Q6228Q2499n6771p2026
136e7740K4805P2675r439n3006J3753J1760k1233J7947K3001r847k1198q720L6519
149A9277K0546n1544k9283L8051L0116j6846k9086J4244K0690l2165n152M1861
161B0709k1355l8581L9619L6812l1090k9211K3256K2470k4278j2678K6900J441
173A4014k1258N803J4754j635j8286j5923J5975J8593j6495j0876J9178M901k1186
186a2441R20K7241q724l8139J6994N6667r713n9977K156N1869J270m1698p820
199b1395K2973R707n571m128o809j1190N336J9547j764j9072l118J7646K0797
212B2959r726l1944N223K7594l481j1933L133Nl375M152J0481j1311k9922J4286
$$ plain form
226 -13859 23746 8491 -20199 -9631 9314 11133 -4926 -12852 2963 4759 -584 10224 6555
239 6555 -3227 699 380 4282 807 -16079 -2136 14567 -2241 -9849 -2752 2025 1106 -12563
253 -12563 -3381 14953 -2775 -6240 14826 5630 -4680 359 1048 5174 -1234 -3931 10895 -130
267 -130 -11082 3441 -1985 -8788 -3124 -6477 3431 6885 -9181 37 8604 -2884 -976 133
281 133 4435 11302 -4305 361 16454 -4934 -10882 5459 170 -3676 -4852 -3988 7549 -2912
295 -2912 -10914 3747 -3791 -6320 7538 -1778 -1744 8172 1075 4996 2924 -7693 4789 6417 -2770
310 -2770 2557 -2440 1022 7514 -11728 -8243 7658 -6007 -6104 4465 -224 478 -2462 -1303 8501
325 8501 -5095 -6416 11936 2474 -1825 5990 -2869 404 3872 -6909 -1409 925 -2973 3811
$$ packed form
226a3859L7605j5255k8690J0568J8945J819j6059p926J5815J796n343J0808l669
239F555r782L926l19L902l475j6886J3943J6703j6808p608P097M777r19j3669
253a2563R182J8334j7728l465K1066r196j0310N039O89M126o408k697J4826j1025
267a30j0952J4523n426o803N664l353R908L454j6066R218Q567j1488J908J109
281A33M302O867j5607M666J6093k1388n948J6341n289l846j176Q64J1537j0461
295b912q002J4661p538k529J3858r316L4R916p097L921k072j0617J2482J628r187
310b770N327m997L462O492j9242L485J5901j3665r7J0569m689P02k940J159R804
325H501j3596j321J8352r462m299P815q859L273L468j0781N500K334l898O784
$$ plain form
339 3811 -2771 -4492 3627 -5540 -2578 5889 -5913 96 10495 -858 -824 3057 500 2648 -3639
354 -3639 -1336 7504 -4437 -3349 6672 -5396 -6369 1667 -3730 -826 490 -3038 4014 2747 -862
369 -862 2463 -2692 2185 7916 -3799 186 8425 -2739 -1580 2252 -3826 -3173 -2738 -1274 2014
384 2014 -4574 -2531 2523 -4539 -431 4609 -3985 -751 7148 3607 2299 17 -185 3858 958
399 958 -311 -101 -4305 1403 4311 -5665 -5440 -842 -3805 -1043 1517 -1853 -2212 650 5624 3662
415 3662 -3941 -853 4895 2606 3638 2660 -3457 -751 4312 1084 -4826 -5629 -1002 2031 152 -2108
431 -2108 -3701 -2802 2548 2719 -2353 -1633 2994 2882 1942 3840 1504 -3400 -1491 4645 2673 -3640
447 -3640 -4723 -14 3510 202 -3924 -6074 -2501 4784 3131 -4107 -1561 2875 2147 2880 1785 -1532
$$ packed form
339C811o582j721Q119r167K962Q467j1802O009J0399j1353L4L881k557K148o287
354c639K303Q840j1941J088J0021j2068r73Q036n397K904J316l528P052j267l609
369h62L325n155M877N731j1715L985Q239j1164J159L832o078O53M35J464L288
384B014o588K043N054p062M108N040q594L234P899l541j308k282k02M043k900
399I58j269K10m204N708K908r976K25M598k963K762K560l370l59K862M974j962
415C662p603L088N748k289J032r78o117K706N063l228n910q03M627L033j879k260
431b108j593Q99N350J71n072P20M627j12r40J898k336m904J909O136j972o313
447c640j083M709L524l308m126k150L573P285j653p238K546M436p28P33j095l317
$$ plain form
463 -1532 -1705 829 5798 3982 -5302 -5247 1094 2765 1483 -6678 -9310 3708 7391 -1232 -5113 -3735
479 -3735 3394 5344 -1369 529 2374 -1269 3604 6221 -438 -3056 -4676 734 8041 -1963 -9401
494 -9401 -2747 2366 4880 -2524 -11145 -503 6239 -29 1765 926 -2092 2057 2352 4277 4104 -6629
510 -6629 -2643 7862 3981 -606 -7531 -8317 7098 6207 -7230 -7332 -3286 4122 7668 -4837 -5574
525 -5574 1418 569 6532 5608 -5296 -1950 2914 5544 7471 -6411 -10257 3616 6560 2754 -5751
540 -5751 -12845 3181 10246 -4230 -5627 -2725 -1145 6763 4062 -1298 -1122 -4257 5155 10941 -4010
555 -4010 -6259 289 2192 8017 -1514 -12412 -457 4650 308 -660 -5942 -2156 4139 24 3784
570 3784 1744 -7981 1631 7970 1785 980 -4184 -2785 8195 3266 -4429 -5146 -5180 5659 5613 -8190
$$ packed form
463a532j73K534M969j816r284N5O341J671j282q161k632J3018L683q623l881J378
479c735P129J950o713J898J845l643M873K617o659k618j620N410P307j0004p438
494i401O654N113K514p404q621J0642O742o268J794q39l018M149K95J925j73j0733
510f629L986J0505l881m587o925p86J5415q91j3437j02M046P408L546j2505p37
525e574O992q49N963r24j0904L346M864K630J927j3882l846J3873K944l806q505
540e751p094J6026P065j4476j397K902J580P908k701n360J76l135R412N786j4951
555d010k249O548J903N825r531j0898J1955N107m342r68n282L786O295m115L760
570C784k040r725R612O339o185q05n164J399J0980m929p695p17l4J0839m6j3803
$$ plain form
586 -8190 -4458 895 -1619 4319 1148 -5244 -121 2369 5111 5111 -4779 -3283 3606 3851 5754 -3882
602 -3882 -11276 4638 8014 -4337 -5615 -3270 168 2843 -2205 -1687 -636 -2517 5587 5299 -3529
617 -3529 -322 279 983 7916 1455 -6168 -356 3304 2378 -2778 -6162 1407 1830 -4018 638 -541
633 -541 -4784 1136 2190 -614 1455 294 -367 1730 2944 3899 -2255 -4768 4971 3942 -4031 -1588
649 -1588 -990 -1751 1711 15 -4618 -3319 1048 2525 -577 -1571 1800 -329 -248 5694 1065 -5083
665 -5083 1424 5893 1448 -2205 -2429 -644 315 1118 -487 -5351 -3110 3819 1359 -4309 -1516 1874
681 1874 851 1451 1950 -1486 -943 4295 3592 -1931 -1259 1739 -565 -1900 704 -207 -4068 -1314 2373
698 2373 -2080 -4068 1005 1187 -833 1804 1429 -971 1051 3003 1057 -1003 1375 3169 -1686 -1616
$$ packed form
586h190L732N353k514N938l171o392N123K490K742%r890J496O889K45J903r636
602c882p394J5914L376j2351j278K345L438K675n048N18J051j881Q104k88q828
617c529L207O01P04O933o461p623N812L660r26n156l384P569M23n848M656j179
633e41m243N920J054k804K069j161o61K097J214R55o154k513R739j029p973K443
649a588N98p61L462j696m633J299M367J477l102r94L371k129Q1N942m629o148
665e083O507M469m445l653k24J785R59Q03j605m864K241O929k460n668K793L390
681A874j023O00M99l436N43N238p03n523O72K998k304j335K604r11l861K754L687
698B373m453j988N073J82k020K637l75k400K022J952j946k060K378J794m855P0
$$ plain form
714 -1616 2779 -1542 -4092 959 -105 -2648 -899 -970 -791 -517 505 2005 -1691 -418 4882 18
730 18 -1435 4451 1084 -1168 2254 23 -1397 -901 -825 645 -2140 -2109 1481 -3041 -2037 3670 -2618
747 -2618 -2536 4347 1046 -881 916 974 2681 372 -569 2676 -868 -765 2939 -3249 -2473 3016 -2827
764 -2827 -2998 1133 -1649 -437 -423 -567 2829 -1100 -715 4148 -1031 -174 4493 -1421 -370 3284 -1819
781 -1819 -1253 196 -1285 818 -2990 -2545 2708 -2667 -2058 2928 -2609 198 4244 -2033 471 2880
797 2880 -14 1711 -286 -190 3160 -2478 -1241 3146 -3325 -1654 2010 -3762 -1162 998 -3066 721
813 721 832 -746 2105 -1220 390 4468 -2056 -123 4351 -1228 494 1857 -2563 684 16 -2596
829 -2596 345 -2116 -1412 1731 -3152 -995 2733 -2747 247 3140 -1354 1491 1957 -377 3023 147
$$ packed form
714a616M395m321k550N051j064k543J749p1J79K74J022J500l696J273N300m864
730A8j453N886l367k252L422k231j420M96P6J470k785L1L590m522J004N707o288
747b618Q2O883l301j927J797N8J707k309r41L245l544J03L704o188P76N489n843
764b827j71M131k782J212J4j44L396l929L85M863n179Q57M667n914J051L654n103
781a819N66J449j481K103l808M45N253n375O09M986n537K807M046o277K504K409
797B880k894J725j997R6L350n638J237M387o471J671L664n772K600K160m064L787
813G21J11j578K851l325J610M078o524J933M474n579J722J363m420L247o68k612
829b596K941k461P04L143m883K157L728n480K994K893m494K845M66k334L400k876
$$ plain form
845 147 -656 2148 -1576 -7 1659 -3931 -849 1626 -3116 -960 -81 -1915 1099 -372 -999 2673
861 2673 -621 504 3106 -391 1313 2087 -2065 1593 2032 -2181 -443 -892 -882 1052 -2639 -1720 1130
878 1130 -1783 -192 1270 -2213 618 2295 -153 1117 599 255 2629 230 214 1608 -1625 -570
894 -570 1004 -1296 -1062 -1204 -1855 1029 50 -2438 -823 565 1509 1155 -1548 1046 2753 -246 228
911 228 1704 -1 -275 -113 151 274 -1832 -1783 -72 -311 -786 -1144 -1921 202 1722 -200 -925 515
929 515 1436 1582 886 844 359 420 788 531 -469 -797 -798 -750 -283 263 -1917 -3249 620 2336 -1025 -1963
949 -1963 511 2166 1523 -215 24 1513 766 781 1266 -620 -72 -273 -911 899 -670 -3219 -581
966 -581 1156 -273 -1286 -1584 880 1828 -878 610 1838 -1092 1326 2398 -98 239 -257 -149 1561
$$ packed form
845A47q03K804l724J569J666n590L082K475m742K156Q79j834L014j471o27L672
861B673l294J125K602l497J704P74m152L658M39m213J738m49J0J934l691R19K850
878A130k913J591J462l483K831J677k448J270n18l44K374k399j6J394l233J055
894e70J574k300K34j42o51K884r79k488J615J388R44l54k703K594J707k999M74
911B28J476j705k74J62K64J23k106M9J711k39m75l58p77K123J520j922p25J440
929E15R21J46o96m2m85O1L68k57j000l28jM8M67N46k180j332L869J716l361r38
949a963K474J655o43j738K39J489p47J5M85j886N48k01o38J810j569k549K638
966e81J737j429j013k98K464R48k706J488J228k930K418J072k496L37m96J08J710
$$ plain form
983 1561 -900 -1613 -258 -1979 570 665 -3240 -562 703 -1054 1649 252 -1467 1630 1378 1074
999 1074 1495 -1012 815 1732 -904 1467 -450 -4250 1365 1820 -2542 -1745 -1630 442 1965 -2460
1015 -2460 -546 2072 -601 1509 1758 -857 1754 312 -712 4161 -119 -3433 816 767 563 -1449
1031 -1449 -4320 1564 1594 -3785 -11 681 -1815 1475 530 -275 2613 -949 262 2859 -110 714
1047 714 6 -2170 2832 868 -3308 102 -813 -1403 1912 -2229 -2220 1936 -510 287 380 -1270 2371
1064 2371 673 -1297 3659 681 -2497 1607 1312 427 -442 -3601 741 2475 -2986 -1748 -233 -567
1080 -567 1575 -1487 -1725 2770 -530 -904 3449 241 -329 861 124 2544 -136 -2912 1329 575
1096 575 -1609 767 -1784 -1914 1299 -1321 -477 642 -1475 1309 1771 -961 710 680 549 2126 -636
$$ packed form
983A561k461p13J355j721K549R5l905K678J265j757K703j397j719L097k52l04
999A074M21k507J827R17k636K371j917l800N615M55m362P97J15K072J523m425
1015b460J914K618k673K110K49k615K611j442j024M873m280l314M249m9k04k012
1031a449k871N884L0n379L774O92k496L290r45q05K888l562J211K597k969Q24
1047G14p08k176N002j964m176L410r15n90L315m141RM156k446P97R3j650L641
1064B371j698j970M956k978l178M104k95q85q69l159M342J734n461J238J515l34
1080e67K142l062k38M495l300l74M353l208n70J190p37K420k680k776M241p54
1096E75k184K376k551j30L213k620Q44J119k117K784M62k732J671l0j31J577k762
$$ plain form
1113 -636 -68 2123 -1649 -578 2018 -1259 -1547 -597 -824 719 -1126 -1843 1227 76 -579 1300 -568
1130 -568 337 1647 -114 1303 890 -992 920 1055 -739 -311 -810 -199 -64 -2130 -624 642 -1991
1147 -1991 -837 1494 -371 -528 233 1301 1615 -413 -42 1919 614 -70 194 -97 579 -205 -1588
1164 -1588 -249 -163 -1686 -1177 548 252 -907 -590 1020 897 -470 942 1365 346 676 1001 326
1181 326 -358 327 522 -458 -886 -307 -514 -369 -840 -697 221 -199 -788 -254 784 1039 -45 -123 2192
1200 2192 1330 -1418 403 1694 -184 -673 -269 379 -272 -1734 -443 -70 -1458 -135 -121 -863 847
1217 847 141 -886 1573 631 -102 1276 699 207 149 -236 950 -486 -1659 1214 -386 -2614 463
1234 463 252 -1467 -253 -555 248 132 -1267 1073 1318 -177 1298 524 -641 1746 -270 -1218 1640
$$ packed form
1113f36N68K191l772J071K596l277k88R50k27J543j845p17L070j151o55J879j868
1130e68R05J310j761J417m13j882J912J35j794M28m99O11J35k066J506J266k633
1147a991J154K331j865j57P61J068L14k028L71J961j305o84K64k91O76p84j383
1164a588J339Q6j523N09J725k96j159L17J610j23j367J412M23j019L30L25o75
1181C26o84O85J95r80m28N79k07J45m71J43R18m20n89N34J038K55j084p8K315
1200B192q62k748J821J291j878m89M04O48o51j462J291L73j388J323J4p42J710
1217H47p06j027K459r42p33J378n77m92n8l85J186j436j173K873j600k228L077
1234D63k11j719J214l02Q03j16j399K340K45j495J475p74j165K387k016r48K858
$$ plain form
1251 1640 -306 -1297 -42 -794 -251 -920 -1355 1183 -778 -1927 1907 106 -1376 2043 534 -334
1267 -334 1286 138 943 379 -1062 1340 275 -1422 803 -1091 -1471 1354 -1746 -1652 1560 -784
1283 -784 -1070 476 228 1419 -388 -254 2704 -255 -1640 2220 134 -1104 1261 -1025 -598 468
1299 468 -1327 -189 -525 -1194 1003 -905 -1144 2044 -748 -488 2461 -546 19 1694 -196 331 551
1316 551 -367 790 -1077 -838 1600 -1909 -1775 1785 -1198 -1273 664 -875 426 796 -675 1133 294
1333 294 329 1647 -724 114 1942 -1267 -358 1612 -1175 -866 334 -1171 -468 -681 -705 406 -941
1350 -941 -180 1352 -1224 301 2315 -440 96 1373 -26 639 282 -344 633 -771 -501 394 -1514
1367 -1514 -524 593 -1926 -403 798 -941 -249 707 432 597 -121 688 1370 -234 538 978 -1041
$$ packed form
1251A640j946r91J255p52N43o69m35K538j961j149L834j801j482L419j509q68
1267c34J620j148Q05n64j441K402j065j697K225j894l80K825l100R4L212k344
1283g84k86J546k48J191j807J34K958k959j385L860k086j238K365k286M27J066
1299D68j795J138l36o69K197j908k39L188k792K60K949l007N65J675j890N27K20
1316E51r18J157j867K39K438l509J34L560k983p5J937j539J301L70j471J808q39
1333B94L5J318k371Q38J828l209R09J970k787L09J200j505P03k13k4J111j347
1350i41P61J532k576J525K014k755N36J277j399O65l57o26R77j404K70Q95j908
1367a514R90J117k519J523J201j739O92R56k75J65p18Q09O82j604P72M40k019
$$ plain form
1384 -1041 333 808 -1087 -454 -65 -845 -382 -435 -112 15 -850 241 685 -617 524 886 -29 1010
1402 1010 1042 29 -66 473 330 -294 -752 -41 -91 -969 -237 -435 -1107 3 353 -314 -223 456 306 60
1422 60 640 1063 363 44 795 512 -412 -476 -117 -197 -133 -315 -665 -823 227 219 -1080 -112 688 -4 52 488
1444 488 598 419 199 922 722 -196 59 -34 -485 459 -93 -1621 -211 245 -493 -790 -450 115 348 -776
1464 -776 457 1051 -102 598 508 256 973 0 -666 784 480 -639 -655 -756 537 -86 -2128 -245
1482 -245 448 -625 197 -334 33 1102 -181 -109 1155 100 246 261 -172 968 242 -1700 620 383
1500 383 -1134 -289 -1045 -125 834 -1220 -277 931 -389 586 265 -422 1461 166 -727 1322 324 -282
1518 -282 150 -823 464 93 -1919 299 341 -1401 106 -100 -741 1051 -371 -287 1286 -246 376 1172
$$ packed form
1384a041J374M75j895O33L89p80M63n3L23J27q65J091M44j302J141L62r15J039
1402A010L2j013r5N39j43o24m58P11n0q78P32j98o72J110L50o67R1O79j50k46
1422F0N80M23p00l19P51k83r24o4L59q0O4j82l50j58J050qj299R68Q00o92N6M36
1444D88J10j79k20P23k00r18K55r3m51R44n52j528J410M56p38k97L40N65K33j124
1464g76J233N94j153P00r0k52P17r73o66J450l04j119j6j01J293o23k042J883
1482b45O93j073Q22n31L67J069j283P2J264j055J46J5m33J140p26j942K320k37
1500C83j517Q45p56R20R59k054R43J208j320R75l21o87J883j295q93K049r98o06
1518b82M32r73J287l71k012K218M2j742J507k06o41J792j422Q4J573j532O22P96
$$ plain form
1536 1172 -73 995 311 -805 1164 439 -1331 421 -562 -786 222 -964 -202 234 -1291 303
1552 303 722 -1026 965 620 -67 1406 328 -78 1353 -12 -9 312 -1032 103 98 -1595 186 -86
1570 -86 -1597 347 -232 -643 522 -486 38 1023 -153 682 613 -724 1622 394 -1244 956 151
1587 151 -883 161 -699 -113 236 -1334 -115 325 -1015 407 61 -161 1464 -168 -667 1449 679
1604 679 -295 541 49 380 -62 -1331 460 -70 -1314 225 -306 -962 407 -509 -361 528 -221 196
1622 196 376 308 833 247 -609 753 330 -285 460 -628 -470 470 -345 -880 -171 -176 -164 -644 -363 909
1642 909 -312 -414 931 510 -78 367 433 292 162 -81 -180 -237 -153 -253 -693 -588 38 -654 -675 195 -421
1663 -421 -154 531 513 -30 144 803 546 47 644 830 -199 -421 174 -77 -570 -420 -116 -607 -335 -241
$$ packed form
1536A172j245J068o84j116J969p25j770J752r83k24J008j186P62M36j525J594
1552C03M19j748J991l45o87J473j078m06J431j365LL21j344J135nj693J781k72
1570h6j511J944n79m11J165j008N24R85j176Q35o9j337K346j228j638K200q05
1587A51j034J044q60N86L49j570J219M40j340J422l46k22J625j632m99K116p70
1604F79r74Q36m92L31m42j269J791n30j244J539n31o56J369r16J48Q89p49M17
1622A96J80o8N25n86q56J362m23o15P45j088J58R40q15n35P09nJ2m80K81J272
1642I09j221j02J345m21n88M45O6j41j30k43r9n7Q4j00m40J05O26o92k1Q70o16
1663d21K67O85j8n43J74O59k57m99N97J86j029k22N95k51m93J50L04m91K72R4
$$ plain form
1683 -241 -245 -223 169 -146 -176 496 616 186 94 691 655 105 78 737 -373 -443 310 -463 -540 -6 -374 -684 -310
1706 -310 -136 -111 -458 48 791 -47 -66 828 -17 277 729 -162 193 574 -110 -350 -170 -302 -61 -1021 -381
1727 -381 637 -924 -299 661 -372 -42 534 -137 613 562 -132 629 -71 320 610 -833 7 260 -888
1746 -888 -251 138 -912 -14 -69 -672 326 -77 62 679 -490 520 1039 -627 230 1052 -475 -43 211
1765 211 -412 304 -531 -760 233 -735 -244 -32 -940 590 654 -958 593 979 -608 595 528 98 696
1784 696 -287 252 401 -949 174 166 -1515 8 266 -1178 -50 -368 -518 654 -503 14 1040 -172
1802 -172 535 716 -183 1043 362 -1086 1215 175 -791 20 -491 -281 324 -954 -12 307 -1164 271
1820 271 325 -582 1017 177 -455 1040 384 15 655 -321 123 342 -897 336 -114 -1118 461 -430
$$ packed form
1683b41mK2L92l15l0O72J20m30r2N97l6n50k7O59j110p0P53p73p7N34l68l10L74
1706c10J74K5l47N06P43q38j9Q94q45K94M52q91L55L81o84k40J80j32K41r60O40
1727c81J018j561O25R60j033L30N76o71P50n1o94P61p00L91K90j443Q40K53j148
1746h88O37L89j050Q98n5o03R98m03J39O17j169J010N19j666Q57Q22j527M32K54
1765B11o23P16q35k29R93r68M91K12r08J530O4j612J551L86j587J203o7m30N98
1784F96r83N39J49j350J123qj681J523K58j444J128l18j50J172j157N17J026j212
1802a72P07J81q99J226o81j448K301j040r66Q11n11K10O05j278R42L19j471J435
1820B71N4r07J599q40o32J495o56l69O40r76M44K19j239J233m50j004J579q91
$$ plain form
1838 -430 -1034 542 -379 -880 715 36 43 164 -217 724 316 -487 693 512 -328 582 -452 -584 448
1857 448 -581 -616 148 -416 -196 -217 -464 350 -265 -354 989 163 -96 1069 224 159 488 -155 -69 82 -122
1878 -122 320 -715 -666 164 -449 -711 -62 -435 -106 554 -1 39 627 -9 309 43 383 565 -402 107
1898 107 612 -157 -782 298 96 -280 -450 -330 -226 -352 179 100 -190 237 532 -113 352 449 46 -127
1918 -127 293 117 -181 27 18 -377 -300 7 -223 -431 -171 -81 -237 -271 222 195 -262 218 557 183 165 855
1940 855 193 -31 279 -106 -332 105 -284 -59 -628 -234 -65 -473 -160 448 -158 41 680 144 -56 625
1960 625 286 148 -146 448 453 -347 18 159 -939 -338 235 -951 -102 139 -462 162 60 169 223 -457
1980 -457 697 955 -390 65 761 -179 135 200 -472 145 77 -599 -249 -497 -180 45 -845 201 556 -1018
$$ packed form
1838d30o04J576r21n01J595o79PJ21l81R41m08q03J180j81q40R10j034j32J032
1857D48j029l5P64n64K20k1k47Q14o15q9J343q26k59J165q45o5L29o43Q6J51k04
1878a22M42j035M9Q30o13k62O49l73L29O60n55M0N88o36L18k66L40J82r67N09
1898A07N05p69o25J080k02l76j70J20J04j26N31p9k90M27K95o45M65R7m03j73
1918a27M20j76k98K08rl95P7L07k30k08K60R0j56l4M93k7m57M80L39l74j8O90
1940H55o62k24L10l85k26M37l89K25n69L94J69m08L13O08o06J99O39n36k00O81
1960F25l39j38k94N94Nq00L65J41j098O01N73j186Q49K41o01O24j02J09N4o80
1980d57J154K58j345M55O96r40L14O5o72O17o8o76L50k48L17K25q90J046L55j574
$$ plain form
2000 -1018 329 565 -284 592 52 -163 641 111 -39 292 -489 235 59 -1081 129 162 -742 42 81
2019 81 -339 235 -446 -206 773 -234 253 412 -398 721 333 -817 618 469 -749 67 -139 -241 78
2038 78 -1025 -193 376 -766 77 313 -357 332 179 -224 988 199 -332 580 17 277 343 -756 372
2057 372 82 -1034 145 -157 -855 440 -122 -398 307 -274 226 563 -28 622 516 -289 752 483 -379
2076 -379 693 -471 -581 458 -425 -487 -2 -540 17 -322 -605 660 209 -433 821 192 -39 1047
2094 1047 192 326 471 -186 341 227 -358 129 -110 -709 4 -354 -482 306 -504 -173 473 -423 211 483
2114 483 100 421 400 -180 719 173 -324 345 130 -248 173 -371 22 -143 -519 -8 -1 -421 -27 -50 -27 182
2136 182 88 242 460 177 357 486 -142 286 -154 -379 43 -295 -427 66 -552 -510 65 -149 -182 -338 76
$$ packed form
2000a018J347K36q49Q76n40k15Q04n30j50L31p81P24j76j140J210L3r04P84L9
2019H1m20N74o81K40R79j007M87J59q10J119l88j150J435j49j218Q16k06j02L19
2038G8j103Q32N69j142Q43K36o70O89j53m03J212p89n31R12n63K60O6j099J128
2057C72k90j116J179l02o98J295n62k76P05n81N00L37n91O50j06q05J041k69q62
2076c79J072j164j10J039q83o2M85n38N57l39k83J265m51o42J254o29k31J086
2094A047q55J34J45o57N27j14n85M87k39n99P13l58j28P88q10L31O46q96O34K72
2114D83l83L21k1n80Q99n46m97O69k15l78M21n44L93j65l76N11Pm20L94k3K3K09
2136A82r4J54K18k83J80J29o28M28m40k25M22l38j32M93o18M2N75k14l3j56M14
$$ plain form
2157 76 453 -84 62 458 233 86 25 356 251 87 -105 -53 -202 -246 -296 -183 51 -44 -430 202 216 186 45
2180 45 50 414 247 -11 570 312 -171 413 26 -153 -74 74 15 -191 -340 133 -39 -719 284 291 -8 117
2202 117 131 218 649 -45 105 277 -7 53 -57 -29 181 -192 -535 327 -217 -675 -88 -78 -407 -3 -112 6
2224 6 275 -125 480 319 -166 578 -112 -71 523 -35 -104 247 -408 -111 -43 -473 -84 -209 -448 416 -162 -240
2246 -240 887 -100 -402 523 -74 137 210 -72 367 -70 -407 364 -328 -201 318 -511 -278 429 -695 -1
2266 -1 337 -193 193 156 -133 782 -139 -157 695 -369 43 671 -265 -253 8 -534 -393 -290 -530 422 -274
2287 -274 -485 566 -215 -156 423 -505 258 583 -123 302 344 2 163 -137 -214 351 -606 -282 286 -819
2307 -819 -255 292 -465 -63 27 -129 148 -139 103 712 -142 164 847 -454 136 350 -668 234 147 -524
$$ packed form
2157G6L77n37J46L96k25j47o1L31j05j64j92N2j49m4n0J13K34r5l86O32J4l0j41
2180D5NL64j67k58N81k58m83N84l87j79P9J48n9k06j49M73j72o80J003Pk99J25
2202A17J4Q7M31o94J50J72k84O0j10K8K10l73l43Q62n44m58N87J0l29M04j09J18
2224FK69m00O05j61m85P44o90M1N94n58o9L51o55K97O8m30L89j25k39Q64n78p8
2246b40J127r87l02R25n97K11P3k82M39m37l37P71o92J27N19q29K33P07j124O94
2266aL38n30L86l7k89R15r21j8Q52j064M12O28r36J2K61n42J41J03k40R52o96
2287b74k11J051p81N9N79r28P63L25p06M25M2l42J61l00p7N65r57L24N68j105
2307h19N64N47p57M02R0j56K77k87K42O09q54L06O83j301N90K14j018R02q7o71
$$ plain form
2327 -524 -9 -203 -414 -108 -461 230 415 -345 56 702 -281 222 591 -160 158 275 -178 390 -93 -251
2347 -251 174 -387 84 118 -560 210 141 -423 -6 310 -233 288 184 82 -18 68 429 299 -423 383 99
2368 99 -484 6 4 -301 -208 -194 -126 255 -158 -82 -149 -4 154 -20 -292 703 263 -108 269 -85 27 -45 -80
2391 -80 145 99 -296 68 -514 -330 138 -280 -430 113 141 346 34 -98 18 323 172 171 191 212 238 -259 -176
2414 -176 -19 108 -443 -174 40 -30 -260 144 297 -321 75 161 196 249 69 273 245 201 195 -322 -110 223 115
2437 115 -551 14 201 -359 -185 7 -92 -100 -21 66 92 15 306 28 8 535 243 -433 218 63 -43 -117 -296
2460 -296 -85 -46 -307 -52 -181 -125 126 -545 -301 636 127 -370 528 349 167 328 -173 -84 -168 -336 209
2481 209 108 -415 7 -328 -488 -12 -164 -152 91 90 73 -33 -9 390 33 -161 323 -102 -12 647 -254 -291
$$ packed form
2327e24N15j94k11L06l53O91J85p60M01O46r83N03L69p51L18J17m53N68m83j58
2347b51M25n61M71L4o78P70o9n64M17L16n43N21j04j02j00Q6L61j30p22Q06k84
2368I9n83M90kl05R3J4O8L81m13P6o7J45J58j74k72R95m40l71L77l54J12p2l5
2391h0K25m6l95L64n82J84M68m18j50N43K8K05l12j32J16L05j51jK0K1K6m97Q3
2414a76J57J27n51K69K14p0k30M04J53o18L96Q6L5N3j80K04k8m4on17K12L33j08
2437A15o66N65J87n60J74J92r9qP9Q7K6p7K91k78k0N27k92o76O51j55j06p4j79
2460b96K11L9k61K55j29N6K51o71K44R37n09m97Q98j79j82J61n01Q9q4j68N45
2481B09j01n23M22l35j60M76j52J2K43jj7j06K4L99l57j94M84m25R0O59r01l7
$$ plain form
2503 -291 183 -480 -41 -126 -331 183 -191 -382 318 -171 57 452 -90 120 513 101 83 372 -129 280 140
2524 140 -219 188 -130 -248 185 -530 -240 130 -644 -41 -69 -134 152 174 -118 773 10 -126 531 -215 -105
2545 -105 456 -179 -27 271 -603 -42 -167 -300 -112 -292 -217 380 -376 -38 466 -165 152 387 -112 498
2565 498 175 -267 180 -56 -79 -154 -196 -114 310 -490 -147 161 -396 93 113 -176 70 11 200 389 32 375
2587 375 396 -285 135 326 -377 -105 -22 -311 158 -253 -304 334 -321 -284 237 -366 335 93 -135 339 398 -317
2609 -317 95 200 56 -50 -244 -67 115 -371 -31 -184 -435 -7 -244 -153 84 9 -106 287 -34 331 60
2630 60 -39 221 284 -108 244 -241 -162 -49 -237 -295 205 37 -227 -84 -180 140 -123 -106 49 171 114 298 20
2653 20 183 328 1 219 -49 45 58 -334 -110 -172 -303 -65 -63 -364 -130 176 121 191 176 116 117 152 68 412 87
$$ packed form
2503b91M74o63M39q5k05N14l74j91P00m89K28L95n42K10L93m12j8K89n01M09j40
2524A40l59M07l18j18M33p15K90L70p74O03k8o5K86K2k92Q91p63j36O57p46J10
2545a05N61o35J52K98q74N61j25j33J88j80P5N97p56L38N04o31L17K35m99O10
2565D98l23m42M47k36k3p5m2Q2M24q00L43L08n57M89K0k89K46n9J89J89l57L43
2587C75K1o81M20J91p03K72Q3k89M69m11n1O38o55L7N21o03P01k42k28M74N9p15
2609c17M12J05j44j06j94J77J82m86L40j53k51M28k37R1K37p5j15L93l21L65k71
2630F0r9K60O3l92L52m85P9J13j88n8N00j68k64J43r6L20k63J7J55J22n7J84k78
2653B0J63J45l27K18k68R4J3l92K24o2j31K38Kl01K34L06n5P0j5o0JL5q4L44l25
$$ plain form
2678 87 201 130 -129 -182 -183 -163 7 -428 -339 22 -84 73 -79 -121 357 -18 35 141 -13 -34 169 -121 -184 104
2702 104 -399 0 -79 -511 -58 -274 -254 -55 -110 -232 57 -143 179 98 19 36 307 -3 64 42 -112 366 -93
2725 -93 -325 13 -152 -188 1 -148 209 1 -379 143 0 68 -72 -89 191 427 -129 350 182 -193 382
2746 382 143 -372 74 -170 -290 10 -359 -276 182 -175 138 17 -188 127 176 107 550 -172 -226 299 262 -20
2768 -20 233 -376 -228 77 -412 39 23 -411 -154 -137 -198 557 -266 -324 310 60 30 303 40 284 269 -259
2790 -259 159 -104 -219 178 -254 -241 52 49 32 13 -178 77 -29 -322 314 168 -323 283 178 -24 435 -327
2812 -327 169 491 -189 -136 57 -210 77 -259 -275 190 -345 -209 157 -74 -48 194 -172 124 132 -79 285 -19
2834 -19 -37 439 -136 -274 178 -152 -134 -40 -561 -201 147 -220 205 -139 -13 502 -208 80 375 -152 123
$$ packed form
2678H7J14p1k59n3jK0J70m35Q9L61j06J57j52m2M78l75N3J06j54k1K03k90o3K88
2702A04n03L99p9m32M53k16K0J99n5j22K89k00L22q1p9J7K71l10O7k2j54M78m59
2725i3k32L38j65l6J89j49L57k08l80N22j43O8j40j7K80K36n56M79j68l75N75
2746C82k39n15M46k44j20L00l69Q3M58l57L13j21k05L15M9o9M43p22n4N25l7k82
2768b0K53o09J48L05m89M51j6m34K57J7o1P55q23n8O34k50l0K73k63K44j5n28
2790b59M18k63j15L97m32J3K93lj7j9j91K55j06k93O36j46m91O06j05k02M59p62
2812c27M96L22o80N3J93k67K87l36j6M65n35J36L66k31K6K42l66K96Qk11L64l04
2834a9j8M76n75j38M52l30J8R4n21L60L48l67M25l44J26N15p10K88K95n27K75
$$ plain form
2855 123 545 -193 -70 11 8 -184 -309 -220 529 -54 -220 288 -293 39 137 -88 233 324 -47 51 257 115
2877 115 20 39 31 163 -75 74 191 -396 -65 -107 -84 -186 -202 52 -470 -22 -89 49 -147 -62 194 9 51
2900 51 -67 -147 36 96 -121 -244 -106 25 -301 -534 253 -3 -236 -10 38 111 15 148 208 -8 -24 431 270
2923 270 -104 269 36 -78 -59 77 -79 -342 -283 -40 -135 -105 -147 -287 35 330 -65 -30 229 35 45 204
2945 204 190 224 -141 -171 -60 -355 -134 88 -513 -49 179 -110 -98 -8 70 69 70 175 470 -30 165 211 -174 136
2969 136 60 -166 239 174 -97 -149 -82 133 -81 -177 355 68 -222 20 201 -383 208 -9 -191 358 162 23
2991 23 23 -252 110 0 -468 -150 12 -463 -34 -105 -318 148 62 -71 227 190 173 224 -75 257 295 -451 58
3014 58 309 -296 176 -89 -82 43 -206 -273 -7 -86 -27 63 -336 438 248 -182 452 223 -246 130 -167 -102 91
$$ packed form
2855A23M22p38J23Q1lj92j25Q9P49n83j66N08n81L32R8k25L21R1l71R8K06j42
2877A15r5J9qJ32k38J49J17n87L31m2K3j02j6K54n22M48o7J38j96Q5K56j85M2
2900E1j18q0J83O0k17j23J38J31l26k33P87k56k33K26M8P3r6J33O0k16j6M55j61
2923B70l74L73k33j14J9J36j56k63N9K43r5L0m2j40L22K95l95L5K59j94J0J59
2945B04j4L4l65l0J11k95K21K22o01M64K28k89J2R0P8jJJ05K95n00J95M6l85L10
2969A36p6k26M05o5k71n2O7K15k14r6N32k87k90K42J81n84N91k17j82N49j96j39
2991B3%k75L62j10m68L18J62m75M29p1k13M66q6j33K98l7j7N1k99L32L8p46N09
3014E8K51o05M72k65PJ25k49o7K66p9N9R0l99P74j90m30O34k29m69L76k97O5J93
$$ plain form
3037 91 -296 -125 96 -313 232 -97 -502 97 -89 -231 199 103 -226 309 -225 260 348 -104 173 20 -107
3058 -107 263 -269 -239 124 -50 -247 -69 -18 -61 -139 -170 116 21 -355 220 -103 -259 337 -74 -251 260 33
3080 33 -104 22 -297 67 -263 -301 324 -215 -431 194 -195 -99 62 -194 -78 329 -121 361 270 151 286
3101 286 -103 321 393 -316 -62 274 -286 -315 223 -271 -36 62 143 -222 -127 -214 -5 27 237 442 -13 255
3123 255 189 -44 -204 -147 108 -86 -25 -18 64 -112 31 -4 -226 -75 22 -183 242 184 92 132 -105 97 210 81
3147 81 292 -60 -41 -104 105 -60 -94 -76 -342 -166 -117 -157 -73 -120 292 -18 115 238 174 -101 -47 176 37 11
3171 11 -160 18 -174 103 -63 -295 57 76 -182 47 136 -104 44 202 110 355 27 -63 440 -10 90 121
3193 121 -335 29 59 -220 -103 -200 -58 106 -149 -9 -43 -213 -58 146 268 317 124 -133 277 76 193
$$ packed form
3037I1l87J71K21m09N45l29m05N99j86j42M30r6l29N35n34M85Q8m52K77j53j27
3058a07L70n32L0L63j74j97J78N1m3p8l1K86r5l76N75l23j56N96m11j77N11k27
3080C3j37J26l19L64l30l8O25n39k16O25l89R6J61k56J16M07m50M82r1j19J35
3101B86l89M24P2p09K54L36n60k9N38m94K35R8Q1l65R5q7K09L2K10K05m55K68
3123B55o6k33j60N7K55j94O1PQ2j76J43l5k22J51R7k05M25n8r2M0k37K02J13j29
3147H1K11l52J9o3K09j65l4J8k66J76M9m0Q4m7M12l10J33J23o4k75N4K23j39k6
3171A1j71J78j92K77j66k32L52J9k58K29Q9k40J48J58r2K45l28r0N03m50J00L1
3193A21m56L64L0k79J17r7J42J64k55J40l4j70J55K04J22M9j93k57M10k01J17
$$ plain form
3214 193 5 -148 22 79 -239 -39 -34 -192 -194 295 -116 43 -52 -162 340 -26 -36 153 40 185 226 52 180
3237 180 264 -294 30 -72 -148 198 -229 -236 143 -248 -208 32 -153 199 173 -76 226 103 69 293 -184 245
3259 245 298 -220 -88 29 -197 104 -178 -334 162 -54 -226 266 -109 -255 336 9 -27 318 -136 324 84
3280 84 -170 361 78 -226 120 5 -184 121 -4 84 81 -247 -54 -114 -302 222 -53 -57 380 85 -23 195
3302 195 100 25 265 -243 225 -42 -345 61 7 -185 -33 -113 77 241 -144 -47 319 -40 -67 308 -176 237
3324 237 -9 -188 43 61 -40 23 -253 72 82 -696 -115 -120 -383 -60 -106 -151 247 31 -265 298 173 193 166
3347 166 235 32 58 -95 238 -112 -66 29 -205 -316 -24 -135 -60 49 -95 107 13 -94 138 245 82 279
3369 279 -85 -99 111 6 24 -80 -292 -116 -2 -74 125 -90 -237 -46 -220 82 40 -158 128 45 104 205
$$ packed form
3214A93j88j53J70N7l18K00Nj58kM89m11J59r5j10N02l66j0J89j13J45M1j74J28
3237A80Q4n58L24j02p6L46m27pL79l91M0K40j85L52k6k49L02j23l4K24m77M29
3259B45N3n18J32J17k26L01k82j56M96k16j72M92l75j46N91l27l6L45m54M60k40
3280H4k54N31k83l04L46j15j89L05j25Q8ll28J93o0j88N24k75mM37k95j08K18
3302A95r5p5K40n08M68k67l03M06n4j92J52q0J90J64l85R7L66l59k7L75m84M13
3324B37k46j79K31J8j01O3k76L25J0p78N81nk63L23m6m5L98k16k96N63j25K0k7
3347A66O9k03K6j53L33l50M6R5k34j11K92j11P5J09j44K02r4j07K32J07j63J97
3369B79l64j4K10j05J8j04k12J76J14p2J99k15j47J91j74L02m2j98K86q3N9J01
$$ plain form
3391 205 21 21 -29 -265 27 2 17 -238 -41 -281 -11 106 -113 21 -63 169 83 23 56 142 93 3 415 225
3415 225 -1 -110 43 -57 -301 -148 -209 -81 -25 64 15 13 -38 -36 70 82 165 -29 172 155 -109 21 263 177
3439 177 -158 263 -10 -223 -79 -209 -205 -261 16 58 -88 -244 165 47 -38 249 162 -47 259 146 6 144
3461 144 65 120 -166 -123 -68 -16 -261 132 32 -61 40 -15 -27 67 141 9 26 -136 128 13 -72 245 -96 -72
3485 -72 63 -245 37 -23 -85 -235 -211 77 30 -143 -53 241 -30 150 326 161 76 159 67 182 -180 -120 13
3508 13 -206 -132 272 -258 -19 185 -190 -80 -9 -100 56 311 -33 218 62 44 232 -24 -55 212 -166 -120
3530 -120 137 -307 -112 45 -105 -48 -109 -183 202 -197 142 199 40 -17 354 -395 402 317 -162 -113 -173 -222 110
3553 110 -330 -240 142 -271 -71 -79 -80 63 93 -116 173 75 -23 61 36 33 280 -64 229 154 -92 207 -116 -385
$$ packed form
3391B05j84%n0k36K92k5J5k55J97k40K70J17k19J34q4K32q6o0L3Q6m9r0M12j90
3415B25k26j09J53j00k44J53o1J28N6Q9m9kn1KJ06J2Q3j94K01j7k64J30K42q6
3439A77l35M21k73k13J44j30Mn6K77M2j46j56M09j18q5K87q7k09L06j13j40J38
3461A44p9N5k86M3N5N2k45L93j00r3J01n5j2R4P4j32J7j62K64j15q5L17l41K4
3485g2J35l08K82o0o2j50K4K88m7j73R0K94k71J80J76j65q5Q3r2J15l62O0J33
3508A3k19P4M04n30K39K04l75J10P1r1J56K55l44K51j56j8J88k56l1K67l78M6
3530a20K57m44J95J57j50N7o1p4L85l99L39N7j59n7L71p49P97q5m79M9o0m9L32
3553A10m40R0L82m13K00qjJ43L0k09K89r8r8Q4k5lK47l44K93p5k46K99l23k69
$$ plain form
3577 -385 30 11 -277 75 87 -42 27 -249 112 136 -205 349 162 -146 250 150 -366 5 157 -65 -42 -80
3599 -80 55 -6 -341 314 -96 -387 86 22 -13 82 -6 96 67 361 -3 219 85 168 -235 -133 95 26 -217
3622 -217 44 -65 -160 -198 -158 195 154 2 54 -1 52 -39 -127 -141 49 34 -74 -187 32 -267 -152 -191 80 -148
3646 -148 -295 142 -239 37 -150 -230 157 200 61 -3 54 82 105 -226 -197 -171 -48 -8 184 -205 58 -61 -154
3669 -154 -179 -45 80 -42 -156 37 219 -171 211 311 59 89 39 -122 143 -91 -18 -154 -50 166 -160
3690 -160 -56 -54 95 -204 58 -140 -171 50 55 171 -231 -106 -113 162 -89 90 38 -221 180 -117 -317 -50 3
3713 3 -129 -35 -253 112 -120 -67 221 -217 -134 125 19 -126 232 -182 193 62 -95 84 22 -175 -123 -399
3735 -399 -83 215 -215 -56 206 -196 12 173 -116 212 -26 137 201 64 59 182 -138 220 233 -232 -42
$$ packed form
3577c85M15j9k88L52J2j29O9k76L61K4l41N54j87l08L96j00n16L71J52k22K3l8
3599h0J35o1l35O55m10k91M73o4l5R5q8J02k9K94l64K22j34Q3m03J02K28o9k43
3622b17K61j09r5l8M0L53m1j52N2n5N3r1q8j4J90j5j08j13K19k99J15l9K71k28
3646a48j47M37l81K76j87q0L87M3j39o4N7K8K3l31K9K6J23M0J92l89K63j19r3
3669a54k5J34J25j22j14J93J82l90L82J00k52L0n0j61K65k34P3j36J04K16l26
3690a60J04KJ49k99K62j98l1K21NJ16m02J25pK75k51J79n2k59M01k97k00K67N3
3713Cj32R4k18L65k32N3K88m38Q3K59j06j45L58m14L75j31j57J79o2j97N2k76
3735c99L16K98m30J59K62m02K08J61k89L28k38J63O4j37nJ23l20L58J3m65J90
$$ plain form
3756 -42 44 -132 -10 -178 -133 96 43 106 258 -11 119 324 -467 311 319 -43 74 -31 60 140 -126 -74 173
3779 173 -165 7 139 -114 -157 87 -295 20 35 -141 122 207 9 260 -15 3 377 -367 174 -96 -180 1
3801 1 -188 -76 -101 -118 13 -139 -254 16 184 -97 180 157 25 286 -63 -163 59 197 -228 141 -146 -182
3823 -182 52 -310 -38 105 -147 -28 223 -72 9 -55 238 306 -206 -80 194 -47 22 107 -96 140 -47 -419
3845 -419 47 -217 -160 -54 -221 -133 29 31 171 -20 -70 315 37 120 174 62 -49 244 58 24 -142 -54 116
3868 116 63 -114 -55 75 115 70 -291 89 120 -133 228 127 16 51 155 42 -29 37 159 41 -171 79 124
3891 124 -250 -83 -27 -12 -1 -121 -4 143 352 65 70 136 84 116 -227 128 252 24 23 -3 44 -84 -226 -111
3915 -111 76 -163 -4 170 27 -183 75 199 254 -111 120 49 -27 33 57 7 -181 -22 -62 -81 -166 -16 13
$$ packed form
3756d2Q6j76J22j68M5K29n3O3J52k69J30K05p91P78Ql62J17j05R1Q0k66N2K47
3779A73l38J72J32k53m3K44l82L15J5j76K63Q5j98K51k75J8L74p44N41k70q4J81
3801Aj89J12k5j7J31j52j15K70J68k81K77k3j32K61l49j00K22J38m25L69k87l6
3823a82K34l62K72J43k52J19K51k95Q1o4K93O8n12J26K74k41O9Q5k03K36j87l72
3845d19M66k64N7J06j67Q8J62KJ40j91n0L85k78Q3N4j12j11K93j86l4j66Q8J70
3868A16n3j77N9J30M0m5l61L80L1k53L61j01j11L5J04j13p1O6J22j18k12K50M5
3891A24l74J67N6J5J1j20J17J47K09k87NO6n2L2l43L55J24k28jk6M7j28j42J15
3915a11J87k39J59J74j43k10K58J24N5l65K31p1p6O0K4n0j88J59m0j9q5J50K9
$$ plain form
3938 13 -65 -86 -56 -250 173 -14 37 358 -176 -207 294 114 63 70 -273 42 35 133 -7 -171 -135 12 -16 -106 -88
3963 -88 -300 -59 63 -54 320 52 32 237 273 -56 151 -50 -36 -130 -178 -189 164 -263 100 119 -114 131 -50
3986 -50 -389 219 73 183 164 -144 238 234 -239 -103 96 -341 -38 -38 -203 -101 -303 -169 39 -112 -254 19
4008 19 -190 115 142 -287 138 39 -62 435 36 116 237 -12 -47 -12 78 113 -243 -43 361 71 66 -104 -134 -54
4032 -54 265 -134 93 245 -48 28 155 -21 22 -137 -267 16 -29 -193 -30 -22 -100 -147 -171 98 -17 -235 171
4055 171 -128 -64 231 -77 46 181 100 -107 46 -129 63 114 -267 69 -161 -120 -93 -116 -42 170 -43 101
4077 101 100 -5 113 -25 43 151 11 -189 155 -162 91 167 -105 -69 78 -310 62 -57 -149 -80 2 -113 239
4100 239 -64 211 156 -3 61 310 -67 24 119 -126 92 -115 -172 -67 -89 -189 71 -11 125 40 -88 -207 310
$$ packed form
3938A3p8k1L0j94M23j87N1L21n34l1N01j80n1Pl43L15pR8j40j64L6J47k8r0J8
3963h8k12K41J22j17L74k68k0K05L6l29K07k01J4r4m8j1L53m27L63J9k33K45j81
3986e0l39O08j46J10j9l08L82mm73J36J99m37L03%j65J02k02J34K08j51j42K73
4008A9k09L05K7m29M25r9j01M97l99Q0J21k49l5L5R0L5l56K00M04k90nj70l0Q0
4032e4L19l99K27J52k93P6J27j76M3j59j30K83m5j64J63Qp8m7k4K69j15k18M06
4055A71k99O4K95l08J23J35q1k07J53j75J92N1l81L36k30M1K7k3P4K12k13J44
4077A01jj05J18j38O8J08j40k00L44l17K53P6k72L6J47l88L72j19r2O9Q2j15L52
4100B39l03K75n5j59O4K49l77R1R5k45K18k07n7J05k2j00K60q2J36q5j28j19N17
$$ plain form
4123 310 19 45 -164 -84 141 -59 -112 83 -218 -31 -142 -155 30 -113 -140 -17 188 -133 24 -34 143 112
4145 112 -86 100 86 143 159 66 -12 164 77 39 28 -182 -8 -115 -114 45 -198 -159 10 -44 -113 89 87 66 21 91
4171 91 82 112 125 203 -192 -89 87 -144 -104 53 -99 -97 -130 -168 -88 -72 -103 -68 -46 177 233 -66 133 45 -19 172
4197 172 107 -131 -118 -237 -95 -241 -253 31 58 -265 29 324 -143 -150 -67 -33 132 116 59 174 81 59 73 -19 198
4222 198 -22 -179 6 81 -128 75 -101 209 197 -119 210 -142 -184 93 94 -74 174 183 -355 193 -26 270
4244 270 -26 -80 173 -174 -527 162 109 -383 138 34 -104 20 0 -135 -10 254 316 89 -146 300 91
4265 91 -127 197 -154 -185 -35 -131 -199 210 -140 100 37 -143 480 271 -57 215 -268 -218 219 1 -240 231
4287 231 -125 -166 154 -39 7 -248 -198 197 -77 -177 329 49 59 241 -241 -300 -57 67 9 16 76 32 16 -89
$$ packed form
4123C10k91K6k09Q0K25k00n3J95l01J87j11j3J85j43k7J23K05l21J57n8J77l1
4145A12j98J86j4N7J6r3p8J76q7l8j1k10J74j07JJ59k43L9J69n4o9K02kk1m5P0
4171I1rL0J3P8l95J03J76k31M0J57j52Kl3l8Q0J6l1L5K2K23N6k99J99q8o4J91
4197A72o5k38J3j19J42j46j2K84K7l23K94K95m67pQ3L4J65j6n7J15r3k2J4r2K17
4222A98k20j57J85P5k09K03j76L10j2l16L29l52m2K77Jj68K48Rn38N48k19K96
4244B70k96n4K53l47l53O89n3m92N21j04j38J24k0j35J25K64O2k27k35M46k09
4265I1k18L24l51l1J50r6o8M09l50K40o3j80O23k09l28K72m83N0M37k18k41M71
4287B31l56m1L20j93M6k55N0L95k74j00N06k80J0J82m82n9K43J24n8PO0m4j6j05
$$ plain form
4311 -89 88 -117 -266 2 -380 88 23 -221 89 311 108 73 7 28 148 -73 -87 116 -9 -108 -52 -163 -164
4334 -164 9 -147 140 -117 -241 -219 -317 -123 38 -138 178 228 -67 -101 166 129 -11 -137 121 39 -228 -77
4356 -77 -143 -120 -68 -23 -307 -59 -28 -26 50 -12 97 31 29 135 284 103 222 13 31 39 51 -69 -72 -463 -94 -212
4382 -212 49 -173 194 -149 -12 -202 17 -214 -302 187 52 177 -16 71 -68 161 -153 -96 -99 -299 -292 70
4404 70 40 -153 -140 -158 -117 -55 -140 -9 -94 -218 223 85 -160 256 -3 211 -162 -17 -6 -129 9 93 -122
4427 -122 -402 77 -267 -110 168 -462 116 8 165 94 -48 -25 248 -59 26 254 -57 -36 -27 88 329 -59
4449 -59 -2 -134 -250 -15 -94 -86 -62 179 48 176 218 -114 186 -7 -20 312 -75 26 -13 -149 1 -105 -182
4472 -182 31 -21 -92 110 65 3 124 237 41 36 188 117 221 -139 90 33 -78 249 -55 19 95 52 -137 70
$$ packed form
4311h9J77k05j49K68l82M68o5k44L10K22k03l5o6K1J20k21j4K03j25r9N6j11j
4334a64J73j56K87k57j24K2r8J94J61j76L16N0k95l4K67l7j40j26K58q2k67J51
4356g7o6K3N2M5k84K48L1KP6o2J09o6kJ06J49j81J19k09J8QJ2j20ll91L69j18
4382b12K61k22L67l43J37j90K19k31q8M89j35J25j93Q7j39K29l14N7lk00PL62
4404G0l0j93J3j8M1O2q5J31q5j24M41j38k45M16k59K14l73J45J1j23J38Q4k15
4427a22k80M79l44J57K78o30N78j08J57p1j42K3K73l07Q5K28l11K1RJ15K41l88
4449e9N7j32j16K35p9QK4K41j31J28M2l32L00j93j3L32l87J01l9j36J50j06p7
4472a82K13n2p1K02m5o2J21J13j96nJ52p1J04l60K29n7j11L27l04P4P6m3j89K07
$$ plain form
4496 70 -160 64 -33 -279 101 12 115 213 -101 34 340 -16 65 51 -233 181 117 -449 201 34 -255 246
4518 246 -351 -248 157 -59 -28 249 -47 239 221 -121 214 30 -33 230 89 -132 107 -156 -76 -15 -246 -14
4540 -14 -42 -142 -99 135 -327 309 -20 -7 381 89 37 13 203 -39 129 -83 50 108 -216 87 -206 -145 0
4563 0 -162 -94 -64 -67 -78 90 -4 208 150 -187 234 103 -173 15 -105 -188 126 18 115 -17 -50 -16 -205 -242 76
4588 76 -146 -215 260 135 -249 -44 66 176 119 -105 115 106 -141 45 -74 -285 74 -249 -192 39 -296 -117
4610 -117 104 46 88 96 -136 232 -78 -52 214 -99 -94 361 -179 54 73 25 -124 -120 -30 -80 -34 -3 75 -221 120
4635 120 32 -36 -82 118 218 121 209 111 251 -15 -30 1 -78 -29 -85 -178 -55 -115 -6 -61 -6 162 137 226 217 12
4661 12 -92 185 198 -100 183 83 -61 20 -101 -117 -180 -171 63 2 -305 85 -66 -20 125 -50 107 -22 53
$$ packed form
4496G0k30K24r7k46L80q9J03R8l14J35L06l56Q1j4k84M14o4n66O50j67k89N01
4518B46n97J03M05k16L1K77k96K86j8l42L35j84o3K63j41k21K39k63Q0O1k31K32
4540a4k8j00M3K34m62O36l29J3L88k92n2k4J90k42J68k12J33N8l24L03k93O1J45
4563@j62O8L0lj1J68r4K12n8l37M21j31k76J88j20q3L14j08R7j32l3L4j89l7L18
4588G6k22o9M75j25l84K05J10J10n7k24K20rk47J86j19k11L59l23N7K31l35J79
4610a17K21n8M2Qk32L68l10K6K66l13NM55n40K33J9m8j49MR0n0M6L1P8k96L41
4635A20q8o8m6K00J00r7Q8r8J40k66j5L1p9M9n6r3J23o0J09n5N5J68k5Q9rk05
4661A2j04K77J3k98K83j00j44Q1j21j6o3RK34o1l07L90j51M6J45j75J57j29P5
$$ plain form
4684 53 113 13 -35 204 -6 -2 20 -167 -91 155 -204 -200 -50 179 179 -18 13 3 -190 -69 290 5 171 211 58
4709 58 119 457 281 -24 163 38 171 -227 -69 52 -60 -204 108 -155 -144 116 -25 16 160 -104 71
4730 71 -215 -120 98 -167 89 289 -133 54 -189 -243 -294 -35 -253 138 58 -76 184 -260 182 77 -43 16
4752 16 243 -109 159 79 -166 -70 154 38 102 -279 -85 165 -95 -252 -44 -206 151 236 -125 106 18 -36
4774 -36 227 -60 -31 372 -213 145 96 -202 -19 -27 -338 5 -12 -110 -41 -84 189 114 -158 -46 224 -107 326
4797 326 61 -199 175 102 20 104 -114 -50 -82 -43 -4 240 -50 232 137 10 263 -52 -45 216 220 113 214 -53
4821 -53 295 139 -68 81 -178 -115 153 -25 -208 175 188 -220 -10 140 28 7 73 282 225 -23 537 115
4843 115 -106 235 125 10 55 -153 -79 -49 -121 54 -80 144 2 -124 -169 75 55 202 37 -64 52 144
$$ packed form
4684E3O0j00m8K39k10MK2j87P6K46l59MJ50K29%j97L1j0j93J21L59k85J66M0j53
4709E8O1L38j76l05J87j25J33l98J58J21j12j44L12k63J1K60j41M1J44k64J75
4730G1k86R5K18k65K56K00m22J87k43n4n1K59k18L91q0j34K60m44M42j05j20N9
4752A6K27l52K68q0k45R6K24j16O4l81J94K50k60j57K08j62L57Q5l61K31q8n4
4774c6K63k87K9M03n85L58m9k98J83ql11L43j7r8O9m3K73p5k72J12K70l31M33
4797C26k65k60L74p3q2Q4k18O4l2L9L9K44k90K82r5j27K53l15PK61Mj07J01k67
4821e3L48j56k07J49k59O3K68j78j83L83J3m08K10J50j12k1O6K09n7k48N60m22
4843A15k21L41j10j15M5k08P4L0p2J75j34K24j42j26m5K44k0J47j65j01J16R2
$$ plain form
4865 144 73 350 45 52 112 -192 -4 40 -121 -167 -129 -131 -64 -209 -49 5 64 -108 149 -152 38 68 -75 48
4889 48 287 131 -48 -73 -218 -80 -50 -86 -221 -121 31 98 -251 253 -54 83 106 106 47 32 -2 173 176 -2
4913 -2 -213 -91 -286 108 -180 -26 -81 -165 78 -57 -147 87 -25 -12 304 222 -128 255 51 -86 7 -108 189
4936 189 -64 50 49 -16 -180 -95 -312 -96 -136 -35 50 -146 -49 90 216 -20 226 64 -195 352 112 109 183
4959 183 -165 0 -51 -51 199 -129 -125 -54 -57 -81 27 -132 35 271 108 98 261 -22 98 -42 -183 88 13 -25
4983 -25 383 -314 -41 284 -147 42 -129 2 181 -50 -63 82 233 -152 297 -63 -56 241 -260 123 104 -129
5005 -129 221 -48 -282 113 9 -72 -141 -96 -213 10 -90 -46 106 -24 76 66 -11 197 31 -117 116 15
5027 15 -163 303 -179 -89 -37 -108 -87 45 -130 155 64 -174 243 149 -78 156 -140 -6 171 6 66 1 -206
$$ packed form
4865A44p1K77l05PO0l04J88M4j61m6L8kO7j45J60N4N9j72K57l01J90L0j43J23
4889D8K39j56j79k5j45J38L0l6j35J00J52O7l49N04l07J37K3%n9j5l4J75Lj78
4913bk11J22j95L94k88J54n5q4K43j35r0K34j12J3L16q2l50L83k04j37R3j15K97
4936A89k53J14jo5j64Q5k17K16m0J01Q5j96R7J39J26k36K46j62k59N47k40lP4
4959A83l48J65n1%K50l28MP1lk4J08j59J67K36j63j0J63k83J20j40j41K71p5l8
4983b5M08o97K73L25m31J89j71J31J79k31j3J45J51l85M49l60PK97n01L83j9k33
5005a29L50k69k34L95j04q1o9M5j17K23j00M4J52j30J00j0p7K08j66j48K33j01
5027A5j78M66m82R0N2p1K1J32j75K85r1k38M17r4k27K34k96J34J77j65O0o5k07
$$ plain form
5050 -206 -1 -48 -73 124 -53 -149 9 -132 -49 245 -121 96 85 45 285 243 79 -116 -10 -125 87 -9 17
5073 17 -3 -204 -53 -13 -140 -115 -11 126 110 18 -65 11 15 127 -79 -168 366 23 52 143 -226 24 -78 -168 6
5098 6 93 -352 -211 26 -144 161 149 -75 -65 86 88 162 116 -51 -65 106 75 92 97 -54 30 -165 -45 1 -37 -103
5124 -103 93 63 -11 -47 23 -34 5 93 151 181 26 84 -72 -141 36 75 -17 -65 -35 -58 -49 51 -59 104 65 -134
5150 -134 140 -7 79 149 -57 168 -18 -161 15 105 -114 -57 28 -57 -100 -57 -155 37 -270 79 195 -55 257
5173 257 142 -50 59 258 38 26 136 68 -61 93 -91 37 -123 -178 42 8 109 30 -52 155 192 -120
5195 -120 184 17 63 -143 -99 175 75 -21 42 36 -300 -65 38 -216 -97 -126 -62 -137 -31 277 -81 -125 82
5218 82 46 -48 124 -112 -12 85 -100 90 21 -26 106 190 -39 -116 -15 99 144 -276 43 324 -37 12 -42 -90
$$ packed form
5050b06K05m7k5J97j77r6J58j41Q3K94l66K17j1m0K40m2j64j95J06j15K12r6K6
5073A7k0k01J51M0j27K5J04J37j6r2q3P6MJ12k06q9N34l43K9R1l69K50j02r0J74
5098FQ7m45J41K37j70L05j2k24J0J51KP4m6j67j4J71l1J7Nj51Q4j95J20M6l8o6
5124a03J96l0p4l6P0n7L9Q8N8L0j55N8j56o9J77L9r2m8L0k3RJ00j10J63l9j99
5150a34K74j47Q6P0k06K25j86j43J76R0k19N7Q5q5m3M3r8J92l07L49J16k50L12
5173B57j15j92J09J99k20j2J10o8j29J54j84J28j60n5K20l4J01p9q2K07L7l12
5195a20L04j67M6k06M4K74j00r6O3ol36K35J03k54J19k9O4p5J06L08l58m4K07
5218H2l6r4J72k36J00R7j85J90o9m7J32Q4k29p7J01J14M5m20L19K81l61M9n4m8
$$ plain form
5242 -90 285 -15 -162 14 66 17 146 -113 -119 111 -55 1 226 74 -2 259 -140 139 -80 -22 245 -6 9
5265 9 206 -158 -1 219 -59 58 40 -264 -42 -4 -262 156 -47 23 183 -189 234 438 92 -87 122 173
5287 173 269 65 88 56 -72 139 109 -133 22 140 -160 -151 -187 -202 44 13 -197 220 -17 82 108 -11 173 62
5311 62 40 99 159 -78 215 172 -84 65 -168 -178 -12 64 -62 -185 -87 40 72 -73 -59 140 69 157 22 182
5335 182 131 -15 -44 -145 -186 99 21 -155 16 92 -67 -176 40 -242 -58 67 50 169 -30 302 -4 -147
5357 -147 47 125 -231 -6 -95 -24 16 211 244 -217 -56 -152 -320 53 17 -187 -86 26 -76 1 -30 71 43
5380 43 -11 -38 62 60 -89 99 -213 24 110 -213 -390 -29 93 130 -268 32 112 22 153 126 51 -135 93 -167
5404 -167 -39 126 51 -201 -234 -91 -107 -160 137 157 -189 -79 47 -19 32 -190 -101 -17 -62 17 -43 146 116 434
$$ packed form
5242i0L75l00j47J76N2m9J29k59oK30j66N6K25j52p6K61l99K79k19N8K67k51J5
5265IJ97l64J57K20k78J17j8l04K22L8k58M18k03P0J60l72M23K04l46j79K09N1
5287A73R6k04K3l2j28K11l0k42J55J18l00Rl6j5K46l1k10M17k37R9K6j19J84j11
5311F2k2N9O0k37K93m3k56J49k33j0J66P6j26j23R8J27L2j45J4J99p1Q8j35J60
5335A82n1j46k9j01m1K85p8j76J71P6j59j09K16k82J84J25j7J19j99L32l06j43
5357a47J94P8l56K25q9P1M0J95L3m61J61r6j68L73l6k04J01J12j02P7l1J01k8
5380D3n4k7J00kj49J88l12K37Q6l23j77L61J22L7l98L00Q0r0J31k7p5j86K28k60
5404a67J28J65p5k52l3J43j6n3K97K0l46J10J26o6N1k22Q9Q4m5P9o0J89l0L18
$$ plain form
5428 434 70 117 16 27 -19 -111 120 10 -156 -78 -53 -64 43 50 -71 113 201 -163 171 -90 107 17 38 34 163
5453 163 83 8 -81 -214 163 -256 -37 -53 -74 -47 40 -55 -70 -34 199 105 5 -302 -50 80 -8 69 -8 -237 -114
5478 -114 -132 -204 107 28 -116 127 -292 246 -110 19 199 -114 38 238 81 -15 82 -145 4 66 -145 262
5500 262 113 -3 50 47 8 364 -28 -64 25 55 180 257 45 -48 -55 -107 25 -199 -57 208 -133 180 254 -101
5524 -101 88 -36 69 75 -83 -37 177 185 -145 166 35 89 169 -87 16 -84 -183 -103 -54 -43 1 -172 -5 -5 110
5549 110 143 174 -12 -57 98 17 -55 -3 161 59 63 -124 263 64 -32 -10 -153 192 -200 -41 -112 -91 -21 161
5573 161 -64 54 72 47 237 85 24 224 -77 -131 174 -282 82 103 -303 37 -97 -31 -54 -176 -249 137 8
5596 8 195 46 -79 -5 144 46 -2 71 -15 91 -109 0 239 -65 -124 96 -21 -6 -268 41 193 72 -31
$$ packed form
5428D34l64M7j01J1m6r2K31j10j66P8K5j1J07Pj21J84Q8l64L34k61J97r0K1mJ29
5453A63q0p5q9j33L77m19K19j6k1K7Q7r5j5L6K33r4j00l07K52J30q8P7p7k29J23
5478a14j8p2L11p9j44K43m19N38l56J29J80l13J52K00j57r6R7k27J49O2k11M07
5500B62j49j16N3ll9L56l92l6Q9L0J25P7k12r3pn2J32k24J42K65l41L13P4l55
5524a01J89j24J05Oj58M6K14Ql30L11j31N4Q0k56J03j00r9Q0M9J1M4j73J67%J15
5549A10L3L1j86m5J55q1p2N2J64j02Mj87L87j99r6K2j43L45l92J59p1K1P0J82
5573A61k25J18J8k5J90j52o1K00l01n4L05m56L64K1m06L40j34O6k3j22p3L86j29
5596HJ87j49j25P4J49r8m8P3q6J06k00J09K39l04n9K20j17J5k62L09J52j21j03
$$ plain form
5619 -31 283 60 -38 123 -40 -189 199 -116 -22 101 69 73 -63 33 -12 68 -146 -168 -96 -26 -56 -34 123 186 37
5644 37 51 15 239 113 10 208 122 -203 0 -110 -299 -68 -10 -118 18 -152 21 -135 -4 114 -22 -22
5666 -22 77 106 -120 39 103 50 -3 0 -170 88 36 257 172 -240 4 -84 -32 53 187 97 267 210 34 -122 119
5691 119 153 130 18 -88 191 10 -175 -47 -224 -55 -167 103 114 -26 -70 -92 -128 105 108 28 181 13 43
5714 43 103 73 62 223 -243 6 -37 -65 -45 -34 -381 64 61 -126 79 -75 102 -18 -309 138 10 50 238 58
5738 58 -39 250 86 -15 7 -263 -307 -42 3 31 36 48 71 -34 -166 386 58 5 207 -144 -3 178 46 66
5762 66 -138 -32 134 -77 -36 102 -96 -269 -142 106 80 30 82 -49 89 -52 327 39 -177 39 10 82
5784 82 114 -139 168 137 -138 66 -6 -101 153 -234 -153 -87 -58 28 -227 -52 -112 227 76 142 187 145 -106 -133 -83
$$ packed form
5619c1L14k23r8J61j63j49L88l15R4J23l2Mj36R6m5Q0k14k2P2P0l0K2J57O3j49
5644C7J4l6K24j26j03J98q6l25K03j10j89K31N8j08J36j70J73j56J31J18j36%
5666b2R9K9k26J59O4n3n3Lj70K58n2K21q5m12K44q8N2Q5J34r0J70n7j76j56K41
5691A19L4k3j12j06K79j81j85J28j77J69j12K70J1j40m4k2l6K33Lq0J53j68L0
5714D3O0l0j1J61m66K49m3k8K0J1l47M45lj87K05j54J77j20k91M47j28M0J88j80
5738E8r7K89j64j01K2k70m4K65M5K8NJ2K3j05j32N52l28n3K02l51J41J81j32K0
5762F6k04J06J66k11M1J38j98j73J27K48k6n0N2j31J38j41L79k88k16K16k9P2
5784H2L2k53L07l1k75K04p2r5K54l87Q1O6K9Q6k55J75o0L39j51O6M5m2k51k7N0
$$ plain form
5809 -83 18 -238 -102 -71 112 103 72 -22 -156 -147 152 115 -72 -64 57 -107 140 120 -168 152 114 -34 -51 195 2
5834 2 -20 -93 -60 131 -121 181 57 164 57 143 -165 -40 353 -7 125 20 57 -26 -73 36 72 -81 -119 -303
$$ packed form
5809h3J01k56J36L1J83rl1r4j34RK99l7j87QJ21j64K47k0k88L20l8j48j7K46j93
5834Bk2p3L3J91k52L02j24J07j07Q6l08J25L93l60J32j05L7q3m7J09L6j53l8j84
$$ [...]
8191b8
##END NTUPLES=NMR FID
##END=
