##TITLE=1H_Pr EDA-2
 CDCl3, 8 sc, 
 25.3.2020
##JCAMPDX= 6.0         $$ Bruker NMR JCAMP-DX V2.0
##DATA TYPE= NMR FID
##DATA CLASS= NTUPLES
##ORIGIN= UXNMR, Bruker Analytische Messtechnik GmbH
##OWNER= root
$$ XWIN-NMR		Version 3.5
$$ Wed Mar 25 13:44:40 2020 Russian Standard Time (UT+4h)  she@DPX200
##.OBSERVE FREQUENCY= 200.1315
##.OBSERVE NUCLEUS= ^1H
##.DELAY= (6, 6)
##.ACQUISITION MODE= SIMULTANEOUS
##.ACQUISITION SCHEME= undefined
##.AVERAGES= 8
##.DIGITISER RES= 18
##SPECTROMETER/DATA SYSTEM= spect
##.PULSE SEQUENCE= zg30
##.SOLVENT NAME= CDCl3
##.SHIFT REFERENCE= (INTERNAL, CDCl3, 0, 15.7039)
##AUDIT TRAIL= $$ (NUMBER, WHEN, WHO, WHERE, WHAT)
$$ ##TITLE= Audit trail, XWIN-NMR		Version 3.5
$$ ##JCAMPDX= 5.01
$$ ##ORIGIN= Bruker BioSpin GmbH
$$ ##OWNER= she
$$ F:/spectra/data/she/nmr/H-F/1/audita.txt
$$ ##AUDIT TRAIL=  $$ (NUMBER, WHEN, WHO, WHERE, WHAT)
(   1,<2020-03-25 13:43:27.28 +0400>,<she>,<DPX200>,
      <created by zg, POWCHK disabled, PULCHK disabled
       configuration hash MD5:
       00 E9 B6 7A A2 85 ED C7 34 08 36 98 17 FE 4E 26
       data hash MD5: 16K
       A7 C8 5B CC 6D 94 6A 8B B0 9D DB F2 BA C8 71 F8>)
$$ ##END=
$$ 
$$ hash MD5
$$ E3 5F BA 72 60 66 3D 40 2F D8 4B 3F 3F FD 93 DF
##$RELAX= 
##$RELAX= 
##$RELAX= 
##$RELAX= 
##$RELAX= 
##$RELAX= 
$$ Bruker specific parameters
$$ --------------------------
##$DU= <F:/spectra>
##$EXPNO= 1
##$NAME= <H-F>
##$PROCNO= 1
##$TYPE= <nmr>
##$USER= <she>
##$AMP= (0..31)
100 100 100 100 100 100 100 100 100 100 100 100 100 100 100 100 100 100 
100 100 100 100 100 100 100 100 100 100 100 100 100 100 
##$AQSEQ= 0
##$AQ_mod= 1
##$AUNM= <au_zg>
##$AUTOPOS= <>
##$BF1= 200.13
##$BF2= 200.13
##$BF3= 200.13
##$BF4= 200.13
##$BF5= 200.13
##$BF6= 200.13
##$BF7= 200.13
##$BF8= 200.13
##$BYTORDA= 1
##$CFDGTYP= 0
##$CFRGTYP= 5
##$CHEMSTR= <none>
##$CNST= (0..31)
1 1 145 1 1 1 1 1 1 1 1 1 1 1 1 1 1 1 1 1 1 1 1 1 1 1 1 1 1 1 1 1 
##$CPDPRG= <>
##$CPDPRG1= <>
##$CPDPRG2= <>
##$CPDPRG3= <>
##$CPDPRG4= <mlev>
##$CPDPRG5= <mlev>
##$CPDPRG6= <mlev>
##$CPDPRG7= <mlev>
##$CPDPRG8= <mlev>
##$CPDPRGB= <>
##$CPDPRGT= <>
##$D= (0..31)
0 1.2 0 0 0 0 0 0 0 0.06 0 0.03 0 0 0 0 0.0002 0 0 0 0 0 0 0 0 0 0 0 0 
0 0 0 
##$DATE= 1585129406
##$DBL= (0..7)
120 120 120 120 120 120 120 120 
##$DBP= (0..7)
150 150 150 150 150 150 150 150 
##$DBP07= 0
##$DBPNAM0= <>
##$DBPNAM1= <>
##$DBPNAM2= <>
##$DBPNAM3= <>
##$DBPNAM4= <>
##$DBPNAM5= <>
##$DBPNAM6= <>
##$DBPNAM7= <>
##$DBPOAL= (0..7)
0.5 0.5 0.5 0.5 0.5 0.5 0.5 0.5 
##$DBPOFFS= (0..7)
0 0 0 0 0 0 0 0 
##$DE= 6
##$DECBNUC= <off>
##$DECIM= 24
##$DECNUC= <off>
##$DECSTAT= 4
##$DIGMOD= 1
##$DIGTYP= 9
##$DL= (0..7)
0 120 120 120 120 120 120 120 
##$DP= (0..7)
150 150 150 150 150 150 150 150 
##$DP07= 0
##$DPNAME0= <>
##$DPNAME1= <>
##$DPNAME2= <>
##$DPNAME3= <>
##$DPNAME4= <>
##$DPNAME5= <>
##$DPNAME6= <>
##$DPNAME7= <>
##$DPOAL= (0..7)
0.5 0.5 0.5 0.5 0.5 0.5 0.5 0.5 
##$DPOFFS= (0..7)
0 0 0 0 0 0 0 0 
##$DQDMODE= 0
##$DR= 18
##$DS= 0
##$DSLIST= <SSSSSSSSSSSSSSS>
$$ [...]
##$SUBNAM2= <"">
##$SUBNAM3= <"">
##$SUBNAM4= <"">
##$SUBNAM5= <"">
##$SUBNAM6= <"">
##$SUBNAM7= <"">
##$SUBNAM8= <"">
##$SUBNAM9= <"">
##$SW= 24.9337058887773
##$SWIBOX= (0..15)
0 0 2 0 0 0 0 0 0 0 0 0 0 0 0 0 
##$SW_h= 4990.01996007984
##$TD= 16384
##$TD0= 1
##$TE= 0
##$TE2= 300
##$TE3= 300
##$TEG= 300
##$TL= (0..7)
0 120 120 120 120 120 120 120 
##$TP= (0..7)
150 150 150 150 150 150 150 150 
##$TP07= 0
##$TPNAME0= <>
##$TPNAME1= <>
##$TPNAME2= <>
##$TPNAME3= <>
##$TPNAME4= <>
##$TPNAME5= <>
##$TPNAME6= <>
##$TPNAME7= <>
##$TPOAL= (0..7)
0.5 0.5 0.5 0.5 0.5 0.5 0.5 0.5 
##$TPOFFS= (0..7)
0 0 0 0 0 0 0 0 
##$TUNHIN= 0
##$TUNHOUT= 0
##$TUNXOUT= 0
##$USERA1= <user>
##$USERA2= <user>
##$USERA3= <user>
##$USERA4= <user>
##$USERA5= <user>
##$V9= 5
##$VALIST= <valist>
##$VCLIST= <CCCCCCCCCCCCCCC>
##$VD= 0
##$VDLIST= <DDDDDDDDDDDDDDD>
##$VPLIST= <PPPPPPPPPPPPPPP>
##$VTLIST= <TTTTTTTTTTTTTTT>
##$WBST= 1024
##$WBSW= 4
##$XGAIN= (0..3)
0 0 0 0 
##$XL= 0
##$YL= 0
##$YMAX_a= 289361
##$YMIN_a= -199389
##$ZGOPTNS= <>
##$ZL1= 120
##$ZL2= 120
##$ZL3= 120
##$ZL4= 120
##$ABSF1= 10
##$ABSF2= 0
##$ABSG= 5
##$ABSL= 3
##$ALPHA= 0
##$AQORDER= 0
##$ASSFAC= 0
##$ASSFACI= 0
##$ASSFACX= 0
##$ASSWID= 0
##$AUNMP= <proc_1d>
##$AZFE= 0.1
##$AZFW= 0.1
##$BCFW= 1
##$BC_mod= 2
##$BYTORDP= 1
##$COROFFS= 0
##$CY= 11.3945322036743
##$DATMOD= 1
##$DC= 2
##$DFILT= <>
##$DTYPP= 0
##$F1P= 16.9975609425685
##$F2P= -3.02152046262296
##$FCOR= 0.5
##$FTSIZE= 0
##$FT_mod= 4
##$GAMMA= 1
##$GB= 0.15
##$INTBC= 1
##$INTSCL= 1
##$ISEN= 128
##$LB= 0.24
##$LEV0= 0
##$LPBIN= 0
##$MAXI= 10000
##$MC2= 0
##$MEAN= 0
##$ME_mod= 0
##$MI= 1.114404
##$NCOEF= 0
##$NC_proc= 0
##$NLEV= 6
##$NOISF1= 3.799351
##$NOISF2= 2.8
##$NSP= 1
##$NTH_PI= 0
##$NZP= 0
##$OFFSET= 15.70392
##$PC= 1
##$PHC0= -9784.372
##$PHC1= 12.60082
##$PH_mod= 1
##$PKNL= yes
##$PPARMOD= 0
##$PSCAL= 0
##$PSIGN= 0
##$REVERSE= no
##$SF= 200.130013532006
##$SI= 16384
##$SIGF1= 3
##$SIGF2= 2
##$SINO= 400
##$SIOLD= 16384
##$SREGLST= <1H.CDCl3>
##$SSB= 0
##$STSI= 0
##$STSR= 0
##$SW_p= 3612.71676300578
##$SYMM= 0
##$S_DEV= 0
##$TDeff= 0
##$TDoff= 0
##$TI= <>
##$TILT= no
##$TM1= 0
##$TM2= 0
##$TOPLEV= 0
##$USERP1= <user>
##$USERP2= <user>
##$USERP3= <user>
##$USERP4= <user>
##$USERP5= <user>
##$WDW= 1
##$XDIM= 8192
##$YMAX_p= 0
##$YMIN_p= 0
$$ End of Bruker specific parameters
$$ ---------------------------------
##NTUPLES= NMR FID
##VAR_NAME=  TIME,          FID/REAL,        FID/IMAG
##SYMBOL=    X,             R,               I
##VAR_TYPE=  INDEPENDENT,   DEPENDENT,       DEPENDENT
##VAR_FORM=  AFFN,          ASDF,            ASDF
##VAR_DIM=   8192,          8192,            8192
##UNITS=     SECONDS,       ARBITRARY UNITS, ARBITRARY UNITS
##FACTOR=    0.0002004,     1,               1
##FIRST=     0,             0,               0
##LAST=      1.6414764,     0,               0
##MIN=       0,             -199389,         0
##MAX=       1.6414764,     289361,          0
$$ Real data points
##PAGE= N=1
##DATA TABLE= (X++(R..R)), XYDATA
$$ [...]
2811I242K289l000l247J44L323J642j795k169J055K282O92k851k109J489L863
2826A0850J126l725m569J83N138L760k124o714l229L846O223P54n582n923M45
2841D59N671L653k929n763k178L214L686o13l810k697R98K159k75k421j378J092
2857a132J835j117l577j606K160L468k94m908m499J885N533K193l884o312j317
2872a1572M848N342j022n986m575K231N618K307l657m762o23L733L113p36l450
2887i191j128J993K270q85k278l3K594J989j701l564lM450L307j738m773k065
2903a0756L684O189J362m652m954J281N983M559k048n250k278L634N791J426l895
2918G6l823J153M617K423j770k338M22K616J510j748j433J960K394J027k428k934
$$ plain form
2811 9242 11531 8531 5284 5428 8751 10393 8598 6429 7484 9766 10458 7607 5498 6987 10850
2826 10850 11976 8251 3682 3865 9003 12763 10639 3925 696 4542 10765 11519 5937 14 459
2841 459 6130 9783 6854 1091 -1087 2127 5813 5200 1390 -1307 -309 1850 1575 -846 -2224 -1132
2857 -1132 703 -414 -3991 -5597 -3437 31 -263 -5171 -9670 -7785 -2252 -59 -3943 -10255 -11572
2872 -11572 -6724 -1382 -2404 -8390 -12965 -10734 -5116 -2809 -6466 -11228 -11851 -8118 -5005 -5741 -9191
2887 -9191 -10319 -8326 -6056 -6941 -9219 -9252 -6658 -4669 -6370 -9934 -9937 -5487 -2180 -3918 -8691 -10756
2903 -10756 -7072 -883 479 -4173 -9127 -7846 -1863 2696 648 -4602 -6880 -3246 2545 3971 76
2918 76 -3747 -2594 2023 4446 2676 338 760 3376 4886 3138 1705 3665 6059 7086 4658 1724
2934A724J476M653K508k847m877q11M669N755o66n815m217K775O072K591l406
2949I584n686p71M498M188j037m223k447J599L374O13k727j930K58K139J18k503
2965E047j266J383K411o45l689k365J922M025N55m545m540k10N246L884k695o369
2981a851l182L807N018M07m674m793m4M257K686k174m134j723K206K358o34k963
2997e433j130J470J252j172k310m65K011K160j792l982j399L614L919n78m910
3012h745l649K211N401K872l927n511n54M403M516m35m370l479K174M372J951
3027b770k420k950j11L034K214j157j872N43K148J225j597j435J498K969J346
3042F65k517l050M89M587L529j133n001j951M083N571J274m544l752L73N676L871
$$ plain form
2934 1724 3200 7853 10361 7514 2637 1826 6495 12250 11584 5769 1552 4327 10399 12990 9584
2949 9584 3898 3127 7625 11813 10776 6553 4106 5705 9079 9692 6965 5035 5293 7432 7550 5047
2965 5047 3781 5164 7575 6930 3241 876 2798 6823 7378 2833 -1707 -1917 3329 7213 4518 -1851
2981 -1851 -5033 -1226 3792 4199 -475 -5268 -5312 -1055 1631 -543 -4677 -6400 -4194 -1836 -2470 -5433
2997 -5433 -6563 -5093 -3841 -5013 -7323 -7788 -5777 -3617 -5409 -9391 -10790 -7176 -3257 -3835 -8745
3012 -8745 -12394 -10183 -4782 -1910 -5837 -11348 -11902 -7499 -2983 -3418 -7788 -11267 -9093 -4721 -2770
3027 -2770 -5190 -8140 -8251 -5217 -3003 -4160 -6032 -5489 -3341 -2116 -3713 -5148 -3650 -681 665
3042 665 -1852 -4902 -4413 174 3703 2570 -2431 -4382 -299 5272 6546 2002 -1750 -1377 4299 8170
3058H170j847m853j346L389L855P03l009k261J297K798R97j554j127Q20J905J11
3074H048k000j161J654L087k1l298k965J519M305K589l271n176j143M380M685
3089A1232p95n568l574J692N053J889l181m782p92L195K725j114l477j528J180
3104B155J852n52k233j196J633Q58r57l187q41K571K257j738m220k085K478M436
3120A231M56m536n001P06M657L091k084n509k435K797M390P20l839l825L54L233
3136e594K233j891k677q12K217J114r03j896K18K383O41j998k253Q85L267K052
3152c014k199l973q84M296M238p88m071l519K688N065K464k686m847j70L943M174
3168G17m65l549k249K219L402J496k126j584O11K422J042j472r08J711K220r6
$$ plain form
3058 8170 6323 1470 124 3513 7368 8071 5062 2801 4098 6896 7893 6339 5212 6032 7937 8048
3074 8048 6048 4887 6541 9628 9607 6309 3344 4863 9168 11757 8486 3310 2167 6547 11232
3089 11232 10437 4869 1295 2987 8040 9929 6748 1966 1174 4369 7094 5980 2503 975 2155
3104 2155 4007 3455 1222 26 1659 2517 1560 -1627 -2468 103 2360 622 -3598 -5683 -3205 1231
3120 1231 1687 -2849 -7850 -7144 -2487 604 -1480 -6989 -9424 -6627 -2237 -1517 -5356 -9181 -8827 -5594
3136 -5594 -3361 -5252 -7929 -8741 -6524 -5410 -6313 -8209 -7991 -5608 -4967 -6965 -9218 -8333 -5066 -3014
3152 -3014 -5213 -9186 -10070 -5774 -1536 -2324 -6395 -9914 -7226 -2161 303 -2383 -7230 -7400 -3457 717
3168 717 252 -3297 -5546 -3327 75 1571 -555 -2139 -1528 894 1936 464 -444 1267 3487 3391
3184C391k179j249J882L724R75k580l256N32M521L475j423m780k136L571M778
3199I246Q86l822m021N66M269K945j204l958j457K398K715m8k352j213P21J773
3215G444k69k147k22J453J536j137l329p95K336K987n77m164l206J562M555J819
3231G846l255m987j268L689L809p52m887l369J350M083J335l026l575m02K175
3246a234J912j494k464o68J142R31j350j727K26K061M61k121k749l10K997K764
3262a623j807m287j971K673M287N90l991l921L53M396L354j781m388k145K809
3277g452L803L21k853k492J418K411J107j402j556R26J777L06j356q37J180K919
3293a780oj914k052J365L624K095k181l595k63L638M332o06l910k855J990M939
$$ plain form
3184 3391 1212 -37 1845 5569 6544 3964 708 1240 5761 9236 7813 3033 897 4468 9246
3199 9246 10132 6310 2289 2855 7124 10069 8865 4907 3450 5848 8563 8515 6163 4950 5671 7444
3215 7444 7175 5028 4806 6259 7795 6658 3329 2534 4870 7857 7280 3116 -90 1472 6027 7846
3231 7846 4591 -396 -1664 2025 5834 5082 195 -3174 -1824 2259 3594 568 -3007 -3409 -1234
3246 -1234 678 -816 -3280 -3948 -2806 -1875 -3225 -4952 -4726 -2665 -2204 -4325 -7074 -7384 -4387 -1623
3262 -1623 -3430 -7717 -9688 -7015 -2728 -2138 -6129 -10050 -9697 -5301 -1947 -3728 -8116 -10261 -7452
3277 -7452 -3649 -3328 -6181 -8673 -7255 -4844 -3737 -5139 -6695 -5769 -3992 -3686 -5042 -5879 -4699 -1780
3293 -1780 -1786 -3700 -5752 -4387 -763 1332 -849 -4444 -4707 -1069 3263 2657 -1253 -4108 -2118 2821
3309B821K343k693l697l79L552L440k23k921j291J745K427J4j466o66J274J698
3325E978n08j600N5J942J901o69k830j557K402L350P03l196l613N47M235L077
3341A0217k089m519k130L086M067J26l258l183L87K896J704j306l031n66J055
3356C456J514m56j866p44J379O59j454k113kK175J056k013l183q55K533K892o92
3373B286m310k968J590M061J256k898m499p37L037L385r37l391k730Q98L230P84
3389a943j861k432o7J630O91j088j642Q19J133K78j946j082R47K421Q07k384k771
3406h490O26L374K398j333l679k038K910M285M34l115l356O37M104K827j584l072
3422e072j209K342K926J85j718j656J767J538M45j010k81J100J815Qj770q75K358
$$ plain form
3309 2821 5164 2471 -1226 -1605 1947 5387 5164 2243 952 2697 5124 5138 3672 3006 4280 5978
3325 5978 5470 3870 3925 5867 7768 7099 4269 2712 5114 8464 9167 5971 2358 2905 7140 10217
3341 10217 8128 3609 1479 4565 8632 8758 5500 2317 2704 5600 7304 5998 2967 2401 3456
3356 3456 4970 4514 2648 1904 3283 3942 2488 375 373 2548 3604 1591 -1592 -2447 86 2978 2286
3373 2286 -2024 -4992 -3402 659 1915 -983 -5482 -6219 -3182 203 -734 -4125 -6855 -5957 -2727 -1943
3389 -1943 -3804 -6236 -6303 -4673 -3982 -5070 -6712 -5893 -4760 -4482 -6428 -7510 -6563 -4142 -3335 -5719 -8490
3406 -8490 -7864 -4490 -2092 -3425 -7104 -9142 -6232 -1947 -1513 -4628 -7984 -7347 -3243 -416 -2000 -5072
3422 -5072 -6281 -3939 -1013 -828 -2546 -4202 -2435 -897 -452 -1462 -1743 -643 1172 1180 -590 -1465 893
3439H93K728K69k804k470J954M001J944k664l589k09L317M008o38l430k292J743
3455B761L307J614j725l147j27K396K108n01j948m62J528O71m82j402r2J846M71
3472F816j218k215J06K362J724j230l465j411K246L059M44l199l701O12L454K188
3488F572j698l997j658J481L305M16k879k682M55K071R00j756j652j50J041L82
3504A51j637j024K28J514K30k318k119P70K514J292k751l030n76K976K735m84
3520a529m190k612J731L564J545k391l828l76K675K620n43k355j610J011K306
3535c982K00j402j192J168J206j45j245o09J697J687n29j934j167K001L062P03
3551d81k656k751J126L322K702j335l498j126K510L793M35k538k496M30L583K064
$$ plain form
3439 893 3621 3890 1086 -1384 570 4571 6515 3851 262 53 3370 7378 6740 3310 1018 2761
3455 2761 6068 7682 5957 2810 2683 5079 7187 6686 4738 4276 5804 6475 5993 4591 4499 6345 6816
3472 6816 5598 3383 3489 5851 7575 6345 2880 1469 3715 6774 7218 4019 318 930 4384 6572
3488 6572 4874 877 -781 700 4005 4421 1542 -1140 -685 1386 2286 530 -1122 -1272 -231 151
3504 151 -1486 -2510 -2282 -768 -538 -2856 -4975 -4205 -1691 -399 -3150 -6180 -6756 -3780 -1045 -1529
3520 -1529 -5719 -8331 -6600 -3036 -1491 -3882 -7710 -8086 -5411 -2791 -3334 -5689 -7299 -6288 -3982
3535 -3982 -3782 -5184 -6376 -5208 -4002 -4147 -5392 -6001 -4304 -2617 -3146 -5080 -6247 -4246 -1184 -481
3551 -481 -3137 -5888 -4762 -1440 1262 -73 -3571 -4697 -2187 1606 2041 -497 -2993 -2563 1020 3084
3567C084r08k483%J688J665j58j405L4J208J324q12r29L94J647J346j046k243
3584B406n08K517K476k70l141j985J550L731J863k935l398o70L210L524r74l169
3600D227k029J463K833O48j754k303k48J822Q48p28j486P8R99O3j634j012M74
3617B261J783K84k341k150K82K265J896j891l231j684K377L013k06l161k981N5
3633c429L334J809j793k871j590J700J922l0j988j737K60J666J32j180j292P39
3649d348Q87l66j215q37J082J870k05k398j554Q01K568J555k098k933l97L057
3665d531K514m54l266j979J850L193J414k325k108j25K115K054m46j638o11J436
3681b907J154jj012K11J157J335j000j344L37J891J915o83k412q76K419K876N71
$$ plain form
3567 3084 2176 -307 -307 1381 3046 2888 1483 1517 2725 4049 3237 2308 2702 4349 5695 4649 2406
3584 2406 1898 4415 6891 6621 3480 1495 3045 6776 8639 5704 2306 1636 4846 8370 7396 4227
3600 4227 2198 3661 6494 7142 5388 3085 2837 4659 5507 4779 3293 3371 4370 4433 2799 1787 2261
3617 2261 4044 4328 1987 -163 119 2384 4280 2389 -842 -2526 -149 2864 2658 -503 -3484 -3429
3633 -3429 -95 1714 -79 -2950 -4540 -2840 -918 -948 -2936 -4673 -4413 -2747 -2615 -3795 -5087 -4348
3649 -4348 -3461 -3827 -5042 -5879 -4797 -2927 -3132 -5530 -7084 -6283 -3715 -2160 -4258 -7191 -7588 -4531
3665 -4531 -2017 -2471 -5737 -7716 -5866 -2673 -1259 -3584 -5692 -5817 -3702 -1648 -2094 -3732 -4343 -2907
3681 -2907 -1753 -1754 -2766 -2555 -1398 -63 -1063 -2407 -2070 -179 1736 1053 -1359 -2235 184 3060 3631
3698C631k452k538O64L832K096j480k979j033K392K693P75k343j765P65K463J153
3714E874j083j751J44J335O68m32j386Q84J108J90j042j630N79K071J049j531
3730E047k618J3K219J873o22k652k473J368L282J240k592k905o18K187K534p41
3746D542k895j489R72J628O35j653j505K16P45k24j016o27N35O09m84j610j011
3763b632P37K060K39k577k109J84K731J432r91l828j403K294K656K03k752k629
3779f385M65K637J569j338k383r08J789J331l19j090q98Q30R28m2j469J97Q59
3796d227J309q34j706k82J918J901k79k246j679J526K985J489k342k560o3L131
3812a959K479k51k699j652J079L117J371j531j626J69J881J062k61j096K38J141
$$ plain form
3698 3631 1179 -1359 -695 3137 5233 3753 774 -259 2133 4826 5601 3258 1493 2258 4721 5874
3714 5874 4791 3040 3184 4519 5187 4755 3369 4253 5361 5551 4509 2879 3458 5529 6578 5047
3730 5047 2429 2442 4661 6534 5912 3260 787 2155 5437 6677 4085 1180 562 2749 5283 4542
3746 4542 1647 158 1130 2758 3393 1740 235 451 1196 972 -44 -671 -136 473 -11 -1621 -2632
3763 -2632 -1895 165 404 -2173 -4282 -4098 -1367 65 -926 -4754 -6157 -3863 -1207 -1004 -3756 -6385
3779 -6385 -5920 -3283 -1714 -3052 -5435 -6343 -4554 -3223 -3542 -4632 -5530 -4700 -3772 -3814 -5283 -5086 -4227
3796 -4227 -2918 -3752 -5458 -5740 -3822 -1921 -2200 -4446 -6125 -4599 -1614 -125 -2467 -5027 -5090 -1959
3812 -1959 520 269 -2430 -4082 -3003 114 1485 -46 -1672 -1503 378 1440 1179 83 321 1462
3828A462P23n11j046P21J754K43p15j553L55K312J415r72k289j198K139L166J01
3845F107k256k534O54K939K224j640k552j008J745K334k4j639j549J15J625P62
3861E303j088j227N57P48R7j156r08Q30R64j83j805j265N23K423N39j884k553
3878h5o88K431K029q59k952j863J250K291J064k117k912j95J965J503p34j994
3894a866j043P84J106O8j679n82P26M74k66j417k01Q56J374j054j712j190J398
3911d224K175jk240k232Q77K393J988j608k846j012K018K461M06k302j532L36
3927e343K249J392j123j463j61J360O56j92q64R7J167M95n90j161P79J954J002
3944B54j262j543j42K126J968l59k344j086J207K918J183j530k390J12K175K337
$$ plain form
3828 1462 2185 1674 628 1349 3103 3346 2631 1078 1433 3745 5160 4188 1899 701 2840 6006 6107
3845 6107 3851 1317 1971 4910 7134 5494 2942 1934 3679 6013 5989 4350 2801 2916 4541 5303
3861 5303 4215 2988 3545 4293 4390 3234 2326 3156 4120 3937 2132 867 1390 3813 4352 2468 -85
3878 -85 -773 1658 3687 2828 -124 -1987 -737 1554 2618 501 -2411 -2606 -641 862 128 -1866
3894 -1866 -2909 -2125 -1019 -951 -2630 -3212 -2486 -2012 -2278 -3695 -3896 -3040 -1666 -2720 -4432 -5622 -4224
3911 -4224 -2049 -2050 -4290 -6522 -5645 -3252 -1264 -2872 -5718 -6730 -4712 -2251 -1845 -4147 -5679 -5343
3927 -5343 -3094 -1702 -2825 -4288 -4449 -3089 -2433 -2625 -3489 -3392 -2225 -1730 -2320 -3481 -2702 -748 254
3944 254 -1008 -2551 -2693 -567 1401 1042 -1302 -2388 -1181 1737 2920 1390 -1000 -888 1287 3624
3960C624k95j896j404R57K400O13j136j344L52J473M42m62q31P99Q55K15j063
3977C299n50O78J771M38j806j780K49K728R99j035k450j017J896K308K44k632
3993C340k187P65K125J181j284j779j015J281J211l52q85j452L48J112m17q66
4009A126m50O84M66j062q61p27P04J581l55j789j803O87K197P54j928k594l69
4026c739K212J669o51k209k251J239K365N42j717j865j74J566R07n75j175l96
4042d252O74O26j46j081K6O30O97p66j189J15J664J141q89j851n16J062K467J88
4060a400k015j650P73K429J650j166k457m04J376K396N91j607j558J037J467J003
4076D65j004r44M41P46P76p74j88J035J189j19r36r50Q19K230M13p02k016L43
$$ plain form
3960 3624 3329 1433 29 986 3386 3999 2863 1519 1871 3344 3786 3324 2493 3292 4147 4362 3299
3977 3299 2749 3427 5198 5636 3830 2050 2299 5027 6026 4991 2541 1524 3420 5728 5972 3340
3993 3340 1153 1918 4043 5224 3940 2161 1146 2427 3638 3286 2401 949 1297 2409 1992 1126
4009 1126 676 1360 1826 764 -97 -824 -120 1461 1106 -683 -2486 -1799 398 1152 -776 -3370 -3739
4026 -3739 -1527 142 -509 -2718 -4969 -3730 -1365 -823 -2540 -4405 -4579 -3013 -2106 -2681 -3856 -4252
4042 -4252 -3578 -2952 -3098 -4179 -4153 -3523 -2826 -3592 -4781 -4666 -3002 -1861 -2750 -4601 -5117 -4055 -1588 -1400
4060 -1400 -3415 -5065 -4292 -1863 -213 -1379 -3836 -4240 -2864 -468 123 -1484 -3042 -2005 -538 465
4076 465 -539 -1483 -1042 -296 480 -294 -482 553 1742 1623 687 -263 556 2786 3199 2497 481 824
4094H24J426K124j93k254j614J106K857Q86j586j901j12J868J667m07j991k54
4110B446N09J277J61q37n46K15P67np90m17N76Q59n68j114j236J831J360j058
4128C430j523j362O92J257J325j001k174j318J701J937Jj764k034j8J926O98p20
4145A053j643l81M63Q02p77o13l81K98O51p58r19j16P29Q15j040j672r3J301J615
4164f66o50k426j251J154J825J050j695k265l29J884K016q98j734j003O94J674
4180b620M51p22j461J49J121N06j08j082M85P50L36q53m94P73J212K35j081p44
4198c147M16J686J112k75k204o95J566K686Oj525j832N87K018J731p75j634n95
4215h74J325J577M33j142q08P13J005K57m31n36M32Q82K07j098m70J242J228k11
$$ plain form
4094 824 2250 4374 4181 1927 313 1419 4276 5162 3576 1675 1563 3431 5098 4691 2700 2446
4110 2446 2955 4232 4393 3556 3010 3225 3992 3987 3197 2780 3356 4215 3647 2533 1297 3128 4488 3430
4128 3430 1907 545 1237 2494 3819 2818 644 -674 1027 2964 2965 1201 -833 -851 1075 1773 1053
4145 1053 -590 -971 -508 294 -483 -1096 -1477 -1179 -528 -1286 -2205 -2321 -1592 -777 -1817 -3489 -3582 -2281 -666
4164 -666 -1316 -3742 -4993 -3839 -2014 -964 -2659 -4924 -5253 -3369 -1353 -2251 -3985 -4988 -4294 -2620
4180 -2620 -2169 -2891 -4352 -4203 -3082 -2576 -2684 -3766 -3281 -2531 -2195 -3048 -3542 -2769 -1557 -1322 -2403 -3147
4198 -3147 -2731 -1045 67 -208 -2412 -3107 -1541 1145 1151 -374 -2206 -1619 399 2130 1355 -279 -874
4215 -874 451 2028 2461 1319 511 1224 2229 2486 2055 1519 1951 2833 3040 1942 1472 2714 3942 3731
4233C731j399p24J008J846M95j236k124N9J775J564j56k493p80P09K167M52j265
4250C629j922j98J309J098l74j436n08N21O56l7r37j30L93J60l44j274k50J368
4268A724N98r73j674r07J185J562K62j877k064L65K291N74j082k128r41J140J988
4285D3j34j619j602L52J095P41q25j022J5M68N24q66l60j24J038l1q40r46N50
4304c543J064O36q70j792j66J668J776o48j857j075R37J666J153j450j523k18
4320d242J679J508k96j095r22P31J598M27p38p39N80M99M02o06qO50Q64J10j286
4339h84j50R82J485K30j133j240K26K191J371q69j652n65J114K129K33j472j366
4356F30M21J659R87l95j328j38L61J599k68r18l01Q43K45l52j43l76R81K41l78
$$ plain form
4233 3731 2332 1608 2616 4462 4957 3721 1597 1656 3431 4995 4839 2346 1566 2275 4442 4894 3629
4250 3629 1707 1509 2818 3916 3542 2106 1598 2119 2775 2738 1801 1671 2064 2224 1880 606 356 1724
4268 1724 2322 1349 -325 -1232 -47 1515 1777 -100 -2164 -1799 492 1066 -16 -2144 -3085 -1945 43
4285 43 -91 -1710 -3312 -2960 -1865 -1124 -1949 -2971 -2956 -2488 -1964 -2830 -3190 -3314 -2276 -2307 -3147 -4093 -3543
4304 -3543 -2479 -1843 -2713 -4505 -4671 -3003 -1227 -1875 -3732 -4807 -3870 -2204 -1051 -2501 -4024 -4242
4320 -4242 -2563 -1055 -1351 -2446 -3368 -2637 -1039 -612 -1350 -2089 -1509 -1010 -608 -1214 -1222 -572 292 402 -884
4339 -884 -1034 -52 1433 1663 530 -710 -484 1707 3078 2209 557 -8 1106 3235 3468 1996 630
4356 630 1051 2710 3697 3302 1974 1836 2197 3796 3528 2610 2309 3152 3397 3045 2902 2526 3507 3748 3370
4375C370j322J8R15J287n80j590j116O53J643O35j125k371o62K158J554p68j589
4392A110j393R88J456J44p78j445K74L70M03j31j026l97P07j16q18l58l6M29L91
4411b26j057q30L3J367L41q89j674o66J577J104K83j892j591O32J522J325j348
4428a989j552o48J240J086K1r74q68L84Q33M07q32l34K77K83L97n79j61M21R00
4447a688J7j171q31R83J392R22j295j478J52J663J511l97j626q55Q54J988Q61
4464A002j426j260J21J586J110n55o72l97O60J287j24m83m74Q94N06m31m13P2
4482A003J187M31N3j544k35J128J261K22j338j182N70J647J166j066j695k32J024
4499B400J789qj595r86L21J233N71p85n40o49Q64M08n10n75%M21K30q91n64M14
$$ plain form
4375 3370 2048 2066 2981 4268 3688 2098 982 1635 3278 3913 2788 417 -245 1913 3467 2699 1110
4392 1110 -283 705 2161 2305 1527 82 356 726 1129 998 -28 -425 282 166 -652 -1010 -1046 -617 -226
4411 -226 -1283 -2113 -2080 -713 -372 -1261 -2935 -3601 -2024 -920 -637 -2529 -4120 -3488 -1966 -641 -1989
4428 -1989 -3541 -4189 -2949 -1863 -1842 -2816 -3684 -3300 -2467 -2060 -2892 -3226 -2949 -2666 -2269 -2848 -3009 -2588 -1688
4447 -1688 -1671 -2842 -3673 -2690 -1298 -376 -1671 -3149 -2997 -1334 177 -220 -1846 -2701 -1847 141 1002
4464 1002 -424 -1684 -1563 23 1133 578 -94 -491 169 1456 1332 849 375 1269 1775 1344 931 1003
4482 1003 2190 2621 2674 1130 895 2023 3284 3506 2168 986 1556 3203 4369 3303 1608 1376 2400
4499 2400 4189 4181 2586 1600 1921 3154 3725 2940 2400 1751 2615 3023 2513 1938 1938 2359 2589 1698 1134 1548
4519A548N69N64j113j246l59J119J218o29j585j112O33J763L22j094k120j00J523
4536i9R28k97j575j235O76J225M2q01r49J85N84J76j053j29L35L94n2j010m64
4555c119N13Q71M7q89r55j04J588R12r05j444q82J582J624J02j415j429j07K098
4573a912Q87q29j087l93J007J185n56m24l23N08O26R1k30n53Q44K92J68o26k6
4592a351P38J390n38j229l73O36J827K48p17j407K6J408J826o93j272q02Q23J455
4610A995J087j106j017o4J120Q81m14p57J93N33L96l48m63P4Q35L15p86n76k48
4629A650J501N86j068j086o13J246J394Q2j639j204L58J528J000j001j686o84
4645C64R78J236Q9j287o85J67N44M32p75r68J31P20M6n94q99Q69L91l24q08r48
$$ plain form
4519 1548 2117 2681 1568 322 -37 1082 2300 1671 86 -1026 -393 1370 1692 598 -1522 -1622 -99
4536 -99 829 532 -1043 -2278 -1602 -377 -335 -1136 -2085 -1900 -1316 -1140 -2193 -2322 -1987 -1593 -1645 -2655 -3119
4555 -3119 -2606 -1735 -1688 -2577 -3532 -3636 -2048 -1136 -2041 -3485 -4367 -2785 -1161 -1059 -2474 -3903 -4010 -1912
4573 -1912 -1025 -1854 -2941 -3334 -2327 -1142 -1698 -2122 -2445 -1937 -1311 -1220 -1450 -2003 -1159 -867 -699 -1325 -1351
4592 -1351 -613 777 239 -990 -1363 -727 1100 1348 631 -776 -750 658 2484 1791 519 -283 540 1995
4610 1995 3082 1976 959 895 2015 2896 2482 1725 1918 2451 2847 2499 2036 2110 2945 3260 2474 1898 1650
4629 1650 3151 3737 2669 1583 970 2216 3610 3692 2053 849 1207 2735 3735 2734 1048 364
4645 364 1342 2578 2667 1380 695 862 1406 1838 1063 95 226 946 992 398 -501 368 759 435 -373 -1321
4665a321N20Q58N35j203j484Q4J088J026n86j541q03Q01J358L72j100j487j33
4682c016R47J083l79j026q80O67R84j07p34m65L17M91j77n81J66N15O38k40r63
4701b760m80N75J347J10j143r88N59J696L90n41j176k22Q42J603L26j198j042
4718b102K09J513O00m25j002J22P92N20q5n29J71L36O60j25k78l2R19L08l82r24
4738B66J58J168J004l19j252l11O63J171O09p73j385K8J449R36k77j229r29Q74
4756A851J226K65p09r03L80M49J17k63l53j76O89j17p93R3L7J006q6j088j187
4775D38N56R68N21n54j785l75J113J375q0j664j134M37J199N47p44j474k37P49
4793a44P36o2j077l50K0K68J21l91n48L78Q3N0q33n16P35O89m23q97o80P62Q35
$$ plain form
4665 -1321 -801 57 592 -611 -2095 -2011 -923 103 -483 -2024 -2827 -2026 -668 -296 -1396 -2883 -3016
4682 -3016 -2069 -986 -1365 -2391 -3271 -2604 -1620 -1727 -2461 -2926 -2609 -2118 -2295 -2876 -2710 -2195 -1557 -1797 -2760
4701 -2760 -3240 -2665 -1318 -1208 -2351 -3339 -2780 -1084 -694 -1235 -2411 -2633 -1791 -188 138 -1060 -2102
4718 -2102 -1893 -380 220 -205 -1207 -1085 -293 227 142 -387 -216 120 780 655 377 345 1264 1572 1190 266
4738 266 424 1592 2596 2277 1025 714 1377 2548 3157 2384 999 1027 2476 3412 3135 1906 977 1851
4756 1851 3077 3342 2633 1730 2110 2559 2676 2413 2060 1884 2573 2456 1663 1756 1793 2799 2713 1625 438
4775 438 994 1962 2483 1929 144 -231 882 2257 2177 513 -621 -184 1015 1562 818 -656 -893 -144
4793 -144 592 530 -547 -897 -877 -609 -488 -879 -1427 -1049 -966 -916 -1749 -2265 -1530 -841 -1264 -2161 -2841 -2079 -1244
4814a244Q96j567j546K95J594MO50j254j616R69Q67Q39q42j179p7J019J368q46
4832a670l93l19O23O99p72l0j60N67J29j79j93J1N67J082p73o20o60R91J571J10
4852E81j316q37N96J574O66k77j479j68Q11J285L23j052n16J03J116K88l11l23
4870A064j91N14L38k07j48K42N24P0p98N0L88Q42L19q77j047N21Q76O48l58j062
4890A708j077P78J513L75r93j447K80J078O20j78j175p15L64J226k3j305o9LM55
4909A418L8n61p97P34L35l04r92j80L40Q91K01j184j242L89J201N06m09j687j39
4928a442M15J134k9j192j234M51P46P45q07o64m06P00L23M6p92k43J79K43q1k84
4948b192k27N03N35p19l65l43P61P44k24p73q96R72J106M0p47j094K14J182J004
$$ plain form
4814 -1244 -348 -1915 -3461 -3166 -1572 -1568 -918 -2172 -3788 -2819 -1952 -1113 -1955 -3134 -3211 -2192 -824 -1670
4832 -1670 -2063 -2382 -1759 -1060 -1832 -1862 -2022 -1455 -1326 -1505 -1698 -1687 -1120 -38 -811 -1431 -2091 -1100 471 581
4852 581 -735 -1572 -976 598 1264 987 -492 -660 151 1436 1759 707 191 294 1410 1698 1387 1064
4870 1064 873 1387 1725 1518 1370 1612 2136 2206 1408 1458 1846 2688 3007 2130 1083 1604 2480 3128 2770 1708
4890 1708 631 1409 2922 3297 2304 857 1137 2215 2835 2657 1482 767 1131 2357 2334 1029 960 963 1418
4909 1418 1456 895 98 832 1167 863 -129 -309 31 922 1123 -61 -1303 -914 287 793 384 -1303 -1442
4928 -1442 -1027 107 78 -1114 -2348 -1897 -1151 -406 -1213 -1877 -2283 -1583 -1260 -1214 -2006 -2249 -2070 -1827 -1908 -2192
4948 -2192 -2419 -1916 -1381 -2100 -2465 -2808 -2047 -1303 -1527 -2300 -3196 -2224 -1118 -1078 -1825 -2919 -2705 -1523 -519
4967e19k30j469k99Q89R64L93o80o61J51R17L64l73l3j33L78L41k01m87P47J83
4987B42N20o08m92L50Q62M96k14j104j97P44J724l11q97p23R3J569O01o51r86
5006A018n69Q59R63L05p72o16L15N92L63o94l7J08L14J21l98l26M04K29K5o71
5026A533o54N62J264j74p79j308K80Q54P46l18q90q37J51J342N7n66j106l09P52
5045F00M88k24q81k43J37M43Q3q90Q3j76M61l22p64K90M31m7k13q61m55N40R39
5066e81j73q52j065M25J245M31n34j222o11J103Q27K1q91r33K40P41N12n69l01
5085b187l24P29L23k62m96L67L07J96m18l93M32M54P23o83n92j0O51R77k76r64
5105a446l66L46J464K44p72m94J2Q71P31J29q79m61O06M66O46m62m23J48L94L15
$$ plain form
4967 -519 -749 -2218 -2517 -1628 -664 -271 -951 -1612 -1461 -544 -180 -553 -586 -719 -341 0 -201 -688 59 242
4987 242 762 154 -338 12 874 1370 1156 52 -145 599 2323 2012 1115 392 485 2054 2655 2004 1018
5006 1018 449 1308 2271 2576 1804 1188 1503 2095 2458 1764 1727 1835 2149 2270 1872 1546 1950 2179 2204 1533
5026 1533 879 1441 2705 2531 1752 444 724 1578 2324 2006 1116 279 430 1772 1829 1263 157 -152 600
5045 600 1088 864 -17 -260 -123 320 403 -487 -404 -580 -119 -441 -1205 -915 -484 -531 -744 -1605 -2060 -1520 -581
5066 -581 -754 -1606 -2671 -2246 -1001 -570 -1104 -2326 -2937 -1834 -1007 -986 -1877 -2810 -2570 -1829 -1317 -1886 -2187
5085 -2187 -2511 -1782 -1459 -1721 -2217 -1850 -1543 -1347 -1765 -2158 -1726 -1272 -549 -1232 -1824 -1834 -1183 -206 -482 -1446
5105 -1446 -1812 -1466 -2 242 -530 -1024 -1012 -141 590 719 -160 -621 -15 451 1097 635 212 360 754 1069
5125A069m2n8jM39j0m36M5L8Q70J80r80k40K91J009P18q19r41m25J217Q49k57
5146B516q16n42l36J394M35l73j004j75N83K59P9o60k87J73K28K4k29k27K43L24
5166A609l27q46j16O66M67l56q15p08P19N89L00p21r95l60Q94P32q2j635r6N02
5186e79J28N95l95r59k30N30L24l22n25J04q4K08k25k18K08k53M48m51m47K26
5206a917N89L30j98q27l14M02R02K49j220l55N5J164K77m89p92j87N62R16J82
5225f71m34n80L00L30M42m04Q9l07L33N47l31j78J43O81Q1l89m31M97N84O03p26
5246A79q50J78J055N97P4j207j03J63J470K5n67o85K02M66O83J73p79k86L30O32
5266A750K97p95l18N93M39o1o50K08M74M0l92k26j83M37N96k9o46q10K6J216J32
$$ plain form
5125 1069 1027 969 968 1407 1397 961 1006 1044 1914 2094 1114 874 1165 2174 2892 2073 1132 707 1924 2773 2516
5146 2516 1700 1158 822 2216 2651 2278 1274 1099 1682 1941 2020 1360 1073 1246 1474 1498 1269 1042 1285 1609
5166 1609 1282 436 320 986 1453 1097 282 -426 293 882 1182 461 -534 -894 0 732 650 -985 -1081 -579
5186 -579 -451 144 -251 -1210 -1440 -910 -586 -908 -1433 -1329 -1413 -1205 -1430 -1648 -1440 -1693 -1245 -1696 -2143 -1917
5206 -1917 -1328 -998 -1196 -2023 -2337 -1935 -1033 -784 -2004 -2359 -2304 -1140 -863 -1352 -2144 -2331 -1769 -853 -671
5225 -671 -1105 -1685 -1385 -1055 -613 -1017 -928 -1235 -902 -355 -686 -864 -721 -40 41 -348 -779 -282 302 905 179
5246 179 -671 -493 562 1159 1233 26 -77 86 1556 1581 1014 329 531 997 1680 1853 1074 788 1118 1750
5266 1750 2047 1252 934 1527 1966 1905 1255 1463 1937 1977 1585 1359 1176 1613 2209 2180 1534 724 750 1966 2098
5287B098J05j415l74Q09P59Q9j028q27L47O34K0m28k56l34K20L97l57l1k68J56
5307C16j38N6o53J09M38l9l14n61l17O13M11l44q79m42O15P40L73r97r08j3O24
5328a310O73k85q37l9J13J99Q97j109k94J52M75K8m41j2L43J24J04n12NK26K51
5349a249M06p54l92L41P41K49j56j054k1P13J045k26m64o14j9J161J41N5p03j29
5369i29L28Q35J89n76j59L63J85L23o25M59j21N38P9m12J25K98L85K09r37k68
5389B89N96O00J91l50n94k36Q34P22j36p61n57R41M17ll48n82j7K46N74K1n14
5410A333j92J28M44p4m11J41q0J56n3m54R4L61K46n34p25j53P25L25j09p01p04
5431b37J80R00K28m15j203k91O70R50m62p19l48L19J21L52n22m88K33k8P0k50
$$ plain form
5287 2098 2203 788 414 1223 1982 2071 1043 216 563 1197 1217 789 533 199 419 816 459 428 160 316
5307 316 178 234 -419 -310 128 89 -225 -786 -1103 -490 -79 -423 -1302 -1744 -1129 -389 -16 -1013 -1921 -1934 -1310
5328 -1310 -637 -922 -1759 -1798 -1685 -1486 -589 -1698 -1992 -1840 -1365 -1337 -1778 -1790 -1447 -1323 -1219 -1731 -1726 -1500 -1249
5349 -1249 -843 -1597 -1989 -1648 -907 -658 -814 -1868 -1889 -1176 -131 -357 -821 -1435 -1454 -293 -152 -97 -800 -929
5369 -929 -601 234 423 -153 -312 51 236 559 -66 393 272 810 889 477 602 900 1285 1494 557 289
5389 289 885 1485 1676 1326 732 496 1330 2052 1916 1155 598 1539 1956 1953 1605 1023 1006 1252 1826 1847 1333
5410 1333 1141 1269 1713 1639 1228 1369 1289 1445 1392 938 1032 1393 1639 1105 380 227 952 1277 1168 467 -237
5431 -237 -57 843 1071 656 -547 -838 -168 782 320 -399 -747 -428 -307 45 -477 -965 -732 -760 -690 -940
5451i40k35k3L77k49j49n07J88Q29J75q53m20j29L67J017k79r07o51K89J117L39
5471f44q24o00J8N03O77n5n51j58K26O23m07j45j83N39J59j61j87J83J99L26m4
5492e06k53m78M88P62q9n20n42N95M44Q06m34r45O2M79J010k6n78m78J36O95Q67
5513A495n17l40j94L51L25L70r80M72J52K78J2n69J32L20K61m76m12Q0P60P5L1
5534A626n93m59N16Q15j18k46p11j15M05R09m11o25n13L02O20R5n06l21P7K55
5554A002J52l18l90N2M06j09n03k13O1N76k36n84p5k92Q15j3l99p74m2M63N06
5575H5J27r45m92J03O78M20n58m45m52L65M52l6n77j10J18J12O9k25j43K73J5
5596a166O7k86j84N38J92l26l63p5J72N02L23m90n70K22K35P18L2q24l65K32J008
$$ plain form
5451 -940 -1175 -1198 -821 -1070 -1219 -1726 -1538 -709 -534 -1387 -1807 -1936 -1569 -552 -831 -1738 -2389 -2100 -983 -644
5471 -644 -1468 -2068 -2050 -1547 -870 -925 -1476 -1634 -1408 -785 -1192 -1337 -1520 -981 -822 -983 -1170 -987 -788 -462 -506
5492 -506 -759 -1237 -749 13 -76 -596 -1138 -543 -99 707 273 -672 -610 -131 879 853 275 -203 -67 628 1495
5513 1495 978 638 444 795 1120 1490 510 982 1134 1412 1424 855 987 1307 1568 1092 680 760 1520 1595 1626
5534 1626 1033 574 1090 1905 1787 1541 830 715 1120 2029 1618 993 480 782 1402 1497 991 670 747 1002
5554 1002 1154 836 446 498 904 795 292 79 140 716 480 -104 -179 -471 344 331 -68 -842 -884 -421 85
5575 85 212 -733 -1225 -1122 -444 -24 -582 -1027 -1479 -1114 -662 -698 -1275 -1385 -1267 -1155 -1086 -1311 -1454 -1181 -1166
5596 -1166 -1099 -1385 -1569 -1031 -839 -1165 -1528 -1603 -1431 -929 -606 -1096 -1666 -1444 -1209 -491 -459 -1283 -1648 -1416 -408
5617d08K01m30m70n2N06N52l33j16n2M36j02Q5L4mL30J3J7n30N6P04N60l84o32
5640a9M2O02M41J91p32l21K10P83L56m94l55l15O47O25ln23k87r9P65Q7j28o22
5662H51J56K01K49m38K02K08j57J68m59J44p5K41L0l93o24R2N95K68J38r75l16
5683A06K74Q58J88q74o40P4K92L23jn35l70K27K61p4k09j99o2J41J88j15m32K26
5705c53O5m94k5p9L50p3L67q21j9j74M88L66n44n12k4J93N72J17n03m58K48N83
5727g30J4j46o35K03q3O70m34k15l9K78K39J16n83N16l9K02J80n17k67K84N62
5748d24M18o52n38N59M85K44k44o07J24J93J015m62n35j95L82P76J24k90l19j4
5768D0K22M13j41lj42J33L21k47J57r0J79L60j83l54K82J78L06Mo50k76M11Q65
$$ plain form
5617 -408 -207 -637 -1107 -1159 -653 -101 -434 -550 -602 -166 -268 -183 -149 -153 177 190 207 -323 -267 437 997 613 -19
5640 -19 23 625 1066 1257 525 204 414 1197 1553 1059 704 389 1036 1661 1658 1135 848 749 1514 1601 1473 851
5662 851 1007 1208 1457 1019 1221 1429 1272 1440 981 1125 1050 1291 1321 928 304 396 991 1259 1397 422 106
5683 106 380 1238 1426 552 -88 -14 278 601 600 65 -305 -78 183 109 -100 -299 -361 -220 -32 -147 -579 -353
5705 -353 -288 -782 -807 -886 -536 -609 -242 -1063 -1082 -1256 -768 -402 -946 -1458 -1482 -1289 -717 -600 -1103 -1561 -1313 -730
5727 -730 -716 -862 -1497 -1294 -1377 -707 -1141 -1356 -1395 -1117 -878 -762 -1345 -829 -868 -666 -486 -1003 -1270 -986 -424
5748 -424 -6 -658 -1196 -637 -152 92 -152 -759 -635 -442 573 111 -424 -619 -237 539 663 373 54 40
5768 40 262 675 534 531 389 522 843 596 753 663 842 1202 1019 665 947 1125 1431 1435 785 509 920 1785
5790A785N5q46m52L54L63M85n67l94j49N39R2o8j24p8m56O79o3l82j34QK07m4
5812H10k7k63oK46k38l14k17R2O18k48r0o67N8P30P7j32n49n06J16P13M8m48n82
5835g79j83N27K98m24m77J08K35J55J26n41k38L77N5r4k75j91J93N08k17l55k20
5856a412N58J28K73m15n95M53M38K63m19n93j42M04N00M49o76n26J83N03J14Q2
5876d30l93J09N30n07J43j02K13J68j62J79j93K69L19j13J5m06J56M58K44p8j69
5897B50l04K88N23J16n09j55n9N06O12k42m41l03M47M98R9l13j83j81L38L0j70
5918H47K7n2L70l26j72L2O6M58O1o18k49L18M71J56k79n81J24K1O05j46o13n39
5940a9L27M78j1K2m43p5J36K91j31k60m46L45p2j8k01P0R0J30l82l07Q5K69Q8
$$ plain form
5790 1785 1840 994 542 896 1259 1744 1177 783 634 1173 1265 1197 1073 995 539 1218 1155 773 639 647 854 810
5812 810 783 520 514 760 522 208 -9 83 701 453 363 -304 -246 484 561 429 -120 -626 -510 203 251 -197 -779
5835 -779 -962 -435 -137 -561 -1038 -930 -695 -540 -414 -955 -1193 -816 -761 -855 -1130 -1321 -1128 -620 -837 -1192 -1412
5856 -1412 -854 -726 -453 -868 -1463 -1010 -572 -309 -728 -1321 -1463 -1059 -559 -110 -786 -1312 -1129 -626 -512 -430
5876 -430 -823 -714 -184 -691 -548 -650 -437 -269 -431 -252 -445 -176 143 30 45 -361 -205 253 497 419 250
5897 250 -54 234 757 873 364 209 150 656 1268 1026 585 282 729 1227 1326 1013 830 649 987 1017 847
5918 847 874 822 1192 866 694 726 792 1250 1311 693 444 762 1233 1389 1110 529 653 674 1279 1133 520 -19
5940 -19 308 786 775 797 354 279 415 706 575 315 -131 214 142 124 -77 -7 83 213 -169 -476 -391 -122 -34
5963c4k44k73j64J43M19J18o65l78L41M13L1%n36l53K08M50J90l65n53J6K42M69
5985e25k39l8k58K41L2l23K70l3K18k47J73l76q4P62k50q1l96K95J66M02j0j13
6007d14p97K61P38L13l85l58MK65M62r6j92j92L86K58r8j28r9K16J00j96J67p2
6029A43J39K77N4J48n46L09L29j9M3l93JK80L89Rj116l11O80P08M50P5j179M4
6051E14J43R07q2K0j500Q66M8O7m65O9K79m01K67k68j20K22Q4O5J06o17K84J47
6073F35J82n41k96J17L31M30l69l73k06K9O39l12m72k51N08j62M63k14o96L0Q9
6094d39Mr8p3Q9L8K20j60l45L0O6K01j67j98Q9Q2J05j13m08l09R5Q26j79j84m46
6118a274J53J66O63j35m73k88L17L00pl1k62J67J03M83o34J14J42P5m3j56O8J38
$$ plain form
5963 -34 -278 -551 -715 -572 -153 -35 -700 -1078 -737 -324 -293 -293 -829 -1182 -974 -524 -334 -699 -1252 -1236 -994 -525
5985 -525 -764 -802 -1060 -819 -787 -1110 -840 -873 -655 -902 -729 -1105 -1189 -427 -677 -758 -1154 -859 -693 -291 -301 -414
6007 -414 -1211 -950 -212 101 -284 -642 -638 -373 89 -7 -199 -391 -5 253 155 27 -72 144 244 48 215 143
6029 143 282 559 613 761 215 524 853 834 877 484 485 765 1154 1163 47 -264 416 1124 1574 1649 470 514
6051 514 657 1564 1482 1502 2 868 916 983 518 587 866 465 732 464 344 566 650 715 821 204 488 635
6073 635 817 276 -20 97 428 858 489 116 -90 -61 578 266 -206 -457 51 -111 352 138 -558 -528 -439
6094 -439 -435 -533 -606 -517 -479 -259 -419 -764 -734 -668 -467 -634 -832 -743 -661 -556 -669 -1077 -1386 -1291 -465 -644 -828 -1274
6118 -1274 -1121 -955 -292 -427 -900 -1188 -871 -571 -578 -609 -871 -704 -601 -118 -752 -638 -496 -421 -464 -620 -552 -414
6140d14M08o5m12l1n2N13M27l98j94j54M44K09K38n16m02N48K5M17p2o67J65M02
6162D19N2L29qn88p3N38K28n81K38J42J26k89K0N2K82K66N8n54j52J64J92K01
6184A062j30p11K46M52J74r4m26MR6l5M73l55l61k4j34M39r3l54K85m8k6j38J
6207C03O9l47L22j40j53k03M88j32o6l18k64J8N85m1m36j14K8m8L87p0p56K48
6229f40k10N93K17o77j13q2M08O6L2m55J78P0r6R0k95Q5M9m2R4l0l15L82J88l53
6253h56k30K52K60P5JJ4n28N35R2M16k28k94k52L66M67m03q1J83r0M01j90k98
6275c88L45l08Q0J06k25L67L54j12k9j50j57L74L97k74J3l03q5L11M75J85p18
6296B58j73Q3Q17nm94m24O57K33M6l08n0l86L23K33j81k23K80j96K24K0k76K13
$$ plain form
6140 -414 -6 -71 -483 -514 -566 -53 374 -24 -218 -372 72 281 519 3 -399 149 174 591 519 -148 17 419
6162 419 471 800 792 204 131 669 897 316 554 696 822 533 553 605 887 1153 1211 657 505 669 861 1062
6184 1062 932 221 467 919 1093 999 573 577 673 638 1111 756 395 371 237 676 583 229 514 466 440 302 303
6207 303 372 25 347 207 54 -149 339 207 141 -177 -441 -423 162 121 -315 -429 -401 -449 -62 -132 -888 -640
6229 -640 -850 -257 -40 -717 -830 -912 -504 -438 -406 -861 -683 -613 -709 -619 -914 -829 -780 -822 -728 -758 -1073 -691 -503 -856
6253 -856 -1086 -834 -574 -499 -498 -484 -1012 -477 -385 31 -197 -491 -743 -377 90 -313 -394 -211 -301 100 -90 -388
6275 -388 -43 -351 -271 -165 -390 -23 331 219 190 40 -117 257 654 380 393 90 5 316 791 976 258
6296 258 85 168 985 980 486 62 719 952 998 690 640 254 577 810 629 406 686 490 714 734 458 671
6318F71j34rK89o6m31M98j29J21l47k21M86L0K00m55l00J10j12O03k30n87n5P5
6340GJ37K31l52n5p8L09l28L9j35J05K12l68k30K57q0j34J54j59k26j00K16o1
6362f39Q2m13J81K37R4J66j48o39J81N84l00K45k67m12M32n1K96m01l86N16K50
6383c92j40j90J40l0l9J08j75j11L13J78j9l0k35J82j89N32j61L9l11K06M19l1
6405F4j25k40k04N85J36k8l54j34M63L07j45j3k61L5K94K55j61j85J64l3O7p3
6427D14j0J52J05J2j29k04O42k82J88k10l24K77J78p5K59o40j17K88K30J03j73
6448F84j96m0M42l96J35m80K58j03L06k89K05l19m2K51k45k0J3l2J25j58j96n3
6470a50J83R9J88k12m95J19J80K73j00k57j73P3J74K75n61N8j15K66L4j71j2k88
$$ plain form
6318 671 537 528 817 751 320 818 689 810 463 242 728 758 958 503 203 313 201 804 574 -13 -68 7
6340 7 144 375 23 -32 -110 199 -129 -90 -225 -120 92 -276 -506 -249 -329 -463 -309 -468 -694 -794 -578 -639
6362 -639 -557 -970 -789 -552 -458 -292 -440 -1079 -898 -314 -614 -369 -636 -1048 -616 -667 -371 -772 -1158 -642 -392
6383 -392 -532 -722 -582 -612 -651 -543 -718 -829 -516 -338 -357 -387 -622 -440 -629 -97 -258 -219 -530 -324 95 64
6405 64 -61 -301 -505 80 216 188 -166 -300 163 470 325 312 51 86 380 635 474 289 453 420 487 414
6427 414 404 556 661 673 544 340 982 700 888 678 354 631 809 734 993 353 236 524 754 857 684
6448 684 488 448 890 494 629 149 407 304 610 321 526 207 165 416 171 151 164 132 257 99 -97 -150
6470 -150 33 132 320 108 -387 -268 -88 185 85 -172 -345 -272 -98 177 -384 -326 -441 -175 -141 -312 -324 -612
6492f12L9L43j63n9m24J51K20l29K14R5K21k55j17O5l70L54K69j71j76k11J66
6513g50N20j90k26p8qL03k8J57l45K6J97K18P2k13j2J31n2L51j88r9K36k09j46
6536c33M52k78J9K45L0l65L8J93K76L02k44l45J53J87j1K21l46j51N4O48j22j0
6558F13k90N5J86p3M52n24N1Q0J95m88J71J5j06L67j29k19K5K49%J87l76j13P1
6581C99M58l04j60k37J40J29K26j20k08q8j25J49J90k40k17L60j36J19o37K89
6601a3j72M35j54J54k52k43J66j14Qm06O0M61j04J35j79j28P6R0q7j23k55K41
6623d04Q4P6j26l10k1K61R3J4lj77P4j66O82o28J67j93Q1p2R0J2J79J9l5l28J74
6648d57J82l77M39j66j69K02K41R7r7j73n8Q2K30K9m8l04L95J89L4n7n6r0J06
$$ plain form
6492 -612 -573 -230 -393 -452 -876 -725 -505 -834 -620 -525 -304 -559 -676 -611 -981 -627 -358 -529 -705 -916 -750
6513 -750 -230 -420 -646 -724 -732 -429 -457 -300 -645 -619 -422 -204 -132 -345 -357 -226 -278 73 -115 -214 22 -187 -333
6536 -333 119 -159 -140 105 135 -230 -192 1 277 579 335 -10 143 330 319 540 194 43 97 745 623 613
6558 613 323 378 564 491 943 419 470 550 745 257 428 443 337 704 575 356 381 630 630 817 441 328 399
6581 399 857 553 393 156 296 425 651 531 323 235 110 259 449 209 -8 352 216 335 -302 -13
6601 -13 -185 250 96 250 -2 -245 -79 -193 -185 -591 -531 -70 -174 -39 -218 -346 -270 -180 -267 -390 -645 -404
6623 -404 -320 -244 -370 -680 -701 -440 -347 -333 -336 -513 -439 -605 77 -551 -384 -577 -496 -568 -478 -466 -287 -268 -303 -631 -457
6648 -457 -275 -652 -213 -379 -548 -346 -105 -8 -105 -278 -336 -254 -24 5 -43 -347 48 237 271 214 158 68 174
6671A74K55j31m29L08J57j2N5m4k06J76K84j11j24k23L98k20J73k56j04L18J30
6692E68qQ5l11n5J57l8j31M5K98m5o5L30l70m38K48o7L13j73QK43j10O3m0m72
6716C5J86L39l31R9k79J46N9M23J9p49p9K34l8pJ46l91j09L44J53q9p11M08K6
6739a66K54m24J8j38J33L21l98L30k74M29n67J38p9J77k44M48m14L8j74j19M56
6760b55j71l63L13J2K46j95n1k43M39r9J86K14l22k78K08Q1j1n4K04n45N26j31
6782b89l26M03n0J63N2M2j2k02N48j36l00J10j56K28J52l57n0N5j3N63l44K19
6804C00L51p43j08O90K44p90M40k82P80R8k53k90j67k28Q51n53k96L13k15K21
6824C63N1k17P2Q7J4m12L17J63J8J03Q2M3j084Q92J1Q9l31k39K47N5L92m65j10
$$ plain form
6671 174 429 298 -131 177 334 322 377 333 127 303 587 476 352 129 527 307 480 224 120 438 568
6692 568 560 645 334 279 436 398 267 312 610 565 500 830 460 22 270 203 516 343 351 594 484 547 507 35
6716 35 221 560 229 328 49 195 254 677 696 -53 -132 102 64 57 203 -188 -297 47 200 111 -600 -192 -166
6739 -166 88 -336 -318 -456 -323 -2 -400 -70 -344 85 -482 -344 -423 -246 -490 -42 -456 -418 -592 -711 -255
6760 -255 -426 -789 -476 -464 -218 -413 -464 -707 -268 -367 -181 33 -289 -567 -359 -278 -289 -343 -139 -684 -158 -289
6782 -289 -615 -212 -262 -99 -47 -5 -17 -219 329 193 -107 3 -153 75 227 -130 -180 -125 -138 425 81 300
6804 300 651 -92 -200 490 734 -56 384 102 882 980 727 437 270 42 893 340 44 357 142 363
6824 363 414 197 269 356 370 -42 275 438 456 559 641 684 -400 492 503 592 261 22 269 324 716 251 141
6847A41j46L75j68l8J17j78k99M00j67J68j19rn4Q2o37N9K30K28k47R0r3r0Q0
6870b75K33k00j70j29J74K00N6j60l00J86n5R3K62l82J95Oj35J3qj2r5J55R9J42
6894a07k57M9J41q6j52R7K4J95M9l46j56jM38R0l79K33n7J25J90N7j48j70j40
6917c11K76J68m2k05J23j73l5P3K17m0M12l75j70K59j26J99k83L01k02j22J94
6938A38L56k54m22L26M19j30N5m53J80K34j37O1k72K4L40m6j43J30l64L29l47
6959B4J00O6K68p2m38L51j18K7r8k6M11q4k88p9K35j36J51k20m0j22L88n1j01
6982A48k40KJ87L29m50L07l75o4J24j48L43m59K04M4j04L3J75l05O4OJ32j21J7
7005a51l8j07o2K50j41J6M4j03J46l22J79J49o9K0l74L13R8k24K99j85j60k5L09
$$ plain form
6847 141 -5 370 202 164 281 103 -196 204 37 205 86 77 23 105 -532 -473 -243 -15 -262 -172 -265 -355 -275
6870 -275 -42 -242 -412 -541 -367 -167 -111 -271 -571 -385 -440 -347 -85 -467 -272 -266 -401 -388 -396 -408 -503 -348 -249 -107
6894 -107 -364 -315 -174 -260 -412 -315 -291 -96 -47 -393 -549 -550 -112 -22 -401 -168 -225 -100 90 147 -1 -171 -311
6917 -311 -35 133 91 -114 9 -164 -199 -126 91 51 463 88 -82 177 51 250 -33 268 66 -56 138
6938 138 494 240 -182 144 563 433 488 35 215 449 312 373 101 125 465 419 276 406 42 371 24
6959 24 124 190 458 386 -52 299 181 208 110 84 495 411 123 44 279 143 294 74 34 -88 300 249 148
6982 148 -92 -90 97 426 -24 283 -92 -156 -32 -180 163 -296 -92 -48 -152 -119 56 -249 -185 -179 -47 -168 -151
7005 -151 -189 -296 -358 -108 -249 -233 -189 -292 -146 -468 -289 -140 -209 -189 -563 -250 -152 -376 -77 -262 -422 -447 -138
7028a38j78k11J25J31J29r2P9L5J3j23J74l3j95K43L4J56k64n10O38q3J73NO5
7051A73m24L08k35K66J6Nj08K48j75R8j25j28M3K95J55l64o5M55k97J99J34l05
7073A69J78L7k3j70M9j28L71k78J67N7j32K9J18k80K44o6Q1QQ7l79K7L6j38K74
7097C38N7j92j02K61j19K88l15J30l56J49O3k38J30mJ65l5j44r7J3j11m7J23k17
7120b60L22R8j05k74N7L03l68M63l24j56R6J11m9J22j08O0j8j48J7MK8k79K44
7143a64j49o5k5J64M8jk96K5M23q0j36J21m20K01j15J33L17k22N5J08O5l25J23
7166b15K4J6J33k14J10o2M3L34j39p7O4n8m3O9j17K97J11k61r8J77L0k22J61P3
7190A36J29j12k03N1O0K12o0J7k88J20O8J20L4l49M32k03R9R9j89ro2L19n1r8
$$ plain form
7028 -138 -316 -527 -402 -271 -142 -234 -155 -120 -107 -230 -56 -89 -284 -41 -7 149 -115 -625 13 -70 103 108 173
7051 173 -251 57 -178 88 104 109 1 249 74 172 47 -81 -38 257 412 48 -17 438 141 340 474 169
7073 169 347 384 361 191 240 112 483 205 372 429 297 326 444 164 408 342 423 431 518 139 166 202 64 338
7097 338 395 203 101 362 243 531 216 346 -10 139 202 -36 94 90 255 220 76 -21 -8 -119 -166 -43 -260
7120 -260 62 160 55 -219 -162 141 -227 236 -88 -244 -148 -37 -86 36 -72 -12 -30 -178 -161 -157 -129 -408 -164
7143 -164 -313 -378 -403 -239 -191 -192 -488 -463 -40 -120 -256 -135 -555 -354 -469 -336 -19 -241 -186 -78 -13 -338 -215
7166 -215 -191 -175 -42 -256 -146 -208 -165 169 30 -47 17 -41 -84 -15 -132 165 276 15 -83 94 124 -98 63 136
7190 136 265 153 -50 1 61 273 213 230 -58 62 130 250 284 -65 367 164 263 362 173 164 102 421 370 272
7214B72k66R4J46m7jO0k1K84k49r1J80k31M3r7o2j48J47J12%P5p3J44k56K85k98
7239BP2ml13J59J48j86K68m13K32n1j6J50l5j95j28L03j04k6j85M79j71o1j49
7262b24J50o5j92K66q9j49M3n1L98l12j25K93%r8Qj52K44k66L9J54n0k52L26r6
7286b00J04o3j22m7J30J15l1M1N9J08k96%p7N2O53m80m2NR7q6J21j76j01K12q6
7311a10j14K49j48K18k66K5M11j82O5o5RK3K23o5k83J75q4K58p9r2K27k25Q1j33
7335A18k67M85k30K57k00J49Mk01j52J04M7j26M35j34l4k11J99j6j23m0J34j52
7357D6j5L0j25O9J51r7n9k1Q4J83l53M67l88j79K56l46M02j00m55L92k09M33j29
7380C7j56k91M24m68L77m5L90j6r91K52K10Q66j240M44O17o21K59n49M30q5K95
$$ plain form
7214 272 6 100 246 199 198 258 237 521 272 181 361 130 173 76 14 -134 13 125 125 200 127 271 15 300 2
7239 2 74 70 -243 -84 64 -122 146 -267 -35 -86 -102 48 13 -182 -310 -7 -111 -137 -322 157 -14 -75 -224
7262 -224 -74 -139 -331 -65 -154 -303 -260 -311 87 -225 -350 -57 -57 -155 -147 -299 -55 -321 -282 -128 -178 -430 -104 -200
7286 -200 -96 -159 -281 -328 -198 -83 -114 -73 -14 94 -202 -202 -279 -227 426 -54 -96 -91 6 -80 41 -135 -236 -24 -110
7311 -110 -224 25 -123 95 -171 -146 265 83 148 83 92 115 338 273 -10 165 81 339 260 168 395 170 251 118
7335 118 -149 336 106 363 163 312 316 115 -37 67 114 -12 423 289 255 44 243 227 104 64 198 46
7357 46 31 61 -64 5 156 59 0 -21 63 246 -107 360 -28 -207 49 -297 105 5 -450 -58 -267 166 37
7380 37 -119 -410 14 -454 -77 -122 268 252 -739 -487 -277 589 -651 -207 410 -211 48 -501 -71 -156 139
7401A39l46L0J62j97M45k39k18J28P5N7k91J20k35J25J52K5P0m15O0j07N12m86
7423d34J64J69j92J20O41o95L28k58K27j78L86l73P17j173N83l54j3M34J21m75
7443b55J85l5L25N17r63J87n6K4L66j77J18j84k38K84k0K44l26l4k64J70M8oK35
7466A45j25k73J09K88K28m66O5j94l1N06j71R5L0m7j84J42M1j42J94K22k11k39
7488a8J25K10m02q3K93nk5J24k2k12J82j88J23j84J2K89N3k14j76N4P2k28M85
7511B65l69L11k27k45L94l63K4K59N7N0o81L31J71r6L37k24k11J99j17J01J37
7532A03o1n6k32k6N9J5L16m93O24m21J53j60k04K33j75N95k33Q9k71K10R0k43
7554h8J19K11k52j84M07l09L17j10o8k18J65J8J05J32k67j5P8j08PN0J56K60o11
$$ plain form
7401 139 -207 -177 -15 -212 233 -6 -224 -96 -21 36 -255 -135 -370 -245 -93 -68 2 -413 -353 -460 52 -434
7423 -434 -270 -101 -293 -173 468 -227 101 -157 70 -108 278 -95 622 -551 32 -322 -335 99 220 -255
7443 -255 -70 -105 220 737 -226 -39 -95 -71 295 118 236 52 -186 98 78 322 -4 -38 -302 -132 -84 -90 145
7466 145 20 -253 -144 144 372 -94 -29 -223 -254 252 81 176 206 159 -25 117 158 16 210 432 221 -18
7488 -18 107 317 -85 -168 125 120 95 219 197 -15 167 -21 102 -82 -70 219 272 58 -118 -64 8 -220 265
7511 265 -104 207 -20 -265 129 -234 -210 49 106 156 -525 -194 -23 -119 218 -6 -217 -18 -135 -34 103
7532 103 42 -14 -246 -272 -213 -198 118 -375 249 -172 -19 -179 -383 -150 -325 270 37 126 -145 65 155 -88
7554 -88 31 242 -10 -194 213 -96 221 111 43 -175 -10 8 113 245 -22 -37 41 -67 -60 -10 146 406 -205
7577b05J72m3j42M7j0L84J95l02j32k56L26n4K36j29r4j06K68j26K73l15m3P1
7599A5M03o56M34m85L26q2K4j72Q41J61n77j34K2Q42j146j43J56J41l24M99R4
7620B39qk15R7J14r1N0k44J25l18L24k9l9k35j7L34M6j78L77m44P1L75n44L87
7643A77j03l44J45J06r4J69J02o90k69Q68J41p35O3m8k91O41l9L79j7k14k50J38
7665a65q9L32j58k15J67J99M5k72K43R8l40j62Q6K69J36j66j1L0n3J33j38L5P8
7688H2J24k75K16l06J34j26N13m7k8M12o81N0j024j1J164M7k29M76j070jM39K21
7710H0l27J17Q09J87j032K3Q04q32L81o1n50K88M50n38L48l64KL72j67L82k52
7731A20N49o21rJ84k60J46n2j33P6J1J05l05k35J47M26o7M5L1j51k23j23K53k02
$$ plain form
7577 -205 -33 -76 -218 -171 -181 203 398 96 -36 -292 34 -20 216 87 -7 -113 155 29 302 -13 -56 15
7599 15 418 -238 196 -289 37 -45 -21 -193 648 809 232 98 120 962 -184 -327 -171 -30 -354 145 239
7620 239 231 16 113 227 136 186 -58 67 -251 73 44 5 -230 -247 87 133 -45 332 -112 -41 334 -210 177
7643 177 74 -270 -125 -19 -113 56 158 -532 -801 67 208 -527 -464 -512 -803 -162 -201 178 161 -53 -303 -165
7665 -165 -254 78 -80 -295 -128 71 116 -156 87 185 -155 -317 -231 38 174 8 -3 27 -26 107 -31 4 82
7688 82 206 -69 147 -159 -25 -151 362 315 287 699 18 68 -956 -967 197 244 15 491 -579 -580 -141 80
7710 80 -247 -130 679 866 -166 -143 661 -171 210 149 -401 -113 337 -201 147 -217 -215 157 -10 372 120
7731 120 669 48 39 223 -37 109 57 -76 0 11 116 -189 -424 -277 149 82 127 158 7 -216 -339 -86 -288
7754b88L28j46k9NL10l76L50j81j1%r6J50j24J51k48J69j54K28j32j3j69L18j09
7777f7o4J67j02k12J89N8p7Q7j63J78m7J64J4j05K63l21l81K97%M9P4op9J79l27
7802b32K28K6K0J90j89k55K48l68J69K79j42J28k49J97j03L7j40Q6K26k75M19
7823C00l16j32J5K57Q0l02P3K6J74j28l61K78l3J98J49m97N08nj73j36j20J35
7845a0k69J13l0K79l0R4o0k50J02N6j47J46O4K45l68J04o1J15j84n0K9k11J56
7868a67K88k47K80j38J70j81M2m1j7J02j29N2n8j80K37R0J2Q0j49k25mJ79j16
7891a20R7j14l6L93j02p6p9k06K36m34M18J8L23m85K7K19k1p6q4J08l29L55k61
7914b29L11J9r8k69P12m14p5K2J9j06M29l36N5K45m33K92l15J86j53j8M1p1M2
$$ plain form
7754 -288 40 -106 -135 -130 180 -196 154 -27 -38 -38 -134 16 -108 43 -205 -36 -190 38 -94 -107 -276 42 -67
7777 -67 -131 36 -66 -278 -89 -31 -108 -21 -184 -6 -53 111 125 20 283 -38 -419 -122 -122 -73 1 -5 -84 95 -232
7802 -232 -4 22 42 232 43 -212 36 -332 -163 116 -26 102 -147 50 -53 -16 -156 -70 156 -119 300
7823 300 -16 -148 -133 124 204 -98 -25 1 175 47 -314 -36 -69 129 278 -219 289 284 111 -25 -145 -10
7845 -10 -279 -166 -196 83 53 147 87 -163 -61 -5 -152 -6 58 303 -65 39 -22 93 -91 -141 -112 -323 -167
7868 -167 121 -126 154 16 186 5 47 6 -11 91 -38 14 -44 -224 13 103 115 195 46 -179 -183 -4 -120
7891 -120 -23 -137 -173 220 118 42 -37 -243 -7 -441 -23 -5 318 -167 -140 79 58 -18 -102 6 -323 32 -229
7914 -229 82 101 3 -266 446 32 -43 -21 -2 -108 321 -15 40 285 -148 144 -171 15 -138 -156 -115 -186 -144
7937a44J57k6L35l43j73K36l3RK2l20L61n9J09j90M0k23K76j55M0J10j65J98q8
7960b6K97l93J63k38J12K38l75L24K9j61n0j17K80m4q9K33k52qK53k1l43L53o
7983A59j86p9M6K58j6l1J48n51M10jj95R2L10m98J70r9K07j67k91M05o4R4r9j50
8007a28L00k51J81k30J83r3J22J35q7k5J44m59M57k79p2L81k37l9N7j88J63k35
8029b00J83K22J3J1O4q8q6M9k75J79l33J80J53K9K0k38K61K00o81M78J14k44N
8052A6j19J72j46L47p4j66j18J14k7%J5K11P0j58j17k84p8K37P0J50l31K63j1
8075C6O1k46j39o4L79K0K26n68J59M3L47l16j25O4K06j21P5r9j54K38K1P8l87
8098b66L27j33K25j17j83k9m1O1J48p9l50M97k61J60R0m0J73J77n12R8m0l0K63
$$ plain form
7937 -144 13 -13 322 -21 -194 42 9 18 40 -280 81 22 131 -59 -19 -242 34 -121 -81 29 -136 62 -26
7960 -26 271 -122 41 -197 -85 153 -222 102 131 -30 -80 -197 83 39 -50 183 -69 -77 176 155 -188 165 159
7983 159 -27 -106 -60 198 182 151 299 -252 158 157 -38 54 364 -134 36 -63 144 -23 -314 91 27 121 22 -128
8007 -128 172 -79 102 -128 55 -38 84 219 132 107 251 -208 249 -30 -102 279 42 3 60 -128 35 -200
8029 -200 -17 205 218 229 293 205 119 168 -107 72 -261 -81 72 101 121 -117 144 344 -337 141 255 11 16
8052 16 -103 69 -77 270 196 30 -88 26 -1 -1 14 225 295 137 20 -264 -342 -105 -35 115 -216 47 36
8075 36 97 -149 -288 -352 27 47 273 -295 -136 -93 254 -62 -187 -123 83 -38 37 -62 -216 22 43 121 -266
8098 -266 61 -72 153 36 -147 -176 -217 -156 -8 -87 -437 60 -201 -41 49 9 182 359 -153 -55 -95 -125 138
8121A38m02L15k79J36L6n4Q2J7Mj39J86l8k51L93k55J09Q4l50K74O3j57P8K70
8144B60m09J76O0l08J40J93k25J17J76Jo0Mj12j73J53M0N6l16M21l25J51P7j21
8167b4P3j2k2n3J07j56J29j28M08p54K54LJ4N41k09n1l2n4l69L12J03j52J58J01
$$ plain form
8121 138 -264 51 -228 -92 -56 -110 -28 -11 -7 -146 40 2 -249 144 -111 -2 82 -268 6 69 -88 -10 260
8144 260 -149 27 87 -221 -81 112 -113 4 180 181 121 125 13 -160 -7 33 89 -227 194 -131 20 97 -24
8167 -24 49 37 15 -38 69 -87 42 -86 322 -432 -178 -175 -161 380 171 120 88 34 -335 -23 80 -72 86 187
8191A87
$$ Imaginary data points
##PAGE= N=2
##DATA TABLE= (X++(I..I)), XYDATA
0@%%%%%%Qj6J6j6K4l2L3m1N1n9P3q9J05j23J43j67J94k22K56k94L35l82M34m91
30b60N53o22O99p83Q74r72J081j203J333j478J639j815K009k224K464k733L036
47A598l378L771m225M759n400O178p152Q413j0117J2566j6406K3345l9849J49163
61A23266J66095k23648j20120N6136J83925N4144q4399j28324r223Q7756R2233
72A97841k0724q7723n1625N3146P0575l740p3246l1634M3722N7661j4321p1350
84F8582m6756M4424Q7909J6205j02297j01229L2731J31817N5417r7073j34677
95d4947j1541J11994R1211l4394j15616p1980L9785R8031M1804o8677j02069j7669
107h4068P6533O1416l2031p8638k7280M5010M1960k4698n7925j0117M8562L2317
$$ plain form
0 0 0 0 0 0 0 0 8 -8 8 -8 16 -16 17 -24 27 -32 41 -48 57 -66 77 -90 104 -118 138 -156 179 -203 231 -260
30 -260 293 -329 370 -413 461 -511 570 -633 700 -778 861 -954 1055 -1169 1295 -1438 1598
47 1598 -1780 1991 -2234 2525 -2875 3303 -3849 4564 -5553 7013 -9393 13952 -25897 123266
61 123266 289361 65713 -54407 1729 185654 239798 155399 27075 17852 105608 197841
72 197841 177117 89394 37769 90915 161490 157750 84504 52870 96592 154253 139932 68582
84 68582 21826 66250 154159 170364 68067 -33162 -431 131386 186803 89730 -44947
95 -44947 -56488 55506 146717 112323 -3293 -75273 -35488 62543 104347 35670 -66399 -84068
107 -84068 -7535 53881 21850 -56788 -84068 -39058 2902 -21796 -79721 -89838 -41276 -8959
119h959m0215o9495q820O9375N9448l5762r6454m0498O2819R1803J2146q4429
131h9041r0839O498J02038P9041m0739j15828n0519P5914J07487N255r6199o7674
143a74606M1879Q6184J7905n8804m4383K7925N6283N618m7357k5353M0546N5126
155a9037k373n4698l6115L4154P3096L2766m7298p4483q679P9670Q5467p659r4629
168c9818o4352N2353J11810L8804p1790q5577N674Q7036O4495k5207p0368k2454
180a9394M8359N3565j357l9207j7935K6292L4445j540l2098j4292L1423M3557
192A11818k004n2651l8988L5913P8592K2267p1265p9265J4756R5210O0258m6965
204A27676r7917l4036O7468Q5373L677p8319o8164J6124P3603M0604l9007o8339
$$ plain form
119 -8959 -49174 -118669 -127489 -58114 1334 -34428 -130882 -171380 -108561 -16758 -4612 -89041
131 -89041 -179880 -173382 -71344 7697 -33042 -148870 -199389 -123475 -15988 -10733 -106932 -174606
143 -174606 -132727 -46543 -28638 -87442 -131825 -103900 -47617 -41999 -89356 -114709 -74163 -19037
155 -19037 -21410 -76108 -112223 -78069 -4973 27793 -19505 -93988 -102667 -22997 62470 54811 -39818
168 -39818 -104170 -51817 59993 98797 27007 -58570 -52896 34140 98635 73428 3060 -19394
180 -19394 28965 82530 81173 41966 24031 50323 84768 83228 51130 36838 68261 111818
192 111818 109814 57163 18175 54088 132680 154947 83682 4417 19173 114383 174641 127676
204 127676 29759 -4277 63191 148564 152241 73922 5758 21882 95485 136089 97082 28743
216B8743j6251M5269M0208j6617m8892j8053L2353K9832k3160n0860p412M8325
228D3485L5066l6937p1529j7137O1241O0582k3352q4542m8195M0518P5660K0658
240E5518o1006p7771j0346O4879O0974j8004p6836m7325L1319O4620J5644m9935
252d8269n0535O948M3722J7943k9396l3177P477L3934O919l5865k9328K1502M6948
265d1177R650m4907m7667R986O1574M2545k8912p0351k9768N0929P7154J4401
277C457o7425o8793J5534Q3073N1266l7122p2286j7629N4675N8556l186m9423
289d9303k5846K8026M2386N173k8549j6094K3827L4428j204l5138j6129L4101
301d322M9737M318m9369m1587K5656P3637L6258m6972p2762o341P2810O9592j4307
$$ plain form
216 28743 12492 57761 97969 81352 32460 14407 46760 76592 53432 2572 -4840 43485
228 43485 78551 41614 -29915 -47052 14189 74771 51419 -33123 -81318 -40800 34860 55518
240 55518 -5488 -83259 -93605 -28726 32248 14244 -62592 -109917 -78598 -13978 1666 -48269
252 -48269 -98804 -91856 -48134 -30191 -59587 -92764 -85287 -51353 -44434 -80299 -109627 -88125 -41177
265 -41177 -31527 -76434 -124101 -114115 -52541 -9996 -38908 -109259 -139027 -88098 -10944 3457
277 3457 -63968 -132761 -117227 -34154 17112 -20010 -92296 -109925 -55250 3306 120 -49303
289 -49303 -75149 -47123 -4737 436 -28113 -44207 -20380 14048 12844 -22294 -38423 -4322
301 -4322 45415 49733 364 -41223 -15567 58070 94328 47356 -25406 -31747 41063 110655 96348
314I6348p7483m3768M2486P6180K1476m9112n4853K992N2647L8570j6555m3876
326D5052j3601K9930L0594p510l1555q808K8039K5644j8401m1167o744M1412L8897
339A11782j8498o0532l0471M0833O4760P124o4665o2005J1400O9456M3561l5538
351G7207p5381k9276M4946O0704K904n7230n0956R623N0885K4017l2964m6253
363b1774l538L3660J7320k5405l3561L187L2900J0190l4800l9505P724M5640K3918
376A5956l4817n9651j3931N0315N4402j1499o8810m7621K8128O9431K6969m8529
388c9657o8375p921N6983N0758j4424n9062l0636L0117M7661O165l7096k6705
400i2192J6123L2093L145k5480j5626J9596L1759l98l4981k2786K5494M8452J4763
$$ plain form
314 96348 18865 -24903 17583 93763 115239 66127 11274 14266 66913 105483 88928 45052
326 45052 31451 61381 91975 84465 52910 44102 72141 97785 79384 38217 31473 72885 111782
339 111782 93284 32752 2281 43114 107874 114998 50333 -11672 -272 69184 112745 77207
351 77207 1826 -27450 17496 78200 81104 23874 -27082 -17459 33426 57443 24479 -21774
363 -21774 -25312 8348 25668 263 -33298 -30111 2789 12979 -21821 -61326 -53602 -7962 15956
376 15956 -18861 -78512 -92443 -42128 12274 775 -68035 -115656 -87528 -18097 8872 -39657
388 -39657 -108032 -115953 -58970 -8212 -22636 -81698 -112334 -82217 -34556 -28391 -65487 -92192
400 -92192 -76069 -43976 -40831 -66311 -81937 -62341 -30582 -30980 -65961 -88747 -63253 -14801 -38
413c8m1043m8545Q422O3109M5507k5532o5026k4340M8640O7202J0473n4395n0135
426f5701J6051O2103L6358k5461m7719r836L8862L8597m590l1457j1138K3712
438A9781K5531l795k4405n411K8101K8473j1457l8114j3033L7159M6570j300n1622
451C6478l8893K5547O4059K6284m2811o0120o804N5110N2447j0631n9745l6987
463C934K7514N4448J6029l7179m2805R81L7167K2667j9467l1336l258K4151J2845
476F5691j9130k7165K821L0570J4095k9509m1079r73M1844L2341k2830n7601k6611
489c7536L5891N4401M703n4374n3424O261N5722L6051k8089o0923k2447L5330
501b8434M3777r66m2852l1984J1741L2827Q192k5875k3504P356K2193K175k4641
$$ plain form
413 -38 -41081 -89626 -81204 -18095 27412 1880 -63146 -87486 -38846 28356 38829 -15566 -65701
426 -65701 -49650 12453 48811 23350 -24369 -34205 4657 43254 38664 7207 -3931 19781
438 19781 45312 41517 17112 11701 39802 68275 56818 18704 5671 42830 89400 88100 36478
451 36478 -2415 23132 87191 113475 70664 10544 3740 58850 111297 100666 40921 3934
463 3934 31448 85896 101925 64746 21941 22922 60089 82756 63289 31953 28695 52846 65691
476 65691 46561 19396 22217 52787 66882 37373 -3706 -4679 37165 69506 46676 -10925 -37536
489 -37536 -1645 52756 57459 3085 -50339 -44078 11644 47695 19606 -41317 -63764 -28434
501 -28434 15343 14377 -28475 -60459 -48718 -15891 -7699 -33574 -57078 -49722 -27529 -25354 -49995
514d9995j9065J3977L0906K451l4831l1742J3241M5183K1866l1710n1488r363
526a00570M6189M8344p352n4741l7703K4372N7342K3610l5798m7406q20M0827
538d3706L5260r805l5115j5002K1969K9596J042k1987q672J8151J9839m142k2465
551c5037n327K7368K8322o818l6068j7228K9466M7232J0420l9071m2014J0003
563b8752N5022L8350k1406n3008j9811L8923N3005P178m2003l5951J3181M3971
575D8699K3096j9350l2489k769K8215K0606j1479k2669J324K3507J2589j7414
587E1866k5046M211L2264K0629k1768m0220q975L6788L8787n846m8632l5948K0865
600A8975N2193J8956l5977n0829p829M1492M0658r558m7810k9612J9451L8902
$$ plain form
514 -49995 -69060 -55083 -24177 -21726 -56557 -88299 -75058 -29875 -8009 -39719 -91207 -100570
526 -100570 -54381 -6037 -13389 -68130 -105833 -81461 -24119 -509 -36307 -83713 -84533 -43706
538 -43706 -8446 -18251 -53366 -68368 -46399 -16803 -15761 -37748 -46420 -28269 -8430 -12572 -35037
551 -35037 -40364 -12996 15326 8508 -27560 -44788 -15322 31910 42330 3259 -38755 -28752
563 -28752 26270 64620 43214 -9794 -29605 9318 62323 69501 27498 -8453 4728 48699
575 48699 71795 52445 19956 17187 45402 66008 54529 31860 33184 56691 69280 51866
587 51866 26820 31031 63295 83924 62156 21936 12961 49749 88536 82690 34058 -1890 18975
600 18975 71168 90124 54147 3318 -4511 36981 77639 68081 20271 -9341 10110 49012
612D9012Q566l0573l0955L786K7048Q654k2172k1949O277K2233K009k6788k4269
625b9121J1219L2462R284l3092l9238L29M0392L1189k0181n2351k4956L1370M8025
638E331O642m3962m4383L970M5274L0422k0412m5049j6860K6749L3629n76l0541
651d9766k0098J3628K4594M39k1760j1183J5287K0760l692k6777j2899K2110L3284
664a6073J117l5242k8570J6566M5384K2215k8337m4674n470M1783M1601m644m2010
677c6354k8089J9566M5072J9980k4745l3817q79L1509K5834o441k4343o738K0124
690F79J9441n494j8454N37K2547J7199j2830k6324j855L3260L0054j1701m0429
703F630j7613L0642M6154P636m0073l8391J0296M7328K9983k0408m3749j5673
$$ plain form
612 49012 57578 27005 -3950 -164 26884 35538 13366 -8583 -2306 19927 21936 -4852 -29121
625 -29121 -17902 14560 23844 -9248 -48486 -48157 -7765 23424 3243 -49108 -74064 -42694 5331
638 5331 11973 -31989 -76372 -72402 -27128 3294 -17118 -62167 -79027 -52278 -18649 -19225 -49766
651 -49766 -69864 -56236 -31642 -31203 -52963 -64146 -48859 -28099 -31791 -58568 -71467 -49357 -16073
664 -16073 -14956 -50198 -78768 -62202 -16818 5397 -22940 -67614 -73084 -31301 10300 5656 -36354
677 -36354 -64443 -44877 195 20175 -4570 -38387 -39266 -7757 18077 11636 -12707 -19445 679
690 679 20120 14626 -3828 -3291 19256 36455 23625 -2699 -4554 28706 58760 47059 6630
703 6630 -10983 19659 65813 73449 33376 -5015 5281 52609 82592 62184 18435 2762
715B762K9913L9160L199l2879k6718J0023L0403J2085j8358k2163J911K1364P865
728E8567j7476j8379O777K3812O772k4934k8727O063L5551J8959k5741m3581r943
741a2280L5359L7946p394m7853l3464J8469M5166J6623l2312m4182o868L3740
753B950K9574j0705l6219j9438J4866K4709J375k2602j7114P185J7374j153k0272
766b9470j2777J1860K0739k156k8190k1590J4456L4671J0063l2021l7658J468
778g0605M0546L1294j7068m7443k0391K9836M2897N750l6384l3851Q435L7055
790b9929K0288j6860k8555n153K1252J9431m317j7995n030J5484J4178o848j6729
803d0783p14K2061J8167r913k6824q241K7416L3107r7l4171k5887J7095M4332
$$ plain form
715 2762 32675 71835 75034 42155 15437 25460 55863 67948 49590 27427 29338 50702 58567
728 58567 41091 22712 29489 53301 60073 35139 6412 12475 48026 66985 41244 -2337 -12280
741 -12280 23079 61025 53631 5778 -27686 -9217 35949 52572 20260 -23922 -30790 2950
753 2950 32524 21819 -14400 -33838 -18972 5737 7112 -15490 -32604 -25419 -8045 -9198 -29470
766 -29470 -42247 -30387 -9648 -11804 -39994 -61584 -47128 -12457 -2394 -34415 -72073 -70605
778 -70605 -30059 1235 -15833 -63276 -83667 -53831 -10934 -5184 -41568 -75419 -66984 -29929
790 -29929 -9641 -26501 -55056 -60209 -38957 -19526 -23843 -41838 -46868 -31384 -17206 -24054 -40783
803 -40783 -41497 -19436 -1269 -11182 -38006 -46247 -18831 14276 14179 -19992 -45879 -28784 15548
816A5548K0428k6134l9037l129L6880L5605n176l4761j9903J7996L4327J0785
828D3429j9855k1443M430K2680J1966j0070j4751M359J7970O226j4782j3649Q425
841B4935K4415R020j9882k6396K311L1848K4959j4245l7307j7153K5459L9326
853F7290N717l5286l5005O571L7896K3309j7595l6973j2564K2846K7346k542k6963
866B4047j6643R936J9088J47j8455j2254J0018J5081n338k1823j1121J3876K1624
879B8183j772k8257k4312R790L2653J4035k5154l8184q035L1158L1675o943l9670
892b4833k7142J5527L5539J2088k5491l2569k951K5257J9502j0026k4165q586
904d7850J3318J4280n066j6398m669J3750J1017r385j9263k880J9405J9305o838
$$ plain form
816 15548 35976 9842 -29195 -32324 4556 40161 34985 224 -19679 -1683 32644 43429
828 43429 23574 2131 6561 29241 41207 31137 16386 20745 38715 44941 30159 16510 24935
841 24935 49350 58370 38488 12092 14403 46251 71210 56965 19658 2505 27964 67290
853 67290 73007 37721 2716 9287 47183 70492 52897 15924 3360 26206 53552 51010 24047
866 24047 7404 17340 36428 36575 18120 5866 15884 30965 25627 3804 -7317 6559 28183
879 28183 26411 -1846 -26158 -16368 16285 30320 5166 -33018 -41053 -9895 21780 14837 -24833
892 -24833 -51975 -36448 -909 11179 -14312 -46881 -49832 -24575 -5073 -15099 -39264 -47850
904 -47850 -34532 -20252 -25318 -41716 -46385 -32635 -21618 -31003 -50266 -53146 -33741 -14436 -21274
917b1274k8393j5679J9541L4066O698k8650l1049M930L6804K6206j4112l5819
929d6731j3842K4293L3880N379k5876k2950P516K8086J4030j2845j7667J514J7540
942g673J1468q188j2323M458J8418Q194j3705j6033N918K6237J6175j4291k7964
955i309n155K8559L0863k716l2128k2064J5390L7543J6537k2083l2325l623K8705
968B8194K7303m252k7478j5522J3582K4261M503j6079j3756N518J5149L068j2582
981C1909r539Q709J5056q26j8783j3661J0627K3872O636k3284k6818K051K8974
994C4923K1227j3518l5033j6937K0050L2659M425k9587k9394K885K8169J7140
1006C7009j4035k8246r476J6158J6723m565j8321r683Q376J0682m857j5705n356
$$ plain form
917 -21274 -49667 -65346 -45805 -11739 -5041 -33691 -64740 -59810 -23006 3200 -10912 -46731
929 -46731 -60573 -36280 -2400 2979 -22897 -45847 -38331 -10245 3785 -9060 -26727 -25213 -7673
942 -7673 3795 -4393 -16716 -12258 6160 14354 649 -15384 -9466 16771 32946 18655 -9309
955 -9309 -14464 14095 44958 42242 10114 -11950 3440 40983 57520 35437 3112 -511 28194
968 28194 55497 51245 23767 8245 21827 46088 50591 34512 20756 26274 41423 44491 31909
981 31909 22370 31079 46135 45309 26526 12865 23492 47364 54000 30716 3898 5949 34923
994 34923 56150 42632 7599 -9338 10712 43371 47796 18209 -11185 -8300 19869 37009
1006 37009 22974 -5272 -14748 1410 18133 13568 -4753 -14436 -6060 4622 -235 -15940 -21296
1019b1296J2372J1522q371k2234q796J6386K2347k360k8352k2119J0646L1020
1031i235J3488k1737l2860o914K7029K7911n410l0910j9821J2060K7953R740j7745
1044b6451k2037K23J8721J2153p663j4650q28J2794P858p746j2008L284J7237
1057a9113Q795j2555j8374Q81K3922J9669q339k7298j2077K0364L1509O684k5056
1070a0988k5810N247L2075K1616j0835k7862r760J9813K5719L326j8872j4557
1082a0888Q154J9492P061j0823r570N868J3768L329j1458q262J0185J8415K567
1095C7838j7264j5857Q281K5676J3612j6379k7497m689K5796K6500l419k9781
1107B2817k0397J2826L0342J1887j9248k6369l214K1369J8378n864k1506r752
$$ plain form
1019 -21296 -8924 2598 -5773 -28007 -36803 -20417 1930 -430 -28782 -50901 -40255 -9235
1031 -9235 4253 -17484 -50344 -57258 -30229 -2318 -7728 -38638 -58459 -46399 -18446 -8706 -26451
1044 -26451 -48488 -48265 -29544 -17391 -25054 -39704 -40532 -27738 -19880 -27626 -39634 -36350 -19113
1057 -19113 -10318 -22873 -41247 -40366 -16444 3225 -5114 -32412 -44489 -24125 7384 14068 -10988
1070 -10988 -36798 -31551 524 22140 11305 -16557 -26317 -6504 19215 22541 3669 -10888
1082 -10888 -2734 16758 23819 12996 3426 9294 23062 26391 14933 6671 16856 35271 37838
1095 37838 20574 4717 12998 38674 52286 35907 8410 3721 29517 56017 52598 22817
1107 22817 2420 15246 45588 57475 38227 11858 8644 30013 48391 42527 21021 11269
1119A1269J0875J3859k068j3491o890Q176R632n790j5119m978J2886J3499o797
1132B5063k1603j2725J2694K2991M098k4174k5786K369K6375J8237j3540l0954
1144a6955j4321J8028K5624J800k4190k1584L331K0648J0865j2284j8879l378
1156c1295J2506Q812p200j2444j264J0197O066r582j4580J463J6880J0492j1290
1169b1239k1817n781J9809K2387k820k6670j8723J2149K8879J2492j8776k6357
1181d6467l594K3495K3002m144k2531j3554J1129K1029P351j3199j3405M197J4384
1194a2307O133p566p839N497J3009L237j1176r624Q826J9323P149j4704j8272
1207a8314L028K4285J8828r139k5146r796J8424K7180N767k1393k1599M482K5730
$$ plain form
1119 11269 22144 36003 33935 20444 13554 21730 31362 25572 10453 5475 18361 31860 25063
1132 25063 3460 -9265 3429 26420 30518 6344 -19442 -17073 9302 27539 13999 -16955
1144 -16955 -31276 -13248 12376 14176 -10014 -31598 -28267 -7619 3246 -9038 -27917 -31295
1156 -31295 -18789 -9977 -17177 -29621 -30885 -20688 -14622 -24204 -38784 -37321 -20441 -9949 -21239
1169 -21239 -43056 -48837 -29028 -6641 -9461 -36131 -54854 -42705 -13826 -1334 -20110 -46467
1181 -46467 -50061 -26566 -3564 -7708 -30239 -43793 -32664 -11635 -4284 -17483 -30888 -26691 -12307
1194 -12307 -6174 -13740 -21579 -16082 -3073 164 -11012 -20636 -11810 7513 14662 -42 -18314
1207 -18314 -15286 8999 27827 18688 -6458 -16254 2170 29350 35117 13724 -7875 -3393 22337
1220B2337J6661r078k1370o681J5115J7172L53j4445p499Q128J1425l51r792l966
1234A8009Q930J0238m150j4191n269J2506J6270j312j9182j5686P958K3507J0783
1247D8411j7024k5394m513K0901K1593m076k6174j7639R631K3666P067j6920j9550
1260b1j403J5044J0036o780j4894l609Q344N382o224j0172j181R293N531r592
1274b46j5682k017J5097J2685q049k2186j2112J3095K3186K933k1979k3012J974
1287c6313K4217J5831j1153k5737j0357J5178K0408J313j8119j4816M073J5695
1299a9780O572r471j1351J355J0611L894p981q166M689J2619L633j2168j2978
1312c8522N569J9136J0131j1544k0015l826J9314K1580j751k2016j5451R965K4727
$$ plain form
1220 22337 38998 29920 8550 1869 16984 34156 34509 20064 12565 20693 32118 31767 21975 18009
1234 18009 26939 37177 33027 18836 13567 26073 42343 41031 21849 6163 14121 37628 48411
1247 48411 31387 5993 1480 22381 43974 39898 13724 -3915 5716 29382 36449 19529 -21
1260 -21 -1424 13620 23656 16876 1982 -1627 6717 12099 5875 -4297 -5478 3815 9346 -246
1274 -246 -15928 -17945 -2848 9837 1788 -20398 -32510 -19415 3771 6704 -15275 -38287 -36313
1287 -36313 -12096 3735 -7418 -33155 -43512 -28334 -7926 -6613 -24732 -39548 -35475 -19780
1299 -19780 -13208 -22679 -34030 -32675 -22064 -18170 -26151 -34317 -29628 -17009 -13376 -25544 -38522
1312 -38522 -32953 -13817 -3686 -15230 -35245 -39071 -19757 1823 72 -21944 -37395 -27430 -2703
1325b703J2596j3379k1901k917J9369J8622j610j6788r475R949J6064L582j0620
1338G89o652P112J0922k3q902l510J0501J2117j731j3989p145J0806J8567M350
1352C3212j4989j6888K541K1480J6175q160k2213j0430J4471K2705M980j8237
1364B4647j8226L292J9221J1731q818j6159l990J0975J0405m128j0944k285P737
1377B3458N562o047j0219l69J0706P411q088j6214m622J2889J5508k633k0374
1390F968j5716P160K1548Q470j5924k2940m027J7493J6850m512k0677j3420P481
1403a1246J6231M586j2491j3996j64J0648N674p409r732K04Q113K795r225r966
1417b5978L039J3022M802j2507j6459P42J7719J3544r312k1514r293J4641K1085
$$ plain form
1325 -2703 9893 -3486 -25387 -28304 -8935 9687 8077 -8711 -18186 -8237 7827 11409 789
1338 789 -5863 1249 12171 12148 3246 -264 10237 22354 20623 6634 -511 10295 28862 33212
1352 33212 18223 1335 3876 25356 41531 33371 11158 728 15199 37904 42884 24647
1364 24647 6421 9713 28934 40665 31847 15688 11698 22673 33078 28950 18006 15721 23458
1377 23458 29020 22973 12754 12385 23091 30502 22414 6200 1578 14467 29975 27342 6968
1390 6968 -8748 -1588 19960 28430 12506 -10434 -14461 3032 19882 15370 -5307 -18727 -11246
1403 -11246 4985 9571 -2920 -16916 -17080 -6432 -758 -8167 -17899 -17695 -9582 -6787 -16012 -25978
1417 -25978 -22939 -9917 -5115 -17622 -34081 -33339 -15620 -2076 -11388 -32902 -42195 -27554 -6469
1430f469J956j8669j7769L260J9790J3416q197j8298p046J1899J5746J184j1854
1443b1051r329N012J2391L004q237n522O256R947J24j0555m768R301J4350J519
1457B442j4407j1314Q032J9831R211j1640j8782k101J8790J8747j538j8878j2703
1470a4310Q649K1194R483j1310j6464o55J5348J2238k894j1715m238Q210R516
1483B3052j424p823j177Q038O355m352j0021j210J1016J1401l893j5748q336J0741
1497A6619J7908L698j6042j7954K043K0001J3542q979k1129q257J2326J7251J295
1510C2322j5395j3406L276J2996N222p366j0900j174P167L588n525p667M77O970
1524A0585K601q719j0705O93J2383P690j0322j7866m157J4005J5245l722j9613
$$ plain form
1430 -6469 -4513 -23182 -40951 -37691 -17901 -4485 -12682 -30980 -38026 -26127 -10381 -9197 -21051
1443 -21051 -30380 -25368 -12977 -9973 -18210 -23732 -17476 -7529 -7405 -17960 -22728 -13427 923 2442
1457 2442 -11965 -23279 -15247 4584 13795 2155 -16627 -18728 62 18809 17271 -1607 -14310
1470 -14310 -5661 15533 25016 13706 -2758 -3413 11935 24173 21279 9564 5326 13536 23052
1483 23052 21628 13805 12628 20666 27021 22669 12648 11438 22454 33855 29962 14214 5878 16619
1497 16619 34527 38225 22183 4229 6272 26273 39815 30836 9707 1450 13776 31027 32322
1510 32322 16927 3521 6797 19793 25015 17649 6749 5575 12742 16330 10805 3138 3615 10585
1524 10585 13186 4467 -6238 -5545 6838 14528 4206 -13660 -17817 -3812 11433 7711 -11902
1537a1902j4340P738J9319O487j3807j8745k841J4348J3050l422j5347r321O288
1550b2495J1701K445q970q586K092Q362J446p521n259N216Q806p43j0950p124
1564c1580O957J4520L293j2923j4036K783J7328J2263p054j7988p486J2510J8526
1577b887L857j4530j3995K329J7108J1670o341j3811l398J0837J1031r57q196
1590g283l351P198P653k191o611n7Q951P559m251j0178k344J1402J2553n34j3412
1605E104r997P149J7962Q582j0858j7196k423J6594J6498k808j6614r972P832
1618I853J6056N311r803j1539R69J0251N995m676p248l07O180K981m759o419K029
1633A4874P971L197p661j0987n05J2150R868o219j6681p922J0491J6382J509j6225
$$ plain form
1537 -11902 -26242 -18504 815 7302 -6505 -25250 -28091 -13743 -693 -4115 -19462 -28783 -22495
1550 -22495 -10794 -8349 -17319 -25905 -23813 -15451 -14005 -21526 -26785 -21569 -12763 -13506 -24456 -31580
1564 -31580 -24623 -10103 -6810 -19733 -33769 -30986 -13658 -1395 -8449 -26437 -33923 -21413 -2887
1577 -2887 970 -13560 -27555 -25226 -8118 3552 -2789 -16600 -19998 -9161 1870 913 -7283
1590 -7283 -10634 -3436 4217 2026 -4585 -4642 4309 11868 7617 -2561 -4905 6497 19050 18516 5104
1605 5104 -4893 2256 20218 28800 17942 746 -1677 14917 31415 28607 11993 2021 9853
1618 9853 25909 31220 21417 9878 10847 21098 27093 22417 15169 14862 21042 24023 19264 12845 14874
1633 14874 22845 26042 18381 7394 6889 19039 28907 22688 6007 -1915 8576 24958 26467 10242
1647A0242j5819K453J6418R778q553j6698o394R406J1678l56j1586r056K738P940
1661B191K013o627o876J285N866M0p716n471M044Q393M54j1771r722M018J3929
1676e950N929j1215j5480j926J3372J3092l156j7090j0073P233J5668M908r183
1689a3871j4434j623J2039J0278k945j1299m823O339Q459K96o814l397O467N958
1703i370k568q211J18R161P047k490j1424m527R418J4095J958j1203j1180J216
1717a7960J7204J1184o266j4806n484J1960J4541K709j2061j0219M707J2858O668
1730A5035n102q324p19P938N853k545n048N5P378L212m894o098K250R434O399
1745B4824o467j1075k320J1486J2513j746j4539j0127O796J6493O573j1079j5652
$$ plain form
1647 10242 -5577 -3124 13294 23072 14519 -2179 -8573 833 12511 12155 569 -8487 -5749 2191
1661 2191 4204 -2423 -9299 -8014 -2148 -2108 -9824 -15295 -11251 -2858 -2404 -14175 -23897 -19879 -5950
1676 -5950 -21 -11236 -26716 -28642 -15270 -2178 -5334 -22424 -32497 -25264 -9596 -4688 -13871
1689 -13871 -28305 -29928 -17889 -7611 -10556 -21855 -26678 -20339 -11880 -11584 -18398 -21795 -15328 -9370
1703 -9370 -11938 -20149 -20031 -10870 -3823 -6313 -17737 -22264 -12846 1249 3207 -7996 -19176 -17960
1717 -17960 -756 10428 4162 -10644 -16128 -4168 10373 13082 1021 -9198 -4491 8367 15035
1730 15035 9933 1609 890 8828 14681 12136 7088 7143 14521 17733 12839 6741 8991 18425 24824
1745 24824 18357 7282 4962 16448 28961 27215 12676 2549 9345 25838 32411 21332 5680
1758E680j665J3515J1835l457j3435p796O183J0619J821p718p897J037O420J987
1772A7129n063n503J965N573k80p718o040L311R346J796r996j1870P33J2822Q693
1787A4898p674j5708o934R617J3898J014j3730j3484K316J3298P069o617j2836
1800a4873m515P108Q464r51q895n088L510N395l36o709k866N216N063k948q903
1815b1328k535P395Q708p47j1682q304N724J3714N660r604j3822j203J3097J2333
1829b594j980j4085q542O793J4071N495q437j0450N92R972P334l429o899n28O300
1844f387M779k640m475J336P354L528m096p461K84J1090P253k725j1389m416R445
1859A480J4031J937j2307j0107L491J3556R900n162j3019m867J0031J1319J303
$$ plain form
1758 5680 4015 17530 29365 25908 12473 4677 10860 21479 23300 15582 7685 8722 15142 17129
1772 17129 12066 6563 8528 14101 13821 6103 63 3374 12720 14516 4520 -7350 -6617 6205 14898
1787 14898 7224 -8484 -15418 -5801 8097 9111 -4619 -18103 -15787 -2489 4580 -2037 -14873
1800 -14873 -19388 -12280 -3816 -4767 -13662 -18750 -15240 -9845 -10181 -16890 -19756 -14540 -9477 -12425 -21328
1815 -21328 -23863 -16468 -7760 -8507 -20189 -28493 -22769 -9055 -3395 -12999 -26821 -28024 -14927 -2594
1829 -2594 -4574 -18659 -27201 -20408 -6337 -842 -9279 -19729 -19137 -9165 -1831 -5260 -12159 -12687 -6387
1844 -6387 -1608 -4248 -8723 -7387 -33 3495 -601 -8062 -7778 3312 10565 7840 -3549 -7965 1480
1859 1480 15511 17448 5141 -4966 -1475 12081 21981 16819 3800 -1067 8964 20283 21586
1872B1586q545q299L212R868L345m710o257J824N816J666m450m149K947O478J345
1887B1677p621o768K919J0300M768p451j2492k043J1241J0813l252j4014r195
1900a118N627J3592M568r687j3077j402R420Q225l062j0559n860M169P143m13
1914G566o541m549K363M162j345o370k972M619N387k717r505n300N946R909R84
1929A637j0889j0992J657J2690P438o492j4045n322Q626J2297N17j0853j0085
1942b3816K380J0069N705n054q626k378O583N081k004n102j194M309L186k099
1956a2960n244J65P174N144m715q352j449Q713J0065j013j1207p629O408J3735
1970a165N565q458j1791q70J1827J1161j810j1125n779N876J0722L758o132o877
$$ plain form
1872 21586 13041 4742 7954 17822 21167 16457 10200 12024 17840 19506 15056 10907 13854 20332 21677
1887 21677 14056 7288 10207 20507 25275 17824 5332 3289 14530 25343 22091 8077 -1118
1900 -1118 4509 18101 22669 12982 -95 -1497 7923 16148 13086 2527 -3333 836 7979 7566
1914 7566 1025 -3524 -1161 3001 1656 -4714 -7686 -3067 2320 -397 -9902 -15202 -9256 653 1637
1929 1637 -9252 -20244 -18587 -5897 1541 -4951 -18996 -24318 -15692 -3395 -2878 -13731 -23816
1942 -23816 -21436 -11367 -5662 -10716 -19342 -21720 -15137 -10056 -12060 -17162 -18356 -14047 -10861 -12960
1956 -12960 -18204 -18039 -10865 -5721 -10436 -18788 -20237 -11524 -1459 -2472 -13679 -21308 -14900 -1165
1970 -1165 4400 -4058 -15849 -16719 -4892 6269 4459 -6666 -12445 -6569 4153 7911 1779 -5098
1984e098K249O970M082l356l466J300N647J821l804l890L292P642K839o130q016
1999B082J880J0477P873m491j1899m551Q831J2460J931j0840j0298K228J2008
2012A7691Q000n829j1413l262P325Q116l96p674m777L136N377l5m895k644K487
2027A1207L683j579n911l145N030O223j457q988o913L584J0236L861q373j2525
2041e067j683R902R408k623j2868q683N008J1665K852q468j0024r79P336N477
2055A253k944q180k653M116L775k335m890r49L842K840m019o331o03O720N424
2070d934l686r628m020O600J0437J139j0246r778K001J2001P269n021j1635m276
2084b3777P796J0947Q60q911o742K677Q323M377m324n466R43N286L056k817l149
$$ plain form
1984 -5098 -2849 4121 8203 4847 1381 2681 8328 10149 6345 2455 5747 13389 16228 10098 2082
1999 2082 3962 14439 22312 17821 5922 1371 10202 22662 24593 13753 3455 5683 17691
2012 17691 25691 19862 8449 5187 12512 20628 20232 12558 7781 10917 16294 16259 11364 8720 11207
2027 11207 14890 13311 7400 4255 9285 15508 14051 5063 -1850 1734 11970 15831 7458 -5067
2041 -5067 -6750 3152 12560 9937 -2931 -11614 -6606 5059 7911 -557 -10581 -11560 -4224 1253
2055 1253 -1691 -9871 -12524 -8408 -4633 -6968 -11858 -12807 -8965 -6125 -10144 -16475 -17078 -10358 -4934
2070 -4934 -8620 -18248 -22268 -15668 -5231 -4092 -14338 -24116 -22115 -10114 -2845 -7866 -19501 -23777
2084 -23777 -15981 -5034 -4174 -13085 -19827 -17150 -8827 -4450 -8774 -14240 -13297 -8011 -4955 -7772 -10921
2099a0921J728N936J969n010m486K788Q981M049n289q433k28R146R777j401j0683
2114b077o363O309J1709N104p080j0145n59R753Q860j821q474m369M719Q221J320
2129A5107m990l836K494N373M88l942k221L711M868p19o425l740N061Q017J186
2144B0432p908p852J182J0042O997n258j1350m520P367J0285M51r321r220J883
2158C210R472M651m867r032k293M849N653j915o020k537L134K547k252m775r03
2173a078L891K930l399p394k529O355O258k083r347o855M207R676L653q442j0918
2188a5075j163R292P718k501j0569o332M284Q802K417o307p376J85O022L320k898
2203a0181m854k59M050K131l464l669J720N469K173n011o193J025P824O261l818
$$ plain form
2099 -10921 -9193 -3257 -1288 -6298 -10784 -7996 985 5034 -255 -8688 -8916 230 10007 8606 -2077
2114 -2077 -8440 -2131 9578 14682 7602 -2543 -3102 6651 15511 13690 5216 847 5566 13787 15107
2129 15107 10117 6281 8775 14148 14636 10694 8473 12184 17052 16333 9908 6168 11229 19246 20432
2144 20432 12524 4672 5854 15896 22893 17635 6285 1765 9132 19417 19868 10547 1327 3210
2158 3210 12682 17333 12466 3434 1141 5990 11643 9728 3708 1171 4305 6852 4600 -175 -1078
2173 -1078 2813 5743 2344 -5050 -7579 -1224 5034 2951 -6396 -13251 -9044 632 4285 -4157 -15075
2188 -15075 -16238 -6946 772 -1729 -12298 -18630 -14346 -5544 -3127 -9434 -16810 -16625 -10603 -7283 -10181
2203 -10181 -15035 -15294 -11244 -9113 -12577 -16246 -14526 -9057 -6884 -11895 -18088 -17063 -9239 -2978 -6796
2218f796r340l694P484J0185J090q733p828K567J0561O372l908q909k812O641
2232g120Q395P94n982m218K794O287K163l108k957K270M500Q41l790j505L897
2247C261N878K70n778m679M256Q587L694n902q214m70Q904Q778j928r832n697
2262A128M880J0391L548o476q702j38P873N691j919o908k258L778M280p34m711
2277I723j382L741K224k182m557q48M642M124k689p585l743N389P421L93q196
2292F475q518J470R194N514n282j0772l461O309Q247j03q411p361J896O622K835
2307D654m419n686j510M270J920k628l777l09L350Q08l866m346J188N403K315
2322b633m646p516j440P102O585j770r309o179M480J0159K978p514q569q34Q121
$$ plain form
2218 -6796 -16136 -19830 -12346 -2161 -1071 -9804 -17632 -15065 -4504 1868 -2040 -10949 -13761 -7120
2232 -7120 1275 2069 -3913 -8131 -5337 950 3113 5 -2952 -682 3818 4659 869 -636 3261
2247 3261 9139 9409 3631 -1048 3208 11795 15489 9587 1373 903 9807 18585 16657 6825 1128
2262 1128 6008 16399 19947 13471 4769 4631 12504 18195 16276 9368 7110 10888 15168 14434 9723
2277 9723 8341 12082 14306 12124 7567 6719 11361 15485 12796 5211 1468 6857 14278 14671 6475
2292 6475 -2043 -573 8621 14135 8853 -1919 -5380 929 9176 9073 662 -6699 -4803 1819 4654
2307 4654 235 -5451 -6961 -2691 -771 -3399 -7176 -7485 -4135 -3327 -7193 -11539 -10351 -4948 -2633
2322 -2633 -7279 -14795 -16235 -9133 -2548 -4318 -13627 -19806 -15326 -5167 -2189 -9703 -18272 -19106 -10985
2337a0985P227k123q311m203M701O480J512m612m079J640M459J396k610k160K391
2352i277M373k18m152k279L572O488J709n637o105K156R005N289l515q588k940
2367a0119P524R102J175p856o491K416Q932N459l364p280j461N975N733l82m224
2382E139k241L057L713J56l286m30L912K897j586m771j168N209N499o71p432m742
2398C255L921Q684L043o003q724j020Q307P166k199q894n000M051P706J977n515
2413A0755p078N24N088L045k561m511j205K895K101k593l486j63L762P67l756
2428C584n548L83N419L518l761p826l394N070P186J67p848p987J580Q258M918
2443C719m959q769l194N290O511j18o815m382J549N106J052l292m019Q87L158
$$ plain form
2337 -10985 -3758 -5881 -14192 -18395 -13694 -7214 -5702 -10314 -14393 -12753 -8294 -6898 -9508 -11668 -9277
2352 -9277 -4904 -5122 -9274 -11553 -7981 -1493 216 -5421 -11526 -9370 -365 4924 1409 -7179 -10119
2367 -10119 -2595 6507 7682 -174 -6665 -4249 4683 10142 6778 -502 -1963 4012 9745 9363 5139
2382 5139 2898 5955 9668 9824 6538 6108 10020 12917 11331 6560 5392 10601 16100 15429 7997 3255
2398 3255 7176 15860 18903 12900 4176 3156 11463 18629 16430 7536 2536 6587 14293 16270 10755
2413 10755 3677 4201 9289 12334 9773 5262 4057 6952 9053 6460 2974 2811 6573 7340 3584
2428 3584 -1964 -1581 3838 7356 3595 -4231 -7625 -2555 4631 4798 -3050 -11037 -9457 -1199 3719
2443 3719 -1240 -10009 -13203 -7913 -1402 -1520 -8335 -12717 -11168 -6062 -5010 -8302 -12321 -11434 -8276
2458h276Q57l019k561K007M029j24m592m391K637O829K570m982p547l18P635O975
2474b271j882q102n293N000R046K992n896o865k41P364N807j763n491k375L719
2489f251M896O55k889j788K274L600l55k830l52L794L935r95m644k445N175O396
2505H176J364o170n870K182Q871N085l423q496k842O981P762L47o321n671K153
2520D128P009L572l198n161k82L719L198j378k888p61K770K163k416l522Q41L905
2536A1699K908m712n123m60M961N501j790p533n076M007P351K296n942q298p04
2551i15O904N712j863q237m438K976O239R63n282m397K21L524J311l240k559L70
2567b711K251J53l877k970J934M169P75n308n590J100N860M069l880p920l030
$$ plain form
2458 -8276 -7419 -10438 -12999 -10992 -6963 -7087 -11679 -16070 -13433 -6604 -4034 -9016 -16563 -16881 -9246 -2271
2474 -2271 -4153 -12255 -17548 -12548 -3502 -510 -6406 -13271 -13512 -6148 -341 -2104 -7595 -9970 -6251
2489 -6251 -1355 -700 -3589 -5377 -3103 497 142 -2688 -3040 754 4689 3694 -950 -3395 1780 8176
2505 8176 9540 3370 -2500 -318 8553 13638 10215 1719 -1123 5858 13620 13967 7646 1975 4128
2520 4128 11137 14709 11511 6350 6068 9787 12985 11607 8719 7958 10728 12891 10475 6953 7794 11699
2536 11699 14607 9895 4772 4312 9273 14774 12984 5451 375 4382 11733 14029 8087 -211 -915
2551 -915 5989 11701 9838 1601 -2837 139 6378 7341 2059 -2338 -2117 1407 2718 -522 -3081 -2711
2567 -2711 -460 -307 -4184 -7154 -5220 -1051 -276 -5584 -11174 -10074 -4214 -145 -4025 -11945 -14975
2582a4975N920P116mp197o681J535P395M321l823o912j763M092N557m32m884k426
2598a3161K110L298N66k595j446K073K832n26l388j398L754M647o20n183l289
2613a2326L168P934K483n066o394p7P362O673j304p312l976M049P491L049m553
2628A201n205L42N620L927q51m074q85L246K962o55k583L87L246K029j783l373
2644C551L8N052L829k182n712k351N061P029K54o673n686K375P356M278l706p319
2660E194k172M900O414p9n599m655J499N062J915k969m176rK757J307k511k335
2676D543O92K591N72l644m115J973M422J660m370o255j081N521N296k004p623
2691a822m846L242P015J947n646o672j008N540M406k113n618l340K328M137K31
$$ plain form
2582 -14975 -9055 -1939 -1943 -9140 -15821 -14286 -6891 -2570 -6393 -13305 -15068 -10976 -5419 -5851 -10735 -13161
2598 -13161 -11051 -7753 -7187 -9782 -11228 -9155 -6323 -6849 -10237 -11635 -7881 -3234 -3854 -9037 -12326
2613 -12326 -9158 -1224 1259 -3807 -10201 -10278 -2916 3757 2453 -4859 -8835 -4786 2705 5754 1201
2628 1201 -4004 -3662 1958 5885 5034 960 75 3321 6283 5628 3045 3432 6678 8707 6924 3551
2644 3551 3589 8641 12470 10288 4576 2225 7286 14315 14569 7896 2210 4585 11941 16219 12513 5194
2660 5194 3022 7922 14336 14257 8658 4003 5502 10564 12479 9510 5334 5325 8082 9389 6878 4543
2676 4543 5235 7826 8398 4754 639 2612 7034 8694 4324 -1931 -3012 2509 7805 5801 -1822
2691 -1822 -6668 -3426 3589 5536 -110 -6782 -7790 -2250 2156 43 -5575 -8915 -6587 -2450 -2219
2706b219l407l011J235K137j68k798j618J954K620r37m137k142K935M983N16n039
2722i096n528J233O773M178l294p152k419N525O782R3o148m689J896O304L305
2737b237k847m567o28L728L349m85k864q22K553K319n39k390J94L407K824j742
2753g47m119lM520N168j005n279l537L430P626K422m569o071J14O377N880j287
2769H920o097l147L470N851J748l364m090P51M079K141j436k401N8K493J509k457
2785H028j945J160L505J149l709l711Q56M816L531k878o162k691M724O207J50
2800A3030o219n818J842N737L437l165o462k129L843M300k74m838l146J116L092
2815D346M43k805k220P85J642m70k955k131K304K664p10m526l166J736M802J937
$$ plain form
2706 -2219 -5626 -8637 -7402 -5265 -5433 -8231 -9849 -7895 -5275 -6212 -10349 -12491 -9556 -4573 -4057 -9096
2722 -9096 -14624 -13391 -6618 -2440 -5734 -12886 -15305 -9780 -2998 -2905 -9053 -13742 -11846 -5542 -2237
2737 -2237 -5084 -9651 -10279 -6551 -3202 -3687 -6551 -7373 -4820 -2501 -3040 -5430 -5236 -1829 995 -747
2753 -747 -4866 -4869 -349 4819 3814 -1465 -5002 -1572 6054 8476 3907 -2164 -2050 4327 10207 8920
2769 8920 2823 -324 3146 8997 10745 7381 3291 4042 8121 10262 8826 6425 6483 8976 10485 8028
2785 8028 6083 7243 10748 11897 8188 4477 5333 10149 13680 10802 4640 1949 6673 12880 13030
2800 13030 6811 993 2835 8572 12009 8844 2382 253 4096 8396 8122 3284 138 1254 4346
2815 4346 4789 1984 -236 549 2191 1721 -1234 -3365 -1061 1603 893 -3633 -6799 -5063 -261 1676
2831A676m823n839r30N840M317j736o625m145L001O212K235n343n108k40M439
2846g069L390j749m171j711K687K656r53k485l18J784J591j114k842jL452L100
2862c753j513m653j711L701N451P84n105m854K184O376M160k953o046j600M566
2877d966N992M54m585l379J560N155K428j780l159N2K920K068j067j572O08K907
2893C636J061k072k027J451M393J779k542m555J98N316M335j247n649l197L636
2908D516O241K024m286n435l01N234M648j694m879k848K800M292R05l316k868
2923E033Q88K369Q75k137j587R43K454o36l239j874J759M013l3m188m285P72M838
2940E965L061l383n930k234L983N061m32n258m931Q50N218K779l346n170j391
$$ plain form
2831 1676 -3147 -8986 -9916 -4076 241 -1495 -8120 -12265 -9264 -3052 -817 -6160 -11268 -11508 -7069
2846 -7069 -3679 -5428 -9599 -11310 -8623 -5967 -6920 -9405 -9723 -7939 -6348 -7462 -10304 -10305 -6853 -3753
2862 -3753 -5266 -9919 -11630 -7929 -2478 -1694 -6799 -11653 -9469 -3093 1067 -1886 -7932 -9532 -4966
2877 -4966 1026 1480 -3105 -6484 -4924 231 2659 879 -2280 -2228 692 2760 1693 121 729 3636
2893 3636 4697 2625 598 2049 6442 8221 5679 1124 1322 6638 10973 9726 4077 880 4516
2908 4516 10757 12781 8495 3060 2759 7993 12641 10947 6068 3220 6020 10312 11217 7901 5033
2923 5033 5921 8290 9165 7028 5441 6384 8838 8202 4963 3089 4848 8861 8828 4640 355 1127 5965
2940 5965 9026 5643 -287 -2521 1462 6523 6091 833 -4098 -3248 1970 4749 1403 -3767 -5158
2955e158L039K575p17l238j706J001K040j109k296q39K002J190j681l108j089
2970i094L138L224q42n059l256K660N190J902m411n577m26N491M896k022n376
2985i562k804K355N611J498l542l760L58L606K024r84k647P5K137J828j189j709
3001f705J025K652J202j859k648O99M178L481k023m883q79L849N442O95n416l266
3017d456J613O123L571k820m700j356L882M655J37l096k892J675L761J307j774
3032E630k167J135K071O85j648j552K111K803j12k983k492J979M381J413l268
3047G986m198m68M428M089r82n930l078K513N513J779m271m734p50M156L413j588
3063G878m364j535J736K369l03k592j013O08J617j118k323q21J988J606j437l853
$$ plain form
2955 -5158 -2119 456 -261 -3499 -5205 -4204 -2164 -3273 -5569 -6408 -4406 -3216 -4897 -8005 -9094
2970 -9094 -5956 -2732 -3574 -8633 -11889 -9229 -4039 -2137 -6548 -12125 -12551 -7060 -2164 -4186 -9562
2985 -9562 -12366 -10011 -4400 -2902 -6444 -10204 -9846 -6240 -4216 -5200 -7847 -7772 -5635 -3807 -4996 -6705
3001 -6705 -5680 -3028 -1826 -3685 -6333 -5634 -1456 2025 2 -4881 -5760 -1911 3531 4226 -1190 -4456
3017 -4456 -2843 3280 6851 4031 -669 -2025 1857 6512 6649 3553 661 2336 6097 7404 5630
3032 5630 3463 4598 6669 7354 5706 4154 6265 9068 8956 5973 3481 5460 9841 11254 7986
3047 7986 3788 3320 7748 11837 10855 4925 1847 4360 9873 11652 7381 2647 1897 6053 9466 7878
3063 7878 3514 1979 3715 6084 5781 3189 2176 2784 4401 3283 960 139 2127 3733 2296 -1557
3079a557j932K539L790K47m653m384J047M925K513k918o189j723L692M771m03
3094b35m670m122J351L771J846k384l566k42K008J714o36k502k59J894Q59j826
3110f999j773N06K687J335j836l617j87L635M023j208n109k400K827N227J810
3125a079l784m796L03M745M001p53m394j844K268M198J355k448k434J089K866
3140g07J157j090j693J123K133P14j889q96J671L291O92k749k721J435M664K360
3156G495k125m258j230L770M928N49m210l839J234M947K912k387l736j408L306
3171E948L456n14k737j429J277K006P9j606j157J368J674j240k429n45K143K673
3187H967j004l735k480K022M001J058l633m657m46M243L782j803n151l062K185
$$ plain form
3079 -1557 -3489 -950 2840 3087 -1566 -5950 -4903 22 2535 -383 -6572 -8295 -4603 168 -235
3094 -235 -4905 -9027 -7676 -3905 -2059 -4443 -8009 -8251 -6243 -4529 -5165 -7667 -7926 -6032 -5173 -6999
3110 -6999 -8772 -8266 -5579 -4244 -6080 -9697 -9884 -6249 -2226 -3434 -8543 -10943 -8116 -2889 -1079
3125 -1079 -4863 -9659 -9356 -4611 -610 -1363 -5757 -7601 -5333 -1135 220 -2228 -4662 -3573 -707
3140 -707 450 -640 -2333 -1210 923 1637 -252 -1148 523 3814 4506 1757 -964 471 5135 7495
3156 7495 5370 1112 -118 3652 8580 9129 4919 1080 2314 7261 10173 7786 4050 2642 5948
3171 5948 9404 8890 6153 4724 6001 8007 8086 6480 5323 6691 8365 7125 4696 4151 6294 8967
3187 8967 7963 4228 1748 3770 7771 8829 5196 539 93 4336 8118 6315 1164 -1898 287
3202B87M366R91l294m352k06L140K173j701k834r86J134J108r89j788l70J269
3218b052P74j824k437O2K640J626j628m375j485K950M320j30m658m050J138M910
3234d219K753k915m691j401L149M131l26l353k716J237L522J044j653k022q6K153
3250e393R74j071j098Q46J976P55k150j527J334L449J366k595l251L09M128L366
3266A418r27m100k268K847M507J934l222l864M35M100L264o08l261j402K143K882
3282C878N96j698j121J257J376L82j069m99J816J620n18k463r33K272L193M86
3298H575l275l119J296M188K602k587m428j148L187M441n9m571k683J080L607
3313G106K182k296l582l34K185J396p20k014o12J109J174j465k035M5J844N90
$$ plain form
3202 287 4653 5644 2350 -2002 -2208 932 3105 1404 -1430 -2416 -1282 -174 -1163 -2951 -3321 -2052
3218 -2052 -1278 -3102 -5539 -5477 -2837 -1211 -2839 -7214 -8699 -5749 -1429 -1559 -6217 -10267 -9129 -4219
3234 -4219 -1466 -4381 -9072 -10473 -7324 -3193 -3519 -6872 -9588 -8351 -4829 -3785 -5438 -7460 -7546 -5393
3250 -5393 -4419 -5490 -6588 -5742 -3766 -3011 -5161 -6688 -5354 -1905 -539 -3134 -6385 -6076 -1948 1418
3266 1418 491 -3609 -5877 -3030 1477 3411 189 -3675 -3240 860 4124 3516 255 -1147 996 3878
3282 3878 4474 2776 1655 2912 4288 4670 3601 3102 4918 6538 6020 3557 2624 4896 8089 8575
3298 8575 5300 2181 3477 7665 10267 7680 3252 2104 5291 9732 9673 5102 2419 3499 7106
3313 7106 9288 6992 3410 3076 5261 6657 5937 3923 3311 4420 5594 4129 2094 2139 3983 4573
3329D573j471l113l03K554K375j484m066k103J549M178R30l742m407k20L818L184
3345B252j285m766k367J824L053P82k383l159l0K223J018j016j647o78J728M74
3361c977j680j539J047K082J14k085k443O60L403J690j842l552j368L193L653
3376b644K83l873k924R94M769K256k241l652r36L139L195l23k033j535J283K343
3392a899L23j120l09P71J558K83j739k94K097K286m68k217j681K182L409J412
3408D594k904l012O86L544L547j221l671k039K321M226J171k597k854K7L014K605
3424G437j069k259p87J418K067o61j437J9Q14J259o96j733K5K137J281j258k778
3441C779j250K037L672m75l432l395J368L512K238k418m113j516K788L381k04
$$ plain form
3329 4573 3102 -11 -314 2240 4615 3131 -935 -3038 -1489 2689 3619 -123 -4530 -4750 -932 2252
3345 2252 967 -3799 -6166 -4342 -1289 -507 -2890 -6049 -6079 -3856 -2838 -3854 -5501 -6179 -4451 -3977
3361 -3977 -5657 -7196 -6149 -4067 -3953 -6038 -8481 -7821 -4418 -2728 -4570 -8122 -9490 -6297 -2644
3376 -2644 -2361 -6234 -9158 -8164 -3395 -1139 -3380 -7032 -7968 -4829 -1634 -1957 -3990 -5525 -4242 -1899
3392 -1899 -1576 -2696 -3005 -2234 -676 -393 -2132 -2426 -329 1957 1489 -728 -2409 -227 3182 4594
3408 4594 1690 -1322 -636 2908 6455 5234 1563 -476 1845 6071 7242 4645 1791 1818 4832 7437
3424 7437 6368 4109 3322 4740 6807 6146 4709 4728 5542 6801 6105 4372 4397 6534 7815 6557 3779
3441 3779 2529 4566 8238 7763 4331 936 2304 5816 8054 5636 1523 7 2795 6176 5972
3456E972l478k797Q23K634J126j969k567n5J458N73j229j210O4J118J20j856k089
3473c362O72K452M20k183l032j53K779K294j152l818k179J739L617J081l378l144
3489g347m68L381K476q56l613j583J870K592J19j585j742M59J743p0q19p06M32
3506e717J908k74j794r92K022K138M91k643j990Q81L863J880j818l651n52L218
3522c030L569K11l239k217P92L979K094j571k564m00K277K314o0j694o50J388
3538A199J460k7j300K57J664Q07n38j642l38K487K108m60k857j645K135L630Q13
3555G753k726l232L23L338K932j130l376j951J995L178P69k192k569K92K399J115
3571F918j364j693j03Q39Q12j222j484Q40J264L25j993j898J52K293J572j681
$$ plain form
3456 5972 2494 -303 520 3154 4280 2311 -256 -311 1147 1720 491 -719 -655 463 583 -1273 -3362
3473 -3362 -2690 -238 182 -2001 -5033 -5186 -2407 -113 -1265 -5083 -7262 -5523 -1906 -825 -4203 -7347
3489 -7347 -7815 -4434 -1958 -2814 -6427 -8010 -6140 -3548 -3429 -5014 -6756 -6297 -4554 -4624 -5443 -6149 -5717
3506 -5717 -3809 -4083 -5877 -6869 -4847 -2709 -2218 -4861 -6851 -5970 -2107 -227 -2045 -5696 -6248 -3030
3522 -3030 539 750 -2489 -4706 -3914 65 2159 588 -1976 -2376 -99 2215 2155 461 -189 1199
3538 1199 2659 2632 1332 1589 3253 4060 3522 1880 1542 4029 6137 5677 2820 1175 3310 6940 7753
3555 7753 5027 1795 2118 5456 8388 7258 3882 1931 3926 7104 7873 5681 3112 3404 5803 6918
3571 6918 5554 3861 3758 4597 5409 4187 2703 3543 4807 5132 3139 1241 1393 3686 5258 3577
3587C577l525r99K330K773n99l324k981J170K914J727k033l452j055K130K502
3602A155o10k486j867O59J683M04j556j732N50Q39L8j369o38P97J520k67k557
3619e437j272J237K726L81k333k681M0L244K311j184l328j874J939L577Q35k494
3635d313k657J81K574K296j213j845n91J249J725O4j117m92J080J200n15j049
3651c423Q3J729J523n10j702j097K223K789O7k559k062J291M000J783j960l166
3667i91l81K703L038K26k532k049J203K833J093j087j863r7J771J274n07j172
3683C462k4J132R88j044j188N97J757R15j868j986L6K564K163j160k815j923J703
3700C309L271J148l313k788m0K879J979o90l209j654J536J986L04k111j643K63
$$ plain form
3587 3577 52 -947 1383 4156 3557 233 -2748 -1578 1336 3063 1030 -2422 -3477 -1347 1155
3602 1155 545 -1941 -3808 -3149 -1466 -1062 -2618 -4350 -3800 -2961 -2923 -4292 -4930 -4133 -2613 -2880 -5437
3619 -5437 -6709 -5472 -2746 -2365 -4698 -7379 -7339 -4095 -1784 -2968 -6296 -8170 -6231 -2654 -1819 -4313
3635 -4313 -6970 -6789 -4215 -1919 -3132 -4977 -5568 -4319 -2594 -2530 -3647 -4139 -3059 -1859 -2374 -3423
3651 -3423 -3340 -1611 -88 -598 -2300 -3397 -1174 1615 1682 -877 -2939 -1648 2352 4135 2175 -991
3667 -991 -1372 1331 4369 4595 2063 14 1217 4050 5143 4056 2193 2096 3867 5141 4634 3462
3683 3462 3438 4570 5558 4514 3326 3923 5680 6595 4727 2741 2777 5341 7504 6344 3529 1606 3309
3700 3309 6580 7728 4415 1627 1587 4466 6445 5755 2546 892 2428 4414 4718 2607 964 1227
3716A227J163N24j455o81P9P23j99j751q09J123J268Lk256k103N48K739Q56j711
3734g12l183j050K333K765l39l143k774J115K823J153j795k640r30K071J896j039
3750c449j428o21O08J162K38j634l82J087Q34n35j546k47J667J650k55k410j306
3767f567J690K687J041k087k949O4L599K364j235k538j730K064L216P21j976j984
3783c620N21K289J391m74j557l6J300J174m31o10K65J068P50p97j278M91K290
3800B736J503j305k198m38K442K300M98k704k065R72L139J558j552k599o31K255
3816C911K593j67k457j494P95J863O52p89j292o3R16N30q97r15N36J152k43j483
3834C148j204J112J599O43k297k329M52K427J289j096k726j992J458L021M39k313
$$ plain form
3716 1227 2390 2914 1459 778 857 1580 1381 -370 -1179 -56 1212 1215 -1041 -3144 -2596 143 999 -712
3734 -712 -3895 -4945 -2612 153 -186 -3329 -6103 -4988 -2165 -1012 -2807 -5447 -6377 -4306 -2410 -3449
3750 -3449 -4877 -5498 -4890 -3728 -3490 -5124 -5506 -4419 -3585 -4120 -5666 -5913 -4246 -2596 -2851 -5261 -6567
3767 -6567 -4877 -2190 -1149 -3236 -6185 -6121 -2522 -158 -1393 -3931 -5661 -3597 -381 340 -1636 -3620
3783 -3620 -3099 -810 581 107 -1450 -1486 -186 988 557 -53 212 1280 2030 1233 -45 446 2736
3800 2736 4239 2934 736 298 2740 5040 5538 2834 769 1741 4880 6438 4886 2287 1656 3911
3816 3911 6504 6337 3880 2386 3181 5044 5696 4907 3615 3552 4468 4998 4101 3186 3722 4874 4631 3148
3834 3148 1944 3056 4655 5298 3001 672 1124 3551 4840 3744 1018 -974 484 3505 3944 1631
3850A631l025k05K481J487j092k500j015Q23J837n12j346r85N06O92m34r87m48
3867c092R10Q53j076j512q46J411J760q1k318k294R13K462J728j742l024m52K167
3884d233K354m16k518j743N05K841J274j357j950K5J357J258m59p76o67J034P77
3901b694l02p70j6J488J187j230j231M06J609J926n49k195j141J645L126M35j916
3918b22k146L75K541K163o83j923j417J838J909Q01j437j301L13J901P19o18q95
3935A918O03O63M18o70n93P81J625K11j557j451N04K458J359j692k114p86K186
3952C863K510J32k908k252Q39K729J511j634k652n31J591J649l20k059n11L70
3968B327J079k04n78j250N00O93m19j196o69J340P70n59j806j639J250J891M32
$$ plain form
3850 1631 -1394 -1599 882 2369 1277 -1223 -2238 -1415 422 -90 -1436 -2421 -1915 -1223 -1657 -2644 -3092
3867 -3092 -2182 -1329 -2405 -3917 -4763 -3352 -1592 -1673 -3991 -6285 -5372 -2910 -1182 -2924 -5948 -6400 -4233
3884 -4233 -1879 -2295 -4813 -6556 -6051 -3210 -1936 -3293 -5243 -5218 -3861 -2603 -3062 -3838 -4505 -3471 -2694
3901 -2694 -2996 -3766 -3782 -2294 -1107 -2337 -3568 -3162 -1553 373 -176 -2371 -3512 -1867 1259 1694 -222
3918 -222 -2368 -1993 548 2711 2028 105 -1312 526 2435 3236 1799 498 811 2712 3431 2813 1918
3935 1918 2521 3184 3602 2932 2339 3120 4745 4956 3399 1948 2452 4910 6269 4577 2463 1677 3863
3952 3863 6373 6505 3597 1345 2184 4913 6424 4790 2138 1607 3198 4847 4527 2468 1957 2327
3968 2327 3406 3202 2624 1374 1874 2567 2148 952 283 1623 2393 1834 28 -1611 -361 1530 1962
3985A962j882k858q4K363K144j422k887j367J403K261L91j966k021R4J735Q22
4001a312p38j924k44N74J044l28p95j28N29L06n05j054J22J538L14p95j649o01
4019e646J745K065k56k377j406Q29K561J501j450k325m03K077K213j6k178r11
4035c977O36J942R89j008j123J41J251N50Jp49M31R92L74o80q71O70J811J113
4053B493j460j727N39K063J678p33k073r54J593K451R50k038j727MK299J889q37
4070D410j899j090J511J490R4j225n75L01J129K16r36l60O53Q22l63j711r5Q81
4088C253J672j40j649j894P82K176N81j073k816l80J711J876k5k551j775P13J726
4105B187J220j716j877m53J193R49n10j309o46K53O86k76p15n95R95K52o46j808
$$ plain form
3985 1962 80 -2778 -2862 -499 1645 223 -2664 -4031 -2628 -367 24 -1942 -3963 -3869 -2134 -1312
4001 -1312 -2050 -3974 -4218 -3644 -2600 -2928 -3723 -3851 -3322 -3016 -3521 -4575 -4453 -2915 -2601 -3396 -5045 -5646
4019 -5646 -3901 -1836 -2092 -4469 -5875 -5046 -2485 -984 -2434 -4759 -5162 -3085 -872 -888 -3066 -3977
4035 -3977 -3341 -1399 -410 -1418 -2541 -2400 -1149 -599 -598 -1347 -916 76 450 -230 -1101 -431 1380 2493
4053 2493 1033 -694 -155 1908 3586 2853 780 -174 1419 3870 4820 2782 1055 1059 3358 5247 4410
4070 4410 2511 1421 2932 4422 4516 3291 2716 3017 4146 4362 3426 3066 3719 4541 4178 2467 2372 3253
4088 3253 4925 4785 3136 1242 2024 4200 4781 3708 892 512 2223 4099 4074 1523 -252 461 2187
4105 2187 3407 1691 -186 -639 554 1503 993 -316 -962 -709 -23 -299 -1014 -1609 -614 -362 -1008 -2816
$$ [...]
8191A10
##END NTUPLES=NMR FID
##END=
