##TITLE=1H_Pr EClF
 200.13MHz,CDCl3,
 8 sc
 
 22.4.2025
##JCAMPDX= 6.0         $$ Bruker NMR JCAMP-DX V2.0
##DATA TYPE= NMR FID
##DATA CLASS= NTUPLES
##ORIGIN= UXNMR, Bruker Analytische Messtechnik GmbH
##OWNER= pz
$$ XWIN-NMR		Version 3.5
$$ Tue Apr 22 16:01:14 2025 Russian Standard Time (UT+4h)  she@DPX200
##.OBSERVE FREQUENCY= 200.1313
##.OBSERVE NUCLEUS= ^1H
##.DELAY= (6, 6)
##.ACQUISITION MODE= SIMULTANEOUS
##.ACQUISITION SCHEME= undefined
##.AVERAGES= 8
##.DIGITISER RES= 18
##SPECTROMETER/DATA SYSTEM= spect
##.PULSE SEQUENCE= zg30
##.SOLVENT NAME= CDCl3
##.SHIFT REFERENCE= (INTERNAL, CDCl3, 0, 14.3821)
##AUDIT TRAIL= $$ (NUMBER, WHEN, WHO, WHERE, WHAT)
$$ ##TITLE= Audit trail, XWIN-NMR		Version 3.5
$$ ##JCAMPDX= 5.01
$$ ##ORIGIN= Bruker BioSpin GmbH
$$ ##OWNER= she
$$ F:/spectra/data/she/nmr/H-C/1/audita.txt
$$ ##AUDIT TRAIL=  $$ (NUMBER, WHEN, WHO, WHERE, WHAT)
(   1,<2025-04-22 16:00:03.29 +0400>,<she>,<DPX200>,
      <created by zg, POWCHK disabled, PULCHK disabled
       configuration hash MD5:
       00 E9 B6 7A A2 85 ED C7 34 08 36 98 17 FE 4E 26
       data hash MD5: 16K
       20 7A 15 BF B4 6A C5 85 87 88 B7 A3 07 E3 BC 62>)
$$ ##END=
$$ 
$$ hash MD5
$$ 2E C8 74 D6 63 B3 61 B1 02 B8 ED 3C 1C 41 8D 74
##$RELAX= 
##$RELAX= 
##$RELAX= 
##$RELAX= 
##$RELAX= 
##$RELAX= 
$$ Bruker specific parameters
$$ --------------------------
##$DU= <F:/spectra>
##$EXPNO= 1
##$NAME= <H-C>
##$PROCNO= 1
##$TYPE= <nmr>
##$USER= <she>
##$AMP= (0..31)
100 100 100 100 100 100 100 100 100 100 100 100 100 100 100 100 100 100 
100 100 100 100 100 100 100 100 100 100 100 100 100 100 
##$AQSEQ= 0
##$AQ_mod= 1
##$AUNM= <au_zg>
##$AUTOPOS= <>
##$BF1= 200.13
##$BF2= 200.13
##$BF3= 200.13
##$BF4= 200.13
##$BF5= 200.13
##$BF6= 200.13
##$BF7= 200.13
##$BF8= 200.13
##$BYTORDA= 1
##$CFDGTYP= 0
##$CFRGTYP= 5
##$CHEMSTR= <none>
##$CNST= (0..31)
1 1 145 1 1 1 1 1 1 1 1 1 1 1 1 1 1 1 1 1 1 1 1 1 1 1 1 1 1 1 1 1 
##$CPDPRG= <>
##$CPDPRG1= <>
##$CPDPRG2= <>
##$CPDPRG3= <>
##$CPDPRG4= <mlev>
##$CPDPRG5= <mlev>
##$CPDPRG6= <mlev>
##$CPDPRG7= <mlev>
##$CPDPRG8= <mlev>
##$CPDPRGB= <>
##$CPDPRGT= <>
##$D= (0..31)
0 0.7 0 0 0 0 0 0 0 0 0 0.03 0 0 0 0 0 0 0 0 0 0 0 0 0 0 0 0 0 0 0 0 
##$DATE= 1745323202
##$DBL= (0..7)
120 120 120 120 120 120 120 120 
##$DBP= (0..7)
150 150 150 150 150 150 150 150 
##$DBP07= 0
##$DBPNAM0= <>
##$DBPNAM1= <>
##$DBPNAM2= <>
##$DBPNAM3= <>
##$DBPNAM4= <>
##$DBPNAM5= <>
##$DBPNAM6= <>
##$DBPNAM7= <>
##$DBPOAL= (0..7)
0.5 0.5 0.5 0.5 0.5 0.5 0.5 0.5 
##$DBPOFFS= (0..7)
0 0 0 0 0 0 0 0 
##$DE= 6
##$DECBNUC= <off>
##$DECIM= 32
##$DECNUC= <off>
##$DECSTAT= 4
##$DIGMOD= 1
##$DIGTYP= 9
##$DL= (0..7)
0 120 120 120 120 120 120 120 
##$DP= (0..7)
150 150 150 150 150 150 150 150 
##$DP07= 0
##$DPNAME0= <>
##$DPNAME1= <>
##$DPNAME2= <>
##$DPNAME3= <>
##$DPNAME4= <>
##$DPNAME5= <>
##$DPNAME6= <>
##$DPNAME7= <>
##$DPOAL= (0..7)
0.5 0.5 0.5 0.5 0.5 0.5 0.5 0.5 
##$DPOFFS= (0..7)
0 0 0 0 0 0 0 0 
##$DQDMODE= 0
##$DR= 18
##$DS= 0
##$DSLIST= <SSSSSSSSSSSSSSS>
$$ [...]
##$SUBNAM0= <"">
##$SUBNAM1= <"">
##$SUBNAM2= <"">
##$SUBNAM3= <"">
##$SUBNAM4= <"">
##$SUBNAM5= <"">
##$SUBNAM6= <"">
##$SUBNAM7= <"">
##$SUBNAM8= <"">
##$SUBNAM9= <"">
##$SW= 18.0517328524113
##$SWIBOX= (0..15)
0 0 2 0 0 0 0 0 0 0 0 0 0 0 0 0 
##$SW_h= 3612.71676300578
##$TD= 16384
##$TD0= 1
##$TE= 0
##$TE2= 300
##$TE3= 300
##$TEG= 300
##$TL= (0..7)
0 120 120 120 120 120 120 120 
##$TP= (0..7)
150 150 150 150 150 150 150 150 
##$TP07= 0
##$TPNAME0= <>
##$TPNAME1= <>
##$TPNAME2= <>
##$TPNAME3= <>
##$TPNAME4= <>
##$TPNAME5= <>
##$TPNAME6= <>
##$TPNAME7= <>
##$TPOAL= (0..7)
0.5 0.5 0.5 0.5 0.5 0.5 0.5 0.5 
##$TPOFFS= (0..7)
0 0 0 0 0 0 0 0 
##$TUNHIN= 0
##$TUNHOUT= 0
##$TUNXOUT= 0
##$USERA1= <user>
##$USERA2= <user>
##$USERA3= <user>
##$USERA4= <user>
##$USERA5= <user>
##$V9= 5
##$VALIST= <valist>
##$VCLIST= <CCCCCCCCCCCCCCC>
##$VD= 0
##$VDLIST= <DDDDDDDDDDDDDDD>
##$VPLIST= <PPPPPPPPPPPPPPP>
##$VTLIST= <TTTTTTTTTTTTTTT>
##$WBST= 1024
##$WBSW= 4
##$XGAIN= (0..3)
0 0 0 0 
##$XL= 0
##$YL= 0
##$YMAX_a= 538736
##$YMIN_a= -492496
##$ZGOPTNS= <>
##$ZL1= 120
##$ZL2= 120
##$ZL3= 120
##$ZL4= 120
##$ABSF1= 10
##$ABSF2= 0
##$ABSG= 5
##$ABSL= 3
##$ALPHA= 0
##$AQORDER= 0
##$ASSFAC= 0
##$ASSFACI= 0
##$ASSFACX= 0
##$ASSWID= 0
##$AUNMP= <proc_1d>
##$AZFE= 0.1
##$AZFW= 0.1
##$BCFW= 1
##$BC_mod= 2
##$BYTORDP= 1
##$COROFFS= 0
##$CY= -3
##$DATMOD= 1
##$DC= 2
##$DFILT= <>
##$DTYPP= 0
##$F1P= 0
##$F2P= 0
##$FCOR= 0.5
##$FTSIZE= 0
##$FT_mod= 4
##$GAMMA= 1
##$GB= 0.15
##$INTBC= 1
##$INTSCL= 1
##$ISEN= 128
##$LB= 0.25
##$LEV0= 0
##$LPBIN= 0
##$MAXI= 10000
##$MC2= 0
##$MEAN= 0
##$ME_mod= 0
##$MI= 1.114404
##$NCOEF= 0
##$NC_proc= 0
##$NLEV= 6
##$NOISF1= 3.799351
##$NOISF2= 2.8
##$NSP= 1
##$NTH_PI= 0
##$NZP= 0
##$OFFSET= 14.38212
##$PC= 1
##$PHC0= -831.05
##$PHC1= 9.7922
##$PH_mod= 1
##$PKNL= yes
##$PPARMOD= 0
##$PSCAL= 0
##$PSIGN= 0
##$REVERSE= no
##$SF= 200.129724274929
##$SI= 16384
##$SIGF1= 3
##$SIGF2= 2
##$SINO= 400
##$SIOLD= 16384
##$SREGLST= <1H.CDCl3>
##$SSB= 0
##$STSI= 0
##$STSR= 0
##$SW_p= 3205.1282051282
##$SYMM= 0
##$S_DEV= 0
##$TDeff= 0
##$TDoff= 0
##$TI= <>
##$TILT= no
##$TM1= 0
##$TM2= 0
##$TOPLEV= 0
##$USERP1= <user>
##$USERP2= <user>
##$USERP3= <user>
##$USERP4= <user>
##$USERP5= <user>
##$WDW= 1
##$XDIM= 8192
##$YMAX_p= 0
##$YMIN_p= 0
$$ End of Bruker specific parameters
$$ ---------------------------------
##NTUPLES= NMR FID
##VAR_NAME=  TIME,          FID/REAL,        FID/IMAG
##SYMBOL=    X,             R,               I
##VAR_TYPE=  INDEPENDENT,   DEPENDENT,       DEPENDENT
##VAR_FORM=  AFFN,          ASDF,            ASDF
##VAR_DIM=   8192,          8192,            8192
##UNITS=     SECONDS,       ARBITRARY UNITS, ARBITRARY UNITS
##FACTOR=    0.0002768,     1,               1
##FIRST=     0,             0,               0
##LAST=      2.2672688,     0,               0
##MIN=       0,             -492496,         0
##MAX=       2.2672688,     538736,          0
$$ Real data points
##PAGE= N=1
##DATA TABLE= (X++(R..R)), XYDATA
0@%%%%%%%%%%%kK%Qj6J6j6J6k4L2l4L9m5N6o6P4q5R8j14J30j46J64j86K10k35
36a24K61k92L27l64M03m45M95n48O03o64P32q08Q90r78J077j187J310j449J602
55H41j778J982k217K496k828L234l746M408n297O557q474J1688j7998L4603j54683
70a31212l61284M54324J34569l71188K76795N36732l47201m54693K86895O0573
80H4310n01303J33167O18596j02990l47296L04540R5978n83194j14112M97818
90H5514j9203k69248L78493K87456m87187k55148L35784q0635l55031L34671M41639
101C97105k81532k19024L03887r8061m94258J39358M35097j58856j43684L97238
111B77270L5309n10320l8001L17969j82425j87589M31050K27005l79186p7487
$$ y = [0, 0, 0, 0, 0, 0, 0, 0, 0, 0, 0, 0, -2, 0, 0, 8, -8, 8, -8, 8, -16, 16, -18, 21, -24, 32, -34, 40, -45, 53, -61, 69, -77, 87, -99, 111, -124, 137, -155, 172, -192, 211, -234, 261, -287, 316, -348, 384, -424, 466, -512, 565, -622, 688, -761, 841, -937, 1045, -1172, 1324, -1504, 1730, -2016, 2392, -2905, 3652, -4822, 6866, -11132, 23471, -131212, -492496, -38172, 96397, -274791, 2004, 538736, 191535, -263158, 23737, 84310, -416993, -283826, 334770, 231780, -115516, 189024, 285002, -298192, -412304, 85514, 66311, -202937, 175556, 463012, -24175, -279323, 56461, -24174, -379205, -44534, 397105, 115573, -103451, 200436, 102375, -391883, -252525, 182572, 23716, -119968, 277270, 312579, -197741, -235742, 82227, -100198, -287787, 143263, 370268, -8918, -86405]
121h6405K68807k30806l38002L14149L01367k46337k4726L35936j53884m26039
131b85940J34307K49015k27146l6453M12471J7060l70389M7397J88307k69977
141a41348j52181L64943J42371k56225N9408K23916k50550k72973K28349J44998
151I0708k08359P4123L04339j28557k85721J19607J00594k39537J836L26752o
162A55779k16192J08507J05314k61633j09344K49438M4539j64777J28629J76157
172B16417k04749j68956J62230K0875j82012J03336K28597j04797j45926J30489
182E5504J6345k16471K0827K12758m3822j10709J44957O0599k05642m9251J54145
193C9240l7592j13725J37437J19492j44719o7778J21763m0793j45291Q9741J37685
$$ y = [-86405, 182402, -48404, -386406, -72257, 229110, -17227, -41953, 293983, 140099, -285940, -151633, 97382, -129764, -166217, 246254, 263314, -107075, -59678, 128629, -141348, -293529, 71414, 213785, -42440, 16968, 240884, -9666, -282639, -54290, 90708, -117651, -43528, 260811, 132254, -153467, -33860, 66734, -172803, -170967, 155785, 155779, -60413, 48094, 153408, -108225, -217569, 31869, 76408, -88369, 40260, 216417, 11668, -157288, 4942, 25817, -156195, -52859, 175738, 70941, -74985, 55504, 71849, -144622, -123795, 88963, 45141, -65568, 79389, 139988, -65654, -114905, 39240, 1648, -112077, 25360, 144852, 133, -67645, 54118, 13325, -131966, -42225, 95460]
204I5460q5365n2656J21811j1628j56426K5203J16215o3734n4703J25239L4515
215I3931j30021p624Q8440o0291p5692R8796O6342q8225j1204Q5316m4960r3077
227g8269N9030O3967o2905j0151Q6174j4389q6123K5488N0260n6469k2857P7455
239C1211R529o4480J6570M2120m8910l4667N4713J8862m4585J3571M5155l3240
251E849l8463L5659J4778l8592R050M2178j7105l1777K2834J2788l5415k618L6183
264A5349p020k5480K0645J4936k8296p907K6118j609k0877J3922J9399j8604j1752
277a1176J9629M75k0069O983J6310j0407j0754J1898M347j4662j151J3420l705
290A138r544Q111O201p913k370P337P87n569R91N888k352m385K726J888l450r58
$$ y = [95460, 10095, -42561, 79250, 67622, -88804, -63601, 52614, -11120, -65823, 59416, 93931, -36090, -43714, 44726, -15565, -91257, 7539, 73881, -14344, -25548, 59768, 14808, -78269, -19239, 44728, -18177, -28328, 57846, 43457, -42666, -17178, 33082, -23387, -46244, 31211, 40740, -23740, -7170, 34950, -13960, -48627, 6086, 24948, -19637, -6066, 39089, 5849, -32614, 3045, 17823, -20769, -11719, 30459, 13354, -18423, 4411, 17199, -18216, -20834, 15349, 8329, -17151, 3494, 18430, -9866, -17773, 8345, 6736, -14141, -219, 19180, 576, -11176, 8453, 8928, -11141, -4158, 12152, 1745, -9009, 2889, 7236, -7426, -8577, 4843, 1138, -8406, -295, 5906, -2007, -4377, 2960, 3747, -1822, -831, 5057, 2705, -1680, 1046, 2934, -516, -1474]
306a474J201O77j499j958J536J640k294l43K669P57j300n35K576Q98l010R87L132
323C660k279j993J781N67j844j784J455J209l016p86L149l09k614P37L059K91
339A283l290J719M565k846m207M931K682o122m68O126j323p914K594O867p363
354b766n099J0696J883j0753K437J0045o993q239J0412O935j1936l1J4627o342
368D876j4911J0407Q455j4908j545J8118l410j7621Q567J1340j8572o438K3998
381H356N85j9674J2189J6500k2707j3146K4612L179k4230J3308K7151k2390k2342
394a8609K5890L205l5134J0188L8683j7151k5490L0290R913m6658k276M5664j2083
407F432l1182L9335K6105n1343j6467M4446j2342m4830L8196M7244m3227k5273
$$ y = [-1474, -273, 404, -1095, -3053, -1517, 123, -2171, -2514, 155, 912, -388, -923, 1653, 2551, -459, 528, 3660, 1381, -612, 1169, 1736, -108, -1892, -437, 772, -2244, -3030, 119, -190, -2804, -2067, 992, 1283, -2007, -288, 4277, 1431, -2776, 2155, 4837, -1285, -1753, 4373, 3050, -4864, -2270, 4597, -2766, -7865, 2831, 4714, -6039, -3602, 6443, -550, -8789, 1623, 8558, -3378, -3409, 11218, 4876, -10035, 372, 8827, -6081, -7626, 10492, 7082, -10539, -1972, 9368, -9204, -15642, 8356, 8941, -10733, 1456, 17956, -4751, -17897, 6715, 9894, -14336, -1028, 26123, 3733, -18609, 7281, 10486, -24648, -14460, 24223, 7072, -18418, 11872, 21785, -24873, -27149, 18515, 6432, -24750, 14585, 40690, -10653, -27120, 17326, 4984, -39846, -1650, 45594, 2367, -22906]
419b2906M8976j0218o5784K4236N8815l2867k6570O1118P291p6781J405N8127
431B4842l3132l7596P1408L5013p1797j0116N6321m0115o3393O1426N6880n7063
443g322q981P2721l2562r0368L7847N8633n6122r808R7345k227r5139J8530N3673
456C6220p3369l7038J06359L0338q2631K2663O6555q3288p7102Q5194M1723p6539
468d0915L1223J03636o0201j00387O0118L4417r7509J4221J31580j8036r2397
479c4250N6922M0018j23201l4989J24184P659q1386P4127P8448j17845p6521R3850
491G016K457r6989P2747J26730p4794q3056Q3052m386j37906L0719J40985l5856
503C0719o5958J03603K5336j57841k7263J16218l4964p2869J25926Q4346j30071
$$ y = [-22906, 26070, 15852, -49932, -25696, 33119, 252, -26318, 34800, 42091, -34690, -33285, 24842, -8290, -45886, 25522, 60535, -11262, -21378, 34943, -5172, -68565, -7139, 49741, -7322, -16303, 56418, 23856, -66512, -28665, 29968, -26154, -35962, 61383, 59156, -35983, -17453, 36220, -37149, -74187, 32172, 62510, -20121, 2542, 69097, -14191, -91293, -6099, 35624, -40915, -9692, 93944, 33743, -66644, -6526, 27891, -69618, -55397, 76183, 58147, -34250, 22672, 62690, -60511, -95500, 28684, 36343, -45043, 29084, 107532, -10313, -86834, 7016, 9473, -87516, -14769, 111961, 37167, -45889, 37163, 32777, -105129, -74410, 66575, 30719, -35239, 68364, 93700, -64141, -91404, 24814, -10150, -83019, 42907, 127253, -2818]
514b818m9703R4427n3983j16746J02814J23943q3487l5271J13273m4284j61857
525a13692M4147J14031p0035k6367J50086J1009j58963J05Q6441r1956o2792J56006
537C8020P1197j17315M801R1949j04944j22306J09534Q6816q9004K3143J37077
548A28968o7362j52740N5117O3652j07812M845J71020J5j29248M1436N7433j38041
560g2717n7771J53144L9778r6915O3549R7072j27443j10382J00949L0247j03468
571h3957O4161J48696p0150j13405P3251J4544j40726J6728J58387j6728q2732
582c1931Q7802L8334j54326m6550J21533p969p5833J05705R3039j19085p1494
593f0775Q3723k7504j08557Q0605J28021o3510n4429Q8688k3013j44472K3395
$$ y = [-2818, -52521, 41906, -12077, -128823, -26009, 97934, 14447, -20824, 92449, 48165, -113692, -69545, 44486, -25549, -51916, 98170, 109179, -49784, -49679, 36762, -55194, -117986, 38020, 109217, -8098, -3297, 88652, -16292, -138598, -29064, 57752, -31252, -8109, 128968, 61606, -91134, -36017, 27635, -80177, -75332, 95688, 95703, -33545, 7891, 65324, -72717, -130488, 22656, 62434, -34481, 29068, 126140, -1303, -111685, -10736, 19511, -83957, -19796, 128900, 58750, -54655, 18596, 33140, -107586, -90858, 67529, 50801, -31931, 55871, 94205, -60121, -106671, 14862, 6893, -68940, 36765, 129804, 10719, -60775, 22948, -4556, -113113, -32508, 95513, 32003, -22426, 66262, 43249, -101223, -77828]
604g7828J14532m0626l6808J16606K3661j37172j9979Q1384n5328o1296J19472
615B6618P4271r6927j9680P6287o6479j05796P9152Q6946o5391l915J04492l7665
627E1913j26196L2044O7466o9573j2381J24745J3226j05014J3417N4818q5254
638d0789n3085J07283M4848p4111K2770P1801p5959q6266O5560M0884o5224K3572
650a8716R8950l5621q6219L8119K8042p9909k031J01284O88o3821L8941L4632
662E4339q4792l7687P6049R733n3241M6282O0226o4351n1672N1415J452o2694
674e4941L3712P6493l2760m4061M7070L037p6616N753O9082j7159l4535N4091
686B9166K1392p1399j6792N1894j8199m0296N2323M2436n0543j9471M3458j9118
$$ y = [-77828, 36704, -3922, -40730, 75876, 99537, -37635, -57614, 23770, -31558, -92854, 26618, 100889, 3962, -15718, 60569, -5910, -111706, -32554, 54392, -10999, -14914, 89578, 51913, -74283, -42239, 25227, -44346, -56727, 68018, 81244, -23770, -10353, 44465, -40789, -93874, 13409, 58257, -15854, 6916, 78717, 2758, -83508, -17948, 22936, -42288, -18716, 80234, 44613, -41606, -3487, 24555, -55354, -57385, 43899, 44587, -19234, 19707, 54339, -30453, -68140, 7909, 17642, -35599, 10683, 70909, 6558, -45114, 6301, 7753, -54941, -21229, 55264, 22504, -21557, 25513, 28550, -48066, -42313, 26769, 9610, -24925, 29166, 50558, -20841, -37633, 14261, -3938, -44234, 8089, 50525, -18, -19489, 23969, 4851]
698D851n2763L2425M7975l1676j4794M7014p225n7865J0633L9083k6788j6946
710b6076M8228J1591m7245L44L1059k6270k7065L9125K2404l2658P75L1405k0479
723E138l4130K3157K1566k5458o57L4362q346l2996J2549J6656k4794n959L1867
736A2955J574k4255R252J5736k2052j3066K4311N349j9394R481J8388j6305j5105
749a3131J5535M376j7494N047J8939q534j3799J1863M678j7161L89J6163l916
762B955j0269J0054O871j3066l949J2009j576r925P573Q426r396m524Q500q23
776B860r003L260P912m981m653O544J186p203P46O171k444l487M400K421m320
791e91j140M064o96l607K250K108k456j012J834n78j507K01J071j00r14R77K87
$$ y = [4851, -47912, -15487, 32488, 812, -13982, 33032, 25807, -32058, -21425, 17658, -9130, -26076, 22152, 33743, -13502, -13158, 17901, -8369, -35434, 3691, 26095, -6563, -5788, 25617, 5138, -28992, -5835, 15731, -9727, -10384, 23978, 15632, -17364, -4815, 11841, -12953, -18912, 12955, 14529, -9726, -474, 15262, -6790, -19856, 4455, 9804, -9590, -109, 18279, 1974, -13131, 2404, 6780, -10714, -5667, 13272, 4738, -9061, 2802, 7480, -9681, -9292, 6871, 2955, -7314, 2740, 9611, -3455, -7404, 4605, 3029, -6896, 677, 9103, -293, -4817, 3683, 2860, -6143, -2883, 5029, 48, -4605, 1939, 3125, -4078, -3332, 2839, 395, -3092, 1308, 3729, -591, -1731, 2333, 1637, -1970, 280, 2388, -68, -1080, 754, 176, -1331, -1130, -59, -159, -1073, -96, 191]
808A91o47K92M07J16K71l74NO46k11q17K44L71l03n06o9N10q97l40R57n7q75N77
830e09N43p6k84L43R21l9r05O10M41p81m22M24N76j166l93J248n04j673R07J562
850H23j715o25J948Q53k061J84K373r88k662K508J817l571M77L597k084l489K342
867b73J980l869n43N055p90m993L118L312n664j576O949r4n379L625N070o530
883f02m623P580N69q172M476Q479p173o394Q416O09j1090K860J2407n212q684
898f554J0984L899j5754p23J4933m704j0782J3233R059j6480n954J5315m552j6739
912a4819J2808J6597j5197p694J8053l318k3181P783K0519j2325r365K3046L362
925A6269k7649J293K0605j3938j4318K5586J2584k5287k231K1249j5232k4395
$$ y = [191, -456, -164, 243, 359, 630, 256, 261, 907, 696, -121, 123, 494, 191, -315, -384, 126, -771, -1111, -154, -211, -1086, -509, 34, -42, -326, 17, 938, 899, -6, 604, 1045, 264, -158, 266, 842, -324, -717, 531, 27, -1646, -739, 823, -892, -1517, 431, 1284, -777, -593, 1780, 792, -1870, 638, 2455, -1116, -639, 2958, 874, -2615, -273, 1707, -2162, -2705, 2350, 1560, -3433, -315, 2997, -2667, -4243, 2706, 2612, -2767, 858, 5928, -602, -5225, 2355, 2924, -5248, -772, 7707, 534, -5860, 2556, 3165, -7925, -5065, 7342, 2130, -6554, 4430, 8329, -7425, -8148, 6785, 2081, -8701, 4532, 13591, -2889, -8843, 6472, 1920, -14819, -2011, 14586, -611, -8305, 9748, 6430, -16751, -8968, 11551, -774, -10139, 12907, 16269, -11380, -10087, 10518, -3420, -17738, 7848, 20432, -4855, -7086, 14163, -1069, -25464]
937b5464K2192J9921k2108j355K8503j1534l2347J4185J9479k2638m166L7059
949B1727k22l3953R331J9349l0026j5283L8455J0389k9924J1446K7115l1287l0046
962c2929L1486J3074l1289J3939M1840k2139l6073K4050J0505m0804M253N0664
974B6577o489l3680K5473J5860n0383j4671M6654N47l1390L2180L3254m5051k9557
987c0676L6340k449m0724K8887N1059k8524k9280L4447k949n6305R681N2851j4975
1000G383k4202M4102J2341o1585j1133M3269j7269k9894N0656L5305m8157j7060
1012a6244L8046k3578m9868L8596M8022l2732j0625M8393j6806o5348J5490M2310
1024A5656l0962j0980O3731P589o2295K094L4519m1987k8779O2724K9333m5735
$$ y = [-25464, -3272, 16649, -5459, -6814, 21689, 10155, -22192, -8007, 11472, -11166, -15332, 21727, 21505, -12448, -3117, 16232, -13794, -29077, 9378, 19767, -10157, 1289, 28404, -2883, -32929, -1443, 11631, -19658, -5719, 36121, 13982, -22091, 1959, 12464, -28340, -24087, 26577, 20088, -13592, 11881, 27741, -22642, -37313, 9341, 9888, -21502, 10678, 43932, -1119, -30676, 5664, 3215, -37509, -8622, 42437, 13913, -15367, 19080, 16131, -40174, -30493, 22358, 7383, -16819, 27283, 39624, -21961, -33094, 10175, -7094, -36988, 13668, 48973, 816, -16244, 21802, -1776, -51644, -13048, 34974, 2242, -8383, 40010, 23204, -42144, -26654, 15656, -15306, -26286, 37445, 45034, -17261, -15167, 19352, -22635, -51414, 11310, 40643, -5092]
1036e092O292M1625m3653n4100M2271L2342l9335J1440O1656k4230o1555K2017
1048a0322K3351m9377j913P2165L784m9857K1020K5357o0073k9326O0115J5638
1060B0562l9043K9957M5752n0931m8823L8619R514m7136K6676O7047k5349m5805
1072a8960L1867M822o4270L038O7690n149l3707M2042J9877o8693k3552N0426
1084E431o343l4826M8184M5433m9814l1617L7870j4458n3982L3906N9002k7278
1096A1508k2104M4367p943o7538O269N0298j9937j8916N6198J6718o1415j0402
1108b2897L7277k8214l3508N3274L7595m1808p979L8396k9008n4025L2340M0422
1120B1865l0502k087N3187j2637n9242J2043L0768l5699j0346O0154J0924m7761
$$ y = [-5092, 1200, 42825, -828, -54928, -12657, 19685, -19650, -8210, 53446, 29216, -32339, -10322, 13029, -36348, -38261, 33904, 37688, -12169, 8851, 34208, -25865, -55191, 4924, 20562, -18481, 11476, 57228, 6297, -42526, -3907, 5607, -41529, -14853, 52194, 26845, -18960, 12907, 17729, -46541, -43503, 24187, 19038, -14669, 27373, 47250, -21443, -44995, 5431, -912, -35738, 12446, 57879, 8065, -23552, 14318, -140, -54122, -20216, 38786, 11508, -10596, 33771, 25828, -41710, -35441, 14857, -5080, -23996, 32202, 48920, -12495, -22897, 14380, -13834, -47342, 5932, 43527, 1719, -6260, 32136, 3128, -50897, -18557, 21865, -8637, -10724, 42463, 29826, -29416, -17373, 13395, -22304, -32650, 27504, 38428, -9333]
1132i333P537K8201m3025l0641M8828K1894l5104J3469L9781l4338m4603K9725
1144g609J8012l6016J1477N2356j4276m1080K0034J3329m3793n193N0094K188
1156A9523l0978K2723K0569m3855k2168L6625L463k8120K5267L4382l0331k7252
1168b0152K5645l69l5264J5751M0771j4981k1625K5929K036m1060l07L4795q627
1181B542j7984K9560J4142l6297j0053K6033j0677k2393K6566K4387k4343j0024
1193h541K3675r761l0508J5001K5607j6697p622K6808j971l1371M183J9964j5166
1206f399j0434K7006Q168k4308M59J7017j5026j6205K0524J2454j6858O62J8439
1219A5499j0736k0004J1513J1601j4822m85K0206l296j8019O382R165j4346m657
$$ y = [-9333, -1796, 26405, -16620, -47261, 1567, 23461, -11643, 1826, 41607, 7269, -37334, -7609, 10403, -25613, -14136, 38220, 23944, -17136, 2898, 16227, -27566, -32759, 17335, 19523, -11455, 11268, 31837, -12018, -34186, 2439, 5902, -22218, 3049, 37431, 7100, -20152, 5493, 5124, -30140, -14389, 26382, 11401, -10224, 15705, 17741, -23319, -23626, 11169, 2542, -15442, 14118, 28260, -8037, -18090, 7943, -2734, -25127, 1439, 25826, 1483, -8541, 15134, 5373, -25135, -10134, 15473, -1224, -8846, 17962, 15991, -15380, -11197, 8767, -6399, -16833, 10173, 18341, -5967, -5508, 11509, -3517, -19722, 802, 13256, -3602, -2940, 15499, 4763, -15241, -3728, 7873, -6949, -7434, 12772, 9476, -8543, -2161, 7004, -7342, -11999]
1232a1999J7842K527j3614N970R813j2830q727J2761L233j0822N020J1607q497
1245B284r741Q564K557j0965K250J2181m289q031P143L403j0436r37R860j429
1259B414o388N762N012p973l492P446r67o691M463N882n180l842N305O1o180K060
1275b308N510l050k997M485J122m569l29L950j100k726K819J884l083j150K812
1290A270p43k383J770J456j768o04J212K48j479K63J489j074k75J203Q5r79K91
1307a8L73j65r7M0M85p50j44L75l42k15M63m62L6OJ28K21P6Q9j08K73M3J29j83
1330B53p7J26j59j61J75k19J35m03q2J10j12j77N34J14l84K54J97R3n60M55N46
1351F58n69LO30l60o92K59O67q18k32R18k70j148L76J011j285j25J891k71j498
$$ y = [-11999, 5843, 8370, -5244, 726, 10539, -2291, -11018, 1743, 4976, -5846, -826, 10781, 2284, -7457, 1107, 3664, -7301, -5051, 7130, 2841, -5190, 1953, 5356, -5080, -6017, 3843, 2414, -3974, 1788, 6800, -1173, -4665, 2781, 1814, -4877, -414, 5468, 288, -3554, 1751, 1812, -4368, -2308, 3202, 152, -2845, 1640, 2762, -1807, -2136, 1814, 714, -2012, 807, 2691, -392, -1542, 1270, 527, -1856, -86, 1370, -398, -1002, 210, 458, -1021, -758, 731, -343, -618, 585, 670, -309, -18, 355, 190, 93, 133, 618, -132, -276, 99, -243, -458, 5, -457, -421, -415, -287, -66, 10, 99, -9, 264, 307, 436, 253, 176, 302, 143, -18, 157, -62, 73, -330, -412, -302, -414, -591, -57, 57, -327, -73, 124, 217, -343, 112, 658, 89, 92, 722, 362, -330, -71, 596, -222, -454, 464, 194, -954, -578, 433, -852, -977, 914, 643, -855]
1370h55R95J300j809r18K343K52k275R53K333k609j860L112l01l050J700L333
1386B644k404k964L823P13m908Q51N332j826m020M842K116o546r29N992j845n148
1402d277N469M511o933k624O786k014p637N204P366n948l413Q081n80j0484K752
1417c741R172o276m212J0715J886j1825M52Q652o310p875J1584O584j1473m59
1431c126J0646p211j2083J0021Q837j0354r4J4129m565j5289O123Q965j1968k791
1445h760J8402K69j5574M855R483j4747r002J8355N192j4249O346J4230j4897
1458i7j4978J4795N561j5348O449K0580r227j7606J1693N527k1429R55K4745l006
1472H614j6003J3537Q506k4576p933K2029q01j6087J6990J8239k1867j3847J8137
$$ y = [-855, 140, 1440, -369, -1287, 1056, 1308, -967, -14, 2319, -290, -2150, 962, 661, -2389, -689, 2644, 240, -2724, 1099, 1812, -3096, -2245, 3087, 1261, -2759, 2083, 4199, -2347, -3276, 2716, 871, -4277, 1192, 5703, -1230, -3854, 2932, 918, -6719, -1515, 5851, -97, -3510, 4571, 3991, -6493, -3741, 5431, -845, -5057, 5658, 7544, -4281, -3829, 4823, -1487, -9362, 2222, 8806, -2667, -3126, 7520, 309, -11774, -1753, 7084, -3270, -3364, 10765, 6200, -9089, -2966, 5999, -5969, -8760, 9642, 9911, -5663, -808, 8675, -6072, -15074, 3281, 8473, -5776, 570, 14800, -97, -15075, -280, 5281, -10067, -3618, 16962, 7735, -9871, 1822, 7349, -14080, -13125, 11620, 8614, -7389, 6148, 14654, -9922, -17855, 4174, 3373, -12714, 4276, 22515, 648, -13199, 4938]
1485D938k345k2495J3397K5798j3225j3479J8797q80l0068L401K5997q645j2113
1498a0922K4443Q151l0897n642K1040j0094j7474K5979J9977k3373p857K0808
1510A4139j2945k8092J7679K4900j6714m668K7470o559l5067O262K1385j8302
1522a0512o851L4902P094l1279J648J7870k3415j9099L2228J7250k3578M909K5052
1535B6219k2942l1881K0662J6490k2525O233L6369j0031l4130J2005J2382k9784
1547b0933l362M0517M102k6845J3023J6161l4444j9196L1994Q869k2873J7334
1559D347K9116k7307k8261K0854M853k8807J2864L9687j1890k5169J9375M479
1571A4141l8602j822L7861l312j9092K5747J4863l8057j5226K7319n231k3251
$$ y = [4938, 2593, -19902, -6505, 19293, 6068, -7411, 11386, 10506, -19562, -16161, 9836, 1191, -10922, 13521, 21672, -9225, -14867, 6173, -3921, -21395, 4584, 24561, 1188, -6669, 14139, 1194, -26898, -9219, 15681, -1033, -5701, 21769, 15210, -19857, -13595, 7790, -10512, -17363, 17539, 24633, -6646, -4998, 12872, -10543, -29642, 2586, 19836, -3742, 1167, 26219, 3277, -28604, -7942, 8548, -13977, -7744, 28625, 18594, -15536, -3531, 8851, -20933, -24295, 16222, 20324, -6521, 6502, 22663, -11781, -30977, 1017, 9886, -12987, 4347, 33463, 6156, -22105, -1251, 3602, -25205, -12341, 27346, 15456, -9713, 9662, 14141, -24461, -26283, 11578, 8266, -10826, 14921, 29784, -8273, -23499, 3820, -1411, -24662]
1583b4662K7784K9128k6858j6622K3193r124l4635J7219L4193j5240j1561K9180
1595B1995k217m1277J719K8484j4486j2461L5728J2399l5385n479K2186j9161
1607g955k3209L0986K3774k3727k753K5856j7816l4577J7686K2831j9426k77L4715
1620B6108n428l5330O474J7142k4156p969L6826Q387k7057O038J7606k7122k0477
1633b8958K7475J3158k0356R535K6384k0117k7489J6893R151k3400P002L3105
1645B2383p328k3992J2980P442k8770m093L0334Q10j8234J6080J3914k7511j3989
1658a9974K1733Q66j8045J6134K2794j8134j5986J6314j465k3578Q681K5191q789
1671E742j2306J7197K332k6315j232K0557o413j1035J9509J0248k1486o180J5336
$$ y = [-24662, 3122, 32250, 5392, -11230, 11963, 2839, -31796, -14577, 19616, 4376, -7185, 21995, 19778, -21499, -19780, 8704, -5782, -18243, 17485, 29884, -5501, -10980, 11206, -7955, -31164, -178, 23596, -131, -2884, 22972, 5156, -29421, -11735, 11096, -8330, -8607, 26108, 20680, -14650, -8176, 8966, -15190, -23159, 13667, 22054, -5003, 1035, 18641, -8481, -28958, -1483, 11675, -8681, 854, 27238, 7121, -20368, -3475, 5676, -17724, -10722, 22383, 15055, -8937, 4043, 11485, -17285, -21378, 8956, 9766, -8468, 7612, 21526, -5985, -19974, 1759, 2625, -15420, 714, 23508, 5374, -10612, 5702, 4237, -19341, -10660, 14531, 5742, -6564, 10633, 12965, -13350, -14582, 5975, -438, -11473, 8036, 18284, -3202, -9382, 5954]
1684E954p512j5257J5880J6189j4284n412J5474o475k0157Q469J4986j0088m135
1697f368J7643m66j9307K069J1580j0140o704J7555N776j4656R25J0639j0338
1710a792j1151J2427Q001j0331J102J2618p204j3225P061O638r862L6J3576j319
1724F575j1346M153N864r877l639J1836J856q499M152O479q851o134Q095K146
1738B810p339L391Q324n477o682N358J906p699J804Q344k438n389M995K477p615
1753c230j140O831r30m667M346L851n994k515M883n17m580K861M546l582k491
1768b328L816K18m865J521M011k000k162L299J091l851k77L119j269k196K466
1783E93J337k529n21K128q59k183J476J641j505n82K016k81j949Q06R89o82m03
$$ y = [5954, -1558, -16815, -935, 15254, 970, -4442, 11032, 4557, -15600, -7131, 7855, -2233, -6368, 11275, 10809, -8498, -6429, 5151, -4989, -11693, 5862, 11638, -3018, -2093, 8546, -1792, -12943, -516, 7485, -2846, -1744, 10874, 3670, -9555, -2494, 4144, -5718, -5682, 7894, 6575, -4771, -618, 5246, -4631, -8270, 3566, 5422, -3077, 1075, 7554, -1297, -7431, 664, 2810, -4529, -1138, 7186, 1709, -4973, 385, 2291, -5408, -3604, 4740, 2302, -3087, 1908, 4385, -3230, -4370, 2461, 1531, -3136, 1210, 5061, -933, -3448, 1435, 918, -3662, -801, 3745, 163, -2328, 1488, 1706, -3159, -1638, 2373, 373, -1789, 1510, 2601, -1250, -1527, 1592, 323, -1873, 593, 1930, -599, -1120, 1008, 149, -2034, -558, 1083, -422, -1004, 1012, 731, -1218, -412, 577, -105, -508]
1800e08J237K0j212J43J210r77n16P91J82r69J82M51n6l55P9N48l61j44O08l06
1820D7j83N73j84m5k14P8J65l80M3K02j42j83K21k5M4l90N67l36j93K39K50J83
1842C37l04J65M8k31Q5K76l73j10q9J58m1l37M68k13j60K74J81m32K18L87m32
1863a25N9M77K7m81J59M82p03m82J052o9j004N96R27j131p46J132P6j381O29J715
1883A209j073j480K094K68k458O88K173p39k012K011J208k946o94K992j185k471
1899b415K745K187l195j184L339j098l582K652L385l003j395M261n14n209J605
1914a421L875k944k245N193J073n747J72M544l628l882N955L216n708K52N480
1929D185l663o101N101L871n355kP559k276p766L369M086o348j224Q796N67q023
$$ y = [-508, 729, 749, -463, -320, 890, -87, -603, 188, 370, -599, -417, 34, -22, -377, -298, 250, -111, -255, 353, 47, -136, 437, 253, 208, -6, 72, 237, -143, -100, 102, -40, -223, -2, -27, 17, -373, 194, -142, -335, -96, 154, 337, 33, 198, 246, 15, 100, 376, 3, -107, -196, -38, -79, -416, 52, -161, -321, -47, 134, -298, -80, 307, -125, -66, 411, 438, -43, 116, 598, -105, -587, 465, 396, -608, -12, 915, -216, -962, 170, 246, -1135, -506, 1209, 136, -1344, 750, 1018, -1440, -752, 1421, 682, -1330, 681, 1889, -1057, -1751, 1241, 56, -2415, 330, 2517, -678, -1862, 1477, 379, -3203, -551, 2834, -169, -1564, 2697, 2183, -3026, -1421, 2454, -490, -2735, 2458, 3531, -2216, -2044, 2500, -1128, -5010, 945, 4161, -1547, -1295, 4185, 522, -5579, -478, 3393, -1962, -1964, 5595, 3319, -4447, -1078, 3008, -3340, -4564, 4232, 4799, -3224]
1945c224L008M997p907m524R320K316p452L795P895p293p890P167K552q491K898
1960b833J1281m272r034O607K689j1923j97J2808j394p940P619N381j2910n012
1974i130J1376r32q527R124J0369j1151p090R281j818j2628O658J3850o547o723
1988c888J0820j40j7102J143J3724m913o338J4198N302j6550l336J1299o645j0152
2002a2578J4225J1746j2685l551J1688p171j6748R255J3380r317k457J6600k729
2015I658j9621L228J1324j1132m277J9725N000j7073J404J0409j4013j1618J7460
2028D74R560j3038L384J4841j2405j7996J1053Q638j3610L436K1367n237j8243
2041g776P525O601j8068k698K2824J839j4640R091R656k0099j1150J7517L099
$$ y = [-3224, -216, 4781, -3126, -7650, 1670, 3986, -3466, 329, 8224, 931, -6959, 208, 2760, -5731, -2833, 8448, 4176, -4858, 1749, 4438, -7485, -7682, 5126, 3732, -4208, 3411, 8792, -4118, -9130, 2246, 1314, -7213, 1911, 12280, 1129, -5961, 3320, 1502, -11126, -4468, 9382, 2835, -3888, 6932, 6792, -10310, -9167, 4557, -356, -6694, 7504, 12806, -3744, -7080, 4219, -2426, -12578, 1647, 13393, 708, -2843, 8845, 1674, -15074, -5819, 7561, -1756, -4213, 12387, 9658, -9963, -6735, 4589, -6543, -10820, 8905, 13905, -3168, -1764, 8645, -5368, -16986, 474, 10034, -3004, 380, 15221, 2816, -15180, -4127, 4511, -9099, -5663, 15704, 10467, -7776, -251, 6350, -11718, -14416, 8408, 10247, -4393, 4698, 14354, -5745, -16895, 622, 3721]
2054C721j3347J1312J7308j4845j5084J2103J149j8214P530K2744o415j2880J2746
2067G828K035k3103j698K0381k659j0236J6407Q907k1547q410J4722m963j3376
2080a5712J6509J6943j4622q065J3502o558k0575R768J9031q908n157J7778j946
2093A1988k3412J107J4805r607o436K1153P173j9436j854J2231j3099j3583J8322
2106f48J2677j3255O03J5233j1079j9577R819J1715j1837Q66K0805l436j9270
2119g384M275Q250j4887m526K1601L972j4455N065R433j5817j1753J5645N987
2132E406j1844P291J5221j1628j4830R588L445j3904M493J8590l902j2433Q269
2145C762L336j7306k235J6767l37r079J0531P876j6114p547J1763j239j0381J0638
$$ y = [3721, -9626, 1686, 18994, 4149, -10935, 1168, 2317, -15897, -8367, 14377, 7962, -4918, 7828, 9863, -13240, -14938, 5443, 2784, -7452, 8955, 17862, -3685, -12095, 2627, -2336, -15712, 797, 17740, 3118, -4947, 8555, 1997, -18578, -8810, 10221, 1313, -3844, 13934, 11988, -11424, -10317, 4488, -5119, -11555, 9598, 16771, -2665, -4519, 7712, -5387, -18970, -648, 12029, -1226, -623, 14610, 3531, -16046, -6227, 5488, -6349, -5483, 15322, 11886, -7384, -3109, 5141, -9746, -14272, 7329, 11301, -3154, 1911, 11344, -4473, -16226, -581, 5406, -6438, 853, 16074, 4446, -10384, -796, 2649, -11255, -6762, 11828, 7926, -4507, 3762, 7098, -10208, -12443, 4324, 3987, -5092, 5439, 13315, -2799, -10346, 1417, 178, -10203, 435]
2159D35J2987j0229p991R409k417j4261N620J3982n425n586J0697Q58j5950l17
2173h188J1325m564n660J2459N663j2519l011Q579n720r180J0152R384q381k088
2187a749Q983m776j1949M989Q621o037j923J1372o77j1533J497O324o723l518
2201g099J0928L331q715J008O199o901o641P537M542o706J754P575m652p825M310
2216a355L655o494O76Q819j252p072L530K900o827j778P760L45n193L070M325
2231E109o099l966N573P67m785K560N602l687m241M146P16n466J239N752j680
2246A540l389L541J369n493l75M324r16k968L395K342m115j492L287m57l428K312
2262e23L178k792j200K693k07l379J245K748j481j375K545K57k858K40J783j009
$$ y = [435, 13422, 3193, -4798, 4611, 2194, -12067, -6447, 7535, 2110, -3476, 7221, 8079, -7871, -8188, 3137, -1427, -7087, 5372, 11035, -1484, -4495, 4084, -1636, -10816, -664, 8720, 339, -1749, 7234, 2458, -9491, -4502, 4119, -1918, -3841, 7531, 6854, -4679, -3182, 3142, -3581, -7099, 3829, 7160, -1555, -547, 5652, -1249, -7890, -353, 4189, -2517, -763, 6812, 2160, -5665, -1355, 2300, -4194, -3518, 5301, 4049, -3023, 507, 3407, -3420, -5198, 2562, 2907, -2286, 784, 5109, -990, -4956, 617, 1384, -3401, -841, 4761, 1074, -3167, 979, 1695, -3771, -2532, 3220, 1540, -1849, 1692, 3061, -2432, -2807, 1517, 601, -2367, 1028, 3370, -745, -2237, 1050, 593, -2835, -523, 2655, -137, -1337, 1356, 1149, -2230, -985, 1763, 282, -1093, 1452, 1709, -1149, -909, 874, -135]
2278a35j337J994Q68j861l23K004j162j669J554J123j383j14J470l46j459O02
2294a74R36q49m28J419j12j321K29P92q14l17R35p0n68J69N01m49k43N00K68l88
2314A6K7K04pn78K16M38l48j59L60j5o51K54J68l7o7J76K0k7k10L74J99k92N2
2337A13J9J16l19m4K96j74r0J70q4N5k99J69m6j6j4P6J17J58j1j69J6l5QQ6K06
2362C04L4m21R2Q5j80l8K05O3l15o5M66m24j82N24j28n26L52Q18l96n25N21K54
2384E18p86k2J017p70m45Q02M35j371j1J073k72j008J187P43j502l74J398l67
2402B45j415J350J149j315o08J865o72k001P11J705j341j075K469L68k585M78
2418f72J966k013j454K526J260k345K06K487j797k656K444J355k396L66L176j388
$$ y = [-135, -1472, 522, 1390, -471, -794, 1210, 48, -1621, -67, 1056, -327, -441, 1029, 683, -776, -174, 762, -87, -515, 904, 792, -529, -300, 492, -322, -639, 296, 226, -342, -173, 328, -121, -364, 136, 404, 16, 43, 247, 240, -338, -122, 316, -32, -191, 169, 154, -497, -243, -75, -112, -179, -3, 17, -10, -220, 154, 353, 61, 113, 132, 248, -71, -115, 181, 7, -83, 87, 3, 58, -241, -72, -118, -134, -148, -72, 45, 203, 192, 23, 39, 4, 12, 98, 304, 338, -83, 9, 94, -86, -124, 81, 144, -171, -236, 230, -194, -376, 148, 20, -506, -154, 664, 268, -257, 264, 518, -268, -290, 727, -43, -488, 314, 749, -622, -633, 440, 168, -840, 347, 1090, -412, -786, 612, 245, -1170, 180, 1329, 14, -594, 1271, 599, -1402, -691, 1014, -327, -1402, 1067, 1435, -1150, -672, 1294, -719, -2173, 353, 1613, -732, -526, 1961, 164, -2492, -48, 1307, -1089, -723, 2453, 1065]
2434A065l144J876J392l159rM020k92l111J590K251m068j663M330M46l445K402
2450D81L386l631l540L736O75m464K136M960k285l431L068N50n206K42O019j277
2466A419l593M245K124o253k083N586r37m136M904M217n276k862M481j159o307
2481e630L836O269l853k560N658o69p997J305O096l256k495P249J690p864m03
2496b624N155m237m243P066M555n999r04N985m486p375M759N727n126o0Q216k282
2512D127q925K373M656o113j242R725J249p949K123M521p793m762Q702L212o388
2527b484L205P034o741q298O367K815p383L207J0252l484q068M387J933r403L3
2542f628J0937n03n993N528L674j0523m158Q527j45o156P068P775q236n910O115
$$ y = [1065, -2079, -203, 1189, -1970, -1979, 2041, 1749, -1362, 228, 2479, -1589, -3252, 1078, 1524, -1921, 481, 3867, 236, -3304, 432, 1107, -3357, -1221, 3739, 1454, -1977, 1091, 1641, -3565, -3323, 2696, 1419, -2174, 2071, 4195, -2058, -4141, 1445, 508, -3628, 1276, 5493, 217, -2645, 1836, 677, -5630, -1794, 4475, 622, -1938, 3720, 3051, -4946, -3641, 2455, -801, -3296, 3953, 5643, -2221, -2624, 2531, -1706, -5949, 1117, 5672, -327, -1231, 4754, 268, -7107, -2348, 3379, -1747, -1807, 6409, 4127, -4798, -2425, 2231, -3882, -5124, 4601, 5850, -2099, 24, 4545, -3248, -8010, 692, 3904, -2484, 721, 7755, 1014, -7284, -917, 1898, -5485, -2278, 7974, 4490, -3578, 809, 2742, -6661, -6628, 4309, 3806, -2187, 3341, 7015, -3508, -7666, 861, 716, -5440, 1628, 9403, 1167, -4743, 1372]
2557A372j033q657N241J0256m639m640P196q45j1882J158R463l089l764R233L012
2572H382j1086k454P112l946o071R446O985p635k426O714m653r810N972Q309n304
2587d65j034R120k200j1394J855O279n985j982J1130K332r109N52M947p685n412
2602i051R470M981o627J862P282o566r166N714M331o870K108J0663k980q948L368
2617d29K891q399j057J0827R45o387L661M470r233n145P826J941n802M839P690
2632H638o669o966N188N97p460L212R717k912n735N248Q41r336n85Q616q72m294
2648b772O499L267q560l427O010j399n406O119O734n685l634N063j999p178K893
2663c475P323l189k496O568l14q698M84N589l002k815P110K961p093q86M646l768
$$ y = [1372, 339, -8318, -3077, 7179, 2540, -2100, 5096, 4251, -7631, -6473, 2990, -99, -3863, 5370, 8382, -2704, -5158, 1954, -1992, -8063, 1383, 8368, 733, -1693, 5021, 368, -9442, -3470, 4839, -465, -1499, 7621, 5421, -5973, -4118, 2161, -3824, -5806, 5324, 7656, -1453, -901, 4046, -3639, -9051, 419, 5400, -1227, 635, 7917, 1351, -7815, -2101, 2230, -4640, -2532, 8131, 5151, -3797, -429, 2462, -5937, -6994, 3833, 4778, -1609, 2052, 6522, -2711, -7856, -30, 1911, -3891, 948, 8638, 1969, -4997, 191, 788, -6672, -3460, 6257, 3345, -2390, 2858, 3699, -5637, -6222, 2394, 1522, -2772, 3727, 6994, -1566, -4993, 1017, -382, -5788, 331, 7065, 1380, -2254, 2809, 810, -6368, -3475, 3848, 659, -1837, 4731, 4417, -4281, -3797, 1792, -1210, -4025, 3085, 6046, -1047, -1933, 2713, -1055]
2679a055m808N716M359m582m01N096k887o645K914M325l668o14O620r05o102J431
2695a206L102m398j685O041J655m685J260L469m555l826M759K169m038J547M407
2710D016k843m257K695J485l671N27N210r02l824K351J385m148r58M108J83l002
2726a645K516K202l718k058L018J84k848K096L057k158k168K303Ll135J050L205
2742A904j214j836K470O63l401l74K738o45j788K248J144k358p62J814l52k171
2758a920J814J672j346p43J560k77k193O78J704r91p54J683J36j881M64J130j112
2775c76o75J544M53j459R7J145p17j005J097M71o99j46R93l01r09M26M41o37k33
2794d90R89l16n74J66M03m09k03N92j5k19Q0L48j81n16N31%l65k09N72l23R9j92
$$ y = [-1055, -5863, -147, 4212, -370, -771, 4325, 1438, -5207, -2293, 2032, -1636, -2250, 4370, 3465, -2637, -1206, 1896, -2502, -4187, 1854, 3509, -1176, 84, 3553, -1002, -4828, -69, 2100, -1938, -391, 4016, 1173, -3084, -389, 1096, -2575, -2048, 3162, 2260, -1564, 787, 2172, -1976, -2934, 1174, 1357, -1645, 871, 3073, -645, -2703, 315, 499, -2349, -253, 2804, 646, -1522, 781, 784, -2351, -1301, 1904, 690, -1146, 1324, 1987, -1414, -1788, 950, 305, -1483, 765, 1909, -449, -1211, 603, 251, -1920, -106, 1566, 220, -523, 1037, 760, -1433, -755, 949, -42, -796, 887, 1023, -858, -394, 736, -376, -1051, 493, 946, -513, -416, 729, 12, -993, 104, 575, -124, -270, 723, 422, -487, -61, 380, -257, -490, 499, 183, -391, -225, 178, -231, -434, 158, 143, -76, 4, 352, 171, -345, 186, 186, -179, -388, 184, -139, -40, -232]
2816b32M99o01J38K6K67l22K18L60n28L60o4Mk91J45J32Jj42o0K40n9r9J9J79
2839A90m59J45K13j80n7L6j5m5J34R0M4J35j22j5J83j34j12M4k39J51J08M5j20
2862B0j47N0k10L98k01NJ83J78k17l37J62L34l87rL63j69j64L02J71n85K74ln3
2885d2k75M52J66q16L19K08M3o27O22M43m60l47M27k02k77L98L18m12k16Q23j58
2906C87j240N61N58p13j0O47M38r66l0R69o49p26R58N30r49O6R83p68j016R00
2926g0L01o63O4J426l96j810J067Q71j459m50K035j72j285P96R16j688q57J812
2944D38L99k005J223J668j778j230J611L25k028O17K544j269j676J968J3k513
2960a693K96K506o28j573J983J318k950j017K390o51k008K528J950k419j355K433
$$ y = [-232, 267, -334, -196, -170, 97, -225, -7, 353, -175, 185, 121, 125, -166, -21, 111, 112, -30, -90, 150, 91, -8, 11, 190, -269, -124, 89, -91, -148, -112, -127, -172, -38, 52, 96, 231, 109, 94, 277, 143, 31, 75, -164, -13, 95, 140, 20, -127, -77, -287, 111, -90, -85, 98, 276, 59, -278, -116, 218, -169, -178, 185, 16, -148, 154, 325, -260, 14, 11, -42, -317, 135, 301, -515, -196, 12, 55, -572, 50, 493, 33, -314, 113, -89, -366, 32, 350, -62, -278, 545, 387, -853, -292, 266, -447, -457, 190, 628, -338, -368, 601, -48, -774, 184, 714, -235, -169, 814, 46, -970, -70, 231, -432, -368, 1058, 662, -1148, -81, 790, -669, -1119, 916, 744, -541, 255, 1171, -517, -1374, 438, 837, -1168, 55, 1723, -55, -1285, 326, 651, -1377, -760, 1784, 515, -1161, 807, 820, -1693, -1397, 1109, 481, -1092, 891, 2209, -741, -1758, 632, -19, -2027, 501, 2451, 32, -1323, 1110]
2976A110p05l024J581K887j712j112L020k14l944N71K753j644j389L602R35l768
2992a053L5K389k104k356L350K188k879j24L167k215l987K594K643k900J28M547
3008C423j326m237J444K002l459q27N072O98l850J513K332m382k379M099J479
3023A602l130J787L858l425l957K940J208l629J123N519j593l852K414J307n104
3038b932p22N600l48l095L217K480n405k700M264m8l589L705M538m090k776L268
3054A367o97n002K305N187j756k435M049j97o151n1M580j564k062M865K425n535
3070f72j640L588k045m078M544M464l689j243M178k210o054K528M364k900o48
3085a513N527l49o034K06L557l598j861O188K328n046L31L227l989m226M630L256
$$ y = [1110, 405, -2619, -1038, 1849, 137, -975, 2045, 1831, -2113, -1542, 1211, -433, -1822, 1780, 2715, -1053, -1018, 1371, -733, -3089, 261, 2449, -430, -554, 2613, 398, -3589, -995, 1648, -1252, -1124, 3423, 2097, -2140, -696, 1306, -2153, -2980, 2092, 2790, -1060, 453, 2785, -1597, -3976, 123, 1602, -1528, 259, 4117, 692, -3265, -325, 883, -2746, -1623, 3896, 2303, -1549, 865, 2172, -2932, -3654, 1946, 1598, -1497, 1720, 4200, -1205, -3905, 359, 311, -3278, 427, 4965, 875, -1901, 1367, 670, -4332, -2027, 3160, 1404, -1031, 3018, 2821, -3330, -3381, 1199, -365, -2427, 2438, 4863, -672, -2312, 1276, -769, -4847, -303, 4161, 472, -771, 3407, 1197, -4857, -2329, 2035, -865, -1513, 4014, 3665, -2369, -2163, 1394, -2204, -4065, 2123, 4451, -595, -264, 2963, -1026, -5252, -622, 2634]
3101B634l560Q50M795l103n572K631K510l969N66O296o65n233J875J858m930j263
3117d280N663J016l372K303L189n188l724M152J083l593K584N202l433l951K687
3132C38P17m896R71N765p72l472L242R15n468j161M885l57k741L549L102m670
3148e3k570L313o00l825L068M547l133k069L336o30n130J209M583k054j407L797
3164B382Q59n216k29L534k286k095M413K193l676p39K801k375l249K812L007k572
3180d36l13L415j194m174J318K513k393l54M038P5l734P18K111k848j928L903
3196G17J204k694P08K536k699k687K748J192k121O00L101j141k932J458R70k702
3212a742K25L046q4k368J350J166k719j060K857Q4j731J476J616k189j472J839
$$ y = [2634, -926, -76, 4719, 1616, -3956, -1325, 1185, -2784, -2218, 4078, 3413, -1820, 55, 1913, -3017, -4280, 1383, 2399, -973, 1330, 4519, -669, -4393, -241, 842, -2751, -167, 5035, 1602, -2349, 338, 1055, -3841, -2870, 2895, 2123, -1349, 1893, 2808, -2660, -3821, 1064, 707, -2034, 1515, 4617, -53, -2623, 690, 90, -3735, -667, 3880, 747, -1322, 2014, 1384, -3746, -2537, 2046, -8, -1415, 2382, 3241, -1975, -2204, 1330, -956, -3051, 1362, 3555, -121, -860, 1941, -434, -3683, -871, 2136, -436, -749, 2666, 1472, -2702, -1384, 1129, -1264, -1618, 2420, 2495, -1239, -521, 1590, -1258, -3186, 717, 1921, -773, -65, 2471, -228, -2915, -167, 1025, -1096, -496, 2605, 1464, -1468, -10, 960, -1742, -1517, 1529, 1445, -923, 427, 1593, -1126, -2186, 671, 755, -976, 500, 2116, -73, -1545, 294]
3228B94J2j837J258K200j474j288J501P1k140N00K003p30j126J449O56j939n77
3245a167J629n45j107J446J001j657l59J356l43j783J240J294j078n34J427m36
3261C84j051K68R11m76o21R10L85j167p6R98m91q55J002N43q38J81P47n88q33
3280f67L29R19o48j53P00j31p04J28M10k94n86J087J28p30K30L95m03m86M15L90
3300C29l58k3M36j67m32K08K63l48n5K96L6j87r8L10j69j37J71Rj59m8K65j98
3322e6m0J04R4o0m4M2k7r9J71k7j76J07K26k39l9k28M15R4k61J54k2k89K07o5
3346e8O9pm6J99j70n3j0N4M5p3l1J60j02L4Ok09J08J38K30k87K5J13k01O8J39
3371A41l7k51K62r0ln5J32j62j44K14Q1k17Q4K09n04K46K28p4j97K19K46l59j38
$$ y = [294, 306, -1531, -273, 1927, 453, -835, 666, 737, -1403, -903, 1100, 370, -756, 693, 1349, -590, -1167, 462, -83, -1190, 256, 1257, -400, -759, 597, 254, -1529, -289, 1005, -73, -607, 820, 384, -667, -399, 512, 36, -585, 325, 710, -457, -533, 465, -26, -881, 121, 664, -174, 7, 754, 166, -667, -338, 581, -67, -220, 480, 349, -355, -227, 183, -111, -697, 390, 518, -212, 18, 413, 10, -476, -61, 329, -29, -52, 384, 217, -215, -7, 256, -92, -147, 149, 185, -2, -100, 210, 41, -96, 75, 84, -75, -123, 142, -56, -96, 8, 102, 42, -2, 40, 13, -86, 85, 58, -118, -11, 215, -24, -63, -291, 124, 218, -43, 111, 89, -200, 7, -58, 11, 4, -42, 157, -13, -66, -76, -22, 23, -50, -81, 79, -23, 11, 17, -192, -84, 54, 284, -3, 22, 135, -66, 2, 141, 104, -147, 115, 25, 22, -33, 99, -63, -207, 7, 88, -129, -45, 164, -340, -94, 134, 60, -137, 82, 328, -31, -169]
3394a69J85Q2l23J26K36j86k21M56J88n90J94K23k59k61M08K36m33J25J96j83
3414C0m12N17M17o18k5L96k61n06N26M04q53o7J068k41q48P52J59q74k65J146
3434D45J23r84N75N88r89o14J010K90j159N82J131q69r90J039J59j354N54J319
3452H56n00q53R45J77j554J03J325j78j002J247O60j554n29J319n26j377J487
3469D6J382j259o88J318m93j762P88J735j023q96J821K70k259J41J591q52j088
3486a228J677J246j900l83J418j125j714J803J429j346j14J933j009k295R34J398
3502G24j455k42K761k50k521N89J443k228j112L154P74k340N23J919k362j858
3518b481K264J103k035Q38K719j606k327J426P94k488N65K971n03j853J173Q96
$$ y = [-169, 16, 98, -225, -99, 137, -49, -270, 186, 374, -216, -22, 201, -58, -319, 89, 325, -108, 17, 213, 30, -382, 135, 552, -66, -91, 305, 44, -462, 64, 468, -385, -452, 616, 375, -473, 279, 438, -436, -701, 445, 568, -416, 159, 747, -242, -856, 154, 444, -715, -133, 998, 129, -861, 178, 337, -1017, -463, 856, 356, -497, 448, 625, -929, -826, 499, 321, -681, 566, 1226, -328, -857, 462, -64, -1441, 46, 1428, 169, -519, 799, 306, -1456, -668, 1067, 44, -852, 969, 1239, -1020, -879, 712, -140, -1228, 449, 1695, -205, -588, 830, -295, -2009, -206, 1223, -123, -237, 1696, 687, -1608, -674, 724, -731, -973, 1788, 1538, -983, -394, 1049, -1179, -2291, 863, 1637, -703, -180, 1739, -623, -2481, -217, 886, -1149, -311, 2408, 802, -1525, -99, 695, -1793, -1228, 1743, 1240, -613, 560, 1456]
3534A456k963p43L042O4j988J829J955k764k019K450J7k442J587L347j874j940
3550i86K042j23l428L38L652p18j751K620P90l938o81K708q30j788L019K263l361
3567a72q36K115j412k604K242L059k177p40K587r42l683Q40K594j203j060L942
3583B550p3l570k4K202k122j792L640J863k747j49K337k248l102K514K059k153
3599h15J83L575j474l536J157J550k344M2L660L99l151R89J570l184j570L447
3615D98N98k072J604K213k870k464K276N12k571J694L465j468k632J821J48k999
3631b247K70L288q2k082K024J183l536r10K538j92k023K640K049k750j617J944
3647D97k62k805J733K872j422j386K320m76l070K95K697j166r74K946M34l130
$$ y = [1456, -1507, -2250, 792, 856, -1132, 697, 2652, -112, -2131, 319, 336, -2106, -519, 2828, 954, -986, 1056, 933, -2495, -2157, 1495, 777, -974, 1646, 2436, -1502, -2183, 525, -305, -2093, 926, 3189, -172, -1008, 1107, -305, -2909, -667, 2392, 215, -525, 2062, 1120, -2563, -1723, 871, -332, -1392, 2550, 2477, -1093, -1117, 1085, -1037, -2829, 811, 2674, -73, -222, 2115, -133, -3235, -721, 1338, -815, -632, 2943, 1469, -2067, -910, 640, -1704, -1662, 1998, 2397, -754, 235, 1805, -1379, -2949, 498, 1096, -976, 628, 2841, -29, -2493, -217, 295, -2276, -582, 2883, 1415, -1217, 604, 752, -2247, -1977, 1311, 1229, -853, 1171, 2354, -1182, -2092, 446, 254, -1769, 871, 2920, 170, -1447, 497, 235, -2570, -837, 2035, 613, -773, 1547, 1071, -1999, -1704, 993, -173, -1147, 1799, 2233, -897]
3663h97k13J880j218j670K544J750k191n59K194j622k238J725J926j598l96K520
3679A937p45k900O49J847j698l04K697K59k375K27J333j770j158K258R09j742
3695e76N03J656j260j829J135J125j473J75K213p91j757Q83O06j626n8J886K74
3712A086j382P01N49j538q34J651J59j039R75J170j404r50R77J88j403N47J566
3729A019p70p99R75J96j660J96J396l93n71Q63N28j428o6J068n73q01Q11J157
3747A148j075m68Q90l73q20L50J109o69n49Q64K06j256P7Q27n47k51Q32K97p74
3766a82j33Q22m90n23P82K97m85k83M91j83o44M10K09n22K97N24j39m55M7K97
3786A37m25j65Q31q2o47K22M01m33j36M05K94m69l1M08j78m87L65K38l86j28M77
$$ y = [-897, -1110, 770, -448, -2118, 426, 2176, -15, -574, 1620, -2, -2240, -515, 1411, -187, -583, 1937, 1192, -1708, -1059, 788, -910, -1214, 1483, 1742, -633, -406, 927, -843, -2001, 257, 1166, -576, -73, 1583, 323, -1506, -371, 754, -719, -544, 1669, 878, -879, 4, 610, -1016, -1074, 812, 1086, -296, 405, 954, -584, -1418, 233, 392, -647, 328, 1498, 94, -856, 121, 309, -1094, -547, 1019, 249, -550, 425, 621, -1039, -843, 553, 160, -411, 452, 980, -448, -514, 554, -19, -820, -9, 1148, 73, -395, 495, 122, -698, -348, 761, 92, -457, 407, 613, -643, -566, 261, -286, -537, 295, 592, -182, -315, 507, 17, -506, 276, 573, 88, -195, 296, 113, -531, -121, 88, -434, -137, 387, 248, -207, -160, 137, -288, -453, 378, 296, -351, -129, 272, -161, -297, 108, 402, -67, -98, 310, 132, -355, 10, 248, -138, -266, 211]
3807B11k75k02J75K84k17k29M34J6l17J6J69J17k00R3l2k56J87J47O0l61J20J32
3829G2J60l92K69l9j52J06j36K17k83K8L78j25m8n9k5n8k03K51Q1j4R7j55m6J15
3853C9j60N4J51j14Lj01M44k86n8J20k21K55J5j66k5p7J50Q1j67l1J19K6k81K59
3877B9r0K8j39K38n4J1qmM2j53J70R7m0k62K88k22j49Q0K26M2k35J62j52K5j31
3902b01L83j76k07L77o9j73j48L83j27k22M11rm64K49m4J98m58J87M23m90J20
3923e7L48p2m05J06L41k48l71L99P1m25J95M51m20l41M56L20m59J75J62k6l69
3944a69K33J24p18L17P11k13n78M52L85r58j2P53j35n84M47M77p01l22N85N4p53
3965f05O81N67n44k49P96n60o96K45O47m36j44P70l4q54J64M82o62k87J109L29
$$ y = [211, -64, -266, -91, 193, -24, -253, 181, 197, -120, -104, 65, 182, -18, 75, 43, -213, -26, 121, 181, -180, -60, 72, 232, -160, 109, 70, -82, 24, -112, 105, -178, -150, 228, 103, 55, -4, -29, -87, -290, -39, 42, 28, 125, -30, -76, 39, -121, -67, 84, -30, -27, -128, 316, 30, -28, 92, -129, 126, 141, -25, -50, -127, 23, 104, -63, -94, 25, 51, -230, 29, -61, -33, -172, 66, 12, 23, 15, 11, 53, -100, 70, 167, 127, -135, 153, -69, -218, -138, 88, 130, -105, 57, -95, -70, -201, 182, 6, -201, 176, 107, -66, -214, 169, 42, -180, 231, 222, -242, 7, -37, 161, -297, -110, 313, -177, -57, 291, 219, -186, -80, 261, 13, -358, 41, 112, -313, -118, 333, -87, -428, 28, 348, -111, 64, 226, 200, -169, 64, 188, -530, -213, 498, 285, -293, 159, 544, -414, -426, 327, 192, -392, 55, 532, -169, -491, 94, 148, -605, 76, 643, 99, -150, 646, 86, -610, -365, 282, -154, -298, 472, 438, -416, -252, 230, -432, -719, 390, 719]
3985G19j054K62K68k98o54P70N46r20L24P95m67q33L47N95q79N1J314l18j035
4004d67M31N29j252j38J381K60j033M88L83o26r31Q30M39q39O60Q03n09j130O41
4023h0M34j301K40J381l04p30R22K79j430k88J024L1p72J121N15j099o61P84L70
4042D36j449R06J271j229k37Q33j77j490L36J513n58m52J194j51j362l42J169
4059B11m16m72J036O78j180l25R59m42j216Q75Q71n35k7Q75o88j258N16P44n93
4078c87NJ601l03j519K32Q64j105m23J555K41q62J88P19j209p96J349K95q14M00
4097C1J026m62j234M64O35j261J55J532j32j161O21K52j209k54J258J91p47O02
4115C07Q11j315o42R68j71q76P02J339n29j010P02j67j070L54J018r9p62Q22M80
$$ y = [719, -335, -73, 195, -103, -757, 13, 559, -361, -37, 758, 291, -542, -195, 400, -479, -428, 886, 568, -467, -36, 493, -759, -897, 484, 744, -289, 199, 582, -44, -975, -145, 294, -545, 115, 918, 409, -721, -80, 354, -947, -707, 674, 370, -360, 562, 841, -589, -877, 147, 178, -594, 527, 1042, -57, -718, 66, 436, -1013, -107, 1164, -65, -302, 531, 354, -1136, -800, 713, 155, -297, 897, 746, -616, -958, 211, -205, -677, 359, 1037, -143, -468, 491, 49, -1167, -292, 579, 44, 17, 892, 204, -1054, -538, 206, -387, -382, 1219, 916, -603, -371, 493, -612, -1035, 520, 761, -101, 87, 806, -403, -1199, 150, 445, -369, 31, 1057, 595, -639, -175, 460, -801, -646, 886, 754, -407, 214, 466, -743, -997, 261, 452, -295, 307, 1118, -197, -839, 129, -42, -918, -216, 1123, 594, -416, 286, 119, -951, -597, 421, 322, -440, 382, 862]
4134H62j376j00J020n05m17J050L58q87l21N69l65o94P09R70p06l47Q32l34j144
4153h26L55P82n34m4J102k15r46j72Q14m55o35J010N47r77P3O95o95o79N70O48
4173D18o42P5Q41m09p86M16L25o33O7J023m65m38L27M60j244K5P64K34p03N02
4193A57K37o08l96O14O9l60K62O19l22m66K30M8p03K15O69k91k27L56K02n67r6
4214c58N86j82k38K67K48j97m51N47j82l39J89O18k62m17N19q1p07J35O62k34
4234A23k33K39K05n10p3L02Nk28M24k10M8l09M21l30k16L76L05k33k48L74j91
4255D1l01K67Q9k78j24L71L22o18J11M53m43l0K22Q8k65J38J83k69j43L72q8n2
4277D6pQ0r4j90K35j31O1j32L31j97k8loN5m3p5K70k85Q9K2j48JJ62j7L4k7J95
$$ y = [862, -514, -614, 406, -99, -516, 534, 892, 5, -316, 253, -112, -806, -97, 873, 167, -180, 652, 318, -826, -471, 311, -223, -267, 835, 620, -326, -498, 316, -139, -774, 236, 783, -194, -121, 574, -121, -800, -230, 418, -224, -149, 692, 283, -503, -87, 238, -395, -328, 695, 230, -208, 119, 579, -665, -640, 124, 358, -345, 157, 394, -214, -610, 4, 73, -287, -25, 594, 272, -194, 36, 84, -619, -404, 265, -26, -253, 103, 305, -262, -358, 228, 46, -192, 75, 323, 126, -325, 222, 40, -299, -110, 508, 246, -171, 348, 267, -440, -305, 357, 123, -110, 129, 334, -176, -249, 53, 58, -170, 254, 44, 92, -217, 204, -126, -342, 34, 339, 106, -142, 232, 41, -260, 7, 96, -182, -306, 65, 387, -231, -120, 333, -110, -140, 82, 170, -95, 43, 226, -43, -186, 186, 98, 46, 39, 119, 25, -165, 70, -61, 0, -132, 199, 2, -26, -29, -35, 20, -23, -98, 172, -113, -24, -2, -150, -149, 13, -4, 30, 3, 198]
4304A98l47J58j64J92J5j78M10r0j56qP1q9j25L49j64R5r6jj75K25k78J71J8N0
4328H1j32p4J24j23K14K4O2l39L69j34k07q1J21O3n2j8J63r0P2M9j58N5q2M0K03
4353A50l33L33Q0l19R1l0OJ06J6L3q1pJ12l25K54l57K99j09R5K12j21j04J5q7
4377g1M2J30j83J46l5j42J74K51k65pK0k4Q2m9k82K83p8r3J49j22K68l30O5J7
4401e4j08Q4Q5q3J84j57J46q6k20K33k25J76j4M8k07K33J52k09n8J41j42L17l90
4424a54K83j66J47j36J29k53p8K43j5k59K50N6j09J76j74K3P3l3n0O6K9R7l8j92
4448h5QJ78k15N5j4O7r7K62j03j87K57j46j01R6Q8J03l03K58o2J2j32O7JR5k59
4473a57L04n2j62L53j99j94J66j08K9lO2m3j19K40n9j24J27j38K62l57L1K62j23
$$ y = [198, -149, 9, -155, 37, 52, -126, 284, 194, 38, 30, 101, 12, -113, 236, 72, 167, 71, 70, -105, 120, -158, 13, 31, 81, -51, -125, -1, -124, 90, 114, 176, -163, 206, 72, -135, -216, -95, -32, -84, -102, 61, -29, 43, 92, -66, -11, -93, -53, 150, -183, 150, 230, -89, 2, -28, -22, 84, 100, 133, 52, 45, 157, -168, 86, -271, 28, -81, 14, 226, 105, 1, 16, -71, -29, 101, -82, 64, 29, -113, 61, 312, 47, 40, 60, 36, 118, 69, -213, 70, -8, -101, 48, -74, 194, -136, -71, -54, -162, -78, 7, -76, 108, -49, 97, 11, -209, 24, -201, -25, -39, 9, -198, 35, 187, -22, -80, 61, -81, 236, -154, 129, -37, 110, -26, 103, -150, -228, 15, 0, -259, -9, 47, -62, 114, -60, -37, 36, 3, -47, 19, 48, 145, 107, -85, -77, 101, -114, -59, -73, -6, -103, 159, 56, -131, 126, -20, -121, -25, 63, 166, -137, 121, 59, 71, -61, 6, 7, 102, -157, 147, 95, -67, 286, 87, -107, 59, -49, -20, -23, 39, -4, -123, 117, 58, -66, 61, -77, 185, -172, -141, 121, -2]
4496bk4j73K20j48K17j50J27j87K74j28l9N5m8K2j48L13l11J17N4mj10K77k39
4519c5n4M5J60k9n1P2N6j31j21j15J57p3J36j02J32j42J68N1k10K9J39j93N7K29
4543A75J37k42J1k7j55K81k45L1j6j32K86Q0k94J62j81p5J60o3L01j40j32P9j97
4566a96J43l5j3k2K1K39j48qL54m34k39M43J65l50R5K00N9n21J35L94l47k37L79
4589G7J03j15r0J16k75j37M45P7m12K49J66r7l49L26J26m48J39M02l17k65J68
4610a11L60k57k85L25Q2k76P6M94n47j16L07L33o21R2N31k59m44K99J94l32r1
4631b46P18o8n33K64j22k11J0L84k95j66L10M94n88j58L37j92j74j8O76l50m19
4652c47N78k07m05M5P00k69j08K73l6p26K24L31l35J26N70K62o94J65L6j64l22
$$ y = [-2, -26, -199, 21, -127, 90, -60, 67, -120, 154, 26, -13, 42, -6, 16, -132, 181, -130, -13, 41, 37, -73, 204, -35, -89, -44, 116, 87, 36, 108, 164, 33, -88, -203, -46, -119, 17, -85, 47, -95, 73, 124, -86, -57, 82, -111, -54, 175, 312, 70, 81, 54, -101, 180, -65, -34, -50, -182, 104, 184, -110, 52, -129, -204, -44, -107, 194, 54, -78, 1, -196, -53, -88, -101, -123, -102, 137, -11, -19, 335, -99, -338, 105, 270, -80, 15, 215, 274, -247, -112, 282, -65, -302, 77, 180, 65, -25, 91, -184, -321, 124, 201, -211, 38, 204, 107, -242, 84, 210, -238, -99, 303, -14, -279, -111, 249, -8, -293, 32, 114, -162, -86, 408, -139, -255, 52, 385, -236, -144, 387, 128, -316, -17, 177, -155, -246, 472, 404, -129, 135, 13, -198, -188, 196, -99, -265, 45, 539, -49, -207, 130, -62, -236, -254, 422, 72, -347, 231, 24, -381, -336, 364, 95, -13, 260, 224, -502, -278, 53, -282, -156, 414, 676, -18, 147, 183, 19, -303]
4673c03L21L05l63j91M81k12m49J23M27j25k17P04j91n04J52L02m46j04N68M7
4693C25k71j7J78l75k44K65N34l66M7K91j96l35j60N69l57j06O10k03l16J34K53
4714B60n39j85M01L14m14L71K47l59m62J28O84o04K56K32l12O7mJn26L82J77N4
4736A69k67J54K19m42r3L88k39o9M61q1j10j96K14J00p22L76N85k43l79L29p1
4757H3l29J52J46o6J51j18J85n00J84J98J28k31J76lo0j56K22j24j51Q7J41Ol25
4780b04M47m35K27j63N4k0j58K30K10j33j02J69j5k07J22J50r5j73K07Q7n31J68
4802a65J23J48k43J68J1j43K70k79N9n4J01K67l51J77J83m9k57p1J19J34k72K48
4824A24k55K7J7J51r7M8j65J78j9J53j12M3j65L16k14J4L3Pq3Or0m3N2J91k18
$$ y = [-303, 18, 323, -40, -231, 250, 38, -411, -288, 139, 14, -203, 501, 310, -194, -42, 260, -186, -290, 278, 325, 54, 37, 215, -160, -404, -139, 395, 29, 76, 367, 171, -164, -324, 245, -112, -218, 392, 189, -127, 7, 260, -279, -464, -63, 251, -163, 208, 455, 96, -366, -238, 446, -158, 98, 330, 18, 85, 81, 82, -444, -62, 115, 169, -98, 56, 275, -167, -260, 128, -111, -180, 281, 200, 90, -106, 108, 208, -514, -138, 447, 204, -175, 154, 83, -246, -94, 52, -14, 137, 19, 204, -296, -112, 86, 214, -17, 159, 156, 96, -60, 162, 38, -113, -26, 115, 121, -204, 243, -192, 35, -128, -74, -94, -252, -22, 188, 55, -47, 122, 107, -100, 22, 172, 77, -96, 111, 198, -333, -165, -42, 106, -137, 31, 42, -101, 169, -110, -51, -105, -4, 263, -88, 89, 272, 223, -34, -105, 14, 148, -124, 124, -131, -104, -87, 64, -33, 15, -150, 28, 9, 162, 50, 93, -72, 244, 30, 44, 77, 84, 1, 7, -83, -126, -74, 117, -101]
4849a01J94k38JL20j93N1j50J73J21j61O1o2J12k00M6m7L0J30k73K38r2p3J20
4872Gp8K96m66M36k41J79qk34M17m44K20L2N2j64l5K41j20rO6l4r3j05j45L79
4896A49k82J19p0J46J56j25K5k41L03k9n4J50r6k86M5o3L96j54l3p8N1k76K47
4919@n2k54L08P0J25m45L17j98K49k83J38Q4J19L3L8j66k96J26L15j03j93N15
4941D47m35o0K58j60r8K14m9q3Qo4Rn0n9K31j98j67L61P3k66r6L07j59j16Q7N28
4966D63n07m6l9M13o09M43K39k96o0K09Lm36pL83k90MJ98K08m08R8R4j49j09j7
4990b18N16l7l39K37j1n06L61L20n10n3P06j88n56J72L03l44j27N09J51l04j36
5011e4N29n50n40P01K11l90J43K95l60m33K58L54n00PP21r0o59M00K10p35J58
$$ y = [-101, 93, -145, -144, 176, -17, 34, -116, 57, 178, 17, 78, 16, 128, -72, -26, -73, -43, 87, -186, 52, -40, -113, 7, -71, 225, -241, 195, -46, 133, 125, -109, 308, -136, 84, 116, 168, 4, -31, 210, 90, 81, 147, 113, 20, -85, -230, 149, -133, -14, -84, 62, 218, 93, 118, -123, 180, 151, 97, 247, 151, -135, -90, -153, 243, 89, 56, -22, 29, -247, 0, -52, -306, 2, 72, 197, -248, 69, -129, 120, -163, -25, 59, 178, 211, 249, 83, -213, -87, 228, 125, -68, 447, 12, -48, 210, 50, -48, 166, 117, 34, 42, -22, -13, -63, -122, 109, -89, -256, 105, 178, -88, -184, 123, -36, -152, -65, 463, -44, -90, -129, 284, -325, 118, 357, 61, 1, 210, 213, -223, -230, 153, -137, -133, 65, 273, -135, -37, 57, -92, -201, -218, 298, 261, -78, 159, 148, -358, 3, 323, -187, -240, 466, 278, -278, -106, 197, -147, -274, 235, 386, 82, -54, 475, -75, -615, 86, 297, -93, 50, 345, -15, -448, -190, 164, -336, -329, 392, 302, -357, 43, 253, -482, -324]
5032c24M74m4j86L77L67r47m9N46k45k61L18O62m85l99L36P2p60K81Q76k72k25
5053A12n0M42j051q2P74j50l65M91O63j054J3L04j98m02O22N38m35m23O66j11
5073C04j207L97J066m98k53P83J98j177kN55n21k64R93K44n98l54R18o16p89O64
5093a57N92n29r8Q26m51q14J45Q33p85j3R78p5q33L06O36q88m08J062J28q68O96
5114B83M41r22n07M93K32m88L17R02m53o49M81J10p69r2J085Q8q97Q16J21q61
5134b69l20N80K33n01N06N77q67k70M83k14n88M88P93n88m18M41K61j012J89P21
5154B25j67k10O03L00j215j02O46j88l86P40L55o65o6K24k64o10N31Q37n75k32
5174b19N17mo56Q3N81q34J45Q10J94q96K70K36l88k58O27K52m41k5M36k73p38
$$ y = [-324, 150, 106, -80, 297, 664, -283, -332, 214, -31, -292, 26, 688, 203, -196, 140, 212, -548, -267, 609, 337, 112, 62, 504, -547, -629, 145, -5, -370, 121, 784, -270, -257, 47, -151, -553, 69, 607, 172, -251, 415, 304, -903, -506, 560, 62, -191, 592, 790, -387, -389, 166, -355, -619, 374, 618, 20, -334, 584, -32, -821, -157, 435, -94, -192, 634, 183, -631, -486, 347, -438, -451, 527, 452, -381, -75, 561, -327, -735, 327, 455, -413, 283, 724, -198, -705, -212, 20, -468, -151, 751, 298, -351, 130, 240, -529, -621, 464, 552, -345, 471, 592, -269, -589, -9, 224, -277, 229, 806, -61, -331, 152, -62, -650, -162, 631, 43, -375, 66, 327, -685, -496, 225, 58, -152, 451, 751, -464, -566, 80, -108, -494, 246, 601, -64, -130, 94, -170, -780, -249, 588, 13, -219, 298, 294, -362, -279, 302, -532, -387, 423, 617, -279, -9, 227, -161, -419, 208, 460, 19, -6, 430, 157, -581]
5195e81O33L9l15M5O63j99n84K40K58n56J00O68j29n98M72K21o80l73Q58j5m09
5216b42N33K73m49m94N22J21n53R9N85k42k99K43J26m87j88Q40j71l35K48L07
5236D37o77j30M33j22k79K39M29l29k65M59p2m24K93J99j8l64M60k46l35jN92
5257B79k12oJ51m5j26k92L60j85n1L14R4k82k9M77k50l69J38J87j92k06L86K91
5279D32l81j11J50n1k87K61M5r4p1L28J31n71Q1L96j19j04N4Q7l86K35J55r5P3
5302A58P8o5k24K9K46k15N7j92L16k31RJ68j59L9J9J6j31l4K12j78j9K34P0l79
5326a76J75K22j56M5J67K5j87L4m7j56J21j3q7q1K24R4k0o2j63q8J22j29P4L08
5350B46k08k9K63j58l53J78J97m1N5p2j09j4K46l47J86j77J26o3J44Q7k58M6M3
$$ y = [-581, 52, 91, -224, -179, 484, 285, -299, -59, 199, -357, -257, 411, 282, -316, 156, 377, -303, -676, 182, 167, -242, 291, 564, 115, -379, 143, 264, -289, -190, 395, 153, -146, 97, 223, -264, -452, 388, 217, -118, 130, 437, -240, -370, 63, -59, -338, -99, 330, 1, -264, 195, 123, -301, -8, 191, 173, -191, 269, 23, -312, -313, 279, 67, 61, 212, 167, 41, -251, 109, -76, -127, 187, 281, -1, -30, 447, 197, -172, -34, 153, -39, -245, 141, 432, 51, -60, 90, 39, -248, 13, 58, -36, -107, 221, 352, -219, -138, 258, 139, 35, 89, 176, -210, 25, 180, 85, 158, 236, 171, -53, -24, 222, 7, 64, -128, 188, -43, -34, 134, -25, 14, 33, 49, -82, -116, 96, -82, -101, 133, 203, -176, -1, 221, 65, 110, 277, 302, 115, 149, 102, -54, 67, 54, -33, -114, 110, 204, 184, 122, -41, -129, -7, -136, -62, 246, 38, 9, 272, 114, -239, -61, 136, 95, 150, 78, -31, -45, 201, -146, 40, -137, -11, -74, 70, 157, -101, -55, -12]
5373a2M2Q3q6k17J73k15J13K16O2k51J34k4o5j08O1N3jj96L18Jm1p5Q0k35j69
5398c59M86j03k77J7L09j16o3J51l6O1l2j09J46j53J89j28k02J44J59j10k3J05
5420E6r1J39o4j50J85j14J55p2q9L4L21k63k39J05J61M6j45n3K50l01Nj97K82
5443c9R7Q5j36l35K96Q1k08M3K18J5l13M16j55j12j95K51J2j27K14K2J19k43K
5466Hm6j67K8L67m3l78K96j5J16k48l7K82l15L09J14l71N9J2J29k27J81K03k82
5489b5J05j5K74n26K5M15j49k34R8P3j59n2K62j74j19L22O1L5k34Q8k91L9K16
5512C5J36j23k0J08K9q0p4j10l9K8L42R7m40r8L45r8n48N54L32n26J30L8J49m31
5536b64Q9K20j42LN37r8l55M6J24l97o6M74K9m19K82N46o92o7L39K7n49K51O36
$$ y = [-12, 30, 113, 27, -190, -17, -232, -119, 97, 159, -92, 42, 18, -47, -155, -94, -41, -42, -238, 80, 81, 40, -35, 45, -190, -359, 127, 24, -253, -236, 73, -43, -106, 45, 9, 70, 38, -71, 75, -78, 111, -17, -219, -75, 84, -26, -49, 56, -35, 104, 40, -110, 75, -39, 116, 44, -45, -11, 310, 47, -192, -87, 74, 120, -25, -78, 172, -129, -124, -321, -39, 58, 143, 7, -328, -32, 49, -159, -116, 102, 117, -196, 220, 65, -47, -242, 9, 21, -106, 108, 130, 249, 6, 8, -38, -205, -177, 190, 147, -231, 65, 50, 166, -82, -119, 163, -152, 157, 271, -100, -41, -29, 100, -127, 54, 257, -25, 80, 65, 339, -187, -162, 253, 104, -130, -32, 41, -118, -170, 92, -82, -201, 121, 182, 217, -17, 71, -220, -181, 35, 171, 48, 28, 136, 165, 85, 11, -99, -138, -110, 232, 329, -111, -209, 136, 38, -510, 44, 376, -150, -20, 18, 167, -264, -175, 45, -97, -94, 443, 345, -10, 36, 160, -237, -303, 171, 200, -219, 63, 609, -83, -150, 189, 216, -333, -82, 554]
5559E54l99m14K38j75j33L6M00j05l50O22J48o34k13N90L9m76L89N68p84L7L57
5580B95l59j19J60L82k52k49N05j29m82k0L63j01j36L87J51o61P3K29j0m25P23
5601C25J21l91o8K43j28p62N69M24k11j36M28k71l44j2K82j85m35Q27J38n20J9
5622h7L56m30l02N15K36m76J88M47m90k66L26P2l12Q6M59k0m83J45J74n40k2N48
5644A24L8r8J92K27m88m25M67p3j99K77N37m80n21L83p0k70J93M66n7k54J10K14
5666B93n97k0O02j02k18J71K87n03k65N53k62l14L24N38n25j34M32j03o06L29
5686a20M92k95k87O20j03q30L65J99m5m64P05K41n73M8J58j38k33L00J99l75R5
5707d1L52k14k75o5K83l55L17L20Km09N5N4m0l05K06K87j09J02nj54k86L53P0
$$ y = [554, 155, -259, -21, -196, -329, -293, 107, 2, -348, 274, 422, -212, -425, 165, 204, -272, 117, 685, -99, -62, 295, -64, -183, -23, 359, 107, -142, 363, 234, -248, -268, 95, -6, -142, 245, 396, -265, -192, 37, 27, -398, 325, 446, 55, -13, 230, 102, -660, -91, 333, 122, -14, 414, 143, -201, -213, 69, -116, -551, 276, 414, -106, -87, 269, -161, -463, 52, 288, -188, 0, 447, -43, -309, 17, 89, -223, -137, 322, 302, -181, -36, 138, -402, -424, 124, 162, 64, 256, 483, -5, -430, 37, -36, -235, 42, 579, 99, -422, -39, -109, -379, -186, 280, 223, -31, 79, 293, -304, -324, 278, 176, -42, 129, 416, -87, -352, 201, -61, -375, -51, 487, -38, -172, 260, 157, -449, -120, 372, 77, -210, 410, 307, -523, -158, 41, -4, -468, 237, 478, -95, -47, 111, -27, -260, 40, 239, -136, -41, 311, 97, -178, -243, 40, -315, 2, 322, 324, -85, -30, 24, -16, -321, -115, 172, 63, 165, 160, 6, -280, 73, 143]
5730A43m50M04J13l30l57L67L22k81j23N31j08j82M1J93n07n3L09R1L0L0o8j46
5752c1j03R7M5j93K81n4J37j79K8J28l58j06N04k54k10L26J57l48m7J86L4p3J09
5775G6j5j02M6k6J69j91J28J69k33k42J8L73m13K10J29j01J10j85K89k27J5P1
5797F8p3k41K67J57m6k11K59r5r4J5L8k3q0K36l2k23l9K96l90J26J65M1l35J73
5821d1O9o2K5N3K27k89p2J05o5o4J3M0N2K7j31J88j52n1j08M09r3P3q3m2n9Q9
5847E8j77n0K87j54K34j42J10j49n7P5M6j25mJ37p8j56k6n1J32l1Q7K31j88j76
5871a67O7M2Q8J29j23K7o5K33m49L15M0k66J02o6J44k03j10L65R5l45N2J98J31
5894B34j33%k72J32q9L03l09L23j31j41qj18M04J3j08l23L86j99J07N0j9j88K7
$$ y = [143, -307, 97, 210, -120, -477, -110, 212, -69, -192, 339, 231, 49, 90, 283, -224, -277, 32, 123, 153, 183, 115, -31, -134, -37, 8, -185, 96, 42, 179, 0, 28, 156, -202, -308, 196, -58, -268, 58, 215, -133, -180, 6, 40, -33, 76, 61, -41, 5, -21, 148, -43, 85, 254, 21, -221, -203, 170, -243, -33, 96, -5, 105, -80, 209, -18, -3, 68, -5, -246, 21, 178, 132, -79, 180, 85, -9, 6, 44, 21, -59, 177, 145, -78, -117, 179, -211, -85, 80, 121, -214, -41, 28, -34, -9, 44, 271, -18, -90, 15, -50, -114, -101, -61, -9, 18, -113, 75, -77, -128, -236, 173, 80, 153, 70, 28, -31, 58, -119, -169, 118, -36, 198, 56, 166, 17, -40, 35, 81, -44, -48, 89, 11, -145, -171, -222, -90, -121, -34, 197, 9, -167, -100, -58, 30, 159, 36, 63, -2, 231, -218, 97, 137, -129, -27, -93, 51, -152, -262, 103, 198, -147, -95, 103, 234, 101, 101, -171, -39, -128, 175, -134, 189, 58, -83, -91, -209, 195, 208, 100, -223, 163, -36, 71, 121, 102, -86, -59]
5917e9m5J36o7k30K48M2M0k6j4JJ03j46Mo3J50j71R2J03J04j76j97M14l17l2l4
5942a40L36m35J55L83m53L8J70J22j90n4L1J4Oj15K14l24K30K17p5j77L8k4n0
5965h3j92J76L26k09K3L45l45p7J33j6j76J19K58m80J52Q5N5l69K03J29j31J4
5987f0K96q1l72N2L94l57l4K59J14j59k31M20l31j37J30R9J2M5K81k83m21Q1L20
6010C7j16k92L11L94l82j77L25J0n06L62J55j94R3L34j78n31N50j56m07M34J62
6031B28l7n22R3M45l82k33N99K16n74L15J59k08p01O75J25k52L3M32N5o02O8J06
6053C8l45L2O94m33k76L16N2m77M5M67O9m18N40M1n28k44N48k84j64M39M16k74
6075B54n23L30O3p25M01M83m3k84L54l2o34O1L89j13j65N18K83q20rO30n14m63
$$ y = [-59, -104, 32, -35, -265, -17, 25, 65, 39, 25, 26, 129, -17, -13, -76, 74, -97, -5, 98, 202, 26, -171, 243, -74, -106, -140, 196, -239, -84, 299, -154, -116, 54, 176, -14, -68, -37, -23, -17, -132, 82, -242, -12, 205, 130, -47, -9, -33, -83, -275, -99, 227, 18, 41, 386, 41, -36, 97, 81, -95, 24, 282, -198, -46, 39, 94, -275, -72, 57, -74, -60, 236, 155, -217, -165, 229, -128, -162, 97, 211, 52, -179, 241, -90, -227, -97, 2, 14, 59, 340, 57, -364, -283, 37, -79, -371, -60, 334, -48, -225, 100, 110, -396, -34, 121, -73, 20, 354, 176, -355, 195, 39, -368, 66, 228, 191, -331, -238, 207, -175, -408, 191, 407, -167, 148, 307, 99, -602, 73, 198, -54, -21, 411, 466, -136, -68, 38, -307, -275, 419, -14, -290, 26, 78, -399, -354, 113, 182, -236, 304, 345, -183, -427, 121, -163, -327, 112, 528, 254, -269, 61, 124, -601, -200, 283, 240, -44, 310, 278, -356, -295, 94, -19, -184, 334, 617, -203, -212, 418, -96, -559]
6097e59L92N23n26l2N89k69p84N94M42n30k00P09o1n54K84J66l93k56O67J63o36
6118b71K79L26o03m52O04L45n34L46L53l29m92L22L38o20K98P72k98o83M01J18
6138B20p57lQ47j9o66N32L52q93k84P54%n80N09N73n17k07J97M0r48Q00N72k97
6160B25l76M76p6p91K06N63j86l98N91J62o39pM49k59m21M00N57l49l50M61p5
6181A63n93K16M59l03n0M40K6o71J46J55n1m59P65K09k66m37M83l65l30L87L12
6202B36m49K24M24n60k81L57J05j73L7N03j83m83J84L89m99k68O81r7l61L42J47
6223B75m98o3K55J13k65K43N55o07l05L94J1k66k93Q48k74k10K94j58k28M5L43
6244B09K54r16O23J02m83l5M18o1l15K64M19m48k3J03J25m11J2M77j36j65j7K74
$$ y = [-559, -167, 356, -170, -202, 387, 118, -666, -72, 370, -160, -360, 349, 288, -266, 18, 184, -209, -465, 202, 365, -271, 8, 334, -269, -721, -117, 228, -306, 40, 393, 64, -428, -106, 232, -388, -90, 682, 384, -299, 102, 220, -537, -540, 307, 288, -378, 154, 506, -387, -671, 83, 83, -497, 12, 585, 68, -139, 58, 98, -850, -50, 522, 225, -151, 325, 249, -542, -336, 227, 41, -357, 234, 396, -243, -250, 199, -60, -481, -81, 476, 127, -223, 238, 163, -430, -214, 245, -58, -108, 332, 358, -313, -167, -12, -63, -522, 243, 452, 186, -251, 232, -133, -463, -76, 236, -213, 11, 435, -125, -406, -49, 56, -117, -80, 423, 240, -243, -59, 330, -169, -437, 244, 147, -214, 128, 275, -223, -286, -31, 82, -183, 60, 615, 8, -297, 97, 108, -158, -451, 397, 123, -87, 207, 49, -179, -134, 209, 463, -453, 170, 272, -211, -246, 172, 111, -204, 60, 479, 31, 8, 111, 236, -175, -163, 314, 178, 13, -4, 270]
6266B70m86p2O06k30j28K83J09k39j73J94j43j98N4M96k01j45Q2r7k41J28R4j48
6288a85J37L70j79j13L7J26k91k8J21J93m30L46p8l00K87j46R8k44L30K6j7k74
6310b14K09P7R9k52K29L7l87n7M01k78k14M33J09n28R7M67l97J59J53j7j7j74
6332f5J56j73K44k36K45k22L3N1j10J48J13k94j10K31j00L34q0j19N2m4k59L31
6354A26l11J45K14j8J67k24j95M6j51J52J04l38L81j97K73k52l9K16k02%K37K4
6376A58l7j97j41M21k73J56p8L7j58Q0rK71j37k7l01J35L62k84L9j47K21M1m45
6399c13M37m9J3k50J48J39j60q4J65l83L87R4k09l6K13o5%j42J35l7nJ69j28R5
6423A34l01L91j05k36J0K40l17K17J54J0l17p3L43r7k1L0K68l56K40j40j49n0
$$ y = [270, -216, -288, 318, 88, -40, 243, 352, 113, -60, 134, -9, -207, -153, 343, 142, -3, 79, -18, -259, -131, -37, -185, -48, 322, 143, 30, 67, 193, -98, -126, -5, 188, -242, 104, 26, -274, 13, -133, -35, -279, 51, 77, 60, -214, -5, 72, 171, -81, 148, 185, -202, -259, 142, -136, -350, 83, 192, -336, -239, 228, -169, -10, 143, 126, 109, -65, 91, -82, 162, -74, 171, -51, -18, 33, -77, 71, 184, -110, -220, 11, -89, 245, 165, 46, 98, 54, -205, 126, -185, -40, 174, 156, 323, 99, -96, -50, -201, -49, 55, -283, 98, -99, 174, -78, -117, 99, -103, -103, 134, 158, 121, -76, -217, 204, -69, 87, 9, 46, -112, -32, -41, 230, 93, 66, -235, -100, 262, -22, 17, -130, 91, 132, -313, 124, 75, 88, -162, -14, 125, -35, -119, 46, -337, 50, 144, -65, -101, 112, 47, 47, -95, 40, 3, -2, 167, 39, 134, -167, 224, 119, -117, -107, 133, -184, 33, 187, 197, -120, -193, 150, 53, 32, 62, 330, -26, 214, 74, -75, -125]
6445a25L86k76o8Q8M3K4l9Q9o2o9j0L45k09k27M6r3K65j5q7O8k62J67L24m33n1
6470a81M10l59j18J91J85p7j57J92j23k04K22J7K68k56K24k8m84J87K06k93L1
6491a47N07J81o85J59P1o4k54M43j38j8LJ49j28l06R3K76k21P9K16rl79J78J06
6514A12k24l4J65J89k59L8K41l00l31M87j0j10J08K33Mn95K48M84q21J12N86k27
6536I6j73K02Q5k65l09M46R7j15K35K95r02J28K64j65k15N00M43n49k60M62r8
6557B02q61L53P82l74j99M94k18m13J06M20l68k60N47K44n67J42K44m17n45O85
6577cL79n10K68L33m02n50K76N37m75n5N93L3o12J23K65l20k90R95j11o63K44
6598E5L39m84m22M45L82n67J97P17n01o54O00po68K54Q61m06k76K38n2n41j04
$$ y = [-125, 261, -15, -83, 5, 48, 72, 33, 122, 60, -9, -19, 326, 117, -110, -64, -157, 108, 93, 6, 74, -188, -21, 303, -130, -181, 229, -130, -248, -57, 128, 51, -106, 86, -37, -241, -19, -2, 266, 10, 234, 206, -278, -91, 115, -178, -147, 360, 541, -144, 15, 86, 22, -232, 211, 73, 55, 58, 207, 79, -227, -134, 142, -79, 0, 216, 207, -172, 6, 112, -112, -146, 19, 208, -51, -13, 228, -72, -403, 84, 74, -36, 72, 305, 309, -286, -38, 446, -375, -263, 323, 96, -77, 125, 210, -55, -364, 82, 179, 64, 299, 594, -308, -180, 84, -81, -296, 204, 647, 98, -162, 300, 202, -659, -306, 476, 102, -97, 397, 179, -234, -128, 292, -76, -336, 211, 455, -112, 30, 274, -143, -688, -3, 376, -134, 134, 467, 65, -485, -209, 328, -147, -202, 391, 424, -188, -65, 200, -120, -410, 585, 474, -189, 55, 394, -90, -512, -67, 315, -252, -55, 662, 161, -493, 107, 100, -568, -314, 547, 141, -135, 103, 51, -490, -594]
6619e94R20k33j54K35L64p25m08O59j10k41J36P92n47q7M5J18n87R7P39k43m15
6640b39N52J36q34J50M61l50k96N44L97p96K5L20L6q36P73M92o41k98O93j4o45
6661c70K50M04k92j16O58k71n05j07M43l91l15R19L67o47j38L72j86p62O08L58
6681B79m39J29M20m3j039M98L65m85k3Q80k66l90j3L04n17j96O25J93m57L05L13
6702D43m78n79N10K08n35N82M14n77j31K84l2n47N14M05l75k58M96k20m79J07
6722b48P02l02k55K96K93o72R7P4p0j97K80O99o70l70L50N4l96J15M00k49q1O08
6744D58k29m63j73O62l57k98N73Q6k64j22L41k61l90N49J70l81n2L91k19j32L5
6765g6M40n01J04M33l53j90N4K01l19J80K37r9l33K18K15l21r4K50K20l51l6K55
$$ y = [-594, 326, 93, -61, 174, 538, -187, -595, 64, -46, -287, -151, 641, 94, 7, 52, 170, -417, -320, 419, 176, -239, 313, 449, -385, -235, 226, -124, -420, 124, 521, -275, -250, 70, 106, -730, 43, 535, -106, -404, 289, 275, -370, -120, 284, -8, -124, 534, 263, -242, -349, 94, -297, -612, 307, 674, 27, -111, 261, 75, -687, -79, 279, -160, -31, 389, 346, -693, -195, 170, -315, -338, 542, 276, -114, -127, 177, -340, -536, 89, 282, -175, 130, 443, -35, -614, -104, 104, -431, 151, 565, -12, -143, 141, 109, -438, 76, 481, 106, -152, 344, 124, -355, -248, 454, 152, -103, 193, 486, -186, -89, -15, -85, -282, -2, 697, 27, -343, 7, 61, -335, -220, 180, -69, -150, 458, 229, -234, -407, 255, -102, -400, 173, 259, -5, -127, 214, -47, -437, 112, 282, -99, -151, 240, 21, -111, -76, 364, -137, -33, 400, 47, -143, -89, 112, -207, -27, 210, 111, -222, -4, 211, -110, -204, 46, 266, -85, -121, 134]
6787A34j92r4J69P9k00J9J45l2j60J11K95k66mJ47l9k35J06N9j56k77M20J37l39
6810a73j5L16L0l90K82p3o0j65L85j20P7Nj57q1L7L10j59k03Q5K66k07j82J30
6833f2K27k53k5L43k45j67J5O9k4L6L09l40J48O8J58m16J16J17J0J43r2J19k52
6856Bq6J10K50l10J91j38j67K14o3n1k21M73j20J0j05K50l26KJ57K3k2j48L1J9
6880b5J74j59J77k21K33k0j90j6n6J15N4o9j01K06j53Q4M8P1j95Q4J1r3J35J74
6904B68j13j90J16q6j02J29j5K0j83K42N1j82O9j20O2K1j33K71j71J32o0K8k46
6927a92K13Q3p9Q2M1j11k82K98K1o6j05J75j26k84L79J79k24p8J81J70l28j92
6949b45L91j67j39K51j41K42l8l37P7Q7Q2K7j22l7J16j53J34OO4j49O6J64r6j85
$$ y = [134, -58, -152, 17, 96, -104, -85, 60, 28, -132, -21, 274, 8, 4, 151, 112, -123, -17, 42, -114, -391, 29, 166, -173, -188, 128, 158, -232, 50, -23, -83, -248, 137, 17, 94, 99, -58, -139, -102, 208, 49, -154, -69, 197, -10, -192, -62, 165, -88, -113, 230, -15, -182, -167, -98, -122, -86, 223, -117, 31, 99, 257, -159, -43, 74, 84, 227, 135, 254, 2, -84, 26, 276, -34, 157, 19, -148, 66, 3, -48, -269, 204, 84, 94, -11, 239, -87, -85, 72, 95, 73, -75, -44, -25, 149, -10, 167, -54, 179, 159, -31, -47, -103, 12, 66, -3, -104, 102, -51, 33, 81, 152, -43, 41, 52, -41, 94, 268, 155, -35, 81, -5, -107, 22, 7, 27, -156, 86, 137, -45, 24, -96, -34, -13, -146, 125, -46, 86, 26, 54, -192, 21, 104, 25, 107, 148, 37, -245, 53, 74, 8, -97, 78, -48, -332, 47, 226, 2, -76, 105, 275, -53, -245, 146, -21, -160, 91, -50, 192, 154, -183, -106, -19, 63, 90, -32, -69, 47, -106, 28, 34, 98, -51, 15, 179, 83, -102]
6973a02j79J72J35p9M4Q7j51J1M57k23j72m5J98k51J01K13rk14j66J38q9j43L68
6996A01J9k91JK57j89j23J33K78m28J12M60n03J40Q7L23o81K24L71k77j73M48
7017B89j30l26L3J77J35m30M86Q2k97j29L80o8n69L52M58n06j18N18m34k24J78
7038a43L75k96j00L64O5p23J64M52k74j87P29r7l03O3J24k49j95J93K69l41P1
7059c9K50J07o99K53J53m31J99P23k85m91L06K80l73l8K83J81m99K42K81m19o16
7080f32N48M03n34k5O37l11l00K84j22l32J44O42j28m33K30M17q45r9M78jj73
7101a52M02K39o71k78P09p7n28M46J90j69j22J46j3n98K80N06j58k31M65Jn56
7122a69k02P55p36j6M04M83n50p5L66k87o26O11M20m56R7L34j90o78L62M12n09
$$ y = [-102, -281, -109, 26, -53, -9, 78, -73, -62, 395, 172, 0, -45, 153, -98, 3, 216, 207, -7, -173, -35, -124, -267, 101, 120, -171, -170, 87, -102, -225, -92, 186, -242, -130, 330, -173, -33, 54, 377, -304, -80, 291, 14, -159, 289, 159, -167, -134, 43, 178, -252, 234, 316, 19, -110, 270, 202, -367, -15, 443, -63, -181, 337, -97, -321, -143, 232, -64, -164, 200, 265, -458, -294, 158, -116, -303, 426, 329, 26, 89, 213, -36, -231, -38, 231, -110, -39, 211, 318, -381, -128, 25, -406, -207, 516, 231, -260, 46, 326, -47, -85, 198, 379, -120, 122, 403, -16, -632, -84, 319, -215, -240, 397, 86, -214, 70, -52, -384, -240, 402, 274, -159, 71, 488, -357, -456, 22, 21, -152, 250, 489, -182, -460, 249, 172, -356, 90, 280, 111, -11, 135, 122, -476, -196, 310, 152, -79, 386, 387, -169, -371, 384, -352, -368, 36, 519, -31, -106, 260, -27, -653, -42, 378, -78, 19, 353, 163, -515, -153, 259, -250]
7143b50L3N29J69p21P4L09n78j02Q38ol53J51J04l26m19N66J36n00N11K60l63
7164F2k55J08K86o07L5R39m60k95M40k94r7k35O01Q6l01K75Q4m31m4LK09m36J73
7187a54O12j82m48K21j3m75L86K57m6j17R1J41l90j73M13o7l37L48L10m09k13
7208b45M54k05j94J01M07m26j29N14j14n47M18K19k48j65L35L6m57M5L98l27k32
7229c62O51J4k86k2J08j97j09L49P8l56J15J63J2m37J12J52m7j93O12r1l90K5
7251i9J89L1l72M55p4J6m42M35j40k30k0L26k80K00L59j72m88L18M4n9n7M44j44
7274B40l37K43O1l91M5K32kJ23k21Q6k93J75J0n0r6P0M11l62O1p4J21jj40J93
7298A04p7n7OJ31k12j4J14j76M5J50mR6j18P4j76m0J61J77Nm36L41rj92K79q0
$$ y = [-250, -217, 312, 481, -240, -166, 143, -435, -537, 301, 295, -58, 93, 197, -129, -548, 18, 154, -346, 165, 425, 62, -193, -85, 201, -406, -371, 568, 108, -187, 253, -41, -138, -373, 228, 314, 13, 288, 372, -59, -103, -100, 109, -327, -154, 458, 276, -172, 49, 36, -439, -53, 204, 158, 41, 132, 273, -117, -290, 123, 56, -281, 67, 377, -32, -245, 209, 4, -190, -89, 318, -108, -237, 277, 163, -384, 34, 253, 5, -160, 175, 211, -246, -201, 197, -130, -362, 289, 303, 17, -5, 103, -94, -203, 146, 224, -132, -17, 146, 158, -279, -167, -15, -62, -255, 357, 266, -124, -99, 90, 121, -251, 204, 130, 146, -296, 139, -1, -231, -251, 75, -205, -5, 354, 182, -306, 12, 56, -3, -60, 384, 240, -97, 146, 207, -184, -139, 93, 91, 214, -7, 79, -214, -39, -29, -79, -175, -105, 306, -56, 5, -69, 52, 51, -89, 104, 27, -30, -24, 107, -105, -119, -5, -181, -136, 14, 10, 106, -12, 62, -114, -154, 7, 184, 189, -247, 94, 85, -107, 172, 92]
7323I2j27O8p0K27j4k62K52m25L21k62L15r3q6J03N9l26mL61K4k00n9n9Q2pJ21
7348C1j58J26l0P3o9j39J85r2o3J06K61r2M2k35J11j40P7K70l23Q0m7j9j94K68
7372B9MQ9j08J08j23n9j38J49Q4k0j78J06J32k66L68j90m1J01K23l64K22k16L4
7395e4l5K38K1j16o0J06j66L7J87j65j70P5K68k34J70j74J69J52m26J08J58r2
7417cO3M3j79K33k7K8j92l2r2K79p8o5K71l53pmJN4K57j65k27K07j67J01J33J01
7443A80j21j83jO6J16p6OJ58k22P4m7N2j25J98Q3k89J17M1N4q1n1R9J47l24L38
7468B09p5k26N5J70l84J44J11j2j6JK93m76J06K16o3k44L17k4J7k18N8J7ok5J21
7493F6K7j77K53k01J48j39R7L1n8l5J23k9k75J41J37k70J5J53J17l00K66J5k60
$$ y = [92, -35, 33, -37, 190, 176, -86, 166, -259, 62, -200, 115, 22, -64, 39, 98, -228, -232, 129, 153, -47, -106, -165, -83, -90, 31, -127, -1, -31, 42, -27, -166, 19, -73, -136, -30, 231, 139, 181, -54, 57, -83, -6, 264, -59, 21, -26, -45, -239, 29, 33, 122, 14, 122, -1, -60, -198, -49, 35, 15, -163, -57, 75, -191, 177, -13, -54, 47, 270, -94, 128, -88, -54, -89, 149, 170, 54, -6, 100, -66, -29, 158, -7, -177, -102, 166, -68, 102, -72, 97, 249, -177, -69, 89, -3, 60, 103, -76, 157, 130, 158, -34, -66, -158, 121, 43, -22, 249, -104, -111, -115, -114, -60, 197, 32, -195, 12, -155, -54, 79, 180, 59, -124, -125, -59, 57, -19, -13, 145, -77, -3, -50, 2, -123, 75, 158, -131, -14, 27, 81, 0, -51, 48, 195, -129, 209, 134, -92, -37, 133, -251, -107, 4, -8, -24, -23, 270, -206, -100, 116, 53, -191, 126, 102, 119, -99, -41, -24, -30, -55, 66, 93, -84, 169, -32, 116, -23, 74, 105, 47, 12, 135, 106, -169, -28, 109, -161, -146, 7, 124, -176, 90, 105, -155]
7516a55j60M32pj03J28o0q7k39J10J80k49o3N55m24J82L7n7k23O3J84j46J73J12
7539A83q3l8j43J65j19J1K49J8l09PJ90k41k9J60N6j53P1J02J1j11j85K16k06
7562a78O3M66k03k65L8J16k96K25L03N0m96L45n4j55m4K68j94j94L16P1N9m22
7584a81J32J59k68J40K73jl19J81O8l65J98L2n3m70N84M28o91l3K80o4k72L20
7606G8M00n87O3L56k83l41P5N22k23j89L47j79j41J61j37k00J03L56J89n08j4
7627a52M64m13k96N48J33m20K23J95k73k72J74J14j70J44K98O0m67J9M27m52n5
7648a71L06O1j85J78K18m45j06K26K0l22P0N76m59k61K92j3j51r5N78j44k50l4
7670a11L79m08j47M38j7j79jL25m86L16J91k93n2L43nk35n17Q06l87j13j11L59
$$ y = [-155, -315, 117, 110, 7, 135, 75, -12, -251, -141, 39, -210, -273, 282, -142, 40, 77, 20, -203, -140, 44, -102, 71, 183, 100, 62, -81, 84, -35, -24, 225, 243, -66, -59, 131, -110, -139, 21, 77, -76, -5, 97, 108, -3, -188, 28, -178, -115, 351, 148, -117, -79, 37, -259, -34, 269, 319, -177, 168, 114, -41, -85, 183, -11, -205, 111, 182, 241, -181, -49, 110, -158, -18, 255, 254, -65, 116, 184, -181, 17, 49, -4, -474, 110, 538, -153, -186, 94, 30, -242, 78, 478, -109, -46, 310, 27, -314, -239, 283, 60, -129, 218, 39, -102, 59, -78, -278, -175, 181, 370, -138, -152, 312, -101, -397, 151, 284, -136, 87, 282, 9, -263, -89, 25, -145, -1, 297, 357, -110, -91, 336, -116, -171, 135, 196, 11, 189, 407, -38, -144, 82, 102, -220, -150, 426, -33, -294, -2, -15, -166, -261, 317, 173, -77, -111, 268, -140, -287, 151, 134, -45, -46, 279, -207, 109, 300, 7, -45, 298, 293, 58, -459, 347, -40, -153, -264, 95]
7692I5n3n6L01N1m02k19K16j26QJ91M07o36K25N1j06k20M17L47n32j22L40ql56
7715a87O3M76l2m79K26k9k54K53J4j6j95J08K22j30K2J87l58j93K91K09j00j7
7737H1J91j90j21J30k05N3l15N43j67k12K08R3l11j90M70Oj60J41J34k07R8k37
7759a67K13r1K23k41o3j0M6K13j91n3M50j80k93L80r7l34K58l4j89L8J68J24j56
7782A4k42K44m8j70P7L35k22q3M3P1k52J67K16r0j04J96K2k56j29K37J13j98J5
7805d4R1r6j47K35rj25J05M7j25j78L93l3j07p4j7n3K8K65L1j16m9J33j91r7l3
7830a66J38P2j22MJ46j20j92L33q2m1r3K53k37K10o8j11j18J02R4Rj58J44pN1
7854D1j04PM5L5K0j03M1m1o4J28J87k02m4j01K99j33J02j31J60r9n5R4L4J03k53
$$ y = [95, 42, -14, 287, 338, -64, -283, -67, -193, -185, 6, 413, -223, 2, 53, -53, -273, 144, 491, -41, -163, 177, 169, -187, -124, 352, 320, -159, 67, 38, -216, 37, 51, 35, -160, -52, 170, 40, 62, 249, -109, -302, -11, 198, 98, 81, 272, 82, -39, 91, -114, -61, -376, 167, 0, -212, -4, 89, -222, -412, 58, 64, -96, 45, 179, -28, 70, -167, 46, -45, 178, -63, -126, -136, -90, 123, -68, -121, 329, 149, -144, 236, 139, -195, 63, 29, -160, -122, 46, 170, 14, -228, 16, -32, -202, -125, 210, -12, -95, -52, 19, -233, -66, 150, 60, -44, 152, 174, -82, -211, 26, 139, -59, -44, 47, -49, -196, 39, 30, -95, 10, 57, -68, -246, 147, 114, 7, -67, -84, -137, -109, 156, 187, 71, 22, 155, -36, -133, -166, -28, 44, -78, -74, 72, -48, -240, 93, 11, -30, -123, 130, -107, 103, 35, -76, -194, -92, 2, 11, -147, -3, -10, 41, -63, -56, -11, 24, 44, -59, -18, -59, -123, 5, 192, -10, -54, -155, 144, 11, 113, -18, 142, 43, -12, 82, 116, 219, -34]
7879c4J30J12j08r1Jj75n3K08m6J4P7j23J79M5P6j61K22l35L22k22L9k1k7k15
7903a86P4J39Q7k73J67R8l69L34M7j34J04O4k6j23k30K15mq0K36l12J73K5j76
7926a50L60j85j45J0K31kj41K8q8m0J15pR2k9kRk80Q5J64j2J04J16k35n1mj0N5
7953a2o7K13j54j94Q3N8j45Q4J45o9j25Q8P7l6K4J1l3j05K06n9P3j25N1L0j93
7978a74l5J11Q4j5M02k54k01q7M5K0L3o1L74j45j16P7j11J50j79J51k23J12L14
8001B72k63k67J92K50k90r9K48L3k27K43l7l87o3L87M8j36q7K93k57N2K78l56
8023a73J70m3J47n0j2pL1k96J55J48P9j50r0K46j22j82L49k33M3m1K22k69%Q2
8047Dj72M6o4L31k14J70n1J32k86j13J88l7J00M47n52j15J85L32m62K78j32J18
$$ y = [-34, 96, 208, 100, 9, 10, -165, -218, -10, -56, -42, 35, -88, 91, 136, 212, 51, 273, -62, 260, 38, 77, 56, 29, -186, -112, 27, 114, -159, 8, 106, -263, 71, 118, -16, 88, 152, 126, 3, -227, -12, -16, -96, 140, -172, 1, 26, -150, 210, 25, -120, -110, 121, 119, -22, 6, -82, -122, -7, -14, 78, 49, 47, 56, -224, -139, 25, 13, 117, 233, -2, -53, -57, -67, -12, -79, 134, -20, -214, -131, -73, -218, -134, 11, -58, -183, -95, -18, -54, -30, -19, -52, -157, 49, -10, 63, -62, -11, 19, -174, -209, -98, -14, -29, 373, 119, -82, -169, -124, -104, -71, -132, 242, 97, -19, 58, -53, 97, -82, 69, -154, -42, 272, 9, -258, -66, 184, -106, -205, 43, 76, -151, 92, 55, -332, -395, -8, 40, -96, -183, 110, -147, -95, 183, -173, -3, -46, 101, 51, 39, 32, 63, -233, -78, 70, 149, -1, -91, 155, 33, -149, 200, -33, 10, -31, 191, -78, -78, 4, -168, -122, -186, 145, -69, 101, 50, 182, -104, -217, -29, -66, 34, 481, -71, -186, -1, 331, -131, 147, 15, 133]
8069A33k44J95O2l88J43k3L99k49j34K97j12k92L09Qk69k2J70J25j17J51R5n28
8091b91J81L4j65J84k2L78l06k44L30P9m82K97L98m94J06N0J68k98q4K50j35o3
8113a29K87J14l24j97L47l3m56M29L63k94j75K97j58k07qL08j63j11M29l28j28
8134a37k11L49j58R3K57J54n23K27p5J4l73L02J61j08N5N8%l17qL85j84J39J93
8157B93k00l70K72K71m86J2L78J03k71K9R4m6n6O7j12J48R1K22l24m58L97l9j74
8180a59Q3L60k72p8J44J40m41L9L14j02l19
$$ y = [133, -111, 84, 146, -242, -99, -122, 277, 28, -106, 191, 79, -213, 96, 104, -165, -187, -17, 108, -9, 142, 237, -291, -110, -76, -241, -57, -79, 299, -7, -251, 79, 158, -324, -27, 371, -123, -17, 33, 201, -97, -181, 69, -66, -129, 158, 272, -52, -249, 98, 65, -391, 38, 401, 107, -68, 229, 71, -136, -144, 164, 1, -110, 319, -9, -137, -348, 1, -157, -64, 193, 347, -176, 51, -24, -10, -383, -81, 80, -28, 27, 85, 85, -232, -240, 145, -39, 100, 293, 93, -277, -5, 266, -220, -208, 170, 273, 2, 31, 125, 79, 23, 90, -22, 126, 217, 439, 115, -343, 54, 15, -159, -76, 284, 12, -66, 78, 218, -223, -184, 130, 28, -291]
8191b91
$$ Imaginary data points
##PAGE= N=2
##DATA TABLE= (X++(I..I)), XYDATA
0@%%%%%%%%%qJ6j6J9k7L2m0N4o4P5r0J11j35J62j90K22k62L04l51M05m67N38o15
32c27O98p90Q94j010J134j271J423j589J771j969K184k422K682k964L273l610
48a893L980m386M831n322N865o469P143p898Q755r734J0866j2190J3762j5673
62h363J8046k1087K5145l0867L9596n4690Q7962k92817J59930M13957m34379J34462
74C6895M16297l34918n73044L14212K51483l52447P3317O18934j24619n09221
84a83111J55351J90359m78201q6429N84554R5249l70323K02071K47599m81587
94a24468l11605M17826J10800l09098K49034M23453l29648l69832K58530L9493
104E4485m03304J51312N11848j23401k91649K62228N1737m96910n1371M34988
$$ y = [0, 0, 0, 0, 0, 0, 0, 0, 0, 0, -8, 8, -8, 11, -16, 16, -24, 30, -34, 41, -49, 62, -73, 89, -101, 121, -141, 163, -188, 217, -250, 288, -327, 371, -419, 475, -535, 599, -672, 751, -838, 933, -1036, 1148, -1274, 1408, -1556, 1717, -1893, 2087, -2299, 2532, -2790, 3075, -3394, 3749, -4149, 4606, -5128, 5738, -6452, 7310, -8363, 9683, -11404, 13741, -17126, 22470, -32220, 55742, -237075, -77145, 336812, -97567, 36895, 453192, 118274, -454770, -140558, 110925, -241522, -168205, 450729, 326110, -183111, -27760, 162599, -315602, -402031, 182523, 277772, -92551, 109520, 357119, -124468, -436073, -18247, 92553, -216545, 32489, 455942, 126294, -243538, 14992, 54485, -348819, -197507, 314341, 190940, -100709, 161519, 213256, -283654, -335025, 99963]
114I9963m1861k21342L33774K07735m39339j89643L05313q2117k89485L12645
124d357L55986k73628j76844K67644r8297m07404J49878L66129j54755j23020
134i8668L29897R378m28715r445K74309j52354j47153L51864J66104l18842o0950
145h4575K18569j77424k56103K59451K37135k00955k7134K51328j26400l24770
155b30878J12957J98976j66290k7255L05131P47k89085L5518J45508j95456j00086
166b10213K79695R8137k00039M0665J59450j89248j89056J85628J06055j59482
176g8408N6638K13295j13889k05398J04874P4207j74646J4112K33923k2813j63270
187f1375Q9221P4845j89445n8282J88649J6720j25290R5418J16348j53213j07083
$$ y = [99963, 58102, -163240, 170534, 378269, -61070, -250713, 54600, -27517, -317002, -4357, 351629, 78001, -98843, 168801, 70504, -336900, -187022, 179107, 24352, -98668, 231229, 240607, -188108, -197553, 76756, -75598, -222751, 129113, 295217, -23625, -84575, 133994, -43430, -299533, -40082, 197053, -3902, -31036, 220292, 93892, -230878, -117921, 81055, -85235, -112490, 192641, 193388, -95697, -60179, 85329, -110127, -210213, 69482, 167619, -32420, 8245, 167695, -21553, -210609, -24981, 81074, -78408, -21770, 191525, 77636, -127762, -22888, 51319, -123327, -109215, 124708, 101895, -61375, 27846, 102691, -86754, -145036, 43613, 60333, -64957, 30461, 146809, -6404, -113487]
198a13487J28253J2149j30817P6275J51733q7287j00478R7881J2140j45533K1105
209g8066J46240l6838q0994R7745M1083j37291k6572J08873k4862p7534Q6624
220A8408P4283r7030m4476Q2121k1858r1273N6768Q4674n8416l5473P4596o176
232C6148r0898J9518P0337l8242l3366P1135J6414p4677M28N0878l4838l7771
244d4934N4651K8667m9822l474M3638k6450m3919L5999K8673l5751l13M2339j4041
257A5263l8600J9522K2255k9734o478L7787k210l2240J3164J8776k6465j2077
269b1037K7847L364k3186Q457K0465j6893j5785J9748O788j9246M566J8980q807
282E261j3435J0708P196j3984l124J4161j755j2298N658P563q665m680Q036J673
$$ y = [-113487, 14766, 26915, -103902, -27627, 124106, 36819, -63659, 34222, 46362, -99171, -78066, 68174, 31336, -49658, 48087, 89170, -48121, -74693, 34180, 9318, -68216, 18408, 92691, -4339, -48815, 33306, 11448, -79825, -23057, 61617, 3201, -32272, 42324, 36148, -54750, -35232, 35105, -3137, -36503, 34632, 51046, -23631, -23203, 27675, -7163, -44934, 9717, 38384, -11438, -14912, 28726, 2276, -41643, -5644, 23029, -12722, -13035, 29304, 15263, -23337, -3815, 18440, -11294, -17772, 20015, 17805, -14435, -1271, 17505, -8960, -21037, 6810, 10174, -13012, -4555, 15910, -983, -16768, 2980, 9768, -9478, -4912, 14068, 5261, -8174, 2534, 9730, -4254, -7378, 6783, 5028, -7270, -1612, 5951, -2714, -7394, 642, 2315]
296B315o107N12O140j035m672L129L444k832j124K426N62j731j491R50J281k461
312f94j234J923l54j953l56J934Q50k411M71L735j327j980K594J507j271j206
328B28J388J235k315j722K467J6l310K2K539n65k842K03M015j749m257M458M019
345C830m950j304O759k62p004J916P263m856o557Q552L381j1513o16J0163m685
360A17r704R263P777j0864l315J3504k822j5094R235J2990j2716m538J7152j647
374I338j8747N227J4133j3824r024K1791L705k2903N098J7566j8254j4941K4873
387D038R751k3381N699K6473j8869k6596K4086J3640l0133M966L8497j4194l3948
400a9971K1534J6309l9819o175M8749k843l8112K5295K7981m8164k3233M9454
$$ y = [2315, -3792, -3280, 2860, 1825, -2847, 282, 3726, 894, -230, 2196, 2758, 1027, -464, 486, 1767, -694, -1928, -5, -359, -2312, -2668, -734, 116, -2295, -1824, 1911, 584, -1396, 1198, 2705, 1434, 228, 1616, 2851, 536, -1186, 1281, 1297, -2013, -1991, 548, -17, -2859, -2656, 1359, -390, -4647, -189, 3830, -1120, -2424, 4335, 4073, -2931, -1015, 6248, 1392, -5165, 3387, 6768, -4745, -5361, 4802, 117, -9587, -324, 7453, -3411, -6726, 6778, 3956, -11138, -1903, 11087, -1629, -6167, 10985, 9338, -9409, -4182, 9951, -3873, -12897, 8894, 12599, -10304, -5206, 12360, -5894, -20835, 4038, 13789, -9592, -3893, 22580, 3711, -22885, 1201, 14841, -15292, -10326, 28171, 13977, -19971, 1563, 17872, -21947, -28122, 20627, 17784, -20328, 4967, 32948, -15216, -38449, 11005]
412A1005M104m2615K8179M8299m2461l9924M3828O159n7878J9703O6341k7411
424A7329m3537M5031J3277p3570m118P0983j3404m5126N5575L6572p6283k7367
436d4638O2958j4766n7802N6694O5662n9789l6839O1223j7351q5896L7141Q0824
448D7421m2938l1615P8076n68j04032N578P5024m2822l9526R7870L7629r8173
460a8076r920O9509n8182p2828R0799O7807p6981n036Q7401n3986j11232N7942
472c2783P1484p3635k555J21895j6968j19816K9938O1430r2475l3219J34991K9619
484G7906j01514L0736P3270j06983q4790J08499M7363q8066M2293J15128q0451
495C3391j17025P1430L7066j09025K7361J52761k7921j06574O3468L6083j40985
$$ y = [11005, 15109, -27506, 673, 48972, 6511, -33413, 10415, 16574, -41304, -21601, 44740, 17329, -26208, 18823, 32100, -41470, -45588, 25395, 11991, -33135, 22440, 59012, -17271, -44638, 18320, 3554, -54248, 2446, 68108, 8319, -28520, 32703, 15352, -70544, -33403, 47421, 4483, -27132, 50944, 50376, -53656, -48078, 26946, -15876, -55402, 42468, 80097, -18076, -27996, 41513, -16669, -89497, 1302, 69109, -7872, -12908, 74493, 20507, -90725, -32783, 38701, -34934, -37489, 84406, 67438, -52378, -22440, 38990, -53485, -86704, 48287, 77906, -23608, 7128, 80398, -26585, -111375, -2876, 44487, -43579, -1286, 113842, 33391, -83634, -12204, 24862, -84163, -56802, 95959, 68038, -38536, 24932, 61015, -79970]
506g9970k8156J46114P074q6852Q5462P5746j41307p9772J07744m27r9168R1346
518b166J31287r3844q8122Q8907j4274j43727N0251J51992m6786o4592J09720
529G8646R554j69736j4353J24479l9585o4387J36730P1647j45490m5354R4690
540C6841o2306j06471J19817J19579r2355l2311J07452n8702j57772N9683J16375
551D9830p1422j7830J48001n843j63677Q322Q6193r1759n0773J60617O0328j24691
563a2704O410Q7420j09117j11462J19992Q2302r1844K5630J28636p6090j46064
574i6891O3648O2436j04222J2333J63592j1803j26387M3176M9682j31533m3086
585a19055J48843L1271r0807O0946Q0788j25693r4530R8787K5509q8099O7125
$$ y = [-79970, -108126, 37988, 45062, -41790, 43672, 119418, -21889, -101661, 6083, 5656, -93512, -2166, 129121, 35277, -52845, 36062, 21788, -121939, -71688, 80304, 33518, -31074, 78646, 88200, -81536, -95889, 28590, -10995, -75382, 61348, 132995, -12495, -57849, 36841, -25465, -131936, -12119, 107460, 15105, -17206, 90246, 31544, -126228, -66545, 49830, -21592, -39422, 108579, 102736, -60941, -52619, 33574, -58185, -108958, 51659, 111987, -12704, -6294, 81126, -27991, -139453, -19461, 62841, -29003, -3373, 125263, 49173, -96891, -33243, 29193, -75029, -62696, 100896, 89093, -37294, 5882, 55564, -75969, -119055, 29788, 61059, -29748, 31198, 111986, -13707, -108237, -9450, 16059, -72040, -4915]
596d915J28131p4545j01042O6204O459j21432K9239J42552k2614p2680P6649K1404
608G3410j40310k8943J12690j0215o2004R7811P1248j15955n7328P9132k7896
619h360q9258Q2765J07773o8044m7746P9107k6968j25147L4224J03954m2905l2696
631c3301J02380J0006j25051q264P6850m8882m7856J07087N6100r1898j5625O6077
643D7623n7789q3240P4849P1924n9377m814Q2137l6714j01892L2628N7818n5967
655c2814p936R8652L267q6215J3674M3748o5855l5647Q6978L0107o1430J8800
667E329N3787o2473o2161N7148K9217n3420K1566P3666l4970o5543L5882K0550
679A8578o3107N110P9184p824n0981L4605K4342o8505k1477O3671K372m2880L8522
$$ y = [-4915, 123216, 48671, -52371, 13833, 20292, -101140, -71901, 70651, 48037, -24643, 52006, 73410, -66900, -95843, 16847, 6632, -55372, 42439, 113687, -2268, -59596, 19536, -8360, -97618, -14853, 92920, 24876, -22870, 56237, 29269, -95878, -61654, 42300, -605, -33301, 69079, 79085, -45966, -54230, 22620, -26262, -74118, 32969, 89069, -2829, -18454, 47623, -10166, -93406, -18557, 53367, -6010, -10824, 71313, 34599, -67293, -34665, 23153, -32814, -40750, 57902, 61169, -25046, -11372, 32376, -33479, -69126, 17852, 47959, -13471, 5329, 59116, -3357, -65518, -8370, 20847, -32573, -11007, 62659, 27689, -37854, -1972, 18578, -44529, -39419, 39765, 31941, -19040, 15565, 39907, -28598, -50075, 13596, 15968, -26912, 11610]
692A1610M1963n5412l5425M4646j453m7336K9790N5249l1060l2728L7817P62n5668
705c7245R507N1614j6174k5672L9242J2414n1233q410L8400j3112k7843L5961
717G449K6534l7035j2661L0371j2387l3789K3550L0433k2575j0123L0266n677
729A4356l6141R975K5439j8030r988L0006L872k9961K469J9238j6601j4896K4685
742D423J0754k1823K279J8714j4148j7446J6580J0451j6018J468J8948p324j7325
755a0467R904Q618j5126j619J7275k196j3425O565Q331j2608n331J3228J506j0612
769e957N301R223q761o403Q688K050q646K262Q737m091o729N647K516p277o42
784d082O984j679m546L206K737m277j497M109N03l540J840L127k212j577K027
$$ y = [11610, 53573, -1839, -37264, 7382, 5929, -41407, -11617, 43632, 12572, -20156, 17661, 18423, -37245, -27738, 23876, 7702, -17970, 21272, 33686, -17547, -25957, 12443, -669, -28512, 7449, 33983, -3052, -15713, 14658, 2271, -31518, -7968, 22465, -110, -10233, 20033, 14356, -21785, -11810, 13629, -4401, -14389, 15617, 19489, -10472, -8003, 11235, -5366, -20262, 4423, 15177, -6646, -4367, 14347, 199, -17247, -667, 9784, -6234, -4766, 14182, 6858, -10467, -563, 8055, -7071, -8690, 8585, 6389, -7036, -471, 7860, -4748, -10079, 3149, 4655, -5957, -656, 8567, -194, -6597, 2091, 4141, -4505, -2243, 6494, 2403, -4326, 1321, 3837, -3440, -4082, 2902, 1223, -3323, -117, 2620, -1657, -3154, 955, 1458, -2082, -242, 2885, 673, -904, 1123]
799A123K67j977L06J294l90j466L90O28q94l81O84o5J6Q7k62P96K13n71P24M40
819I62l30l04J87L14n30n57O95L0j154L09L45o35l79K31P01j16m23L02J158p11
839I5l88R94M54m21q23J121j7j559J46J589j335j366J792O28k324k19K303n75
857I5k522K159K511k773o33L404q58l466K282K638l182j581M560K6n586J456M024
874B554m347k302O278Q05o043J786N196m958m885P696K777p796K280Q687o256
889A472q237P668L477r678J294J2195l878j1213P563N496j3695k205J6087j198
903E148j1957Q992R677j5507q217J6271P09j5142R531J7138j4619j3473J6003
916D554J565k1110O205K2955r117j5061J7154N754k7049j423K5296o605j6220
$$ y = [1123, 1390, -587, -281, 1013, 623, -843, -453, 175, -719, -1100, -416, -481, -465, -378, -640, 156, 369, -202, 522, 962, 632, 328, 515, 829, 299, -258, 437, 467, -687, -378, -33, -668, -1047, -816, -115, -231, -654, -352, 806, 95, -293, 701, 1155, 734, -89, 1032, 1015, -544, -398, 1191, -144, -1510, 282, 910, -1414, -1633, 670, 95, -2427, -268, 2243, -530, -1163, 2241, 1383, -2083, 199, 2837, -345, -1926, 2634, 2660, -2926, -1470, 2554, -1793, -4095, 2183, 2988, -3055, -1269, 3927, -1031, -5916, 1780, 4557, -3239, -959, 7728, 1472, -6765, 903, 4380, -5298, -4004, 8191, 4313, -6900, 663, 6159, -7536, -9741, 6346, 5148, -6809, 2183, 11860, -3647, -11864, 4407, 5116, -10026, -495, 16643, 2024, -11449, 4554, 6119, -14991, -8786, 14169, 5052, -10009, 7145, 12899, -14150, -15573, 9723, 3118, -13102]
929a3102K1359J3642k6878r233K2492o652k2669K0409K3781k1857j1379K3674
941A3587o903l2191J3016K7897j6647j0582L0943J349l8059L041K6514j9182j5677
954b2894L7148J4255l5103j026K6499k3869k9719L3020K4320k9499J355L6268
966C0755k0555m2604K1772K4291l0662k08M9324m846m5050J3525K2558l9898j4624
979c6222N2500J0938l7998J5683K9873m3058l4560M1206J5360l5391J8923M8405
991D5659l0651m4294K8628J1329m5522R470O0223r697l9031K7678J4504n7517
1003b9221j3450N5025L49l3481L7057L2414n3931l1256M1021l537m2061L6140
1015d931N4189l5176l1625L7218p016o0294J7109N8652j8966k4170M8571O533
$$ y = [-13102, 8257, 21899, -4979, -14212, 8280, 1628, -21041, -632, 23149, 1292, -10087, 13587, 6684, -25507, -12491, 15406, -1241, -11823, 19120, 20469, -17590, -14549, 11965, -7217, -22894, 14254, 28509, -6594, -7620, 18879, -4990, -34709, -1689, 22631, -6868, -5513, 30755, 10200, -32404, -10632, 13659, -17003, -17211, 32113, 27267, -17783, -4258, 18300, -21598, -36222, 16278, 27216, -10782, 4901, 34774, -8284, -42844, -1638, 13722, -21669, -2746, 45659, 15008, -29286, -658, 10671, -34851, -25381, 34842, 25145, -13886, 13792, 28296, -29221, -42671, 12354, 12703, -20778, 16279, 48693, -5238, -36494, 4527, 990, -41071, -4931, 49258, 14082, -17543, 19675, 12659, -47635, -30526, 28126, 9160, -15010, 33561, 40094]
1027D0094o9318p221M8117k0450k8181N7900L2401n6164j5775L9531k8699m8714
1039e6479M7035M8957l7102r280M9628k2877o7670K1002M4070l2458p713O5360
1051D2473L005o5869L592L4185m2932k5660O6327K7989m7891O322L8768m6154
1063e845n1832M5911L3333l8127J2766N9449k9248o2487K3987K3394m7915L479
1075c3135P2340o95n2114K0587K2283o0929k3020O3357J4031l8674L0360L9778
1087E4169n4499m4502M1431R158m3174K9659O1615l0582m4123L1571K379n8925
1099d5823Q675O4303q680l2023L8670J4851o4858j7446M9791o746l1286M5878
1111A5306L7886m9741k7413L6222j3474m7026L4584N2611k8722k0850M0004r759
$$ y = [40094, -29224, -36445, 11672, -8778, -36959, 20941, 53342, -2822, -18597, 20934, -7765, -56479, -9444, 39513, 2411, -6869, 42759, 19882, -47788, -26786, 17284, -15174, -22887, 42473, 45478, -20391, -16799, 17386, -25546, -51206, 15121, 43110, -4781, 1541, 40309, -5845, -57677, -11766, 21567, -16560, -3794, 55655, 26407, -36080, -12093, 11301, -36614, -33135, 39205, 38510, -13604, 6983, 29266, -31663, -54683, 8674, 22705, -15969, 14391, 54169, -330, -44832, -3401, 5757, -37417, -7758, 53857, 23275, -20848, 10723, 13102, -45823, -37148, 27155, 18475, -13548, 25122, 39973, -24885, -42331, 7460, 714, -30572, 15306, 53192, 3451, -23962, 12260, -1214, -48240, -13656, 38955, 10233, -10617, 29387, 19628]
1123A9628o1096J1013M7088k0548j6155N1266J0357n7698o137L5885k6420k7454
1135d0271N0782L0328m1662n605L4333k8155m5559L3010L4739k9898n46M5830
1147C7326j5087n1280J4372K6579l1502n650N1214N784m1895Q151K3050l6547
1159a5485k2296M2742J6097l0216J1769L0464l0980l4262K6961J3948k8637J1044
1171h851M1154j5473l3328J7988R638l4663J83M1184j773k5804J9128J4310l6332
1184a2639j3858L1704N79k2529K1011K4390k7327j8829K2223p75k7158J4573L0588
1197B1953j5057j6464K1129R98l1298L104K6812q731j3712K1952Q857k7662n431
1210a3550K0559q297j6148J9777J5802j9084o341J7020p092j9686J1580J7142
$$ y = [19628, -41468, -30455, 16633, -3915, -20070, 31196, 41553, -16145, -22282, 13603, -12817, -40271, 10511, 40839, -823, -6428, 27905, -250, -45809, -12799, 21940, -7958, -8504, 37326, 22239, -29041, -14669, 11910, -19592, -25242, 25972, 31756, -10139, -1988, 21062, -15485, -37781, 4961, 21058, -9158, 2611, 33075, 2095, -32167, -5206, 8742, -19895, -8851, 32303, 16830, -16498, 1490, 11128, -23535, -23352, 17832, 16059, -9745, 9383, 23693, -12639, -26497, 5207, 5786, -16743, 4268, 28658, 1331, -17498, 4725, 3950, -23208, -8635, 21953, 6896, -9568, 11561, 12559, -18739, -15635, 11177, 2446, -11266, 10686, 19543, -8119, -13550, 7009, -1288, -17436, 2341, 18143, -941, -7282, 9738, 2646, -17040, -5460, 11682]
1222A1682j2131n442J7703k186k0543M116J3412j0323o071J7001L839j5977P77
1235d143J1233r719r650J3796O753j1505J411J1327p678j1431Q621O493r682L8
1249d136J2436l457j0792N115N416r206j917J0929j44q293L664N950p460m364
1263f259Q086J535o410K889N834m572m982N031J603n982J113N891k377m367L370
1278D03K064m937o24M533l73l233K154K705l197j584L409Ok779J477J957j775
1294B06j421J629K56j990K49J874p83j177R63P77j439L74P42k41j12N14J15l02
1312B34j87O42j90l50R6K31p12K76j38j86P0j8j59jJ02JJ10L9K7L78J62j16j26
1335A85K62Nl32K87m42j02J24m6k33p8J33J05l34R8O44n16j40O85k3n21J60J165
$$ y = [11682, -449, -5891, 11812, 9626, -10917, -6801, 6611, -3712, -9783, 7218, 11057, -4920, -4143, 7090, -2629, -12279, 1517, 8270, -3235, -1824, 9503, 1825, -9606, -985, 5508, -4174, -4136, 8300, 4843, -5949, -834, 4582, -4624, -6541, 4388, 4244, -4049, -385, 5565, -1895, -6259, 1827, 3362, -3048, -159, 5675, 1103, -3879, 1152, 2755, -3227, -2114, 3777, 1400, -2967, 403, 2467, -2470, -3094, 1439, 1066, -2167, -13, 2692, -505, -2089, 1320, 1326, -1453, 24, 1981, 206, -1215, 414, 670, -1320, -1071, 803, 20, -1157, -194, 583, -856, -482, 260, 19, -93, 421, 536, 234, 47, 689, 499, 149, 245, 476, -236, 40, -98, -284, -214, -232, -391, -392, -290, -289, -179, -140, -113, 265, 427, 311, 185, 447, 452, 120, 407, -35, -137, -13, -59, -292, -370, -237, -132, -466, -368, 276, -240, -380, 305, 282, -239, -79, 1086]
1357A086o75n70P42J1j096P2J144q70j109J835m9j905O96J318j273j014K275P53
1375A371k084L58K332k049k120K987R33l085P36L270j976l425K808J744m280k77
1391b757N397j062m565L183L051n727j564O498Q3n438L674N180o594m289O788
1406A858M50p221L795P946o031n582O563J225r561J990J0498m120o696Q716L107
1421F937j2495q36J0848l391p612R711O922j1740m145J0317l782j1431R465J0899
1435I667r908m388J1766k882j5655N435J3046q425n185J5958J514j8178J355J2291
1449F411j0141q272J7546P713j6520p3J3466j1708j5467J5157J1683j4050Q25
1462c430J8978q936k0885R865J1185j5653r48K4656j484k1210P148J1051k0425
$$ y = [1086, 411, -159, 583, 594, -502, -430, 714, -156, -1265, 570, 521, -1384, -688, 630, -643, -1657, 618, 1371, -713, -355, 1977, -72, -2192, 795, 1728, -1357, -621, 2649, 673, -2752, 56, 1800, -2480, -2757, 2640, 1578, -2987, 196, 3247, -2480, -4044, 2454, 2537, -2901, 773, 5953, -641, -4930, 1858, 2308, -4913, -1118, 6828, 797, -4785, 1778, 3003, -6558, -4568, 5930, 1810, -4886, 3830, 6937, -5558, -6394, 4454, 1063, -6549, 3162, 10084, -1656, -5801, 4516, 734, -10697, -1232, 9667, -241, -4629, 7137, 4255, -11400, -5965, 7081, -1344, -6529, 9429, 10943, -7235, -5880, 6411, -3730, -12002, 5544, 13257, -3263, -3336, 10130, -1578, -17045, -1888, 9795, -4255, -3430, 15548, 6612, -14273, -4408, 6777, -8876, -9824, 14832, 13348, -7862, -714, 10337, -10088]
1475a0088q460K4792N372j8263Q748J6717k1129j8102J9844O576j8919R854K5573
1488B2515j3686k1515J4714N172k5324L219L0534m385j9038J6291Q494l0290q311
1501b1610K6492n47j7471J9926J9376k6326j6469K0663l235k3905J7668K9444
1513B4006j6160j5573K0648l297l3668O104L0128j0095j2211K7603O432l6418
1525a2501n268K4067j2736j6673L1004K0684k8335p611K2129j6570k9600K3219
1537h191K7170j9457l592K9298j0603l8705R147K3381j9384n439L8252M537l5768
1550i354K313J9211k5624j7338L6168J7416k6043M431K4727k5535l1704K3446
1562g886J8360k2718O977L6217j3770l5187J2740J3086k9212j542M1871K110k8424
$$ y = [-10088, -18548, 6244, 11616, -6647, 2101, 18818, -2311, -20413, -569, 6007, -12912, -3058, 22515, 8829, -12686, 2028, 7200, -18124, -14905, 15629, 11244, -7794, 8497, 16991, -13299, -21610, 4882, 4335, -13136, 6790, 26166, -160, -16629, 4034, 799, -23106, -5438, 24006, 7846, -7727, 12921, 9624, -24044, -17940, 12188, 2093, -10118, 17485, 23917, -12501, -17769, 6298, -6438, -23111, 7893, 28577, 242, -7369, 14760, -1810, -31410, -8191, 18979, -478, -4070, 25228, 14625, -24080, -14933, 8448, -10936, -16375, 21877, 26414, -9354, -7041, 12170, -13454, -30792, 5376, 22792, -3251, 1180, 25907, 372, -31332, -7886, 10474, -12244, -5267, 30950, 17180, -18007, -5267, 7819, -21393, -22935, 18936, 21046, -7378]
1575g378J3407J4681l5312j6617L4151P753k2964J8712K7020l0073k6765K3297
1587h8L329k8558J6498L7734j5433k4120K0156J799l7597K134L7640n379j8339
1600a0224K6403J1155l9043j1702K8243o407k0359K8118K5551k8326j5566K2631
1612A0474r817l1399J9135L1950j6193j0543K6676m864l8285M650K6918j3607
1624d905j0135L3235Q790l3845l535K0071j8153j8617L0036J9500k3197j830K2231
1637A9646j7914k9398J8967J9774j8134J043K9765q096l1159Q215J5015k0994
1649a3270m385L2541L866k4772O751J4132k4181j4636K5624R354j8469Q950K0509
1662B2014j9100k1342J6043P310j9061P091K6667q597j9673J1841N361k2919j541
$$ y = [-7378, 6029, 20710, -14602, -31219, 2932, 10685, -12279, 6433, 33453, 3380, -23385, -88, 3241, -25317, -8819, 28915, 13482, -10638, 9518, 11317, -26280, -24146, 13494, 8115, -10224, 16179, 27334, -11709, -23411, 4832, -1575, -21934, 6184, 31735, 3409, -12157, 10474, 657, -30742, -11607, 20343, 4150, -6393, 20283, 15419, -22866, -18216, 8702, -4905, -15040, 18195, 26985, -6860, -10395, 9676, -8477, -27094, 2942, 22442, -755, -2585, 19646, 1732, -27666, -8699, 11075, -7059, -6016, 23749, 15653, -15506, -7291, 7724, -13270, -17655, 14886, 18752, -6020, 731, 14863, -9318, -23954, 1670, 11024, -7445, 1505, 22014, 2914, -18428, -2385, 4925, -14136, -7045, 19622, 11025, -8648, 3193, 8554, -14365, -15906]
1675a5906K5219j136j4807J2982R955k2809r428J8352k76j4225J3480J6777j5605
1688B573j1645J3598j602j7690Q204J9040q339r402J3750N73k0290Q62J6055n557
1702A30q569J4871O523j7017l600J2037n697j0484J2465J0841j1162l769J0931
1715G500n048j3733P308J0719p947k797J1990j026j3629K232Q361p082m287J1891
$$ y = [-15906, 9313, 8177, -6630, 6352, 16307, -6502, -15930, 2422, 2146, -12079, 1401, 18178, 2573, -9072, 4526, 2924, -14766, -6562, 12478, 4139, -5263, 8487, 9060, -11230, -10368, 5687, 130, -8439, 6432, 12955, -4062, -7662, 4375, -1322, -11806, 659, 11500, 338, -3431, 7500, 2452, -11281, -3973, 6746, -1201, -3998, 7992, 6966, -6663, -4431, 3930, -3152, -7439, 4452]
$$ [...]
8191i5
##END NTUPLES=NMR FID
##END=
