##TITLE=1H_Pr EBH
 200.13Hz,CDCl3 .
 8 sc
 
25.3.2026
##JCAMPDX= 6.0         $$ Bruker NMR JCAMP-DX V2.0
##DATA TYPE= NMR FID
##DATA CLASS= NTUPLES
##ORIGIN= UXNMR, Bruker Analytische Messtechnik GmbH
##OWNER= pz
$$ XWIN-NMR		Version 3.5
$$ Wed Mar 25 15:24:44 2026 Russian Standard Time (UT+4h)  she@DPX200
##.OBSERVE FREQUENCY= 200.1313
##.OBSERVE NUCLEUS= ^1H
##.DELAY= (6, 6)
##.ACQUISITION MODE= SIMULTANEOUS
##.ACQUISITION SCHEME= undefined
##.AVERAGES= 8
##.DIGITISER RES= 18
##SPECTROMETER/DATA SYSTEM= spect
##.PULSE SEQUENCE= zg30
##.SOLVENT NAME= CDCl3
##.SHIFT REFERENCE= (INTERNAL, CDCl3, 0, 14.3821)
##AUDIT TRAIL= $$ (NUMBER, WHEN, WHO, WHERE, WHAT)
$$ ##TITLE= Audit trail, XWIN-NMR		Version 3.5
$$ ##JCAMPDX= 5.01
$$ ##ORIGIN= Bruker BioSpin GmbH
$$ ##OWNER= she
$$ F:/spectra/data/she/nmr/H-C/1/audita.txt
$$ ##AUDIT TRAIL=  $$ (NUMBER, WHEN, WHO, WHERE, WHAT)
(   1,<2026-03-25 15:23:18.54 +0400>,<she>,<DPX200>,
      <created by zg, POWCHK disabled, PULCHK disabled
       configuration hash MD5:
       00 E9 B6 7A A2 85 ED C7 34 08 36 98 17 FE 4E 26
       data hash MD5: 16K
       5C D4 C6 65 42 E3 F0 82 96 FC C6 40 36 F4 17 06>)
$$ ##END=
$$ 
$$ hash MD5
$$ 4E 1B A4 4D DA 44 BE E4 0B 55 54 57 94 D7 27 32
##$RELAX= 
##$RELAX= 
##$RELAX= 
##$RELAX= 
##$RELAX= 
##$RELAX= 
$$ Bruker specific parameters
$$ --------------------------
##$DU= <F:/spectra>
##$EXPNO= 1
##$NAME= <H-C>
##$PROCNO= 1
##$TYPE= <nmr>
##$USER= <she>
##$AMP= (0..31)
100 100 100 100 100 100 100 100 100 100 100 100 100 100 100 100 100 100 
100 100 100 100 100 100 100 100 100 100 100 100 100 100 
##$AQSEQ= 0
##$AQ_mod= 1
##$AUNM= <au_zg>
##$AUTOPOS= <>
##$BF1= 200.13
##$BF2= 200.13
##$BF3= 200.13
##$BF4= 200.13
##$BF5= 200.13
##$BF6= 200.13
##$BF7= 200.13
##$BF8= 200.13
##$BYTORDA= 1
##$CFDGTYP= 0
##$CFRGTYP= 5
##$CHEMSTR= <none>
##$CNST= (0..31)
1 1 145 1 1 1 1 1 1 1 1 1 1 1 1 1 1 1 1 1 1 1 1 1 1 1 1 1 1 1 1 1 
##$CPDPRG= <>
##$CPDPRG1= <>
##$CPDPRG2= <>
##$CPDPRG3= <>
##$CPDPRG4= <mlev>
##$CPDPRG5= <mlev>
##$CPDPRG6= <mlev>
##$CPDPRG7= <mlev>
##$CPDPRG8= <mlev>
##$CPDPRGB= <>
##$CPDPRGT= <>
##$D= (0..31)
0 0.7 0 0 0 0 0 0 0 0 0 0.03 0 0 0 0 0 0 0 0 0 0 0 0 0 0 0 0 0 0 0 0 
##$DATE= 1774437797
##$DBL= (0..7)
120 120 120 120 120 120 120 120 
##$DBP= (0..7)
150 150 150 150 150 150 150 150 
##$DBP07= 0
##$DBPNAM0= <>
##$DBPNAM1= <>
##$DBPNAM2= <>
##$DBPNAM3= <>
##$DBPNAM4= <>
##$DBPNAM5= <>
##$DBPNAM6= <>
##$DBPNAM7= <>
##$DBPOAL= (0..7)
0.5 0.5 0.5 0.5 0.5 0.5 0.5 0.5 
##$DBPOFFS= (0..7)
0 0 0 0 0 0 0 0 
##$DE= 6
##$DECBNUC= <off>
##$DECIM= 32
##$DECNUC= <off>
##$DECSTAT= 4
##$DIGMOD= 1
##$DIGTYP= 9
##$DL= (0..7)
0 120 120 120 120 120 120 120 
##$DP= (0..7)
150 150 150 150 150 150 150 150 
##$DP07= 0
##$DPNAME0= <>
##$DPNAME1= <>
##$DPNAME2= <>
##$DPNAME3= <>
##$DPNAME4= <>
##$DPNAME5= <>
##$DPNAME6= <>
##$DPNAME7= <>
##$DPOAL= (0..7)
0.5 0.5 0.5 0.5 0.5 0.5 0.5 0.5 
##$DPOFFS= (0..7)
0 0 0 0 0 0 0 0 
##$DQDMODE= 0
##$DR= 18
##$DS= 0
##$DSLIST= <SSSSSSSSSSSSSSS>
$$ [...]
##$SUBNAM0= <"">
##$SUBNAM1= <"">
##$SUBNAM2= <"">
##$SUBNAM3= <"">
##$SUBNAM4= <"">
##$SUBNAM5= <"">
##$SUBNAM6= <"">
##$SUBNAM7= <"">
##$SUBNAM8= <"">
##$SUBNAM9= <"">
##$SW= 18.0517328524113
##$SWIBOX= (0..15)
0 0 2 0 0 0 0 0 0 0 0 0 0 0 0 0 
##$SW_h= 3612.71676300578
##$TD= 16384
##$TD0= 1
##$TE= 0
##$TE2= 300
##$TE3= 300
##$TEG= 300
##$TL= (0..7)
0 120 120 120 120 120 120 120 
##$TP= (0..7)
150 150 150 150 150 150 150 150 
##$TP07= 0
##$TPNAME0= <>
##$TPNAME1= <>
##$TPNAME2= <>
##$TPNAME3= <>
##$TPNAME4= <>
##$TPNAME5= <>
##$TPNAME6= <>
##$TPNAME7= <>
##$TPOAL= (0..7)
0.5 0.5 0.5 0.5 0.5 0.5 0.5 0.5 
##$TPOFFS= (0..7)
0 0 0 0 0 0 0 0 
##$TUNHIN= 0
##$TUNHOUT= 0
##$TUNXOUT= 0
##$USERA1= <user>
##$USERA2= <user>
##$USERA3= <user>
##$USERA4= <user>
##$USERA5= <user>
##$V9= 5
##$VALIST= <valist>
##$VCLIST= <CCCCCCCCCCCCCCC>
##$VD= 0
##$VDLIST= <DDDDDDDDDDDDDDD>
##$VPLIST= <PPPPPPPPPPPPPPP>
##$VTLIST= <TTTTTTTTTTTTTTT>
##$WBST= 1024
##$WBSW= 4
##$XGAIN= (0..3)
0 0 0 0 
##$XL= 0
##$YL= 0
##$YMAX_a= 437715
##$YMIN_a= -463885
##$ZGOPTNS= <>
##$ZL1= 120
##$ZL2= 120
##$ZL3= 120
##$ZL4= 120
##$ABSF1= 10
##$ABSF2= 0
##$ABSG= 5
##$ABSL= 3
##$ALPHA= 0
##$AQORDER= 0
##$ASSFAC= 0
##$ASSFACI= 0
##$ASSFACX= 0
##$ASSWID= 0
##$AUNMP= <proc_1d>
##$AZFE= 0.1
##$AZFW= 0.1
##$BCFW= 1
##$BC_mod= 2
##$BYTORDP= 1
##$COROFFS= 0
##$CY= -3
##$DATMOD= 1
##$DC= 2
##$DFILT= <>
##$DTYPP= 0
##$F1P= 0
##$F2P= 0
##$FCOR= 0.5
##$FTSIZE= 0
##$FT_mod= 4
##$GAMMA= 1
##$GB= 0.15
##$INTBC= 1
##$INTSCL= 1
##$ISEN= 128
##$LB= 0.25
##$LEV0= 0
##$LPBIN= 0
##$MAXI= 10000
##$MC2= 0
##$MEAN= 0
##$ME_mod= 0
##$MI= 1.114404
##$NCOEF= 0
##$NC_proc= 0
##$NLEV= 6
##$NOISF1= 3.799351
##$NOISF2= 2.8
##$NSP= 1
##$NTH_PI= 0
##$NZP= 0
##$OFFSET= 14.38212
##$PC= 1
##$PHC0= -3707.51
##$PHC1= 9.5923
##$PH_mod= 1
##$PKNL= yes
##$PPARMOD= 0
##$PSCAL= 0
##$PSIGN= 0
##$REVERSE= no
##$SF= 200.129724274929
##$SI= 16384
##$SIGF1= 3
##$SIGF2= 2
##$SINO= 400
##$SIOLD= 16384
##$SREGLST= <1H.CDCl3>
##$SSB= 0
##$STSI= 0
##$STSR= 0
##$SW_p= 3205.1282051282
##$SYMM= 0
##$S_DEV= 0
##$TDeff= 0
##$TDoff= 0
##$TI= <>
##$TILT= no
##$TM1= 0
##$TM2= 0
##$TOPLEV= 0
##$USERP1= <user>
##$USERP2= <user>
##$USERP3= <user>
##$USERP4= <user>
##$USERP5= <user>
##$WDW= 1
##$XDIM= 8192
##$YMAX_p= 0
##$YMIN_p= 0
$$ End of Bruker specific parameters
$$ ---------------------------------
##NTUPLES= NMR FID
##VAR_NAME=  TIME,          FID/REAL,        FID/IMAG
##SYMBOL=    X,             R,               I
##VAR_TYPE=  INDEPENDENT,   DEPENDENT,       DEPENDENT
##VAR_FORM=  AFFN,          ASDF,            ASDF
##VAR_DIM=   8192,          8192,            8192
##UNITS=     SECONDS,       ARBITRARY UNITS, ARBITRARY UNITS
##FACTOR=    0.0002768,     1,               1
##FIRST=     0,             0,               0
##LAST=      2.2672688,     0,               0
##MIN=       0,             -463885,         0
##MAX=       2.2672688,     437715,          0
$$ Real data points
##PAGE= N=1
##DATA TABLE= (X++(R..R)), XYDATA
0@%%%%%%%%%%%%%%%oJ1j3J6j6J6j6K1k9L2l4M2m9N4o1P1q3R2j02J15j30J46j63
38h6J83k05K29k52K77l06L38l75M11m52N00n52O07o68P38q14R01j001J111j244
58f60J402j587J817k107K482k985L703m806O683j0465K0900j03427l74835J68289
72b95596N07874K25437l00538m20966n0325L25496K79460n2493k64975j56867
82b03493P2451J63777R0028j3557q6815j12797o1039Q1747J86153Q7166j48901
93E4720k31810l8063K16452K21673l4713k46682j68172R3065K35563J08152j24204
104H5981j97335o3255J09075J58730O3482q3962j64930r3389R8307K14281Q7736
115B14721j64801k40005k1515K39061K12052p9280k72049j24080J74380K41665
$$ plain form
0 0 0 0 0 0 0 0 0 0 0 0 0 0 0 0 0 -6 5 -8 8 -8 8 -8 13 -16 16 -18 24 -25 29 -32 39 -44 48 -54 61 -69 77 -86
38 -86 97 -108 121 -131 146 -160 178 -197 214 -238 262 -290 317 -351 387 -427 474 -527 584 -660
58 -660 742 -845 972 -1135 1347 -1638 2065 -2741 3942 -6523 14377 -89050 -463885 -295596
72 -295596 212278 437715 137177 -283789 -334114 -8618 270842 218349 -46626 -203493
82 -203493 -131042 32735 122763 109206 22391 -90406 -151445 -69698 116455 203621 54720
93 54720 -177090 -215153 1299 222972 188259 -58423 -226595 -133530 102033 210185 85981
104 85981 -111354 -174609 -65534 93196 156678 72716 -92214 -185603 -87296 126985 214721
115 214721 49920 -190085 -211600 27461 239513 160233 -111816 -235896 -61516 180149
125A80149k30k21484j39783J08686J78860K163j42660o0212R0852P6686o0879
136A2148r2501L7070J24069J9701j34911j06414Q7519J78470K1089j78423j39282
147a71465Q9932J95546L7519j58621j33504N3976J45824M5909q7555q5321J6401
158e1359O5900K0834k9600j4756K0196M267l3999j6696M1040M7014k0069o6034
170c3262k1489M7318M6176p149l5936k0081J655N590J6274L3478J3652m4893p0637
183f9304k445J01608R2182n4527j57050n8268J38333J68390l1679k01557j07275
194a81592J26802J94302R167j80018j27563P9602J65094L6392j20017r9947M4086
205e3692R8408R844o5377k3434M7828K1569n4431l8158N6193P8626k1154j12010
$$ plain form
125 180149 179919 -41565 -181348 -72662 106198 108361 -34299 -94511 -3659 73027 12148
136 12148 -80353 -43283 80786 100487 -34424 -140838 -53319 125151 146240 -32183 -171465
147 -171465 -81533 114013 151532 -7089 -140593 -86617 59207 105116 17561 -67760 -51359
158 -51359 14541 35375 5775 -8981 11215 15482 -18517 -35213 5827 52841 32772 -33262
170 -33262 -54751 -7433 38743 31594 -4342 -24423 -22768 -17178 -904 32574 46226 1333 -69304
183 -69304 -71749 29859 122041 67514 -89536 -147804 -9471 158919 127240 -74317 -181592
194 -181592 -54790 139512 148679 -31339 -158902 -79300 85794 122186 2169 -97778 -53692
205 -53692 44716 54560 -10817 -34251 13577 35146 -19285 -57443 -1250 77376 56222 -55788
217e5788n3270R2060J24590r928j39716r2281P7022J47992K8745j16407j08115
228a05096K5355J11529O0065m4692q0189l4957L2089O3236L6601k3691o6423m7450
240g3623K8236Q3835M6990n2261j00439k7046Q8647R5838j9857j06636n3613O3255
252b6674Q7388n97o9907l6953L1761L9022r150k6353R622K7595j3843n2205r552
265d9846O9414O1201m7584j08538k0613J09229R9515m7466j34957m4460J02750
276a1355J15546j9138j22091o5406O7085J02979Q248q2778n7598K9911N7827J0478
288C3708k9558j7949O577K615o633Q362K2854N318k8952l1062J2207M6227K1984
301D5698l2588m8546l752M4565L3239j6048l7100j4705J4015J8556J0415L753
$$ plain form
217 -55788 -109058 -16998 107592 97664 -42052 -134333 -57311 90681 119426 3019 -105096
228 -105096 -79741 31788 91853 47161 -33028 -67985 -35896 27340 63941 40250 -26173 -73623
240 -73623 -45387 38448 85438 33177 -67262 -94308 -5661 90177 70320 -36316 -89929 -26674
252 -26674 60714 60117 -9790 -46743 -14982 24040 14890 -11463 -1841 25754 11911 -40294 -49846
265 -49846 19568 80769 33185 -75353 -95966 13263 112778 65312 -69645 -114105 -11355
276 -11355 104191 85053 -37038 -102444 -35359 67620 75868 -6910 -64508 -34597 23230 33708
288 33708 4150 -13799 -7222 -4607 -11240 -2878 19976 25294 -3658 -34720 -22513 23714 45698
301 45698 13110 -35436 -39188 5377 38616 22568 -14532 -29237 -15222 3334 13749 17502
313A7502j1552k6422j3158K5908M4163Q433m8598n0522J5625P0168L9445m8166
325B2826p9875o674P5786N8012l2990p8180k1047N5935N1866j2992m9284j9707
337c6324K7151K8740n554j8673j50J2410k986k0036J418L2422J5526l2434m1735
350d0225P687N3536K8692l6563n4627l957N0204M3248j7897n3343k0940L2167
362a2018M2606L671l3011k5820M610K0998J7369J250j5522k0508p426J7340K6993
375B0532L875k5543k6669K440L1545K4364j2724l3988j4212K2597L0910P08k4427
388e92j6199N630J4353P351j582m792p881q278J868J3455J2827m362k2036j4980
402b5218J3305K8992R557k4423k9227M653L2218J8636j5392k7408o546J8619J8325
$$ plain form
313 17502 5950 -20472 -33630 -7722 36441 44874 -3724 -54246 -38621 31547 70992 22826
325 22826 -57049 -63723 12063 70075 37085 -41095 -62142 -6207 45659 32667 -16617 -36324
337 -36324 -9173 19567 14013 -4660 -4810 7600 4614 -15422 -14004 18418 33944 1510 -40225
350 -40225 -32538 20998 49690 13127 -41500 -45457 4747 47995 30098 -23245 -44185 -12018
362 -12018 30588 34259 1248 -24572 -19962 1036 18405 19655 4133 -16375 -23801 -6461 20532
375 20532 24407 -1136 -27805 -25365 6180 30544 17820 -16168 -30380 -7783 23127 23835 -592
388 -592 -16791 -11161 3192 10543 8961 4169 -3712 -11990 -10122 3333 16160 11798 -10238 -25218
402 -25218 -11913 17079 26636 2213 -27014 -22361 9857 28493 13101 -14307 -20853 -2234 16091
415A6091j494j5755j1244N207J0599K049m721k447R29j378l757K955Q764K364
429H162p521q668J165J0306P308l312j0152n943M666R431J605o193n524O17K344
444a709o30N96M499J356n366p220J011J0945R721l351j4443j0707Q459K0967O721
459B0849j6454k0873j491J9008J6483m024j7601j3898K563J7141J2972k650j4643
472b618j3294J124J5875J7177K323j9355k4021Q15K9042K5059r596l6487k1413
485c5369J8943L5973J3893k3663l5885p324K7507L0914L171k5583k6765j212K2402
498b998K6737P367k3636l3987p253L0457L8990J789m2147l9004Q489M7715L3892
511D6411k0562n1400k1548L0361M5978J0010l2838l3497j390K4737K6101N630
$$ plain form
415 16091 14597 -1158 -12402 -7195 3404 5453 732 -1715 -786 -2164 -5921 -2966 5798 8162
429 8162 641 -8027 -6862 3444 10752 7440 -2712 -8655 -3989 5442 7047 854 -4670 -4053 -1709
444 -1709 -2339 -1743 2756 4112 -1254 -8474 -7463 3482 13203 9852 -4591 -15298 -6839 14128 20849
459 20849 4395 -16478 -17969 1039 17522 13498 -4103 -18001 -15438 1703 14675 12025 -2618
472 -2618 -15912 -14788 1087 18264 20587 1232 -22789 -21974 7068 32127 22531 -13956 -35369
485 -35369 -16426 19547 33440 9777 -26108 -33432 -5925 24989 28160 2577 -24188 -25400 -2998
498 -2998 23739 31106 7470 -26517 -33770 -3313 35677 37466 -4681 -43685 -35196 12519 46411
511 46411 25849 -25551 -47099 -16738 29240 39250 6412 -27085 -28475 -3738 22363 27993
523B7993j7604k6774j3726J6426L4552J7019k3267m3969j6737L5337N0691M979
535D4920m9100m7125J2087N6911L3356k5623n0667j8280L0012L9876R574k4250
547A1691l0989j0256J6912K7645J6071j1845l4840k4511J6499M5985K5358l0621
559A7099n5393j2270M6441N0964l899n2222l7903J7614M8525K3954k2596l8460
571a8146j3653J7380K6576J3558p693k3746k3841N80L2865L4684o485m7000l5904
584e0825K1877N8325K6113l7172n7906j0852M8566M9440o028m8922l4905J3362
596b8927L9647K2693j0471k9420k4242J943K8654L1793J745l6826l9138N841M9132
609A2424L9217j8154n8473k8512L5494N6169J1323m4452m5132M945L9577K7346
$$ plain form
523 27993 10389 -16385 -30111 -13685 20867 37886 14619 -29350 -46087 -10750 39941 44920
535 44920 -4180 -51305 -39218 17693 51049 25426 -25241 -43521 -13509 26367 35941 11691
547 11691 -19298 -29554 -12642 15003 31074 19229 -15611 -40122 -23623 22362 47720 17099
559 17099 -38294 -50564 -4123 46841 42942 -9280 -47183 -29569 18956 42910 20314 -18146
571 -18146 -31799 -14419 12157 25715 18022 -5724 -29565 -28985 3880 38564 32079 -14921 -50825
584 -50825 -28948 29377 55490 18318 -39588 -50440 -1874 47566 41538 -7384 -42289 -28927
596 -28927 10720 33413 22942 -6478 -30720 -28777 -123 31670 33415 -3411 -42549 -36708 12424
609 12424 51641 33487 -24986 -53498 -18004 38165 49488 5036 -40096 -35151 4426 31772
621C1772p881k7812j9916L17J6419K4117J2930j6689l6175j9183K7392N2969J5575
634E3835m8143n8951K474O5860N1227k7268p1795l1075M1954O2939J1052m7124
646D985m6600Q29L9321L3715j484k7480k6347p207J9764L3631J6152k1706m4377
659b6804j9076L3528N1041J0308m4093n1388r33N0052M4741p378m9741l9607J1367
672c7983M7705L7588q030m8325m2506Q958N7151M9439j6625p2665m8931L4793
684c9431Q2825L6610n5444q4836j6064O9415P3526n342p2959n3626K0239O1993
696A6906L5544j8727m4892k8265O699L3839L6512O742l6250n1880j3024N0254
708f542O6742N217p2251p3183J3789R2428O5731m0004j01387m6308O2132R9099
$$ plain form
621 31772 23891 -3921 -23837 -23520 -7101 17016 29946 13257 -22918 -42101 -14709 38260 53835
634 53835 5692 -53259 -50785 15075 66302 39034 -32761 -63836 -21882 41057 52109 4985
646 4985 -41615 -40786 -1465 32250 30766 3286 -23061 -30268 -10504 23127 39279 17573 -26804
659 -26804 -45880 -12352 38689 48997 4904 -46484 -47417 2635 47376 39998 -9743 -49350 -37983
672 -37983 9722 47310 39280 -9045 -51551 -42593 14558 63997 47372 -25293 -74224 -39431
684 -39431 43394 80004 24560 -60276 -76340 -6925 66601 61259 -11700 -65326 -45087 16906
696 16906 52450 33723 -11169 -39434 -32735 1104 37616 44358 8108 -43772 -56796 -6542
708 -6542 60200 65417 -6834 -80017 -66228 26200 91931 51927 -49460 -95768 -33636 65463
720F5463K4151p4227q7459n808P8788P5313p447p8409o4626J5324P6041N5941
732G3045k1407p5856n0071K8159P5341M1748l5140p1877l0896L8601O4324K5485
744F1456l5838n8079k3770L0961N6670K9157k9676o2642l5191L3029P4856L7082
756G8015m9277q8258k8515P1529R4883O276r3000q5306K2082J05119O5415m9110
768D9853j01932l6909O5399Q7124R851o9345o3448N987N8398M3815j1258m3581
780f046l1620M190L1539L0067M758k3669l5501j3705K7059M4864J7524l4717n4923
793d0180j3294M7603N8178L355o0168n8367J0894O9580N1199k6970p6921l8511
805g3602M4984P6383K0702n7778o8623L48O5487N3995j7740o5040l5137L1596
$$ plain form
720 65463 89614 15387 -72072 -77880 908 76221 68774 -9635 -74261 -58937 17104 73045
732 73045 51638 -24218 -74289 -46130 29211 70959 35819 -36058 -66954 -28353 35971 61456
744 61456 25618 -32461 -56231 -25270 31400 60557 30881 -31761 -66952 -33923 40933 78015
756 78015 28738 -59520 -88035 -16506 78377 84653 -8347 -93653 -71571 33548 98963 49853
768 49853 -52079 -88988 -23589 63535 73386 4041 -59407 -53420 4978 48793 37535 -6046
780 -6046 -37666 -33476 -1937 28130 32888 9219 -26282 -39987 -12928 31936 49460 14743 -40180
793 -40180 -53474 -5871 52307 55662 -4506 -62873 -51979 17601 68800 41830 -35091 -73602
805 -73602 -28618 47765 68467 10689 -57934 -57586 7901 61896 44156 -20884 -56021 -24425
817b4425N4750J5143l5242l9945j139K8583K1823k356j5937j1494k372K379R100
830a132J5307O959j5661k8666p525L1364L8446l353m7820l7889K0399N9334K6792
843E6555m0473o2192r494N6605N5113j2805o4999l8864L3337O3434J7787m5951
855H053n1116L363M9559L3842j9300m3105j4448K5925K8914k265k3028j1280Q840
868f046R930k945n280N803Q583o457j8508m044K3060K4820r223l6957j9187K7478
882h973M3983L564m4121l8907J4605N2337K5292l3211n1178p272M3804M2213j0405
895C1731m8085k6184K4362M3668J1013l1846l2806L926L1025K0647j3023k6672
907a2244o405J6520J4393m111j3676j777J0131J701j0678n424J2097J6542m812
$$ plain form
817 -24425 30325 45468 10226 -29719 -30858 -2275 19548 17192 1255 -10239 -12611 -10232 -1132
830 -1132 14175 21134 5473 -23193 -30718 646 39092 35739 -12081 -49970 -29571 29763 56555
843 56555 16082 -46110 -55604 1001 56114 43309 -21690 -60554 -27217 36217 54004 8053
855 8053 -43063 -39700 9859 43701 24401 -18704 -33152 -7227 21687 19422 -3606 -14886 -6046
868 -6046 3884 939 -4341 1462 10045 3588 -14920 -18964 4096 28916 19693 -17264 -36451 -8973
882 -8973 35010 38574 -5547 -44454 -29849 22488 47780 14569 -36609 -43881 -77 42136 31731
895 31731 -16354 -42538 -18176 25492 36505 4659 -28147 -24221 6804 27451 14428 -12244
907 -12244 -18649 -2129 12264 8153 -5523 -7300 2831 4532 -6146 -11570 527 17069 12257
920A2257k6554j2511K3026L4045J59m0904l1297K1918N0609J5480m2024m9467
932d5263O774N4868L3057k8652n4759j2083M3930M2208j0638m4224k2044K4611
944a2215L5018K201k5985j7349Q999J7634J621j0687l377O591K522r222p863R093
958c019J6943L1k0372j6955J0204K8248J1897k0427k9822l874K9200K9999n798
971B6255l6449k5363J6177M1164J7099k8726m1329n779L7928L6242r580m3056
983a5417k4276K3390M0813Q177l1384k8693Q014K9644J2074j6151j7037K954J2360
996D468M96j0037P72J3681L702j9418j8459J2590L3380R722l2724l5749Q910M6884
1010A8218K7068k8926m9549q781M3051M2022r320m7818k7854K2420M2208J3025
$$ plain form
920 12257 -14297 -26808 -3782 30263 30422 -10482 -41779 -19861 30748 46228 4204 -45263
932 -45263 -38489 16379 49436 20784 -33975 -46058 -2128 40080 29442 -14782 -36826 -12215
944 -12215 22803 25004 -981 -18330 -9331 8303 9924 -763 -4140 2451 4973 -4249 -12112 -3019
958 -3019 13924 13955 -6417 -23372 -13168 15080 26977 6550 -23272 -27146 2054 32053 26255
971 26255 -10194 -35557 -19380 21784 38883 10157 -31172 -36951 977 37219 27639 -15417
983 -15417 -39693 -16303 24510 32687 1303 -27390 -19376 10268 22342 6191 -10846 -7892 4468
996 4468 4964 -5073 -4301 9380 13082 -6336 -24795 -12205 21175 30897 -1827 -37576 -28666 18218
1010 18218 45286 16360 -33189 -41970 1081 43103 33783 -14035 -41889 -19469 22739 35764
1022C5764k7303l3221l398K4549K3933N59k0580j8815K89J6868J7261J086j4668
1035B324j5586k023J3613J5735K207j2076j5336n663J0521J7266Q612j0531k3813
1048a4750j2840J6879L1571J1399k6619l8192k849M0451L7468j0805m9347k9138
1060d6772K7884N1185J2652l9602m3908M209M2951K7703j5971l6110j3705J9044
1072a0440K3752L716j2119j1958l542K997O507J0575O594r543k0075p695J7375
1085c856K6357K694k7610k6419O286L1956K1415j5190l3160j2930K0004K9831
1097A9378O947k2106k4883j653K1399K2100n53k1183j9314K787K1678J6479p168
1110A3908k1262j1787R105J8569O229j0601j2901k265P868P704P66k022k791l795
$$ plain form
1022 35764 8461 -24760 -28158 -3609 20324 20883 303 -18512 -18223 -1355 15906 16992 2324
1035 2324 -13262 -15285 -1672 14063 16270 4194 -11142 -16805 -6284 10982 19594 9063 -14750
1048 -14750 -27590 -10711 20860 32259 5640 -32552 -35401 5050 42518 31713 -17634 -46772
1060 -46772 -18888 32297 44949 5347 -38561 -34352 8599 36302 20331 -15779 -29484 -10440
1072 -10440 13312 17028 4909 -7049 -10591 -7594 -1087 9488 16082 6539 -13536 -21231 -3856
1085 -3856 22501 25195 -2415 -28834 -22548 9408 30823 15633 -17527 -30457 -10453 19378
1097 19378 26325 4219 -20664 -22317 -918 21182 20629 -554 -19868 -17081 4597 21076 13908
1110 13908 -7354 -19141 -10036 8533 14762 4161 -8740 -11005 -3137 4567 5333 3311 520 -3275
1124c275l161K762R655P120p331j5597n125J3119J7157m98j8813j4603P114J9427
1138G951Q162j1586j6103j231J2563R652k401q045l387K236K325Q57J485K266
1152D744j315p018m806M683J0233M192q681j3163j578J2193J2463j052j3514j0751
1166a3370L503J3713J0123l996j3751q776M501J3118Q653n043j3315q836M317
1179i159J3861R273n853j4377r626N926J6526R746p147j7397j0199R489K0558
1192A1621Q872j2261k1255p524J5980K1547L499j7883k1098j572J9771J9158j050
1205A7805k0174j8697K918K1172J7593l225k1786j8056N869K4055J7660p991k6526
1218i383j6363J1906K7151J3731j5226k8478j0409J7802K6894P980j9838k6751
$$ plain form
1124 -3275 -6436 -3674 5981 13101 5770 -9827 -14952 -1833 15324 14826 -3987 -18590 -11476 7951
1138 7951 16113 4527 -11576 -12807 -244 9408 7007 -1038 -4425 -2189 136 993 2478 4744
1152 4744 3429 -3589 -8395 -3712 6521 10713 2032 -11131 -12709 -516 11947 10895 -2619 -13370
1166 -13370 -9867 3846 13969 9973 -3778 -12554 -8053 5065 13718 8675 -4640 -13476 -9159
1179 -9159 4702 13975 8122 -6255 -15881 -9955 6571 16317 9170 -8227 -18426 -8937 11621
1192 11621 20493 8232 -13023 -20547 -4567 16980 20479 2596 -18502 -20074 -303 18855 17805
1205 17805 -2369 -21066 -18148 3024 20617 17392 -4394 -22450 -16581 7474 25134 17143 -9383
1218 -9383 -25746 -13840 13311 27042 11816 -16662 -27071 -9269 17625 25605 5767 -20984
1230b0984n236K1801K6951M062k5072k7412N34K9157K7101o300l4188k2817J3694
1243a8709L5080J6616k1323l3517p905K4098K7872J094k3802k0613K183J9183
1255B57J6774P7j4924j6553m083J4681K1671N876j9509k7196l434K7951K8482
1268C0070n464l5538k4552J6380L8359J4186k5393l3982k927K9547K5444n444
1280B0686k6042j6614Q754K0406J1059o674j5963j0630L565J4679J2798l238j8355
1293e569j4145P012K1369J1407j2642k0925m696J6137J6318r82j4154r171L060
1306f981P636M783J739k029o921r127L82J4560J3522p027k2934j1157J7734K5931
1320B0111R51k5843j9850J1362K7479P673j9473j8328M941J7988M676j1587o544
$$ plain form
1230 -20984 -26220 -4419 22532 26594 1522 -25890 -25356 3801 30902 24602 -9586 -32403 -18709
1243 -18709 16371 32987 11664 -21853 -29758 -5660 22212 23306 -496 -21109 -18926 257
1255 257 17031 17108 2184 -14369 -18452 -3771 17900 23776 4267 -22929 -26363 1588 30070
1268 30070 24606 -10932 -35484 -19104 19255 33441 8048 -25934 -28861 686 26130 20686
1280 20686 -5356 -21970 -13216 7190 18249 11575 -4388 -15018 -11453 3226 16024 12786 -5569
1293 -5569 -19714 -12702 8667 20074 7432 -13493 -18189 -2052 14266 13284 -870 -10041 -6981
1306 -6981 655 5438 7177 5148 -1773 -10900 -10518 4042 17564 10537 -12397 -23554 -5820 20111
1320 20111 21062 -4781 -24631 -13269 14210 21883 2410 -15918 -10977 7011 11687 100 -6444
1333f444O575N596p502q834P112J6523nk1113j4619J4285K7456M446k6278k3122
1347b5924R795K9672J2633j8265k4730j833J8156J5130j311j2560j0493k426N914
1360f242J2575R597o219k0553j3201J3762K9298Q936k5387k9603K472L3053K2624
1373C1112j4926l1099j0009J8827K1719P02j3939j0931k489K982Q081J2084M568
1386A6682j5709k4624j409L1944K9780j2697m5761k2259L3244M9331L281m7682
1398e879l9613J7406M9853K0049l0225l9288k757K9907K2536n159j8382j1030
1410a2582J29O044J1195J2520j222k2179k1082R305L5324J9292k4985m1547o070
1423c5858L7915L5115j0811m1795k0695K1957L3215O872k1192k0677j233J1971
$$ plain form
1333 -6444 131 5727 -1775 -10609 -3497 13026 13021 -8092 -22711 -8426 19030 23476 -2802 -25924
1347 -25924 -16129 13543 26176 7911 -16819 -18652 -496 14634 13323 763 -9730 -12156 -6242
1360 -6242 6333 15930 9711 -10842 -24043 -10281 19017 27953 2566 -27037 -24565 8488 31112
1373 31112 16186 -14913 -24922 -6095 15624 16326 2387 -8544 -11033 -8051 30 12114 16682
1386 16682 973 -23651 -25060 6884 36664 23967 -21794 -44053 -10809 38522 41803 -5879
1398 -5879 -45492 -28086 21767 41816 11591 -27697 -30454 -547 21989 16830 -1552 -12582
1410 -12582 -12453 -6409 4786 17306 16084 -6095 -27177 -17872 17452 36744 11759 -29788 -35858
1423 -35858 2057 37172 26361 -15434 -36129 -14172 19043 25915 4723 -15954 -17187 -5216
1435e216J3129P520k783j5952j8244K873K8415K3597j4298m1151j7780L1746M4104
1448C5960l24m5075l3855K0094M6345J3546l1555l2766M542K8910J4661j1187
1460I296j4018j620K717r11K564J2808O567j7194k4682K744L3386K3556k1440
1473A3773m2478p921L8283L5976j1956m3604j8682K7344L4601M06k7976j8296
1485b0530Q713J7344N029m244l932m794q022j674J4835J8314o007k9910j6185
1498c1063K2343L6570K715l7675k8830J7325M0470J1417k9963k9756P188K8403
1510I144J1127j4548j5084K142P708j505k356P719Q176j0059k1059o94K7718K1586
1524C0015j6877l6622q123L4191L2395j2300l9974j5824K6947L1717l584k8716
$$ plain form
1435 -5216 7913 15433 12650 -3302 -21546 -18673 9742 33339 19041 -22110 -39890 -8144 35960
1448 35960 35636 -9439 -43294 -23200 23145 36691 5136 -27630 -23088 5822 20483 9296
1460 9296 -4722 -6342 -3625 -4536 -1972 10836 17403 209 -24473 -21729 11657 35213 13773
1473 13773 -28705 -36626 1657 37633 25677 -17927 -36609 -9265 25336 25742 -2234 -20530
1485 -20530 -11817 5527 10556 6312 2380 -2414 -10436 -12110 2725 21039 15032 -14878 -31063
1498 -31063 -8720 27850 30565 -7110 -35940 -18615 21855 33272 3309 -26447 -19259 9144
1510 9144 20271 5723 -9361 -7219 489 -1016 -3372 4347 12523 2464 -18595 -19289 8429 30015
1524 30015 13138 -23484 -31607 2584 34979 22679 -17295 -33119 -6172 25545 21961 -6755
1536f755j4306J2977J6865k50r018j113K885n273o823Q103J8122J929k4116j9539
1550b6312J4835L3378P381l0541k8970J0797L5651J2628k4532k6950N096K4172
1562F633R349j3205j1604M722P709m611o625Q355J4016n135k3282q646K3412K6928
1576B8016q227l6379j6137K7120L4954l836l6382k0823K0442L0881J651k4377
1588c097j4971R974J5089M06p726L7M448m834r548M150J7668P257j9097k2515
1602b2759O332K9353J3626k1177k9160J500K9334J6900j4762k3657j923J7905
1614A512J0247o890p829K215L008n845m565J0262J4200o535k3905r277K2796K7146
1628B6540p175l5164j6076K5128L3593k320l4341j9092J9699K8726M31k3905j3495
$$ plain form
1536 -6755 -21061 -8084 8781 8531 -487 -1600 1285 -3988 -10811 -2708 15414 17343 -6773 -26312
1550 -26312 -11477 21901 29282 -1259 -30229 -19432 16219 28847 4315 -22635 -17539 6633
1562 6633 15982 2777 -8827 -4105 3604 -1007 -7632 723 14739 9604 -13678 -22324 1088 28016
1576 28016 19789 -16590 -32727 -5607 29347 25511 -10871 -31694 -11252 19629 21280 -3097
1588 -3097 -18068 -8094 6995 7401 -325 -288 4160 -674 -10222 -6072 11596 18853 -244 -22759
1602 -22759 -16427 12926 26552 5375 -23785 -22285 7049 23949 9187 -14470 -16393 1512
1614 1512 11759 4869 -2960 -745 2263 -3582 -8147 2115 16315 9780 -14125 -23402 -606 26540
1628 26540 19365 -15799 -31875 -6747 26846 24526 -9815 -28907 -9208 19518 19949 -3956 -17451
1641a7451J2762J5297l552j2014J55J0622K82j3571n108J5108J4611r231k3243
1654a5333m750K2807J9915j0437k6116o967K0515J9334o429j9655o287J1691R692
1667G980l082o734J037K627m833m837O585J2218j162j7475j0569J3483K1356N13
1681A7107k2515j5198J2562K2484K333j8578j2905Q869J4181j010j0678j691Q711
1694C672J641j1398n982J3331J5782p556k4421p817K3365K5543p655l2770j4569
1707b8834K3134L0897k120k9859j8277J4187K4817L953j7054j3232L763R723L184
1720D282j964M83l18o916o427O769J6084M378j6895j8502M958K3812J3089j4916
1734G917k3829l520J9456J6851m400j7087q901N416J0243N783k94n764r143n167
$$ plain form
1641 -17451 -4689 10608 7056 -4958 -4803 5819 6101 -7470 -12578 2530 17141 7910 -15333
1654 -15333 -20083 2724 22639 12202 -13914 -20881 -366 18968 12539 -7116 -13403 -1712 7980
1667 7980 4898 -1836 -799 1828 -3005 -7842 -1257 10961 9799 -7676 -18245 -4762 16594 17107
1681 17107 -5408 -20606 -8044 14440 16773 -1805 -14710 -5841 8340 7330 -3348 -5039 3672
1694 3672 5313 -6085 -12067 1264 17046 9490 -14931 -22748 617 26160 18505 -14265 -28834
1707 -28834 -5700 25197 23077 -6782 -25059 -10872 13945 17898 844 -12388 -8625 1098 4282
1720 4282 2318 2801 2483 -4433 -10860 -4091 11993 16371 -524 -19026 -14068 9744 22833 7917
1734 7917 -15912 -19432 24 16875 12475 -4612 -13513 -8097 2146 7929 7635 1871 -7272 -12439
1748a2439P411J7183O483j6268k1773M56K5647K0106j2810l0567r676K2956K6136
1761B2845l731k7121j4566J3738K0753K529j4846r968N077P893N2k634K231K919
1775E171n443r114K437J4408P662j1689j8306n00J9910J4150r963k1032n455J6388
1789a376J6330m075j5973p553Q379J1184J045o874m610M67K319J784J565Q80l033
1804D59n358l67O519N387l357q873j687P710O708l680q146j046P636M804n212
1819A497o684J826P881J981p728o089M935Q573l04q944m857N943P954j688q212
1834c916k021O688N032m470o689K152Q202K139q726p079N582J1017J232j1481
1848b338r200N503J3358L694j0593j0979K067J1806O475n441r424k536N588O535
$$ plain form
1748 -12439 -5028 12155 18638 2370 -19403 -18947 6700 26806 13996 -16571 -26247 -3291 22845
1761 22845 19114 -8007 -22573 -8835 11918 14447 -399 -10367 -5290 2603 2655 21 2252 5171
1775 5171 -272 -9386 -6949 7459 15121 3432 -14874 -15374 4536 18686 8723 -12309 -17764 -1376
1789 -1376 14954 10879 -5094 -12647 -4268 6916 7961 1087 -3523 -3056 -737 1047 2612 3492 459
1804 459 -4899 -5266 1253 6640 3283 -5590 -7277 433 7141 3461 -4685 -5731 1905 6709 1497
1819 1497 -5187 -3361 4520 6501 -1227 -7316 -2381 6192 5888 -3056 -7913 -1970 5984 4296 -3916
1834 -3916 -5937 751 5783 1313 -5376 -3224 4978 7117 -1609 -8688 -3106 7911 9143 -2338
1848 -2338 -11538 -6035 7323 11017 424 -10555 -8488 3318 9793 4352 -5072 -7608 -2020 4515
1862D515J305l445m633k480J765N062M287j599p890n677M047R838M150o780j0719
1877h254j076Q519R227o75r079o528K031P774N596j194o867o176L36O988Q017
1892H639m91r914r181K031J2759R058o101j4905o262J0159J5046K300j2928j2446
1906a2236K021J3679R224n269j2279n190N389R825L798n673p806l394L924P560
1920C573L999l553q236m842M570R926M618o436j0996l018R146J1338L29j1114
1934f96j0268K557J2353P158n479j1460m980O882J0155K100o969q098p23O810
1948f58O754Q5n519o080j7N743N745j5o001o313Q96O712N536k216p773m833M106
1965c848P808K868n190p049o07N705N593m28n031l957P86M214L251p06l475l208
$$ plain form
1862 4515 5820 2375 -2258 -4738 -2973 2089 6376 4777 -3113 -8790 -4743 5095 9245 2465 -8254
1877 -8254 -9330 -811 8416 7741 -1338 -7866 -5835 1939 7535 6341 -526 -6702 -6366 622 8639
1892 8639 8148 -1766 -10947 -8916 3843 12901 6800 -8105 -14367 -4208 10838 13138 210 -12236
1906 -12236 -10215 3464 12688 7419 -4860 -10050 -4661 5164 8962 3289 -4517 -7911 -3987 3573
1920 3573 7572 4019 -4217 -9059 -4489 5437 10055 3619 -7377 -10395 -1249 10089 10418 -696
1934 -696 -10964 -8407 3946 11104 5625 -5835 -10815 -3933 6222 8322 1353 -6745 -7468 -658
1948 -658 6096 6181 662 -5418 -5435 308 6053 6038 37 -6276 -5380 1332 6868 4652 -3121 -7954 -3848
1965 -3848 3960 6828 1638 -5411 -6018 -313 5280 4852 -179 -4136 -3350 864 4115 3409 -66 -3274
1981c274P6L220L625l30l957m009R46N008L098k354m711j412L279L877n3l240
1997b11j592J153J245o3m53R23K70k183k256J440M070J679m208n076J142O285
2013B165L830m158o376n34N997M500k202n451j204L646K589j339k428N27J464
2028A026r45k821R03M084J974m444n854J151Q257M046n118q315j077Q496O781
2043H144l030q217l533M002O851J243m302m662r40K731M040J447j670m505l065
2058e466K621O495K885m491p451j290P241O621j355q074m661L720O789J538l736
2073A386m349q62J810K371K292R89l077n413j446O203Q741p80j0971q417N814
2088e709J3927N287j1277j4065O71J4336J0164o507j4148m403Q985J0510j29q464
$$ plain form
1981 -3274 -3198 22 3647 3317 -640 -4649 -3703 1305 4403 2049 -2662 -4074 -795 3082 3029 -211
1997 -211 -1803 -650 595 532 79 1002 1272 -911 -3167 -1727 2343 4022 -186 -5262 -4120 2165
2013 2165 5995 1837 -4539 -5073 924 5424 3222 -2229 -3433 213 2802 1463 -965 -438 1026
2028 1026 81 -2740 -1837 2247 4221 -223 -6077 -4926 3331 7377 2259 -6056 -7133 1363 8144
2043 8144 5114 -3103 -6636 -2634 4217 5460 1158 -3504 -4444 -1713 2327 3774 2104 -2401 -5466
2058 -5466 -2845 3650 6535 2044 -5407 -6697 544 7165 5810 -2264 -6925 -3205 3584 5122 1386
2073 1386 -2963 -3825 -2015 356 2648 3637 560 -4853 -6299 -96 8645 7865 -3106 -11523 -5709
2088 -5709 8218 13505 2228 -11837 -11166 3170 13334 6827 -7321 -11724 -2739 7771 7642 -822
2102h22n773J832N323L280L8j958l516l171Q64O867N168l536r842m861P433J1271
2118H597J453j0696j0515K495J1965P648m990j1296n020O033R960L923n118r716
2132e277m377N583J0998M706p642j3224l845J1494J4166m7j5632j2549N767J6997
2146G118Q132j0352j5218k274J2142J0985j451j0190o709K397O552M372O4l740
2160A828n933l640L607R870N200p468j3572l616J2794J5376j654j7394j2496P695
2174i403J8906P729j2291j6976k071J3949J3035j548j3243r648K550J1364P888
2187A0241k742j0080p906K290J0877Q488l758j2061p645O312J3580M610q778j2075
2201h647j691R886R560j133q791o679R72O701N505K21m852p053k049N982R375
$$ plain form
2102 -822 -6595 -4763 560 3840 3878 1920 -1596 -4767 -3903 2964 8132 4596 -5246 -10107 -2674 8597
2118 8597 10050 -646 -11161 -8666 3299 10947 5957 -5339 -10359 -4326 5634 9557 4439 -5277
2132 -5277 -9654 -4071 6927 11633 3991 -9233 -13078 -1584 12582 12535 -3097 -15646 -9879 7118
2146 7118 15250 4898 -10320 -12594 -452 10533 9082 -1108 -7817 -5420 1132 5504 5568 1828
2160 1828 -4105 -7745 -4138 5732 10932 3464 -10108 -13724 -930 14446 12792 -4602 -17098 -9403
2174 -9403 9503 17232 4941 -12035 -14106 -157 12878 11330 -1913 -11561 -9011 2353 10241
2187 10241 7499 -2581 -10487 -8197 2680 11168 7410 -4651 -12296 -5984 7596 12206 3428 -8647
2201 -8647 -10338 -452 9108 7975 -816 -7495 -6523 178 5683 5904 1052 -6001 -8050 -2068 7307
2216G307K638q900j1484J33J3017J1241m787j5717p836R912J4871K009j2294j1648
2230a1538K451J2141O468n011q979k925M984N260J365j962k726k433m08K786M596
2245D069J570m789o217n49O744O227j921q053m502L659P228K705m106o234j365
2260e534L955N267J841l576n233k154L708O371J569m832o821q12O777O226j952
2275D800p682m243M113O603J416m521m216P78L600J600j005p81l55n84j319O90
2291a106L273K145l295n551p44O159N479k439p619l825M937P924J152o565o116
2306f191J539O668M116k874n554k167K622M221J589k247l169j880J084L607K263
2321C627j517m011k369K212M351J575k724l783j128L120L502O76k528k955j309
$$ plain form
2216 7307 9945 1045 -10439 -10306 2711 13952 9165 -6552 -14388 -4476 10395 12404 110 -11538
2230 -11538 -9087 3054 9522 4511 -4468 -7393 -2409 2851 4216 2254 -472 -2905 -3313 -527 4069
2245 4069 5639 850 -5367 -5916 828 7055 5134 -2919 -7421 -3762 3466 6171 2065 -4169 -5534
2260 -5534 -1579 3688 5529 1953 -3280 -5434 -1726 4645 6214 1382 -5439 -6251 526 6752 4800
2275 4800 -2882 -7125 -3012 3591 5007 486 -3730 -2952 648 2248 1243 462 107 -477 -1796 -1106
2291 -1106 2167 4312 1017 -4534 -5278 881 6360 3921 -3698 -7523 -2586 5338 6490 -75 -6191
2306 -6191 -4652 2016 6132 3258 -2296 -4463 -1841 2380 3969 1722 -1447 -3327 -2243 1364 3627
2321 3627 2110 -1901 -4270 -2058 2293 3868 1144 -2639 -3767 -647 2855 3531 1003 -1952 -3261
2336c261K422L576J260k418m861j600L557N469Q88n246n663O58O922M648k551
2351C800p085l191M638O708J129n394n283L88N106L207o42m042l083Q74K884K650
2367B664J15l117l085j8L265L693J84l934l668M05M722L702j299n066l595K090
2383b942N523K730l069n563k417L687N693J611m516n397p31N207N282l03n566
2398g71m743J706O027L510k675n526k472K975M918J411k874m351j470K971M003
2413B639J036k862l711j055L275L904P75l311l884m35L638M046m73l863l805O06
2429c480M505L229j353m620l094J857M949K664k654m810k063L678M983P52m251
2444B92m394M31M637L511j674m107k533K066L749J292k294k913q34J715K386R89
$$ plain form
2336 -3261 -839 2737 3997 1579 -3282 -4882 -1325 4144 5032 -214 -5877 -5219 1703 6351 3800
2351 3800 -3285 -6476 -1838 4870 5999 605 -4678 -4290 816 4023 3381 -661 -3744 -2870 14 2664
2367 2664 2779 -338 -3423 -3441 -176 3517 3701 -233 -3901 -3496 1226 4928 3629 -1437 -5032 -2942
2383 -2942 2581 5311 2242 -3321 -5738 -2051 3642 5253 737 -4660 -5391 -184 5098 4795 -771
2398 -771 -5514 -3808 2219 5729 3054 -2472 -4944 -1969 2949 4360 1486 -2865 -4335 -1364 2639
2413 2639 3675 813 -2898 -3953 -678 3226 4001 690 -3194 -3629 9 4055 3582 -281 -4086 -3480
2429 -3480 1025 4254 2901 -1719 -4813 -2956 1993 4657 2003 -2807 -4870 -1192 3791 4543 292
2444 292 -4102 -3671 966 4477 2803 -1304 -3837 -1771 1978 3270 976 -1937 -2771 -1056 1330 2319
2460B319j636j999r66J147K840J205j787k879q97K543K959k00k947k735R75L076
2476A018J707j370k792j267J423K803O08j551k111q37J857K568N64k010k833k12
2492b435K976K346p47l284k171K116L353M00k782k664M62L169J690j618k129m87
2508a805J540J510J07j130o49k28M08O63N93K38j713j310L90K154J545j597k925
2525b209o97K618K772r9l252j982J225L166J342j640k801o85J785K162N36j835
2541D06k325k37J593K353M02k354k375J67L090K543j288l560j386K105L304O64
2557C102k764k594N04K310J487r26j931q05O27J048P16K52q70j328p85J524K172
2574A739N10k205k558N76L108K268j759l460j361K671L076k5k972k350N44K817
$$ plain form
2460 2319 683 -1316 -2282 -1135 1705 2910 1123 -1756 -2653 -110 2849 2649 -298 -3033 -2058 1018
2476 1018 2725 1355 -1437 -2704 -1281 1522 2130 579 -1532 -2369 -512 2056 2620 610 -2223 -2435
2492 -2435 541 2887 2140 -1144 -3315 -1199 2154 2554 -228 -2892 -2430 739 2429 811 -1318 -1805
2508 -1805 -265 1245 1352 222 -427 -655 -247 416 1009 1247 -466 -1776 -1386 768 2313 716 -2209
2525 -2209 -2906 -288 2484 2385 -867 -2849 -1624 1542 2884 1244 -1557 -2242 -457 1705 2241 406
2541 406 -1919 -2156 -563 1790 2192 -162 -2537 -2370 720 3263 1975 -1585 -2971 -866 2438 3102
2557 3102 338 -2256 -1752 558 2045 1119 -812 -1617 -990 58 774 1026 156 -1172 -1957 -433 1739
2574 1739 2249 44 -2514 -1938 1170 3438 1679 -1781 -3142 -471 2605 2580 -392 -2742 -2198 619
2590F19J611j136k267j107J255J890R78r44j673j179J080K217R09j218k642k42
2606a849J616K039l9k080j663N37J864J040n33j589o53N44J007R65n0j208j164
2623a216L4J659J696o62k197j626J293K487P86j928k601J47K338J836n22k691
2639a167q45J169K022O46j226j527k13J125J172M0j154p58m39P88J454Q5j320
2656a48j131J60R11J304j00j372q38K50J237J040l41q81j181K14J314Q92k78j555
2674e03j073O99J478P02q42j764m61J471J492j37j164j135M18J137P64k13p91
2691G8p95P2P81O66J93r20j006j87J095J057m2j370j079K02J621Q80m68j180o97
2710a099M92J105Q25j51r53j564J91J559J758p00k368j829J468K644J076k030
$$ plain form
2590 619 2230 1094 -1173 -2280 -1025 865 1843 899 -774 -1953 -873 1344 2253 1035 -1607 -1849
2606 -1849 -233 1806 1767 -313 -1976 -1439 425 1465 932 -657 -1310 -766 241 1206 1156 -52 -1216
2623 -1216 -1182 477 2173 1511 -686 -2312 -1019 1468 2254 326 -2275 -2128 210 2046 1524 -1167
2639 -1167 -2012 -843 1179 1825 599 -928 -1141 -16 1156 1196 42 -716 -1155 -367 1087 1172 -148
2656 -148 -1279 -1119 -208 1096 996 -376 -1214 -964 273 1313 972 91 -1090 -876 438 1330 1052 -503
2674 -503 -1576 -877 601 1303 461 -1303 -1764 -293 1199 1062 -102 -1237 -819 318 1082 869 78
2691 78 -717 -645 136 802 995 75 -931 -1118 -23 1034 992 -378 -1457 -1255 366 1246 778 -402 -1099
2710 -1099 -607 498 1323 1172 219 -1345 -1154 405 2163 1463 -905 -2734 -1266 1378 2454 424
2726D24k854K6K596K332q91k322j395R99K172J009q00j737j151M86J528J567l10
2743A679k536j997R64L263J851k103l660j003K941L954j23l768k887J381L356
2758A312K136j822k974j365J514K462J262r01k884j816J060L371K306k016m565
2773b920j499L545M977K13m922m226J758N401K665l273m790p12L444L400m25l119
2789d83j907K64J966J831K94j662k084j085K006L440Q03l265l665L15M777L258
2805D803k370n050j517L422M315n45l948k558J557L090J191j744j253p25K74J072
2821A4J293M94j421k364l70K725K915j072m033j955K875M033k40l886k789K182
2837a599L609L61k863j614J259K245m61j865K73J686M77k013j599J825K791m87
$$ plain form
2726 424 -2430 -2404 192 2524 1633 -689 -2084 -1085 1087 2096 1296 -441 -1592 -1106 422 1989 1679
2743 1679 -857 -2854 -1890 1373 3224 1121 -2539 -3542 -601 3353 3230 -538 -3425 -2044 1312
2758 1312 3448 1626 -1348 -2713 -1199 1263 2525 1624 -1260 -3076 -2016 1355 3661 1645 -2920
2773 -2920 -4419 -874 4103 4316 -606 -4832 -3074 2327 4992 1719 -3071 -3783 -339 3061 2636 -483
2789 -483 -2390 -2126 -160 1671 1965 303 -1781 -2866 -860 2580 3383 118 -3547 -3232 1545 4803
2805 4803 2433 -2617 -4134 -712 3603 3058 -890 -3448 -1891 1199 2390 646 -607 -1332 -1058 14
2821 14 1307 1801 380 -1984 -2354 371 3286 2214 -1819 -3774 -899 3134 2894 -992 -3781 -1599
2837 -1599 2010 2371 -492 -2106 -847 1398 937 -928 -655 1031 1508 -505 -2104 -279 2512 2025
2853B025l258j976K442L176l61l050j811J818K533r3j853n85J172L72j026k68
2869g43J732J094j848k898N60L625K497k750m795l29M437L418j618m753j555L090
2885h36L294J18k521j721L83R20J060J248P9k306k892K79M684L444k809o589k136
2902f301N834O757j084q043m719M380Q042J851o571n845J301O103L333k593m061
2917a616j497J602K218J635O5j812l455j442L673N343L9o196n451K484Q501L833
2933G924o069q241m00Q097O263k946p650l305M239O045P57l949m019m34K334L404
2949B050J500j596m220k860K539O410K674n124p595r5Q064O253l329r133l484
2964g946O481P866n75p376m772L043O006J491l261l114k25J325J776R22M46j513
$$ plain form
2853 2025 -1233 -3209 -767 2409 2048 -1002 -2813 -995 1538 1445 -408 -993 179 551 -475 -743
2869 -743 989 2083 235 -2663 -2103 1522 4019 1269 -3526 -3855 582 4000 2382 -2371 -3926 -836
2885 -836 2458 2576 55 -1666 -1283 -363 697 1945 2024 -282 -3174 -2895 1789 5233 2424 -4165 -6301
2902 -6301 -467 6290 5206 -2837 -7556 -3176 4866 6717 146 -5699 -4398 1705 5038 2445 -1616
2917 -1616 -3113 -1511 707 2342 2407 595 -2860 -4302 -629 4714 4753 -1443 -6894 -4410 4091 7924
2933 7924 1855 -6386 -6786 1311 7574 4628 -3022 -6327 -2088 3957 4714 765 -3254 -3688 -1354 2050
2949 2050 3550 1954 -2266 -5126 -2587 3823 6497 1373 -6222 -6317 1747 8000 4671 -4462 -7946
2964 -7946 -1465 6401 5826 -1550 -6322 -3279 2727 4218 957 -2157 -2382 -1057 719 1641 2087 574
2980E74l236j048L748M870n48o442m353L992P421J647p079o611K286Q041L211
2995F473n043o405M58N470L276j898l844q79K096J143J21j4j72j420j727P73L566
3012A974J663l417m224M73N034L292l349n381j84N319L346k775m803r1M294J939
3028C110k181l020P53K630J61k276r60K215J744k168k489R04L436P65l418k479
3044c273K310L755M5m339k036L312L815j299m515j206M033L327k252m895k57M367
3060H92K750k461m298J56M105J947k401k813N00K722M66j632r13J488L58j428
3076e62j257J684K597p60l883j251L500L822j276n313j943M254M709j216m862
3091a757k230L206L893m69l256j393J584J436o97o59R69M01j933j726J582L610
$$ plain form
2980 574 -2662 -3710 38 4908 4360 -2082 -6435 -2443 4978 6625 -454 -7065 -4779 3262 6473
2995 6473 1430 -4975 -4517 953 4229 2331 -1513 -2392 -296 847 968 954 782 -638 -2365 -1592 1974
3012 1974 3637 220 -4004 -3531 1503 4795 1446 -3935 -4119 1200 4546 1771 -3032 -3123 1171 3110
3028 3110 929 -2091 -1338 1292 1453 -823 -1783 432 2176 8 -2481 -1577 1859 2624 -794 -3273
3044 -3273 -963 2792 2837 -1502 -3538 -226 3589 2290 -2225 -3431 602 3929 1677 -3218 -3475 892
3060 892 3642 1181 -3117 -2961 1144 3091 690 -2123 -1623 1099 1565 -67 -980 508 866 -562
3076 -562 -1819 -135 2462 1702 -2181 -3432 68 3890 2614 -2699 -4642 -388 4321 3105 -1757
3091 -1757 -3987 -781 3112 2643 -613 -2006 -422 1014 317 -342 627 1028 -905 -2631 -1049 2561
3107B561N82m304l438K316N722J545m981n220J964O051K409m224n019Q05M332
3122A101K415k340l222K78J880N74q42J44Q64m55k195k56L022K608j865m625r30
3139c844M325M160j842n486j880M045M273q51m298k039K270K898K8k026o56M55
3155d68L09m84Q09J688k48k800j802K162L888K20m158l396K194M833J285m202
3171a70l854J383M421J628k761l118P81K424Q14j314p25Q36J14j186n36J928J851
3188B516j808l024n95L452L148j872m476j379M068L836j283m420j718K953L229
3203B627l36k766j353J486J132j25p22L22K34j270r10J297J997K81k742k321J823
3220a346L692R61l750k854J436L850J246k728k865N63K774J051j286j609J22P66
$$ plain form
3107 2561 3143 -1161 -4599 -2283 3439 4984 3 -5217 -3253 2798 5207 983 -4036 -3231 1101
3122 1101 3516 1176 -2046 -1768 112 686 -156 -12 852 397 -1798 -2054 968 3576 1711 -2914 -3844
3139 -3844 481 4641 2799 -2687 -4567 -522 3751 2900 -1398 -3437 -1167 1731 1759 -267 -923 -468
3155 -468 -159 -643 166 1854 1606 -1194 -2996 -834 3054 3274 -884 -4280 -2086 2747 4032 -170
3171 -170 -4024 -2641 1780 3408 647 -2471 -1690 734 1548 234 -491 345 459 -727 -1263 665 2516
3188 2516 708 -2316 -2911 541 3689 1817 -2659 -4038 30 3866 2583 -1837 -3555 -602 2627
3203 2627 2291 -475 -1828 -342 790 665 -57 265 499 -771 -1681 -384 1613 1894 -848 -3169 -1346
3220 -1346 2346 3307 -443 -3297 -1861 1989 3235 507 -2358 -1795 979 2030 744 -865 -743 23
3236B3j99o6O90P23q76k150L31K412J773j746l315l27L329K735j659l656j117
3253c095L164K786q25l023j160J716J704k17j283n73P64k2l76L13J075j9j672
3270g43j054J311K548L14k936k180J401K988J041k797k451P76K750J002j577k124
3286a731M00J429P20l16m01Ol84k47J95J192L59j081k007L46K384J536j682k650
3304a932m64K653J924q60k581r61J797K040k72j600q07O56Q58M12m78j01j88o96
3322f00k82R81J214l24j944j210J544K296J07k217j740R93K354P46j733j809L38
3339a286J600J160j007q89k11O19J90j4m8K19m24o70K74J203K94p84j302q8J416
3358B52J227n96j718m99J256J301j96j284o82P75P14p2n96m85L98K21l34J20M48
$$ plain form
3236 23 -176 -242 448 1171 295 -1855 -1524 888 2661 915 -2400 -2727 602 3337 1678 -1978 -3095
3253 -3095 69 2855 2030 -993 -2153 -437 1267 1050 -233 -806 -42 -64 -440 -127 948 929 -743
3270 -743 -1797 -486 2062 2376 -560 -2740 -1339 1649 2690 -107 -2558 -1782 968 1970 393 -1731
3286 -1731 -1331 98 818 502 101 107 -277 -524 -329 863 1222 141 -1866 -1520 864 2400 718 -1932
3304 -1932 -2396 257 2181 1321 -1260 -2221 -424 1616 1344 -256 -1063 -407 451 863 385 284 96 -600
3322 -600 -882 99 1313 989 -955 -2165 -621 1675 1782 -435 -2175 -1182 1172 1918 185 -1624 -1286
3339 -1286 314 1474 467 -422 -633 -14 176 162 114 333 -91 -761 -487 716 1010 226 -1076 -1164 252
3358 252 1479 883 -835 -1334 -78 1223 1027 -257 -939 -164 550 478 -118 -603 -205 16 -318 -198 250
3377B50m0k65n84J43Q58M71o87p47J79Q56L07m17o43j86M78L93l07l43K39P9j78
3398a44n74L43Q75K13q12o62M18P38O38o44j055j64O68J078k53r57l49J00O20
3417G7K27q8k42m29k53P25N48P9n55r22Q1R95J009m17j204r39P76J443N78j184
3437C05j454k59J414J073j36j597n31M63J154N13k56r21p04L72R83O68k32j214
3455c59q59N17J462N30r61j698k29J530J262m6j430j348O70J617P82q09j369m04
3473a142J109R79Nm70j040o6M12P18K04l39j051k92N55J124L95j107j131p1J437
3492B29J003k27j557p29J005J331K8j074q70K31N96O40j72p39j57j43O49K74Q4
3511D02k97o46j45P54J046l63r84q36P28J113J87r37j063L44J042O52q14q08m
$$ plain form
3377 250 210 -55 -639 -496 362 833 146 -601 -422 434 741 324 -319 -505 -27 366 59 -284 -45 34 -144
3398 -144 -718 -375 500 713 -99 -761 -343 395 1033 389 -666 -830 -162 916 663 -294 -643 -543 77
3417 77 304 216 -26 -455 -708 17 565 644 89 -833 -752 243 1252 835 -369 -1308 -532 911 1489 305
3437 305 -1149 -1408 6 1079 943 -654 -1185 -722 432 945 689 -232 -936 -564 419 1087 855 -359
3455 -359 -1218 -701 761 1291 330 -1368 -1597 -67 1195 1149 -281 -1629 -959 658 1440 631 -738 -1142
3473 -1142 -33 946 951 481 -559 -625 -213 505 709 370 -681 -973 -418 706 1101 -6 -1137 -1208 229
3492 229 1232 1005 -552 -1281 -276 1055 1083 9 -861 -630 -34 606 434 -305 -462 -605 44 318 402
3511 402 105 -541 -686 68 1114 751 -233 -1069 -341 772 959 22 -1041 -697 345 997 183 -625 -629
3530f29O63K29m5l02J7j95j25R6M39O83n65q66l47J293Q16n85j582j40J142J135
3550A132j10j729p41Q50J532K38j270q07K33R13O73p08j76j17j71K33J56P52o65
3569B18p83m56O12J254J06j045j445P23J299Q23o76j588j06R97J132o2j047n64
3587f08O6O79M43J57l84r57n02N78J576K56j433j852L09K436J372j252k523l83
3605b022K058K180m21k345j364J136K003K16j308j084MO82Q33k03Q3n49p36j38
3623i75R25J408j04j725j533R99K448Q32j829k337M4K114J714n82k381r10J259
3640f33J676L41j231j195k41R88J259M84q96j516p23J278J760M19j693j938K82
3657a579K193J290r03k351n83J565J516j1j372n80K48P02L29j37J42l67o75j00
$$ plain form
3530 -629 34 263 218 -84 -67 -262 -387 -291 148 831 266 -600 -947 346 1162 577 -1005 -1145 -3 1132
3550 1132 1022 -707 -1448 -598 934 1172 -98 -905 -672 241 914 206 30 -87 -258 -25 131 883 218
3569 218 -565 -1021 -409 845 951 -94 -1539 -816 483 1306 630 -958 -1064 -67 1065 1003 -44 -608
3587 -608 -542 137 580 737 353 -604 -1106 -528 1048 1304 -129 -1981 -1672 764 2136 884 -1639 -2022
3605 -2022 36 2216 1795 -550 -1914 -778 1225 1441 133 -951 -947 -265 568 365 448 -101 -837 -975
3623 -975 -50 1358 1254 -471 -2004 -1005 1443 2275 446 -1891 -1847 267 1981 1399 -982 -1892 -633
3640 -633 1043 1384 153 -1042 -1283 -295 964 1448 552 -964 -1687 -409 1351 1770 77 -1861 -1579
3657 -1579 614 1904 1001 -1350 -1933 -368 1148 1137 -235 -815 -567 135 464 327 469 102 -573 -673
3675f73P41J377k05j712j298Q97K364M52k122j881M94K352J162j108k305k14J778
3692I9J386n70j374k95N90O64k28l09J49K4n51m2M83N28J41j174m18N05Q89J72
3712F69p01q22L56N70M94j03n05l28pJ99O38L07l73j033k70O59J556k18j386j017
3732a315N17J596N29j283j168L37J365N76j075q91M72P57K16q94j93Q46L66q60
3750a02r15L84J478M30j582j294M98J744R01j287j723K13J591J143o75j544k75
3767a015R57J103k97p67n11N9O28J18J98m65l59j07P9P35L15o42n27L5O51J37
3787C25J66n35l45O1M03P3J47O1n98m32Q6R87O51o41j389l72J278J476k48j975
3807h21r95J174K186j5j829j254P01J788M42j247j346L27J051P18r19n30K15M27
$$ plain form
3675 -673 68 1445 1240 -472 -1770 -873 1491 1943 -179 -2060 -1566 786 1948 840 -1465 -1679 99
3692 99 1485 915 -459 -754 -164 500 272 -37 112 136 -415 -457 26 554 695 -479 -897 -392 497 669
3712 669 -32 -854 -498 72 566 463 -42 -370 -377 -178 460 767 394 -639 -909 -250 1306 1088 -298 -1315
3732 -1315 -798 798 1327 44 -1124 -787 578 1154 79 -812 -340 417 633 -261 -454 392 758 -102
3750 -102 -1017 -633 845 1275 -307 -1601 -1103 641 1542 255 -1468 -1255 336 1479 804 -740 -1015
3767 -1015 -58 1045 748 -19 -530 -471 157 275 473 8 -351 -458 -379 356 671 29 -498 -463 188 325
3787 325 491 -44 -389 -328 75 148 295 356 -242 -674 -588 399 1050 409 -980 -1352 -74 1402 1154 -821
3807 -821 -1816 -642 1544 1529 -300 -1554 -853 935 1377 130 -1216 -889 162 880 -39 -569 -354 73
3825G3K4k33M5L95Q7n33l63K92J066j04j017o48K68J335K38q34j140K40R13Q91
3845I95l89j054m41L65J078O26p07j136m36R28J169J3j094j042L75J226P37q13
3863D00j497L7Q79R61l4j091n77P21N92Q0k64l71R3ln6n4O77J17n54j025K33J238
3885E02P58q32j670j23J562J231l26j903q42J057J962J60j548j470M66J423R58
3902A365n39j520l75O06R99N95q73q56m59O93Q88K39m44p42n58Q34Q16K7m34n33
3922b71l40L66P76L90n48q46m24N87R31N68r66j258k46J382J360l79j578j264
3940a760Q15K040N90r87j948l31J656J494l23j686q75N89J300L89o29q98k89M86
3958c67P56L03l10o42m91J58Q12P15j82r08p81M54J081P70q45j319m05Q62J212
$$ plain form
3825 73 97 -136 -91 304 391 -142 -505 -213 853 749 -268 -916 -648 687 925 91 -1049 -809 104 995
3845 995 606 -448 -889 -524 554 1180 473 -663 -1099 -171 998 1011 -83 -1125 -750 476 1213 400
3863 400 -1097 -1060 -181 780 746 -345 -922 -201 391 471 207 -164 -71 -74 -130 -184 493 610 56 -969 -736 502
3885 502 1260 428 -1242 -1365 197 1428 1102 -801 -1643 -586 1376 1536 -12 -1482 -1016 407 1365
3902 1365 826 -694 -1069 -463 536 1131 258 -598 -1057 -364 524 763 319 -423 -981 -147 669 696 262 -271
3922 -271 -611 -245 531 921 373 -473 -897 -310 621 1189 223 -1035 -1281 101 1461 1082 -496 -1760
3940 -1760 -945 1095 1685 698 -1250 -1581 75 1569 1246 -440 -1315 -726 574 963 334 -564 -853 -367
3958 -367 389 692 382 -260 -751 -593 219 934 752 -156 -937 -483 598 1368 523 -796 -1201 -339 873
3977H73L25j175j172M7J389J136o15j271q29N39J233Q32r21j224k96R62R74Lj025
3996b15o78K06J028K83j65r08k00L48M25L65j4m52m95Q2J89N25L73n62p50j20
4016g35O98P75J74j086q44M09J039N65p14j085k3O15R62J30r37n94K84N81N87
4035H01l53p23j51J02M07K41k30j78j10l31N04K30Q0j40o85j10N26P17L7n61o56
4056e83M0R22M84k96p68p92P79R18K54r30p72j33R52P99k52o69n78J67O05N01
4076F48k74n18m42L67N76K48k94o66j31J89N27L84l97m25l64K86N92K21k63p13
4096d49l04O16R48No64p15j3Q01M37k05q91l91M85Q05om17m33j6L97L85k18k39
4118h2n5o9K88K41j27l8l22k27L79J35J58l40l20J00L53K09k43k22QJ58K04r8
$$ plain form
3977 873 1198 23 -1149 -1102 287 1423 808 -463 -1292 -753 480 1312 391 -833 -1129 -167 807 810 -215
3996 -215 -893 -687 341 624 459 -449 -649 -301 124 489 475 23 -472 -390 -201 324 697 135 -615 -735
4016 -735 -37 738 912 -174 -1018 -609 430 995 281 -804 -827 -212 750 880 -57 -651 -367 214 801
4035 801 448 -275 -426 -324 83 324 94 -84 -194 -525 -21 209 289 149 -536 -646 -120 597 634 73 -583
4056 -583 -543 379 863 567 -201 -993 -214 704 958 28 -744 -877 75 874 622 -47 -625 -458 147 648
4076 648 374 -144 -586 -219 357 605 311 -355 -486 -297 230 614 217 -208 -572 -286 306 527 264 -449
4096 -449 -753 -137 811 816 152 -563 -576 225 662 457 -434 -825 -340 465 459 42 -391 -407 -10 375 157 -82
4118 -82 -137 -206 82 323 196 158 -164 -391 -12 123 281 -59 -379 -279 74 283 40 -182 -174 -16 188 90
4140I0Pk00m3K41J98k30k7K5j69j6J59R9o4m9k41LJ59K56l55K54k31K1M6Q9J73
4165A95r7l68Q4K64K16J05n02k17L23J86L24l92o95J44K78L99r0k17k85J45L45
4186A45Q9q0j44L9j50m8K10J00J0m54oJ68L34Q0m37k74N1Q08p4m69l21J65M12
4209A54K87k74k62j65L52L29Pm72j39J91j20J32L2n5k39J69L18n4l33k60J49M97
4231B44K26l89n12J65M21K85j1o62l49M38L91R1l84l59J69L36r5q9K72j57k76
4252b45Q6K36L22N6p35m08M68O43L23o12j077K64R26P34o57j046l38Q38J178l80
4272E76n99o39J41Q78M35m22m42l08L9O11M08l02n22p40M90P81N86n90j125k60
4292a004J016P28P3q65q29K78Q82K92j7o79l34m1N71O61r7p22o88QR53Q77l71
$$ plain form
4140 90 97 -103 -146 95 293 63 36 61 -108 -124 35 134 70 21 -220 -217 -58 198 -157 97 -134 -113 -67 22 195
4165 195 98 -270 -186 78 294 399 -103 -320 3 189 513 121 -574 -430 -152 247 157 -60 -345 -200 145
4186 145 234 154 10 49 -101 -149 61 161 171 -283 -289 -121 213 293 -144 -418 -367 441 367 -102 -423 -258 154
4209 154 441 167 -95 -260 92 421 428 -44 -183 8 -112 20 52 -3 -242 -73 245 191 -142 -402 -253 244
4231 244 470 81 -431 -266 155 440 429 -233 -582 -144 247 338 -46 -405 -236 100 5 -84 188 31 -245
4252 -245 -159 77 399 455 -280 -688 -220 423 746 134 -943 -679 247 981 324 -722 -1060 -222 956 576
4272 576 -23 -662 -521 357 792 370 -72 -380 -341 270 678 376 -146 -886 -396 385 971 381 -744 -1004
4292 -1004 12 740 813 -52 -881 -603 279 571 554 -125 -459 -500 71 732 635 -87 -775 -767 186 1063 692
4313F92j436m02Q38J109L72j165j411N44J199R79p56j250r5O02P77N6l67n97j62
4332d73J91K84M83k5p78m84L59O95P69o32j251o2Q24J245k62r98q38O03P45N02
4352H97o79n65k10L66L93K85j80o04m25K52R01L98l62j010l29Q48J017J00j281
4371a88r14O03J141R5o87o70Q6O57J97j92k67n8K53k68L46L3K42n10l95J07Q43
4392D54M21o63p75j71P80N74k17r05l03P08O56k15o01j21K26L28Pj97M0J69j94
4413Ak40K12K68P1m56l77M0Q74P9n93m61L08O65O3o01k84L50N58k14l96oL17K64
4436D42m74l11J89O53Lp33l41L29Q07j99o49k98O18K87j74k89l56M23L86k73j37
4457i7q2L73J45n26k7K96M10l38p83K12O61K51n62o45L38O80L57o95m37K71M54
$$ plain form
4313 692 -744 -1146 -308 801 1173 8 -1403 -859 340 1319 563 -687 -782 -180 597 653 286 -311 -473
4332 -473 -282 2 485 460 -318 -802 -443 252 1021 389 -862 -924 -100 1145 883 -115 -953 -350 395 897
4352 897 218 -347 -557 -191 202 487 307 -297 -722 -470 431 829 467 -543 -872 -24 993 1093 -188
4371 -188 -1102 -499 642 737 50 -620 -534 123 320 128 -139 -197 56 -212 134 167 409 -101 -496 -389 454
4392 454 875 212 -563 -734 46 620 403 -502 -805 -97 559 344 -257 -378 -152 176 183 -14 26 195 1
4413 1 -239 -27 241 312 -144 -521 -481 393 472 -121 -582 -274 391 454 -147 -431 -81 477 263 -133 -139 178 442
4436 442 -32 -343 -154 499 502 -231 -572 -243 564 365 -284 -582 36 323 149 -140 -496 -73 313 40 -97
4457 -97 -179 194 339 -187 -214 82 492 154 -629 -417 244 495 -67 -712 -374 306 663 -32 -469 -198 256
4478B56L39p01r8L13K21k58k58J95K67nm48o01O64P21k16r37j6N17P81m6j169
4499d79m15O86J086k28j133k62L85R97j79n50l58N9N38Qj58m4Ok70j11L88M30
4520C96j9n08n07N43P08j31n81o34L96Q55J27o45n95J98N21K55l45k02L1J13l21
4541c45O9O36M06o97p22o8J241N38o80j418R1J324J071p24j678j47Q56J202l14
4560F41j065k50N05P29k61m20o1J42J38l86O6P97K62p44q96J76J065M54m30j270
4580h08m3Q29P90p3r63m41K41O56K23J98n92n43J0N48O47M9p55r09L16J247L32
4601I59o64j141l59J340O46k8j221m46O44O10J0l27L3P8j54l47L06Q68j11j088
4621c92o85M58J337N83j337j486J46J818J081q17j793l26J255J246r5j184o64
$$ plain form
4478 256 595 -106 -204 109 330 72 -186 9 276 271 -177 -778 -114 607 391 -546 -562 -45 736 690 -479
4499 -479 -894 -208 878 650 -483 -745 -360 637 458 -92 -450 -391 147 155 -3 -47 -41 -311 -422 -34 396
4520 396 377 -131 -638 -95 613 482 -99 -733 -337 518 645 0 -595 -397 124 379 34 -168 -137 -24 -345
4541 -345 -276 360 766 69 -653 -721 520 1058 378 -1040 -949 375 1446 722 -956 -1103 -247 955 641
4560 641 -424 -674 -169 560 299 -121 -182 -40 98 -288 -222 575 837 93 -803 -627 438 892 462 -808
4580 -808 -851 -22 768 695 -268 -709 -468 188 411 609 17 -526 -516 32 679 728 -27 -936 -620 627 959
4601 959 295 -846 -1205 135 781 753 -468 -914 -270 340 350 23 56 134 -20 -367 -61 807 696 -392
4621 -392 -1077 -619 718 1301 -36 -1522 -1376 442 1523 706 -1087 -1413 -158 1088 993 -191 -855
4638h55L77R01N15m58n86l44o8O47K61j7j94p99k39P77Q82j49r37n82M10Q17N62
4659I21n34p33k26L16O38K22l34m32n26J40P42O96n06r04n95O43J381M05j430
4678a16j051K09J597O43q47j233o5J114O82m85q13r2M01L93l20j37J03K74m54
4697a97l66M14R12Qr31o19MJ295O57j094j013R1J058Q63l90j115l27N42O70Q2
4717E44l83m65j59L78L79J59j23n77j59K42P01qn55o49J05O43O88l96p57mL18
4738g8n2L0l9J97J9j70j79M03M31j42r89k56O86R50j05r80o47O42J097J48j068
4759a02r55N71J031K94q20p44L26P37K55n26l53M7L08K69k81j53K42Q5k84q4J34
4780cK1K53l35k61J84L67j69M8k27P3Q0K60k22j11P5j27K10r7J15p8k8o2O6O1
$$ plain form
4638 -855 -478 423 938 480 -106 -450 -518 129 390 373 179 -620 -859 -82 800 651 -286 -868 -458 359 921
4659 921 387 -346 -572 -256 382 604 270 -162 -688 -548 194 890 384 -520 -1115 -472 909 1314 -116
4678 -116 -1167 -958 639 1282 435 -798 -863 251 933 448 -365 -457 -56 337 17 -120 -17 257 -197
4697 -197 -563 -149 763 771 -160 -779 -775 520 1177 83 -930 -839 219 1082 692 -423 -750 -208 462 544
4717 544 161 -304 -463 -85 294 453 330 -247 -406 -164 537 529 -26 -675 -570 73 761 365 -392 -396 -78
4738 -78 -130 -100 -139 58 77 -93 -272 131 562 420 -569 -825 -139 811 706 -274 -921 -279 818 966 -102
4759 -102 -1057 -486 545 839 19 -725 -399 338 593 67 -286 -239 69 338 57 -96 146 231 -53 -137 -3
4780 -3 18 271 -64 -325 -141 226 57 105 -122 -49 31 291 69 -42 33 -94 116 19 134 56 28 -34 32 93
4804I3j56k41L18R0J90k19l37P9L49K89n66k52J41M04M82n27p26K4Q16L93n78
4825F6n50LO09L98n04m82M6M30K57m2l17J5J76K1qk41J64M9j32j25M3J50K68l60
4849f6l24J62M75J12j37o99j4O54R1j95j28l14K69L38N5j58l63L8K27J51oj02
4871F6m14J83J44K64k30k87R3K46J48jl37L4N7L04o2l41j8J08K09J34k61k39K57
4894E7J83k48k26K7K09J91q7m29K70K58o6j17k59L52N4p3m00l2K59K82j20j66
4916h1l01K54N00k71k24j93J39M71L6m42k96J81L87J51l66j65O9MM16k17j85O8
4938f5j0j21K12J6J97l23j13n7L41K37j17j36m35L61L46jj39k58j61R5L16P9l74
4961a10l03J40N19K63k92l59l75K49L32N03n10l49j49M63N35k66k47m90J88M74
$$ plain form
4804 93 -63 -304 14 104 294 75 -262 -183 166 455 -111 -363 -222 182 664 137 -589 -565 251 644 66
4825 66 -484 -481 128 526 22 -460 -414 16 273 231 -86 -71 105 126 118 -123 41 90 -42 -167 -124 26 294 -66
4849 -66 -390 -228 247 359 222 -477 -491 163 254 59 -69 -383 -114 224 279 121 -242 -204 23 174 168 66
4871 66 -348 -165 -21 243 13 -274 -181 65 213 212 -125 -91 -34 270 208 -133 -151 -43 166 300 39 -200 57
4894 57 240 -8 -234 -207 2 193 106 -323 -53 205 139 22 -237 115 169 96 -304 -336 -77 205 85 -81
4916 -81 -382 -128 372 101 -123 -316 -177 294 330 -112 -408 -227 160 311 -55 -220 -151 -147 269 52 -133 -65
4938 -65 -75 -196 16 32 229 -94 -207 -264 77 314 197 61 -374 -13 333 332 193 -65 -226 -131 185 264 -110
4961 -110 -413 -273 246 509 217 -142 -517 -268 64 567 57 -292 -441 22 557 291 44 -446 -258 216
4981B16n0j00k84r5J52J79j81J41J26m10o0L37M68Q0n33m25J0P13M31m98p11j64
5003f58N95O97p9r07o38M67Q28N09o00p64r2Q34N29k60m54m13J15L19M86k63j50
5024A01m52M6M72K16j59m57l22Q8N85N18m61n18r4L55L02M26n29n34L4L96M91
5045E04j22l35o58Q0O79M91oq91o54O21R90J21q61q73K45J009M72l39j042k81
5065h50P04R04l14o20n38L56O07P3j69m52P7kL37o5J06q4l37j22M10N66J6n41
5087F2o83J62P01M82m85p15j70O49P66l56n97m86K30O60L93o60l28o2M40M86R0
5108E79m72p62J15N93O01j27q79k02K83O48K19o58n29J90O17L43l19o02K0N58
5128B16J33l00k10J88J73j67j95J45M73l16m93q9L28N60p3o75m31N24Q18J27p29
$$ plain form
4981 216 166 66 -218 -313 -161 18 -163 -22 104 -306 -366 -29 439 519 -14 -439 -429 284 715 217 -494 -658
5003 -658 -63 634 555 -352 -990 -523 305 814 214 -550 -642 192 721 461 7 -406 -291 28 514 251 101
5024 101 -351 -305 167 383 224 -233 -555 -467 118 636 175 -343 -437 -82 220 646 117 -417 -383 13 504
5045 504 382 47 -611 -531 148 639 633 -258 -912 -291 699 820 -41 -914 -669 340 812 473 -569 -850
5065 -850 -146 758 444 -176 -714 -358 249 322 153 -299 -222 -224 113 48 154 70 -267 -389 21 587 603 62
5087 62 -621 -459 242 724 239 -476 -646 3 769 413 -184 -670 -440 220 613 -47 -375 -437 3 489 579
5108 579 107 -655 -540 53 654 527 -352 -554 -271 377 596 -62 -591 -401 216 559 240 -362 -342 216
5128 216 349 49 -161 27 200 33 -162 -17 456 140 -353 -442 -114 446 373 -302 -733 -209 609 736 7
5149Gn10K09M84O23p12m51o1M83L11j31n25M8J63K08k7j19N6j17n7N5J98J14l47
5172i8J37j76J90M0j31Q3K4J14l89J75K7K12P8m39j89J21N64k1l34k50Q8L26L55
5195E07m64l66J67M77l3l60j25J52J86j58k60K07K81J79o20l65K77P56K04o66
5215b4n92J02Q66M52m10r14O7M68O24j57o70l36L26L53J69j07l98j42K03K35K55
5236C70o1m28m22K20O83M32p73k49m10M74N77J3o55k83R4M17N21j76m13j62m17
5257f48N68M83J18l00q64j46P19Q97j68q09o59K99J266K94q97r81J03P51P75l10
5277D91p11m09L04M87K77j85l76k64j5O10K05Pk65o24O8M05O31k37o22l04J43
5298c84R50M2o56n49R4M38N47j13l17k57l00M37L76K89n99m13k2L70Q09k84o54
$$ plain form
5149 7 -503 -294 190 813 101 -350 -411 72 383 252 -273 -225 -62 146 119 0 56 -61 -118 -63 135 249 -98
5172 -98 39 -137 53 93 -38 45 69 183 -206 -31 -4 208 286 -153 -342 -221 343 322 -12 -262 -174 152 507
5195 507 43 -323 -156 321 288 -72 -197 -45 141 -17 -277 -70 211 390 -230 -595 -318 438 642 -24
5215 -24 -616 -514 352 804 394 -520 -453 15 639 482 -188 -524 -198 155 324 217 -181 -323 -120 115 370
5236 370 309 -119 -541 -321 362 794 21 -228 -638 -164 413 426 -229 -512 -418 -1 520 344 -69 -231 -648
5257 -648 -80 403 521 221 -643 -789 -70 827 659 -150 -809 -510 756 1050 153 -828 -725 26 801 491
5277 491 -220 -629 -325 162 439 254 -122 -386 -401 209 414 421 156 -468 -400 5 636 399 -223 -527 -384
5298 -384 566 608 -48 -597 -503 -65 482 369 52 -205 -505 -68 308 597 -2 -415 -437 -67 742 458 -196
5319a96o20M73O03L40l78q49N6O64L55j27n32j82K50K32K33Qn8l93o1pN10Q4j61
5342B44n81o4M72K62P6m85l87P7N21L14m13k65m0K74L95j66k91j12p9K41J92J13
5364B98k80k88pL8N18Q2l27k17j85N00L71k07o31M8L21L07j5m02p7p0J63N0N3
5387D3Ll3j58p5n8M94pm20k29K60N26J5l16n37L19K88K27j04m49j4K8K60J60p0
5411A53k07J28jk3j03J68k25K2K8R8J27j5j18j89J16K48q5j50q7J10J06L0n6p2
5435CJ54j96O5j43K19M0j76k08J92J68l3j36k28J70K61J21k56k87J98L09j20k04
5457h7k74K90R1J49k90j43K89K42j45j77k00K63J98k16j6j60J18K07k32R6o4q
5479f9J09J20k63Q2J44j14m5O0k6j14J88Q8o5l3J7J99k72m6J4N2l5L6Q4j29j45
$$ plain form
5319 -196 -816 -343 260 600 222 -627 -571 93 448 321 -211 -393 -143 89 322 330 272 -121 -182 -189 321 405 244
5342 244 -337 -401 71 333 409 -76 -463 -386 135 449 36 -229 -269 5 400 234 -57 -169 -248 -7 185 298
5364 298 18 -270 -277 -239 279 361 34 -183 -368 132 503 296 -335 -287 34 341 326 -76 -153 -223 -60 -10 43
5387 43 46 13 -145 -220 -278 216 209 -211 -440 -180 346 361 45 -492 -173 115 342 238 -211 -225 -197 63 223 153
5411 153 -54 74 73 50 -53 115 -110 -88 -60 38 165 150 32 -157 -41 207 122 -28 -115 -5 101 131 75 3
5435 3 157 -39 26 -117 102 142 -34 -242 -50 118 85 -51 -279 -109 152 273 17 -270 -72 237 117 -87
5457 -87 -361 -71 20 169 -121 -264 25 267 122 -55 -255 8 206 -10 -26 -186 -68 139 -93 3 -61 -69
5479 -69 40 160 -103 -21 123 9 -36 24 -2 -116 72 160 95 62 79 278 6 -40 -26 26 -9 27 111 -18 -163
5504a63L6K41L1j57j29j63L46K86k76j83m4J76J01l2l19J42M2P9j4k77J73K16
5526A12J28j57j91kL13Kj15k48K15K08m0r4l55J40L91j44j69m45J31M77J42m35
5548a36L8j02J41K59k38j47J61J90nj14j56J89l41J47K00m8m8J37r7j6Nj03J93
5571A09L0N7j98l58M05K0J4K05m03MJ86J22p0k62j73K10L80n0j16l59J46J64M5
5594A08l0k17J99j40QJ44O7o4O5k97j13K19L33l69l6j06N6L90J12l14m45K09M44
5617B23J22l9m40j93K76M55R0n85j78R9K61J68j63k26j94K54K51Q3m2l82J7J10
5639c3M41l08j36n9N9Q6K7Ok13Q7N0J09k6j31m1j59K90KN3R9k66k18J98L82l8
5664B61k61m36K46L05P4j99j98p5L71K21p6n65o3K37N26j37j11l58qM85m2J3l74
$$ plain form
5504 -163 -127 114 145 -12 -141 -304 42 328 52 -131 -175 1 102 70 -249 -107 -65 14 0 -277 -104 112
5526 112 240 83 -108 -110 203 205 90 -158 57 265 225 131 -224 -84 307 163 -6 -451 -320 157 299 -136
5548 -136 -98 -200 -59 200 -38 -185 -24 166 161 47 -109 80 -261 -114 86 38 -10 127 30 14 19 -84 109
5571 109 139 196 -2 -360 45 65 79 284 -119 -115 71 193 123 -139 -312 -102 278 228 112 -247 -101 63 108
5594 108 78 -139 60 -80 -72 72 139 75 140 -157 -270 -51 282 -87 -123 -229 -173 217 329 15 -430 -221 223
5617 223 345 306 -134 -327 -51 404 494 -91 -269 -170 91 259 96 -130 -324 -70 181 264 222 -160 -143 -33
5639 -33 408 100 -36 -95 -36 50 77 83 -130 -43 7 116 90 -41 -82 -241 49 51 104 203 -63 -281 -83 299 261
5664 261 0 -436 -190 115 189 -10 -208 -283 88 309 233 -332 -395 -158 368 231 120 -238 -246 239 197 210 -164
5687a64J81N1L0J5j05K7m9o3J91J04j97q9k00J27K02K01j59k23m1K46J90J0m45
5710a60o2K01J79k7n4k98R6n8L41k2j57j62l0K63K53k25k09r8J59L22o2j48k13
5733a71K82J96k28k19N8j7K70M8l13n8J3J46J45k45L15j59J72k67q2P6K14Q6k77
5756a5q5P6L23k48j43j61J31K24K6k74J00N9J90q8j54j16J94J10p5k9k17J05J61
5779I4J69k93k49K02Q5Q1P7l64K3J36K10l7j33j40k7K33L62l08l21r7K56P1K98
5802C28k73l80J48K57J75k03k1l05J51K77r0M6m0k17oJ62K23Q8j69m03j15N03
5824A36N32l66o43k23M35O77J7p25l41k3P81K87k88o45k74O88L91J11n06l07j32
5845d18M50L31n2l57m61M68K70J75k73k66k40J49L73K78m48j16r9L2L83K25k72
$$ plain form
5687 -164 17 68 98 113 8 35 -14 -77 114 218 21 -68 -268 -141 61 262 103 -120 -161 85 275 285 -160
5710 -160 -222 -21 158 131 77 -221 -125 -183 158 136 -21 -183 -213 50 303 78 -131 -229 -70 252 190 42 -171
5733 -171 111 307 79 -140 -82 -99 171 219 -94 -152 -139 7 152 -93 222 63 235 -32 -114 -38 176 262 -15
5756 -15 -100 -24 299 51 -92 -253 -122 102 128 -146 -46 13 203 115 -39 -155 39 149 74 45 -172 -67 94
5779 94 263 -30 -279 -77 8 89 166 -198 -175 -39 171 134 1 -139 -166 67 429 121 -200 -297 -41 30 328
5802 328 55 -325 -177 80 255 52 31 -274 -123 154 64 110 70 -147 -153 9 232 320 151 -252 -367 136
5824 136 668 302 -341 -564 -129 548 565 -160 -501 -524 257 544 256 -389 -663 25 416 527 21 -286 -418
5845 -418 32 363 311 -46 -507 -39 231 406 133 -133 -373 -224 149 427 -21 -137 -236 -204 179 404 132
5866A32k66k89K26N19Nk17l60l57O33L06p9k78m60J02N10K78k67n62j7M40N96
5887E95m82l17k42N06K48l8k64j76K10N7k5p8j15J15Q8j98n0R6J26k5j58r0R2
5910a25J06K25j75k46J14J84qqr3k07M0J14L73l62P3j58P9J50L1q7j68J04R0O8
5934A14k97Q3K19K10l11j90L29L10j51l02l01j10O97om30k39J81K47M04k80m80
5955c03j36L52M50m2k08n39L02M19q1j94j32j27P3J23J95j18j55j49J46J58LQ8
5977A25qk83n2L55O1J17m17j75rN07R5m7m76r9R6O11N8m45l53N7L33K79o2n14
6001b46k94M66M40qm71l95K52O09J53l45l31j03M19K07l49k9q0J86j97LJ36J82
6023B05n8j90j14K82J25k1k13l63R6L76M5j68l76J9K98L99J93o71j18L0K46L14
$$ plain form
5866 132 -134 -423 -197 322 327 110 -250 -607 26 332 253 -25 -485 -383 127 405 138 -424 -441 -1 595
5887 595 113 -204 -446 60 308 270 6 -170 40 97 72 -6 -121 -6 82 -116 -166 -70 56 31 -127 -217 -125
5910 -125 -19 206 31 -215 -101 83 75 67 -26 -233 -193 -79 294 -68 5 -153 -74 76 107 20 -148 -44 46 114
5934 114 -183 -100 119 329 18 -172 157 467 316 14 -287 -397 300 294 -136 -375 -194 53 457 177 -303
5955 -303 -439 -87 363 321 113 -426 -124 295 214 20 -112 -239 -166 -43 152 34 -121 -270 -124 34 37 125
5977 125 117 -166 -218 137 198 315 -102 -277 -286 221 316 269 -207 -306 -210 401 459 14 -339 -282 51 330 268 -246
6001 -246 -540 -74 366 358 -113 -508 -256 353 506 161 -170 -273 146 353 4 -25 -105 81 -116 -113 23 205
6023 205 147 -43 -157 125 250 229 16 -347 -251 125 170 2 -374 -355 -57 342 535 -136 -254 -224 22 336
6045C36k38k02o5N2M06j83k18o4O9P6K64j76j64oL2K75p8j19J49j32Rl8O3j4J45
6070A79p4l35J43K32R8j95k94Q3J32L66j94m34k16L96K65J21m33j33J39N29n3
6091C22m65RJ69J85q8k13q0J22nJ97k73j14J60O7Q6k97J15K03j04j21j0K19r8
6114a4K25m15J65l0j4L12j85o0J13p6j53K15k1j37k65K18L90%k62k13J21L65q2
6137A97k57j93p8M31P2k34j40j17L32J81m4j90J8QJ32j40p1K1J70J25m84L43L2
6160A14J09k33k29L5M22J3k43m74J56M42K04j35l24K9n9K06J02j28j27K36O7p9
6182A04J26l08J0r2nM45k00p4k77K58J40J38l19k46J09K60L01l91l8k27L11J04
6204A29l25J97n1j1m3l0J45K08k69o7nJ66J46O6n06O2K37K35q1l42q2J31K63M5
$$ plain form
6045 336 98 -104 -169 -117 289 106 -112 -176 -107 -31 233 57 -107 -113 -81 194 116 -3 146 14 23 -15 48 34 179
6070 179 105 -230 -87 145 243 48 -246 -163 -31 335 141 -293 -509 -113 152 273 -160 -293 -154 375 322
6091 322 -143 -134 35 220 132 -81 -161 -39 -44 153 -120 -234 -74 -7 79 -218 -103 100 -4 -125 -135 84 -14
6114 -14 211 -204 -39 -69 -83 229 44 -16 97 21 -132 83 62 -75 -340 -122 268 268 6 -207 -86 279 197
6137 197 -60 -253 -331 100 172 -62 -202 -319 13 194 150 -40 -22 -14 118 -22 -93 -72 98 223 -261 82 114
6160 114 223 -10 -239 -204 218 231 -12 -486 -330 112 316 181 -143 -114 -173 33 135 7 -120 116 183 104
6182 104 230 -78 -68 -160 -165 280 80 6 -271 -13 127 265 -54 -300 -191 69 370 -21 -59 -286 25 129
6204 129 -196 1 -50 -61 -104 -134 11 219 -50 -117 -122 44 190 256 -250 -188 49 284 203 -139 -221 -90 173 218
6228B18j88k68J15J42K51l88nK1J94k12K11o7k51J8J30J56l7J0K1M0j7J77m38
6251a67P5o3K8L10n4k28k8J51l0J84k08q6M0r1J76J40Pj33j5L0K27j30m5m4m12
6276c66L86j13L59m08k02J50M12O8k12j95j5J56J56j08o9k72K19K52l0n9l42L63
6298A30o9J42Mk91K1o0K34j71K47k67NL6J41J45m79M2p6K77L34L8n90j97L18K38
6322A52Oj63j43o1K63P7r7j51O2m4k9K22N3j29r3r9L6K11N2l4k36nK47Q0j39l81
6348c43K77J83K0k50j12P6L70p2l11J51k3J03O5p4l5j14R4P2k50K63m4j92L2k4
6372a38L38%l16N2J3J20J13q5j64l4J08K73j94j83J22j12J36PK88k36k88K38n6
6395BK07j29j51m6J3J03J47k12m6r7J80K22K5j51k94J44J32K14Mm79R9J34j07
$$ plain form
6228 218 30 -238 -123 19 270 -118 -123 -102 92 -120 91 24 -227 -209 -79 77 40 50 71 111 94 271 -167
6251 -167 -92 -155 -127 183 129 -99 -127 24 -6 178 -30 -116 -76 -167 9 149 156 23 8 38 265 135 90 46 -366
6276 -366 20 -93 266 -142 -344 -194 218 286 74 -121 -136 20 176 68 -1 -273 -54 198 168 109 -233 130
6298 130 61 203 207 -84 -63 -123 111 -60 187 -80 -75 -39 102 247 -232 -190 -266 11 345 383 -207 -404 -86 152
6322 152 158 -5 -148 -209 54 131 34 -117 -55 -99 -128 94 147 18 -75 -174 -138 73 125 91 -145 -150 97 177 38 -343
6348 -343 -66 117 137 -113 -225 -149 221 149 -162 -11 -34 69 134 60 25 -89 5 77 -173 90 46 -146 -114 -138
6372 -138 200 200 -116 -64 -51 69 182 97 -67 -101 7 280 86 -97 25 -87 49 56 344 108 -180 58 2
6395 2 209 80 -71 -117 -104 -1 146 -66 -112 -209 -29 193 218 67 -227 -83 49 263 267 -212 -113 21 -86
6418h6J13Q6j64J34o5O1j6rj77N3R0P4J7k2q4j92L3M23J0l17N0r2R2Q7p6j21l4
6445a32K4L12p6o6nj83J34K00J18k89j66p6K02J50o7o3j50o0L30M4oq3k60J15
6469e3K15P8j59o3k69K91qk5J04j49k77K22J49L6J20m40k29N45K8J67k81l19%
6492c17M25K71k57l71K9O1J63K15k12j56j06L32o1K28j84o0j02J59K3J34pl76
6514a69K4J4N48j46m40K0K7M05j57J10k19l81L48K12p6j32j29q0K94N7J37l58
6536i1rq8J63K27m6j75j67J24J76J34j99P3j43J25n7l0l6M6n9n1RN4K16k32k9
6561f5N4%O4J40m26L4J99L49p2k39k53J40J38J99l48l7J60KK12l72PJ17k1j89
6585b07J46J54O6O6j66k06j9J80K33k22k30O5Q5J26o0L7k02K10j42M0J42l2j82
$$ plain form
6418 -86 27 113 -51 83 18 79 63 54 -123 -70 20 94 111 89 5 -187 -154 269 279 -38 12 -80 12 99 23 -98 -132
6445 -132 -108 204 128 62 57 -126 8 208 326 37 -129 -205 -3 147 80 17 -133 -193 137 181 175 92 -168 -53
6469 -53 162 240 81 18 -251 40 32 7 111 -38 -315 -93 56 92 212 -228 -457 88 116 283 2 -317 -317
6492 -317 108 379 122 -249 -220 -159 4 219 7 -149 -255 77 16 244 60 0 -102 57 80 214 207 -169
6514 -169 -145 -131 417 271 -169 -149 -122 283 126 236 17 -364 -16 196 120 -12 -141 -221 73 130 267 -91
6536 -91 -100 -188 -25 202 156 -19 -186 -62 114 248 49 122 -21 104 47 17 -19 27 -32 -83 -74 -20 196 -36 -65
6561 -65 -11 -11 53 193 -233 -199 0 349 277 38 -215 -75 63 262 -86 -123 37 39 251 -121 -114 3 -18 -207
6585 -207 -61 93 159 225 59 -147 -166 14 247 25 -205 -140 -55 71 11 48 -154 56 -86 -46 96 64 -118
6608a18j73J76L58k46K0k32L24l0P3j99k65J86L22j33o2j99J60K01k34n1K83k22
6630f1K64l41K8K25l7J63n00L0K30L09j42k20k85K02L49N4l45q4q0M15Q8j15m22
6653b75O7L04J12k62r3J44o0k8k5Q4j22J79k30PK04j39J58j04o7J03j1Q9m7nk06
6678b23K02L3K07o5k09j16R4J23O8R1l54j52K79M85k90l81N1R5K99o3k84j36L04
6701E8J21n2j13q0N8j6J09j81j0J85q6k2n3K23J00k22pq2J75L7L8j19n22K50L32
6726A21K71m67l20K42K36L1j2k28k8l9N33k11q9r8R3p8J34m4j50K4n4J22O6l2
6750B3l94K65J31L7K%l5K22k90j6j86L03j3J21m59N2L59M1o5m00J1M00J55j12
6774A52m39r4L81K49j11m74j50N34K93k92p1j40R9L46l6n53NL93j10M7r8m9K3
$$ plain form
6608 -118 -291 -115 243 -3 17 -215 109 79 152 -47 -312 -126 196 63 1 -198 -38 163 -71 -122 161 -61
6630 -61 203 -138 -110 115 78 241 -259 -229 1 310 168 -52 -337 -135 214 268 -77 -161 -241 174 262 147 -275
6653 -275 -208 96 208 -54 -147 -3 -63 -91 -116 -32 -154 25 -205 -198 6 -133 25 -79 -146 -43 -54 35 -12 -17 -223
6678 -223 -21 12 219 154 -55 -171 -77 46 114 205 -149 -301 -22 463 173 -208 -157 -62 237 174 -110 -246 58
6701 58 179 127 14 -66 -8 -24 85 -96 -106 79 -7 -29 -82 141 241 19 12 -70 105 142 180 61 -461 -211 121
6726 121 392 -75 -395 -153 83 114 102 -126 -154 -193 340 129 40 -58 35 -43 91 47 -103 -79 -133 -11 55 23
6750 23 -371 -106 25 62 64 64 29 251 -39 -55 -241 62 49 170 -289 -237 122 163 98 -302 -291 109 264 152
6774 152 -287 -381 0 249 138 -336 -486 48 341 49 -22 -162 -63 283 247 -306 -301 92 -18 29 -69 -118 -95
6797i5K85k70l5L6L25k59k0o0j23L26j8j09k62J17K23J22j56j62j05L40P2j16
6819E6J44l22j59L57kK1l44r4L10J85k7k36j83L23K03N9l07l64L29K52Rk66j89
6842b45J70N6J15rj39j3J96l9k38kK00J44k98q1K8L48K21j92l86pP0L65j21m28
6866b85P8J44K33Q7k75k04J66K36O3k67j93j6K14J08J04l07p4K50k3j23J23j54
6888a15J28R3P1j62j58J03j9K68r6n9p6K5K2M6k97l4L58J13k33k90J77L57j02
6911A20k78o2L83N9j2j39k27K00K22j14l69j7J61M67R7m46k78N3L24J46j82l19
6933b11j87N21pJ4l21K87j39J73L1j9k15K28o8o9j19K43j91Q7j02Q7K2P9j22j07
6957a05J34j73J89O1j3j80j06J00K85o7j99k99K28K40J02j98k67O2L59K2K3l85
$$ plain form
6797 -95 190 -80 -115 -79 246 -13 -33 -93 -216 110 92 -17 -279 -162 61 183 27 -135 -240 100 172 56
6819 56 200 -122 -281 76 74 95 -249 -343 -33 152 125 -111 -294 29 232 291 -16 -380 -51 201 210 -56 -245
6842 -245 -75 -19 96 87 -52 -65 131 92 -146 -148 52 196 -102 -183 -155 193 414 222 -164 -171 -101 264 143 -285
6866 -285 -207 -63 170 257 -18 -222 -56 180 243 -24 -217 -233 -19 89 193 -114 -188 62 39 -84 39 -115
6888 -115 13 106 177 15 -143 -40 -59 209 113 54 -22 3 25 71 -226 -260 98 211 -22 -312 -135 222 120
6911 120 -158 -220 163 222 210 71 -156 44 266 152 -217 -234 -73 394 491 45 -233 -180 144 290 108 -211
6933 -211 -398 123 116 130 -191 96 -43 130 161 142 -73 155 87 18 -101 142 -49 38 -64 23 45 124 2 -105
6957 -105 29 -144 45 106 93 -87 -193 -93 192 125 -74 -373 -145 95 197 -1 -268 -206 153 175 198 -187
6979a87n3K23M09j91n98L11J71J17k31p6m0J48J33j52k16k2M57r3m8k87L2K23
7001C0K59k17j95J59J08j09j0J8k26K49M1N3l11J36j12J27O4q3n2n0k3K06K9k05
7025a14J71j6p8N6k5J7j2N6L9j19k22L18K6oj65j15N2M16k47k36mJ86J18O7j96
7050c3n9L0L49j52k31K6Q8R5j45R4j01r0K72j07k4j23J30q5q4P8L1k5K10K1k33
7075f8L5q4L86j25m27J42J5L45k29l7N9jp6k1K66l22R3J2o4J62R4j85J40o4J29
7100A75k4q4n5J7N3o7p5K9j9j64K16L3o3O5r8lL0n0P7N4k26l1J28J86j5j05l20
7127c36K01K73M3l32j76L44M0O5P5k57j40L00J8N9j14j26m4Q4K08k81L46l05p1
7150a26R9J01J63k82j67q5K26Q8M8j23j10l8P5J38N3k43J43m6J70O2n0L0j41p1
$$ plain form
6979 -187 -240 -17 392 201 -397 -86 85 202 -29 -105 -145 3 136 -16 -232 -254 203 110 62 -225 -193 30
7001 30 289 72 -123 36 144 35 25 43 -183 66 107 160 -151 -15 -127 0 64 -19 -71 -121 -144 62 91 -114
7025 -114 57 41 -37 19 -6 11 -1 55 94 -25 -247 71 97 91 -74 -189 -137 279 32 -204 -208 -22 96 163 -33
7050 -33 -92 -62 287 135 -96 -70 18 113 -32 62 -39 -129 143 36 12 -111 19 -66 -150 -72 -41 -66 144 165 -68
7075 -68 -33 -117 269 144 -283 -141 -126 219 -10 -47 12 11 -65 -86 180 -142 -49 -37 -101 61 155 -30 110 46 175
7100 175 151 67 12 29 82 15 -60 -31 -50 -214 2 35 -28 37 -61 -64 -34 -84 -7 47 -179 -210 -82 104 89 -16 -336
7127 -336 -135 138 181 -151 -327 17 57 122 197 -60 -200 100 118 177 63 -63 -107 -23 185 -96 250 -55 -126
7150 -126 -27 74 237 -45 -212 -297 -71 17 65 -58 -168 -206 -131 7 60 -183 -40 -86 84 146 96 126 -15 -86
7174h6L73j63o2j76j28K98K50k08k53k58M97n4K47j61j56J0K8O2Q1j8k8j09n4
7197f8K02o3j7j06J1L6R3qj26j63J38OK15L9j41j81N2J22O1M1l18L6Q5R6p7j3
7223d8Q1j83J46j2L2k3j61J16M8K22j98n1l6R1J02j98J85k10L5J09n4n2j59o0
7247b78K89r3P4OK47k55Q6M1m4Q3r7K6j61R7K08j37j33o2K3J83L7j52q3J70o8
7272GO2j98J79L8J0Nj51Q6Rk4J71k47L7J05j00J94j18j34O4N4L2m07J86J04%M
7298c2P4m8K5q2K2R2j04L8J08j55K57k68m7J00P4m9k9j0O9q7l4J94qk11L13p3
7324A29k26J39Q6J22j77o5j56J9J27p6R8j08O4K4K25k05j44J47Q1K9P4j23p9m3
7348c8K11P5k58K9k24J95o5J93j50M7j79J18J00N5m7j50J76j54K04p2R2k14r2
$$ plain form
7174 -86 287 124 62 -114 -242 56 306 98 -155 -413 84 30 277 116 -40 -30 -2 60 141 123 95 -14 -68
7197 -68 134 71 54 -52 -41 -5 88 80 -46 -209 -71 -65 150 189 48 -133 -81 41 102 143 -175 -139 -54 42 -35 -48
7223 -48 33 -150 -4 -16 16 -7 -168 -52 -4 218 20 -31 -67 24 126 -72 113 -97 -62 47 -7 -59 -218 -278
7247 -278 11 -82 -8 -2 245 -10 76 117 73 156 59 85 -76 21 229 92 -41 -103 -80 103 140 -12 -95 75 7
7272 7 69 -129 50 88 98 103 -48 38 47 23 194 -53 -16 89 -11 183 65 -69 -5 49 81 -326 -140 -36 -36 -32
7298 -32 42 -6 19 -63 -41 51 -53 -15 93 -62 195 -73 -120 -20 54 5 -24 -34 35 -52 -86 108 100 -111 202 129
7324 129 -97 42 128 250 73 8 -148 -129 -2 -78 20 -88 -24 0 225 20 -124 23 104 133 207 84 5 -38
7348 -38 173 248 -10 19 -205 -10 -75 118 -32 15 -164 -46 54 109 62 -88 88 -66 138 66 158 -56 -148
7371a48Q2K08j34Qk03K0P1J08N4m6k18J38J61j18J68l51J27O0K30r3r2j43J2J90
7395I1R1o0j29J16q4j6J90k3r2j38N8Q0k9M5Lj0m5Jj4q2K11m20P2K34J17q7m2
7422C8j43K5J38J7Oq7j10J75J15n2k31o9L30o6K9k26P8J10o1o2K03j50L0m0j80
7447a83l5O7J74joj04J50L6P9l77J22N0J24J1j41n4oM6o9n8R4O3%J61K0k19L3
7474b3o2J31j8L4J4j03j60L52j28k07n3K98m8q0j5n3K6Q5m1qJ21p4J73j25p8j14
7500a56K00j71K60k6j05J46j26r8o4N0J47J69l49p7K56j4K14l43K5k4P7J10m7
7523E4k08J07O3J27j99j64Q7J38K1k8j26J81p0Q7m4j39J26O8rp1M6n8j26J77p
7548C3Jk9N7pj10p5p8K00k0k6r8k3J36J52M3k58k25J91M55j80m8j77J33jP3j82
$$ plain form
7371 -148 -66 142 8 16 -187 -167 -96 12 66 20 -198 -60 101 -17 151 -200 -73 -13 217 124 32 -111 -99 91
7395 91 182 122 -7 109 25 9 199 176 84 -54 4 84 55 100 103 93 48 49 35 -47 164 -256 -184 50 167 80 38
7422 38 -105 -80 58 75 81 -6 -116 59 174 122 -109 -178 152 86 115 -111 -33 77 16 -46 157 7 37 -3 -183
7447 -183 -218 -151 23 22 16 -88 62 98 177 -200 -78 -28 96 107 -34 -88 -94 -48 -117 -175 -81 -18 -18 143 163 -56 -23
7474 -23 -85 46 28 62 76 -27 -187 165 37 -170 -223 75 27 -53 -68 -121 -95 -10 -51 -59 62 -12 161 36 -42 -156
7500 -156 44 -127 133 107 2 148 22 -76 -140 -90 57 226 -123 -200 56 42 256 -87 -62 -86 -9 101 54
7523 54 -154 -47 16 143 -56 -220 -133 5 26 -2 -128 53 -17 70 26 -113 13 81 72 1 47 -11 -137 40 33
7548 33 34 5 62 55 -55 -130 -208 -8 -28 -54 -152 -175 -39 113 156 -102 -327 -136 319 139 91 -86 47 46 119 -63
7574f3j47K19R4P2k97n7p9L61J88j62l91J54K76Q4r4l54J58K3J00K6j37j31J31
7597b6O7M5L6j46K9r9M2n8J72Q0j45O6k37J14N0rJ78N3j77j18J49J03m9k76Q8
7622f8K1J64k59K01k11P8J74j67R3k89M49p0P4l22k4L98j25N3k24j52L57L6k48
7645f1k15J95K02Q6o3l03O9K87p1J04m69N5J77K06J5m47N7J69P1j14R4j44K1K41
7669A62k49L9kN8J8N7k04J5K75j60j04J36n5J22M9j69j42j01L68J2J76k11k00
7692a10r6L44J44k29m0j43M5L35j49l32J7K71K19j53j22k40K15J78k3j11lj64
7714a47J44K33m38O2J74k2J33j75r0L1J82J52l30N7J13J9j18p3m0kL34p4k82J6
7738a41O6J22J19l01MQ0P1L6n2O4p9m5n5K26k84Q2K22j21J33j44j99J88k5K40
$$ plain form
7574 -63 -210 9 103 175 -122 -179 -258 103 291 129 -262 -108 168 252 158 -196 -38 -15 85 111 -26 -157 -26
7597 -26 41 86 122 -24 5 -94 -52 -110 62 142 -3 63 -174 -60 -10 -19 159 212 35 -83 66 169 120 -156 -68
7622 -68 -47 117 -142 59 -152 -74 100 -67 26 -263 186 116 190 -132 -156 242 117 170 -54 -206 151 187 -61
7645 -61 -276 -81 121 207 144 -159 -90 197 126 230 -239 -184 -7 199 214 -233 -176 -7 64 -50 44 -100 -79 162
7669 162 -87 -48 -50 8 26 83 -121 -106 169 9 -95 41 -14 108 157 -12 -154 -255 113 125 301 90 -110
7692 -110 -206 138 282 53 13 -130 -85 250 101 -231 -214 57 276 123 1 -239 -24 154 131 20 17 -147
7714 -147 -3 230 -208 -146 28 6 139 -36 -126 -95 87 239 -91 -34 79 98 -20 -93 -133 -135 199 125 -157 -141
7738 -141 -75 47 166 -135 -131 -51 20 56 4 68 -11 -56 -111 115 -169 -87 135 14 147 3 -196 -8 -33 207
7762B07k86M3J69j36J65j56q4ON0J07l1j77o3M52k60oj89P4K34Q5l35j79K21J73
7786H4m6k09J16K9P4J0k57R7J19J05r0j3j34L7K23L0j83j2%J41j46qo8L0k5K76
7812A80j75l6J1n6J16n4k7j0J39j19Q5r5J7O4k91L01R2k57R2l5J23n8J2R8k47
7837a30K20O1l18J78J50r3j96l4K62k2p4m7q0m9K41K97l03k91J54J22Q9J41m78
7860b00J6K20R6m9o8j10J91r2J35p7j79q0J79J53N1j23k51k1JK27K36k46j01j24
7884b16K22J21K8N0l72o8K56J32J1j42j04j3K69l5o2m9k84K07PK82k32Q4k06N3
7908f1J89qk20q2K14J95k3l36n8o4K42J62m8j46Lk87M11K9k55kN4J58j38K39N9
7933B27k34j93J25J86J8Lk96o8L00J40j93l0j21PK00K74l95j1j39J61K20j12j48
$$ plain form
7762 207 -79 -36 133 -3 162 6 -78 -72 -22 85 54 -123 -186 266 6 0 -189 -115 119 204 -131 -310 -89 84
7786 84 38 -171 -55 -26 48 58 -199 -102 17 122 32 19 -115 -78 145 175 -8 -20 -20 121 -25 -33 -101 -71 -96 180
7812 180 5 -31 -20 -76 40 -14 -41 -51 88 -31 54 -41 -24 40 -251 50 142 -115 -23 -58 65 7 19 117 -130
7837 -130 90 151 -167 11 161 68 -128 -162 100 78 4 -43 -123 -172 69 366 63 -228 -74 48 137 278 -200
7860 -200 -184 36 132 83 15 -95 96 4 139 62 -117 -197 -18 135 186 63 -188 -209 -208 19 255 9 -92 -216
7884 -216 6 127 155 205 -167 -235 21 153 164 22 -82 -95 174 139 77 28 -256 -49 -42 240 8 92 -114 -61
7908 -61 128 120 -100 -182 32 227 204 -132 -190 -254 -12 150 102 -44 -41 -328 83 112 -143 -145 -91 67 -71 168 227
7933 227 -7 -200 -75 111 129 132 -164 -232 68 208 15 -15 -136 -129 71 345 -50 -61 -200 -39 181 69 -79
7956g9j55M0J00K74q0k24L1J00N0P4k9j84j35J61N30j02m50N1j83K41J77j06k00
7979i8j20J79J40K27m99q4J47Q3J71n9k1j48Q6P4R1k84k1J43p3J55J34j11j52
8002d0M1j07K08m8q7j45R5K2l7P2l1K1L5J88j90J36k72L7K74%j14o9j15O4O5J79
8028A82j98j7K3j9Q9J15l30J54lK22Rj65k37K7N66j63k47k71K05j58L93p2k34
8051a29j81K53K40j55N5p0n1J25j07R7O4r1j00k29M03k8J56l05j82J28J73J71
8073B37j59k48j0J75J57j06N8q6j70K01J46j85n3k61K08L09j57L8l30J32p2K53
8095G7Q0k88l3R7K15J21k24k46K96L7J03r1j26KL2j17p7K09k0J14l3l30K83J67
8119B48l27r2N6R5J45R3k01j85J86J74l5p9k22R6J31L6K5k56N6J34j23K43k78
$$ plain form
7956 -79 -234 -194 -94 180 100 -124 -93 7 57 131 102 -82 -217 -56 474 372 -78 -27 -210 31 208 102 -98
7979 -98 -218 -39 101 328 -171 -255 -108 -25 146 87 66 -82 4 78 169 -115 -136 7 -66 89 223 112 -40
8002 -40 1 -106 102 54 -33 -178 -83 -61 -98 -26 -57 -36 -1 187 -3 133 -139 -102 172 172 58 -11 -126 -62 3 182
8028 182 -16 -33 -10 -29 60 175 -155 -1 -4 218 227 62 -175 -148 418 255 8 -263 -58 -216 177 105 -129
8051 -129 -310 -57 183 28 83 13 -38 87 -20 77 141 50 -50 -279 124 96 252 -53 -235 -107 66 237
8073 237 78 -170 -180 -5 152 46 104 18 -152 49 195 10 -43 -304 -96 213 56 94 -236 -104 -176 77
8095 77 157 -131 -164 -67 148 269 45 -201 95 132 235 144 18 20 52 -65 -142 67 47 161 128 -202 81 248
8119 248 -79 -171 -115 -20 125 218 17 -168 18 192 157 78 -144 -48 83 119 144 -112 -56 78 -45 198 -80
8142h0R2k65J77J58kj50m4J51O3P7k6k84OJ37j02J97j02j62J31J1Rj48J66J28
8166A38k91J40J63j44J15K4k43J61mL7j06k78J38J27J41l6k34j3L00L4r3j83P9
8189b8J26j08
$$ plain form
8142 -80 12 -253 -76 82 80 -70 -114 37 100 177 151 -133 -127 10 -92 105 3 -159 -28 -17 -8 -156 10 138
8166 138 -153 -13 150 6 121 145 -98 63 59 96 -10 -288 -150 -23 118 82 -152 -165 135 169 76 -107 -28
8189 -28 98 -10
8191a0
$$ Imaginary data points
##PAGE= N=2
##DATA TABLE= (X++(I..I)), XYDATA
0@%%%%%%%%%jRj6J6j9K7l2M0m9N7p2Q8j05J24j48J76k06K38k74L18l66M18m78
32b55N44o16O97p86Q84r93J110j237J380j536J705j891K091k310K553k816L103
49A627l421L769m150M574n045N571o163O833p599Q485r524J0760j2262J4136j6547
64h956J9781k4373L1455m3927P2297k55604K6880N73823q322m04001l83305J46448
76b57804L91930K07405k07954k91878q2089J87110J79794L0660j04901j07420
86e5147o9936K5970J15257J40524j0062j88405j76185O9167K46596J44846j40789
97A01836k56846p5907J88451K24597J3821j99136j73779K8107J73571J29446k3634
108A30527j42945j32607k174J52860J70040j1715k12467j77292Q2102K62929J27021
$$ plain form
0 0 0 0 0 0 0 0 0 0 0 -1 8 -8 8 -11 16 -16 24 -25 32 -40 48 -57 67 -81 95 -111 127 -147 171 -195 223 -255
32 -255 289 -327 370 -416 468 -525 585 -652 728 -808 897 -994 1097 -1213 1340 -1476 1627
49 1627 -1794 1975 -2175 2399 -2646 2925 -3238 3595 -4004 4481 -5043 5717 -6545 7591 -8956
64 -8956 10825 -13548 17907 -26020 46277 -209327 -182447 391376 383054 -20947 -404252 -257804
76 -257804 134126 341531 133577 -158301 -240390 -53280 126514 157174 52273 -55147
86 -55147 -125083 -99113 16144 156668 146606 -41799 -217984 -148817 97779 242625 101836
97 101836 -155010 -230917 -42466 182131 195952 -3184 -176963 -148856 24715 154161 130527
108 130527 -12418 -145025 -147199 5661 175701 163986 -48481 -225773 -143671 119258 246279
119B46279j73060k62354k5649K40285K00013q9680k47724q0085J70335J71367
129A49727m8727j66939l9122J14214P0442p3501q2801N0696J07927j3887j34455
140f6426o0519J20446J48945l7866j89178q3216J43842J78627k6757j88574r4242
151a54918J10411J50275M35j23273p4881M9066Q0153Q287m6664k1207K0827Q047
163F558k5130o587M0967L1525l3666n9873Q0O1651L7870k8305m5952j1187J9175
176a2874J7599J1465J3321p945m5826m1848K9062R3887M5940q8300j31901L795
188a13625J60775J19290r3307j97911l8956J76276J61674o2100k00911p6388J36264
199b8919J57523j9396j50648p7686Q1794J05860j1804q1918k0385N3608K2856
$$ plain form
119 246279 73219 -189135 -214784 25501 225514 135834 -111890 -191975 -21640 149727
129 149727 101000 -65939 -105061 9153 79595 6094 -76707 -26011 81916 68029 -66426
140 -66426 -126945 -6499 142446 104580 -84598 -167814 -23972 154655 127898 -60676 -154918
151 -154918 -44507 105768 106203 -17070 -91951 -42885 37268 45555 -1109 -22316 -1489 6558
163 6558 -18572 -25159 15808 47333 13667 -46206 -46126 15525 53395 25090 -20862 -32049 -12874
176 -12874 4725 16190 29511 21566 -24260 -66108 -37046 56841 102781 14481 -117420 -113625
188 -113625 47150 166440 73133 -124778 -163734 12542 174216 112116 -88795 -165183 -28919
199 -28919 128604 109208 -41440 -119126 -37332 68528 56724 -25194 -45579 8029 30885
210C0885m8772k5636N9107N7288m4485r9279j2766J10016R2470n8042j42148m3759
222a25121J16534J29465k5943j43627p5915P5085J20285K3024q3303p9501K521
233f6496O3235N8843M169n0672n9199j2561N5106P3037P601p7104q0407J4603
245f9845J02729O5868n8511j09741j9529R0270P7849l1015q3009k1959N1149M2300
257C6556j6520l2568O800K4030j3576l8827N960O3526L2762o5698q8554J7405
269f8704J16237O2254q5315j24893K706J28130Q6531o4124j27283k5912J00783
280D10R1939k8368r9254l8762N7309O2928o400m5798j9153J5278J1047l972M947
293B151J4099m204k8402j7619K4151M1883M797m2712l7720J5961N1093K0912l2317
$$ plain form
210 30885 -17887 -43523 15584 72872 28387 -70892 -83658 26358 118828 60786 -81362 -125121
222 -125121 -8587 120878 94935 -48692 -124607 -49522 70763 93787 10484 -69017 -66496
233 -66496 -3261 55582 59751 9079 -50120 -62681 -7575 65462 73063 -4041 -84448 -69845
245 -69845 32884 98752 40241 -69500 -89029 1241 79090 48075 -34934 -56893 -5744 36556
257 36556 20036 -12532 -5732 18298 4722 -34105 -28145 35381 68143 2445 -86109 -68704
269 -68704 47533 109787 24472 -100421 -97715 30415 116946 52822 -74461 -100373 410
280 410 92349 63981 -35273 -74035 -16726 46202 39802 -5996 -25149 -9871 1176 -2796 2151
293 2151 16250 12046 -16356 -33975 -9824 32059 36856 -5856 -43576 -27615 23478 44390 12073
306A2073l9415j267K7393K0342p11j0352j4790j7294J643L0177L0063j1823n0951
319b4912k9884L6757O5522J1615o3876o3596K3030Q4190L4860n7987p3838M797
331e3322P0960M0284l5581n5078o193L8889K7335j5103k4704J235J4317q98j3695
344a1554M404K6997N468l4817k8565K3055N0672J0179m9236m5068J7526N6103
356B5164K5302l7210n3133k553M5692L5221j3952m1258j7339K0339K7170R130
368B2573j0371j9265j2408N530K1988J8886q480k9756j6909J5082L1711J1744
380C0325k5103l2442q98L0495K5174j0848k9817r824J5836J7992K702p989p643
393b040m389j574O481J2502M526j1202j9451n551J9509K3290l182k9223k0796
$$ plain form
306 12073 -27342 -28609 -1216 19126 18415 8063 -6727 -24021 -22378 7799 37862 26039 -24912
319 -24912 -54796 -18039 47483 59098 -4778 -68374 -45344 38846 73706 15719 -58119 -53322
331 -53322 17638 57922 22341 -32737 -38930 -41 27294 12191 -12513 -11278 3039 2141 -11554
344 -11554 -7150 19847 25315 -9502 -38067 -15012 35660 45839 -3397 -48465 -30939 25164
356 25164 50466 13256 -39877 -42430 3262 38483 24531 -16727 -34066 -13727 13443 22573
368 22573 12202 -7063 -19471 -13941 8047 26933 18453 -11303 -28212 -13130 18581 30325
380 30325 5222 -27220 -28118 2377 27551 16703 -13114 -22938 -7102 10890 13592 5603 -2040
393 -2040 -6429 -8003 -1522 10980 15506 4304 -15147 -20698 -1189 22101 18919 -10304 -31100
406c1100J6107L3501Q136k4820k5076M703K5499J4599r962j8397o263J0802J1986
419I715j102q305l659J453Jk079K646O161q29r019n465N200J0965L519p055r065
435f918j350Q649R043j493q509m470L018L931k54p38J917o48o337m296M265R875
451E685M391q240j2955l122J3653J7424r75k0642j4737Q509K2052J0038j2726
464H355j9712o259J1197J7396N671j1638j6496o396R647J7248Q876q506k0133
477a0750j4009J2636L0184J2813k1554l3856o103L0865L2003l209l3788k8254
489c3022Q389L5283K1377j3451l2626j7611J3703K8529J6873q893k9297k2812
501c3558J1171L6753K5921j6598m5567k1871K8641M7900J3654l8387m7728j103
$$ plain form
406 -31100 -14993 18508 26644 1824 -23252 -18549 6950 21549 11587 -6810 -13073 -2271 9715
419 9715 8613 308 -3351 -1898 -1897 -3976 -1330 4831 4002 -5017 -10482 -5282 5683 9202 2147 -6918
435 -6918 -8268 381 9424 7931 -578 -5048 -2030 1901 1647 909 2826 2178 -4159 -8455 -4190 5685
451 5685 10076 1836 -11119 -14241 -588 16836 15861 -4781 -19518 -11009 11043 21081 8355
464 8355 -11357 -17616 -6419 10977 16648 5010 -11486 -17882 -8235 9013 17889 9383 -10750
477 -10750 -24759 -12123 18061 30874 9320 -24536 -30639 226 32229 29020 -4768 -33022
489 -33022 -24633 10650 32027 18576 -14050 -31661 -17958 10571 27444 18551 -10746 -33558
501 -33558 -22387 14366 40287 23689 -21878 -43749 -15108 32792 46446 8059 -39669 -40772
513d0772M4595L7688j0762m3988k5503J6341L3461J7251r977k5623j8904L475
525b2718K5783K7928p52l3560l3620M835M4502L6539j8434n5549k8684L3419N7108
538C6797J2026m5412m6924L091M4857L3892r714l5745k3777P369K8587K2815p18
551B7144k3956k9358o100K9759L8728L319m3880m4770J0831N5742L4889k7665
563B4683n7024j9122L8667M8552M766l8006l5646L839L1676K4433j058k0356k3248
576a7844r161J5362L2082J7482k4231m5548j5092L8751N1614J774n2687m6432
588e3930J5250N9091L4187k9326n4099j7189L4047M2604O839k8151l1204r464
600c1345J8478L1077J6197j7011l9570k2043K4964M9465J7695l7746n3398m920
$$ plain form
513 -40772 3823 41511 30749 -13239 -38742 -22401 11060 28311 18334 -7289 -26193 -22718
525 -22718 3065 30993 30241 -3319 -36939 -32104 12398 48937 30503 -25046 -53730 -20311 36797
538 36797 48823 3411 -43513 -40422 4435 38327 28613 -7132 -30909 -23540 5047 27862 27144
551 27144 3188 -26170 -32270 -2511 36217 39536 -4344 -49114 -38283 17459 52348 24683
563 24683 -32341 -51463 -12796 35756 40522 2516 -33130 -29291 2385 26818 25760 5404 -17844
576 -17844 -27005 -11643 20439 37921 13690 -31858 -46950 -8199 43415 45189 -7498 -53930
588 -53930 -38680 20411 54598 25272 -28827 -46016 -11969 30635 37474 9323 -21881 -31345
600 -31345 -12867 18210 34407 17396 -22174 -44217 -19253 30212 47907 10161 -43237 -48157
612d8157N2059M7241j2531n4911l2075K6131M7451J3953k5491l2438r267J5543
624a2492K2519J4051l681k5399k7578O73L6722L9689q336n6167l9293K9417O8656
637C8781K6693n1233o7451k465O2183N2475j6073o1090l3823K4756M8133K0019
649D0905k2357l5662j6123J1763K8013K4117k947l2579l3356L511M4637L9194
661D9116j4205n3060l4111K4227N6736K5734l2696n4032j8824L3915M9976J5024
673D7800l2512m9420j8985L3906N7059K1588m2342o7860j6179O1360P2884J70
685F7469p7233o7113K1771Q5273M9819m0986q1763k8836N0019O5275J0936m4488
697A0143m7298p393L0104L7903J8368j6994m3058l2115J5816N9045M3257k7740
$$ plain form
612 -48157 3902 51143 38612 -16299 -48374 -22243 25208 39161 13670 -18768 -28035 -12492
624 -12492 10027 24078 20397 -5002 -32580 -31907 4815 44504 36168 -19999 -59292 -29875 38781
637 38781 65474 14241 -53210 -55675 6508 58983 42910 -18180 -52003 -27247 20886 40905
649 40905 18548 -17114 -33237 -21474 6539 30656 27709 -4870 -38226 -34715 9922 49116
661 49116 34911 -18149 -52260 -28033 28703 54437 21741 -32291 -51115 -17200 32776 47800
673 47800 15288 -34132 -53117 -19211 37848 59436 17094 -50766 -66945 -5585 67299 67469
685 67469 -9764 -76877 -55106 30167 79986 39000 -42763 -71599 -21580 43695 54631 10143
697 10143 -37155 -44548 -14444 23459 41827 24833 -18225 -50340 -34524 24521 67778 40038
709D0038p8107m2126M9330R1480K6885p4390r2976l281R0859Q0693k0811r6112
721b8518o2848L7840R3388M6810m7284q6347l3004N2749P9838K3603n4848p5457
733e4078j6838N8409P0873P682o2279o5038J189O2282N4835o349n6999m8199O729
746d7781N1672M7373j325n0152n2328j526N5728O1647J33p1275o9337J3117Q9022
759B4968O7280l7735j04371n0154O3785J05428K4456q4649r2860O350R1800P0414
771H4712k8642q6248m2659L9743O8607K3693l7787n0747j4041K5624L7503J6279
783C6037j6011l2749k3780P018L7203L3124o623m5482l9817J3724N8482L9293
795F0419k5667o5970l3612M0078P1188K1175n4073p1251o575O7106O3618j3574
$$ plain form
709 40038 -38069 -80195 -30865 60615 87500 13110 -79866 -83147 7712 88405 67594 -28518
721 -28518 -91366 -53526 39862 86672 39388 -46959 -79963 -27214 52624 76227 21379 -54078
733 -54078 -70916 -12507 58366 66048 3769 -61269 -60080 2202 57037 50688 -6311 -54510 -47781
746 -47781 3891 51264 49939 -213 -52541 -54067 1661 63308 63441 -7834 -77171 -64054 24968
759 24968 92248 54513 -49858 -100012 -36227 69201 93657 9008 -83852 -77502 14298 84712
771 84712 56070 -30178 -72837 -33094 35513 59206 21419 -29328 -43369 -17745 19758 36037
783 36037 20026 -12723 -36503 -29485 7718 40842 34219 -11263 -51080 -37356 21126 60419
795 60419 34752 -31218 -64830 -24752 46436 67611 13538 -57713 -64288 2818 66436 52862
807E2862p3953m9932L1674P4470L0139m4862o5448j0587N2796N0673p166m8873
819h207l1931J6829L7765J4804j5820k2212p778O372R091Q260O922l457j8689
832h051j8295O832L3746K4279k0269m6950j7404L8499N3269K446n5270m8148J7225
845c8091O4755L4960l8346o6180j4704N3064N6139p801n9621l8322K6178N5388
857B7419J7983l6194m2166J348L7184K5025j3449k7950o652J5290J1932m916p582
870b728L677N356p647j3462K894K2235J4259j8590l2591l704L5761L3926j3459
883B5927m7796k2450L2727M9634N182m6718m1768J3775N1476K6938k9534m9689
895c2296r480L8902L8446o357m0567k4628J8838L5116J0212k2744k5401K531K2823
$$ plain form
807 52862 -21091 -71023 -39349 35121 65260 20398 -45050 -55637 -2841 47832 40666 -8207
819 -8207 -40138 -23309 14456 29260 13440 -8772 -16550 -10178 -1087 7173 14095 10638 -8051
832 -8051 -26346 -19514 14232 38511 18242 -28708 -46112 -7613 45656 48102 -7168 -55316 -38091
845 -38091 26664 61624 23278 -42902 -57606 -4542 51597 43796 -15825 -54147 -27969 27419
857 27419 45402 9208 -32958 -31610 5574 30599 17150 -10800 -17452 -2162 9770 4854 -2728
870 -2728 949 6305 -1342 -14804 -11910 10325 24584 5994 -26597 -30301 5460 39386 25927
883 25927 -21869 -44319 -11592 38042 43224 -3494 -45262 -31487 19989 46927 17393 -32296
895 -32296 -41776 -2874 35572 29215 -11352 -35980 -17142 17974 28186 5442 -19959 -17428 5395
908E395J2005r884j4884p3J1530J450j0082l203J1482J0383j0109k2870k451K7283
922E972K4032j3271l9834j5920L5080M4063m066n0041l4638K6999N6279J3886
934D8541m5436m7975Q582N2841K9571k8876m7253p453L6393L1754j0639l2486
946a2436j0957J7337J9223j703j4356l183Q179K532p670m258R810J2086o135k0613
960a2144q217J6995K3887O4k7096k2316R793L2839J8301j9531l6254r987K9667
973c999L6569J01l8093l2033J2602M3425K2511k6166m3741q281L5666L5451p803
986B6209l9059k0723K0492L1735L693k3270j6469Q952J5750J59j0381M76J1029
999H593J14j7400j0018J7558K6496l146l6227k3718K3390M4237Q868m1566m0993
$$ plain form
908 5395 17400 7516 -7368 -7441 4089 5539 -4543 -7746 3736 14119 4010 -18860 -21311 5972
922 5972 30004 16733 -23101 -39021 -3941 40122 36056 -13985 -48623 -21624 34655 48541
934 48541 3105 -44870 -36288 16553 46124 17248 -30005 -37458 -1065 30689 20050 -12436
946 -12436 -23393 -6056 13167 11464 -2892 -6075 2104 4636 -3034 -7292 2518 14604 8469 -12144
960 -12144 -20361 -3366 20521 20585 -6511 -28827 -19034 13805 32106 12575 -23679 -33666 -3999
973 -3999 32570 32671 -5422 -37455 -24853 18572 41083 14917 -28824 -37105 -1439 34012 26209
986 26209 -12850 -33573 -13081 18654 22347 -923 -17392 -8440 7310 7469 -2912 -2436 8593
999 8593 8707 -8693 -18711 -1153 25343 22197 -14030 -37748 -14358 29879 38747 -2819 -43812
1012d3812J1454N0843K8090k8210m8923j0507L8332L9058m337l8051k6549J2226
1024b0386L1698J6453j3181k5798j1944J1190K0394J0303q620j8572r882P617
1036a0728J7081J0710o194j5899j0237L960J5522J3374j948j6804j8281l35K3103
1049C324K4045m729l2910k6660J3963M3599K1377k8742m7304r349M2848M4333
1061D3795q204m9359l1073K3260M7690J3779l1597l5615l88K9378K1637p316k0019
1074d032j0359L202R196P346M664j246j2293j3938K607K1604J8365q853k9744
1087a3481j5277J8802L1884Q252k6217l0358M97K9433K3804p227k9126j8205J1048
1100a6171K6133J3841j2078k4216j0414J3739K3239Q158j5857k1246l066J6775
$$ plain form
1012 -43812 -32358 18485 46575 18365 -30558 -41065 -2733 36325 31988 -6063 -32612 -20386
1024 -20386 11312 27765 14584 -11214 -23158 -11968 8426 18729 10109 -8463 -18345 -10728
1036 -10728 6353 17063 10869 -5030 -15267 -11307 4215 17589 15641 -1163 -19444 -19779 3324
1049 3324 27369 22640 -10270 -36930 -22967 20632 42009 13267 -34037 -43386 -538 43795
1061 43795 35591 -13768 -44841 -21581 26109 39888 8291 -27324 -27712 1666 23303 15987 -4032
1074 -4032 -14391 -11189 -1993 5353 10017 8771 -3522 -17460 -14853 6751 25116 16263 -13481
1087 -13481 -28758 -9956 21928 30180 3963 -26395 -25898 3535 27339 20112 -9014 -27219 -16171
1100 -16171 9962 23803 11725 -12491 -22905 -9166 14073 22231 6374 -14872 -17938 -1163
1112a163J7126j231j6130j1666L615J1455O203l451n894k824j375L52M730P569
1126G316J723r646j1769J837J6136J2035p536j9845p700J3959J8238J000j7336
1139a588j4027N348J5123O530p461j0172j173N298L784M22R1L79k022m917j231
1154e616O908Q083p70j1008r534M207J3831P322p622j4826n679R769J3770L816
1168A2651r768j3360k502J0630J2786K491j0054j2789k092J0554J2697K632j1379
1181B497j4006k023J1549J4319K190j4004j5654j334J5553J7193m49j8416j6483
1194a9068L221K1322J6179o914k2188j3767R057K3322J1572j2098k2566j0274
1206b2202J2949K2697Q014j4316k2389q353J6010K4200O417j7975k4592m313K2194
$$ plain form
1112 -1163 15963 14732 -1398 -13064 -9449 2006 8209 4758 -1136 -3960 -5335 -4983 -253 7316
1126 7316 9039 -607 -12376 -10539 5597 17632 10096 -9749 -17449 -3490 14748 15748 -1588
1139 -1588 -15615 -10267 4856 11386 3925 -6247 -7420 -2122 1662 2084 2175 2554 532 -4385 -5616
1154 -5616 1292 9375 8605 -2403 -11937 -7730 6101 13423 5801 -9025 -14704 -4935 8835 12651
1168 12651 2883 -10477 -12979 -2349 10437 12928 2874 -9915 -12007 -1453 11244 13876 2497
1181 2497 -11509 -13532 -1983 12336 14526 522 -15132 -16466 -913 16280 15831 -2585 -19068
1194 -19068 -15847 5475 21654 14740 -7448 -21215 -12158 11164 22736 10638 -11928 -22202
1206 -22202 -9253 13444 21458 7142 -15247 -23600 -7590 16610 23027 5052 -19540 -23853 -1659
1219a659K4274R77k3621k3956K620K6249K0884n734k6983j9829Q366K7378J8033
1232B6999j0548k9588j7142J4780L2007J4745j9784l4012q810K6948L2347J754
1244B9696l1433k7852O870L1759K0172j2252k9283j3057J3788K2460R105j0772
1256I201j8644r825O906J8593J4803n414k3477j7921R713L0932J7378j8869l5642
1269b2266j0473K8704L4535j425l5421k6800J1890L4601J6105j8516k8779o755
1281b4600J8938K1309K477j4664j5757k474J1308J4918N260j0803j7845n815J4115
1294c633J9390K193j8943j8116L929K0390J1925q953j6561n270R226J0027K313
1307G917l083m591n469l392N178J3525O025j3078j9592j673K2126J9653r587k8267
$$ plain form
1219 -1659 22615 23592 -29 -23985 -21365 4884 25768 20034 -6949 -26778 -18412 8966 26999
1232 26999 16451 -13137 -30279 -15499 16508 31253 11469 -22543 -31353 -4405 27942 29696
1244 29696 -1737 -29589 -22719 9040 29212 16960 -12323 -25380 -11592 10868 19973 9201
1256 9201 -9443 -19268 -12362 6231 21034 15620 -7857 -25778 -16065 14867 32245 13376 -22266
1269 -22266 -32739 -4035 30500 29075 -6346 -33146 -21256 13345 29450 10934 -17845 -24600
1281 -24600 -5662 15647 18124 3460 -12297 -14771 -3463 11455 16715 5912 -11933 -17748 -3633
1294 -3633 15757 17950 -993 -19109 -15180 5210 17135 8182 -8379 -13649 -4423 5604 7917
1307 7917 4834 243 -5226 -8618 -3440 10085 16110 3032 -16560 -18233 3893 23546 13959 -14308
1321a4308j1060J9732K5745j493k4881j4207J2544J9299J294j4596o458Q349O127
1334F087o648o480P634J2403m934k0138o917J9206K1824n747k9439j4409J9688
1347g870K8723K052k5787k0563Q451K3896J0367j0027j5990o079N461R984Q919
1360A1537J458j2152j6806k879J9467K2836l611l0161k0584J5692L4264J1232
1372C0293k5683k9483K334K7169J8364q707k0203p990N595Q958P015M616l840
1385H438j6469j5245R550L1055J5611k5483m0735l780M3542L8601j6664n2342
1397b3921k3247L5299M8843K276m3306l3097J3534L7518J5328j7821k3688n512
1409a7794R410J1143P636L093q861j9571r302J8803L0728M394l3092l2618J0810
$$ plain form
1321 -14308 -25368 -5636 20109 18616 -6265 -20472 -7928 11371 12665 -1931 -8389 -40 6087
1334 6087 -561 -7041 593 12996 8062 -12076 -18993 213 22037 16290 -13149 -27558 -7870
1347 -7870 20853 22905 -2882 -23445 -14994 8902 19269 9242 -6748 -12827 -7366 2618 11537
1360 11537 12995 843 -15963 -18842 625 23461 19850 -10311 -30895 -15203 19061 30293
1372 30293 4610 -24873 -22539 4630 22994 14287 -5916 -13906 -8311 647 7662 12278 8438
1385 8438 -8031 -23276 -13726 17329 32940 7457 -33278 -37058 6484 45085 28421 -23921
1397 -23921 -47168 -11869 36974 39250 -4056 -37153 -23619 13899 29227 11406 -12282 -17794
1409 -17794 -8384 2759 10395 13488 4627 -14944 -24246 -5443 25285 29679 -3413 -36031 -25221
1422b5221M3455K2505k6501m2277n992L3980L0087p219l0184j6697J0096J8592
1434D624R654k078j0469j4089p543J2358K6073J0337k4484l4765p65M0277L2818
1447D1948j7888m8523j8153L5043M3211k949m1864k6280J8170L3471P459k0517
1459C128j6467L213Q869K632J730O652L36j6873j5537J2290L1205R673l0212l5473
1473c4834P636M3865K3091k7185m3098m280L8105K9518j3483l3624j1464J8958
1485f795K0424Q4j1494o296j531j647L305J3140R477j3166k5901m249K8539K7877
1499C1767j1529m0181j6592K9688L7551k666l7596k2568J9324L1467L470k2076
1511E9j5057P654J1991m69m206M226L608j0432j4658O264K5982J0435k4294l0825
$$ plain form
1422 -25221 18234 40739 14238 -28039 -34031 -51 30036 22817 -7367 -24064 -13968 4624
1434 4624 14278 12200 1731 -12358 -19901 -7543 18530 28867 4383 -30382 -31147 9130 41948
1447 41948 24060 -24463 -42616 -7573 35638 32689 -9175 -35455 -17285 16186 23645 3128
1459 3128 -13339 -10126 -1257 1375 3105 9757 10093 -6780 -22317 -10027 21178 30851 639 -34834
1473 -34834 -27198 16667 39758 12573 -30525 -34805 3300 32818 19335 -14289 -25753 -6795
1485 -6795 13629 13713 2219 -4077 -5608 -7255 -3950 9190 18667 5501 -20400 -24649 3890 31767
1499 31767 20238 -19943 -36535 -6847 30704 28038 -9558 -32126 -12802 18665 22135 59
1511 59 -14998 -7344 4647 4178 -28 4198 7806 -2626 -17284 -11020 14962 25397 1103 -29722
$$ [...]
8191A91
##END NTUPLES=NMR FID
##END=
