##TITLE=1H_Pr EA-2
 CCl4
 8 sc, 
 24.10.2023
##JCAMPDX= 6.0         $$ Bruker NMR JCAMP-DX V2.0
##DATA TYPE= NMR FID
##DATA CLASS= NTUPLES
##ORIGIN= UXNMR, Bruker Analytische Messtechnik GmbH
##OWNER= root
$$ XWIN-NMR		Version 3.5
$$ Tue Oct 24 14:11:21 2023 Russian Standard Time (UT+4h)  she@DPX200
##.OBSERVE FREQUENCY= 200.13135
##.OBSERVE NUCLEUS= ^1H
##.DELAY= (6, 6)
##.ACQUISITION MODE= SIMULTANEOUS
##.ACQUISITION SCHEME= undefined
##.AVERAGES= 8
##.DIGITISER RES= 18
##SPECTROMETER/DATA SYSTEM= spect
##.PULSE SEQUENCE= zg30
##.SOLVENT NAME= D2O
##.SHIFT REFERENCE= (INTERNAL, D2O, 0, 15.7039)
##AUDIT TRAIL= $$ (NUMBER, WHEN, WHO, WHERE, WHAT)
$$ ##TITLE= Audit trail, XWIN-NMR		Version 3.5
$$ ##JCAMPDX= 5.01
$$ ##ORIGIN= Bruker BioSpin GmbH
$$ ##OWNER= she
$$ F:/spectra/data/she/nmr/H-F/1/audita.txt
$$ ##AUDIT TRAIL=  $$ (NUMBER, WHEN, WHO, WHERE, WHAT)
(   1,<2023-10-24 14:08:49.87 +0400>,<she>,<DPX200>,
      <created by zg, POWCHK disabled, PULCHK disabled
       configuration hash MD5:
       00 E9 B6 7A A2 85 ED C7 34 08 36 98 17 FE 4E 26
       data hash MD5: 16K
       61 FD 56 DB 39 A4 8B DE 69 BD 40 95 1C BC 01 87>)
$$ ##END=
$$ 
$$ hash MD5
$$ 8D 9E 0B AD E0 C1 8B 6D BD 4C 36 D5 52 46 33 30
##$RELAX= 
##$RELAX= 
##$RELAX= 
##$RELAX= 
##$RELAX= 
##$RELAX= 
$$ Bruker specific parameters
$$ --------------------------
##$DU= <F:/spectra>
##$EXPNO= 1
##$NAME= <H-F>
##$PROCNO= 1
##$TYPE= <nmr>
##$USER= <she>
##$AMP= (0..31)
100 100 100 100 100 100 100 100 100 100 100 100 100 100 100 100 100 100 
100 100 100 100 100 100 100 100 100 100 100 100 100 100 
##$AQSEQ= 0
##$AQ_mod= 1
##$AUNM= <au_zg>
##$AUTOPOS= <>
##$BF1= 200.13
##$BF2= 200.13
##$BF3= 200.13
##$BF4= 200.13
##$BF5= 200.13
##$BF6= 200.13
##$BF7= 200.13
##$BF8= 200.13
##$BYTORDA= 1
##$CFDGTYP= 0
##$CFRGTYP= 5
##$CHEMSTR= <none>
##$CNST= (0..31)
1 1 145 1 1 1 1 1 1 1 1 1 1 1 1 1 1 1 1 1 1 1 1 1 1 1 1 1 1 1 1 1 
##$CPDPRG= <>
##$CPDPRG1= <>
##$CPDPRG2= <>
##$CPDPRG3= <>
##$CPDPRG4= <mlev>
##$CPDPRG5= <mlev>
##$CPDPRG6= <mlev>
##$CPDPRG7= <mlev>
##$CPDPRG8= <mlev>
##$CPDPRGB= <>
##$CPDPRGT= <>
##$D= (0..31)
0 1.2 0 0 0 0 0 0 0 0.06 0 0.03 0 0 0 0 0.0002 0 0 0 0 0 0 0 0 0 0 0 0 
0 0 0 
##$DATE= 1698142129
##$DBL= (0..7)
120 120 120 120 120 120 120 120 
##$DBP= (0..7)
150 150 150 150 150 150 150 150 
##$DBP07= 0
##$DBPNAM0= <>
##$DBPNAM1= <>
##$DBPNAM2= <>
##$DBPNAM3= <>
##$DBPNAM4= <>
##$DBPNAM5= <>
##$DBPNAM6= <>
##$DBPNAM7= <>
##$DBPOAL= (0..7)
0.5 0.5 0.5 0.5 0.5 0.5 0.5 0.5 
##$DBPOFFS= (0..7)
0 0 0 0 0 0 0 0 
##$DE= 6
##$DECBNUC= <off>
##$DECIM= 32
##$DECNUC= <off>
##$DECSTAT= 4
##$DIGMOD= 1
##$DIGTYP= 9
##$DL= (0..7)
0 120 120 120 120 120 120 120 
##$DP= (0..7)
150 150 150 150 150 150 150 150 
##$DP07= 0
##$DPNAME0= <>
##$DPNAME1= <>
##$DPNAME2= <>
##$DPNAME3= <>
##$DPNAME4= <>
##$DPNAME5= <>
##$DPNAME6= <>
##$DPNAME7= <>
##$DPOAL= (0..7)
0.5 0.5 0.5 0.5 0.5 0.5 0.5 0.5 
##$DPOFFS= (0..7)
0 0 0 0 0 0 0 0 
##$DQDMODE= 0
##$DR= 18
##$DS= 0
##$DSLIST= <SSSSSSSSSSSSSSS>
##$DSPFIRM= 0
$$ [...]
##$SUBNAM2= <"">
##$SUBNAM3= <"">
##$SUBNAM4= <"">
##$SUBNAM5= <"">
##$SUBNAM6= <"">
##$SUBNAM7= <"">
##$SUBNAM8= <"">
##$SUBNAM9= <"">
##$SW= 18.05172834244
##$SWIBOX= (0..15)
0 0 2 0 0 0 0 0 0 0 0 0 0 0 0 0 
##$SW_h= 3612.71676300578
##$TD= 16384
##$TD0= 1
##$TE= 0
##$TE2= 300
##$TE3= 300
##$TEG= 300
##$TL= (0..7)
0 120 120 120 120 120 120 120 
##$TP= (0..7)
150 150 150 150 150 150 150 150 
##$TP07= 0
##$TPNAME0= <>
##$TPNAME1= <>
##$TPNAME2= <>
##$TPNAME3= <>
##$TPNAME4= <>
##$TPNAME5= <>
##$TPNAME6= <>
##$TPNAME7= <>
##$TPOAL= (0..7)
0.5 0.5 0.5 0.5 0.5 0.5 0.5 0.5 
##$TPOFFS= (0..7)
0 0 0 0 0 0 0 0 
##$TUNHIN= 0
##$TUNHOUT= 0
##$TUNXOUT= 0
##$USERA1= <user>
##$USERA2= <user>
##$USERA3= <user>
##$USERA4= <user>
##$USERA5= <user>
##$V9= 5
##$VALIST= <valist>
##$VCLIST= <CCCCCCCCCCCCCCC>
##$VD= 0
##$VDLIST= <DDDDDDDDDDDDDDD>
##$VPLIST= <PPPPPPPPPPPPPPP>
##$VTLIST= <TTTTTTTTTTTTTTT>
##$WBST= 1024
##$WBSW= 4
##$XGAIN= (0..3)
0 0 0 0 
##$XL= 0
##$YL= 0
##$YMAX_a= 225527
##$YMIN_a= -207053
##$ZGOPTNS= <>
##$ZL1= 120
##$ZL2= 120
##$ZL3= 120
##$ZL4= 120
##$ABSF1= 10
##$ABSF2= 0
##$ABSG= 5
##$ABSL= 3
##$ALPHA= 0
##$AQORDER= 0
##$ASSFAC= 0
##$ASSFACI= 0
##$ASSFACX= 0
##$ASSWID= 0
##$AUNMP= <proc_1d>
##$AZFE= 0.1
##$AZFW= 0.1
##$BCFW= 1
##$BC_mod= 2
##$BYTORDP= 1
##$COROFFS= 0
##$CY= 11.3945322036743
##$DATMOD= 1
##$DC= 2
##$DFILT= <>
##$DTYPP= 0
##$F1P= 15.7292609196834
##$F2P= 12.9074282941183
##$FCOR= 0.5
##$FTSIZE= 0
##$FT_mod= 4
##$GAMMA= 1
##$GB= 0.15
##$INTBC= 1
##$INTSCL= 1
##$ISEN= 128
##$LB= 0.24
##$LEV0= 0
##$LPBIN= 0
##$MAXI= 10000
##$MC2= 0
##$MEAN= 0
##$ME_mod= 0
##$MI= 1.114404
##$NCOEF= 0
##$NC_proc= 0
##$NLEV= 6
##$NOISF1= 3.799351
##$NOISF2= 2.8
##$NSP= 1
##$NTH_PI= 0
##$NZP= 0
##$OFFSET= 15.70392
##$PC= 1
##$PHC0= -23153.42
##$PHC1= 14.0527
##$PH_mod= 1
##$PKNL= yes
##$PPARMOD= 0
##$PSCAL= 0
##$PSIGN= 0
##$REVERSE= no
##$SF= 200.130013532006
##$SI= 16384
##$SIGF1= 3
##$SIGF2= 2
##$SINO= 400
##$SIOLD= 16384
##$SREGLST= <1H.CDCl3>
##$SSB= 0
##$STSI= 0
##$STSR= 0
##$SW_p= 3612.71676300578
##$SYMM= 0
##$S_DEV= 0
##$TDeff= 0
##$TDoff= 0
##$TI= <>
##$TILT= no
##$TM1= 0
##$TM2= 0
##$TOPLEV= 0
##$USERP1= <user>
##$USERP2= <user>
##$USERP3= <user>
##$USERP4= <user>
##$USERP5= <user>
##$WDW= 1
##$XDIM= 8192
##$YMAX_p= 0
##$YMIN_p= 0
$$ End of Bruker specific parameters
$$ ---------------------------------
##NTUPLES= NMR FID
##VAR_NAME=  TIME,          FID/REAL,        FID/IMAG
##SYMBOL=    X,             R,               I
##VAR_TYPE=  INDEPENDENT,   DEPENDENT,       DEPENDENT
##VAR_FORM=  AFFN,          ASDF,            ASDF
##VAR_DIM=   8192,          8192,            8192
##UNITS=     SECONDS,       ARBITRARY UNITS, ARBITRARY UNITS
##FACTOR=    0.0002768,     1,               1
##FIRST=     0,             0,               0
##LAST=      2.2672688,     0,               0
##MIN=       0,             -207053,         0
##MAX=       2.2672688,     225527,          0
$$ Real data points
##PAGE= N=1
##DATA TABLE= (X++(R..R)), XYDATA
0 0 0 0 0 0 0 0 0 0 0 0 0 0 7 -8 8 -8 8 -16 16 -16 24 -24 32 -36 40 -48 56 -64 72 -82 94 -106 118 -133 148
35 148 -166 184 -206 227 -252 277 -306 338 -372 406 -446 490 -536 588 -645 707 -778 857 -946
54 -946 1046 -1159 1294 -1452 1640 -1869 2155 -2517 2993 -3643 4574 -5997 8387 -13007 24735
69 24735 -101522 -175199 201187 -103212 57910 -16598 -109111 182013 -69116 -77856 65480
80 65480 16311 5967 -69142 41283 -3648 69280 -116430 -2124 163172 -166734 61588
91 61588 -1017 -42608 150281 -207053 77227 117379 -169547 106408 -74293 53920 43583
102 43583 -128336 67960 47558 -45209 -33496 33463 27577 -29946 9059 -65897 123175 -38846
114 -38846 -118703 167696 -101955 46488 -3488 -98078 181246 -111282 -50176 123705 -90702
125 -90702 66920 -59410 -7561 85783 -59300 -29502 36323 36813 -61780 19713 -384 1189
137 1189 53643 -118551 73143 60015 -136523 113772 -73061 34197 51102 -138976 117280
148 117280 -1786 -73526 63493 -44405 41333 -1788 -55463 44792 22630 -38103 -21809
159 -21809 65411 -51026 31147 -19137 -33492 103991 -95627 -3648 89286 -101135 79523
170 79523 -48300 -20099 101261 -109249 32368 37083 -43890 27534 -19302 -5881 42466
181 42466 -34352 -20932 46363 -5756 -46633 61138 -53945 37068 13869 -83657 101359
192 101359 -39406 -39289 74771 -72427 49512 3694 -69582 89574 -42770 -15486 33419
203 33419 -20893 5339 16766 -39343 29146 18327 -52285 33425 14055 -47526 58014 -46774
215 -46774 3491 59676 -91608 60845 2168 -47549 59942 -44461 2541 49641 -70829
226 -70829 40961 9150 -34938 28210 -5018 -22749 41794 -30102 -13456 53596 -53521 17160
238 17160 25945 -52653 50921 -15674 -39556 75775 -64791 17732 29721 -52034 42213 -5826
250 -5826 -37072 55828 -34649 -8777 39764 -40027 15004 19160 -41307 33063 4499 -45327
262 -45327 59134 -36347 -5279 40351 -49299 24004 20823 -56000 56965 -23166 -21274 48320
274 48320 -43809 11566 27504 -46201 31498 7033 -41925 50409 -28332 -10091 39016 -38700
286 -38700 8180 32358 -55175 45110 -8236 -31336 49361 -33447 -4928 40310 -48940 24620
298 24620 16448 -47298 48968 -21104 -18256 41218 -33847 127 36540 -52804 36844 -6
310 -6 -34050 42826 -21099 -16154 44048 -43345 14417 24288 -47445 40442 -8892 -26418 41692
323 41692 -26503 -8742 41883 -50283 28307 8518 -36819 37559 -11076 -25219 46551 -38318
335 -38318 5803 30036 -45996 32113 2433 -33890 41485 -19540 -18051 46071 -46973 20113
347 20113 16353 -38790 32640 -2249 -32089 46656 -31750 -2285 33246 -40790 20830 13545
359 13545 -38408 36534 -8054 -28053 48307 -39340 8086 26116 -41662 27135 8173 -40061
371 -40061 47776 -27435 -6704 33069 -36740 15227 17276 -36892 28404 696 -29231 39490
383 39490 -25703 -4636 32467 -36923 11598 25806 -49298 44733 -16738 -19330 44231 -40622
395 -40622 8074 29505 -44690 31000 -2321 -25220 37773 -26390 -3998 28296 -24610 -1980
407 -1980 27817 -37027 27393 -157 -32128 45295 -22142 -20035 48553 -47931 25641 8945
419 8945 -43313 53999 -27993 -13631 35751 -28674 8630 12363 -29337 29218 -4520 -23391
431 -23391 22247 5202 -28821 34180 -25998 3832 32190 -56451 39089 8335 -43868 48111
443 48111 -33414 6326 33029 -60230 45626 -2293 -25296 22412 -10174 -96 15794 -24934
455 -24934 5509 27014 -28463 -4402 32586 -35150 27587 -10471 -28614 68105 -61326 9374
467 9374 35981 -46285 40120 -24813 -13071 54890 -54792 13492 16834 -13174 4408 -6765
479 -6765 -932 15360 -1733 -34522 40604 -1684 -34452 37982 -30987 20808 16425 -68287 77571
492 77571 -28019 -23876 38968 -40089 39719 -12139 -37131 52624 -17212 -13981 6301 5264
504 5264 4483 -6956 -9034 476 41709 -57542 15664 32621 -42799 38157 -37204 6002 57343
517 57343 -86970 46373 9819 -29682 35122 -48198 36242 14072 -43177 15870 15806 -4492
529 -4492 -15525 5847 4479 9111 -4797 -41390 70945 -34789 -22243 42561 -43377 51817
541 51817 -33541 -31223 80619 -57804 4800 16311 -21540 42965 -48636 7289 30068 -11925
553 -11925 -21545 10292 20415 -18884 5229 -16757 19144 27922 -75228 55285 3855 -34554
565 -34554 41680 -59472 58282 -490 -63792 62087 -16824 -4761 6346 -28154 47085
576 47085 -19177 -20056 8774 26380 -20373 -16649 27417 -18289 28713 -35151 -8646 67339 -67237
589 -67237 16245 20141 -33240 56261 -68340 24918 41075 -55808 21769 -2862 5565 9984
601 9984 -33251 17699 16820 -9839 -27717 30792 5569 -26478 24462 -36016 47892 -12050 -51106
614 -51106 68733 -31578 -4293 19974 -43983 64743 -36912 -23125 46669 -23275 5433
625 5433 -9864 2155 17225 -8817 -18806 14456 23814 -37897 10724 15155 -23289 38613 -54354
638 -54354 28812 31175 -62833 43614 -13077 -4494 27860 -52233 39057 8344 -36059 21570
650 21570 -4496 7631 -7212 -4869 209 22241 -21172 -14562 39533 -26294 1916 12175 -31006
663 -31006 51411 -39344 -10088 49797 -46796 24719 -7493 -13323 36906 -34372 -216 27416
675 27416 -20373 2851 156 966 2738 4232 -24512 28074 1393 -33067 37074 -21180 3004
688 3004 18951 -43258 43037 -6779 -32890 43694 -30892 14411 4225 -25165 27326 -3574
700 -3574 -20490 19140 -2008 -7678 9083 -8407 -1502 21810 -30151 9924 21601 -36664 31649
713 31649 -15932 -6669 31351 -38176 15595 17923 -34322 29375 -14443 -3781 20288 -22522
725 -22522 4739 16368 -19213 4772 11253 -19484 18354 -5536 -16084 29081 -18626 -8155
737 -8155 30252 -34819 23544 -1535 -22875 33500 -19779 -6868 25758 -26143 12720 6381
749 6381 -21628 22545 -7125 -13230 20065 -9136 -9266 22928 -24979 12329 9292 -25529 23079
762 23079 -3087 -19508 30479 -23909 4475 17828 -29192 21325 -159 -18630 22968 -11271
774 -11271 -8168 23379 -24470 9695 10183 -21127 15282 2644 -20435 26965 -16895 -3963 22385
787 22385 -25587 12015 9144 -24020 23184 -6332 -15073 27925 -23908 5607 14363 -22303 13904
800 13904 5667 -22648 26260 -13630 -7150 21718 -21007 5512 13928 -24420 18498 31 -19405
813 -19405 26789 -17835 -1271 18397 -21286 8597 11015 -25588 24522 -8782 -11184 22114
825 22114 -17375 254 17769 -24606 15299 4190 -21048 24730 -12522 -6710 20494 -19228
837 -19228 3803 15792 -26634 21533 -4324 -14563 22192 -13688 -4862 21259 -24219 11881
849 11881 8001 -22344 21927 -7171 -11623 21560 -16231 -1252 19787 -26541 17376 1851
861 1851 -18314 21547 -8926 -11153 24441 -23705 8457 11521 -23189 19057 -2290 -14459 20653
874 20653 -12694 -4543 19960 -22773 11025 7010 -18739 15749 -703 -16881 26065 -19879
886 -19879 1025 18488 -24723 14762 3944 -19881 23938 -13210 -6690 22588 -23206 9281
898 9281 7190 -15571 12555 766 -16288 22462 -12852 -6510 19334 -17519 4056 12940 -25337
911 -25337 23753 -5039 -18491 29887 -22656 5029 12466 -22329 18496 -1144 -18344 23643
923 23643 -12383 -2351 10131 -10227 2157 11584 -20636 12234 8358 -22991 21533 -9146
935 -9146 -7527 22951 -27882 12529 15163 -31895 28027 -12553 -3151 16880 -22106 10155 10828
948 10828 -19973 10412 2687 -7686 7335 -3869 -7819 20123 -14464 -9228 28335 -27594 14488
961 14488 916 -19168 32706 -23513 -6201 29770 -29379 17426 -5029 -9394 21947 -17802
973 -17802 -2828 14745 -5171 -7924 8904 -5504 3206 6511 -22039 19668 6790 -31485 32695
986 32695 -19968 6174 13265 -34798 34515 -5998 -22300 25657 -16510 10169 366 -17463
998 -17463 21041 -2719 -11114 976 14492 -13500 5511 -3225 -5111 24752 -29596 2917 28470
1011 28470 -34577 23979 -13305 -3648 31664 -43294 19937 11644 -19436 12646 -11592 7675
1023 7675 9605 -19267 4527 11648 -1501 -18404 19361 -8760 4826 3042 -26614 40651 -18150
1036 -18150 -18727 33099 -26197 20328 -8311 -21826 44200 -30402 -871 11762 -5708 8333
1048 8333 -12768 -240 13509 -2130 -16281 7616 17704 -24335 13586 -8119 2420 22926
1060 22926 -46834 33419 4955 -26383 24772 -23763 18767 7971 -37538 34013 -5656 -7336
1072 -7336 1231 -2946 11922 -5186 -7888 -1157 22443 -18196 -9653 24548 -18676 14505 -10577
1085 -10577 -14469 45775 -43574 9008 17001 -21010 23888 -26131 6212 24927 -30025 7620
1097 7620 5777 1379 -3072 -7192 6476 4246 3114 -26132 27755 -794 -20835 21532 -19706
1110 -19706 18788 2084 -36092 45065 -18941 -8075 15811 -21074 27389 -15449 -12833 22620
1122 22620 -5536 -7462 506 5078 1009 -2223 -6603 130 23877 -32920 12120 12227 -20558 23643
1136 23643 -26156 10648 22446 -39660 23942 290 -10216 16295 -24414 18685 3666 -15715
1148 -15715 3348 9675 -4430 -5258 4747 -4762 11096 -5992 -16974 32512 -20318 -2825 16382
1161 16382 -23283 29299 -19403 -8664 29648 -24069 4902 6011 -11608 18298 -15837 -580
1173 -580 12167 -3470 -10036 8590 987 -5840 10080 -16723 13633 6984 -26091 24098 -6446
1186 -6446 -9321 20102 -28323 23408 -1139 -20718 21924 -8643 -2697 8316 -12634 10364
1198 10364 2029 -12021 6190 7751 -11699 4796 3820 -11652 20098 -19187 2602 18135 -23909
1211 -23909 13251 1654 -13992 23229 -21676 5399 14113 -19044 10462 343 -6650 9144
1223 9144 -5461 -5206 14043 -9859 -3530 11809 -10276 2221 8655 -19166 21008 -8772 -10069
1236 -10069 20779 -17383 5438 8137 -17827 17974 -5807 -10393 17958 -12491 1656 6946
1248 6946 -9494 4643 6178 -15058 13350 -1456 -10428 14030 -8722 -3017 14733 -19096 11493
1261 11493 4611 -17335 18607 -9814 -3263 13403 -14265 4786 8478 -16730 13475 -2881
1273 -2881 -7527 11542 -6563 -4551 13757 -14505 5190 7868 -15655 13673 -3308 -9283 15874
1286 15874 -11600 -991 14122 -18303 12317 123 -11086 13303 -5929 -6601 15315 -14355
1298 -14355 4332 7893 -14429 10833 -204 -10754 14479 -7548 -4702 15029 -16272 7944
1310 7944 4597 -13109 11970 -1825 -10595 16763 -12796 1252 10323 -14412 8629 3168 -12777
1323 -12777 13833 -5314 -7108 15078 -13988 4281 7486 -13128 9158 2027 -12848 16431
1335 16431 -9881 -1942 11837 -12916 4820 6825 -14648 12939 -2598 -9248 15471 -11724
1347 -11724 1042 9639 -12845 6791 5127 -14684 15369 -7056 -4884 12880 -11539 1466
1359 1466 10022 -15790 11469 27 -11552 14939 -9252 -2276 11527 -12460 4491 7162 -15061
1372 -15061 13215 -3759 -6748 11855 -7907 -2875 12647 -14877 7835 4458 -13022 13657
1384 13657 -5379 -6702 14569 -12364 1807 9986 -15592 12440 -2558 -7248 11665 -6377
1396 -6377 -4168 12314 -11898 4382 5231 -11686 9504 -17 -10956 14725 -7815 -3822 13639
1409 13639 -16621 10519 2110 -13199 14718 -5348 -6772 14144 -13660 6663 3777 -10949
1421 -10949 8779 882 -9100 9369 -2673 -5458 11609 -11884 2919 9956 -15854 9620 2523
1434 2523 -13118 18268 -15406 3322 11043 -16787 10167 1313 -9253 11124 -8138 149 8875
1447 8875 -9477 469 7721 -7028 123 6694 -12318 14404 -6496 -8935 18596 -13967 1128
1460 1128 10159 -17209 18805 -9422 -7302 17848 -13794 3187 3343 -6240 7270 -2496 -6826
1473 -6826 9538 -550 -8950 7375 418 -7308 12599 -16935 10947 6564 -21132 19167 -6561
1486 -6561 -4201 12717 -19237 15109 1689 -16216 14888 -5515 1022 35 -3193 2960 4802
1499 4802 -8911 -1279 12549 -11231 1088 5949 -11464 18321 -16193 -2368 21738 -23712
1511 -23712 12096 -2264 -6146 16508 -18815 4665 12310 -13499 5025 -1894 3607 137 -2750
1524 -2750 -4364 9592 229 -15723 17180 -5967 -2508 8464 -18321 21725 -5612 -18090 25455
1537 25455 -16264 7781 -1229 -11210 19893 -10622 -6139 9796 -1520 -918 -4290 3144 765
1550 765 4546 -11634 2461 16781 -22809 12525 -2599 -4027 16190 -25752 14465 10396 -22370
1563 -22370 17096 -10687 6555 4666 -17538 14252 1374 -6230 -2181 5544 974 -3054 262
1576 262 -5123 14765 -8178 -12799 23840 -17528 8250 -1526 -11528 26080 -21858 -849 16604
1589 16604 -14945 10200 -9217 789 12963 -14251 1233 4665 4519 -10131 3923 1177 -474
1602 -474 5560 -17410 15021 5196 -21316 19509 -12132 6420 5971 -22954 25487 -7446 -9162
1615 -9162 10383 -7449 8597 -4182 -7829 11017 -782 -5428 -3179 11574 -8332 2402 -1441
1628 -1441 -4738 17844 -20760 4218 14196 -18160 13959 -10120 -26 17349 -24557 12721
1640 12721 3384 -7422 4927 -6204 5054 3474 -7636 -1000 8112 -1339 -9453 10527 -6445
1653 -6445 4180 2151 -15964 23272 -12079 -5769 14063 -13695 11997 -5084 -10142 20212 -13374
1666 -13374 233 4799 -3215 3952 -4126 -1633 4524 2858 -10732 6724 4191 -9779 9243
1679 9243 -7734 1851 11503 -21844 16545 -1433 -9336 12399 -12621 7814 4551 -14363 11723
1692 11723 -958 -4811 4170 -2696 1806 2235 -3811 -2449 11363 -10974 1485 6550 -10043 10683
1706 10683 -5999 -5912 17046 -16469 5542 5347 -10732 12056 -8762 -586 9317 -8704 619
1719 619 5455 -5309 2815 444 -3907 5259 904 -9764 12459 -6146 -2609 9562 -12168 9337
1733 9337 405 -11510 14182 -7317 -2517 9353 -11387 8079 -533 -7046 7316 -873 -5800
1746 -5800 7342 -4347 -1034 6174 -7671 2778 5753 -11128 8481 -915 -7223 11992 -10958
1759 -10958 3080 6691 -11234 7444 729 -7852 10196 -7435 210 6285 -7504 2171 4856
1772 4856 -7969 5796 498 -6990 9407 -5958 -2040 8676 -9022 3193 4996 -10857 10933
1785 10933 -4936 -3625 9047 -7656 999 6279 -9291 6789 41 -7055 9223 -4907 -2461
1798 -2461 7678 -7237 1396 6201 -10529 8664 -1246 -5987 9098 -5645 -2150 8655 -10171
1811 -10171 5344 2541 -8447 8740 -3213 -4238 8472 -7002 156 6776 -10054 6857 16
1824 16 -6506 7915 -3219 -4209 9357 -8918 3132 4628 -8597 6916 -556 -6497 9141 -5633
1838 -5633 -1652 8161 -9735 5265 2346 -7370 7176 -1284 -5820 9889 -7863 1282 5667 -8435
1852 -8435 5120 1645 -7974 8708 -4033 -3635 8877 -8637 3143 4334 -8219 6041 374
1865 374 -7160 9819 -6642 -316 6610 -7507 3039 3820 -8440 7479 -1875 -5350 9229 -7035
1879 -7035 382 6596 -8569 4761 2515 -8875 10081 -5467 -2011 6820 -6849 1550 4625
1892 4625 -8593 6851 -898 -5802 7601 -4418 -1870 6871 -6807 2112 5167 -10290 9412
1905 9412 -2498 -5308 8873 -6603 123 6930 -10566 7803 -247 -6540 7636 -4197 -1441
1918 -1441 5730 -6156 1346 5146 -8088 4991 1233 -5905 6868 -3298 -4122 10745 -11187
1931 -11187 4324 4598 -9349 8757 -3623 -3607 9258 -8999 2061 5169 -7286 4864 -925
1944 -925 -2937 4306 -1139 -5438 8725 -5212 -1917 6645 -8013 5237 1787 -10020 12914 -6987
1958 -6987 -3011 9021 -10142 7578 -1179 -6450 8842 -3623 -3539 5617 -3568 1356 1004 -3324
1972 -3324 1703 5194 -9924 6058 1993 -7783 9637 -8255 2282 7969 -13952 9611 713
1985 713 -7711 9647 -9588 5747 2477 -7825 4631 2213 -3958 1037 638 -1341 3206 -2798
1999 -2798 -4501 11079 -7969 -1483 8213 -10678 10957 -7246 -3836 13935 -12106 2636 4592
2012 4592 -7122 9308 -8557 1028 6516 -4861 -1650 2828 1429 -3138 2791 -4527 4760 2656
2026 2656 -12091 11241 -1117 -7195 10329 -12806 11617 -1369 -11842 14164 -6217 -1007
2038 -1007 3204 -6159 8489 -3384 -4733 4562 1940 -3494 -2023 5964 -5058 6114 -7592 153
2052 153 11954 -14652 5406 3664 -7958 12124 -14132 5908 8205 -14113 8213 -1979 1061
2065 1061 1927 -6603 3979 3082 -4033 -3162 6107 93 -5753 6174 -7911 10232 -3898 -10109
2079 -10109 16822 -10018 930 4179 -9037 13986 -9700 -4050 12495 -9074 3453 -2943
2091 -2943 1616 3379 -3538 -2502 4100 3674 -8704 3389 3042 -5143 7562 -11375 7470 6171
2105 6171 -16355 13410 -4896 46 5382 -11939 11227 -115 -8716 7378 -2526 2752 -3093
2118 -3093 -821 2147 2706 -4396 -3787 10519 -8212 1066 2825 -6424 11619 -11114 -1231 13266
2132 13266 -14232 8084 -3381 -1434 9188 -11595 3641 5353 -5205 1120 -669 2023 146
2145 146 -1041 -3272 5449 1290 -10169 10875 -5356 617 3735 -10518 12528 -3664 -8477 12398
2159 12398 -8808 4923 -621 -6433 9821 -5121 -2684 3418 646 -1795 331 -655 545 3893
2173 3893 -6909 1780 7289 -11532 8293 -3611 -1296 8342 -12533 7544 3185 -9025 7746
2186 7746 -4577 1487 4101 -7984 5335 925 -2695 -911 3189 -2809 2208 -918 -3607 8039
2200 8039 -5321 -3002 8837 -8662 5742 -831 -6244 11257 -8844 680 5628 -6196 4040
2213 4040 -951 -3230 6327 -3971 -1113 3224 -437 -2736 4070 -3981 1562 3291 -8244 7637
2227 7637 -1137 -5456 7664 -6233 2026 4085 -9239 8800 -2775 -3308 4946 -3849 742 2864
2241 2864 -4833 2825 1588 -4577 3286 993 -4086 4969 -2841 -2084 7342 -8524 4459 2099 -6056
2256 -6056 6465 -3023 -2475 7359 -7499 3323 2408 -5395 4286 -1122 -2634 4640 -2747 -1866 5513
2271 5513 -5123 1504 2784 -4934 4038 274 -5483 8207 -5578 -3 4864 -6335 3773 1025
2285 1025 -5268 6328 -2860 -2158 5473 -5329 1680 2253 -4511 3043 1119 -5178 6358 -3427 -1373
2300 -1373 4847 -5014 1731 3298 -6501 5545 -1283 -3725 6274 -4930 245 3500 -5365 3015
2314 3015 1479 -5547 5920 -2844 -1554 4785 -4214 381 4291 -6026 4254 297 -4490 5744
2328 5744 -3131 -1486 4780 -5169 1602 3312 -6446 5674 -1657 -2985 4942 -3415 -861 5157 -6047
2343 -6047 3472 1176 -4724 5225 -1768 -2527 5291 -4264 184 4148 -6160 4218 -89 -3711 5036
2358 5036 -2334 -2270 5343 -5697 2531 1982 -4982 4316 -338 -3516 5627 -3620 -772 4883 -5686
2373 -5686 3030 1302 -4387 4439 -969 -3668 5952 -5319 1560 2960 -5110 3761 269 -4191 5490
2388 5490 -3422 -1433 4691 -4769 1801 2081 -4545 3652 675 -4410 6031 -3803 -358 4073 -5251
2403 -5251 2527 2481 -6154 5667 -2397 -2217 5096 -5053 1741 2403 -4462 3009 935 -3992 4645
2418 4645 -2763 -1063 3680 -3635 37 4523 -5996 4224 -97 -4193 6190 -4467 -489 5047
2432 5047 -5924 3117 811 -4461 5644 -3560 -901 3627 -2596 -601 3248 -3928 2407 809
2446 809 -4178 4580 -700 -4176 6424 -4508 659 3927 -7178 6662 -1975 -3574 5337 -3683
2460 -3683 395 2771 -4941 4232 -631 -2599 2540 828 -3002 2863 -1880 -1078 4868 -6396 2356
2475 2356 3443 -6483 5398 -2276 -2224 7084 -8516 4623 1747 -4898 4014 -1882 -140 3005 -3842
2490 -3842 1087 2540 -2252 -870 2834 -2539 1262 1193 -5413 8219 -4929 -1988 6326 -6282 3745
2505 3745 -374 -5067 9030 -6477 12 3852 -3522 2739 -1898 -429 2266 -528 -3416 3199
2519 3199 1152 -4048 3199 -1820 -78 5075 -9476 7617 87 -5829 6732 -5797 3528 1762
2533 1762 -7633 7346 -1624 -2853 2530 -2326 3047 -1399 -1143 38 4199 -4300 -701 4952 -4332
2548 -4332 3262 -1932 -3218 9219 -9471 2324 4491 -6133 6320 -6104 1721 5049 -6855
2561 -6855 2442 1736 -1137 598 -1931 1980 345 366 -4839 5626 -442 -5220 5958 -4998 4341
2576 4341 74 -7495 10333 -4648 -2369 5154 -6138 7155 -4443 -2121 5791 -2604 -964 296
2590 296 1167 3 -974 -851 377 4427 -6997 2428 4117 -6188 6345 -6462 3112 4623 -9918
2605 -9918 6701 -65 -3234 4441 -6316 5744 182 -4323 2378 970 91 -2430 2197 -748
2619 -748 2394 -1534 -3586 7725 -5027 -1576 5284 -6540 7478 -5679 -1653 8191 -7685 2593
2633 2593 804 -2082 4584 -4711 1040 2973 -2096 -1061 957 2152 -2913 2498 -3639 3246 1827
2648 1827 -7342 6915 -1358 -2797 5256 -7228 6896 -980 -6231 7210 -3822 937 610 -2370
2662 -2370 3415 -1032 -2440 1857 1644 -2226 -578 2675 -3065 4344 -4350 75 5773 -7789 3911
2677 3911 284 -3079 5693 -6337 2426 3909 -6266 4224 -1503 248 1001 -2044 503 2353
2691 2353 -1918 -1700 3383 -1321 -534 2362 -4121 5064 -1942 -4076 7091 -5534 2051 707 -3993
2706 -3993 5537 -3119 -1824 4911 -3913 1253 -186 -1139 1344 -147 -2280 2134 1061 -3953 3477
2721 3477 -1537 -1002 3598 -5060 3029 2070 -5979 5833 -3130 -131 2585 -4531 3153 472 -3656
2736 -3656 2813 -882 -937 1842 -1616 163 2278 -2247 -24 3443 -4535 3212 -530 -2436 4477
2751 4477 -4009 153 3802 -5104 3786 -650 -2286 3987 -3228 301 2300 -2786 529 1577 -2830
2766 -2830 2570 -299 -2044 2792 -989 -2083 3855 -3949 1694 1496 -3760 4102 -1438 -2082 3793
2781 3793 -3118 645 2116 -3908 3379 -506 -1913 2587 -863 -1524 3473 -2747 881 1912 -3342
2796 -3342 2466 713 -3103 3611 -1981 -646 3458 -4106 2341 710 -2985 2953 -881 -1973 3726
2811 3726 -3259 654 1825 -3043 1830 850 -3045 3424 -1349 -1271 3500 -3228 767 1514 -3374 2373
2827 2373 455 -3018 3976 -2756 -121 2609 -3086 1416 1170 -3368 3315 -963 -1588 3336 -2493
2842 -2493 68 2438 -3107 1571 985 -3338 3702 -1816 -1084 3055 -2482 471 2281 -3845 2939
2857 2939 -283 -2063 3255 -2303 -357 2777 -3015 1496 1434 -3294 3222 -1198 -1457 2694 -1818 -441
2873 -441 2865 -3801 2234 223 -2726 3078 -1656 -1340 3022 -2905 772 1846 -3552 2806 -530
2888 -530 -1771 2692 -1252 -1232 3109 -3218 1553 1333 -3176 2624 -428 -2241 3852 -2607 238 2599
2904 2599 -3816 2399 59 -2350 2807 -1213 -1272 3232 -3123 1271 1353 -2337 1450 825 -2697 3188
2920 3188 -1702 -1194 3674 -3221 1090 1621 -3349 3177 -955 -2084 4022 -3484 927 1269 -2232 1856
2936 1856 387 -2450 2578 -1259 -1382 2472 -1297 -189 2422 -3138 1904 927 -4023 4458 -2262
2951 -2262 -468 2675 -3304 1964 1062 -3507 3681 -1519 -556 1753 -1716 555 1402 -2057 887 1999
2967 1999 -3092 2050 84 -2128 3301 -2659 -160 3951 -4999 3319 -623 -2033 3424 -3259 824
2982 824 2278 -3238 1683 212 -1210 1280 -826 -501 1612 -111 -2363 3828 -2599 468 1717
2997 1717 -3505 3779 -1128 -3091 5343 -3966 1664 753 -3339 4081 -2424 -811 2183 -968 -363
3012 -363 608 -557 643 518 -1916 938 2716 -4702 3187 -879 -1257 3702 -5161 3450 1453 -4369
3028 -4369 3930 -2240 388 2053 -4181 3657 -582 -1287 325 844 -459 -18 -35 -1011 2693 -2189
3044 -2189 -1822 4807 -4024 1782 424 -3276 6008 -5380 816 3507 -3870 2610 -1411 -542 3118
3059 3118 -3822 1026 1037 -63 -1630 1050 258 -452 1424 -3572 3865 366 -4132 4501 -2718 631
3075 631 1826 -5421 6334 -2729 -1746 2876 -2321 2014 -1230 -1560 2750 -776 -980 64 1799 -1608
3091 -1608 77 392 -1714 4317 -5157 1777 3029 -4491 3456 -2342 -91 4183 -6134 3901 480
3106 480 -2131 1990 -2190 2058 1 -1496 221 1809 -743 -1950 2322 -1302 582 993 -4025
3121 -4025 5972 -3194 -1474 3915 -4334 3472 -1515 -2124 5005 -3885 407 1507 -1198 1643 -2187
3136 -2187 932 576 525 -2296 1356 1210 -2920 2289 -1695 451 2832 -5417 4335 -261 -3094 3923
3152 3923 -3791 3129 51 -3398 3550 -899 -962 829 -1042 1284 -691 -315 -412 2647 -2386 -502
3168 -502 2722 -3162 2784 -1680 -949 4489 -4854 1743 1916 -3262 3966 -3406 1155 2083 -2837 920
3184 920 478 -745 212 -320 22 917 188 -2373 2968 -795 -1870 3218 -3596 3118 -600 -3010 4222
3201 4222 -2501 -284 2306 -2988 3054 -1449 -1084 2300 -1116 -488 525 3 -457 987 -1600 625
3217 625 1640 -3091 1910 802 -2621 3529 -3576 1555 1866 -3622 2904 -510 -1284 2270 -2204 1060
3233 1060 1142 -2318 1134 462 -804 -10 832 -1638 2321 -1530 -665 2679 -2486 792 1511 -2847 3162
3250 3162 -1762 -1032 2896 -3007 1231 237 -1516 1549 -846 -1132 2202 -1391 -91 1193 -1002 102
3266 102 1525 -2162 2088 -123 -2178 2474 -1430 -225 1741 -2522 1665 318 -2241 2937 -1755
3281 -1755 -116 1451 -1778 261 1169 -1979 1834 67 -1655 1875 -758 -920 2053 -2123 577
3296 577 1624 -2939 2491 -631 -923 2135 -1380 -54 1883 -2354 1692 146 -1217 1850 -708
3311 -708 -747 1814 -1551 168 1297 -1895 1563 165 -1626 1972 -768 -955 2239 -2447 1037 789
3327 789 -1744 1807 -179 -1444 2388 -1770 -142 1579 -2213 1497 176 -1391 1544 -469 -1301
3342 -1301 2266 -1852 476 1058 -1711 856 273 -2053 2230 -1352 -482 1778 -2267 747 745 -2037
3358 -2037 1555 -72 -1516 2390 -2100 79 1186 -1835 480 861 -2101 1990 -659 -1082 1850
3373 1850 -1654 397 1277 -1877 1284 433 -2001 2171 -1305 -142 1525 -1494 482 1101 -2284 1885
3389 1885 -427 -1185 1705 -1220 -420 1869 -1679 1061 1024 -2139 2126 -979 -813 1853 -1333 55
3405 55 1313 -2371 1668 -371 -1088 1460 -620 -809 1703 -1487 15 1195 -2255 1342 34 -1238
3421 -1238 1643 -1134 -599 2071 -2431 1695 -161 -1420 1426 -704 -652 1804 -1549 338 833 -1298
3437 -1298 995 370 -1410 1416 -8 -1453 2198 -1984 880 1226 -2146 1829 53 -1749 2419
3452 2419 -1914 356 1113 -1864 1328 -16 -1097 808 115 -704 1273 -1234 -363 1562 -1646 227
3468 227 1137 -2199 2448 -1287 -796 2503 -2256 808 943 -1767 1631 -813 -305 1777 -1445 484
3484 484 768 -356 -346 857 -1335 1024 26 -1690 2390 -793 -719 2145 -2503 2095 139 -2482 2903
3501 2903 -1812 88 859 -1785 1058 -337 -1006 1313 -329 -421 74 715 -1090 1464 -1306 52
3517 52 2240 -2970 1908 269 -1903 2407 -2409 1089 1645 -3170 2389 -729 78 923 -1134 692
3533 692 651 -1045 19 1136 -698 -639 1116 -1541 1513 -479 -1751 3574 -2741 649 753 -2141
3549 -2141 2646 -1833 -558 2480 -2405 1185 -262 -55 1120 -936 62 380 643 -1782 1329 289
3565 289 -1179 1355 -2092 1284 1373 -3593 3272 -1746 -79 1399 -2657 2410 -510 -1756 2021 -793
3581 -793 541 -266 -140 591 -230 -662 -950 2344 -2092 549 830 -1557 2579 -2380 45 2792 -3394
3598 -3394 2371 -995 -705 2301 -2974 1685 416 -1149 489 -300 258 72 -127 -42 677 587 -2175
3615 -2175 2554 -1092 -15 1154 -2742 3102 -1322 -1574 2723 -2128 1234 96 -1575 2869 -1777
3630 -1777 21 641 177 -419 -61 259 -46 761 -1317 556 1923 -2641 1795 -369 -525 2255 -3459
3647 -3459 2318 221 -1921 2250 -1397 727 639 -1965 1793 -438 -426 -323 480 -151 -475 336 -910
3664 -910 1776 -1367 -907 1962 -1959 1213 175 -1525 3252 -3086 903 1219 -1746 1599 -920 -28
3680 -28 1049 -1090 351 713 70 -622 338 -65 -315 966 -2125 2215 -136 -1754 2089 -1759 670
3697 670 848 -2545 2986 -1375 -435 1335 -1239 718 -195 -581 648 103 -789 473 269 -612 600
3714 600 56 -787 1893 -2316 1096 945 -1745 1867 -1197 122 1645 -2023 1106 331 -1255 1337
3730 1337 -864 443 496 -146 -364 1106 -776 -279 840 -968 910 76 -1500 2076 -1453 -67
3746 -67 1496 -2054 1589 -747 -1101 1408 -1225 -85 924 -968 569 26 -405 512 190 -880 1146
3763 1146 -576 -582 1508 -1125 389 531 -1620 1495 -118 -904 1703 -1535 704 558 -1379 960
3779 960 -12 -545 1115 -598 -65 715 -948 94 619 -1102 731 318 -1253 1584 -948 -237 1147
3796 1147 -1269 548 679 -1524 1353 -704 -496 1254 -1128 299 487 -814 625 389 -978 1091
3812 1091 -638 -505 944 -798 -37 1120 -1385 1085 -159 -683 1390 -676 -301 1007 -1330 479
3828 479 399 -1159 1197 -666 -521 1004 -657 -39 983 -1315 849 -141 -961 1120 -419 -536 1146
3845 1146 -1306 376 751 -1391 913 -117 -1000 1234 -867 -94 1045 -1096 636 123 -810 865
3861 865 -185 -715 1252 -765 94 651 -1232 900 91 -878 1172 -288 -489 1356 -1195 533 394
3878 394 -892 714 55 -981 1305 -827 67 835 -853 256 669 -872 876 16 -775 1203 -1119
3895 -1119 57 806 -1092 375 530 -1133 1163 -496 -305 864 -903 65 611 -799 695 27
3911 27 -966 979 -546 -175 978 -1018 290 866 -1284 1143 -360 -617 1232 -817 211 588 -940
3928 -940 587 -9 -783 888 -485 -315 775 -727 -19 824 -1005 1031 70 -834 913 -508 -209
3945 -209 1327 -1421 626 352 -1175 1380 -523 -293 555 -727 30 745 -854 439 55 -506 406
3962 406 82 -920 1273 -913 -380 1186 -1496 1003 58 -858 1333 -856 121 890 -1101 797 -292
3979 -292 -403 675 -129 -320 722 -258 -375 616 -541 -129 801 -1400 1334 -147 -1106 1398 -1135
3996 -1135 604 290 -1187 1199 -235 -580 1051 -742 605 101 -386 352 551 -790 -27 558 -1051
4013 -1051 856 -469 -577 1164 -1517 493 550 -1662 1580 -961 -52 926 -1367 914 411 -559 269
4030 269 -226 -35 135 -31 -686 1040 -44 -763 1305 -1363 943 171 -1123 1909 -1170 -202 1177
4047 1177 -1377 1073 -690 -362 1141 -1088 69 53 91 -359 145 24 162 410 -960 570 507 -1164
4065 -1164 1664 -1360 523 971 -2083 1663 -532 -729 992 -1276 910 -116 -811 772 -265 220
4081 220 -595 669 -346 332 -192 -593 1181 -1048 -211 1055 -1394 1632 -1027 -498 1807 -1949 883
4098 883 -35 -327 892 -1189 327 658 -690 -81 -139 537 -842 551 -521 324 514 -1411 1842
4115 1842 -622 -624 1167 -1478 1341 -266 -1270 1890 -1278 519 211 -510 820 -693 -11 372 125
4132 125 -498 38 611 -550 725 -240 -180 1473 -1783 1086 -75 -756 1178 -1401 900 592 -1434
4149 -1434 1328 -638 315 359 -676 618 41 -95 -596 744 -134 -281 649 -708 961 -440 -962
4166 -962 1924 -1382 503 265 -655 1499 -1442 10 1030 -1000 532 -187 -154 325 -573 -21 261
4183 261 365 -1006 828 -167 -363 971 -1049 913 290 -1431 1430 -673 169 392 -1144 1558 -297
4200 -297 -600 499 -50 143 5 -236 433 178 -327 -132 884 -971 471 61 -564 1309 -1220 157
4218 157 608 -1338 1099 -359 -422 1030 -1268 371 305 -88 231 -10 -312 66 -14 -184 692 -206 -457
4237 -457 758 -665 87 372 -967 1514 -514 -355 905 -895 384 253 -965 965 -694 -222
4253 -222 514 -189 -57 277 -110 7 520 -584 502 145 -537 755 -337 -475 960 -938 801 74
4271 74 -527 728 -525 -168 464 -737 657 153 -373 419 100 -298 352 -9 -477 719 -652 354
4289 354 279 -878 643 -107 -726 1197 -588 22 398 -686 564 -243 -305 629 -331 -250 420 -443 90
4308 90 362 -381 178 18 -632 638 -155 -359 739 -517 186 384 -647 880 -164 -247 589 -704
4326 -704 -21 199 -408 255 409 -820 506 -315 -341 580 -378 53 517 -456 291 156 -790 718 -335
4345 -335 -4 626 -869 56 455 -618 757 -93 -280 555 -274 -324 589 -575 264 170 -753 590 -273
4364 -273 -449 634 -498 -158 695 -713 804 -260 -484 577 -302 -220 557 -721 336 369 -663 528
4382 528 -7 -267 442 -352 -428 508 -744 378 106 -308 504 -16 -374 655 -640 253 502 -537 296
4401 296 -199 -205 514 -246 -169 636 -723 95 307 -439 193 -12 -466 638 -547 -20 289 -309 466 90
4421 90 -564 215 -164 -82 673 -591 212 137 -332 225 77 -374 662 -362 -348 454 -475 158 277 -664
4441 -664 743 10 -632 611 -666 -51 106 -563 233 154 -541 473 -75 15 291 -387 -181 445 -411
4460 -411 405 434 -486 823 -500 -368 709 -669 140 460 -648 966 -345 9 180 -257 117 307
4478 307 -308 228 235 -299 381 120 -578 530 -117 -313 784 -836 581 -15 -719 788 -698 -199 647
4497 647 -588 703 44 -401 325 -136 -108 35 2 -267 623 -430 40 447 -782 343 72 -465 944
4516 944 -951 111 432 -634 522 -100 -99 476 -354 245 196 -363 307 22 139 -26 352 -610 637
4535 637 -162 -580 588 -424 183 269 -1088 1196 -392 -212 820 -749 473 -119 -143 421 74 54
4553 54 209 211 -160 -29 162 -326 523 -603 260 456 -805 695 -438 -64 583 -974 538 140 -676
4572 -676 612 -503 238 -20 -221 78 336 -78 -153 536 -316 80 133 -673 831 -261 -277 833 -795
4591 -795 630 -543 -224 609 -708 361 412 -386 444 -437 248 162 174 62 245 543 -634 210 -362
4610 -362 -205 534 -1001 926 -182 -668 1173 -957 770 -232 -701 938 -273 -180 212 -452 331
4627 331 -127 2 -142 305 -346 -148 606 -835 576 -480 -112 590 -873 376 480 -841 465 -662
4645 -662 238 577 -769 535 -264 80 -24 -174 213 120 129 -444 393 322 -487 845 -358 387 -14 -438
4665 -438 875 -881 32 333 -571 436 -361 -254 347 -421 53 -128 392 -225 292 -109 -134 330 -510
4684 -510 338 126 -509 740 -539 431 409 -923 693 -295 -32 313 -237 372 32 -276 207 -343 63
4703 63 29 271 -289 284 -196 -305 583 -324 57 282 -631 606 -351 -207 742 -693 578 96 -174 230
4723 230 -196 96 223 -346 -209 -69 66 -113 287 -187 128 336 -478 561 -253 96 140 -495 536 20
4743 20 -524 844 -339 30 232 -327 233 -474 -243 62 273 -330 -34 31 -146 258 -316 -342 512 -478
4763 -478 330 -112 -455 528 -368 420 46 -190 288 -422 -173 255 -262 243 253 75 -145 180 -446 132
4783 132 73 -345 230 -67 -116 483 -359 351 -13 -294 314 -131 -144 22 -144 164 28 -182 187 -9 -263
4804 -263 83 168 -553 379 -70 -103 374 -486 274 -208 -233 253 -195 -47 258 -384 216 70 -107 272 -180
4825 -180 -334 601 -229 -51 134 -427 109 133 -58 168 -211 -200 620 -373 67 24 -600 204 -39 -430 384
4846 384 -19 -168 51 -39 280 64 -354 308 130 -424 213 -114 -158 495 -265 142 281 -393 205 -224 -281
4867 -281 540 -496 -5 -142 -536 300 -68 -241 330 -210 60 264 -86 -162 227 -286 341 -36 -32 199 -35
4888 -35 -12 276 -476 313 -58 -328 431 158 -166 91 -299 -34 162 -492 391 171 -33 -39 -98 -165 472 -274
4910 -274 123 107 -503 67 -44 -592 262 -177 -184 286 -322 158 -234 -113 -99 195 -15 32 -352 139 73 -342
4932 -342 37 103 -168 305 -52 -213 297 -324 41 -129 -194 417 -128 -162 241 -66 5 72 -304 -83 139 -129
4954 -129 115 20 -88 149 28 -112 399 -364 199 110 -184 543 -262 -78 41 -295 231 141 -287 174 151
4975 151 -135 295 59 -140 99 -157 -30 234 -563 271 -127 -245 448 -346 2 502 -402 323 -42 -254
4995 -254 291 -1 -55 33 -389 40 -14 -198 -16 -98 -138 192 145 -267 460 -512 183 318 -395 425 -357 -314
5017 -314 468 -480 328 31 46 150 -165 131 -224 100 -113 184 42 -188 363 -82 136 376 -325 374
5037 374 -41 -138 454 -508 301 -202 -360 365 -119 296 -166 114 154 134 -48 -145 44 -383 26 16 -159 225
5059 225 -340 -13 314 -632 138 211 -179 556 -432 291 125 -231 135 -194 20 -22 174 -2 370 261 -191
5080 -191 289 -55 -355 364 -443 362 -112 -277 362 -426 206 -19 -482 216 -411 79 101 -140 -36 -57 53
5101 53 -110 -14 -175 88 204 -377 331 84 -113 395 -650 260 71 -434 428 -364 120 53 -481 64 -198
5122 -198 -203 -21 171 198 -226 229 -205 78 -113 -248 552 -114 150 120 -370 655 -479 -80 225 -191 123
5143 123 -296 194 227 -231 -7 -123 -103 -20 -43 74 -28 73 -356 162 30 -357 471 -368 303 51 -331
5164 -331 543 -182 -84 204 -446 202 -101 73 21 -205 99 -172 281 -191 -117 -6 -19 244 -325 123 151 -471
5186 -471 223 -101 -225 256 -287 322 -11 -199 407 -110 -12 -46 -143 -32 28 53 -74 243 -364 160 81 -162
5208 -162 176 232 -124 371 -467 213 -192 -374 489 -413 60 20 -191 32 -89 -79 -49 -63 -69 142 -85 -187
5230 -187 188 -195 66 306 -229 281 44 -26 200 -272 213 -63 -166 216 -190 -71 -30 -106 97 98 69 21
5252 21 112 -39 -2 219 -340 26 -254 -273 315 -448 75 49 112 430 -128 -39 134 -176 135 -35 -13 19 -81
5275 -81 -50 83 -23 -63 195 -195 -128 153 -99 -96 81 9 209 -296 -91 -50 71 170 247 -196 203 -110 -99 74
5299 74 -256 220 160 -223 67 254 -123 50 346 24 166 -7 31 308 -382 260 33 -163 280 -200 78
5320 78 -243 -16 220 2 -153 179 19 -147 116 -128 -3 357 -197 33 51 -181 109 214 -99 398 -194
5341 -194 -110 82 -144 -83 5 -9 249 0 -70 150 -171 57 -188 -404 4 321 33 445 -98 12 203 -443
5363 -443 139 -48 35 45 130 -28 234 -121 44 -79 -94 -125 -50 -255 243 -84 -26 -73 -247 16 -26 -42 -40 160
5387 160 -96 154 -276 -168 256 -40 82 307 -192 321 32 -234 -185 -172 -204 152 -116 148 141 -73 166 74
5409 74 211 -61 -219 48 54 23 292 34 -227 87 -23 -167 230 -138 -117 262 -29 -78 -130 -115 58 -143 -92
5432 -92 180 -144 223 -197 -358 130 122 -49 129 -143 205 87 -123 149 19 -193 84 -43 -103 39 -144
5453 -144 32 -79 29 -25 -150 -33 71 -203 41 -39 -163 94 -69 -308 143 -39 -150 -93 -250 21 118
5474 118 131 108 -53 -426 234 -17 -38 255 -187 -148 79 -219 145 25 -205 253 -201 86 -38 -180 159
5495 159 -105 -67 6 -32 -127 -8 -172 -380 254 -56 186 244 -48 417 -80 -43 449 -296 18 -58 -392 148
5517 148 -300 138 -203 92 -152 43 -116 31 155 -214 23 224 -99 280 -16 -248 214 -405 193 -177
5537 -177 -37 259 -307 147 4 -59 186 174 18 15 6 169 98 -9 -142 260 34 -178 46 -150 33 -149
5559 -149 -84 225 -278 -255 164 -284 114 -281 -43 -109 -17 96 11 -11 -208 160 290 111 93 -309 310 86
5581 86 56 262 -179 -38 -161 -231 224 -231 123 344 -124 104 -84 -27 259 -301 -32 13 84 -97 -190 -27
5603 -27 -59 193 -102 135 157 -233 79 -124 146 63 -362 259 7 -141 40 -132 113 -43 256 -43 -102 82
5625 82 56 82 -158 158 211 -123 325 -376 12 31 -249 250 -146 112 10 -89 34 89 121 260 -36 -126 -53
5648 -53 143 -272 212 237 -131 288 -118 -51 -32 -146 63 -131 134 301 -145 203 -32 -291 25 -100 -137 -98
5670 -98 41 -270 221 -31 -110 34 -54 22 24 -183 332 12 -248 29 -62 -7 -58 -280 127 -84 -12 71 -210 116
5694 116 142 28 -33 -58 -88 20 -78 -46 160 119 -34 64 -213 305 -80 -269 157 -284 -7 50 -509 286 13
5717 13 -104 24 -73 -143 13 238 -229 190 -49 -175 14 -133 54 104 19 153 -191 -15 105 49 226 -213
5739 -213 -14 160 -185 37 16 -190 42 -125 244 20 -67 -39 -153 -34 25 356 -159 -96 -50 -97 183 -288
5761 -288 39 113 -180 290 99 -12 131 -33 -18 -1 90 -77 7 -145 236 6 -173 -152 -96 -129 19 -1 -68
5784 -68 -2 -275 -79 -185 26 175 -201 -89 -123 25 -97 -84 -31 -289 -121 -118 336 -71 42 104 -392 -23 127
5807 127 -117 37 146 -1 109 -122 -44 -99 7 -120 -164 -4 121 -243 51 -112 -25 -49 -122 24 -12 -51 -3
5830 -3 24 -134 -236 96 -48 172 -184 -139 -2 -154 98 186 -17 -109 104 15 169 -56 68 262 112 -146
5852 -146 10 -306 49 201 -76 -19 98 135 107 -185 207 92 -333 98 -26 -59 -107 27 -241 208 216 -187
5874 -187 91 28 92 21 83 280 33 182 -7 -117 26 157 239 -83 167 -306 91 58 0 198 -63 71
5896 71 -8 -18 164 -18 59 99 -49 -203 95 -84 402 -1 -25 115 48 -145 79 -238 -116 42 -22 28 -94
5919 -94 69 -45 -127 210 -50 9 -42 45 -15 49 2 -231 224 -140 46 125 -115 80 231 156 261 167 -91 155
5943 155 156 -122 158 -11 -100 159 -14 138 146 119 149 -250 67 40 -261 49 -83 169 25 19 -57 1 80 30 -2
5968 -2 102 -114 57 -6 229 -104 -22 106 -74 154 -177 -106 34 -58 -80 137 -348 186 42 -142 -1 -83 -41
5991 -41 101 46 288 -108 172 -21 -44 -118 -37 54 -40 55 -250 -171 80 -118 33 240 -89 33 -46 -6 -28 142
6015 142 123 -104 136 -67 -73 -74 -97 -99 59 73 -128 -4 -42 -179 25 -77 -132 184 157 111 101 -66 -15 -35 -21 209
6041 209 -71 -160 61 9 -143 147 -146 68 -69 -127 -192 -83 140 100 -141 113 51 -144 39 -181 -125 -119 -69
6064 -69 17 118 -155 50 -96 103 5 191 -31 -56 -60 -235 -106 -257 17 131 -151 -31 -267 -222 -101 -91 -80
6087 -80 -136 110 96 -181 40 -2 3 202 -37 5 23 107 -53 109 -127 -167 198 -48 -191 0 -210 -71 -66 17
6111 17 430 -59 -97 39 -85 48 -87 108 -179 -110 317 108 64 -264 -9 7 9 -52 2 207 51 -100 -80
6134 -80 21 26 72 -75 -100 -167 -209 -58 48 -42 -8 -93 20 -72 91 -48 -136 -121 158 -113 -15 30 -24 94 134 -103
6160 -103 56 -177 66 181 42 -80 8 -111 3 21 -99 -239 260 69 -55 101 97 -107 68 -151 -36
6181 -36 -22 -125 -25 -3 68 -37 205 39 -53 103 84 2 -153 -166 47 44 34 -140 36 60 86 -52 -51 141 -298
6206 -298 -139 -120 64 69 122 22 20 -355 -111 -47 126 -76 -105 19 -137 23 -169 -42 -69 -47 271 -59 -160
6229 -160 176 41 271 -171 78 236 -180 71 -207 -21 145 48 -71 3 138 284 147 313 -219 52 1
6250 1 28 -28 -33 174 257 49 40 -89 95 -75 107 36 162 48 -2 241 342 28 -196 70 -53 -90 23 -114
6274 -114 -47 35 -17 32 -124 57 155 168 -103 44 75 -28 124 68 18 -176 -13 201 192 -24 168 -18 -78 86
6298 86 -72 -18 284 -251 180 58 57 49 32 -206 25 -69 26 72 22 76 -63 125 4 -123 -10 -118 -307 80
6322 80 -269 123 102 6 41 -101 -154 -166 90 106 -131 -95 67 -70 32 -8 -19 -94 -181 81 100 -61 192 -54
6346 -54 -70 -2 199 -251 -118 38 -121 -62 68 -85 -131 49 -5 132 72 -60 -146 92 -153 -18 -35 -95 10
6369 10 88 -297 -202 -78 -46 192 -208 52 45 -32 294 -39 152 78 58 132 260 -82 -24 -143 -58 157 207 90
6393 90 0 89 -3 -12 57 75 -125 -132 -93 -32 -204 96 -110 100 19 -161 -179 -179 322 -3 38 184 -96 218 -57 62
6419 62 -62 -36 -139 -175 33 -130 -84 104 -168 -266 -108 -1 85 -248 48 -217 -160 -210 -59 -98 -63 -75 47 -224
6443 -224 -59 129 -6 123 -71 88 66 -113 -155 -31 93 57 75 -69 -15 90 135 33 -51 30 -239 73 59
6466 59 200 -43 -81 30 -284 48 1 -119 -81 114 -94 -23 235 87 334 -98 -208 -5 -177 -134 107 156
6488 156 -127 -2 -66 21 110 -23 66 40 133 -26 229 76 -67 29 -176 -136 -79 -31 67 -18 1 47 -114 98 4
6513 4 235 -71 443 1 -76 88 113 8 165 10 -242 12 -159 148 54 -151 113 83 42 -51 -45 97 -156
6536 -156 301 -95 39 272 120 -51 -106 83 114 -115 135 -8 -35 141 -31 32 143 -20 -5 -91 -100 26 -143
6559 -143 257 27 98 -133 120 155 -276 -115 -127 49 -32 -106 71 184 35 81 -5 126 -96 28 167 162 -118
6582 -118 -80 -125 -62 18 168 16 -214 60 261 -98 -119 -108 -104 83 -9 76 81 -275 -126 285 64 175 62 -169
6606 -169 -55 -4 192 -149 15 61 -170 59 -135 265 93 31 176 178 -150 -9 -6 7 -128 -217 162 24 -127
6629 -127 -238 -154 87 287 -86 -113 -283 122 155 -88 -108 -151 215 163 33 -125 -66 -5 -245 -107 -135 -28 -269
6652 -269 51 -151 -37 -124 49 189 11 -58 232 -169 -298 -82 -43 41 54 98 17 8 -135 -93 -148 60 11 -25
6676 -25 203 -258 -234 194 -181 69 -21 186 -48 -18 -106 82 196 120 -87 -15 26 76 -59 108 -16 25 51 9
6700 9 19 91 -44 -4 -75 -281 -161 -223 -62 120 -13 -82 65 8 -141 25 -87 -161 79 112 -151 -50 74 181
6724 181 33 44 -11 -338 68 153 319 -10 -68 138 252 -21 192 -55 38 -20 -125 42 -87 -177 65 246
6746 246 -31 -124 -74 101 122 10 -84 16 -121 53 -210 109 -62 147 74 152 -173 49 -111 35 25 140
6768 140 211 -4 20 77 -50 -138 12 -115 127 27 73 -64 302 -35 121 -95 -100 160 144 64 98 74 18 -71
6792 -71 -172 -84 62 -57 20 -47 180 -78 28 74 60 105 140 -35 -188 -19 -162 111 128 -51 80 -87 94
6815 94 -67 4 -100 -15 40 -164 -104 -67 -132 -73 -164 -79 9 54 -155 -45 63 -185 -137 6 -62 5 187 -58 -19
6840 -19 -88 183 34 -6 -84 51 -76 94 41 87 26 10 -31 -94 -100 -28 4 128 -43 5 55 -34 316 35 112 222
6866 222 81 211 -30 -73 -235 58 10 115 27 33 147 -103 181 -77 175 101 99 -85 62 202 -45 228 -6
6889 -6 -28 71 26 271 -161 -317 97 132 78 8 -29 106 -202 66 -59 193 18 -14 152 108 -182 -169 -208 83
6913 83 14 -49 -101 116 167 203 101 69 -22 159 140 -386 107 22 -166 55 48 107 -177 -144 -173 -171 -62 -99 -210 70
6939 70 142 -135 -353 111 5 88 -163 23 -78 -140 158 -60 223 123 128 -283 23 -126 -95 52 -34 68 155
6962 155 -111 2 -220 121 -134 -3 89 36 -60 -3 225 -74 62 122 192 -123 63 -128 -113 15 -14 -47 -89
6985 -89 2 -59 291 -144 -98 14 -123 123 -202 64 -90 87 -29 107 -124 -151 116 59 259 250 -79 -120 -51
7008 -51 28 171 111 -35 -114 27 13 201 11 -173 64 34 105 276 116 269 -44 179 109 26 22 247 29 -64
7032 -64 22 -126 51 104 -181 239 -172 -1 88 -78 253 -174 44 55 121 -148 110 81 149 33 13 107 -50
7055 -50 -36 -84 220 -38 10 -37 -124 -101 -54 -97 -139 -147 126 71 215 0 18 77 199 -151 67 9 -96 63 -31 72
7081 72 -37 12 -79 -308 262 41 -2 -182 -109 191 -74 272 -89 59 116 -50 109 -73 93 80 -152 -17
7103 -17 -11 141 91 -287 174 -125 -30 -203 17 94 -124 153 100 -60 103 -137 33 -158 33 63 -96 -80 -16
7126 -16 2 40 199 175 -124 -144 213 51 22 91 -191 61 -103 -48 -89 135 -10 37 279 49 53 55 206 144 49
7151 49 20 -4 23 35 -19 108 -27 -145 2 -109 -144 81 88 -52 -41 138 -293 129 -151 -156 -17 85 -1 -139
7175 -139 -22 143 158 146 -82 87 -47 24 -155 126 12 1 111 -33 35 -144 168 -218 245 -111 51 -85
7197 -85 196 22 -110 4 51 -56 -89 -370 95 -123 26 -7 -139 -56 112 90 -155 -137 -192 -277 0 88 56 -135
7221 -135 -138 49 -9 -101 -123 -120 -181 82 -203 -35 336 18 94 -66 92 -184 -155 -40 -65 -13 174 36 54 100 34
7246 34 -68 208 -40 -146 53 -472 293 19 61 -10 -19 109 -137 99 39 -137 -166 76 95 -219 -185 -38 -123
7269 -123 -147 -102 -222 -136 -141 -39 -27 -73 104 -74 107 302 -77 52 43 -7 37 191 119 71 125 53 -64 42 238
7294 238 32 57 -10 -83 10 93 -159 -66 -148 38 19 -197 -172 -37 17 74 81 -142 27 190 -130 -100 -30 159 -33
7319 -33 33 -175 59 -77 -156 -256 -60 -57 -142 -276 80 -176 -183 127 223 -31 -157 117 34 -103 91 -2 -64 28
7343 28 69 -50 77 -181 -157 5 -112 -38 -282 -49 77 225 101 113 -51 -2 111 45 -9 -122 92 -42 65
7366 65 69 56 5 210 117 -45 110 -193 -168 67 -207 26 -78 262 -21 77 -55 -69 229 44 -24 -122 120 105
7390 105 -133 -75 28 -176 192 23 -211 86 -109 7 0 -230 127 92 -131 -53 -213 91 99 12 -41 -121 157
7413 157 -42 -24 -114 36 -97 252 -51 -87 31 55 103 5 -35 81 453 34 -185 114 -88 -155 148 -135 88
7436 88 94 -218 -102 19 -13 -35 -1 -141 32 -23 -3 180 171 315 -246 -56 17 -261 -11 -21 -39 94 -333 -73
7460 -73 203 127 6 149 98 117 155 -104 75 -49 153 -142 -29 124 81 70 94 -140 -62 139 27 -126 -250
7483 -250 -143 -181 -196 59 71 -59 -178 31 -109 -78 -44 -118 -144 -147 179 -78 -99 130 -67 -15 -166 153 111 65
7507 65 33 29 146 -42 174 -266 -158 -223 -199 7 98 -59 149 -17 -159 41 -148 -124 61 46 205 93 -96
7530 -96 136 -22 69 -161 151 161 -12 65 127 -205 -71 199 -120 -30 -221 254 184 -161 -123 343 0 -121 30
7553 30 -1 25 0 -102 102 -78 -129 32 -9 -24 131 42 7 -72 -80 -46 -111 -193 63 -81 -247 -90 -38 -88 130 -236
7579 -236 98 36 -163 73 -88 -93 -206 -152 145 177 -120 17 237 -32 52 -70 -38 169 -128 250 -4 -72 -67
7602 -67 -177 -279 132 -18 201 319 -26 45 86 134 23 56 -10 170 -22 -148 -112 29 -59 39 -25 -44 156 -111
7626 -111 300 -249 -65 -88 73 -64 -22 -96 -93 -6 -39 -118 223 -84 53 -200 222 21 -395 81 -7 91 -85
7649 -85 -63 35 -59 -199 123 -143 150 -38 93 72 35 -72 -188 -35 63 -50 -41 -45 47 -55 -19 214 182 19 26
7674 26 -115 79 78 258 174 -68 2 19 408 -82 81 157 51 79 -13 -54 -58 183 174 3 -72 40 201 197 -38 94
7700 94 52 133 -21 237 108 49 140 -32 62 207 -20 77 -61 -334 135 -100 44 142 -198 -119 -124 146 -40 -193
7724 -193 52 -142 -20 -2 64 224 -79 -37 67 52 -41 16 10 -30 208 170 -84 -107 67 80 -117 88 87 9 -76
7749 -76 144 -134 22 188 43 -77 37 -164 -101 -94 -119 -72 195 161 127 -7 122 426 -270 138 289 -154 -56
7772 -56 79 410 -49 114 -231 -126 -166 -91 -22 55 -108 36 52 -26 4 57 57 17 150 165 182 49 -234 133 76
7797 76 -244 298 -177 170 147 101 232 -20 84 21 -96 -8 -102 80 1 148 -79 -80 3 -127 28 -63 -149 53
7821 53 -197 -2 298 33 203 -81 16 101 83 -325 43 -54 -182 -41 76 -80 -3 -2 191 70 -116 -78 -12
7844 -12 48 -32 -17 -129 14 132 51 -96 -93 53 35 68 -90 -131 316 57 -75 51 -89 -27 -197 -102 60 16
7868 16 -35 160 -191 239 -50 -144 48 89 -14 8 -147 -51 118 -152 112 27 59 -61 109 218 -165 139 -248
7891 -248 -96 186 90 153 189 -134 179 -128 341 -141 -19 52 107 192 100 36 -10 -2 -15 83 6 -71 -151 -90 88 -48
7917 -48 14 148 -129 6 -69 -63 -99 -32 -31 74 -106 197 110 -50 -139 -45 -182 10 -141 108 213 -117 -51 36 5
7942 5 334 51 82 -19 19 94 -132 7 -135 -23 -11 142 -415 24 250 32 14 10 220 -28 175 -148 48
7965 48 -190 2 84 -8 101 -35 79 -179 -64 3 -370 42 62 106 335 -32 63 5 -49 -127 -182 96 46 7
7989 7 16 -49 -100 156 -144 -118 -149 -303 128 124 -211 36 -104 78 -144 -225 69 -93 -89 181 -13 118 157 128 98
8014 98 22 -157 -178 -31 -54 125 -142 0 -21 -132 54 -44 48 147 62 29 -163 -25 -134 42 15 -202 57 -237
8038 -237 3 -228 150 111 -72 -183 298 -220 20 -94 193 -14 -279 -183 -159 -19 -161 -226 -86 261 18
8059 18 72 -168 -39 38 310 67 170 24 -28 -33 -61 -318 198 -165 211 74 53 16 123 -35 -152 191 36
8082 36 199 -193 46 -79 -49 -138 166 -55 167 -16 -27 -90 -8 -45 -41 -8 131 -66 115 -64 66 -34 19 78
8106 78 -43 160 -62 -103 -304 -96 -227 48 -123 69 -258 -23 -128 -6 38 -180 252 65 -196 -96 -37
8127 -37 -140 19 -9 -20 -266 134 -81 -16 247 105 -79 2 93 47 -26 80 86 28 80 91 207 27 -216 -183 -77
8152 -77 51 -44 348 -24 -95 -64 -135 58 -96 54 19 -171 103 -82 35 -118 -15 34 1 -19 -56 -174 207
8175 207 -6 76 -127 35 -17 -42 11 -7 -118 0 -40 73 -199 -343 -144 135
8191A35
$$ Imaginary data points
##PAGE= N=2
##DATA TABLE= (X++(I..I)), XYDATA
0 0 0 0 0 0 0 0 0 0 0 0 8 -8 8 -8 16 -17 24 -32 38 -46 56 -64 80 -94 110 -129 150 -175 201 -231 266 -304
32 -304 347 -393 448 -505 570 -639 715 -802 895 -994 1107 -1230 1361 -1505 1664 -1839 2026
49 2026 -2234 2462 -2711 2990 -3296 3636 -4017 4447 -4938 5500 -6153 6924 -7851 8988
63 8988 -10426 12312 -14907 18751 -25143 38553 -126183 145866 37481 -109346 106939
74 106939 -148250 142039 8951 -144496 92841 24459 -16110 -48493 18293 38006 -3640
85 -3640 -21873 -84844 190363 -114900 -51499 116633 -101513 114170 -86910 -72126 225527
96 225527 -187593 33826 45569 -55510 101621 -127355 30754 87052 -64891 -31117 31372
107 31372 38783 -41826 49 -17247 37607 53174 -170891 144480 -5319 -81480 95472
118 95472 -121457 120504 -760 -151525 164546 -55660 -18980 33064 -70467 106524
128 106524 -50237 -44128 40677 38531 -52402 -10506 41858 -27301 41957 -59421 -12063 128286
140 128286 -145487 50045 38920 -74969 109896 -125993 48264 79854 -122444 58499
150 58499 3336 -18725 41430 -70215 40554 27974 -32305 -32262 61583 -18093 -25663 37308
162 37308 -58934 79487 -29809 -75572 124494 -73703 -1606 48796 -89130 114530 -68623
173 -68623 -32726 87816 -56580 6282 13253 -26315 41275 -19708 -30618 38522 14737 -57577
185 -57577 41404 -326 -30919 63811 -88869 58260 27863 -91483 80754 -27519 -22046
196 -22046 63807 -90248 64754 7954 -61629 52381 -12689 -12203 22166 -23991 1891 38198
208 38198 -49358 8460 40693 -50551 25339 10498 -50698 81415 -67706 4140 60039 -75086
220 -75086 44284 299 -41957 66225 -50654 -2913 50048 -52098 20134 12079 -27604
231 -27604 23596 3792 -42164 56795 -27815 -21663 51196 -45106 12594 31914 -66546 63954
243 63954 -18607 -38618 66552 -52940 13913 27259 -50297 38038 4040 -44613 52682 -26494
255 -26494 -10420 34162 -31843 3130 35277 -54686 37138 5505 -43638 53098 -30596 -10900
267 -10900 46600 -52577 21823 24987 -56613 53799 -21279 -19239 42867 -34552 -1101 38610
279 38610 -51438 31928 6994 -38529 43546 -18090 -21163 46961 -40837 5993 34899 -55225
291 -55225 42502 -5276 -32533 46030 -25474 -14487 47892 -52784 26071 14371 -42263 39957
303 39957 -9363 -28268 47185 -34943 -820 37231 -49860 31518 5262 -35911 39899 -14252
315 -14252 -24124 49403 -45350 15139 22065 -41770 31341 2173 -36095 47195 -28086 -8991
327 -8991 40175 -45517 21483 14836 -39247 35177 -5426 -31274 50061 -38806 5156 28875
339 28875 -40985 23161 12800 -42625 46390 -21217 -16592 42419 -40285 11916 22858 -41167
351 -41167 30356 2622 -35849 46987 -29428 -4380 32430 -35523 11289 24314 -46582 40263
363 40263 -9294 -26264 44021 -32978 672 33386 -44848 25899 9900 -39330 44732 -24626
375 -24626 -7750 31792 -30391 4084 27233 -40936 28683 464 -27505 36082 -18855 -16396
387 -16396 43202 -40948 11758 24700 -47378 44987 -17067 -21655 44501 -34250 351 30694
399 30694 -42177 31884 -5009 -23031 31599 -11233 -19973 34353 -22708 -2417 27513 -41198
411 -41198 29002 7854 -43017 46692 -17497 -19517 46169 -53687 34840 6395 -41677 41704
423 41704 -12626 -16401 29106 -27879 12774 13946 -30161 14957 16482 -30075 15878 7398 -28604
436 -28604 44949 -41014 3826 42161 -55231 28293 8286 -35812 53400 -49016 11562 34700
448 34700 -47240 22513 2768 -12173 15402 -13105 -7971 29793 -18385 -18816 35769 -17470 -8949
461 -8949 28013 -47960 54596 -19810 -39204 66515 -44360 8159 17732 -42354 55892 -29793
473 -29793 -22365 45918 -25509 3537 -2485 877 6922 4965 -29229 20893 22731 -47418 26775
486 26775 3783 -21657 43722 -62909 38114 28144 -70083 55772 -23461 3023 22460 -51986
498 -51986 42591 7708 -38929 20846 792 6092 -12423 457 -4469 31278 -28088 -22663 60719
511 60719 -44506 9456 9468 -33595 67430 -58945 -7612 65268 -62480 34276 -20676 -588
523 -588 40587 -50479 7850 27752 -12120 -12725 1901 15210 -6674 5694 -33791 39417 12851
536 12851 -65989 61187 -27031 7608 16491 -61482 74672 -19370 -46364 56621 -34637 28756
548 28756 -18823 -21681 47753 -18296 -19249 5778 25618 -18657 -6580 5816 -3626 34687 -54188
561 -54188 9611 56461 -69883 41829 -24037 4221 46375 -81653 45757 21188 -43191
572 -43191 27639 -26464 28300 4641 -38281 21222 15481 -5811 -31948 34834 -8564 968
584 968 394 -33495 65224 -33562 -34857 64180 -48370 34649 -19987 -27661 75068 -59360 959
597 959 26615 -15798 15731 -25811 6147 26343 -16704 -18042 13606 27290 -42095 21316 -9936
610 -9936 6276 26867 -67929 53080 9135 -48701 44857 -36608 28864 10566 -60754 60691
622 60691 -13934 -15153 7956 -6073 17174 -8068 -16308 9474 23478 -25419 -12634 38154
634 38154 -30255 20448 -14027 -17764 62605 -64568 15272 28371 -37403 35640 -32891 4287
646 4287 40908 -52131 18764 8942 -5437 -68 -8093 5389 10597 -4755 -26195 36632 -6985
659 -6985 -24915 30799 -27178 23082 3288 -47642 64254 -32357 -9132 26857 -31436 32633
671 32633 -13957 -22817 39039 -17821 -8478 10183 -2282 1956 1621 -12060 6535 22957 -42256
684 -42256 25431 6074 -24722 31490 -31570 11450 28632 -53650 39273 -5076 -17906 27642
696 27642 -30277 17361 10324 -26935 13873 9450 -16224 8294 -803 -7094 16550 -11945 -13807
709 -13807 37796 -34169 9058 14622 -29382 34261 -20723 -11112 37798 -34987 11093 12698 -25062
722 -25062 27007 -15812 -6388 20798 -12447 -8528 20366 -17125 4911 9567 -21947 19811 1862
735 1862 -27098 33812 -18719 -5155 25662 -34785 25739 -78 -24949 29618 -13188 -9120
747 -9120 24003 -25403 13627 6662 -19992 15319 3879 -19870 21539 -9780 -8762 24312 -25569
760 -25569 8989 14510 -27705 21487 -1558 -19834 31358 -25941 5103 16999 -24883 14342
772 14342 5675 -21643 24051 -11802 -8265 22088 -20295 3380 15018 -22867 14551 4549
784 4549 -23005 28434 -16566 -4854 21765 -22702 7430 13705 -27579 25043 -7201 -14037 24744
797 24744 -18338 -59 18450 -23860 12823 7192 -23505 25372 -11320 -8796 21449 -17936
809 -17936 1035 18269 -27387 19897 -927 -18151 23158 -12575 -6837 21960 -22989 8480
821 8480 11943 -24956 22121 -6025 -13120 21972 -14577 -3780 21697 -26550 15612 3836 -19214
834 -19214 20630 -7066 -12111 24552 -20683 4273 15421 -24984 18413 -545 -16768 22071
846 22071 -11356 -8231 23670 -24805 11554 8026 -20532 17511 -1230 -16881 25118 -17554
858 -17554 -1021 18855 -24288 13594 6076 -21044 21575 -7210 -12604 25547 -23476 7583
870 7583 11354 -20276 13932 2472 -18364 23066 -13421 -4890 18985 -18809 5298 12151 -21469
883 -21469 16797 100 -18684 27581 -19118 -729 17930 -22280 11967 6304 -22890 25938
895 25938 -13320 -6607 18724 -16355 3639 10688 -18444 12891 3287 -19471 21572 -8240 -9412
908 -9412 20149 -18245 3999 17040 -31390 26062 -5468 -15404 23801 -19179 3964 14869
920 14869 -25104 17239 1906 -15806 15620 -6804 -4003 12103 -11154 -3190 20962 -24483
932 -24483 9928 8941 -20264 21066 -11031 -10632 31064 -31841 11361 11278 -22689 23044 -14838
945 -14838 -2894 19358 -18333 885 13550 -12328 4848 1528 -8281 10903 1236 -22224 29215
958 29215 -13005 -9155 21776 -26118 21375 -936 -27045 36388 -18298 -6202 18671 -23017
970 -23017 22418 -8967 -12088 17274 -1597 -12132 8549 923 -4644 8342 -13189 2922 22213
983 22213 -34188 17684 8000 -22381 29050 -30789 14329 18211 -36633 23596 -220 -10955
995 -10955 15910 -22228 16387 4560 -15226 1427 13340 -7130 -6996 10343 -11770 18386
1007 18386 -11676 -17164 38299 -26304 -1893 18405 -27604 36152 -27937 -5801 33815 -28490
1019 -28490 7080 2818 -5701 16096 -18498 51 14041 -1831 -16317 10412 8350 -15125
1031 -15125 16033 -24787 22283 8151 -39434 35487 -8820 -9355 19849 -35085 37069 -8275
1043 -8275 -26277 29167 -11001 4024 -5653 -4725 14240 -2150 -13814 2692 20118 -17954 -3830
1056 -3830 15154 -16866 27539 -32177 4682 34430 -42099 19792 -1638 -8324 26386 -39264
1068 -39264 18618 16554 -26713 11683 -5507 10448 -4315 -7864 232 15378 -6099 -21011
1080 -21011 26679 -7201 -8407 13387 -26756 38040 -17365 -24403 42823 -28446 11889 -3447
1092 -3447 -14695 33953 -24608 -7019 20832 -8180 1301 -9551 9275 1294 2372 -16918 10507
1105 10507 18745 -33285 18575 -1557 -6062 21143 -37864 26753 11607 -36593 30704 -17660
1117 -17660 10658 4452 -25529 24603 413 -14990 4919 3996 2343 -5824 -117 -3705 18690
1130 18690 -16262 -11482 32827 -27272 12828 -3170 -13204 34123 -32513 2089 25430 -27687
1142 -27687 18423 -13333 2084 17226 -21800 3849 10326 -2487 -9137 6295 -541 1535 3470
1155 3470 -19107 21574 1092 -26165 29730 -20058 10199 4908 -27254 33207 -12231 -13721
1167 -13721 21067 -15314 11070 -3220 -12076 17898 -4350 -8529 3689 8765 -12049 8591
1179 8591 -6839 -806 17101 -25178 9914 14491 -25444 22463 -14768 591 20046 -30665
1191 -30665 18329 3672 -14301 12111 -7906 1153 9778 -14368 4176 8902 -7822 -4369 12400
1204 12400 -13351 11337 -2717 -13925 25443 -18063 -2499 17256 -20734 15884 -3810 -13931
1216 -13931 25308 -19230 2301 9757 -10387 5772 1244 -9551 11901 -3192 -9729 12609
1228 12609 -3259 -7643 13791 -14255 6470 9021 -22848 21858 -6881 -9191 17216 -15625
1240 -15625 6019 9167 -20192 17483 -4108 -8519 11664 -7256 -1641 9999 -12076 3609
1252 3609 9501 -16209 10975 778 -11181 15118 -9433 -4293 17900 -21240 11534 3515 -14053
1265 -14053 15056 -7095 -6030 15743 -14834 3496 8663 -13819 9840 -252 -9553 12288
1277 12288 -4916 -7631 16439 -15150 5183 7409 -14275 11535 -283 -12582 18170 -12701
1289 -12701 -394 12291 -15767 9269 2666 -12563 13392 -4442 -8335 15741 -13762 3555
1301 3555 7834 -13472 8425 3763 -14118 16582 -8462 -4285 13539 -13817 4898 7516 -14830
1314 -14830 11921 -1079 -10993 16427 -11695 157 10121 -13036 5613 6214 -15215 14887 -5804
1327 -5804 -6357 13478 -11119 889 10347 -14794 9417 2279 -12823 15787 -8428 -3469 12146
1340 12146 -11967 2712 9073 -16288 13550 -2932 -8559 13498 -8597 -2744 12665 -14381
1352 -14381 6856 5161 -14016 13696 -4979 -6878 13279 -10267 -81 11989 -16766 11414
1364 11414 174 -10238 12998 -6117 -5382 13707 -13563 4668 6927 -13073 10655 -1137
1376 -1137 -9012 13118 -6997 -4590 13923 -15259 7411 4464 -12726 12253 -2610 -9461 16089
1389 16089 -12988 2635 8185 -13319 9793 307 -10195 11834 -4829 -5690 12125 -10992 3621
1402 3621 6651 -12178 7975 3804 -13999 16200 -9683 -2110 12849 -16181 8585 4866 -14427
1415 -14427 13982 -5482 -4799 12193 -12646 4834 5914 -9685 4447 5048 -10632 10408 -4302
1428 -4302 -5781 13639 -11089 -1382 13773 -17120 11800 -1195 -11356 18951 -15100 1263
1440 1263 10988 -12723 6930 608 -8183 12033 -7211 -3122 8450 -3140 -5810 9814 -9084
1453 -9084 3992 5800 -16371 16430 -3477 -11748 17240 -13749 5551 7124 -19473 20298 -7436
1466 -7436 -7121 10479 -7152 3053 2459 -8754 7080 3165 -9482 3736 7001 -10343 8509
1479 8509 -4647 -4870 18627 -22679 9589 8808 -16661 15180 -10295 -286 15390 -22135 11510
1492 11510 3109 -7561 4924 -4427 2580 3393 -4732 -5022 12705 -5705 -7836 12435 -9870 6745
1506 6745 1486 -17516 27401 -16397 -3776 14709 -15572 14953 -8354 -8157 20015 -13698 -940
1519 -940 5540 -2209 3078 -4995 97 3114 6055 -16668 10200 6253 -14119 12548 -11096 5466
1533 5466 12330 -28177 22311 -2028 -11078 13884 -16419 15248 -1390 -14935 13388 -34
1545 -34 -4290 -1361 1338 3324 -1181 -2667 -6145 19817 -16246 -2431 14369 -15220 15651 -13576
1559 -13576 -3504 24430 -25955 8056 6254 -10129 14531 -18689 8750 8670 -11050 -338 4538
1572 4538 2663 -5982 709 -1563 5622 2645 -19394 21170 -3873 -11425 15140 -18104 19859
1585 19859 -6387 -17458 25669 -12497 -1176 5195 -9831 16882 -12133 -3578 8837 1449
1597 1449 -6411 -1711 8584 -5963 5614 -9454 2535 16246 -23745 10745 5768 -12364 17695
1610 17695 -22557 13983 8856 -22055 14868 -3024 -129 3906 -11544 10767 1271 -7222 -1721
1623 -1721 8664 -1807 -7492 8428 -9172 13604 -8843 -10478 23308 -16233 1173 7136 -13546
1636 -13546 21356 -17394 -1608 17249 -14967 5656 -2270 494 5821 -7333 -1718 7396 802
1649 802 -9922 6495 3216 -7117 10031 -15672 13393 3363 -19639 19470 -8234 -739 8427
1662 8427 -17028 17008 -3076 -11972 13018 -5977 2455 -2155 -1923 3390 2993 -7932 1087 9883
1676 9883 -10654 3238 2757 -8319 15218 -15484 2510 14208 -19206 12670 -4349 -3269 12051
1689 12051 -14557 5095 7610 -10957 5897 -1160 -107 1797 -1860 -3837 9006 -4053 -7282
1702 -7282 12536 -9166 2872 4208 -12150 15388 -6574 -8177 16213 -13789 7162 484 -7913
1715 -7913 11465 -5456 -4870 8669 -4711 -1076 3079 -3854 1935 3883 -9050 6071 3857 -11655
1729 -11655 12347 -7307 -40 8713 -13614 8679 2955 -11814 12933 -7668 313 6675 -9980
1742 -9980 5592 2723 -7447 4590 1157 -5995 7171 -4349 -2262 8126 -8011 580 8364
1755 8364 -12409 10079 -2994 -6031 12100 -9505 824 7886 -10533 7025 188 -7216 9557
1768 9557 -5815 -1750 6888 -5446 -271 6311 -9215 6693 132 -7389 9071 -4287 -4346 10023
1782 10023 -10414 4223 4290 -10421 10070 -3419 -4915 8842 -6632 -15 6865 -9806 6557
1795 6557 819 -6576 7483 -2073 -5129 9407 -8161 1676 5972 -9688 7237 -43 -7206 9008
1809 9008 -4954 -2542 9414 -10517 5162 2698 -8085 6960 -1214 -6277 9874 -7342 174
1822 174 6405 -8876 5076 2150 -8003 8384 -2871 -4704 9549 -8836 2571 4739 -8292
1835 -8292 5637 1446 -7868 9995 -5779 -1714 7454 -8411 3224 4156 -8652 7309 -1066
1848 -1066 -6114 9599 -7194 185 6152 -7887 3934 3464 -9116 9373 -4181 -3202 8147
1861 8147 -7267 1029 5934 -9232 6235 322 -6957 9110 -5304 -1769 6820 -6964 1506
1874 1506 5406 -9640 8184 -1805 -5249 8397 -5077 -1810 7964 -9552 5286 2031 -8124
1887 -8124 8786 -3875 -3609 7532 -6461 664 5732 -8935 6188 255 -5684 6487 -2251
1900 -2251 -4360 9057 -8703 2627 5228 -9782 7567 -958 -5854 9463 -6895 139 7325
1913 7325 -10353 6460 154 -5096 5816 -2299 -3404 7597 -6630 135 5792 -7008 3286
1926 3286 2795 -7945 9287 -4130 -4961 11251 -10639 3981 3083 -8051 8319 -3106 -4907
1939 -4907 9595 -7376 1145 2949 -4188 2854 1485 -5922 5514 613 -7413 8585 -4251 -1405
1953 -1405 6940 -10100 6661 3294 -11959 12451 -6828 -177 6141 -9412 6978 1287 -7588
1966 -7588 6537 -1321 -2116 2712 -2727 -104 4916 -5642 -956 8942 -10591 6066 -165 -5831
1980 -5831 11174 -10380 541 10471 -13181 8447 -2715 -3078 8777 -9502 2720 4589 -4626
1993 -4626 -329 2538 -1704 1524 29 -4905 7163 -213 -9770 12727 -8067 2426 3897 -11814
2007 -11814 14284 -6060 -6738 11620 -8683 4590 -769 -5975 10132 -5283 -2301 2991 2611
2020 2611 -4400 1671 -369 -380 5918 -10277 4361 8121 -13464 10049 -4758 -695 9974 -16810
2034 -16810 11477 1374 -9139 7564 -5338 3711 2324 -8340 6248 1643 -2582 -3852 6405
2047 6405 -2750 172 956 -6464 13011 -8987 -4133 12908 -11312 7231 -3072 -6405 16352
2060 16352 -15105 2766 5585 -5448 4387 -5292 1656 5175 -4793 -2495 4157 3201 -7675 4784
2074 4784 -1382 65 5934 -14976 13950 -1362 -9846 11079 -9154 6609 1261 -13070 15525
2087 15525 -6094 -3185 3812 -2882 5104 -4309 -1979 2441 4074 -6459 -901 7829 -6739 3542
2101 3542 -2416 -3641 14260 -16865 6091 6183 -9961 9739 -9266 3841 7630 -13278 6950
2114 6950 1616 -2255 835 -3537 4308 -169 -969 -5238 9164 -2570 -6326 8338 -6463 5474
2128 5474 -729 -10543 17070 -9685 -2050 7755 -9104 10398 -7344 -2641 10002 -6274 -746
2141 -746 2193 0 1088 -2791 -112 1342 4703 -10226 6321 3184 -8004 8172 -8385 5020
2155 5020 5373 -14163 11731 -1559 -5050 7640 -9289 8313 -768 -6521 5072 1010 -2376
2168 -2376 -263 966 -324 2457 -2802 -2981 9737 -8499 375 6136 -8740 10144 -7724 -725
2182 -725 10572 -11213 3907 2351 -5341 7311 -7467 1890 4314 -4511 -759 2742 -828 -1108
2196 -1108 2449 -4557 5128 -19 -7116 8923 -3458 -3060 7330 -9947 9109 -2305 -6702 9708
2210 9708 -5362 -244 3533 -5466 5374 -847 -4115 4234 -23 -3328 2342 549 -3040 5954
2224 5954 -6909 2747 4669 -8616 6047 -374 -4800 8249 -8298 3605 3883 -7854 6002
2237 6002 -1286 -2579 4064 -3232 -180 4670 -5102 1071 2892 -3861 1826 1876 -5608 7583 -4439
2252 -4439 -1951 7345 -7359 3210 2099 -6232 7053 -3370 -2617 6794 -6151 2437 1812 -3975
2266 -3975 2980 563 -4556 5628 -2243 -2534 4924 -4049 384 3966 -6679 5115 470 -5720
2280 -5720 7619 -5123 96 4368 -5939 3294 1905 -5889 6303 -2865 -1634 4374 -3761 367
2294 367 3943 -5723 3316 1348 -5099 5988 -2662 -1885 5315 -5046 996 4208 -7024 5905
2308 5905 -1415 -3351 5340 -3425 -919 4918 -6143 3050 1706 -5019 4880 -2006 -2665 4985 -3748
2323 -3748 -410 4862 -6354 4062 263 -4165 4983 -1954 -2755 5986 -5495 1847 2952 -5460
2337 -5460 4385 -513 -3712 5419 -3291 -1523 5038 -6114 3035 1398 -4337 4069 -698 -4051 6321
2352 6321 -4887 608 3749 -5347 3407 974 -4787 5248 -2341 -2561 5585 -5360 1992 2234 -4655
2367 -4655 3405 416 -4663 5874 -3777 -504 4231 -4980 1820 2727 -5527 5099 -1168 -3323 6132
2382 6132 -4464 695 3299 -4976 2688 1414 -5017 5684 -3155 -1231 3750 -3838 491 3492
2396 3492 -5589 3718 493 -4460 5720 -3411 -996 4861 -5244 2071 2933 -6341 5836 -2520
2410 -2520 -1449 4647 -3651 240 3438 -4909 2901 839 -3437 4128 -1398 -2954 5117 -3727 -316
2425 -316 4907 -6557 5022 -607 -4257 6113 -3558 -1645 5179 -5852 3740 308 -3755 4505
2439 4505 -1318 -2171 3488 -1973 -975 3535 -4398 2293 2037 -5367 4063 390 -4729 6921 -6088
2454 -6088 2420 3370 -6954 5248 -642 -3407 4640 -3926 1298 2698 -4418 2251 1408 -2632 579
2469 579 1656 -3708 5006 -3202 -1887 6167 -5738 956 3446 -6313 7196 -4454 -1355 6882
2483 6882 -6787 2778 816 -2664 3315 -2419 -1003 3775 -2237 -1660 2445 -155 -2202 3724 -5247
2498 -5247 4055 918 -7005 8198 -3609 -1547 5014 -7069 6554 -918 -6004 7543 -4132
2511 -4132 811 431 -1804 2365 -240 -2827 1687 3039 -4198 1099 1965 -3443 5320 -5391 555
2526 555 7258 -9889 6100 -956 -2489 5704 -7455 3747 3529 -6847 4387 -1604 1263 57
2540 57 -1926 746 2283 -1127 -4030 6098 -3101 -995 2930 -5287 7193 -3155 -5397 10297
2554 10297 -7748 3119 -90 -3901 7740 -6147 -771 5082 -2961 567 -1176 1149 1021 -639
2568 -639 -2124 1598 4273 -7703 5371 -823 -1714 4877 -8135 6478 2047 -8713 8279 -4594
2582 -4594 1955 1486 -6612 7367 -1859 -2719 1707 688 275 -1431 166 -83 3075 -3147 -2726 8001
2598 8001 -7265 2831 264 -3563 8501 -9001 1584 5914 -7246 4726 -2792 141 4548
2611 4548 -6844 2982 1422 -486 -2197 1701 760 -763 829 -4139 5229 193 -6604 7581 -4390
2626 -4390 1533 1828 -7406 9669 -5006 -2625 5543 -4237 3298 -2086 -2579 5455 -3108 -1047 444
2641 444 2394 -2583 532 272 -1126 4431 -7123 3090 3851 -7061 5365 -2996 132 5273 -9331
2656 -9331 6593 156 -3601 3243 -2887 2410 683 -3550 2097 1629 -1743 -1783 3048 -1928 786
2671 786 579 -4216 7537 -5531 -957 5332 -5665 4064 -1913 -2847 7394 -6513 1292 2318
2685 2318 -2549 2135 -1741 260 1688 -682 -2417 2784 -79 -2860 2904 -2221 795 3250 -6826
2700 -6826 6651 -1737 -3153 5364 -4873 3469 650 -5012 5432 -1822 -1638 2671 -2140 1393
2714 1393 75 -1392 550 2666 -3915 1589 1653 -3104 3386 -2473 -1331 5348 -6427 2855 1490
2729 1490 -4266 5089 -3991 354 2923 -4279 1605 1360 -2798 2283 -1047 -719 1927 -931 -2034
2744 -2034 4187 -2937 -180 2892 -4146 4053 -1024 -2999 4885 -3592 -7 3519 -4794 3869 -1183
2759 -1183 -2027 3511 -1675 -1134 2818 -2405 308 1547 -2563 2012 1047 -3186 3487 -983 -1991 4298
2775 4298 -4349 2079 1540 -3857 3595 -799 -2573 3937 -3335 1187 1829 -3227 2006 708 -2616
2790 -2616 2631 -761 -1667 3300 -3357 609 2313 -3305 1946 1063 -3574 4150 -2512 -675 3037
2805 3037 -3185 1261 1580 -3305 3042 -1044 -1772 3406 -2857 197 2085 -2733 1471 1449 -3450 3292
2821 3292 -1317 -1312 3166 -2584 254 2633 -3746 2660 48 -2702 3843 -2109 -223 2550 -3066 855
2837 855 1725 -3979 3407 -1017 -1681 2920 -1696 -642 3131 -3817 1939 843 -2990 3411 -1234 -1566
2853 -1566 2899 -2685 533 2543 -3805 2557 -472 -2123 2940 -1524 -1199 3549 -3636 1461 1215
2868 1215 -2963 2624 -154 -2155 3372 -1854 -549 2953 -3682 1833 456 -2824 2756 -950 -1932
2883 -1932 3503 -3271 1043 1609 -3076 2086 335 -2438 3145 -1309 -1156 2934 -3042 1083 1457 -3064
2899 -3064 2243 -85 -2877 3936 -2915 243 2401 -3160 1685 1112 -2529 2819 -1158 -1152 2849 -2298
2915 -2298 285 1891 -2581 1336 994 -3510 3597 -1997 -1343 3237 -2844 722 2304 -3955 3427
2930 3427 -1137 -1890 3095 -2563 389 1569 -2184 1217 909 -2586 2297 -343 -1620 2395 -1244
2945 -1244 -796 3133 -4229 2523 1075 -3326 3456 -2011 -418 2928 -3974 1795 1083 -2962 2644
2960 2644 -1221 -331 1272 -1085 -724 2382 -2324 7 1809 -2539 1942 116 -2828 4676 -3228
2975 -3228 -300 3762 -4093 3496 -1257 -1590 3436 -2689 -140 2290 -2169 1144 -348 -539 1183
2990 1183 632 -2985 2399 183 -2701 3439 -2974 1389 2023 -4768 4361 -591 -2849 4133 -4332
3005 -4332 2900 -50 -3126 2754 -490 -1520 1047 -478 62 324 -1022 -685 2750 -2977 5 2746
3021 2746 -4193 4197 -2737 -282 4176 -5202 1859 1505 -3128 3973 -3640 1318 2005 -2823 957
3036 957 826 110 -805 723 -759 1497 54 -3127 4011 -1300 -2436 3931 -4609 4121 -1359 -3414
3052 -3414 5751 -3780 35 1434 -2696 3353 -2448 -890 2576 -1030 -696 -216 1884 -1926 1609
3067 1609 -2109 606 2986 -5434 2788 1168 -3471 4296 -4892 2977 2141 -5671 4597 -1559 -81
3082 -81 1170 -2391 2509 156 -1979 626 1333 -155 -2002 2607 -2084 2510 -1702 -2287 5761 -4654
3098 -4654 1113 1623 -3265 4766 -4126 -99 4628 -4790 2533 -1265 71 1182 -2177 309 1141
3113 1141 -191 -2191 1585 753 -2314 2502 -3031 2838 1043 -5571 5680 -2683 74 1966 -4246
3128 -4246 4961 -1369 -3171 3993 -2372 1200 -761 -318 1565 -452 -968 -233 2639 -2922 716 774
3144 774 -2026 3068 -3875 478 4120 -5567 3935 -1574 -795 2882 -4507 2928 1192 -2597 1676
3159 1676 -579 702 69 -878 58 785 -249 -2664 3715 -2321 363 1138 -2824 4177 -2251 -1971
3175 -1971 4679 -4008 1821 0 -2260 4097 -3069 -44 1547 -996 -160 65 -236 545 230 -1708
3191 -1708 1014 1772 -3801 3018 -1261 -365 2645 -4380 3471 29 -2987 3372 -2226 575 1326 -3118
3207 -3118 2906 -833 -972 741 415 -598 711 -511 -478 1886 -1895 36 2642 -3229 2266 -280
3223 -280 -2108 4063 -3828 1217 1442 -2748 2160 -740 -821 2474 -2164 466 1069 -754 -438 1156
3239 1156 -1419 845 619 -2482 2854 -1302 -1108 2580 -2310 930 1024 -3015 3732 -1828 -269 2127
3255 2127 -1745 629 642 -1763 1291 -173 -1444 1649 -673 -837 1474 -1328 21 2000 -2942 2350
3271 2350 91 -1907 2288 -1495 -32 2217 -2803 1932 95 -1886 2101 -1073 -326 1510 -1282
3286 -1282 21 1567 -2005 1104 412 -1355 1676 -383 -1454 2688 -2390 543 1248 -2270 2064
3301 2064 -359 -1678 2297 -1668 -302 1787 -2365 1330 168 -1480 1418 -335 -1307 2190 -1647
3316 -1647 234 1416 -1996 1263 822 -2001 2081 -978 -936 2228 -2156 567 919 -1974 1550 -239
3332 -239 -1716 2368 -1750 5 1554 -1839 617 777 -2034 1968 -397 -1225 2066 -1681 191 1499
3348 1499 -1972 947 561 -2093 2670 -1245 -369 1715 -1542 296 1250 -2458 1408 -282 -1152 2060
3364 2060 -1208 -331 1652 -1554 584 1130 -2192 2064 -704 -816 1662 -1284 -239 1313 -2100 1541
3380 1541 34 -1329 1823 -1078 -515 1673 -1415 375 1296 -2164 1642 -395 -1245 1530 -778 -975
3396 -975 2254 -2247 1042 756 -1875 1925 -258 -1283 2050 -1460 -212 1490 -1815 1198 -13
3411 -13 -1405 1365 -341 -1230 2263 -1466 253 948 -2010 1262 311 -2058 2248 -1192 -404 1720
3427 1720 -2244 1311 106 -1588 1416 -372 -1120 1595 -1370 136 850 -1178 262 1246 -1795 1736
3443 1736 -715 -1082 2056 -1950 637 1314 -2466 1572 -47 -1155 1985 -1971 276 831 -1340 443
3459 443 817 -1251 921 -120 -1002 1484 -915 -1015 2105 -1810 598 964 -2329 2709 -1392 -800
3475 -800 2035 -2019 844 753 -1570 2218 -975 -430 878 -356 -589 772 -310 -40 1366 -2062
3491 -2062 1253 596 -1997 2135 -1139 -762 2257 -3414 2434 -74 -2216 2005 -1259 381 952 -1483
3507 -1483 1288 243 -936 112 560 -681 73 335 -1567 2507 -2151 -166 2302 -2787 1605 -186
3523 -186 -1425 2964 -3083 723 1302 -1924 1382 -1226 279 748 -967 -250 1135 -154 -989 989
3539 989 -454 -67 1496 -2686 2784 -428 -1955 2704 -2435 1671 419 -2311 3060 -1358 -769 1214
3555 1214 -1344 1341 -794 17 505 494 -1177 260 1501 -1668 874 -303 -859 2807 -3226 1442
3571 1442 1204 -2771 3014 -2189 934 1407 -2643 1648 206 -907 637 -1089 985 -358 25 -775
3587 -775 1553 -407 -1517 2079 -1434 1227 -161 -1969 3295 -2100 -402 2029 -2646 2660 -1990
3602 -1990 -360 1975 -1963 520 247 -55 212 -574 268 138 1068 -2185 1056 1173 -2299 2437 -2222
3619 -2222 1295 1122 -3085 3073 -861 -1055 2003 -2296 2258 -745 -1358 1917 -346 -71 -498 586
3635 586 -238 -31 -498 -349 2106 -1573 -447 1771 -2501 2405 -2008 -188 2368 -3131 1574 170
3651 170 -1049 1483 -1903 842 681 -1389 587 320 412 -1112 655 -860 664 -9 -1916 2456
3667 2456 -892 -900 1958 -2370 2226 -777 -1682 3163 -2389 501 384 -1004 1291 -639 -484 1136
3683 1136 -43 -479 -116 827 -755 1108 -1178 238 1567 -2545 1710 -451 -1101 1766 -2349 1167
3699 1167 1060 -2345 2136 -898 259 479 -971 823 184 -831 143 821 -724 -132 606 -1080 1610
3716 1610 -698 -958 2212 -2334 1226 254 -1169 2063 -1559 -176 1755 -1945 1146 -103 -316 617
3732 617 -653 -246 911 -155 -807 1230 -512 -103 925 -1353 1131 448 -1807 2094 -1540 224
3748 224 909 -1574 1440 -339 -1057 1477 -787 158 479 -704 463 383 -764 102 746 -1491 1183
3765 1183 -488 -593 1319 -1444 481 971 -1865 1454 -634 -413 1291 -1569 517 856 -924 746
3781 746 150 -820 910 -368 -357 773 -613 -281 1119 -1679 675 371 -1170 1504 -980 -454 1183
3798 1183 -1317 612 615 -1444 1523 -424 -443 621 -588 -75 963 -1115 681 210 -1145 1164 -279
3815 -279 -729 1035 -709 -110 1150 -1297 1053 -9 -982 910 -685 -301 1287 -1246 558 277
3831 277 -945 863 -197 -574 1267 -1010 -154 873 -1086 733 487 -951 1020 -270 -753 1175
3847 1175 -1112 420 762 -929 654 194 -974 993 -395 -205 992 -1210 394 686 -1126 652
3863 652 57 -710 1110 -881 211 707 -1037 544 674 -1387 1163 -604 -706 1112 -1108 377
3879 377 659 -974 485 203 -1084 1173 -700 -125 712 -1005 -28 773 -1253 803 -329 -607 1245
3896 1245 -591 -32 562 -1042 500 401 -1037 1108 -689 -320 617 -756 -110 612 -1207 698 42
3913 42 -971 1071 -284 -676 1101 -1073 414 769 -1305 994 -341 -478 985 -781 102 963 -1064
3930 -1064 690 239 -594 761 7 -665 897 -654 -158 761 -1224 717 17 -912 810 -547 -440
3947 -440 1201 -1564 690 399 -649 807 -298 -341 840 -455 -43 789 -652 72 524 -769 907
3964 907 230 -1279 1670 -1083 21 742 -1338 894 151 -1031 1601 -953 196 563 -665 764
3980 764 -18 -334 355 416 -652 743 11 -314 793 -1059 143 1008 -1661 1233 -448 -585 1145
3997 1145 -1298 573 203 -1310 842 -166 -315 453 -561 9 351 -11 -456 1180 -843 42 286
4014 286 -812 1246 -414 -615 1784 -1426 799 299 -1208 1649 -1010 126 719 -694 366 15
4030 15 -13 383 -324 -139 275 537 -1354 1245 -573 -351 1063 -1719 1315 139 -1450 1506 -1056
4047 -1056 351 427 -1291 1429 -675 -359 36 -318 154 -175 205 -77 655 -547 -219 1328 -1442 551
4065 551 129 -928 1751 -2107 565 866 -1654 1349 -438 -174 912 -1553 959 183 -474 -34 237
4082 237 131 -25 360 -896 1211 -302 -1090 1679 -947 151 676 -1549 2192 -1329 -353 1424 -1183
4099 -1183 911 -563 -441 1025 -776 -175 269 372 -193 150 262 -341 1162 -1442 761 565 -1482
4116 -1482 1239 -723 -15 1072 -2125 1464 -181 -844 861 -980 682 -288 -659 628 276 -133
4132 -133 -297 449 -261 -366 326 -1086 1390 -1196 -114 1334 -1451 1020 -666 -522 1525 -1538 567
4149 567 554 -741 822 -769 466 160 -440 -410 370 169 -612 660 -151 27 624 -1588 1516 -503
4167 -503 -994 1351 -1340 1157 -156 -934 1378 -516 -190 90 -637 755 -536 198 125 384 -427 -44
4185 -44 714 -1009 793 -439 -306 1123 -1499 611 366 -1198 1546 -934 497 338 -931 732
4201 732 -31 -210 392 -362 117 92 -288 -349 647 -332 -420 728 -1011 901 -267 -754 1423 -823 -262
4220 -262 732 -995 1007 -616 -159 778 -760 217 32 -76 6 450 -380 655 295 -631 567 134
4238 134 -970 949 -1072 531 339 -984 991 -591 -187 750 -879 444 207 -485 888 -122
4254 -122 -118 -95 -46 -316 945 -727 74 554 -711 346 281 -828 888 -638 -135 564 -1229 538 -28
4273 -28 -602 540 -331 -409 813 -668 396 222 -372 15 191 -611 463 -273 -451 731 -813 287
4291 287 272 -653 618 -159 -765 951 -619 -56 520 -472 347 -14 -460 636 -175 -318 343 -269 -261 609
4311 609 -457 281 625 -554 909 -386 45 404 -418 311 422 -524 816 -251 -320 596 -389 3
4329 3 458 -526 320 353 -654 687 -59 -41 584 -294 -143 453 -815 476 210 -258 456 -597 -171 704
4349 704 -345 266 540 -669 493 -226 -502 474 -267 -401 637 -577 705 37 -640 470 -163 -604
4367 -604 684 -669 56 528 -545 530 -138 -542 606 -260 -476 709 -773 409 300 -422 310
4384 310 124 -459 557 -340 -29 662 -446 46 11 -701 471 -22 -412 708 -915 74 418 -405 325
4403 325 311 -501 654 -340 -55 467 -392 166 535 -693 437 5 -585 672 -690 -22 350 -570 156
4422 156 447 -655 577 -287 -228 461 -240 91 294 -563 275 268 -672 475 -80 -277 376 -350 -68 497
4442 497 -523 608 -150 -166 729 -509 16 252 -697 321 174 -573 380 -168 -283 492 -225 -336 663
4461 663 -623 467 342 -593 752 -271 -348 765 -670 383 140 -614 686 -202 -287 417 -183 -133
4479 -133 85 -437 -91 250 -221 243 252 -834 700 -435 -11 850 -894 609 -14 -509 456 -709 -37
4498 -37 476 -505 259 150 -185 -165 226 -266 245 -17 -219 468 -164 -126 690 -781 478 177 -534 982
4518 982 -666 172 80 -323 324 -304 -68 666 -488 71 121 195 73 175 -211 -235 593 -772 505 123
4538 123 -561 750 -561 184 221 -926 1140 -307 -35 209 -430 331 73 -212 208 95 -234 195 422
4557 422 -435 391 -280 -601 899 -1109 568 123 -736 889 -470 161 597 -1080 653 -167 -164 534
4575 534 -680 234 286 89 -520 384 -111 -377 481 -604 339 323 -1019 947 -467 176 413 -1046 975
4594 975 -80 -237 702 -628 189 36 -48 504 -441 214 -353 448 -459 23 256 -303 535 -473 239
4613 239 767 -1007 735 -153 -277 774 -1047 774 -10 -379 422 -53 277 -461 -95 172 -6 2 -653
4632 -653 848 -493 -58 506 -726 889 -298 -459 893 -976 504 179 -337 1130 -928 443
4648 443 172 46 151 -291 50 -241 -79 65 -43 251 -855 633 29 -99 874 -664 805 -272
4666 -272 -586 692 -721 192 302 -771 625 -281 -26 6 33 -43 -105 159 -169 116 -440 6 413 -550
4686 -550 288 53 -641 988 -900 466 -74 -521 656 -143 163 468 -527 392 295 -44 -245 340 319
4705 319 -249 503 -356 519 -234 -297 480 -435 166 -25 -645 629 -419 95 513 -340 501 -185 -37 160
4725 160 -169 -314 461 -8 -167 275 -87 -158 399 -511 280 258 -447 571 -529 188 267 -838 455 62
4745 62 -418 498 -273 320 -55 -58 -24 195 -230 185 344 -395 307 58 -577 494 -232 146 409 -522 467
4766 467 -231 -186 474 -514 -102 200 -304 357 124 -192 93 127 -248 392 23 -211 273 -108 272 -99 -591
4787 -591 443 -3 -241 457 -493 290 242 -384 333 -7 28 400 -106 172 338 40 235 36 -43 10 12 -661
4809 -661 372 -483 78 192 -374 134 97 -621 379 -542 184 407 -347 173 108 -172 80 -26 -341 273
4829 273 -30 -132 250 -84 -73 191 -351 574 -251 -159 483 -99 -94 339 -172 169 55 -338 165 -313 42
4850 42 191 -145 110 184 -346 88 -132 -352 340 -345 -30 311 -162 158 65 -200 334 37 40 74 -300 -88
4872 -88 403 -373 187 54 -335 88 -150 -247 369 -359 -26 309 -137 400 -11 -206 -64 -291 -186 315 -491
4893 -491 440 202 -167 595 -63 -46 296 -395 102 128 -231 -6 47 -147 114 -103 -270 359 -318 -28 147
4914 147 -352 197 -310 -370 248 -283 74 183 -325 97 182 -100 -26 134 -125 212 -280 -130 339 -130 106
4935 106 177 -393 372 -231 -227 410 -169 -81 136 -98 183 -114 -503 451 -256 -207 138 -360 -305 216 -140 -43
4957 -43 -94 -276 294 -164 -163 267 -257 436 67 -474 87 -348 254 204 -182 84 238 -498 71 -68 -150 37
4979 37 -2 -38 77 -138 31 263 -279 292 -49 -98 377 -253 143 221 -503 198 -111 79 277 -158 -7 -107
5001 -107 -123 -185 165 -115 7 158 -377 318 -71 -42 281 -465 356 96 -305 169 -126 -137 340 -265 451
5022 451 -90 -70 301 49 -184 -91 241 -197 187 -142 46 129 -521 113 335 -367 401 -308 -178 415 -251
5043 -251 454 -64 -77 64 -64 45 -15 -139 68 102 97 -314 209 -341 117 19 -436 685 -250 287 352 -540
5065 -540 478 13 -225 525 -401 107 -157 156 58 -34 -91 67 192 -216 136 286 -280 486 -180 160 187
5086 187 -484 388 -8 -129 259 -505 155 -11 -158 576 -405 68 -135 17 -82 57 -58 -138 448 -381 -222
5107 -222 336 -335 309 -177 -136 167 -433 129 -47 -96 555 -169 136 107 -352 145 -102 -97 34 65 214 84
5129 84 28 -111 688 -395 -183 316 -252 220 23 -316 476 -242 -34 -31 -264 353 -189 -242 -30 -135 57
5150 57 -19 65 -218 -25 -77 -200 239 -483 205 136 -151 181 -378 326 209 -172 368 -123 109 88 -433 218
5172 218 -48 -49 -224 128 14 -225 133 -81 186 161 -306 396 -381 192 101 -404 310 -613 -65 144 -253
5193 -253 94 168 -34 216 -269 178 103 61 -69 225 -49 -3 -40 -258 -238 267 -87 461 -474 21 311 -537
5215 -537 381 -223 -99 -34 -369 282 141 31 228 10 -251 -184 152 -199 198 144 -317 326 -525 138 280
5236 280 -301 417 140 -363 535 -322 91 -54 -187 85 -227 43 118 -208 16 -105 -99 -7 372 -243 -50
5257 -50 337 -137 148 -162 52 179 -136 206 201 11 210 -545 76 126 -13 -71 133 79 -152 214 -134 316
5279 316 89 -356 104 -59 -76 262 -154 37 9 1 106 -309 -52 254 -336 8 -31 -186 -64 -84 -48 148
5301 148 64 -87 98 -110 -11 -88 -268 178 99 -272 248 -13 39 -74 -166 321 -54 -288 25 14 -168 225
5323 225 -300 65 47 22 67 65 -208 -39 36 180 220 -351 -79 -160 30 316 -122 160 219 -297 238 143 -155
5346 -155 -86 -3 -400 266 -196 -80 226 62 90 -151 -101 46 142 -62 293 -70 -150 25 -67 7 183 -128 156
5369 156 86 -21 -21 102 -122 -93 -216 -108 -46 -234 -96 -123 3 38 48 45 275 -192 -27 -75 -175 192 -28 -216
5393 -216 254 -191 1 -23 -146 -154 -263 -130 99 -19 -34 305 -607 135 63 -201 147 271 -187 252 -393 -115
5415 -115 151 -207 156 -160 -10 36 -214 -74 123 0 36 -30 -213 -68 190 -255 132 -269 281 207 -275
5436 -275 -103 2 -73 145 41 170 -42 55 -134 -73 -64 -7 -24 161 331 -216 164 9 -191 63 -127 -188 -27
5459 -27 -315 -15 52 67 66 106 -9 125 211 16 13 214 25 -91 140 6 -47 18 43 85 -115 86 66 -36 18
5484 18 -10 38 161 -267 98 -348 -137 0 -165 -164 79 -158 49 -25 149 -179 71 25 -86 -36 -145 470 -374
5507 -374 33 227 -191 232 74 -147 15 -223 105 156 -150 235 -249 -72 -78 -133 -35 19 -87 -124 175 54
5529 54 52 17 7 157 -83 -16 237 -22 189 45 -217 273 -336 35 6 -154 15 146 -42 -50 -110 -2 -68 229
5553 229 -286 57 -25 249 35 -335 298 -246 -128 284 -158 -114 185 -68 327 -82 -154 -363 35 -40 -60 -98
5575 -98 -268 245 -6 239 149 -110 243 32 -374 231 -371 40 121 -217 422 -230 -20 123 184 196 -80 175
5597 175 -156 79 -27 -172 -160 -13 277 156 -278 371 58 -63 -302 -56 175 -227 98 190 -270 108 -150
5618 -150 91 -16 -136 -55 20 74 10 286 -18 -118 160 -237 42 33 -338 302 -411 21 104 -175 153 -159
5640 -159 -134 50 -217 43 96 21 -70 46 -203 78 372 -121 -17 152 -236 213 -361 139 47 -124 299 -168
5662 -168 -65 193 -126 188 -369 -238 -85 8 100 -205 -54 77 246 261 -92 205 -206 33 276 -165 270
5683 270 -323 196 -116 105 249 107 53 8 -252 29 -124 333 165 51 -11 26 30 -112 199 144 48 97 -310
5706 -310 -274 -6 -212 -86 -3 69 76 -136 -204 28 -199 -25 132 -12 -29 104 -116 72 -42 -37 189 38 162
5729 162 14 -80 -79 -122 14 275 -73 129 23 5 281 -227 -137 50 -19 -227 -117 71 176 -43 70 -10 247
5752 247 -27 70 -111 -69 -46 -105 -205 -62 117 -68 -312 182 31 67 283 -83 60 -217 3 -192 -31 -138
5774 -138 100 -136 -145 -48 -38 -72 136 130 -72 170 47 -86 -295 -143 -183 -41 -244 88 81 315 -332 20 -82
5797 -82 114 -15 102 269 -52 -100 99 -76 236 350 70 57 -124 83 -143 125 -31 88 -49 -17 104
5818 104 -19 -8 -179 -26 -47 -109 -75 108 -113 192 -112 104 420 103 105 73 -10 191 112 343 188 140 82 33
5842 33 -111 0 -137 -347 129 -293 120 -86 38 0 160 24 50 216 -279 252 65 -200 71 -5 -96 -74
5864 -74 -40 89 -187 -31 -61 -308 -14 31 9 62 -123 127 55 -118 -10 395 -91 101 -104 -142 -71 -84 91
5887 91 -154 26 -18 -78 -2 -111 -194 -132 -55 -14 -49 -21 97 -154 -81 -158 -80 -148 -169 222 -120 -51 256 105 -236
5912 -236 103 16 -16 -8 27 -73 -132 12 210 -151 141 92 -21 209 -94 -59 400 -58 88 -109 -76 128 0
5935 0 -69 322 -145 77 168 -75 231 -34 68 11 -217 -95 122 -140 345 143 -15 10 -13 42 141 -83 -54
5958 -54 82 170 51 -84 -81 56 26 217 254 -225 88 -29 440 17 5 174 99 -378 -145 187 140 180 160 -118
5982 -118 -50 182 -428 129 -127 -104 159 202 245 -213 148 -153 -140 47 20 121 31 156 -16 170 140 -40 79
6005 79 -229 -84 263 -77 48 154 -83 -141 10 157 201 -134 -13 -37 88 63 -169 -41 43 29 0 208 -53
6028 -53 59 -72 -170 -13 -107 112 75 -113 -73 90 200 -35 -148 -46 35 101 -32 5 149 -37 354 -137 4
6051 4 41 85 143 -95 -115 -8 -51 -86 -1 -43 225 -54 5 30 62 300 107 92 -81 57 -144 -180 -131 283 213 1
6077 1 -247 118 -175 -14 -129 -137 34 109 -83 -106 222 -40 120 66 7 -3 -55 166 -143 -155 196 93 47 163
6101 163 -22 213 128 -136 212 -87 -37 -16 -86 49 -196 40 192 -257 -10 -34 -96 68 116 -21 14 220 -67
6124 -67 166 -147 47 168 -89 -389 -11 -111 344 106 -46 94 -186 213 57 -36 -130 -131 15 42 -94 -182
6146 -182 96 -57 -63 22 48 -51 79 -264 326 102 148 133 -165 -326 -240 -165 -21 -64 206 -257 232 177 -85 100
6170 100 105 256 -189 -76 -113 -44 194 -42 6 165 -122 331 -172 32 95 -218 81 -61 -120 -83 -82 -92 -15 94
6194 94 62 -210 -163 6 237 4 29 61 -209 192 -19 121 -93 20 163 -86 -53 -42 -31 -76 -38 120 -204
6217 -204 36 134 60 -35 -118 -38 -128 -50 39 -192 -34 102 -59 53 -128 98 31 -116 -81 291 31 97 -46 47
6241 47 62 8 66 -269 20 -213 25 78 79 -83 149 -144 -217 -12 63 73 77 62 -123 -13 108 114 202 13 -319
6266 -319 -15 -99 -64 -74 -84 -307 29 2 67 202 -147 35 152 -117 95 -173 146 -119 -95 14 -166 154
6288 154 268 4 173 18 90 30 67 -51 15 -19 99 159 -10 138 59 232 10 -97 -113 -30 -61 -167 30
6311 30 -49 14 68 55 -28 181 109 227 193 -338 -15 -140 -106 -73 81 -27 -61 144 168 -19 -211 128 18 -144
6335 -144 -84 153 -257 203 -29 294 16 -1 -273 46 71 -193 -19 49 6 -19 -71 80 140 -292 -68 193 131
6358 131 81 51 -34 -18 157 -32 -257 97 55 144 -219 -272 125 -63 288 136 -1 -159 60 126 -63 -275 -277
6381 -277 -114 -215 83 58 96 -116 286 -3 -106 -244 101 81 -236 12 161 -213 55 -74 -55 -74 134 -64
6403 -64 109 -51 289 -75 203 -91 -145 -139 271 -92 -24 -52 70 77 8 -102 94 -10 275 -281 -313 -102 -127 -169
6427 -169 -248 -46 -168 68 -137 -265 95 -184 113 76 -64 22 211 -10 -69 72 120 -49 -102 -44 -2 -12 53
6450 53 -234 -72 -36 225 255 139 -78 14 228 -38 79 -97 89 -67 9 -22 168 -1 39 76 5 96 88 -25
6474 -25 -16 342 -84 53 -3 147 93 -109 45 21 125 133 302 -83 75 -70 99 234 -59 74 -207 43 -32
6497 -32 9 193 55 -19 -43 119 202 210 105 42 -212 62 -149 -168 -45 -90 158 43 63 -59 73 182 -254 148
6521 148 204 111 70 215 244 0 -56 16 71 222 -132 -148 7 -156 143 -85 4 -147 171 -62 -44 -96 240 89
6545 89 -134 -213 -46 -55 -17 -19 2 -80 -80 -111 165 73 60 -54 -58 -2 70 3 31 51 -163 -151 -9 -143 126 22 -193
6572 -193 49 -17 -38 113 -141 183 101 -51 223 -80 168 -104 141 183 -5 92 69 70 -31 -71 5 -91 -33 -48
6596 -48 -85 46 -33 -81 -146 -136 -107 -218 254 -83 28 -30 -17 122 131 144 28 -146 136 -188 194 109 25 -94 35
6621 35 22 68 106 98 -97 -101 93 8 12 86 165 90 -110 -353 -100 -43 126 36 -124 84 226 -78 -35 376 -26 -157
6647 -157 -48 41 38 -90 62 -170 0 -217 40 7 47 7 45 80 -89 132 -201 -1 45 -129 -104 58 185
6670 185 347 -75 -176 -55 -109 382 131 216 117 128 -63 -42 45 -97 127 57 -15 14 148 302 -114 26 8
6693 8 138 72 19 135 88 277 76 153 -156 179 47 -31 -161 -31 -97 -21 -2 -89 24 54 -135 95 106 -224
6717 -224 -170 34 -224 165 -242 -158 24 57 181 239 4 -36 292 220 -106 91 342 -119 -84 59 67 -57 -111
6740 -111 21 -62 -54 -123 179 -211 64 -32 144 35 -125 -68 76 -163 164 -150 110 116 149 88 138 -13 -62 71
6764 71 228 70 28 -60 62 -106 127 65 -54 120 58 135 -29 -16 -18 136 84 -125 66 -172 151 217 -97 -69
6788 -69 218 -50 -72 80 -71 -13 86 -140 44 27 -165 -175 54 -216 -41 -124 -60 -18 -47 192 114 -49 -135 96
6812 96 -78 142 -57 -30 241 8 110 -59 32 -190 -103 9 253 -54 45 -33 109 -228 -45 -28 -132 109
6834 109 -135 29 149 173 190 71 65 -111 232 -26 40 111 17 201 -78 -139 63 -91 -117 187 18 -32 -204
6857 -204 -97 -76 -133 92 -58 -193 -100 248 -38 -8 171 195 66 -110 -32 -6 182 -18 136 269 88 124 -86
6880 -86 -232 -83 -134 -99 20 -282 -63 65 93 47 59 15 172 -26 39 -93 -158 172 -55 -76 -46 173 95 45
6904 45 -34 42 298 28 -72 124 -17 -22 -43 242 -46 45 0 112 -91 -54 117 -167 122 20 55 -57 60
6927 60 -32 -54 174 69 -96 -86 221 -6 -55 9 154 5 102 -450 -53 200 25 -60 -67 64 -28 221 -116 -121
6951 -121 3 -110 -114 -101 -210 131 6 38 -32 202 -112 225 -128 51 47 186 31 50 -183 172 -109 203 -196
6974 -196 -119 -163 116 -162 32 -45 100 160 -145 -162 -128 -147 -75 -41 235 -40 159 -52 -129 59 4 -129 -30 -107
6998 -107 -102 -239 -103 -30 52 133 -268 -137 117 8 -146 -127 15 45 61 -28 6 -42 -16 22 -203 -203 -29 -167 -211
7023 -211 11 -200 68 181 178 4 -66 133 148 136 -48 26 57 -47 110 43 -109 -29 -183 299 218 -2 -81 60
7047 60 66 -82 96 44 -12 -38 -54 -131 57 20 -46 -6 -5 -77 -64 7 -98 22 -88 -151 45 290 4 -15 96 -54
7073 -54 -14 -68 -122 107 15 -2 -78 -44 -7 -131 45 137 194 235 72 -91 -161 45 -1 -108 -90 100 -34 -4 -57 -71
7099 -71 188 133 -8 -4 60 -19 66 -94 -94 200 140 -173 231 -12 90 27 -111 -139 -1 251 -151 -5 73 -30
7123 -30 67 84 -98 88 -153 74 141 -153 34 148 379 226 48 216 -407 -13 102 54 -115 130 -3 82
7145 82 -99 15 -9 34 -76 -24 20 -135 -20 -123 -71 -6 -58 191 16 -55 115 19 43 -104 181 -74 37 24
7169 24 121 54 -74 -101 154 7 20 2 12 -102 50 134 -236 241 8 20 131 74 -6 -93 50 -102 178 117
7193 117 -21 210 263 103 37 -76 -41 20 -127 -109 -108 -42 -160 127 31 33 14 26 167 39 -136 86 -71 149
7217 149 98 -8 -80 -62 157 171 129 30 3 105 6 -159 -51 -97 144 186 -76 61 103 -2 -11 469 75 157 45
7242 45 -29 177 63 86 9 -104 130 180 -92 129 85 -62 -219 29 -22 174 -15 80 49 -38 -2 -15 -48 37 -139
7267 -139 119 135 -8 90 51 -113 -24 287 163 -22 221 117 -104 -172 49 -209 15 138 21 43 -237 -157
7289 -157 -223 85 36 74 -23 -9 7 -65 -58 -269 -34 -123 -5 -144 47 136 -100 64 -27 -194 105 24 82 -10 -175
7314 -175 -79 208 -104 -31 164 -124 57 -156 -199 -10 130 95 -76 -83 130 -258 -198 356 154 37 67 -58 179
7337 179 72 39 -53 11 -118 -77 -67 133 -164 -140 30 36 56 64 -4 62 133 86 -71 84 -383 -128 14 -123 97
7362 97 -83 30 -142 43 53 67 -146 52 -14 1 -205 -222 -4 267 21 164 -88 240 70 51 122 -57 89
7385 89 -134 -55 266 229 242 -175 -9 -32 -189 -33 30 38 37 -73 95 -5 67 194 -91 48 -113 33 -54 -28
7409 -28 220 8 -113 73 110 119 22 224 -32 -42 37 8 49 -85 94 -215 -41 -100 77 155 42 -78 75 71
7433 71 -131 -10 -378 148 -4 68 -221 99 76 -189 24 -152 151 -133 40 -72 139 -148 2 96 -46
7454 -46 -182 130 198 0 139 371 13 52 -39 -119 -75 84 86 -129 -274 -212 -123 -102 19 -5 -170 177 177 -20 161
7479 161 60 -6 -103 -8 -46 21 -179 -7 85 102 -76 42 -178 -7 142 15 13 3 120 -184 -10 87 -183 44
7503 44 -254 77 -52 -128 -152 -23 -251 -87 39 5 -130 -22 -136 -236 97 24 -88 -76 -26 -25 -130 180 151
7526 151 22 252 -253 -99 110 -169 19 -46 149 -28 -1 -103 71 27 38 -61 -4 -23 145 164 -34 345 -192
7549 -192 -96 136 -59 39 -117 22 -61 175 -92 -191 -9 -179 39 -84 41 -377 -267 118 9 223 47
7570 47 -6 80 -7 156 76 -123 -30 185 51 -50 -35 50 -171 120 -222 1 212 -67 56 -126 111 14 71
7593 71 -179 -127 58 -243 126 20 -309 163 -232 -46 15 -31 -183 63 17 68 326 108 -57 124 126 -8 -99
7616 -99 -117 -152 26 142 210 132 -13 33 -92 -85 98 63 -19 -251 -284 -30 -11 54 -102 0 -140 11 -35 -75 55
7641 55 -92 5 -180 164 -6 -157 27 -95 -108 94 -114 206 72 -69 -121 -48 -83 -79 136 32 -96 0 62
7664 62 251 53 -62 126 -7 3 183 -142 -75 -226 67 -8 -7 79 -198 -173 -195 -96 120 -104 30 -11 34 145
7688 145 47 -28 -22 35 130 -11 -77 85 71 -126 67 73 -79 58 60 -271 -155 -59 -125 135 114 -213 -150 383 -174
7713 -174 101 -94 -260 -81 -56 -128 -52 -82 -149 -96 99 82 -232 -95 26 7 11 24 108 -14 193 178 -30 95
7737 95 -137 132 -89 240 -46 212 -81 -35 70 142 42 -137 78 98 -45 1 77 -46 -86 56 179 77
7759 77 -100 33 -30 -38 -113 73 24 222 -27 225 -36 76 -230 -159 107 -176 213 99 162 14 -23 -138 56
7782 56 -75 107 -16 124 -13 163 27 36 34 -40 119 -335 260 108 -237 4 58 -30 133 -127 -6 134 -131
7805 -131 284 -374 -210 -228 -75 -197 -125 -8 -10 174 -71 -10 -113 63 -31 154 153 -36 -80 72 -159 -53 54
7828 54 129 23 62 -12 -142 112 -312 86 -74 69 1 166 144 138 205 5 -212 -361 -152 12 56 -197 242
7851 242 -255 -250 -83 -92 -371 77 234 44 -49 44 172 105 63 -17 257 54 -151 -165 23 -202 -145 84 92 35 -55
7876 -55 -152 -125 -46 -8 -76 -1 -52 -117 10 98 -247 78 -105 -20 45 -97 191 86 -4 -103 142 219 172 -43 99
7901 99 147 -64 105 -59 -137 -34 -14 164 72 145 21 -19 29 -137 138 22 42 116 -54 171 -84 -169 217 100
7925 100 146 95 94 50 -98 138 -11 -55 115 -140 -158 -32 62 29 -64 156 -70 187 -108 16 -206 -93 78
7948 78 8 -157 39 -135 -26 -18 56 51 -320 -129 16 263 -9 -20 16 50 82 160 -11 -92 -95 -83 118 -61 -12 86
7974 86 154 133 21 -42 -192 -95 6 -194 -102 -50 47 -203 -62 -58 78 129 -216 8 35 139 -103 17 224 -204
7998 -204 -174 2 -166 142 -127 322 -48 -196 -61 114 -33 66 -22 7 -87 -149 -17 -286 76 127 -71 -33 -69
8021 -69 29 -1 -16 380 -27 104 42 126 -46 -55 60 -124 96 75 253 13 131 219 -2 -40 -86 -105 15 -140
8045 -140 137 83 -63 -111 -146 41 163 19 -16 12 -165 -53 -75 -34 2 -12 -169 -108 112 13 -65 -169 -79 154
8069 154 157 -64 212 -67 80 -265 64 -212 199 65 71 -107 53 -235 124 -88 70 -88 79 -233 59
8090 59 52 -60 261 -228 -20 25 212 150 -72 -29 10 18 72 110 -6 -117 -38 116 -24 94 83 -82 98 -23
8114 -23 -61 -183 182 147 -130 -12 -73 104 -146 -77 61 63 123 72 164 -66 -45 26 -21 -99 -64 46 254 -10 -184
8139 -184 -18 50 224 58 71 -99 -114 167 -74 -79 275 105 0 36 -136 121 -113 40 -111 -24 66 -105 132
8162 132 -8 66 -184 27 31 -67 231 39 124 13 -214 94 117 -186 28 -276 -151 -11 -127 199 96 39
8184 39 17 -117 -171 11 -43 -96 32
8191C2
##END NTUPLES=NMR FID
##END=
