##TITLE=1H_Pr EA-1
 
 8 sc, 
 24.10.2023
##JCAMPDX= 6.0         $$ Bruker NMR JCAMP-DX V2.0
##DATA TYPE= NMR FID
##DATA CLASS= NTUPLES
##ORIGIN= UXNMR, Bruker Analytische Messtechnik GmbH
##OWNER= root
$$ XWIN-NMR		Version 3.5
$$ Tue Oct 24 14:04:20 2023 Russian Standard Time (UT+4h)  she@DPX200
##.OBSERVE FREQUENCY= 200.13135
##.OBSERVE NUCLEUS= ^1H
##.DELAY= (6, 6)
##.ACQUISITION MODE= SIMULTANEOUS
##.ACQUISITION SCHEME= undefined
##.AVERAGES= 8
##.DIGITISER RES= 18
##SPECTROMETER/DATA SYSTEM= spect
##.PULSE SEQUENCE= zg30
##.SOLVENT NAME= D2O
##.SHIFT REFERENCE= (INTERNAL, D2O, 0, 15.7039)
##AUDIT TRAIL= $$ (NUMBER, WHEN, WHO, WHERE, WHAT)
$$ ##TITLE= Audit trail, XWIN-NMR		Version 3.5
$$ ##JCAMPDX= 5.01
$$ ##ORIGIN= Bruker BioSpin GmbH
$$ ##OWNER= she
$$ F:/spectra/data/she/nmr/H-F/1/audita.txt
$$ ##AUDIT TRAIL=  $$ (NUMBER, WHEN, WHO, WHERE, WHAT)
(   1,<2023-10-24 14:02:23.50 +0400>,<she>,<DPX200>,
      <created by zg, POWCHK disabled, PULCHK disabled
       configuration hash MD5:
       00 E9 B6 7A A2 85 ED C7 34 08 36 98 17 FE 4E 26
       data hash MD5: 16K
       10 F1 DA 25 FE 26 1C 17 53 25 D3 65 F9 72 49 F6>)
$$ ##END=
$$ 
$$ hash MD5
$$ 60 1B C0 6F 7C BB 5A FF BF 09 E3 41 58 52 22 D6
##$RELAX= 
##$RELAX= 
##$RELAX= 
##$RELAX= 
##$RELAX= 
##$RELAX= 
$$ Bruker specific parameters
$$ --------------------------
##$DU= <F:/spectra>
##$EXPNO= 1
##$NAME= <H-F>
##$PROCNO= 1
##$TYPE= <nmr>
##$USER= <she>
##$AMP= (0..31)
100 100 100 100 100 100 100 100 100 100 100 100 100 100 100 100 100 100 
100 100 100 100 100 100 100 100 100 100 100 100 100 100 
##$AQSEQ= 0
##$AQ_mod= 1
##$AUNM= <au_zg>
##$AUTOPOS= <>
##$BF1= 200.13
##$BF2= 200.13
##$BF3= 200.13
##$BF4= 200.13
##$BF5= 200.13
##$BF6= 200.13
##$BF7= 200.13
##$BF8= 200.13
##$BYTORDA= 1
##$CFDGTYP= 0
##$CFRGTYP= 5
##$CHEMSTR= <none>
##$CNST= (0..31)
1 1 145 1 1 1 1 1 1 1 1 1 1 1 1 1 1 1 1 1 1 1 1 1 1 1 1 1 1 1 1 1 
##$CPDPRG= <>
##$CPDPRG1= <>
##$CPDPRG2= <>
##$CPDPRG3= <>
##$CPDPRG4= <mlev>
##$CPDPRG5= <mlev>
##$CPDPRG6= <mlev>
##$CPDPRG7= <mlev>
##$CPDPRG8= <mlev>
##$CPDPRGB= <>
##$CPDPRGT= <>
##$D= (0..31)
0 1.2 0 0 0 0 0 0 0 0.06 0 0.03 0 0 0 0 0.0002 0 0 0 0 0 0 0 0 0 0 0 0 
0 0 0 
##$DATE= 1698141743
##$DBL= (0..7)
120 120 120 120 120 120 120 120 
##$DBP= (0..7)
150 150 150 150 150 150 150 150 
##$DBP07= 0
##$DBPNAM0= <>
##$DBPNAM1= <>
##$DBPNAM2= <>
##$DBPNAM3= <>
##$DBPNAM4= <>
##$DBPNAM5= <>
##$DBPNAM6= <>
##$DBPNAM7= <>
##$DBPOAL= (0..7)
0.5 0.5 0.5 0.5 0.5 0.5 0.5 0.5 
##$DBPOFFS= (0..7)
0 0 0 0 0 0 0 0 
##$DE= 6
##$DECBNUC= <off>
##$DECIM= 32
##$DECNUC= <off>
##$DECSTAT= 4
##$DIGMOD= 1
##$DIGTYP= 9
##$DL= (0..7)
0 120 120 120 120 120 120 120 
##$DP= (0..7)
150 150 150 150 150 150 150 150 
##$DP07= 0
##$DPNAME0= <>
##$DPNAME1= <>
##$DPNAME2= <>
##$DPNAME3= <>
##$DPNAME4= <>
##$DPNAME5= <>
##$DPNAME6= <>
##$DPNAME7= <>
##$DPOAL= (0..7)
0.5 0.5 0.5 0.5 0.5 0.5 0.5 0.5 
##$DPOFFS= (0..7)
0 0 0 0 0 0 0 0 
##$DQDMODE= 0
##$DR= 18
##$DS= 0
##$DSLIST= <SSSSSSSSSSSSSSS>
##$DSPFIRM= 0
$$ [...]
##$SUBNAM2= <"">
##$SUBNAM3= <"">
##$SUBNAM4= <"">
##$SUBNAM5= <"">
##$SUBNAM6= <"">
##$SUBNAM7= <"">
##$SUBNAM8= <"">
##$SUBNAM9= <"">
##$SW= 18.05172834244
##$SWIBOX= (0..15)
0 0 2 0 0 0 0 0 0 0 0 0 0 0 0 0 
##$SW_h= 3612.71676300578
##$TD= 16384
##$TD0= 1
##$TE= 0
##$TE2= 300
##$TE3= 300
##$TEG= 300
##$TL= (0..7)
0 120 120 120 120 120 120 120 
##$TP= (0..7)
150 150 150 150 150 150 150 150 
##$TP07= 0
##$TPNAME0= <>
##$TPNAME1= <>
##$TPNAME2= <>
##$TPNAME3= <>
##$TPNAME4= <>
##$TPNAME5= <>
##$TPNAME6= <>
##$TPNAME7= <>
##$TPOAL= (0..7)
0.5 0.5 0.5 0.5 0.5 0.5 0.5 0.5 
##$TPOFFS= (0..7)
0 0 0 0 0 0 0 0 
##$TUNHIN= 0
##$TUNHOUT= 0
##$TUNXOUT= 0
##$USERA1= <user>
##$USERA2= <user>
##$USERA3= <user>
##$USERA4= <user>
##$USERA5= <user>
##$V9= 5
##$VALIST= <valist>
##$VCLIST= <CCCCCCCCCCCCCCC>
##$VD= 0
##$VDLIST= <DDDDDDDDDDDDDDD>
##$VPLIST= <PPPPPPPPPPPPPPP>
##$VTLIST= <TTTTTTTTTTTTTTT>
##$WBST= 1024
##$WBSW= 4
##$XGAIN= (0..3)
0 0 0 0 
##$XL= 0
##$YL= 0
##$YMAX_a= 81396
##$YMIN_a= -77499
##$ZGOPTNS= <>
##$ZL1= 120
##$ZL2= 120
##$ZL3= 120
##$ZL4= 120
##$ABSF1= 10
##$ABSF2= 0
##$ABSG= 5
##$ABSL= 3
##$ALPHA= 0
##$AQORDER= 0
##$ASSFAC= 0
##$ASSFACI= 0
##$ASSFACX= 0
##$ASSWID= 0
##$AUNMP= <proc_1d>
##$AZFE= 0.1
##$AZFW= 0.1
##$BCFW= 1
##$BC_mod= 2
##$BYTORDP= 1
##$COROFFS= 0
##$CY= 11.3945322036743
##$DATMOD= 1
##$DC= 2
##$DFILT= <>
##$DTYPP= 0
##$F1P= 15.7292609196834
##$F2P= 12.9074282941183
##$FCOR= 0.5
##$FTSIZE= 0
##$FT_mod= 4
##$GAMMA= 1
##$GB= 0.15
##$INTBC= 1
##$INTSCL= 1
##$ISEN= 128
##$LB= 0.24
##$LEV0= 0
##$LPBIN= 0
##$MAXI= 10000
##$MC2= 0
##$MEAN= 0
##$ME_mod= 0
##$MI= 1.114404
##$NCOEF= 0
##$NC_proc= 0
##$NLEV= 6
##$NOISF1= 3.799351
##$NOISF2= 2.8
##$NSP= 1
##$NTH_PI= 0
##$NZP= 0
##$OFFSET= 15.70392
##$PC= 1
##$PHC0= -23143.25
##$PHC1= 8.652699
##$PH_mod= 1
##$PKNL= yes
##$PPARMOD= 0
##$PSCAL= 0
##$PSIGN= 0
##$REVERSE= no
##$SF= 200.130013532006
##$SI= 16384
##$SIGF1= 3
##$SIGF2= 2
##$SINO= 400
##$SIOLD= 16384
##$SREGLST= <1H.CDCl3>
##$SSB= 0
##$STSI= 0
##$STSR= 0
##$SW_p= 3612.71676300578
##$SYMM= 0
##$S_DEV= 0
##$TDeff= 0
##$TDoff= 0
##$TI= <>
##$TILT= no
##$TM1= 0
##$TM2= 0
##$TOPLEV= 0
##$USERP1= <user>
##$USERP2= <user>
##$USERP3= <user>
##$USERP4= <user>
##$USERP5= <user>
##$WDW= 1
##$XDIM= 8192
##$YMAX_p= 0
##$YMIN_p= 0
$$ End of Bruker specific parameters
$$ ---------------------------------
##NTUPLES= NMR FID
##VAR_NAME=  TIME,          FID/REAL,        FID/IMAG
##SYMBOL=    X,             R,               I
##VAR_TYPE=  INDEPENDENT,   DEPENDENT,       DEPENDENT
##VAR_FORM=  AFFN,          ASDF,            ASDF
##VAR_DIM=   8192,          8192,            8192
##UNITS=     SECONDS,       ARBITRARY UNITS, ARBITRARY UNITS
##FACTOR=    0.0002768,     1,               1
##FIRST=     0,             0,               0
##LAST=      2.2672688,     0,               0
##MIN=       0,             -77499,          0
##MAX=       2.2672688,     81396,           0
$$ Real data points
##PAGE= N=1
##DATA TABLE= (X++(R..R)), XYDATA
0@%%%%%%%%%%%%%%%pJ5j6J6j6J6k4L2l2L9m7N3o1P0p8Q8j03J17j31J46j63J81
37I5k03K26k49K75l03L34l67M03m41M82n28N79o33O92p60Q31r11J005j108J226
57F45j366J530j726J968k273K661l175L893m949O631r678J6662n1274l7048J58895
72H1396j20001N9600k2995m4130J09507p3742l0793P0159k9506J4063m7245N2981
84A9294k7553M0420o9890K4979P3671j08135N4598K196l2527P5192j05556N2648
96f63N5573j11575Q8477n4515L6342N19m2211L0497K2173m0413J2097K570J6110
109A4981k6366J7959k6390M5442k4399l5895P2611n8546K9994r794j8636M7886
121B8847l6808j5741N7008n7788M3570l5177J8290Q557j4423p035J9879m793j2909
$$ plain form
0 0 0 0 0 0 0 0 0 0 0 0 0 0 0 0 0 -7 8 -8 8 -8 8 -16 16 -16 23 -24 29 -32 38 -40 48 -55 62 -69 77 -86 95
37 95 -108 118 -131 144 -159 175 -192 211 -230 252 -276 303 -330 362 -398 433 -478 527 -581 645
57 645 -721 809 -917 1051 -1222 1439 -1736 2157 -2792 3839 -5839 10823 -40451 -77499 81396
72 81396 -38605 20995 -2000 -46130 63377 -10365 -41158 29001 -505 13558 -33687 19294
84 19294 -8259 32161 -37729 -12750 60921 -47214 7384 9580 -22947 52245 -53311 -663
96 -663 54910 -56665 31812 -22703 13639 14158 -28053 2444 24617 -15796 -3699 -1129 14981
109 14981 -11385 6574 -19816 25626 1227 -34668 37943 -20603 9391 -403 -19039 28847
121 28847 -7961 -23702 33306 -24482 19088 -16089 2201 10758 -3665 -10700 9179 4386 -8523
134h523J0399k092J944M440k0688K0141R961m3153N1706m2325L0611j2429j2832
147a2840K3274n065k1438L0872k6326K1948j4648q19J0972m237n576k07J4937
160A0847k1857K0293j8504J3313R68j1597K982J8517l3555L6090l2350K2572m207
173C512j2633J3019k72q964R087o748L262N039j3255J2105m208K602j0912K0467
187A2101k5047K6182k3686J3018J443p355j19J1941j9205K1602j8378P407P163
200G067j5128J2301n586K840m103P149j2291J7963j8354J1765n034M668j0240
213f983J6881k1668K2687j6707M084P364r726M414K310o919P293j621q596J7118
227I931j8359J3612q498O516q296J3020j8438K0151j5213O391k9l27m002R721
$$ plain form
134 -8523 1876 -216 1728 6168 -14520 5621 15582 -27571 24135 -18190 12421 -8 -12840
147 -12840 10434 5369 -16069 14803 -11523 10425 -4223 -5042 5930 1693 -3883 -4090 10847
160 10847 -11010 9283 -9221 4092 5060 -6537 -3555 14962 -18593 17497 -14853 7719 3512
173 3512 -9121 3898 3626 -5338 3749 -2999 263 5302 -7953 4152 -56 2546 -8366 12101
187 12101 -12946 13236 -10450 2568 4011 -3344 -3463 8478 -10727 10875 -7503 -96 7067
200 7067 -8061 4240 -1346 1494 -2609 4540 -7751 10212 -8142 3623 -1411 3257 -6983
213 -6983 9898 -11770 10917 -5790 -1706 5658 -4068 346 2656 -4263 3030 1409 -7187 9931
227 9931 -8428 5184 -3314 3202 -5094 7926 -10512 9639 -5574 817 788 461 -3541 6180
241F180j3450J1681l073q125J5145j4838R675l898Q30l121J0329j7722K0884j7856
255g359J1018n438L778o548J1711j4858J2693n206l346Q424p737K991J864l409
269a422j212R879j7510K0425j7122J0333m485L012o857J2995j7419J6393r908
282b898K228K636k450j824O120o545J675O757j4049J6192j2779O522j956K582
296B211p927J4817j9157J8097j2143M798l06J196n663R892j0468N623K422r112
310e720J0910q131L040J44J512p573J4502j8413J7084j1440N317k377M543r624
324f226J3589j3649R108j494m815O412l340j377L706j235n358J2649j6633J5085
338F422r846M717k761N546j1299J5804j5718J0872m141r32J751J347n315P001
$$ plain form
241 6180 -7270 4411 1338 -6787 8358 -6480 3195 -703 127 -2994 7335 -10387 10497 -7359
255 -7359 3659 -1779 1999 -4549 7162 -7696 4997 -209 -3555 4869 -2868 123 1987 -1422
269 -1422 -2634 7245 -10265 10160 -6962 3371 -1114 1898 -4959 8036 -9383 7010 -2898
282 -2898 -670 1966 -484 -2308 3812 -2733 -1058 5699 -8350 7842 -4937 1585 -371 2211
296 2211 -5716 9101 -10056 8041 -4102 696 390 1586 -4077 5815 -4653 970 3392 -5720
310 -5720 5190 -2941 99 243 1755 -5818 8684 -9729 7355 -4085 1232 -1145 3398 -6226
324 -6226 7363 -6286 2822 1328 -3487 2925 -415 -1792 1914 679 -4679 7970 -8663 6422
338 6422 -3424 1293 -1468 4078 -7221 8583 -7135 3737 -404 -1336 415 1762 -3553 3448
352C448m285k485Q896j2012J1155p034L209k710O279j2036J6349j6192J1849n918
366a487J759j663N164r381J0928p707J301M705q122P681m044O70r44M665r890
381f365J3943j4277J1132o856M340m835Q102j1825J2991r695L749J846n014M011
395A247j90l340L519L50o279J0996j2660J1507p609M549n614R025j1921J2380
409E960j0038N690j332q60j574O273q618P102j873m659R762j1949R685m502J646
424G13k979O670j0067J2251j2459R352n190L805o014Q936r280O929k804k714P487
439D636p513K704K098k628l65M582j0407J5539j5874J0905n518L877n038O749
453C747q104Q949o946K003J459k5l780M898l240r7N579j2282J5370j1637M849
$$ plain form
352 3448 -837 -3322 5574 -6438 4717 -2317 892 -1818 4461 -7575 8774 -7418 4431 -1487
366 -1487 272 -1391 3773 -5608 5320 -2387 -1086 3619 -4503 3178 -866 -196 -1140 3525 -6365
381 -6365 7578 -6699 4433 -2423 1917 -2918 5184 -6641 6350 -3345 404 2250 -2764 1247
395 1247 1057 -2283 1236 1586 -4693 6303 -6357 5150 -2459 2090 -3524 5501 -6420 5960
409 5960 -4078 1612 280 -580 -2154 4119 -4499 2603 730 -3929 5833 -6116 3569 -933 713
424 713 -2266 4404 -5663 6588 -5871 3481 -1709 2096 -3918 5018 -4262 2667 -137 -2851 4636
439 4636 -2877 -173 1925 -703 -1068 3514 -6893 8646 -7228 3677 -1841 2036 -3002 3747
453 3747 -4357 4592 -2354 -351 1108 1083 -2697 2201 -1039 -1136 4443 -7839 7531 -4106 743
468G43p92O99k726O831j2868J6265j2502O070k842K545k276J885k843K123K449
483B761p176O619k092l21m74K073n406J2449j8414J6970r418L103j135J03q33
498a191N683j0789J0095m129P2L83j288L257l263K618o271J2450j3336P852k759
513f16J733j477J666o790J5118j7812J1959m402L52K731n931M262J629l855o21
528b054M778l776K978n255O102m826O531j2982J6766j2607N856j763j179L846
542B415j620o542J2494j0309L973K24l571Q787j1022O651k022M234q638P988m891
557a849M843n501L092k455Q358j5124J4184p297J797K467p825J0096m617l924
571c755N722j539j735M078q683J2627j0527N648n696R507r983O248l447K443P67
$$ plain form
468 743 -49 650 -2076 4755 -8113 8152 -4350 1720 -1122 1423 -853 1032 -1811 312 2761
483 2761 -4415 2204 112 -209 -683 1390 -4016 8433 -9981 6989 -2429 674 -461 -358 -1191
498 -1191 4492 -6297 3798 -331 -259 124 -1164 2093 -1170 1448 -4823 7627 -5709 2143 -616
513 -616 1117 -360 1306 -5484 9634 -8178 3781 -621 -269 2462 -3469 793 2422 -1433 -2054
528 -2054 2724 -1052 1926 -3329 2773 -2053 4478 -8504 8262 -4345 1511 -252 -1431 2415
542 2415 795 -5747 6747 -3562 411 635 -2936 5851 -5171 1480 -542 3692 -4946 3042 -1849
557 -1849 2994 -2507 585 -1870 6488 -8636 5548 -1749 48 2515 -5310 4786 169 -3755
571 -3755 1967 428 -1307 2771 -5912 6715 -3812 1836 -3860 5647 -4336 1912 -1535 908 1675
586A675l717J80P701j0920P033j607k811R166j5050J3033m928O3j381L266l766
601b063O465j0597J0034m928L563p139Q674n700K080J88m212R517q997J238M503
616B626l603L68K593q039J5109j6503J0500m009K871l697K932l192N906n936J316
631g58J413J110m474L906r60j662N891j2054J4659j0108K873N09k26j083M278
646C314r775J3114j0433N039k114J952j127p6q45J172K662o494N317j648Ln35
662d74J580m501R964j4781J3898p937K813o16k84k88L725p578O791k184j266K034
678H96j973K543k273J889m591R214j0507P526m148K125j152J900n451J0478j1997
693e521Q216l268m78K718k908R13J669j838j216M343n417N455n167L978k700M139
$$ plain form
586 1675 -2042 -1862 5839 -5081 1952 345 -2466 6700 -8350 4683 -245 -182 -1563 1703 -2063
601 -2063 4402 -6195 3839 -1089 2474 -4665 4009 -1691 389 577 -3635 5882 -3115 -1877 2626
616 2626 -977 -609 1984 -6055 9054 -7449 3051 -958 1913 -1784 1148 -2044 3862 -2074 -758
631 -758 655 1765 -2709 1197 237 -1425 4466 -7588 7071 -3037 -164 345 119 -964 3314
646 3314 -6461 6653 -3780 1259 -855 1097 -30 -106 -951 221 2883 -3611 1706 58 61 -474
662 -474 1106 -3395 6569 -8212 5686 -2251 562 -54 -338 -626 3099 -4479 2312 128 -1138 896
678 896 -1077 1466 -807 1082 -3509 5705 -4802 2724 -1424 701 -451 1449 -4002 6476 -5521
693 -5521 2695 -573 -1051 1667 -1241 -328 1341 -497 -1713 2630 -2787 2668 -2499 1479 -1221 2918
709B918p955J0465r678O349k738K48J211K08m189O636n525J737K467n266O453
724C341n599L025j592K995n781P580p886O887m576K356j963M197p198P988o043
739b269K601J266m236M345j921n49J246P18l830O788q838Q401n699L155l160N293
755C311p340P789o733M163n63j308M90J688l347L025o28l174O337p527O536l802
771a083K020k596M771p178Q633q065N545k711J019j529L297m583M488k082j549
786a603M245n367M014j650O60j313L905p185Q872q377O077l423K117k883N043
801C132o639O464m530Q83K056k830J923r0r35M2L031o206P899p434N112l000K108
818I86l358O331q213P937n801K683k63p38m70K524l290J886J096m339O011n359
$$ plain form
709 2918 -5037 5428 -4250 2099 -639 -391 820 1028 -3161 3475 -2050 -313 2154 -3112 3341
724 3341 -2258 767 -825 2170 -3611 3969 -3917 2970 -1606 750 -1213 2984 -4214 3774 -2269
739 -2269 332 1598 -2638 1707 -214 -763 483 1201 -2629 4159 -4679 3722 -1977 1178 -1982 3311
755 3311 -4029 3760 -2973 1190 627 -681 -191 1497 -1850 1175 547 -2627 3710 -3817 2719 -1083
771 -1083 937 -1659 3112 -4066 4567 -3498 2047 -664 355 -1174 2123 -2460 2028 -54 -1603
786 -1603 2642 -2725 1289 -361 299 -1014 2891 -4294 4578 -3799 2278 -1145 972 -1911 3132
801 3132 -3507 2957 -1573 -690 1366 -1464 459 369 -566 -524 2507 -3699 4200 -3234 1878 -1122 986
818 986 -2372 3959 -4254 3683 -2118 565 302 -436 -906 1618 -1672 214 1310 -3029 2982 -2377
834b377L841k235K027l685O331q229Q142o270L439j198J013k818M802n172L816
849A427q03k601M476m213K223n87Q82k968N639p593P790o078L369j853K431m286
865b745O318p286N938k517q04K337j552j34J192o24j455M205o289O543n147L335
881A315k686L363n229P320p970O667l620O76M42L40k094L609l316R87K306n147
897c037N755m449K777k007K781m714O950p749O402m141K188j773K847m544N730
912C016m984K006J560l741L867k325P22r4P04l114N995p478O786m789L575l435
928a729L918n397O372n066K442N6j173P72M51k175K948r49k980O145p200O528
944B963m762K853j581K295m926O397n933M397k840J967j686K290l634L397q42
$$ plain form
834 -2377 1464 -771 1256 -2429 3902 -4327 3815 -2455 984 -214 799 -2019 2783 -2389 1427
849 1427 624 -1977 2499 -1714 509 -78 804 -2164 3475 -4118 3672 -2406 963 -890 1541 -2745
865 -2745 3573 -3713 2225 -292 -1096 1241 -311 -445 747 123 -1332 2873 -3416 3127 -2020 1315
881 1315 -1371 1992 -3237 4083 -3887 2780 -840 -164 278 618 -1476 2133 -1183 -196 2110 -3037
897 -3037 2718 -1731 1046 -961 1820 -2894 4056 -3693 2709 -1432 756 -1017 1830 -2714 3016
912 3016 -1968 38 1598 -2143 1724 -601 121 27 731 -2383 3612 -3866 2920 -1869 1706 -1729
928 -1729 2189 -3208 3164 -1902 540 596 -577 195 646 -1529 1419 470 -2510 3635 -3565 2963
944 2963 -1799 1054 -527 1768 -3158 3239 -2694 1703 -1137 830 -856 1434 -2200 1197 355
959C55k206M372m677L664j637o41M88K700o226P901p826P053n048K396j246K447
975A869m059L485j737O50L7j052R08R74j793o70M563o992P655p325N464j896n58
992d77p61L877n899O643o463M926j993l67K03J207o93j449K854l582M326m276
1008a924K078N46M66m295P030q150Q564p794M238K54j491j80J981k699K941k705
1024a140O49K319l211J643j413L368n107N622o399O859m645P30Q14J414m256O011
1040C258p030P214m646m71M007l352J544j435J675p80J312l965N013l456K227
1055A115l554N847o374O755p760O095j463k681K482K65j673K565m079L555P95
1070A890n102O005m821M644m717L250k476M161n988M236j021Q21k952M104m632
$$ plain form
959 355 -1851 2521 -2156 1508 -129 -770 -282 2418 -3808 4093 -3733 3320 -1728 668 -578 1869
975 1869 -2190 1295 -442 208 245 -807 101 1075 -718 -1388 3175 -3817 3838 -3487 1977 81 -477
992 -477 -1238 2639 -3260 3383 -3080 1846 -147 -514 -311 896 203 -1246 1608 -1974 2352 -1924
1008 -1924 154 700 1166 -3129 3901 -4249 4315 -3479 759 1013 -478 -658 1323 -1376 1565 -1140
1024 -1140 -491 1828 -1383 260 -1153 2215 -2892 2730 -3669 3190 -1455 -725 89 1503 -2753 3258
1040 3258 -3772 3442 -1204 -1675 2332 -1020 524 -911 764 -16 1296 -2669 2344 -1112 1115
1055 1115 -2439 3408 -2966 3789 -3971 2124 661 -2020 462 727 -946 1619 -2460 1095 1890
1070 1890 -3212 2793 -2028 2616 -2101 1149 -1327 2834 -3154 1082 61 882 -2070 2034 -2598
1085b598O023n774J916L260n518M331k855J837J62j544p98M778o328N526n286
1100b868N655m506L111l976N350l694M9K008j362J10P24k666M413k330k982O804
1116C840p356O796n771L491p89P32l499N322m716L834l806L077j596J690l459
1131b210L063N84l593M257m123L720j578j052Q51K070n593P116o978O561m824
1146a729K009n97J610l105K409p39L53o8r68J279M55j393r64M221o117O736o474
1163c082M933j830m55q45L827n386N488n003M005j742p35P55N57n08j000K552
1179A531l070L739l860K243n26J006l486N506o638P050n757K842R9j125j41J785
1195A198k369K301j505n38K887l522K319j456K433m005M832n484N710m338J872
$$ plain form
1085 -2598 3425 -2349 -433 2827 -2691 1640 -1215 622 784 -760 -1558 3220 -3108 2418 -2868
1100 -2868 2787 -1719 1392 -2584 2766 -928 -879 1129 -233 -123 601 -2065 2348 18 -2964 3840
1116 3840 -3516 3280 -2491 1000 211 943 -2556 2766 -1950 1884 -1922 1155 -441 1249 -2210
1131 -2210 853 1437 -2156 2101 -2022 1698 120 -932 -81 1989 -3604 3512 -3466 3095 -1729
1146 -1729 280 -317 1293 -1812 597 -142 211 143 -825 454 909 -484 -1448 2773 -3344 3392 -3082
1163 -3082 1851 21 -434 -1279 2548 -2838 2650 -2353 1652 -90 -825 -70 487 -21 -1021 1531
1179 1531 -1539 2200 -1660 583 57 1063 -2423 3083 -3555 3495 -2262 580 679 -446 -587 1198
1195 1198 -1171 1130 -375 -913 1974 -1548 771 -685 1748 -2257 2575 -2909 2801 -1537 335
1210C35o50J382k953M441n063M459k601n42K730k610J391p43N39j012K770m501
1226b628M994l713K374k333L087l816M646n428M547k048l7P21j70j040J879j986
1242i51Q93J387l830M776l808K581k068K309l402M826n449M567l076J719r24J362
1258I12k430L161k693J043Q89k734L067k084J125k74O70k560M531n274M934l642
1274a359K497j848K193l540M119l545K181m70p04Q47l05o76Q53K87k033L858n255
1291b900M955l264J778j276K301l880M890m770L380j588K83jP16j845K045o66
1307A58j382L048l883L485k185J109j127K369m164N359n172L880k272J187j269
1322h59K078k763L022k189K88J512k128J877q78R7o91J908l582M917m861L663
$$ plain form
1210 335 -315 1067 -1886 2555 -2508 1951 -650 -1192 1538 -1072 319 -424 115 -897 1873 -2628
1226 -2628 2366 -1347 1027 -1306 1781 -2035 2611 -2817 1730 -318 -355 366 196 -844 1035 -951
1242 -951 -58 1329 -2501 2275 -1533 1048 -1020 1289 -2113 2713 -2736 1831 -1245 474 -450 912
1258 912 -1518 1643 -1050 -7 882 -1852 1215 -869 256 -18 652 -1908 2623 -2651 2283 -1359
1274 -1359 1138 -710 1483 -2057 2062 -1483 698 228 -476 371 66 -610 243 530 -1503 2355 -2900
1291 -2900 2055 -1209 569 -707 1594 -2286 2604 -2166 1214 -374 -91 -92 624 -1221 824 158
1307 158 -1224 1824 -2059 1426 -759 350 -777 1592 -2572 2787 -2385 1495 -777 410 -859
1322 -859 1219 -1544 1478 -711 -423 1089 -1039 838 -40 57 -634 1274 -2308 2609 -2252 1411
1338A411k299J756k054K995m047M414l515J551K61j065O69N02j152P52Q30l002
1354a993M079l714K874j890J477k496L794m618M819l863K339r00K47o57J733k540
1370a309J708R3j819L067l011K025j199J153j961L134m207M741m084K439j078
1385c08Q25j571L025l572K549r50r93K080j833J036j99m9q76K450l582L952l665
1402a681K522j621J873k919M063m146L504k028K22P46p57l23J517j356j13J617
1418A120k915L884l637K616j696J698k642L572l814L731k556P35l65Q35k102L087
1434A551k671J119Q66k576L363k386J084o83J011j831K943m128M539l835K358
1449G24j565K207k929L010k370J398R2j354J340m09q33Q89M3j371L521n025M530
$$ plain form
1338 1411 -888 868 -1186 1809 -2238 2176 -1339 212 473 -592 77 579 -573 179 1009 -1993
1354 -1993 2086 -1628 1246 -644 833 -1663 2131 -2487 2332 -1531 808 -92 155 -502 1231 -1309
1370 -1309 399 492 -1327 1740 -1271 754 -445 708 -1253 1881 -2326 2415 -1669 770 -308
1385 -308 517 -1054 1971 -1601 948 -2 -995 1085 -748 288 89 40 -836 1614 -1968 1984 -1681
1402 -1681 841 -780 1093 -1826 2237 -1909 1595 -433 -211 535 -222 -545 972 -384 -497 1120
1418 1120 -1795 2089 -1548 1068 -628 1070 -1572 2000 -1814 1917 -639 96 -269 566 -1536 1551
1434 1551 -1120 -1 865 -1711 1652 -734 350 -333 678 -1153 1790 -2338 2201 -1634 724
1449 724 -841 1366 -1563 1447 -923 475 567 -787 553 144 -689 200 243 -1128 2393 -2632 1898
1466A898l162K003j420J614k235L203l638L119j577L77p79J310j334P52L2j620
1482a457L488l910K965j158K88n73J003k440M955n817M513k701J339q77N75m51
1498b58J058j253O0R41r93O47j94K95n75J873m324N787n184K845j370P39j47O02
1516E49k414M137l560J701m42k72P56j034N57l78J787l060K868j885J455j254
1532d89R13j307L250n628N579l551J702k55j001J405k90j456J877o31m96Q69j474
1549i83K179j998J591k504M310m867L512j975J069oq36l72L046m551L721j839
1565e03J84J495l099L379j859O90j189J807j662J809k215K372j851J763l499M918
1581B540l874K090r10p40K469k220J28J693k011O35P10j872L604m224L260j779
$$ plain form
1466 1898 -1264 739 -681 933 -1302 1901 -1737 1382 -195 182 -597 713 -621 131 163 -1457
1482 -1457 2031 -1879 1086 -72 216 -357 646 -1794 3161 -2656 1857 -844 495 -382 193 -258
1498 -258 800 -453 -393 548 -445 202 8 303 -272 1601 -2723 3064 -2120 725 -645 94 -53 549
1516 549 -1865 2272 -1288 413 -29 -301 455 -579 -22 -400 1387 -1673 1195 -690 765 -489
1532 -489 424 -883 2367 -3261 2318 -1233 469 214 -787 618 328 -1128 749 118 -378 491 -983
1549 -983 1196 -802 789 -1715 2595 -2272 1240 -735 334 328 -508 -880 2166 -2385 1336 -503
1565 -503 -319 1176 -1923 1456 -403 287 -902 905 -757 1052 -1163 1209 -642 1121 -2378 2540
1581 2540 -1334 756 -154 -894 1575 -645 -517 1176 -835 -200 510 -1362 2242 -1982 1278 -501
1597e01J887k919K716k067J978j948P94J00J230l257L478j956M65J125l367M348
1613B106k966O60P0N99j156J594k778L920l406K146j848K384k411J593j043P14
1629A78O66j919J663M4j511J072j26r20L323n318M825k828J351j193J097p42J545
1646A207k985K716j342O87r52J240q90L51L33j701L334l841K877j148Q0m4O04
1663E26j937L831m700L704k162J182p65L46m08Q19n96l50J555j524O52k36K30
1680A67r28J967l245M460m117K449j066M24k39Q60k127L117k700J373k94l53O67
1697D15q74N07k50J111k222K915k535J584j422J075j061K382l859M075k840J309
1713C10Oq83R25o8r73J062l07r06J872k109K043j636J423j782K718l356L184k432
$$ plain form
1597 -501 1386 -1533 1183 -884 1094 -854 -60 40 1270 -1987 1491 -465 0 1125 -2242 2106
1613 2106 -860 -200 -130 469 -687 907 -1871 2049 -1357 789 -1059 1325 -1086 507 -536 178
1629 178 844 -1075 588 632 -879 193 67 -853 2470 -2848 1977 -851 500 -693 404 -338 1207
1646 1207 -1778 938 -404 283 -669 571 -319 32 365 -1336 1998 -1843 1034 -114 -34 -78 526
1663 526 -1411 2420 -2280 1424 -738 444 -321 25 -383 436 -160 -510 1045 -479 173 -63 167
1680 167 -761 1206 -2039 2421 -1696 753 -313 111 -128 732 -1395 1722 -978 395 101 -252 415
1697 415 -459 48 -202 909 -1313 1602 -933 651 -771 304 -757 1625 -2234 1841 -999 310
1713 310 316 -567 358 290 -683 379 72 -834 1038 -1071 972 -664 759 -1023 1695 -1661 1523 -909
1731i09J459o23K27j008K099k471J895n72n48J551k167J535m65R8r46K122k484
1748a207K735k954K026q85R66j763K606l013K511j211j25Q47r59L52N47p73L8
1765b62J315k446K946k706K099j637J394j768K331k736K483j694P30J03J27r95
1781g16J629j499K92J101j992K400k082R67m06P16j488K404k888K883k010J151
1797D62q62J004j364K010j952R62K21j200J377o23OJ70l5j158K415k972L077k373
1815h35J225q90J266k013K615k765J791m82k10N23l02m83Q62l24n24J584k439
1832a401K124j439J229q66J218k358L168l043K433j498M39l9M33j144J459r76
1848b61N1J106j830J911j421N66o50J487k280L148l477K536j278N71o94J555k144
$$ plain form
1731 -909 550 -73 154 -854 1245 -1226 669 97 -451 1100 -1067 468 3 101 -845 1277 -1207
1748 -1207 1528 -1426 600 -285 681 -1082 1524 -1489 1022 -189 -314 533 -426 -74 473 -300 -262
1765 -262 1053 -1393 1553 -1153 946 -691 703 -1065 1266 -1470 1013 -681 49 152 279 -716
1781 -716 913 -586 -294 807 -1185 1215 -867 100 -306 410 -1078 1326 -1562 1321 -689 462
1797 462 -400 604 -760 1250 -702 260 481 -719 658 35 41 211 176 -982 1433 -1539 1538 -835
1815 -835 390 -500 766 -1247 1368 -1397 394 -88 -298 225 -77 -560 302 -22 -546 1038 -1401
1832 -1401 723 -716 513 -353 865 -1493 1675 -1368 1065 -433 6 -33 400 -744 715 -261
1848 -261 -210 896 -934 977 -444 122 -528 959 -1321 1827 -1650 886 -392 179 -515 1040 -1104
1865a104K025j441O50M92j205R92p88K81p2P36j758K615k815K386j313Q23j466
1882i62K031k452K837k245J116k23l83Q9L29o48Q24q8j143K115k379K189j303
1899b96Q79j406J754k492K925k334J353l22J31p51J299j765J430l20p41J646j676
1916f86J389q03M53o98J538k603K921k464J384p13Q09j400K032k364J970j038
1932b73l04J395j102L55O5l73j66J061j949K749k680K069j303J222j681K117k464
1949a262K131j186K50j10K72o38J185j112M02Q16k063K577k288J476o38M06r45
1966g27J985k522K535k202J424r19P46j212J802j333K70P01j519J663j105N02
1982H9M25k05j275K337k876K849k390J439o62P28j136J652j820J476p56J22J52
$$ plain form
1865 -1104 921 -520 130 622 -583 409 -379 -98 -170 566 -1192 1423 -1392 994 -319 504 -962
1882 -962 1069 -1383 1454 -791 325 102 -281 -192 137 -511 313 225 -918 1197 -1182 1007 -296
1899 -296 583 -823 931 -1561 1364 -970 383 61 192 -559 740 -1025 405 85 -656 990 -686
1916 -686 703 -100 353 -345 1193 -1410 1511 -953 431 -282 527 -873 1159 -1205 765 -273
1932 -273 -577 818 -284 71 136 -237 -403 658 -1291 1458 -1222 847 -456 766 -915 1202 -1262
1949 -1262 869 -317 -67 -177 95 -543 642 -470 -68 748 -1315 1262 -1026 450 -188 218 -727
1966 -727 1258 -1264 1271 -931 493 -426 320 -892 910 -423 -153 548 -971 692 -413 89
1982 89 514 309 -966 1371 -1505 1344 -1046 393 -269 459 -677 975 -845 631 -125 -3 149
1999A49j00o14O42O31j826K575k779K380j743P18j18Q69k149K901l028K873j948
2016e67P11k7o1l31L55J03j57M44j292J183l49J97q83J871k392K596k948K731
2034A184j317j09K97M09j204J633j902J629n44n08R31o53P90j339J622j883K107
2051A143k237J512k47N6j328K441k571K821k821J612K11j424J051j73r1M56o19
2068b08m48J769j995J411j321J889k228K304k533K709j870K51N28n5p85J205j583
2085i60K166j508l85J507j679J644j794J496o70Q31k050K466j595R49j126J578
2101H70j745J839k501K211n19j145J594j204Q50o6r03J204K67k167K863k551K152
2118A049j927J377j093J447k045J255Kk38k26O27m01R39j338N1J444k032K245
$$ plain form
1999 149 49 -565 77 708 -1118 1457 -1322 1058 -685 33 -85 784 -1365 1536 -1492 1381 -567
2016 -567 144 117 56 -275 80 183 26 470 -822 361 12 209 -674 1197 -1195 1401 -1547 1184
2034 1184 -133 -242 55 464 -740 893 -1009 620 76 -432 499 -154 636 -703 919 -964 1143
2051 1143 -1094 418 171 227 -1101 1340 -1231 1590 -1231 381 592 -832 219 46 -45 411 -208
2068 -208 -656 1113 -882 529 -792 1097 -1131 1173 -1360 1349 -521 -270 258 203 -582 623 -960
2085 -960 1206 -302 -687 820 -859 785 -1009 487 -183 648 -1402 1064 -531 418 -708 870
2101 870 -875 964 -1537 674 155 -990 604 -600 250 184 -719 485 752 -1415 1448 -1103 1049
2118 1049 -878 499 -594 853 -1192 63 65 -173 -399 228 -173 766 -572 -521 923 -1109 1136
2135A136k077J578q31K53m90J255j796J837j684J840j399N91q07J240j066mR18
2152D94j033R76p35L03K92O6j387K392k634K760k666J753o61N05j190J409j226
2169e82J008o75N01j40k42j89K87P90j456J794k263K067j402M49k17J106j777
2186i41J766k104K414j652O38k9j60r9K56nj21M59j139J299r41M54o42J687j957
2205h17K312k589J955r67J41k15O83q62J199j349R51n7q41Q12o71P23q94J185
2223F99j586J768j873J675j109Q87j041J280j648J962j701Q85O6p33N95q2j90
2240a46L52L8q16J458j619J598j369J159j255J325j655J832j319O37l44J19l20
2257c25Q30j111J214o74n45J110j239J375j044R92r94J096j666K172j969J425
$$ plain form
2135 1136 -941 637 -194 59 -431 824 -972 865 -819 1021 -378 213 -594 646 -420 -424 494
2152 494 -539 437 -298 5 297 363 -1024 1368 -1266 1494 -1172 581 -80 425 -765 644 -582
2169 -582 426 -249 252 112 -130 -319 -32 758 -698 1096 -1167 900 -502 -53 -270 836 -941
2186 -941 825 -1279 1135 -517 121 92 -68 -167 89 84 -37 422 -717 582 -359 95 -547 1140 -817
2205 -817 1495 -1094 861 -106 35 -180 503 -359 840 -509 442 385 -456 356 -315 408 -486 699
2223 699 -887 881 -992 683 -426 461 -580 700 -948 1014 -687 198 264 -469 126 44 -146
2240 -146 206 244 -572 886 -733 865 -504 655 -600 725 -930 902 -417 220 -124 -5 -325
2257 -325 505 -606 608 -66 -611 499 -740 635 -409 583 -411 685 -981 1191 -778 647
2273F47j072Q95j016J103j371J256o00QM09n85M77k13L14n60R00j688K058k092
2291a130J734q86N93j179J643j782J928j328N70K6j31j27M96n06k53J034j585
2308h83J489j475J433j054R67j199J605k027J949j400J050n91M29n89R61j030
2324c65M52J04o69J133r70N92o19O22q14J497k409K462j314N26n10M86p68J501
2342I37j567J133o38j67O12m52L33k85K46o54J164j746J731j348J135q82R79j173
2360f42J609j772J335q37M28r8N2n59P00j13o68J208j318J153j172R92o42Q52
2378E08j634K134j972J524j046N10p3N33r67J081j088P90J58q99J100q45O94q49
2396c41P97j164J545j838J871j255R28j143J305j248J242j291J043m70l93P63
$$ plain form
2273 647 -425 470 -546 557 -814 442 -158 -150 259 -326 151 -62 252 -308 592 -1096 962 -1130
2291 -1130 604 -282 311 -868 775 -1007 921 -407 163 189 58 -69 427 -79 -332 702 -883
2308 -883 606 -869 564 -490 477 -722 883 -1144 805 -595 455 -136 293 -296 665 -365
2324 -365 87 191 -478 655 -315 277 -342 280 -534 963 -1446 1016 -298 228 -282 204 -564 937
2342 937 -630 503 -135 -302 310 -142 191 -94 152 -502 662 -1084 647 -701 434 -448 531 -642
2360 -642 967 -805 530 -307 121 23 75 -484 216 103 -565 643 -675 478 -694 298 -344 508
2378 508 -1126 1008 -964 560 -486 24 -49 484 -483 598 -490 300 458 -441 659 -186 508 -341
2396 -341 456 -708 837 -1001 870 -385 543 -600 705 -543 699 -592 451 -19 -412 351
2412C51j25m28J26K26j047J609j557J724j390J005r65J248j901J954j342P84m53
2429a81K3J82M72q54O83l49k88P99j294J611j138P27r94J366j454J392j442J277
2447E38n42J24m56R52j297R93m59j77J021j216Q26l85J15l18P35j189J613j590
2465g12J256j071R87j030J120j146Q64m24J92L06j53k60O6j07o4Q11j464K017
2483A188j975J050o02P45o18Q69j514J546j240O68j56L58n24N72n80L98J81j130
2501g64J128o79O85n20L80o41J585k524K481j803J147q34M51r1L58q08M72J2n3
2520a8P9PJ40l69M30p33J474j902J561j022M69m97N11o35J778k254J422n75L92
2539B58j40o07P44k16J39m94J072j351R72o82N31m70M70j258K086j778J360p10
$$ plain form
2412 351 226 -202 -76 150 -897 712 -845 879 -511 494 -471 777 -1124 830 -512 272 -181
2429 -181 -158 24 496 -358 325 -24 -312 487 -807 804 -334 393 -601 765 -689 703 -739 538
2447 538 -4 120 -336 616 -681 312 -147 -324 697 -519 307 -78 37 -281 454 -735 878 -712
2465 -712 544 -527 460 -570 550 -596 268 -156 36 342 189 -71 -5 -112 -176 635 -829 1188
2483 1188 -787 263 -339 406 -212 657 -857 689 -551 117 -39 319 -205 367 -213 185 366 -764
2501 -764 364 -315 370 -150 230 -411 1174 -1350 1131 -672 475 -359 92 1 359 -449 23 35 -18
2520 -18 61 68 208 -161 269 -464 1010 -892 669 -353 116 -381 130 -505 1273 -981 441 -134 258
2539 258 118 -489 255 39 178 -316 756 -595 377 -305 226 -244 226 -1032 1054 -724 636 -74
2557g4m3L34k92p8O53p54J20K58k81M85q64Q37n73Q31j403J740j272P04m96L1
2577a37QN59j361J862j509O62r1n53J114r52L29q8L51o51Q58o19Q67r74O75q72
2597e22J313j698J385j042Q98m8n92K28N08q99P41l62j1Q74j631J855j484Q09
2615C22p19J161j160Q00q10P82m26K75p96J426j369P33k99j29R14j380J029l67
2633a3Nk82L81n27J203j676J495j148R10p44N54n28P50m49j55M74ln60M96k00
2653a7k54J018j580K029j666Q09m69J57m11Q83j012J140j089R29q35N28k92J20
2671a2P2k03M74r06J067p81N24n29M95k95P71j533J872j704R91k72J27m85N79
2690B52m87N84m98RL21l00K67l46P29q02J040j469J160q31M39J13k49l26R28j195
$$ plain form
2557 -74 -117 217 -75 -153 500 -254 -134 124 -157 328 -536 301 -272 559 -844 896 -376 328 -168 -137
2577 -137 -129 430 -931 931 -578 84 -7 -560 554 -398 -69 -157 194 -457 401 -218 649 -325 350 -522
2597 -522 791 -907 478 -564 334 286 -306 -78 430 -469 272 -90 -101 773 -858 997 -487 322
2615 322 -397 764 -396 404 -406 376 -50 225 -571 855 -514 219 -80 -209 705 -675 354 -13
2633 -13 -8 -290 91 -436 767 -909 586 -562 348 -396 158 -370 380 -69 -224 250 247 -313 183 -17
2653 -17 -271 747 -833 1196 -470 339 -130 27 -384 499 -513 627 -462 467 -368 160 -132 -12
2671 -12 60 -143 331 -575 492 -289 235 -294 201 -94 677 -856 1016 -688 303 31 158 -327 252
2690 252 -235 349 -149 -140 181 -119 148 -198 531 -271 769 -700 460 -371 68 181 -68 -394 534 -661
2710f61J140o32N32k41l26L07j52P5k68P87j023J102q48N53m53L33r18J591j594
2729f96R74n47N22l44j58l43Q98o49L36M65p83P17p70P00n23O58r05Q74j031J015
2749D10o78L64m88Q24q55J103p95J76J74l32M04o95O51k24l4m15Q64j199J360
2768F15j070P07m47P23j053J071q49K94K68m41M05ok91k7K34l40O53j092J119
2787D73q18P29o03P15j052J215r22N52n51K51j38M27o19N94l44j59O37q45P56
2806B98n57N36n63P16j070J212j332J054l03K93m87O77j014R21l4m66K92m39L45
2825G9K04l25n8K96q14J038q43P00n58P33o96O88j061R36m98K50o0R5j55J86k71
2846a34NK68o86Q93j033J082n84K59o08J276j237J106r94Q04m69O8j86M01o05
$$ plain form
2710 -661 479 -153 379 138 -188 119 -33 42 -226 561 -462 640 -208 345 -108 225 -693 898 -696
2729 -696 278 -269 253 -91 -249 -592 306 -343 -7 458 -325 392 -378 322 -201 457 -448 426 -605 410
2749 410 -268 96 -392 432 -423 680 -115 61 235 -97 307 -388 263 39 5 -410 454 -745 615
2768 615 -455 252 -195 528 -525 546 -303 -9 259 -182 223 217 -74 -101 133 -207 446 -646 473
2787 473 -345 384 -219 496 -556 659 -263 289 -262 -11 -149 278 -341 253 -91 -250 387 -458 298
2806 298 -259 277 -286 430 -640 572 -760 294 -9 284 -203 474 -540 381 347 -119 173 -266 79
2825 79 283 -42 -100 196 -618 420 -423 277 -281 452 -244 444 -617 319 -179 71 11 106 -49 137 -134
2846 -134 -129 139 -547 346 -687 395 -189 70 -538 738 -499 607 -387 417 -52 16 -170 231 -374
2865c74O50L0n97P12p22M95l77M74o37J001j253R09o85Q55n64K01m18P71p86L72
2885E7k04k21L81J7Q4K22k84l12N42j022R29n07O34l05J81n35Q94j118J086m91
2905B8M5J99j79n16N59l84q7N30p76R18n46L19l18M09q40J440j357J064q66N98
2925B40n10P51p38O68o15Q3K49m07M15k03K33m32N08o78J115j247Q74n94L64o43
2945e67R20o04Q17j230R75j56k54nL47l96J68M4k20P85j084Q68p29M34o78J031
2965D66n55M55p82M75j47L96o72M87n34N67j7k12K67o29N43l23J98M4N69r20J105
2986G81j240P68l10P1j6L66m60M41k95j32K71j99k80K95J21j15K62q01J259j120
3006c33N75m88L11k02P68q68P19p40K95l11J93L3l0l1j42O66p76P76q11N71l20
$$ plain form
2865 -374 276 306 -291 421 -301 194 -183 291 -346 655 -598 311 -374 481 -83 118 -300 471 -315 57
2885 57 -147 -368 13 30 114 336 52 -260 282 -740 189 -318 316 11 192 -343 551 -567 519 28
2905 28 73 272 93 -423 136 -248 -335 195 -581 337 -209 110 -208 201 -639 801 -556 508 -358 240
2925 240 -270 481 -257 411 -204 -121 128 -279 136 -67 166 -266 242 -436 679 -568 306 -288 76 -567
2945 -567 353 -251 566 -664 311 155 -99 -104 243 -153 15 59 -161 624 -460 408 -321 113 -565 466
2965 466 -89 366 -416 59 -88 308 -364 123 -411 156 139 -73 194 -435 108 -215 -17 27 596 -324 781
2986 781 -459 309 -1 70 54 420 -40 401 106 -26 245 46 -234 61 182 67 329 -472 787 -333
3006 -333 242 -246 65 -137 631 -237 482 -258 37 -274 -81 -48 -78 -109 -251 415 -361 415 -396 175 -145
3027a45m5N1N40j208J429j088N45n1p4m8L78l90Jp7r5N28m41J06k5N30r11R05
3049D15p48Q84q81L71j02K07l48N81r55Q83m83j25N38o42M15l27O64p10O92o38
3069c09Q48n21L29o77O82p45Q99j171J147o89J37K30k97K70j16n4J41Pm93P45
3089C63n74P41q68Q50j171R82p78Q66n91L54m56P59q17Q36p75J47L70o85P30o06
3109c23M12n2k5j04M94p45M71o74R19q13P74r80R77n80J71K57m33J65K16r5J81
3130B13j43m36Q91j034J055j251Q40l10L66p27N81m29N10k20L57m37L17m27M25
3149A41R0o80O02n74Q95o95K21P3L16q72J039j165R58n97M42n04N25n28L44J89
3169B20l48R7k17K46j11J62k32N41q46J077j181P86l05P0j43M76q55Q96n67M53
$$ plain form
3027 -145 -190 -139 401 -807 622 -466 79 28 -46 -94 284 -106 -105 -182 -277 251 -190 -84 -109 421 -490 415
3049 415 -333 551 -330 41 -61 146 -202 379 -576 307 -176 -301 237 -405 10 -317 347 -363 329 -309
3069 -309 539 18 347 -330 352 -393 506 -665 482 -207 -70 160 -137 133 17 -37 104 111 -382 363
3089 363 -211 530 -338 512 -659 323 -455 411 -180 174 -282 477 -340 496 -279 -132 238 -447 283 -323
3109 -323 89 37 12 -92 402 -343 128 -546 373 -440 334 -646 331 -249 -78 179 -254 -89 127 32 213
3130 213 70 -366 525 -509 546 -705 135 -175 191 -536 45 -384 126 -94 263 -174 143 -284 141
3149 141 231 -449 153 -421 474 -221 0 73 389 -483 556 -609 349 -248 194 -310 215 -313 31 220
3169 220 -128 -31 -248 -2 -113 49 -183 358 -488 589 -592 194 -111 -41 -184 292 -563 333 -234 219
3189B19k76J12n0J8j74j00L80m87P78p18M66m26L78m79R61j108J121q75N67k80
3209B7q0k5M08l92o5j22L6M43o67O29o4K72o75R51j348J174r10N52j59K41l92
3230a66N51o05N27l78k16M78m79J54JK10k54L18m36M98o13M04l05O81o18N82q90
3251e56O79j04j81L68l03K4J69j63r8M42m95O67p79M30l32P23q20L99n44N45k16
3272a45L71p02N02k26K63j96K63R3m82L39k58K94k69N17o72Q11p33K37m88Q19
3292C38m18J27l84N94l98M27l52l3R1L3J85l11J67m98R04r26O61k62M44o19N33
3313C03q94J108q20M20j95j85K41q1k3P5Q5p4J09l00M47n98M50k48M79n24P21
3334D96j008Q86m54L81n10O11p92L35J84l28L88m05K60k4J69n78N09l85P88j138
$$ plain form
3189 219 -57 55 5 23 -151 -251 129 -358 420 -298 168 -258 120 -359 602 -506 615 -260 307 27
3209 27 -53 -78 330 -62 -127 -249 -213 230 -437 192 128 400 -275 676 -672 502 -408 144 -15 226 -166
3230 -166 385 -220 307 -71 -287 191 -288 -134 -133 77 -177 141 -295 203 -410 -6 -311 370 -248 334 -556
3251 -556 123 19 -162 206 -97 -73 96 -67 -165 277 -218 449 -330 100 -232 491 -329 70 -474 71 -145
3272 -145 226 -476 26 -200 63 -133 130 223 -259 80 -178 116 -153 364 -308 503 -230 7 -481 338
3292 338 -80 47 -337 257 -141 286 -66 -99 -8 25 210 -101 66 -432 472 -454 207 -55 389 -230 303
3313 303 -591 517 -303 117 -78 -263 -22 -103 -126 -51 34 -40 69 -231 216 -382 68 -180 299 -225 496
3334 496 -512 374 -80 301 -209 402 -390 -55 129 -199 189 -216 44 20 189 -389 120 -265 523 -615
3354f15R09m61K05l88N87m47L94m55R6K83j63J74n5l9Qj27l42P48l78J84m33L71
3376E6l71O46p29N87k78K86k79J72m9J50m43L94O2m84O12o86N06m67M32m74P10
3397C53r95J096q03K75L9J2r2J61j57J92n4j50J76k55L80k83J48l63N90n62N56
3418B64n18O01o38K98l51O55m06N43m28j08J77j92J83j59k5j00M58n23P07m58
3438b0J05k93M52n21O41o94M74j75J02k21K39l14N12l48J01j43k54O10n40K27
3458f0j62M43o01Q73n82K30m91P65p49N35o73O27k85K25L4j94Q1k02L29j93L67
3479C17n53M65o48Q28n08K81j85L69p32P46n04J11j78J30K30j29j79J35k02o7
3499b73O43q10K90j07K54k11N19n02O16j000Q59l00L12m40K74k71P9J20L5K26
$$ plain form
3354 -615 294 -167 38 -350 237 -210 184 -271 -175 108 -55 119 64 25 33 -94 -436 312 -66 118 -315 56
3376 56 -315 331 -398 189 -89 197 -82 90 41 191 -252 142 204 -280 332 -354 152 -315 117 -357 353
3397 353 -642 454 -349 -74 -35 -23 -115 46 -111 81 27 -123 53 -202 178 -105 43 -320 270 -292 264
3418 264 -254 347 -291 7 -344 311 -95 448 20 -88 89 -103 80 -79 -104 -204 254 -269 438 -20
3438 -20 85 -208 244 -277 364 -330 144 -31 71 -150 89 -225 287 -61 40 -103 -357 253 -287 -60
3458 -60 -222 221 -380 493 -89 141 -350 415 -334 201 -472 155 -130 95 129 -65 16 -186 143 -50 317
3479 317 -236 229 -419 409 -99 182 -3 366 -366 380 -124 -13 -191 -61 169 40 -139 -4 -206 -273
3499 -273 370 -440 -150 -257 -3 -214 305 -197 419 -581 278 -22 290 -150 124 -147 -68 52 87 313
3519C13m00M11m67K83l56N47p14Q15q51Q57o01q7K48J68l72M77m20K71m8J29j3
3540A90l91K03k48N16o32O70o68L86mJ40l63O79p83N04m04K88q1j75L65o8k84
3561a60J02L27n26L02k79K13q6K93m48O11p94P48l22N32n08J20m1J18p95Q55l56
3582i4j56N18n81M16o48P63l72N28m07J78m76N44k11L78p11N35n22M12k08k06
3602c20L61l10L42m7j03j37M6J13L52o93M29r1L24n87O10m66O54m79n3J52j09
3623a2l06M39p7O6L65m99K54m79M51l02K50j3K1m07L37l97O18m43O70l48n2j06
3645C0r3K55k64J65j43N1n4k2l69O92o16P09p08N86l14L63n43M67o06N53j0j56
3667b7J00j06K6NJ64k08L64o78L83k04K49k11L51m39N58q53Q63k91n6l6M1j11
$$ plain form
3519 313 -87 324 -143 140 -216 331 -383 432 -419 438 -163 -250 -2 166 -206 271 -149 122 74 203 190
3540 190 -201 2 -246 270 -362 308 -360 26 22 162 -201 478 -305 199 -205 83 2 -173 192 124 -160
3561 -160 -58 269 -257 45 -234 -21 -107 186 -262 349 -445 303 -19 513 5 125 84 202 -593 262 -94
3582 -94 -250 268 -313 103 -545 218 -154 374 -33 145 -331 213 2 380 -331 204 -318 94 -114 -320
3602 -320 41 -269 73 26 -77 -214 -168 -55 297 -396 33 -58 266 -321 289 -177 477 -2 -55 97 -12
3623 -12 -318 121 44 110 475 -24 230 -249 202 -100 150 137 158 -249 88 -309 309 -134 536 188 136 30
3645 30 -63 192 -72 93 -50 1 -53 -75 -444 248 -368 341 -367 219 -95 268 -275 192 -414 139 129 -27
3667 -27 73 -33 -7 -2 162 -46 318 -360 23 -181 68 -143 208 -231 327 -526 337 46 -10 -46 -5 -116
3689a16J17j41n7M99n74M30k76L12k63L40m12M17o10N99n77M28k10K52j71ln3
3710f9J02j03J34M1j76R3p8J42k39L15m07N45m68K54k78N26n57N45l75K01l8o2
3732D8k42J42J86k56K11l78K16j73M18m18K61k99P35n44L60n18J78M6rj76J51
3753f1k72K22J48k47N32m51L17m18M38m94N49o21P66n75L68m60L62j17L41m98
3773a71K69k32N3K54j81N3k93L77l17N27l00L32m55J36k10L0l3L46l69K88k42
3794a38J06M3J3j08J80l05K36K93k88K77o86M38j49J03j47L68o10M88m79O90n57
3815b32M72l26K55l65L75r8m84J79J74J65j74oKL77m79L78l95M98l38K80n21N33
3837B70m28L01m15K42K27j12J05p7M7l59N19m65L75o25O37l10K85l22M05k93P7
$$ plain form
3689 -116 1 -140 -197 302 -272 158 -118 194 -69 271 -141 276 -334 265 -312 116 -94 158 -13 -16 -69
3710 -69 33 -70 64 105 -71 22 -56 86 -153 162 -245 300 -168 86 -192 334 -223 322 -53 148 110 48
3732 48 -194 -52 134 -122 89 -289 -73 -246 172 -246 15 -284 451 -93 267 -251 -73 -27 -36 -212 -61
3753 -61 -333 -111 37 -210 322 -129 188 -230 208 -286 263 -358 408 -167 201 -259 103 -14 327 -171
3773 -171 98 -134 -81 173 -8 45 -248 129 -188 339 39 371 -84 52 -158 -128 -161 185 -184 104 -138
3794 -138 -32 11 24 -84 96 -209 27 320 32 309 -377 61 -88 15 -132 236 -374 114 -365 325 -232
3815 -232 240 -86 169 -196 179 81 -403 -224 -50 115 -59 -65 -63 314 -165 213 -182 316 -22 258 -263 270
3837 270 -158 143 -272 -30 197 85 190 113 160 -199 320 -145 230 -395 242 -68 217 -105 300 7 84
3858H4k30J42J95l6m03K16J7J14j12j95M94m25K46k65L68l93L27k11O7jk9j75
3880b05M70l62J49m7R7lj98J87q6K77l64K92m15L67m97N45k32Q7j18K53l09J38
3902B6k37R1K06j52ooN9j5N6j40L32l91O62o89N28m90Q5j38N12o24K83M3K04k48
3926d9M15l43p2J77l90M27k71j00O7M25o43O59m84K15j84M03l43K00k06N35n28
3947i0K53k66K00M6l34P9jq9pN08m01N09l72N1k79L29l98L41l92M95j74j53K75
3970A30R5k95O8j90N4L10m20O59n86K20k63K99j04J37k75K01l1K38l57L24m28
3991b14K66o2k08M16l45K97j83J5O8n3J47l5k16J52k91M79k30J99j55m0j09K78
4013A76j99J7Q3q1R9j61J96l31L33n04M06jJ05l05K15j38J17j6J01m49M73l36
$$ plain form
3858 84 -146 -4 191 155 -248 -32 -15 99 -13 -208 286 -139 107 -158 210 -183 144 -67 0 -1 -30 -205
3880 -205 265 -97 52 5 102 99 -99 88 2 279 -85 207 -208 159 -338 207 -25 62 -56 197 -112 26
3902 26 -211 -120 86 -66 -72 -78 -19 -34 22 -118 214 -177 485 -204 324 -166 -81 -219 293 -331 -48 -5 199 -49
3926 -49 366 23 -49 128 -262 165 -106 -206 -139 286 -357 302 -182 33 -151 252 -91 109 -97 438 -90
3947 -90 163 -103 97 143 -191 -112 -113 -202 -209 299 -102 407 35 86 -193 136 -262 79 -313 182 8 -145 130
3970 130 225 -70 -2 -192 -138 172 -248 411 -175 45 -218 81 -23 114 -161 40 9 247 -110 214 -214
3991 -214 52 -10 -218 198 -147 150 -33 -18 50 -3 144 109 -107 45 -246 233 3 202 47 7 -102 176
4013 176 -23 -6 77 -4 95 -66 130 -201 132 -372 34 33 138 -167 48 -90 27 11 112 -337 136 -200
4035b00Q2J60k34J97j87K94k45L30l42J35k14L78l55M32l73J52K0J8l50M17L5
4056A50j37j65R5L13l28J10l11O20m20L78n35K64k10K07QJ45k94L68l73J15j34
4077a34K04J55l67KL31k13L9r2J46J3j79L00m39N78n43J80k82K63k62M40k85J52
4099GL1J23j93J75l8m74L75r2L43m60M22k29P1l68L20m3K58k43k9m2J43k19O7
4122i5L23l09L07m34J76n2M4O2K00l81J42j9K85m98M23L1n6L1j53K71o8j89N0
4145I1j68K37j75j21N28n98N00q11N62k30L27k45M70m00K42l62P4j8K60l31K96
4166A28j04j52K81k97M51k35k42mM35k97L0k02M70k00J92k05j7j78L17pJ42n46
4188b40L89j51J9j05k5k1j47K47k1K90o75O51m16M72l82P7p8J57j34J73J23k72
$$ plain form
4035 -200 -118 42 -192 5 -182 112 -133 197 -145 -10 -224 154 -201 231 -142 10 30 48 -302 115 150
4056 150 13 -152 -57 256 -72 38 -273 347 -73 305 -230 34 -176 31 39 184 -110 258 -115 0 -134
4077 -134 70 225 -142 -140 191 -22 17 -75 71 84 -95 205 -234 344 -199 -19 -301 -38 -300 140 -145 7
4099 7 38 161 -32 143 105 -369 6 -86 257 -203 219 -10 61 -307 13 -30 228 -15 -44 -86 57 -162 -95
4122 -95 228 -81 226 -208 -32 -84 -40 22 222 -159 -17 -36 249 -249 174 205 149 180 27 298 230 41 91
4145 91 -77 160 -15 -136 392 -206 294 -517 45 -185 142 -103 367 -33 209 -153 -79 -97 163 -168 128
4166 128 24 -128 153 -144 307 72 -170 -174 261 -36 -6 -208 262 62 254 49 32 -146 171 164 306 -240
4188 -240 149 -2 17 -88 -113 -134 -281 -34 -55 235 -440 211 -205 267 -115 -38 -116 41 -93 80 203 -69
4210f9K6j89N10k34k5LQ2r2J25l06L3m7M92k96m6m9J54j30K57l93J94j94L51j22
4234C5j59K49l0K9l64M04l19J93k73K11R2m3k07K01k6J77l34J25J77J53k20k01
4256a30L00k95K03k35J81k43L53j2J26l30N9M0R6n05M17j89J85k42L84k84j56
4277b77M15l54L78l65K86m4mM6j31k42N08j92K26l63L31l18K86l85J63j53K08
4298A9M2j82J2K04r7r0L2J0K42j75K18n32O48o02L67l24J30J29K7M7j90J96k82
4321a51L78k44J09k55K46k94L00K33l31n8J19j49K63j7j23l5o2R1jP9j38m2ML26
4345B48k32K81l14j6j9K61k23l3j9K25j38q4K93j37j20NLj90L02m5L4k31J13n4
4369i0L57l32J89l69K39M9J89l55M8Q6j30J81r1J80j49o9N1l3j87K51N3J06J32
$$ plain form
4210 -69 -43 -232 278 44 19 22 104 12 137 -169 -136 -183 309 13 -33 -82 72 -58 199 -194 0 -194 157 35
4234 35 -124 125 95 124 -240 164 -155 38 -235 -24 68 25 -182 19 -7 170 -164 -39 138 291 71 -130
4256 -130 170 -125 78 -157 24 -219 134 122 248 -82 -23 17 113 -392 25 -164 21 -221 163 -121 -277
4277 -277 138 -216 162 -203 83 39 35 81 -50 -292 216 24 250 -113 218 -100 186 -199 -36 -189 19
4298 19 61 -121 -109 95 -2 -92 -60 -50 192 17 235 -297 351 -251 116 -208 -78 51 78 125 -65 131 -151
4321 -151 227 -17 92 -163 83 -211 89 322 -9 -67 52 -97 166 149 26 -9 -71 20 19 98 -40 -82 -78 248
4345 248 16 297 -17 -33 -52 209 -14 -47 -66 159 21 -63 230 93 -27 -22 -19 -209 93 48 82 -149 -36 -90
4369 -90 267 -65 124 -245 -6 43 232 -123 -75 11 -119 62 -29 151 2 -67 -16 -49 -236 15 68 174 306
4392C06m49j10M85l95K54j32L32l20k2l9q3J51J06l4k14M6q8K93j25J84k95J68
4414A9j72J38J11j51j86M93m15K48l33J48J51k2k02J35L6k7j45K41k7j7N1j85
4436a11J19j66K31r2J79l66M34m98L65K1J57j79J78j53m75N55m24L85k96K48l50
4457b38L85l20M61m44J56RJ96l25K91k19O4l7P0j18J36k92Q8M31n12L01k22J90
4479E1j27M05l99J34j91J62r5J60m15M08p1J8m4j7j04K02p0K90m11N6K1M6oq1
4503g8K0k04N40l47J67j82K26k38J4O2o1M10k56J8l21L18j60K26k80L31l5J62
4525C32l90L81k82R1k3J41m18L46j38l7Kl00K77K42J61l85K26j55K90l06j6j75
4547a36J57k28K81j97K61m26M29J8o3j33qO7j09J39k22N98o70J79J35jl53M11
$$ plain form
4392 306 -143 -253 232 -163 91 -41 291 -29 -51 -90 -173 -22 84 50 -164 -118 -206 87 -38 146 -149 19
4414 19 -153 -15 96 -55 -241 252 -163 85 -248 -100 51 29 -173 -38 -2 -29 -174 67 40 23 74 -111
4436 -111 8 -158 73 -19 160 -206 228 -270 95 116 273 94 272 119 -356 199 -225 160 -136 112 -238
4457 -238 147 -173 288 -156 0 9 205 -120 171 -48 16 -21 49 -69 67 -225 -137 294 -218 83 -139 51
4479 51 -76 329 -70 64 -127 35 -60 100 -315 93 22 40 -4 -21 -125 77 7 297 -114 -58 -37 9 3 -78
4503 -78 -58 -262 278 -69 98 -84 142 -96 -82 -20 -81 329 73 91 -230 88 -72 154 -126 205 170 332
4525 332 -58 323 41 132 109 250 -168 178 40 3 5 -295 -18 224 385 0 226 71 361 55 39 -136
4547 -136 21 -207 74 -123 138 -288 141 159 96 -37 -45 22 -87 52 -170 428 -242 -63 72 71 -282 129
4569A29m77N98j70l98K50K83l92J33J86j54Q7j78J74l64N27j80j6k60N00m14K90
4590A54j59J07k01N3Q1p5M7j50J09o8P3O6O1l30M22j49J15j91K33m39K85k71K95
4613F8k9m5k0J16l4K9m7r6Q7j96J00r7J59o9L43k35n5j44K67m5j77Q7q0K8j90
4638b75k0M06j80L09m98N62o0j17j74r8L37j53k5j66L96n58M97m26K25L8j62k5
4660a67L48k80Q0N8k1P7l4j37j18P1p8L72j42Q8o2j38R6J9l1n9q1J82Pn3onJj03
4688a16R4OJ35O2M9k77K38l90J15r6K78k19L44l99K77j36O0o0J02j29k4K54l16
4711a48Q7m2K24j76J70j35J18k05J82j96j12M14p5j85M6m0K55k43j5J26k00M2
4733a08l9L32k69L68k94R2k9k14J92P8j55j63J40J83M8J18j68j53m9j12J99m9
$$ plain form
4569 129 -348 250 80 -318 -68 215 -177 -44 142 -12 75 -103 71 -293 234 54 38 -222 278 -136 154
4590 154 -5 102 -99 -46 35 -40 7 -143 -34 -102 -29 37 98 -232 190 41 156 -35 198 -241 44 -227 68
4613 68 39 -6 -26 90 56 85 38 -58 29 -167 -67 -164 -5 -74 269 34 -21 -165 102 57 -120 -33 -113 -85 -275
4638 -275 -295 111 -69 240 -258 304 244 127 -47 -145 192 39 14 -152 244 -314 183 -243 -18 20 -142 -167
4660 -167 181 -99 -19 39 18 95 61 -76 -194 -123 -201 171 29 117 55 -83 13 32 1 -58 -139 43 50 -3 -9 -14 -13 -116
4688 -116 -22 -16 119 181 230 -47 191 -199 -84 -180 98 -121 223 -176 101 -35 25 -35 67 -62 -86 168 -148
4711 -148 -61 -103 121 -55 115 -20 98 -107 75 -121 -233 181 106 -79 -33 -73 182 -61 -76 50 -150 -108
4733 -108 -147 185 -84 284 -10 82 53 -161 31 109 -46 -209 -69 114 162 280 112 -41 -90 -202 -3 -52
4755e2R4kK53l19J2J43n8K2j47j04K01P2Q0k53J35N6j21j47N5J60p8L06m27QL17
4780B06r3k52J00n1O1p1J60N7J18m28J31K98l52M68l71R0j53R7j11N4K4K42l74
4803a50K88j09j51pK27k44M65l45j54J63K7j7J3k5J38J83m07Q9L3J16k50J13P2
4826F8J31l52L51J36k64j85Q6J83o7j02K35k01m0R6J85k09Q0R7j80k71K56J22
4848A55j99K15j63J38r0P2j96L0J72k26J2K14k07K48npPj34M0j95M0J39J69m44
4872b15L31l42J34L53k57K36k93Q8q1j1k6n0J58jj91J44l0J99k18K0k3J23j8J22
4896A52r7M1J58k63j92R9J31l17K95q3J72O1L8k49J52k78O5l2L04j36j48P3Q3
4919B9l5o9Qo8J46k2J12k12J16j08K21j85L76k70Q2j79J79j61K93m99N31k65m3
$$ plain form
4755 -52 42 40 293 -26 -14 129 71 93 -54 -158 43 115 195 -58 77 133 12 -135 -80 80 2 308 -119 -111 206
4780 206 113 -139 -39 -90 -29 -100 60 117 235 -193 -62 236 -116 352 -19 71 -82 15 -96 -42 -18 224 -150
4803 -150 138 29 -122 -129 98 -146 319 -26 -180 -17 10 -7 6 -19 119 302 -105 -16 17 133 -117 -4 68
4826 68 199 -153 198 334 70 -115 -29 154 87 -15 220 19 -21 75 260 51 131 228 48 -223 33 155
4848 155 -44 171 8 146 56 128 -68 -38 134 -92 -80 134 -73 175 170 163 170 36 76 -119 -79 60 229 -215
4872 -215 116 -226 -92 261 4 240 -53 35 -46 -57 -83 -133 25 24 -167 -23 -53 146 -72 -52 -75 48 30 152
4896 152 55 96 254 -9 -201 -102 29 -288 7 -76 96 157 195 -54 98 -180 -115 -147 157 21 -127 -54 29
4919 29 -6 -75 -67 -135 11 -11 101 -111 5 -103 118 -67 309 39 121 -58 121 -40 253 -246 285 20 -23
4942b3j26M05m54Q9m9Q6K06l02P2J85o3j24j24J55K94m61J92N4P6k80J89l00J27
4965a76J35N2j72Q9M7mn7m8K84l5MO3k1P3j87N9k2o9J15m6j46J43M1K07m31L72
4991B70k32K13l70O3J52m9qN2j02n5L09jl34K22J61l76K98j22j9j00j14J29Q4
5014G1J30k48L80m69m1K70O4j82j38M30l37O8j23L93l4m24P6J01K50m56K86j83
5036a16mO3n4K73m5k32K87p2k9j66K35j17J7K2j3j83Pj59K14N6K59k9n22N16j12
5061I6J17k89L02k78J3m0K45j55P5l40L22P9k57j11K24L01l97J37l56M29k27K53
5083A43k44l5R4M0j47L28r3P6p9k27m3M43l31N5r8n5O3R3K16m24J83r9L51j79
5107C1j46J87k86oQ8J64j07L33r3j74j4O7k56M01j98l1K05k80J59R7j71J5lk0
$$ plain form
4942 -23 -149 256 -198 -109 -158 -72 134 -168 -96 89 26 -98 -222 -67 227 -234 -42 12 88 -192 -3 -303 -176
4965 -176 -41 11 -161 -72 -25 -29 -86 -134 150 115 119 182 161 234 47 106 84 15 130 84 -62 81 122 329 -102 270
4991 270 38 251 -119 -56 96 47 39 91 -11 -66 243 242 -92 130 291 -85 213 91 72 -28 -142 -13 71
5014 71 201 -47 333 -136 -177 93 157 -25 -163 267 -70 -2 -125 268 234 -190 -114 -13 237 -219 67 -116
5036 -116 -120 -57 -111 162 117 -115 172 100 71 -95 140 23 40 62 49 -134 -127 -286 -72 -16 243 214 -308 208 96
5061 96 213 -76 226 -52 -39 -79 166 11 86 -254 68 147 -110 -221 3 304 -93 44 -312 117 -110 143
5083 143 -101 -136 -42 -2 -149 179 86 162 83 -144 -187 256 -75 -20 -118 -173 -110 -17 199 -225 -42 -141 210 31
5107 31 -115 72 -214 -220 -132 32 -75 258 165 -9 -23 44 -212 189 -9 -40 165 -115 44 141 -30 -15 -18 -38
5131c8O5j30J22O2Mk31P2N9P5j3J77m13J12n3K82j74N3N9j23n1L5j14L19l23J65
5156bq2l2jJ52j69k6J3R4K02j97J65k86L79j99p9N5J7k63L36K1j88l3K97q3R9
5181A90k87l6O6k8N45k86j62K4N6l98M70m7J0l09N18l40k20K27r0L30k94O0J1
5204A0n4P5K9p2K54l65K07k27L23k87J60j0N4K1o8j95R4p3Q1J89l06J04l06M99
5228A37j55n1q7L78l47L33j69J10k52O5J65J16j23k73P8J04j25P4k31J59L7k21
5250b78K32K9op5K02N6m8N6j89m5J07l24M55k73J90J74l5k27L0N1j40R5r2j04
5274a59J22J04j35J57M5p9k01J92j38n8L81j46Q5n3j36j74K00J9j95K94kj06q0
5297f3K30L4n34M45j74J81k30Nj23K99MM0l25p5K22L2m3m3R5K07j53j0J25j16
$$ plain form
5131 -38 27 -103 19 81 85 -146 -74 -15 60 47 224 -189 -77 -130 152 -22 31 90 -33 -84 -49 -163 156 -167 -2
5156 -2 -84 -116 -117 35 -134 -160 -147 -53 149 -48 117 -169 210 11 -68 -13 4 -259 77 98 -90 -123 174 91 190
5181 190 -97 -133 -67 -95 450 164 2 26 82 -316 154 107 117 -192 326 -14 -234 -7 -97 233 -61 -1 10
5204 10 -44 31 60 -12 242 -123 84 -143 180 -107 53 43 97 118 50 -145 -51 -124 -43 146 -160 -56 -362 137
5228 137 -18 -69 -156 222 -125 208 39 149 -103 -38 127 243 120 -153 -75 29 -96 -22 -253 -94 -57 -278
5250 -278 -46 -17 -23 -98 104 160 112 168 -21 -66 41 -283 172 -101 89 263 228 1 31 82 -58 37 -55 -159
5274 -159 -37 67 -68 89 134 55 -146 46 -92 -150 231 85 170 117 -19 -193 7 26 -169 125 123 17 -63
5297 -63 167 201 -333 112 -62 119 -111 -106 -229 70 74 114 -211 -286 -64 -32 -75 -118 -23 184 31 21 146 30
5321C0L8n0N0n6K44k80J64j39M6o1P1Q9k62J78j93M54l98J4O5om5J38K2J14j68
5346E9K51l48J42k99J70J9r9J42n1n9J43l5j80J02j24K69j10qk08M07k20OLK02
5370A74k93L2R0n0NL36l84m4M44m71K31k93P1o6L59j67K05j94r2K02O9n8l4m18
5394c46M33l15J13q6M07j05J0j51k13L30l24L30k42L45p5J35j59j03l23L79J10
5415A50k06K05k03n4n9J31J58l74J64M80m53n4J78m1J37J66m31N4L8K6j55J22
5437b1M8N2l86K80O6k20K37k18K16j86K1p2L05l02R1r2L26j62K6j39K93l51L87
5460A99j25j5L4o2q0K69m03J65n2N8p5K20n8j32O0k6K52n64N95m99J51k22K40
5483g0j52N07j17P4l44J16m0M4k93J76K42l59OJ55n3J11k8M1r8O5J84P8j92JK7
$$ plain form
5321 30 68 18 68 12 256 -24 140 1 47 -14 57 146 -116 62 -131 323 -75 -61 4 -2 -47 91 113 227 59
5346 59 310 -38 104 -195 -25 -6 -105 37 -14 -73 70 35 -145 -43 -167 102 -8 -16 -224 183 -37 -31 -28 174
5370 174 -119 -87 3 -47 -42 294 -90 -134 310 -161 70 -223 -152 -218 141 -26 179 -15 -107 95 164 106 72 -346
5394 -346 87 -228 -115 -201 206 101 111 -40 -253 77 -247 83 -159 186 111 246 87 -16 -339 40 150
5415 150 -56 149 -54 -108 -167 -36 122 -252 -88 392 -61 -115 63 22 159 325 -106 -52 -14 12 -143 -21
5437 -21 27 79 -307 -27 39 -181 56 -162 54 -132 -111 -183 122 -180 -89 -181 145 -17 9 -130 163 -188 199
5460 199 74 59 93 31 -49 220 -183 -18 -70 -12 -87 133 75 -57 3 -23 229 -335 260 -239 -88 -310 -70
5483 -70 -222 285 168 242 -102 14 -26 18 -275 -99 143 -216 -210 -55 -108 3 -25 16 -82 -17 167 245 53 54 81
5508H1n9j93P7J12N9k80L08Q4j75J4R0j72mk3L43m80J11J03N0j7j22J74j76R6
5532AL9P1k32N5j16J75j19L54k25L82l35N7j39PL6N4K19k35Mj14J12p6Q1q7J97
5557A66l91L25o0LJ45j58J93j25j25K8q6J49R4j46jJ7jj36r7L9N7j04L39m86M92
5582A31M8K8j65N6o0oj24L4J63k98K70l63M65m3j55j36J92p1n6N9J52J4k7j16
5606hK16k84L40k69j53J37p5J78k55M9kL29k82j00J89J71k48J99j80Qj22J94k95
5629b63K96K2k00J29l3o4k4k5K04l9l2K69m01M20m18J96j58j20L19J13m40k1J49
5652a21j5K39K19l28P9m2p8J40j38K47j56j8p7j55J3K31k94J61P0j23Q9L9p5J63
5676G0j8P6k80n5K26j57J18l6Ql63L90j07J51J7K25n13L09j47J76k11J67J9k38
$$ plain form
5508 81 22 -171 -94 18 77 -203 105 189 14 28 118 -54 -58 -81 262 -218 -107 -4 46 29 -93 81 -95 1
5532 1 40 111 -121 -66 -182 -7 -126 228 3 385 50 107 -32 -25 11 65 284 49 53 -61 51 -25 56 -31 166
5557 166 -225 100 40 43 188 30 223 98 -27 1 -85 64 158 12 11 28 27 -109 -206 -167 -110 -214 125 -361 131
5582 131 179 207 42 98 38 32 -92 -58 105 -193 77 -286 179 136 -19 -155 37 -34 -90 -31 121 135 108 -8
5606 -8 208 -76 264 -5 -158 -21 -96 82 -173 -124 -126 203 -79 -179 10 181 -67 132 -48 -40 -162 32 -263
5629 -263 33 55 -145 -16 -49 -113 -137 -162 42 3 -29 240 -161 259 -159 37 -121 -241 78 191 -249 -270 -121
5652 -121 -136 103 322 -6 73 31 -47 93 -45 202 46 28 -49 -204 -191 40 -254 -93 -23 -146 -57 -18 -93 70
5676 70 52 128 -152 -207 19 -138 -20 -56 -48 -411 -21 -128 23 40 265 -248 61 -86 90 -121 46 65 -173
5699a73J99j19J84j69J87j93K25l50L68l11J75q0K27k38J27j61J75N8n7k8j80
5720a34K8M5N6J05L8r7Olj6N4J3j99J22j68J98j97j3K56j8j62M1J87j43K4J75
5745A98o2j11j78J81K5j40J64j02N4j28rm7K74j21N8k77J00J77m0o5m7m9J60j3
5769Bo3K80mnk08j1K03m5N5l2j99J08j90%J44J69j39J34k01O3r8J23J49l33N23
5794D25m73J68k66k0LL59j07J9j46L4Q9j59N3K78l84kJ78o5J05j4l5j96J97K4
5818F5k44L1J70r8J45k19L94m94L37r2j81J65K36l50J92J09k10o2K32l1j9p2J72
5841A76o0j99J13j02J76m0j53R0L4ll6M3K3m1K0L6j40l2R5J83k68Q9p9j01K85
5866A09k94J98pL59k96r1p6J13K6j74K20k2j0k9j78K11o9J02J39J43l74m0L1j02
$$ plain form
5699 -173 26 -93 91 -78 109 -84 141 -209 159 -152 23 -57 170 -68 59 -102 73 131 74 46 -134
5720 -134 -106 -61 -5 100 138 41 47 44 28 82 95 -104 18 -150 48 -149 -162 94 76 -86 -45 142 -1 23 198
5745 198 136 25 -153 28 53 -87 77 -25 29 -99 -108 -155 119 -2 56 -221 -121 56 16 -49 -96 -145 15 2
5769 2 -61 219 215 210 2 -9 194 149 204 172 -27 81 -109 -109 35 204 65 199 -2 61 -37 86 235 -98 425
5794 425 -48 120 -146 -166 -163 196 89 108 -38 -4 85 -74 -21 257 -127 -129 49 -16 89 75 40 -156 41 65
5818 65 -179 -148 22 -76 69 -150 244 -250 87 -5 -186 -21 215 -135 57 166 -44 -106 126 95 76 4 176
5841 176 116 -83 30 -72 104 64 -89 1 35 32 -4 39 62 21 41 77 -63 -95 0 183 -85 4 -75 -176 109
5866 109 -185 13 6 365 69 -22 -98 15 41 -133 87 65 55 26 -152 59 -10 92 231 374 0 -40 -9 -111
5890a11o1M00m13O6J71j17K90j99K08l27J74n4J3l0P7k00J68Ro7j58j8M30l06
5913e5L5J41J80k95OQK09k77p4N6ok60N42j94K29p7j95j29O2N7K72l15K31j68
5937a7L7N6j66J11j38L9j40L05Q4l85J8rK73L2k66K96j78J20O6L6m25K85j20M6
5961d0J26q6J22p7J29l67JK77K16n23K66l40K24J46k36K70L0j82K03o5k26L78
5983B46m07L2J72J89k04j14N7K88n42K58J41Ll98K35k3j18L3J70k50J61J47R7
6005A73O2k64K09q3o7j59K25l9k8Q9k38R6L30m42K53j67J85J3k13M5N9J65k21
6028a7j29L51l66R4K28n0J62l45K49m30j3M41j07k46K8K23l05L09j34R5N1m2j78
6051a31J46j34J12j2K50l43J16J76j09j56K43k20R9n0jK37k60J19l42L60j72J28
$$ plain form
5890 -111 -172 228 -185 -119 52 -65 225 26 234 -93 81 27 40 10 87 -113 55 64 -3 -161 -179 251 -55
5913 -55 -20 121 301 6 12 20 229 -48 -122 -66 -72 -332 210 16 245 168 -27 -156 -94 -37 235 -80 151 -17
5937 -17 20 76 -90 21 -117 -78 -218 87 171 -214 -196 -205 68 100 -166 130 -48 72 138 174 -251 34 -86 -40
5961 -40 86 0 122 45 174 -193 -192 85 301 -222 44 -296 -72 74 -162 108 138 -44 159 94 -132 246
5983 246 -161 -129 43 232 28 -86 -29 259 -283 -25 116 119 -279 -44 -67 -185 -152 18 -232 -71 76 173
6005 173 235 -29 180 97 30 -129 96 57 29 118 -120 -24 306 -136 117 -50 135 148 -65 -20 39 204 -17
6028 -17 -146 205 -161 -67 161 111 273 -72 177 -253 -266 175 68 -178 -150 73 -232 77 -57 38 89 47 -131
6051 -131 15 -119 -7 -19 231 -112 4 180 71 -85 158 -62 37 -13 -14 223 -37 82 -260 100 -72 56
6073E6j51m8K09K10k93L78o62M18q0J0L5J24j98N0j37L19l06J04l0k11N50o37
6095b90L47j93q0J99J50j53rj6j13J8J07K52M0l84J80R0rj36j51nl8N01k74l8
6119ej37J80j78L13j99k6j98J71k22M43m98L03Q5k27J83K7R8j70J07m8k5j85N
6142b03J45Q3j46K59R6k78K54j02j50qj65K03k20J96J41j44j6mK8R9n9J01K33
6165C43k77Q5j53j47j58K98o7L22j71L4j83Q6J0O3q5r4O3j11K26j28O9j7R5o5
6189C8l9j20L39k86j00J73q6l9J35k1n2P9N9K67m69J8J31O6k56M94l23q3n0J25
6213@l0J37j37K2K20l23J71k58L45k39j2J46K2k07Q2J32j54P9J80k75P9m1j58
6236b19K5L09l6j41K24m32L14k70Q6K04oK77k75n6j24J32J78m83K43P2p2k3N8
$$ plain form
6073 56 -95 -143 66 276 -17 361 -301 117 37 47 82 206 8 58 -79 240 -66 38 8 -203 347 -290
6095 -290 57 -136 -216 -17 133 -20 -29 -45 -158 -140 -33 219 259 -125 55 145 136 0 -151 -156 -194 307 33 -5
6119 -5 -142 38 -140 173 -26 -52 -250 -79 -301 142 -356 -53 32 -195 -12 15 113 -57 50 2 -23 -208 -203
6142 -203 -58 25 -121 138 234 -44 210 108 -42 -50 -215 -12 -232 -36 105 -39 -55 -59 -31 68 9 110 343
6165 343 66 151 -2 -149 -307 -9 -76 246 75 109 -74 12 22 85 0 -94 -31 -142 84 -44 25 8 103 38
6189 38 -1 -121 218 -68 -168 5 -81 -120 15 -6 -58 21 80 347 -122 -104 27 93 -163 331 8 -75 -125 0
6213 0 -30 107 -30 -8 212 -111 60 -198 147 -92 -104 42 64 -143 -61 71 -83 -4 176 -99 -20 -61 -219
6236 -219 -194 115 79 -62 162 -270 44 -226 -140 64 58 335 60 4 -120 12 190 -293 -50 22 -50 -73 -15
6259a5J31m2R5j22J42k00J41k16K25j10q6k1q5nN0L06j11j70J00K19j09k92J86
6282A1jo1M2J22j38j06L27j08j51kJ64l75M06Ql54J34Rj14m4K32r6J30Q3p7nk35
6308a99N2K09J87l2m10K88q8k26K16J77j84j61N9L40k31k06K42kj02n2L8n1K15
6331G9l11M04k59P2j9J01P1pp9J81k53K45l04jM7k4Q1m4J07j04J93O6j8k83M03
6356C44m16J76k30K30k11K00j53j08j30M25k11J49M1j09J79k87N3O6J19k55J77
6377D9k03L8k85J33M62k18j97K66k69M15k40r7J53J47j68j0p2K3J98j70J22l01
6399b24M79l98K50j59J41o2Lj32r8Q5m8K76l82j5K32J04p3K72m48PJ55K03j12
6422E6K4j25J71j52J3Oj29J9J69oM0j40L34m50J96J60k19Q9L1J2j01l2j53K66
$$ plain form
6259 -15 116 74 169 47 189 -11 130 -86 139 29 -57 -78 -163 -168 -118 188 77 -93 7 226 117 -175 11
6282 11 10 -51 -9 113 -25 -131 196 88 -63 -65 99 -276 130 138 -216 -82 -73 -187 -231 1 -95 35 118 41 36 -199
6308 -199 -147 62 249 217 -193 95 7 -219 -3 174 -10 -171 -112 228 -3 -209 33 31 -71 -123 -85 -136 79
6331 79 -232 172 -87 -15 -34 67 138 131 52 233 -20 225 -79 -80 -33 -57 24 -20 87 -17 176 242 224 -59 344
6356 344 -72 104 -126 104 -107 93 -60 -168 -298 127 -84 65 106 -3 176 -111 -58 8 127 -128 49
6377 49 -154 -116 -401 -268 194 -24 -221 45 -224 191 -49 -146 7 154 -14 -24 -96 -73 125 -45 77 -224
6399 -224 255 -143 107 -52 89 27 30 -102 -200 -115 -163 113 -269 -284 -52 52 -21 251 -197 -190 -35 168 56
6422 56 80 -45 126 -26 -13 -7 -136 -117 52 46 86 -54 280 -170 26 186 -33 56 87 99 -2 -34 -187 79
6446G9k71K53R0k17jL15k00J14p7j08j77K49r6M8K29l37K79j65L1j66q9L27J86
6469B96k67N8j31J40k82L13j95L64j37j90J79r9nj45K36k86K2j1n1K7J93J2m9
6492hk09M10l12K29o8L5N1j6j81n7J62j11N3j42Q5R9J94r8n3j75R9k02R7j15K62
6517B9r2QK28n64L11R8M3k6P3N2j80pL8MJ98l71J68j9M5m0O9j22P8k13j52K39
6543a05K76j52J24J7j93j20J50l9j67K73j45J31p9K46j25j90q2O1R7K13m5q0o8
6566bo2LK16k22K58P6m82L69k10R2j20j58o8L79j5K8k98M05k69j9J46M0n6j08
6590g7K95k00k08J26K56k36n7K03R3k52K19k47K33j47L03k78J72j29j97R7J71
6611A40k20P9R5j16J4N3K75m79K63j80O5L2n7j46K50K55n18L96l37J21l1k0M4
$$ plain form
6446 79 -192 61 151 -66 -67 248 48 162 85 -23 -200 49 -47 1 230 -107 172 7 38 -128 -217 110 296
6469 296 29 87 -44 96 -186 127 -68 296 159 -31 148 49 44 -101 135 -151 -129 -140 -191 -164 29 41 -8
6492 -8 -217 193 -119 110 42 77 128 112 -69 -126 36 -75 -22 -164 -79 20 214 116 63 -112 -13 -215 -118 -233 29
6517 29 -63 -55 173 -391 -80 18 61 35 108 160 -20 -27 11 15 213 -158 10 -9 36 -4 65 -57 21 -192 -344 -105
6543 -105 171 19 143 160 -33 -153 -3 -42 -209 64 -81 50 -29 217 92 -98 -180 -119 -22 191 146 66 -2
6566 -2 -64 -61 155 -67 191 267 -215 154 -56 36 -84 -242 -310 69 54 82 -216 189 -80 -99 47 87 31 -77
6590 -77 218 18 -190 -64 192 -44 -101 102 195 -57 162 -85 148 1 304 26 198 69 -128 -31 140
6611 140 -80 -1 94 -22 -8 45 320 -159 104 -76 -11 21 -36 -182 68 323 -195 201 -136 -15 -46 -66 -22
6634b2m4K1J15m3l8j12j15L20m1L0P5l99K18k61Q9L61j79m9O4n8j16QK15LJ10
6659A52R0l31N4j20L01M8r0k90L75j38P6KQ9o24L66J42l77L40k84L32k96K50k9
6682C8K04m72K55j38M35l38J11j51K9n9O1J81j51J9J4l9K77m27R8Qj04K15j08
6705d2L3K55r3j76J84j68R0q9J04k25R2rLnk5K06j25J53k07m6l0J20j47Q9j95
6730b53L44o0k77K97j49Q8k38N38m21L29k37P6m0j50K13R0k53J46j44L44j50k06
6752a13J43J17q8J6N2o2nn0j69O6J23j29J96k5J33k8j99J14k84K70o4J61j31N3
6776I7J64m00K11l9m7Q0k2Q3j44j93M14j08R5k36j98J93o6J86l9r6j90M17k02
6799d0n6M6k70K85R9j1q1L6j36J36k21L42p5l07Q3K62k87L19R2L9l81m1K7J65
$$ plain form
6634 -22 -66 -45 70 27 -11 -123 -238 82 41 71 146 -253 -35 -296 -207 154 -25 -74 -10 -68 -184 -176 39 42 152
6659 152 242 -89 -35 -155 146 194 104 -186 189 51 127 129 218 -406 -40 102 -275 65 -219 113 -183 67 38
6682 38 242 -230 25 -113 322 -16 95 -56 -27 -86 -25 156 5 24 38 -1 276 -151 -53 -45 -149 66 -42
6705 -42 -9 246 153 -23 161 -7 83 -6 98 -127 -35 -44 -41 -46 -71 135 10 163 -44 -90 -120 0 -147 -58 -253
6730 -253 91 31 -246 51 -98 -10 -248 290 -131 198 -39 37 -3 -153 60 150 -103 43 -101 243 93 -113
6752 -113 30 147 59 75 127 65 60 10 -159 -93 30 -99 97 72 205 177 -22 92 -192 78 14 175 44 97
6776 97 261 -139 72 33 -14 66 44 127 -17 -210 204 96 191 -45 -243 -50 -116 70 31 -65 -255 162 -40
6799 -40 -96 -50 -320 -35 64 53 -28 8 -128 8 -213 129 54 -253 -170 92 -195 124 216 255 -126 -167 -140 25
6823B5Kj16J50r8J05j56J69k17K13O1Ql79K70P7j39J70L2pk68o5P5J71k36K2J69
6848C8j01j64M6n8L16r1qj67L77l27L38j54N2k05J52j42J45R8j94m7N4J44j56
6871e4K21n07L54l33M00Rj52P1J92l4k32J56j0k28J21OJ61p2j28M04k17M2p0j7
6895H3k73L8o5J63J36l3j91J83j08j54K34K7J16j72qNj01J74j96J30j05P4J39
6918I6l71L67j18J5l8K00k25J42N1nr2m0j39J39j71J26M6K86l47K00j36j5J06
6941G7j98M48j95O4k03O0r9OJ56P0m7k93K89k3j13j29J96l21K12N6J46j02J11
6964A68l57L28j86K47l52L37l1k36K50j24j85L28k31K18q3l17K32P7M4k78J55
6985Dj00K74j88j5j34M8l9J30k07K93k52K30j57L17l26K60p6j46K42l70J84Q5
$$ plain form
6823 25 27 -89 61 -37 68 -88 81 -136 77 138 146 -233 37 114 -25 145 177 170 -98 -163 -88 83 -153 -131 38
6848 38 -63 -227 -181 -239 77 -14 -22 -189 188 -139 199 45 97 -108 44 -98 47 145 -49 -96 -42 102 -54
6871 -54 167 -340 14 -319 81 90 -62 9 201 167 -65 91 81 -147 -26 -20 141 69 -59 345 128 170 100 83
6895 83 -190 -152 -217 -54 82 49 -142 41 -67 -221 13 40 156 -16 -24 -19 -120 54 -142 -12 -117 -43 96
6918 96 -275 92 -26 -11 -49 151 -74 68 119 114 22 -18 -157 -18 -189 -63 -17 269 -78 122 -14 -29 77
6941 77 -121 327 132 196 -7 53 -46 -40 116 186 139 -154 135 112 -1 -130 66 -255 -43 13 159 57 168
6964 168 -189 139 -47 200 -152 185 154 -82 168 44 -141 187 -44 174 91 -226 6 83 127 -151 4
6985 4 -96 178 -10 -25 -159 -111 -150 -20 -227 66 -186 44 -113 204 -122 138 62 -84 158 -212 -28 57
7007E7r7l62K90OK64k04J15K5j48K5K2P6q2K26k02J62q4R5l1k19o1K30k24K17
7031I6j44rJ60j27L5j89K73o5qL5j22J38j01j64J73j35K81j02l37J39L08l01K81
7054A15p9l7q2K27p8k17L99k54j0K87p9l22J01j03J63j73K85k23K04k66M33m85
7076a94J13K82j07j0j13j69K75J01k77L47m06J25MJK3%n7J81j62p3K82l17K85
7099A34pj16n3o1M9J70p7r1Q9m5m6J63l60K77j1q9L47m33J90Q5o9j4R6j46L3K17
7125B32l19O6J24j29J43k58J10Q1P2k40L61j38k65L4L31k30L17k07j12J74k78
7146a31J13p7J52Jp6n9K00l39J70m35L65J38O3r8J82j81J2j07Q1M00k14p4OM1
7170A33k18O2l10N47k66J5L7Oj0j04p9N7J18K23j00j38O2k26O1K52o1l08J18R2
$$ plain form
7007 57 -40 -402 -112 -106 158 -46 69 94 -54 -29 -7 69 -13 213 11 173 89 184 153 -66 -127 103 -121 96
7031 96 -48 -57 103 -24 11 -178 95 30 22 57 -65 73 -28 -192 -19 -154 127 25 -312 -173 135 -166 115
7054 115 36 -1 -83 144 66 -151 248 -6 -16 271 192 -130 -29 -132 31 -142 143 -80 124 -142 291 -194
7076 -194 -81 201 94 84 -29 -198 77 178 -99 248 -158 -33 -29 -28 -5 -5 -62 119 -43 -116 166 -151 134
7099 134 127 11 -42 -103 -54 116 39 -52 37 -8 -54 109 -251 26 15 -74 273 -160 30 115 46 32 128 -18 15 232
7125 232 -87 -21 103 -26 117 -141 -31 50 122 -118 243 105 -160 -126 205 -25 292 85 -27 147 -131
7146 -131 -18 -95 57 58 -18 -77 123 -216 -46 -481 -116 22 85 -13 169 -12 0 -107 -26 374 160 86 92 133
7170 133 -85 -23 -333 214 -52 -37 0 6 -4 -108 -187 -130 -12 211 111 -27 35 -191 -130 122 61 -247 -129 -37
7194c7k4K90j43j01O6k12L63J56j26l89J39M8n0J1J9O3k71M17m07J63j31J13N6
7217A3J15m75L12O2p9O8J29j56q5J33R4j38L53l98L21j09m43K66o1K33l09K9J38
7240A3L6k90L36j39K25L4m08L44j85k16L81k63P8k09L36j45J62j63k12L82j39
7261d2J62l47K24j77K48j96L08k40k14M96L2l88J23j65K56o1P9n4o0J77M7j72
7283C6r6M7J00j37L0K56k64J86K5k06J67P8j49O3J33k29J84l11M3L9J94l92J74
7306b9j0J14k32O8Q4O6j90J2Q2j25k7OPK05r1k9m6K99j34J6o0J62R8k35j28P5
7332d2P4r9J9m8o1J15P4j81K50p5q7Pk39O17j85J0k31K02K8k15J4Qj56K53j3n9
7358b0N9J33j4q1o5j68L90n74L70k19Q4rJ94o1k8j8J89l69L45j49K62k34k1m1
$$ plain form
7194 -37 -61 229 86 -15 51 -161 202 358 232 -157 -18 30 -20 -9 10 73 -198 219 -188 -25 -156 -43 13
7217 13 128 -347 -35 27 -52 16 145 -11 -96 37 131 -7 346 -52 269 160 -283 -17 -78 155 -154 -125 13
7240 13 49 -241 95 -44 181 215 -193 151 -34 -250 131 -132 -54 -263 73 -72 90 -73 -285 97 -42
7261 -42 120 -227 -3 -180 68 -128 180 -60 -274 222 254 -134 -11 -176 80 19 98 44 -16 161 208 36
7283 36 -60 -13 87 -50 -20 236 -28 158 183 -23 144 222 73 136 269 40 224 -87 -44 -5 189 -203 -29
7306 -29 -39 75 -157 -89 -5 61 -129 -117 -35 -160 -187 -181 -174 31 -60 -89 -135 164 30 46 -14 148 246 11 -117 -42
7332 -42 32 -67 -48 -96 -157 -42 32 -149 101 26 -61 -54 -293 324 139 149 -82 120 148 -67 -53 -45 -201 52 39 -20
7358 -20 39 172 158 77 12 -156 234 -340 30 -189 -105 -114 80 19 -9 -27 162 -207 138 -11 251 17 -4 -45
7382d5Q5J13l66k8M4J75q7M25k92Lp1l6l1k83K64J93Oj84p3M31l82L56m70Q0J08
7407f5Q6j32j21K12J98q7O1R4k16k18K01l76K29J16j18J10K32k23l3L09k81kN2
7430B8q1O8k23J69K73J00k89r1K25m18J44j91J27P7N6J81k59k5p0J52L79l46j64
7453a78J71J68j64L8j50J53r8l5N7l4K28k90k8J27j25J02J09m0j24qJ63j4jj98
7477a71L1L05m0j59J06j67K55p3L80n57K15m16N46k22J5m4K5l4k3q2K8K22k56
7500a16J48j72L43l64q4J59L47j05l57J96m6k4rQ3m3P2n9j08J20j61K64M4J50
7523B78l18M8q3j14J38O3K32j98M7K44l97mN6k11L12k31Q1J91J00l32K0J81J2
7546A15l8j94J6j56M59n11M38j34J31j4q9L7k88K18P6m4N4j47M0K5o6P0j51l1
$$ plain form
7382 -45 40 153 -213 -241 -197 -22 -109 316 24 27 -44 -80 -111 -394 -130 63 69 -115 -188 243 -139 217 -253 -173 -65
7407 -65 21 -111 -232 -20 178 91 152 246 30 -188 13 -363 -134 -18 -136 -26 206 -17 -50 259 -22 -24 28
7430 28 -53 15 -208 -39 234 334 45 -46 179 -239 -95 -286 -159 -82 -26 155 -104 -129 -199 -47 332 -14 -178
7453 -178 -7 161 -3 35 -115 38 -60 -95 -38 -72 156 -134 -162 -35 -160 -58 51 11 -113 -121 42 28 27 -171
7477 -171 -140 165 125 -34 72 -95 160 87 467 -90 125 -291 255 33 48 4 29 -5 -28 -110 -82 140 -116
7500 -116 32 -140 203 -161 -245 -86 261 156 -201 -5 -51 -75 -84 -1 -44 28 -31 -139 -19 -180 84 128 278
7523 278 -40 8 -75 -189 -51 12 244 46 93 337 -60 -64 -8 -219 93 -138 -57 134 234 -98 -78 103 115
7546 115 77 -117 -101 -257 202 -309 129 -5 126 112 23 60 -228 -10 66 22 76 -71 -31 -6 -72 -2 -153 -184
7570a84J80L7k17J88j72L34k23L5K3J5n35M61J3Q3k61n2M93m19K56J30J4k05n1
7593e7J01oJ33R1n29K78Q3j51M3K5L17m23J25j21K28j77K53k66N5M2M2j4J44k36
7617b0J10j81K68m1j17j99L75j37j78R8Q2p4O3J08k56K90j21j14Ol6j43J59K05
7640A47K3l55J25K20J63o25K51J11j48K36k97Q5j00L23j26pJ15l39Q3J38R1l49
7662b35J10K15q3p8LL6j76J40L4K4J89l14P8L2l8K8J12j73J70k05j20L10J47l23
7686a17K22OQ8q7j42L31l21j36J27j53K1L88k50Q6k35L24j50p4J81Q4k51R6j09
7709g1K9O1LPj15M9n6K11k43K49j17j88K81lk39K10J11j27j4k29J43j21L23k09
7733e5P8j11N5J29j61n2L61m79N29m58qJ87j6l67L78K66j59r7K6o3K1K0j27Q9
$$ plain form
7570 -184 -4 33 -184 4 -168 166 -57 -22 1 16 -519 -58 -45 38 -223 -275 218 -201 55 185 199 -6 -57
7593 -57 44 38 171 262 -267 11 94 -57 -14 11 328 -95 30 -91 137 -40 213 -53 2 44 86 72 216 -20
7617 -20 90 -91 177 136 19 -180 195 58 -120 -22 60 -14 49 157 -99 191 70 -44 -38 -74 -217 -58 147
7640 147 170 -185 -60 160 323 -302 -51 60 -88 148 -149 -64 -164 159 33 26 141 -198 -115 23 114 -235
7662 -235 -125 90 7 -71 -68 -32 -208 -68 -34 -10 179 -135 -57 -25 -63 -35 77 -96 74 -131 -251 59 206 -117
7686 -117 105 111 199 112 -30 301 -20 -156 -29 -182 -161 227 -23 63 -172 152 2 -72 109 193 -58 38 -71
7709 -71 -42 19 22 29 -86 -37 -93 118 -125 124 7 -181 100 97 -142 68 179 52 38 -191 -48 -169 154 -55
7733 -55 23 -88 -33 96 -65 -117 244 -235 294 -164 -172 15 -1 -368 10 276 117 20 46 -17 4 24 -103 -14
7757a4l00L76j24J58j18J94k01R5m6j7J19r8R3j63K01k40J63Q9j03m7J0n1j2m0
7781g6j7R5pR3N0m0R9k91K83m22L05k99Q1K34j95J6J23J68l81L30j08j07j37M20
7805B17l43J99j74J93j46pL8J89k31J68L1l11Q8K08o7k24J18j85K26K99m3l76
7827a33J31j96K00K8k39P1J43l26M84m5k15r8J83M7J7p8k5K17j79N9r4J22l28
7850b54L28n3PK0j07R6J05l62N08k22l57K91o7K55l23J0K46k06l6N8J23K14k93
7873a9M18n37K43k00K36k76J16M1j00J9k13K04nJ27r8K6J6l5r1j9J63L06l75K75
7897B22m6J8k03l3k71L79j16R8l4J72l8k91L38l68L62l62K32j35j00J62k4m3K39
7920A58l14J31r4J41j17R4k1j34L99j10j13k15K89l6Q3j01J22l15J35n4O4J30
$$ plain form
7757 -14 -314 62 -62 96 -22 172 -29 66 20 3 122 24 117 -46 155 -85 78 167 64 17 27 -24 -36 -76
7781 -76 -93 2 -5 88 138 98 197 -94 189 -233 72 -227 -146 88 -107 -91 32 200 -181 149 41 -66 -203 217
7805 217 -126 73 -101 92 -54 -61 -23 166 -65 103 134 -177 -89 119 52 -172 -54 -239 -13 286 243 -133
7827 -133 -2 -198 2 30 -209 -138 5 -321 163 118 -97 -195 -12 35 52 -26 -51 166 -13 46 -48 74 -254
7850 -254 74 21 28 48 -59 37 142 -220 288 66 -291 0 -67 188 -135 -125 121 -85 -121 -63 60 274 -19
7873 -19 399 -138 105 -95 141 -135 -19 22 -78 -59 -272 -68 -73 54 -44 -18 -2 -37 -128 -147 16 322 -53 222
7897 222 176 194 -9 -42 -313 66 -50 48 14 186 148 -143 195 -173 189 -173 59 -76 -176 -14 -38 -81 158
7920 158 -156 -25 -119 22 -95 -1 -22 -156 243 133 20 -195 94 58 141 40 162 -153 -18 -72 -8 122
7942A22K8r2j00J82q2j80K7n4K7J38k9o7J46p0r2K02k07N5j15R3J97k86L58j60
7966D1j19J20p9M2P9k6l3j41L28k13k0l1K01m89K81L9k05K03M5n9J9K09j70j40
7990a18K26M1n3j20K12l16K08Q1m6M3k00J37k49Q8K55j85K0n0J12r5n9J20q4j60
8014a92L59l56L02p4m0j64J72PM3p6J14k59K44j63l7J67J01j29N7j73P8J06o8
8037A9n6q1J94m7kk86J60J22K09j59K24q0j52K8j13K17k30J47k20K56n9j61Q7
8060A7P1j41j6J41O7j30j20K37L7j80j67J35o9pJ82j02o0M02k01J54j06j27j58
8083a41K38k44K25J89j20l33J42P6O9o4M9j45jK01%k59n2K31m25K49j8M15l30
8106d8OK6J68j12p6k4m1k0L5M6n8k4J63j04j1J82k53K58j84J83k48K11j30J47
$$ plain form
7942 122 150 58 -42 140 58 -122 -95 -149 -122 16 -13 -80 66 -4 -96 106 -101 -46 -161 -68 129 -157 201 41
7966 41 -78 42 -37 5 84 58 25 -116 212 -1 -21 -52 149 -340 -59 -20 -225 -22 23 -36 -17 192 22 -118
7990 -118 108 149 96 -24 188 -128 80 161 115 158 -42 95 -154 -66 189 4 24 -26 86 -9 -68 52 -32 -192
8014 -192 167 -189 113 39 -1 -165 7 14 57 -19 95 -164 80 -83 -120 47 148 19 76 -97 -19 87 19
8037 19 -37 -118 76 29 27 -259 -99 23 232 73 297 217 65 93 -20 197 -33 114 -106 150 91 -70 17
8060 17 88 -53 -69 72 139 9 -111 126 163 -17 -184 -49 -118 -125 57 -45 -105 297 96 250 144 17 -141
8083 -141 97 -147 78 267 147 -186 -44 32 101 37 86 -59 -60 141 141 -118 -170 61 -364 -115 -133 282 -48
8106 -48 -42 -16 152 40 -36 -60 -101 -121 -86 -40 -98 -122 41 -63 -74 108 -145 113 -71 112 -136 75 -55 92
8130I2j10Q5J21K3m83L51k3k15L50R0k24J2r8p9Q3Q2j72K08k25Q2L69l38j24Q4
8154e9J99k02K49p4m0k42K9J66L1j48jJ53Ko5O2j71k2L36l23o2Q0K75o4n8R0j54
8180a3rk35K04P1J67J28k45mp1Q8p2
$$ plain form
8130 92 -18 67 188 211 -272 79 56 -159 191 281 57 69 -29 -108 -25 57 -115 93 -132 -50 319 -19 -143 -59
8154 -59 140 -62 187 113 73 -169 -140 26 57 -91 -92 61 63 -2 60 -111 -133 203 -120 -182 -102 173 109 51 141 -13
8180 -13 -22 -257 -53 18 185 313 68 64 -7 81 9
8191I
$$ Imaginary data points
##PAGE= N=2
##DATA TABLE= (X++(I..I)), XYDATA
0@%%%%%%%%%%%%Qj6J6j6J6k4L2m0M8n6P2q5R8j17J36j55J80k09K41k78L18l62
34a93M14m70N31o00O76p58Q47r46J056j177J305j447J605j774J957k159K384k631
52a380K901l198L528l894M305m770N299n908O618p458Q475r736J1350j3519J6624
67I237k1550L1151q3405J21521l7817o2771Q4627r6077R9737k6270p9404R1671
79C0650j8421j6485j1979J5896J9794k4985Q868m8475J15747j01288O217N9685
91C5224n9330M8078k9161m2791J28387j30804N1349J5610l3939M6133n7233K5519
103b958L0154l7892l529K3159k128r309o148J2087o433K9953p4628P9911l1834
116D05j5424L0011l4040L3724k705m9043O8547l8302j73J6825k7106M0137l4313
$$ plain form
0 0 0 0 0 0 0 0 0 0 0 0 0 0 8 -8 8 -8 8 -16 16 -24 24 -32 40 -45 53 -64 72 -83 97 -112 129 -149 169 -193
34 -193 221 -249 282 -318 358 -400 447 -499 557 -620 685 -762 843 -931 1026 -1133 1251 -1380
52 -1380 1521 -1677 1851 -2043 2262 -2508 2791 -3117 3501 -3957 4518 -5218 6132 -7387 9237
67 9237 -12313 18838 -64567 56954 19137 -43634 40993 -55084 44653 18383 -61021 30650
79 30650 12229 -4256 -16235 -339 19455 -5530 3338 -45137 70610 -30678 -24461 35224
91 35224 -24106 23972 -5189 -47980 80407 -50397 952 16562 -17377 28756 -28477 -2958
103 -2958 27196 -10696 -14225 8934 6806 -2503 -8651 3436 -2997 26956 -47672 32239 405
116 405 -15019 14992 -19048 14676 11971 -37072 31475 -6827 -7000 9825 -17281 22856 -11457
129a1457P322M612J3558k9510K0274n492M239m721n04q022L6150n3932L8931q329
143C119j2276K4537l4210K7485L49k4029K0529j067j2066J9328k8483L0295j8282
156d771P388j2774K4922k4547J3312m802q58Q878j0290m120K3064k6670J3239
169A971L182j7016K9631l4301K3194m834l034k581J0458j5262J9413k1384J5417
182D854n862N055j2997J8063j3993O058K544j3019K0753j7654M417O605o648o49
196b473J0374k1523K9760k7865J6469o384M384p437J0327j2263J2489p510j231
209b883O248l265l278O233l833k192J1489k1722K5684j9636Q940j979J683o087
223d598J3069j9863K1645j5468N617M36n00k490N568o363K315O010j3921J5848
$$ plain form
129 -11457 -4135 477 14035 -15475 4799 -693 3546 -1175 -1679 -9701 26449 -27483 11448 3119
143 3119 -9157 15380 -18830 8655 9004 -15025 5504 4437 -7629 11699 -16784 13511 -4771
156 -4771 2617 -10157 14765 -9782 3530 -1272 -2130 6748 -3542 -7662 15402 -11268 1971
169 1971 5153 -11863 17768 -16533 6661 1827 -1207 -3788 6670 -8592 10821 -10563 4854
182 4854 -1008 4047 -8950 9113 -4880 1178 3722 -9297 11456 -6198 -1781 4824 -1824 -2473
196 -2473 7901 -13622 16138 -11727 4742 -1642 2742 -4695 5632 -6631 5858 -1652 -2883
209 -2883 3365 100 -3178 3055 -778 -2970 8519 -13203 12481 -7155 1785 -194 1489 -4598
223 -4598 8471 -11392 10253 -5215 402 838 338 -2152 3416 -2947 -632 5378 -8543 7305
237G305j1469N269j478K426q567J7618k3994K2926j4866N473j67N98n232J1127
251F969j3780R987j053o919R986q365L941q08J771p642J5601k0180J8673j2771
265d590O073k639M687j0704J6561j7978J2887l960l884P238m679q80M592l417
279f93l024J1015j6149J6250j1603N923l305O207j2789J8100j8721J3864n835
292g60r31K703P91o419R913q014P86P581j3068J3269q712L447j756N164j1698
307g704J7475j8489J4337p702K171j664N949j1029J3429j1001L834M493r059Q053
321C093l755j09P62L397j0201J5638j6741J3305p460L130l526Q156j3510J5758
335G937j3230O545P57m419L103J159n057M899j04p116J2976j4256J1147o002K906
$$ plain form
237 7305 -4164 1105 -373 2053 -6514 11104 -12890 10036 -4830 643 476 1074 -4158 6969
251 6969 -6811 3176 2123 -4796 5190 -3175 766 -42 1729 -5913 9688 -10492 8181 -4590
265 -4590 1483 -1156 3531 -7173 9388 -8590 4297 337 -3547 3691 -988 -1868 2724 -693
279 -693 -3717 7298 -8851 7399 -4204 1719 -1586 4621 -8168 9932 -8789 5075 -760
292 -760 -1691 1012 1803 -4616 5297 -2717 -1931 5650 -7418 5851 -2861 586 -1170 3994 -7704
307 -7704 9771 -8718 5619 -2083 88 -1576 4373 -6656 6773 -4228 -394 4099 -4960 3093
321 3093 -662 -771 -9 3388 -6813 8825 -7916 5389 -2071 1059 -2467 5689 -7821 7937
335 7937 -5293 1252 2009 -2410 693 1852 -3205 1694 1590 -5526 7450 -6806 4341 -1661 1245
350A245m352Q977j4033J6362j4130Q322k347m4j448N351q783P776k598m140R248
365E406j0250P273k921Q24k517P901j3785J6585j4733R815m868K434m179Q060
379E045j1032J0584n856j47M102m911K548N31j672j250P337j2907J5212j3396
393e812Q762l674J906m676R600j3036J3340j0180M921j65j674r9K794l380M69
408i04M324q769J0991r222M955j605K046o748J2364j5656J5645j2111N954n76
422F88q94k037N771o746N393k155k361N946o195L312j796L992q178J1813j3861
437g308J3997r663K945K1J976o472J0795j2676J1383o250j469O317n478K390r07
452c99J154k521N421r360J0643p213L306l897P706j0903J3185j4458J1800m027
$$ plain form
350 1245 -3107 5870 -8163 8199 -5931 2391 44 0 -1448 3903 -4880 2896 298 -3842 5406
365 5406 -4844 2429 -492 332 -2185 5716 -8069 8516 -6217 3598 -1270 1164 -3015 5045
379 5045 -5987 4597 -1259 -1406 2696 -2215 333 864 -808 -2058 5279 -7628 7584 -5812
393 -5812 2950 -724 1182 -3494 6106 -6930 6410 -3770 1151 986 -688 -787 2007 -1373 -904
408 -904 3420 -5349 5642 -3580 1375 -230 1816 -4932 7432 -8224 7421 -4690 1264 688
422 688 -206 -2243 3528 -3218 2175 20 -2341 3605 -2590 722 -1074 2918 -5260 6553 -7308
437 -7308 6689 -2974 -29 -8 1968 -4504 6291 -6385 4998 -1252 -2721 3596 -1882 508 -399
452 -399 755 -1766 3655 -5705 4938 -2275 1031 -2866 4840 -6063 7122 -7336 4464 437
466D37l535M625r07k545M920o808N138J934r224J0895q337O841o886O395o836
481c893R835j1669Q191k404Q26l691O617q756J1308j0877L954N705j0564R174
495C756o226L590K11k246j823Q933j1940R780q177R130q436O639p796R794p448
510b259j4M965l507P54J166m875Q433m831n625J3484j4298J2440j0703O759j095
525G94K82n594R445p567M809n332O091m215M025p178O404J507r451J0910r207
540d277P622l490k940M609K292j0925J3972j3082J2881j0880M210N33J671n291
554c095L555O54j173j37p75J067K497n096L0R351j4067J3839j3464J0895k988
569A093l884K279M876q968R122r796R358m044k161K028J376l79m904P819o783
$$ plain form
466 437 -3098 1527 620 -1925 2995 -3813 1325 3259 -5965 4930 -3407 3434 -3452 2943 -3893
481 -3893 5942 -5727 2464 60 886 -2805 3812 -4944 6364 -4513 -559 5146 -5418 3756
495 3756 -2470 1120 1331 -915 -2738 6195 -5745 4035 -4142 4988 -3448 3191 -4605 5189 -2259
510 -2259 -2273 2692 -815 -61 1105 -3770 4663 -168 -5793 7691 -6607 5833 -4870 1889 794
525 794 1076 -4518 4927 -2640 2169 -3163 2928 -1287 2738 -4440 1964 3471 -5980 4930 -4277
540 -4277 3345 -145 -3085 1524 3816 -7109 6863 -6219 6662 -4218 -8 525 2196 -3095
554 -3095 460 1114 -59 -196 -971 96 2593 -2503 -2473 6878 -7189 6650 -6814 4081 1093
569 1093 -2791 -512 4364 -4604 4518 -5278 4080 36 -2125 -97 1279 900 -4004 3815 -2968
584b968O959p013K645K850k054n545J2127j3931J4332j3374O796K449n556J168
598a115K555k359K923m246J784M066n676K106j728O550j0623J0641j0657J1435
612E656p726m05M368j09o188R474j0960J1873p731j754P964o940L819l396L596
627A541k046K445o218P971m644J676m142Q534j0114J0837j2046R347j406n515
641c780N977k087j393L688n898N255J090q038R353p185O512o927N809n167P305
656D514q811O056j345L63k740M746o346Q521q367K500N358q890P899n473K971
671I56l95j115k268P701r706Q697p272O284n079M594o211P892n816Q45L088l390
687a195K016k19k641M456j749m593R676j0771R276p066L985j635K282n759Q171
$$ plain form
584 -2968 3991 -3022 -377 2473 419 -5126 7001 -6930 7402 -5972 824 3273 -2283 -1115
598 -1115 1440 -919 2004 -2242 -458 3608 -2068 38 -1690 4860 -5763 4878 -5779 5656
612 5656 -2070 -2475 1893 1784 -4404 5070 -5890 5983 -1748 -3502 4462 -2478 1341 -2055 1541
627 1541 -505 1940 -4278 3693 -951 725 -3417 5117 -4997 5840 -6206 3141 1735 -3780
641 -3780 2197 110 -1283 2405 -3493 1762 2852 -5186 4167 -3018 3494 -3433 2376 -2791 4514
656 4514 -4297 1759 414 777 -1963 2783 -3563 4958 -3409 -909 4449 -4441 3458 -2015 956
671 956 561 -554 -2822 4879 -4827 3870 -3402 2882 -2197 2397 -3814 4078 -1738 -893 2195 -1195
687 -1195 821 602 -2039 2417 668 -3925 5751 -5020 4256 -2810 1175 -460 1822 -3937 4234
702D234p338M728k668J597j098J968l575L490J65m855P269p509O059l273J79J00
718e27L467p962J0459j0003P634m398J505r70L071n249M905k540k84K793l933
733b032K838p88l78j143N198q433J0200r652O999l540J066k059N078p372P793
748C775o080K932M76k307J466L66j212j69L079n913P630p255N061k716J821l275
764b321O270q759R088p154L705l42r23n93L008l983K878l25k865N543n696L909
780A440k257K052l745O524q853R137p063L919j413J060k826N469o645N330k157
795b8j770L890l663K102j32k43k044N556q360Q951p007M126k430K434m316O752
811C818p729O501l422J90J580r80p54K336k121m57L685o340P247n914L851k266
$$ plain form
702 4234 -3104 1624 -1044 553 -545 1423 -2152 1338 1503 -3352 3917 -3592 2467 -806 -627 -527
718 -527 2940 -5022 5437 -4566 3068 -1330 175 -795 2276 -2973 1932 -608 -892 1901 -2032
733 -2032 806 18 -360 -1503 3695 -4738 5462 -4190 2809 -731 335 -1724 3354 -4018 3775
748 3775 -2305 627 1103 -1204 262 628 -584 -753 2326 -3587 4043 -3212 1849 -867 954 -2321
764 -2321 3949 -4810 4278 -2876 829 487 -436 -1029 1979 -2004 874 549 -2316 3227 -2469 1440
780 1440 -817 1235 -2510 4014 -4839 4298 -2765 1154 -259 801 -2025 3444 -3201 2129 -28
795 -28 -1798 2092 -1571 531 399 156 -1888 3668 -4692 4259 -2748 1378 -1052 1382 -2934 3818
811 3818 -3911 2590 -832 -642 938 -42 -796 1540 -581 -1038 2647 -3693 3554 -2360 1491 -775
827g75K390m432P031q480P409m381J473l17J142l067M142l606J279J821m424N366
843B571l831J619r08J871m162P168q502P466n198K883j798K401m447O002n590
858b455L131K03k538K875j725J93L77J089l894O891q353P269m930K896k232L189
874A986n379P092o698M654j715m80N62Q80k194K123k75k523N192o361N553l474
890a057J548j482L591o331P905p818O097l372J399j266K225l472L922k225p44
905a080K988l846K881j094M46j236L394o535Q594p942N528l002J634j927L243
920B046n321O241m955K217K20j102J188p33K61n62K711n474O766o076M248k490
936h15J702k759N362p575P806o202L340m45j253J321L58k347K276o2k321L460
$$ plain form
827 -775 1615 -2817 4214 -4266 3143 -1238 235 -82 1060 -2007 2135 -1471 -192 1629 -2795 2571
843 2571 -1260 359 -549 1322 -2840 4328 -4174 3292 -1906 977 -821 1580 -2867 3135 -2455
858 -2455 676 879 -1659 1216 -509 -316 61 1150 -2744 4147 -4206 3063 -1867 1029 -1203 1986
874 1986 -3393 3699 -2999 1655 -60 -540 22 902 -1292 831 556 -1967 3225 -3136 2417 -1057
890 -1057 491 -991 2600 -3731 4174 -3644 2453 -919 480 -786 1439 -2033 1889 -336 -1080
905 -1080 1908 -1938 943 -151 295 -941 2453 -4082 4512 -3430 2098 -904 730 -1197 2046
920 2046 -3275 2966 -1989 228 448 -654 534 -199 62 -500 2211 -3263 3503 -2573 1675 -815
936 -815 887 -1872 3490 -4085 3721 -2481 859 414 -839 482 840 -1507 769 707 -1614 1846
952A846l970L746k814K449l721O449q303P397n167K915q11o2j346M543o206M855
968A800k093n71K693m493M512k417R82k370M533n183N118m801M077k710K410m799
984c312P673p455M932k274o17K968l389J072K376k951N30J708l612O038p185N579
1000B081l475L448n140N730m528L783l150J033N51J313m600N350l510R66J845
1015A697n347P690o430K554l27J057k279L125m852O903o105L524k859M320m973
1030b302L686k260J358J186m427L936k75k300K024l86j932N208q942R820o217
1045a823K801k579K764j980K498m322M234j726M67j711K943k185K72Q57k908O788
1061D390q330N612j837M01n26J057l178P168r558P326l430K041j915O70J52P86
$$ plain form
952 1846 -2124 1622 -1192 1257 -2464 3985 -4318 3079 -2088 827 16 -46 -1392 3151 -3055 1800
968 1800 -293 -864 1829 -2664 1848 -569 413 -1957 2576 -2607 2511 -2290 1787 -923 1487 -3312
984 -3312 4361 -3094 1838 -436 -1053 1915 -1474 -402 1974 -977 -447 1261 -2351 3687 -3498 2081
1000 2081 -1394 2054 -3086 2644 -1884 1899 -1251 -218 333 1646 -2954 2396 -1114 -148 1697
1015 1697 -3650 4040 -2390 164 -163 894 -1385 1740 -3112 3791 -2314 1210 -1649 2671 -2302
1030 -2302 1384 -876 482 1668 -2759 1177 902 -1398 626 240 -1692 3516 -5426 4394 -1823
1045 -1823 978 -1601 1163 -817 1681 -2641 1593 -133 334 -1377 1566 -619 -347 510 -2398 4390
1061 4390 -3940 1672 -165 236 -290 767 -2411 4757 -4801 2525 -905 1136 -779 -109 43 829
1077H29j142j149L672k681N0L49N40j350L189o846R923q841M761j913O45L48Q3
1094D67k748O211o061K530p21K90O21j924K089j502K886n741O563l833J536j297
1110f34J101j656M491q343Q949o041K753o40j099K620j544j233K304l67j861K300
1126A100k632L606l597K786l540O068p706O032l280J649l6r69k96L704o210N135
1142A814k080m34K446m624N134k914J037j928L782m098L537l833L695k215K293
1157A612m584O454o055L708j417o58K867l519J487J430k056L58J637l541N414
1172C137o097M782l071K952m359M875m084L442k625J065J68O48k684L640k559
1187g70N80J699m329O063n145K635j051J314k417L735n130N585m411K602j874
$$ plain form
1077 829 -313 -1462 2210 -471 -421 -72 468 -882 2307 -4539 5384 -3457 1304 -609 36 384 467
1094 467 -2281 3930 -2131 399 -322 -32 589 -1335 754 -748 2138 -3603 2960 -873 663 -634
1110 -634 467 -1189 3302 -5041 3908 -2133 620 -20 -1119 1501 -43 -1276 1028 661 -1200 1100
1126 1100 -1532 2074 -1523 1263 -2277 3791 -3915 2117 -1163 486 450 -519 -815 2889 -3321 1814
1142 1814 -266 -700 1746 -2878 2256 -658 379 -1549 2233 -1865 1672 -2161 1534 -681 1612
1157 1612 -2972 3482 -2573 1135 -282 -940 1927 -1592 -105 1325 -731 -373 1264 -2277 3137
1172 3137 -2960 1822 -1249 1703 -2656 2219 -1865 1577 -1048 17 185 833 -1851 1789 -770
1187 -770 -190 1509 -2820 3243 -1902 733 -318 996 -1421 2314 -2816 2769 -1642 960 -914
1202i14K505l452L365k430J013J081l102L176j419k21M57M87k029M356o597O585
1218B861m403K478j933K278k823L559l905L103j441n5J99Q84j301P60J50j983
1234a572M523n733M900l194J659j053J747l589N430n957M541k320R15n17O31j406
1250i95K098j346n82K480l556L063j842J047j270K502m302N806n897M414k383
1265g63P69o09J926l337L972l130J206J022j984J655j011L04k75J405l416M981
1281B715n331M248k753J573j681L126m342N061m328K148j33q14Q26L76j613J168
1297B46J01k058L815l921L215k348J867k042L231m912N448m464K775r29L14j008
1313f70K135k986K578r13j408K862k877K224j395P09j263L014m737N257m541L180
$$ plain form
1202 -914 1591 -1861 1504 -926 87 1168 -1934 1242 -177 -398 59 546 -1483 2873 -3724 2861
1218 2861 -1542 936 -997 1281 -1542 2017 -1888 1215 -226 -281 -82 802 -499 261 411 -1572
1234 -1572 2951 -2782 2118 -1076 583 -470 1277 -2312 3118 -2839 1702 -618 297 -220 411 -995
1250 -995 1103 -243 -825 1655 -1901 1162 -680 367 -903 1599 -2703 3103 -2794 1620 -763
1265 -763 6 -603 1323 -2014 1958 -1172 34 1056 -928 727 -284 20 -255 1150 -2266 2715
1281 2715 -2616 1632 -1121 452 -1229 1897 -2445 2616 -1712 436 303 -511 315 691 -922 246
1297 246 347 -1711 2104 -1817 1398 -950 917 -1125 2106 -2806 2642 -1822 953 24 338 -670
1313 -670 1465 -1521 1057 144 -1264 1598 -1279 945 -450 259 -1004 2010 -2727 2530 -2011 1169
1329A169j801J274j887L098l918L527k036K37J520k002P80J10j20n77K262l698
1345b062M424m443K992j745J724k571L944m684M399k757P16L92l90n33J450j615
1361g59O09J256k724L404l170K455j566J344k866M515n063M815l392J859r54Q43
1377F06j607K535k498J376O73k461K781k058J145q57J322k423M080n124M874l669
1393a305J918j107J372k481L551l589K463j046j85J125p40j80K20M27j507L411
1409B347m352L990l068J425p28J352k852M516m817L825k446Q83k94N30j047J161
1425D25l94j055K317k745K572j401L71n66K214l981M623n008M305k132J13J26
1441b16J041k201K635k217J205O01j744J753r87M45j135K055l071L892l916K682
$$ plain form
1329 1169 -632 642 -1245 1853 -2065 1462 -574 -337 1183 -819 -39 71 -49 -626 1636 -2062
1345 -2062 2362 -2081 911 -834 890 -1681 2263 -2421 1978 -779 -63 329 -61 -594 856 -759
1361 -759 -150 1106 -1618 1786 -1384 1071 -495 849 -2017 2498 -2565 2250 -1142 717 -237 606
1377 606 -1001 1534 -964 412 1085 -1376 1405 -653 492 -365 957 -1466 2614 -2510 2364 -1305
1393 -1305 613 -494 878 -1603 1948 -1641 822 -224 -409 716 -24 -204 16 443 -1064 2347
1409 2347 -2005 1985 -1083 342 -386 966 -1886 2630 -2187 1638 -808 75 -219 311 -736 425
1425 425 31 -1024 1293 -1452 1120 -281 90 -476 1738 -2243 2380 -2628 1677 -455 -342 -216
1441 -216 825 -1376 1259 -958 247 848 -896 857 -130 315 -820 1235 -1836 2056 -1860 822
1457H22j276P09j181K461l606M317l845K133q0j148J214o17L6L03j11j336K767
1474A562l165K386j517J997k835L576m209M534l593J314M05n20l59J502k326K472
1490A224j496n56K684l481K770k181K011j811J865k639L534k803J339j343K057
1505A174k591L004l573L222j079j452K609k132J599m42j019R39Q23l036M033l863
1521a784L550l071K405j989K549l524K736n92n07J70K77j101K167k540J047K137
1537A930m268M286l942L131j262k68j42K027l191L276l159L128k519J476j576
1552a073K355j649o85K492k415K116k022O74J323j401j330L897m560M648m584
1567b214L111o13k21j213K111j511J128j088O16j9n4r57J398N89l289M364m196
$$ plain form
1457 822 -454 255 -926 1535 -2071 2246 -1599 534 454 -694 520 -97 -61 242 131 -1205 1562
1474 1562 -1603 783 -734 1263 -1572 2004 -2205 2329 -1264 50 455 -65 -424 1078 -1248 1224
1490 1224 -272 -828 1856 -1625 1145 -1036 975 -836 1029 -1610 1924 -879 460 -883 1174
1505 1174 -1417 1587 -1986 1236 157 -1295 1314 -818 781 339 -680 259 1082 -1954 2079 -1784
1521 -1784 1766 -1305 1100 -889 1660 -1864 872 280 -227 -57 220 -881 1286 -1254 -207 1930
1537 1930 -2338 1948 -1994 1137 -125 -393 -535 1492 -1699 1577 -1582 1546 -973 503 -1073
1552 -1073 1282 -367 -1052 1440 -975 1141 -881 -207 1116 -285 -1615 2282 -2278 2370 -2214
1567 -2214 897 284 63 -1150 961 -550 578 -510 106 87 33 -924 474 1063 -2226 2138 -2058
1584b058M038k802M04P66K54k368L576l549L790l399J275N92n07n24K85Q46j118
1601d99J396j912J784r14j74l65K830m419M389m647M131j837m79R41L03j200J727
1618A055k162J977n59j447J844j140J185k243K880k837L182l421K045J2l95q32
1634h56K481l423L851l757K182N73k191J664j117J012l65j85m37J983k723J826
1650E18j337J932k812L268l346L835k969O66J008j041l20J262j660K324j665n92
1666i29K571k987K467k276K028j440J423k497L046k012J049j048J552j897K108
1681A158k765K650j062j224K618k357J271l41n2J39Q40k473L438l361K591k100
1697a030J652j551K148k697K285r15j61O28n39K8J064j612L61J508k544L080k953
$$ plain form
1584 -2058 1980 -822 -418 348 602 -1766 1810 -1739 2051 -1348 -73 519 12 -512 -227 619 -499
1601 -499 897 -1015 769 -145 -319 -684 2146 -2273 2116 -2531 1600 -237 -716 225 528 -672 1055
1618 1055 -1107 870 311 -1136 708 -432 753 -1490 1390 -1447 1735 -1686 359 371 -24 -856
1634 -856 1625 -1798 2053 -1704 478 1051 -1140 524 -593 419 54 -131 -568 1415 -1308 518
1650 518 -819 1113 -1699 1569 -1777 2058 -911 -245 763 -278 -598 664 -996 1328 -337 -929
1666 -929 1642 -1345 1122 -1154 874 -566 857 -1640 1406 -606 443 -605 947 -950 1158
1681 1158 -1607 1043 -19 -1243 1375 -982 289 -52 -104 35 875 -1598 1840 -1521 1070 -1030
1697 -1030 622 -929 1219 -1478 807 -108 -269 359 -180 -152 912 -700 -339 1169 -1375 1705 -1248
1714a248K470j376L69r69K113l008L121k367J645r02K50q52J616j546N99J011
1730I26k049K170j600M67RL87j658K778l537L845k755J452l81K89j288J968j864
1747h41J235j40m56P23p84K28J60L21j392K689l416L172k081Q46m02R06k133L044
1765A679l004K262j086RL58J84o33N96k87n74J550k292K353j695J298j235J640
1782A123k580L079l202K877j654M11k17Q39j549J453r94J68J038j721K129j485
1798b85L11k64J196k349L214l390K382j414O62n07J397k213K609k193J048M49
1814F53j154Q09m80K09k06O23j559K658k842K484j709J096j369J886k340K584
1830A343k423J451l89o2j54N70q79O31P6j092J994k134J781j016P77j075J588
$$ plain form
1714 -1248 1222 -154 215 -754 1359 -1649 1472 -895 750 -152 98 -754 862 -684 -85 926
1730 926 -1123 1047 -553 -86 -77 310 -1348 1430 -2107 1738 -1017 435 54 343 -945 1023 -841
1747 -841 394 254 -202 521 -263 -35 125 446 -946 1743 -1673 1499 -582 264 -138 768 -1365 1679
1765 1679 -1325 937 -149 -140 218 402 -231 365 78 -496 1054 -1238 1115 -580 718 -517 1123
1782 1123 -1457 1622 -1580 1297 -357 54 -163 676 -873 580 -414 -246 792 -929 1200 -285
1798 -285 26 -238 958 -1391 1823 -1567 815 -599 63 -444 953 -1260 1349 -844 204 653
1814 653 -501 308 -172 37 -169 454 -1105 1553 -1289 1195 -514 582 -787 1099 -1241 1343
1830 1343 -1080 371 -18 -80 -234 336 -543 88 164 -928 1066 -1068 713 -303 474 -601 987
1847I87k619L045k607J832p46M94j068J277j386J385p13n10J379j681J276n30
1863a85K19m19J690k890L288l204K179j259J045j076J635k094K117j406K58M23
1879C21n44K01K94n74j09J360k191K674k460J576j137R92j307J958k393K501j871
1896g09J086n48M81p59J253j250N45L61j465K112k087J226n85O94j117K022l040
1913a780L376k683J455n80N08r89J344j585J494l70p81J087n86K61p2K31j166
1930h36K429l386L269k255J239q93O97j224K353k772K257j201K6N49n59K87K90
1947B70l36o25J660j812J614j436J103j114J415k066K915k885K158j078K0M09
1963B12j77p78J474j201L07N87j128J303j179J150j158J508k239K793k328J613
$$ plain form
1847 987 -1632 1413 -1194 638 -108 386 -682 595 -791 594 -119 -629 750 -931 345 -185
1863 -185 34 -385 1305 -1585 1703 -1501 678 -581 464 -612 1023 -1071 1046 -360 -102 321
1879 321 -223 -22 272 -302 -411 949 -1242 1432 -1028 548 -589 403 -904 1054 -1339 1162 -709
1896 -709 377 -171 310 -449 804 -446 99 460 -1005 1107 -980 246 -339 355 -762 1260 -1780
1913 -1780 1596 -1087 368 -212 296 -693 651 -934 560 190 -591 496 -90 171 99 330 -836
1930 -836 1593 -1793 1476 -779 460 -433 264 -960 1393 -1379 878 -323 -297 252 -307 -20 270
1947 270 -66 -691 969 -843 771 -665 438 -676 739 -1327 1588 -1297 861 -217 -197 212
1963 212 35 -743 731 -470 -163 424 -704 599 -580 570 -588 920 -1319 1474 -854 759
1979G59j272Q93o47R93k170K597j921R41Q4j109J921j462O99m17N30j156J769
1996A032k136K293j633J007j333K005k595K123j336R33J71j029Q47L02j475J236
2012D12j95m55J078k216K534j828J305j486J809j870J636j571J435o88N28j497
2028a069K025j901J362l08q77K035k386J644o93J65k48N51j377K481k881K547
2044A070j741J221j379J541j488J208n80k85R31o03k86Q30p33J30P28k101L550
2061B013l437K001r05O90n80N79j506K532k401J315l60Q37j214N45k84M0R88j945
2079a092K335j567N91l90L59p59J896l306L454k618J611q71P65n20L17r94R80
2096A91Kn64J59J21L17n17O05j281K831l702K703j085O67m48J4n65J970k843K583
$$ plain form
1979 759 -513 380 -267 726 -1444 1153 -768 173 257 -852 1069 -393 306 -111 419 -737 1032
1996 1032 -1104 1189 -444 563 -770 1235 -1360 763 -573 360 531 -498 349 651 -824 412
2012 412 217 -238 840 -1376 1158 -670 635 -851 958 -912 724 -847 588 -100 428 -1069
2028 -1069 956 -945 417 109 -768 1267 -1119 525 -168 -3 -251 300 -1077 1404 -1477 1070
2044 1070 -671 550 -829 712 -776 432 -148 -433 498 -105 -391 439 -294 -164 564 -1537 2013
2061 2013 -1424 577 -328 362 -218 361 -1145 1387 -1014 301 -59 778 -436 109 -175 -135 853 -1092
2079 -1092 1243 -324 267 -123 236 -523 1373 -1933 1521 -1097 514 -357 408 -112 205 -789 191
2096 191 193 -371 -212 -91 226 -291 314 -967 1864 -1838 865 -220 447 -1 13 -552 1418 -1425 1158
2115A158j499M14K69p81Q65n55L38q65J668j899J180o80R58q12R43k402L796l611
2133a515K308j132J25N76p45K28R34j406N52K99o86J364j739J361j002J366k325
2150a437K600j693J094r83M55k83Q42j815K381j734O03J46p69J419j562O34J88
2167H6K00p76R34j328J842j580R72j273K134k383K079j607Q30K57q74M89K33o22
2185c87P85j26o85J289j983K388j825J228j392J744j824J705j631J297p64M60
2201B79q78J266j512J232j27r97J560j380J059n35J04m50J219j908K290k451J881
2218F52j209O67o98J310j521J389q51j10P66l28q7K58j36l65Q11j459K144k037
2236h04J341r04O88p67J295j961K271j610O43k12J31j42L33o52K78Q13j723J852
$$ plain form
2115 1158 -341 73 342 -439 426 -129 209 -656 1012 -887 293 -387 571 -241 702 -1700 2096 -1515
2133 -1515 793 -339 -214 362 -383 -155 779 -627 -75 224 -462 902 -837 524 -478 888 -1437
2150 -1437 1163 -530 564 -419 36 -247 595 -1220 1161 -573 30 176 -593 826 -736 -102 86
2167 86 286 -490 444 -884 958 -622 350 -923 1211 -1172 907 -700 130 387 -487 2 235 -387
2185 -387 398 272 -413 876 -1107 1281 -544 684 -708 1036 -788 917 -714 583 -181 279
2201 279 -599 667 -845 387 260 -737 823 -557 502 -33 71 -379 840 -1068 1222 -1229 652
2218 652 -557 110 -588 722 -799 590 -261 -371 395 67 -20 238 102 -263 548 -911 1233 -804
2236 -804 537 -367 321 -446 849 -1112 1159 -451 192 -20 111 -31 302 -350 -72 741 -982 870
2254H70j627J149l45O46j165J617k206K013j637J121o29M08n58O06n69M21N3p44
2272e76J046j094O56O2M26j134J629k148K198j499P89o10N44j094J827j786R52
2289A88l62j31N23l61l3K21K03p60J243j648J970j526Q71o98J039j531J860k216
2307a148J745r16M34K7j5m67P18l10n54J086j269J359j291J001n85O68j408K170
2325A245k337J914j269P52p61Q55r24J252j093L12N40j086J040n70N50n06L41
2342B55p81J784k352J839j138Q30p63Q39j195J535j407P94k41j41K26J9k19K01
2360H5J0q65J801j873J475j548J585j049J431j746J663j958J199k52l3M1K29o28
2378d33R38n75l05J267j450Q81p51Q46q40J209j756J871k043J562o51N57o87J083
$$ plain form
2254 870 -757 392 47 693 -472 1145 -1061 952 -685 436 -193 215 -343 263 -306 115 168 -576
2272 -576 470 -624 32 94 520 -614 1015 -1133 1065 -434 355 -255 289 -805 1022 -764 188
2289 188 -174 -305 218 -143 -176 45 248 -512 731 -917 1053 -473 398 -300 739 -792 1068 -1148
2307 -1148 597 -319 115 142 127 -340 378 68 -486 600 -669 690 -601 400 -185 483 -925 1245
2325 1245 -1092 822 -447 305 -456 399 -525 727 -366 -54 486 -600 440 -130 420 -86 255
2342 255 -526 1258 -1094 745 -393 437 -326 513 -682 853 -554 240 -1 -142 84 103 -116 85
2360 85 95 -770 1031 -842 633 -915 670 -379 1052 -694 969 -989 210 -42 -75 -34 195 -433
2378 -433 505 -70 -375 892 -558 323 -428 418 -422 787 -969 902 -1141 421 -230 327 -360 723
2396G23j395J370q71J26M86p25N23k46M8n17J112j394J536j793J596j106Q95j007
2414f39J410j548J394j278J022l74j98K57M3j13k43N86j214J797j777J411p97
2431b61L37n42J414k059J902j656J253o30K07k10O26n55M10k62l16O73p65N27
2449I3k09L91j022J703k009J946j657Q79k79K15p48J299j673J584n89j75N56n24
2467b19K58o0M91r88R45j326J588r93M34m88R07j296J869k198J705q42j58P09
2485C38m57Q8J13k05q2N03j142J515j084P90r74J246j531J817j838J445o25j12
2503a95k16Q11q54R02r15O04M00j441J583j065R21n12L76q30J261j475J221j079
2521e03Q41r27J105j151J389j075M3O69p79L66K2l05M38l44m10J576j757J553
$$ plain form
2396 723 -672 698 -173 -47 439 -286 237 -9 39 -478 634 -760 776 -1017 579 -527 368 -639
2414 -639 771 -777 617 -661 361 -13 -211 46 89 -24 -267 319 -895 902 -875 536 -261
2431 -261 76 -466 948 -1111 791 -865 388 -242 -35 -245 381 -174 236 -26 -342 331 -434 93
2449 93 -116 275 -747 956 -1053 893 -764 115 -164 51 -697 602 -1071 513 -76 -251 305 -219
2467 -219 39 -21 470 -518 427 -899 689 -304 130 -358 549 -747 1122 -1076 629 -213 -371 338
2485 338 -119 -31 82 -123 -205 298 -844 671 -413 377 -597 649 -882 935 -903 542 -83 -195
2503 -195 -411 400 -454 448 -467 137 537 -904 679 -386 535 23 399 -431 830 -645 576 -503
2521 -503 338 -589 516 -635 754 -321 -278 391 -388 -22 0 -305 133 -211 -621 955 -802 751
2539G51j320J418j129N40p90J104j148O94m71N74n68Q97j158R71j01q87J380j315
2557e58R71o50J80K2L62j301J636j382J449j228Q16m33P64j267P22J00n47M39
2575I5k29M1J87j60m3P17j556J769j847J625q96L09k37M69n79O56o88P98n80K23
2595G4j86M15l61l13J174j156Q92r77O47J10j64q39J447j473J621j656R46k57
2613e6K1l18N11k62J7J17o9N33j020O12j53P63j537J509j376J785j564N79q4N9
2633F7j32M83j161J397j051J15O81o17J44k18M75o36Q19j148J316r56K75j05P55
2652E03j287J736j663J284r12J85J59j55M6R3j04L6K98q67J233r24N12n08J209
2671H74j367R54j106J140o56L79l17L80n76R56j180O62L34j054P48p46J176j160
$$ plain form
2539 751 -569 849 -280 260 -530 574 -574 120 -351 223 -345 552 -606 365 264 -623 757 -558
2557 -558 413 -237 -57 -35 327 -974 662 -720 729 -499 317 -116 648 -619 103 203 -344 95
2575 95 -134 -93 94 -66 -109 608 -948 821 -1026 599 -297 12 -225 244 -335 321 -367 431 -149 74
2595 74 -112 303 -58 -371 803 -353 539 -438 209 319 155 -684 763 -710 911 -745 201 -56
2613 -56 -35 -353 158 -104 -87 30 -39 494 -526 86 -67 696 -841 668 -708 1077 -487 92 8 67
2633 67 -65 418 -743 654 -397 -282 399 -218 -74 -292 183 -453 366 -782 534 -422 -147 -252 503
2652 503 -784 952 -711 573 -339 -154 5 -150 -104 -11 -115 -79 219 -648 585 -339 173 -335 874
2671 874 -493 461 -645 495 -161 218 -99 281 -295 661 -519 143 477 -577 171 -575 601 -559
2689e59P37n45P68p68N46p55R83p85P47r22J194p84Q1K21l73L56j70j77N36j83
2709A48n11J136j504J393j221R60p71P48j186J204r18O63l59M60l94M36n25L57
2727A16J8o13J132j047Q40p15L38m47N94q77J512j776J395o43L74n93O39n94P12
2746C65m79m11N88n80P41k40j24KN49j119J603j471J004m81R5m66R43j119J076
2765D76q70O09j43k58L42j50Pj18L42o89J130j220P00k62L36p33R22j084J241
$$ plain form
2689 -559 178 -367 401 -367 179 -576 407 -378 369 -553 641 -143 -62 159 -214 142 -28 -205 331 148
2709 148 -363 773 -731 662 -559 401 -370 378 -808 396 -522 141 -218 242 -152 284 -241 116
2727 116 134 -479 653 -394 446 -269 69 -378 216 -661 851 -925 470 -173 201 -392 247 -347 365
2746 365 -114 -525 63 -517 224 -16 -140 -138 411 -708 895 -576 428 -53 42 -424 519 -600 476
2765 476 -394 215 72 -186 156 6 13 -105 237 -452 678 -542 158 -104 232 -501 421 -663 578
$$ [...]
8191A22
##END NTUPLES=NMR FID
##END=
