##TITLE=1H_Pr E-8-7
 CDCl3
 8 sc, 
 9.11.2021
##JCAMPDX= 6.0         $$ Bruker NMR JCAMP-DX V2.0
##DATA TYPE= NMR FID
##DATA CLASS= NTUPLES
##ORIGIN= UXNMR, Bruker Analytische Messtechnik GmbH
##OWNER= root
$$ XWIN-NMR		Version 3.5
$$ Tue Nov  9 13:46:31 2021 Russian Standard Time (UT+4h)  she@DPX200
##.OBSERVE FREQUENCY= 200.1313468511
##.OBSERVE NUCLEUS= ^1H
##.DELAY= (6, 6)
##.ACQUISITION MODE= SIMULTANEOUS
##.ACQUISITION SCHEME= undefined
##.AVERAGES= 8
##.DIGITISER RES= 18
##SPECTROMETER/DATA SYSTEM= spect
##.PULSE SEQUENCE= zg30
##.SOLVENT NAME= CDCl3
##.SHIFT REFERENCE= (INTERNAL, CDCl3, 0, 15.7039)
##AUDIT TRAIL= $$ (NUMBER, WHEN, WHO, WHERE, WHAT)
$$ ##TITLE= Audit trail, XWIN-NMR		Version 3.5
$$ ##JCAMPDX= 5.01
$$ ##ORIGIN= Bruker BioSpin GmbH
$$ ##OWNER= she
$$ F:/spectra/data/she/nmr/H-F/1/audita.txt
$$ ##AUDIT TRAIL=  $$ (NUMBER, WHEN, WHO, WHERE, WHAT)
(   1,<2021-11-09 13:41:58.57 +0400>,<she>,<DPX200>,
      <created by zg, POWCHK disabled, PULCHK disabled
       configuration hash MD5:
       00 E9 B6 7A A2 85 ED C7 34 08 36 98 17 FE 4E 26
       data hash MD5: 16K
       23 40 C5 7E 14 17 19 B2 28 F7 80 31 CC A5 84 52>)
$$ ##END=
$$ 
$$ hash MD5
$$ 79 34 2A 0E D6 59 1E E5 D0 7C 96 7F 92 78 98 11
##$RELAX= 
##$RELAX= 
##$RELAX= 
##$RELAX= 
##$RELAX= 
##$RELAX= 
$$ Bruker specific parameters
$$ --------------------------
##$DU= <F:/spectra>
##$EXPNO= 1
##$NAME= <H-F>
##$PROCNO= 1
##$TYPE= <nmr>
##$USER= <she>
##$AMP= (0..31)
100 100 100 100 100 100 100 100 100 100 100 100 100 100 100 100 100 100 
100 100 100 100 100 100 100 100 100 100 100 100 100 100 
##$AQSEQ= 0
##$AQ_mod= 1
##$AUNM= <au_zg>
##$AUTOPOS= <>
##$BF1= 200.13
##$BF2= 200.13
##$BF3= 200.13
##$BF4= 200.13
##$BF5= 200.13
##$BF6= 200.13
##$BF7= 200.13
##$BF8= 200.13
##$BYTORDA= 1
##$CFDGTYP= 0
##$CFRGTYP= 5
##$CHEMSTR= <none>
##$CNST= (0..31)
1 1 145 1 1 1 1 1 1 1 1 1 1 1 1 1 1 1 1 1 1 1 1 1 1 1 1 1 1 1 1 1 
##$CPDPRG= <>
##$CPDPRG1= <>
##$CPDPRG2= <>
##$CPDPRG3= <>
##$CPDPRG4= <mlev>
##$CPDPRG5= <mlev>
##$CPDPRG6= <mlev>
##$CPDPRG7= <mlev>
##$CPDPRG8= <mlev>
##$CPDPRGB= <>
##$CPDPRGT= <>
##$D= (0..31)
0 1.2 0 0 0 0 0 0 0 0.06 0 0.03 0 0 0 0 0.0002 0 0 0 0 0 0 0 0 0 0 0 0 
0 0 0 
##$DATE= 1636450918
##$DBL= (0..7)
120 120 120 120 120 120 120 120 
##$DBP= (0..7)
150 150 150 150 150 150 150 150 
##$DBP07= 0
##$DBPNAM0= <>
##$DBPNAM1= <>
##$DBPNAM2= <>
##$DBPNAM3= <>
##$DBPNAM4= <>
##$DBPNAM5= <>
##$DBPNAM6= <>
##$DBPNAM7= <>
##$DBPOAL= (0..7)
0.5 0.5 0.5 0.5 0.5 0.5 0.5 0.5 
##$DBPOFFS= (0..7)
0 0 0 0 0 0 0 0 
##$DE= 6
##$DECBNUC= <off>
##$DECIM= 32
##$DECNUC= <off>
##$DECSTAT= 4
##$DIGMOD= 1
##$DIGTYP= 9
##$DL= (0..7)
0 120 120 120 120 120 120 120 
##$DP= (0..7)
150 150 150 150 150 150 150 150 
##$DP07= 0
##$DPNAME0= <>
##$DPNAME1= <>
##$DPNAME2= <>
##$DPNAME3= <>
##$DPNAME4= <>
##$DPNAME5= <>
##$DPNAME6= <>
##$DPNAME7= <>
##$DPOAL= (0..7)
0.5 0.5 0.5 0.5 0.5 0.5 0.5 0.5 
##$DPOFFS= (0..7)
0 0 0 0 0 0 0 0 
##$DQDMODE= 0
##$DR= 18
##$DS= 0
##$DSLIST= <SSSSSSSSSSSSSSS>
$$ [...]
##$SUBNAM2= <"">
##$SUBNAM3= <"">
##$SUBNAM4= <"">
##$SUBNAM5= <"">
##$SUBNAM6= <"">
##$SUBNAM7= <"">
##$SUBNAM8= <"">
##$SUBNAM9= <"">
##$SW= 18.0517286264689
##$SWIBOX= (0..15)
0 0 2 0 0 0 0 0 0 0 0 0 0 0 0 0 
##$SW_h= 3612.71676300578
##$TD= 16384
##$TD0= 1
##$TE= 0
##$TE2= 300
##$TE3= 300
##$TEG= 300
##$TL= (0..7)
0 120 120 120 120 120 120 120 
##$TP= (0..7)
150 150 150 150 150 150 150 150 
##$TP07= 0
##$TPNAME0= <>
##$TPNAME1= <>
##$TPNAME2= <>
##$TPNAME3= <>
##$TPNAME4= <>
##$TPNAME5= <>
##$TPNAME6= <>
##$TPNAME7= <>
##$TPOAL= (0..7)
0.5 0.5 0.5 0.5 0.5 0.5 0.5 0.5 
##$TPOFFS= (0..7)
0 0 0 0 0 0 0 0 
##$TUNHIN= 0
##$TUNHOUT= 0
##$TUNXOUT= 0
##$USERA1= <user>
##$USERA2= <user>
##$USERA3= <user>
##$USERA4= <user>
##$USERA5= <user>
##$V9= 5
##$VALIST= <valist>
##$VCLIST= <CCCCCCCCCCCCCCC>
##$VD= 0
##$VDLIST= <DDDDDDDDDDDDDDD>
##$VPLIST= <PPPPPPPPPPPPPPP>
##$VTLIST= <TTTTTTTTTTTTTTT>
##$WBST= 1024
##$WBSW= 4
##$XGAIN= (0..3)
0 0 0 0 
##$XL= 0
##$YL= 0
##$YMAX_a= 200544
##$YMIN_a= -297375
##$ZGOPTNS= <>
##$ZL1= 120
##$ZL2= 120
##$ZL3= 120
##$ZL4= 120
##$ABSF1= 10
##$ABSF2= 0
##$ABSG= 5
##$ABSL= 3
##$ALPHA= 0
##$AQORDER= 0
##$ASSFAC= 0
##$ASSFACI= 0
##$ASSFACX= 0
##$ASSWID= 0
##$AUNMP= <proc_1d>
##$AZFE= 0.1
##$AZFW= 0.1
##$BCFW= 1
##$BC_mod= 2
##$BYTORDP= 1
##$COROFFS= 0
##$CY= 11.3945322036743
##$DATMOD= 1
##$DC= 2
##$DFILT= <>
##$DTYPP= 0
##$F1P= 2.36226072786647
##$F2P= -0.459571619588291
##$FCOR= 0.5
##$FTSIZE= 0
##$FT_mod= 4
##$GAMMA= 1
##$GB= 0.15
##$INTBC= 1
##$INTSCL= 1
##$ISEN= 128
##$LB= 0.24
##$LEV0= 0
##$LPBIN= 0
##$MAXI= 10000
##$MC2= 0
##$MEAN= 0
##$ME_mod= 0
##$MI= 1.114404
##$NCOEF= 0
##$NC_proc= 0
##$NLEV= 6
##$NOISF1= 3.799351
##$NOISF2= 2.8
##$NSP= 1
##$NTH_PI= 0
##$NZP= 0
##$OFFSET= 15.70392
##$PC= 1
##$PHC0= -15512.95
##$PHC1= 15.60082
##$PH_mod= 1
##$PKNL= yes
##$PPARMOD= 0
##$PSCAL= 0
##$PSIGN= 0
##$REVERSE= no
##$SF= 200.130013532006
##$SI= 16384
##$SIGF1= 3
##$SIGF2= 2
##$SINO= 400
##$SIOLD= 16384
##$SREGLST= <1H.CDCl3>
##$SSB= 0
##$STSI= 0
##$STSR= 0
##$SW_p= 3612.71676300578
##$SYMM= 0
##$S_DEV= 0
##$TDeff= 0
##$TDoff= 0
##$TI= <>
##$TILT= no
##$TM1= 0
##$TM2= 0
##$TOPLEV= 0
##$USERP1= <user>
##$USERP2= <user>
##$USERP3= <user>
##$USERP4= <user>
##$USERP5= <user>
##$WDW= 1
##$XDIM= 8192
##$YMAX_p= 0
##$YMIN_p= 0
$$ End of Bruker specific parameters
$$ ---------------------------------
##NTUPLES= NMR FID
##VAR_NAME=  TIME,          FID/REAL,        FID/IMAG
##SYMBOL=    X,             R,               I
##VAR_TYPE=  INDEPENDENT,   DEPENDENT,       DEPENDENT
##VAR_FORM=  AFFN,          ASDF,            ASDF
##VAR_DIM=   8192,          8192,            8192
##UNITS=     SECONDS,       ARBITRARY UNITS, ARBITRARY UNITS
##FACTOR=    0.0002768,     1,               1
##FIRST=     0,             0,               0
##LAST=      2.2672688,     0,               0
##MIN=       0,             -297375,         0
##MAX=       2.2672688,     200544,          0
$$ Real data points
##PAGE= N=1
##DATA TABLE= (X++(R..R)), XYDATA
$$ [...]
$$ plain form
2258 237 -178 -131 558 -624 444 -657 -323 4 -366 -204 -307 -284 223 -224 609 -16 602 291 -593 668
2278 668 35 450 734 587 401 268 611 319 172 -273 -506 -50 -328 -463 58 -257 -557 -384 -267 -253
2298 -253 -774 -478 -31 -482 -87 -658 -387 -155 -256 -465 429 -310 3 839 136 349 583 831 597 284
2318 284 -92 56 -105 -331 -907 -301 -215 -1039 -814 -747 -642 -210 -427 -545 -106 -6 457 419 -146 520 389
2339 389 -68 551 241 534 382 33 963 -86 28 75 -244 250 -52 -208 434 -156 -105 -237 -106 -237
2359 -237 -42 -680 264 286 -506 -99 104 190 177 139 150 -346 181 488 156 72 701 56 556 505 -90 620
2381 620 232 -923 392 185 -122 186 35 -430 -718 -603 -906 -445 -745 -30 -257 -397 -92 -130 -75 -37
2401 -37 -74 497 259 85 -156 91 452 661 171 -160 351 68 302 -490 34 -46 -326 -137 -356 -510 -485
$$ packed form
2258B37m15M7O89j182J068j101L34L27l70J62j03K3N07m47Q33o25O18l11q84J261
2278F68o33M15K84j47j86j33L43k92j47m45k33M56k78j35N21l15l00J73J17J4
2298b53n21K96M47m51L95n71K71K32j01k09Q94p39L13Q36p03K13K34K48k34l13
2318B84l76J48j61k26n76O06Q6q24K25O7J05M32k17j18M39J00M63l8n65O66j31
2339C89m57O19l10K93j52l49R30j049J14M7l19M94l02j56O42n90N1j32J31j31
2359b37J95o38R44K2p92M07K03Q6j3l8J1m96N27L07l32q4O29o45N00n1n95P10
2381F20l88j155J315k07l07L08j51m65k88J15l03M61l00P15k27j40L05l8N5L8
2401c7l7N71k38j74k41K47L61K09m90l31N11k83K34p92N24q0k80J89k19j54K5
$$ plain form
2422 -485 -557 -573 -388 -154 -394 -299 -332 462 112 -84 427 -296 140 385 491 259 477 610 107 -35 490
2443 490 56 123 133 239 -157 -273 -378 -725 -328 131 -127 -649 -618 -370 -435 -404 6 -309 -317 -254 7 415 281
2466 281 -24 201 364 419 268 -259 -8 206 41 370 -354 193 462 -474 -421 -493 -377 -31 -440 -494 -430 -427
2488 -427 214 -157 -76 -222 -168 296 139 315 207 511 389 112 191 337 343 341 202 229 188 -67 114 337 -186
2511 -186 -525 -49 -193 -474 -293 -163 -331 -83 -396 -222 65 47 -80 6 46 429 307 342 330 223 484 437
2533 437 23 643 538 321 226 -203 -93 5 32 -104 -294 -86 -519 -406 -241 -166 -539 -146 -47 -753 -279 -482
2555 -482 -466 245 44 175 316 26 421 191 364 690 -31 342 617 60 473 196 174 212 -318 -19 -233
2576 -233 -514 -588 -643 -492 -628 -503 -245 -272 -560 -212 -106 -118 50 75 339 288 394 576 430 398 469 315 -239
$$ packed form
2422d85p2j6J85K34k40R5l3P94l50j96N11p23M36K45J06k32K18J33n03j42N25
2443D90m34O7J0J06l96j16j05l47L97M59k58n22L1K48o5L1M10l15qO3K61M08j34
2466B81l05K25J63N5j51n27K51K14j65L29p24N47K69r36N3p2J16L46m09n4O4L
2488d27O41l71Q1j46N4M64j57J76j08L04j22k77P9J46Okj39K7m1k55J81K23n23
2511a86l39M76j44k81J81J30j68K48l13J74K87j8j27Q6M0L83j22L5j2j07K61m7
2533D37m14O20j05k17r5m29J10R8K7j36j90K08m33J13J65P5l73L93R9p06M74k03
2555d82J6P11k01J31J41k90L95k30J73L26p21L73K75n57M13k77k2L8n30K99k14
2576b33k81p4n5J51j36J25K58k7k88L48J06j2J68K5K64n1J06J82j46l2P1j54n54
$$ plain form
2599 -239 146 -333 15 75 -120 -129 18 -23 -2 -463 -188 -223 -363 53 -54 -540 201 -262 -80 -4 -152 50
2621 50 96 307 -70 98 302 393 116 548 144 332 258 54 45 -207 -220 -139 -252 -116 -28 -290 -255 20 -343
2644 -343 -215 -414 -435 26 65 27 -156 -178 330 367 263 -200 150 119 65 77 155 332 -86 29 -38 225 285 176
2668 176 -5 191 149 -310 -402 -453 -322 -163 -266 -503 -601 -106 -458 -349 53 -50 82 259 371 83 658
2689 658 293 658 382 429 464 318 633 436 -362 -29 -201 -253 -152 -604 -180 -576 -662 -447 -226 -575 -261
2710 -261 -235 -215 -135 99 247 72 383 25 252 344 4 204 523 281 487 82 38 107 85 -108 -368 -93
2732 -93 77 -1 -367 -233 -273 -425 -478 -217 -234 -2 -131 -51 154 65 110 -202 -23 221 187 665 348 444 382 431
2756 431 194 149 82 191 -140 103 -248 -275 -337 -246 -45 -632 -196 -378 -352 -258 18 -118 -21 -115 81 242 -44
$$ packed form
2599b39L85m79L48O0j95rJ47m1K1m61K75l5j40M16j07m86P41m63J82P6j48K02
2621E0M6K11l77J68K04R1k77M32m04J88p4k04rk52j3Q1j13J36Q8k62L5K75l63
2644c43J28j99k1M61L9l8j83k2N08L7j04m63L50l1n4J2P8J77m18J15o7K63O0j09
2668A76j81J96m2m59r2n1J31J59j03k37r8M95l52J09M02j03J32J77J12k88N75
2689F58l65L65k76M7L5j46L15j97p98L33j72n2J01m52M24l96q6K15K21l49L14
2710b61K6K0Q0K34J48j75L11l58K27R2l40K00L19k42K06m05m4O9k2j93k60K75
2732i3J70p8l66J34m0j52n3K61j7K32j29Q0K05q9M5l12J79K44l4M78l17R6o2M9
2756D31k37m5o7J09l31K43l51k7o2R1K01n87M36j82K6R4K76j36R7r4J96J61k86
$$ plain form
2779 -44 313 153 74 83 68 88 199 298 439 -24 392 246 108 -91 194 343 16 82 -376 -269 -629 -371 -251
2802 -251 -359 -383 -240 -262 -241 -156 59 9 -151 402 184 236 368 415 309 720 507 267 88 201 202 -292 -327
2825 -327 -114 -198 -327 -232 -316 -237 -256 -553 32 -202 -66 -26 -114 -251 -241 102 125 24 87 -42 -79 38 -91 488
2849 488 256 20 72 372 222 51 191 73 33 20 -93 -277 -262 -273 -157 -582 -400 -320 -400 -168 -441 54
2871 54 233 -142 216 366 334 143 429 358 223 106 333 332 76 214 67 -141 395 -297 -261 -194 -561 -293
2893 -293 -172 -158 -260 -285 -429 -301 -324 -110 -382 -39 27 -98 -91 264 179 357 660 241 208 478 170 152 388
2916 388 -111 189 -22 -29 -387 -70 -22 -24 -359 -74 -600 -360 -409 -252 -325 -198 -72 -37 -183 -5 258 234 142
2939 142 77 92 400 469 3 106 83 304 81 -37 259 79 -62 67 -97 -346 -565 -371 -255 -398 -67
$$ packed form
2779d4L57j60p9Rj5K0J11R9J41m63M16j46j38j99K85J49l27O6m58J07l60K58J20
2802b51j08k4J43k2K1Q5K15n0j60N53k18N2J32M7j06M11k13k40j79J13Jm94l5
2825c27K13q4j29R5q4P9j9k97N85k34J36M0q8j37J0L43K3j01O3j29l7J17j29N79
2849D88k32k36N2L00j50j71J40j18m0j3j13j84J5j1J16m25J82Q0q0K32k73M95
2871E4J79l75L58J50l2j91K86p1j35j17K27jk56J38j47k08N36o92L6O7l67K68
2893b93J21J4j02k5j44J28k3K14k72L43O6j25PL55q5J78L03m19l3K70l08j8K36
2916C88m99L00k11pl58L17M8kl35K85n26K40m9J57p3J27J26L5j46J78K63k4r2
2939A42o5J5L08O9m66J03k3K21k23j18K96j80j41J29j64k49k19J94J16j43L31
$$ plain form
2960 -67 -347 -211 -206 36 60 -309 264 231 492 14 266 400 417 247 77 -112 137 56 -113 47 -113 101
2982 101 342 70 -139 -378 -566 -231 -493 -347 -522 -340 -484 57 -252 253 -479 309 -359 138 -128 -127 284
3003 284 119 587 307 283 205 754 -268 111 282 -146 -179 -469 7 -33 -279 -519 -121 -398 -342 103 -466
3024 -466 -495 58 -378 185 -186 103 36 -191 405 290 487 193 330 165 -91 270 394 178 99 279 33
3045 33 77 -118 -59 183 -87 427 -643 -662 -22 -281 -312 -67 517 -828 -127 149 -285 259 -315 -459 -394
3066 -394 289 210 700 12 206 -789 404 345 -261 711 166 -96 1074 -329 -531 -136 475 -1244 -197
3085 -197 285 -617 683 -238 146 -531 223 -360 354 147 518 708 1012 834 276 773 -260 155 276
3104 276 -249 -508 103 -108 54 -183 197 449 -491 287 -216 -654 277 -862 -570 -595 -773 -551 -138 -532
$$ packed form
2960f7k80J36NK42K4l69N73l3K61m78K52J34J7j70j70j89K49q1j69J60j60K14
2982A01K41k72k09k39j88L35k62J46j75J82j44N41l09N05p32P88o68M97k66JM11
3003B84j65M68k80k4p8N49j022L79J71m28l3k90M76m0k46k40L98k77N6M45n69
3024d66k9N53m36N63l71K89o7k27N96j15J97k94J37j65k56L61J24k16p9J80k46
3045C3M4j95N9K42k70N14j070j9O40k59l1K45N84j345P01K76m34N44n74j44O5
3066c94O83p9M90o88J94r95J193n9o06R72n45k62J170j403k02L95O11j719J047
3085a97M82r02J300r21L84o77P54n83P14k07L71J90L04j78n58M97j033M15J21
3104B76n25k59O11k11J62k37L80K52r40P78n03m38R31j139K92k5j78K22M13l94
$$ plain form
3124 -532 -446 1 633 893 58 -340 -56 -327 631 211 -407 459 421 821 -66 113 524 -289 423 -258 220
3145 220 -716 -122 -1609 -5 216 -49 141 -897 -887 -794 611 181 -297 -294 413 578 -132 401 403 579 621
3166 621 461 871 12 260 564 90 -505 -40 -71 169 -844 -215 -1143 -4 221 366 -46 -74 -69 59 84
3187 84 124 289 257 201 358 160 -59 422 459 924 91 305 170 305 -488 610 -271 -235 67 -819 -400 -3
3209 -3 -226 5 -330 -22 -465 -224 -186 884 -521 -116 -9 -97 249 -132 446 585 -8 409 57 218 325
3230 325 295 81 446 -380 -570 -224 26 -306 -167 -775 96 -281 -813 1 -295 -470 -363 -306 177 212 -368
3251 -368 190 33 314 244 30 246 -337 312 27 -402 -199 663 264 27 -184 -441 7 106 91 -444 -625
3272 -625 -540 75 -347 -161 -119 -284 -268 -173 197 -101 120 253 170 -98 -66 307 267 311 22 -229 166 241 554
$$ packed form
3124e32Q6M47O32K60q35l98K84k71R58m20o18Q66l8M00q87J79M11q13P12o81M78
3145B20r36N94j487J604K21k65J90j038J0R3J405m30m78LP07J65p10N33KJ76M2
3166F21j60M10q59K48L04m74n95M65l1K40j013O29r28J139K25J45m12k8NJ28K5
3187H4M0J65l2n6J57j98k19M81L7M65q33K14j35J35p93J098q81L6L02q86M19L97
3209ck23K31l35L08m43K41L8J070j405M05J07q8L46l81N78J39n93M17l52J61J07
3230C25l0k14L65q26j90L46K50l32J39o08Q71l77n32Q14k96j75J07N7M83L5n80
3251c68N58j57K81p0k14K16n83O49k85m29K03Q62l99k37k11k57M48R9j5n35j81
3272f25Q5O15m22J86M2j65J6R5L70k98K21J33q3k68L2L73m0M4k89k51L95P5L13
$$ plain form
3295 554 430 75 428 -147 98 -96 -21 -15 -347 -273 5 -50 -91 239 -110 -852 228 635 222 572 65 26
3317 26 -17 -177 -246 208 37 396 376 223 161 243 329 124 110 627 -224 0 96 -166 -345 -390 -403 -1161 118
3340 118 -362 75 405 -235 -706 -458 416 249 150 514 -309 -123 -228 408 133 189 730 -27 729 219 224
3361 224 124 -62 -557 -154 221 -748 244 179 -111 291 -258 340 -43 -170 -237 63 302 -218 3 -74 -9
3382 -9 69 599 311 146 519 308 118 259 188 -94 -211 -344 217 -234 123 -846 38 -126 -542 -705 -238
3403 -238 -243 58 494 -541 -398 -225 -57 -20 -7 -242 70 61 -132 -88 -271 25 254 -280 -174 17 -29 368
3425 368 -324 119 -52 -404 -572 -116 -60 111 -204 -368 -1377 73 388 -91 -36 -22 -569 -17 -165 -341
3445 -341 75 110 -96 495 563 226 -142 -51 10 81 332 -56 -1 -46 196 -250 -38 -491 -220 -276 -215 117 -531
$$ packed form
3295E54j24l55L53n75K45j94P5Ol32P4K78n5m1L30l49p42J080M07m13L50n07l9
3317B6m3j60o9M54j71L59k0j53o2Q2Q6k05j4N17q51K24R6k62j79m5j3p58J279
3340A18m80M37L30o40m71K48Q74j67r9L64q23J86j05O36k75N6N41p57P56n10N
3361B24j00j86m95M03L75r69R92o5k90M02n49N98l83j27o7L00K39n20K21p7O5
3382iP8N30k88j65L73k11j90J41p1k82j17j33N61m51L57r69Q84j64m16j63M67
3403b38nL01M36j035J43J73J68L7J3k35L12rj93M4j83K96K29n34J06J91m6L97
3425C68o92M43j71l52j68M56N6J71l15j64j009J450L15m79N5J4n47N52j48j76
3445c41M16L5k06N91O8l37l68R1O1P1K51l88N5m5K42m46K12m53K71n6O1L32o48
$$ plain form
3468 -531 -89 125 438 -358 275 57 367 -127 826 284 168 386 181 195 -225 -209 84 86 -140 310 -264
3489 -264 -105 -396 -306 -495 -103 -153 -58 45 -169 133 96 -196 -128 -493 429 30 -225 98 430 62 -342 101
3511 101 296 267 -166 -178 -91 -542 -498 -236 -1 321 -157 -743 -158 70 -196 -224 -699 -331 -584 62 181 381
3533 381 -288 -87 -334 15 -159 57 270 -271 197 -29 -92 278 -200 197 4 -5 -348 -193 -242 35 -106
3554 -106 -227 51 169 396 -163 -281 -158 -246 -443 78 -235 -661 50 2 354 518 92 -219 -18 -60 -329
3575 -329 183 95 381 -160 -132 -551 -164 380 -183 -135 -278 -430 131 2 -107 -429 -397 -78 -170 -343 -9 -205
3597 -205 96 181 519 -295 -170 -150 -261 93 124 155 260 -7 407 -132 -199 -52 -403 -114 455 141 433 -370
3619 -370 -581 206 -674 -251 -253 -315 11 -189 -456 -242 321 208 -21 -5 -37 42 562 -36 -242 -197 199 -40
$$ packed form
3468e31M42K14L13p96O33k18L10m94R53n42j16K18k05J4m20J6K93Kk26M50n74
3489b64J59k91R0j89L92n0R5J03k14L02l7k92O8l65R22l99k55L23L32l68m04M43
3511A01J95k9m33j2Q7m51M4K62K35L22m78n86N85K28k66k8m75L68k53O46J19K00
3533C81o69K01k47L49j74K16K13n41M68k26o3L70m78L97j93rl43J55m9K77j41
3554a06j21K78J18K27n59j18J23q8j97N21l13m26P11m8L52J64m26l11K01m2k69
3575c29N12q8K86n41K8m19L87N44n63M8j43j52N61j29j09l22L2L19r2j73L34j96
3597b05L01Q5L38q14J25K0j11L54L1L1J05k67M14n39o7J47l51K89N69l14K92q03
3619c70k11P87q80M23ko2L26k00k67K14N63j13k29J6l2P9N20n98k06M5L96k39
$$ plain form
3641 -40 472 188 -243 314 119 -535 276 458 249 -292 -385 -108 107 -911 -174 -426 -764 10 -193 -214 226
3662 226 184 -41 -7 -21 -122 247 288 16 416 176 200 46 -533 -127 152 -151 96 -137 -204 -93 -599 -874
3684 -874 -275 -199 298 -435 -227 8 -314 -341 -150 -421 -308 -122 469 -18 -34 340 -12 -104 358 223 230 169
3706 169 -160 215 373 289 -77 -490 -196 166 11 -311 321 356 -353 -438 -188 -284 -209 -398 28 181 349 72
3728 72 -199 344 410 511 173 -61 -118 491 -7 514 553 -455 -8 64 -84 -423 -187 244 -313 -148 -652
3749 -652 117 229 -848 624 189 892 39 934 97 -464 787 1011 148 674 -299 -123 238 -191 616
3768 616 108 146 241 271 421 195 -129 298 122 473 -316 164 -279 270 -27 -319 -476 -198 152 -318 333
3789 333 -195 -50 15 176 374 431 -238 -340 111 60 30 155 171 -510 418 -25 368 80 -90 144 -183 137
$$ packed form
3641d0N12k84m31N57j95o54Q11J82k09n41r3K77K15j018P37k52l38P74k03k1M40
3662B26m2k25L4j4j01L69M1k72M00k40K4j54n79M06K79l03K47k33o7J11n06k75
3684h74N99P6M97p33K08K35l22k7J91k71J13J86N91m87j6L74l52r2M62j35Po1
3706A69l29L75J58q4l66m13K94L62j55l22O32L5p09q5K50r6P5j89M26J53J68k77
3728G2k71N43O6J01l38k34n7O09m98N21L9j008M47P2j48l39K36M31n57J65n04
3749f52P69J12j077J472m35P03q53Q95q37n61J251K24q63N26r73J76L61m29Q07
3768F16n08L8R5L0J50k26l24M27j76L51p89M80m43N49k97k92j57K78L50m70O51
3789C33n28J45O5J61J98N7o69j02M51n1l0J25J6o81R28m43L93k88j70K34l27L20
$$ plain form
3811 137 235 -4 -555 -280 -274 -276 201 467 187 6 132 272 -135 509 148 43 -242 -25 127 87 -17 -48
3833 -48 -38 -31 133 -347 -478 -25 -274 -333 104 -364 222 56 -505 -194 -656 513 -262 -250 -159 38 -124 101
3855 101 161 596 825 51 347 258 -2 396 -549 -254 285 -69 148 289 290 -162 -170 145 -11 -283 -561 24
3877 24 -260 -630 311 118 22 -336 321 132 16 222 -96 60 249 190 67 306 72 -145 -101 31 -379
3898 -379 -416 -134 -49 -10 -78 86 337 -734 850 -740 778 139 173 -17 -26 679 -97 122 472 -376 -1176
3919 -1176 31 565 720 -484 -777 101 638 811 819 -786 53 -63 -683 -340 89 -241 -886 151 68
3938 68 282 650 -1189 -330 -293 -713 123 248 269 18 -271 -288 537 -498 155 693 59 -340 -13 -14 -459
3959 -459 -309 62 -182 -76 -271 160 -218 359 -142 -357 11 -180 -314 -181 -37 134 46 393 -376 121
$$ packed form
3811A37R8k39n51K75OkM77K66k80j81J26J40m07O44l61j05k85K17J52m0j04l1
3833d8J0PJ64m80j31M53k49n9M37m68N86j66n61L11m62J169p75J2R1J97j62K25
3855A01O0M35K29p74K96q9k60L98r45K95N39l54K17J41Jm52qL15j56k72k78N85
3877B4k84l70R41j93r6l58O57j89j16K06l18J56J89n9j23K39k34k17M4J32m10
3898c79l7K82Q5L9o8J64K51j071J584j590J518o39L4j90rP05p76K19L50q48q00
3919a176J207N34J55j204k93Q78N37J73Qj605Q39j16o20L43M29l30o45J037q3
3938F8K14L68j839Q59L7m20Q36J25K1k51k89j7Q25j035O53N38o34l99L27jm45
3959d59J50L71k44J06j95M31l78N77n01k15L68j91j34J33J44J71q8L47p69M97
$$ plain form
3979 121 4 -111 254 140 25 142 -23 113 182 110 -73 -107 -301 -227 40 52 -165 -272 -296 -45 184 -102
4001 -102 -129 -106 24 -166 -86 110 -18 275 -120 58 -200 146 201 127 305 -39 184 24 -46 -76 49 45 4
4024 4 45 205 -112 -53 -62 95 -174 -193 -93 -360 83 16 99 -92 168 96 -96 -98 257 226 -25 -20 147 60 369
4049 369 172 -25 175 140 100 -81 -195 50 -207 -115 -20 -89 -150 139 -190 178 -246 -553 93 -233 7 -90
4071 -90 -45 124 -27 53 242 179 -154 261 2 66 51 14 -103 -106 -32 46 131 -139 291 -321 43 196 -58 -70
4095 -70 -280 -271 -52 -155 -88 -69 -73 3 200 66 432 50 298 226 347 245 77 -4 196 103 -176 -18 286 -84
4119 -84 -126 130 281 7 68 -75 -164 104 -116 30 -83 150 -72 138 22 -67 197 -109 217 81 163 19
4141 19 -67 550 196 84 264 -110 -181 -33 -152 132 -79 -215 186 -1 19 -139 -372 -204 -98 -364 162
$$ packed form
3979A21j17j15L65j14j15J17j65J36O9p2j83l4j94P4K67J2k17j07k4K51K29k86
4001a02k7K3J30j90Q0J96j28K93l95J78k58L46N5p4J78l44K23j60p0l0J25mm1
4024DM1J60l17N9rJ57k69j9J00k67M43o7Q3j91K60p2j92kL55l1k51NJ67q7L09
4049C69j97j97K00l5m0j81j14K45k57R2R5o9o1K89l29L68m24l07O46l26K40r7
4071i0M5J69j51Q0J89o3l33M15k59O4j5l7j17lP4P8Q5k70M30o12L64J53k54j2
4095g0k10RK19j03O7J9mP6J97j34L66l82K48p2J21j02j68q1K00r3k79J58L04l70
4119h4m2K56J51k74O1j43q9K68k20J46j13K33k22K10j16q9K64l06L26j36Q2j44
4141A9q6O17l54j12J80l74p1J48j19K84k11j36M01j87K0j58k33J68J06k66N26
$$ plain form
4162 162 29 146 4 -2 -98 -119 -36 106 83 -124 -34 -7 142 336 -82 -162 -77 -132 82 -111 39 -84 172 -118
4186 -118 -295 -23 -291 -254 -312 -88 -146 -26 -196 -189 -209 -252 69 -55 -192 238 -4 98 281 219 118 -71 174
4209 174 143 146 -251 97 -171 122 -189 -182 -46 159 -171 -34 59 107 -163 70 268 99 217 -228 -186 232 77
4232 77 -19 131 192 246 334 196 385 118 154 -2 79 -129 -227 -124 -292 -105 -295 92 -90 -396 133 -182 -241
4255 -241 -399 -118 -411 -125 163 12 134 19 4 130 281 109 107 127 -31 79 13 190 150 469 -17 -79
4277 -79 -252 -220 9 -95 43 -41 -228 -5 -92 76 -215 50 -154 155 90 99 95 -25 118 -136 163 -224 153
4300 153 -217 156 -144 -162 -113 23 -260 260 -32 -36 106 -143 -78 77 -424 130 -139 -253 -185 -305 36 -108
4322 -108 32 154 -368 290 123 -173 433 -126 -1 343 202 -151 117 -158 242 -407 -26 37 -57 -114 -325
$$ packed form
4162A62j33J17j42or6k1Q3J42k3k07R0K7J49J94m18q0Q5n5K14j93J50j23K56k90
4186a18j77K72k68L7n8K24n8J20j70Pk0m3L21j24j37M30k42J02J83o2j01j89K45
4209A74l1Ll97L48k68K93l11PJ36K05l30J37R3M8k70K33J98j69J18m45M2M18j55
4232G7r6J50O1N4Q8j38J89k67L6j56Q1k08r8J03j68J87j90L87j82l06N29l15n9
4255b41j58K81k93K86K88j51J22j15j5J26J51j72kK0j58J10o6J77m0L19m86o2
4277g9j73L2K29j04J38q4j87K23q7J68k91K65k04L09o5Rmj20J43k54K99l87L77
4300A53l70L73l00j8M9J36k83N20k92mJ42k49O5J55n01N54k69j14O8j20L41j44
4322a08J40J22n22O58j67k96O06n59J25L44j41l53K68k75M00o49L81O3r4n7k11
$$ plain form
4343 -325 -236 389 103 23 -144 -195 -41 36 124 -161 25 -47 73 -91 -91 245 27 346 -19 33 154 185 209 -70
4367 -70 -77 -38 -139 -21 -187 -158 67 -111 -169 -130 -195 -84 -28 -156 -120 -170 51 -120 -14 9 -160 138 -195 398
4391 398 -160 47 15 33 159 308 201 -143 189 156 114 161 -249 -251 135 -185 -267 -40 -48 -208 -197 -42 15 -132
4415 -132 183 132 -43 128 62 104 302 -54 359 139 103 -17 16 146 45 348 -191 -279 10 -177 122 -265
4437 -265 39 -45 -55 -367 -230 306 40 -158 -178 -191 -25 -56 199 -63 -212 246 219 112 -28 155 286 220
4459 220 223 -119 145 -225 195 -72 102 196 -29 -109 -94 -176 -323 -214 -147 -57 -293 -16 -248 240 -15 87 36
4482 36 383 358 -1 -55 332 48 235 255 3 129 -244 278 -95 -287 -35 509 -243 164 58 -111 309
4503 309 -315 -111 -322 -248 -531 204 -75 -139 311 115 -116 214 -1 353 93 242 -217 -135 -137 -310 -182 -13
$$ packed form
4343c25Q9O25k86q0j67n1J54P7Q8k85J86p2J20j64%L36k18L19l65N2J21L1K4k79
4367g0pL9j01J18j66K9K25j78n8L9o5J11N6j28L6n0K21j71J06K3j69K98l33N93
4391C98n58K07l2J8J26J49j07l44L32l3m2M7m10kL86l20q2K27qj60J1J55N7j47
4415a32L15n1j75J71o6M2J98l56M13k20l6j20L3J30j01L03n39q8K89j87K99l87
4437b65L04q4j0l12J37N36k66j98k0j3J66l1K55k62j49M58k7j07j40J83J31o6
4459B20Ll42K64l70M20k67J74R4k25q0J5q2j47J09O7R0k36K77k32M88k55J02n1
4482C6L47k5l59n4L87k84J87K0k52J26l73N22l73j92K52N44p52M07j06j69M20
4503C09o24K04k11P4k83P35k79o4M50j96k31L30k15L54k60J49m59Q2kj73J28J69
$$ plain form
4525 -13 23 448 -69 134 171 -42 67 -161 341 -204 -111 98 -209 -85 39 16 -68 -24 -143 122 -261 -322 -17
4548 -17 -119 57 671 616 190 474 36 15 325 265 80 227 390 -244 -191 185 -337 317 137 207 157 24
4570 24 37 145 16 141 103 -61 -36 -157 220 272 -29 -61 702 677 -461 468 165 -195 -12 433 138 7
4592 7 -740 -202 367 74 23 -80 -113 -343 99 -610 455 379 254 148 228 165 469 360 174 5 36 -325
4614 -325 -347 -146 -298 75 518 116 243 233 191 -129 14 73 -482 -161 37 -137 -99 -228 117 190 -214 50
4636 50 -519 235 -368 -425 218 -176 154 25 19 294 -170 -128 373 -297 376 573 395 -73 89 175 314 -55
4658 -55 336 -245 -207 -367 -134 -149 -228 -359 263 86 -27 -220 -246 8 -419 -342 117 -60 -149 45 388 33
4680 33 -58 71 279 69 -403 140 -148 110 225 -144 206 160 250 -89 -189 226 -343 205 70 -171 -382
$$ packed form
4525a3L6M25n17K03L7k13J09k28N02n45R3K09l07J24J24k3q4M4j19K65l83o1L05
4548a7j02J76O14n5m26K84m38k1L10o0j85J47J63o34N3L76n22O54j80P0n0j33
4570B4J3J08j29J25l8j64K5j21L77N2l01l2P63k5j138R29l03l60J83M45k95j31
4592Gp47N38N69k93n1j03l3k30M42p09J065p6j25j06Q0o3L04j09j86j69L1l61
4614c25k2K01j52L73M43m02J27j0m2l20J43N9n55L21J98j74L8j29L45P3m04K64
4636E0n69P54o03n7O43l94L30j29oK75m64M2N01o70O73J97j78m68J62Q6J39l69
4658e5L91n81L8j60K33j5p9j31O22j77j13j93k6K54m27P7M59j77q9J94L43l55
4680C3r1J29K08k10m72N43k88K58J15l69L50m6R0l39j00M15n69N48j35k41k11
$$ plain form
4701 -382 212 57 224 50 75 -259 -3 186 213 437 -478 -245 -175 278 651 539 243 -156 -352 195 -263
4722 -263 -28 110 -121 244 -35 278 -123 61 32 128 103 -484 -42 220 3 -212 636 -354 60 232 -43
4743 -43 -69 593 257 56 379 143 127 -349 -380 74 170 -330 -431 632 -818 41 -69 214 -371 468 203
4764 203 322 746 -89 -113 -113 532 -105 73 937 593 187 340 -780 -24 54 503 -30 -178 -13 -47 -164
4785 -164 408 -211 224 113 -391 -308 480 644 -185 -196 -152 -106 453 -459 787 -449 487 -1333 281 -343
4805 -343 -220 195 -702 -80 -426 587 483 118 -637 30 -5 -1101 416 -48 -109 511 -386 860 -65
4824 -65 89 215 -431 843 43 -597 -117 -938 -280 103 190 -96 766 99 245 193 -160 218 -929 -439
4844 -439 48 -120 158 173 596 -435 -2 571 86 -833 575 -438 0 267 -991 -342 -444 164 818
$$ packed form
4701c82N94j55J67j74K5l34K56J89K7K24r15K33P0M53L73j12k96l99j96N47m58
4722b63K35J38k31L65k79L13m01J84k9R6k5n87M42K62k17k15Q48r90M14J72k75
4743d3k6O62l36k01L23k36j6m76l1M54R6n00j01J063j450Q59j10K83n85Q39k65
4764B03J19M24q35k4%O45o37J78Q64l44m06J53j120P56P8M49n33j48J65l4j17
4785a64N72o19M35j11n04Q3P88J64q29j1M4M6N59r12J246j236R36j820J614o24
4805c43J23M15q97O22l46J013j04l65p55O67l5j096J517m64o1O20q97J246r25
4824f5J54J26o46J274q00o40M80q21O58L83Q7k86Q62o67J46n2l53L78j147M90
4844d39M87j68K78J5M23j031M33N73m85r19J408j013M38K67j258O49j02O08O54
$$ plain form
4863 818 205 150 82 -58 398 847 -558 -75 758 140 104 -349 -980 -229 -243 -575 308 483 -131 -542 -683
4884 -683 -952 -702 548 43 -179 524 -424 -648 168 178 -211 716 450 158 -736 214 -465 208 279 -3
4904 -3 -191 691 -293 -626 366 52 -37 -460 -116 -377 -103 -209 501 343 344 136 -638 704 -884 -36 -639
4925 -639 -542 331 -343 -408 39 -547 69 435 384 389 76 616 -225 -226 -658 -205 143 231 545 -97 -21 -587 -73
4948 -73 -57 442 -103 661 191 298 323 -111 -161 -72 211 718 35 133 -995 343 245 87 -254 392 -276 -278
4970 -278 254 -273 -694 -295 -273 106 -738 122 -232 708 705 -15 566 -178 81 -90 -262 378 -83 124 352
4991 352 -424 230 -218 152 -69 353 -81 -251 -270 699 -6 63 127 -421 10 408 -566 -177 -173 204 530 -327
5013 -327 60 -132 -383 -121 -169 936 55 -38 544 -150 113 844 364 -368 6 -479 274 120 -444 -319
$$ packed form
4863H18o13n5o8j40M56M49j405M83Q33o18l6m53o31P51j4l32Q83J75o14m11j41
4884f83k69K50J250n05k22P03r48k24Q16J0l89R27k66k92q94R50o79O73P1k82
4904cj88Q82r84l33R92l14q9m23L44k61K74j06P10j58Jk08p74J342j588Q48o03
4925f39R7Q73o74o5M47n86O16L66n1Nl13N40q41jm32M53L48Q8L14o42P6n66N14
4948g3J6M99n45P64m70J07K5m34n0Q9K83N07o83R8j128J338r8j58l41O46o68k
4970b78N32n27m21L99K2L79q44Q60l54R40lp20N81p44K59j71j72O40m61K07K28
4991C52p76O54m48L70k21M22m34j70j9R69p05O9O4n48M31L98r74L89ML77L26q57
5013c27L87j92k51K62m8J105q81r3N82o94K63P31m80p32L74m85P53j54n64J25
$$ plain form
5033 -319 408 -76 -442 -305 7 736 -38 -796 521 252 -428 -381 -539 -711 -9 444 -277 595 -586 -347
5053 -347 -16 446 -217 -748 158 -771 168 300 -546 251 254 -345 836 -591 202 -246 -230 -295 -514 -88 -332
5074 -332 -966 172 -693 340 198 -102 277 -781 -1165 65 -711 216 -257 -380 430 206 11 325 693
5093 693 -133 324 -214 -227 316 -818 136 86 503 -284 257 204 47 -332 -281 67 -658 598 -158 26 -219
5114 -219 72 -865 -142 390 653 -319 -219 -749 470 -120 747 498 -380 -267 -545 -94 608 32 62 473
5134 473 487 484 -816 -211 549 676 -294 1 340 107 224 -61 -707 -207 -145 791 248 68 32 595 69
5155 69 -44 -223 -181 -137 -82 -629 -128 199 -111 119 129 144 413 -484 -234 26 -256 544 -128 -575 -368 -659
5177 -659 218 -288 300 -50 262 -569 384 -183 -296 237 89 432 -7 175 -295 -339 -31 -181 273 -392
$$ packed form
5033c19P27m84l66J37L12P29p74p58J317k69o80M7j58j72P02M53p21Q72j181K39
5053c47L31M62o63n31R06r29R39J32q46P97Ln99J181j427P93m48J6o5k19M26k44
5074c32o34J138q65J033j42l00L79j058l84J230p76R27m73j23Q10k24j95L14L68
5093F93q26M57n38j3N43j134R54n0M17p87N41n3j57l79N1L48p25J256p56J84k45
5114b19K91r37P23N32K63r72J00n30J219n90Q67k49q78J13k78M51P02n76L0M11
5134D73J4lj300O05P60J27r70K95L39k33J17k85o46N00O2R36n43j80l6N63n26
5155F9j13j79M2M4N5n47N01L27l10K30J0J5K69q97K50K60k82Q00o72m47K07k91
5177f59Q77n06N88l50L12q31R53n67j13N33j48L43m39J82m70m4L08j50M54o65
$$ plain form
5197 -392 429 253 -171 246 -267 323 297 -164 -203 273 -225 -24 -444 -15 -500 158 -4 -184 75 -433 -153
5218 -153 151 -345 126 -601 -372 -61 66 -236 95 494 -406 -151 -825 103 313 -2 -45 -87 -504 301 663
5239 663 -94 -286 -77 444 -151 162 282 -638 -107 222 479 -1 -303 149 -438 316 -188 123 26 465
5259 465 485 -544 41 -154 51 -201 151 174 102 300 607 -406 85 -118 101 -72 -473 13 63 377 -42
5280 -42 128 351 -407 117 -134 -77 -28 -392 -374 -322 -30 377 327 -301 -226 274 87 -298 231 299 77 382 -283
5303 -283 -540 252 176 -487 159 -45 287 24 409 509 481 -32 291 55 294 -568 148 -237 -173 2 -61
5324 -61 -459 -247 205 -260 -562 -426 -202 278 216 -174 651 -21 443 -416 -11 305 -131 260 184 -45 682
5345 682 306 -483 -85 464 33 110 291 -81 606 357 -424 -532 -370 -106 280 551 -207 430 -701 -49
$$ packed form
5197c92Q21j76m24M17n13N90k6m61l9M76m98K01m20M29m85O58j62j80K59n08K80
5218a53L04m96M71p27K29L11J27l02L31L99r00K55o74R28K10l15m3m2m17Q05L62
5239F63p57j92K09N21n95L13J20r20N31L29K57m80l02M52n87P54n04L11r7M39
5259D65K0j029N85j95K05k52L52K3p2J98L07j013M91k03K19j73m01M86N0L14m19
5280d2J70K23p58N24k51N7M9l64J8N2K92M07n0o28P5N00j87l85N29O8k22L05o65
5303b83k57P92p6o63O46k04L32k63L85J00k8n13L23k36K39q62P16l85O4J75o3
5324f1l98K12M52m65l02J36K24M80o2l90Q25o72M64q59M05L16m36L91p6k29P27
5345F82l76p89L98N49m31P7J81l72O87k49p81j08J62K64L86K71p58O37j131O52
$$ plain form
5365 -49 429 660 708 -194 940 37 -440 -296 694 -124 -376 281 -255 703 3 552 -98 550 455 -122 933
5386 933 -46 81 -273 -228 234 456 137 740 281 -527 251 -312 -608 -163 -684 692 -382 260 496 448
5406 448 660 230 -23 1191 -223 -186 -193 -318 182 -391 529 49 19 159 -181 -382 85 282 -690 558
5426 558 -38 -691 44 375 16 776 222 -437 268 259 36 64 565 -6 -312 83 126 806 168 -435 178
5447 178 -414 608 -225 -56 90 -82 105 -379 -22 -108 -267 -36 308 165 -426 -282 81 242 -38 119
5467 119 383 -128 219 255 -108 -35 -112 -30 -170 -215 311 -694 -500 345 -187 52 159 -51 -30 551 -469
5488 -469 85 -220 67 55 155 187 -234 -43 -261 112 -285 68 344 215 16 130 98 -104 78 49 91 17
5510 17 301 -347 221 13 46 -86 148 -20 -196 51 105 249 156 -149 -229 360 -33 -65 22 62 -138 -9 33
$$ packed form
5365d9M78K31M8r02J134r03m77J44R90q18k52O57n36R58p00N49o50O48r5n77J055
5386I33r79J27l54M5M62K22l19O03m59q08P78n63k96M45n21J376j074O42K36m8
5406D48K12m30k53J214j414L7pj25N00n73R20m80l0J40l40k01M67J97r72J248
5426E58n96o53P35L31l59P60n54o59P05rk23K8N01n71l06L95M3O80o38o03O13
5447A78n92J022q33J69J46j72J87m84L57q6j59K31L44j43n91J44L63J61k80J57
5467A19K64n11L47L6l63P3p7Q2j40m5N26j005J94Q45n32K39J07k10K1N81j020
5488d69N54l05K87j2J00L2m21J91k18L73l97L53K76j29j99J14l2k02J82k9M2p4
5510A7K84o48N68k08L3j32K34j68j76K47N4J44r3l05q0N89l93l2Q7M0k00J29M2
$$ plain form
5533 33 216 30 92 32 -191 93 131 -56 -92 -278 -133 -65 -12 -128 80 -90 66 114 238 74 64 59 -3 124
5557 124 125 316 129 -153 -18 119 72 157 28 242 85 -398 62 -8 -181 -199 70 10 -45 -92 -210 67 41
5580 41 -272 -131 -105 -52 92 100 312 114 139 -30 83 -30 -120 -87 1 217 148 161 189 4 -205 7 -194 -91
5604 -91 5 -88 -4 -283 38 -181 -17 -33 -56 -98 -20 -172 216 175 -130 14 88 -104 191 37 103 71 218 -130
5628 -130 -9 162 -67 -111 -90 129 -157 14 -306 148 -117 -134 1 78 -29 -57 16 -105 -324 149 -83 29
5650 29 80 -73 -111 21 101 132 88 51 79 169 134 -51 195 -6 -201 -86 -306 -24 -50 -52 -27 1 -62 230 126
5675 126 -207 -119 290 -244 -50 266 51 -179 -74 187 -51 -4 112 -353 -66 112 88 158 -95 100 -72
5696 -72 -351 -31 -25 -160 -50 -200 -6 -195 -66 -26 -13 120 -11 -34 -86 -65 -25 41 1 36 17 96 192 99 163 15
$$ packed form
5533C3J83j86O2o0k23K84L8j87l6j86J45O8N3j16K08j70J56M8J24j64j0no2J27
5557A24JJ91j87k82J35J37m7Q5j29K14j57m83M60p0j73j8K69o0n5m7j18K77k6
5580D1l13J41K6N3J44QK12j98K5j69J13j13r0L3Q8K16o9J3K8j85k09K12k01J03
5604i1R6r3Q4k79L21k19J64j6k3m2P8j52L88m1l05J44P4j92K95j54O6l2J47l48
5628a30J21J71k29m4K1K19k86J71l20M54k65j7J35P7j07k8P3j21k19M73k32J12
5650B9N1j53l8J32Q0L1m4l7K8R0l5j85K46k01j95J15k20K82k6kK5K8o3K92j04
5675A26l33Q8M09n34J94L16k15k30J05K61k38M7J16m65K87J78k4P0k53J95j72
5696g2k79L20Oj35J10j50J94j89J29M0J3J33j31k3n2K1M0O6m0L5j9P9R6r3O4j48
$$ plain form
5722 15 -130 -60 -76 -149 34 -63 12 34 -275 106 74 106 -220 -116 53 -263 60 55 -26 -426 -185 4 180 20
5746 20 36 68 -115 269 -56 268 112 -21 -129 -252 -176 -58 168 -27 -158 -93 205 45 -27 -117 0 79 -54
5769 -54 117 135 91 -231 196 -51 -92 -2 148 279 -190 147 264 185 107 137 -201 44 -88 -125 -193 77 -54
5792 -54 -73 -249 43 -64 -194 -85 117 59 -27 232 -9 34 176 -226 100 26 115 -123 250 -201 -179 2 -156
5815 -156 124 85 215 27 -53 74 -106 -167 88 -100 125 -143 -41 -208 -58 -84 -28 22 221 -53 116 -78
5837 -78 42 -100 25 -100 -75 190 15 255 -77 -102 311 187 -15 118 -241 -89 31 150 -124 -4 -57
5858 -57 -19 103 -93 100 58 -148 120 77 -14 181 -144 -91 87 -150 -56 -28 39 -4 11 51 -51 -278 12 43
5882 43 71 13 5 94 -71 -110 88 -77 146 -130 -149 -123 145 -141 174 -88 69 -39 -33 -7 -164 -83 -66 -40 36
$$ packed form
5722A5j45P0j6p3J83r7P5K2l09L81l2L2l26J04J69l16L23nq1m00K41J89J76j60
5746B0J6L2j83L84l25L24j56j33j08j23P6J18K26j95j31O5K98j60p2r0J17P9j33
5769e4J71J8m4l22M27k47m1R0J50J31m69L37J17p9p8L0l38K45j32l7o8K70j31
5792e4j9j76K92j07j30J09K02n8q6K59k41M3J42m02L26p4Q9k38L73m51K2J81j58
5815a56K80l9J30j88q0J27j80o1K55j88K25k68J02j67J50k6N6N0J99k74J69j94
5837g8J20j42J25j25K5K65j75K40l32k5M13j24k02J33l59J52J20J19k74J20n3
5858e7L8J22j96J93m2k06K68m3r1J95l25N3J78k37R4K8O7m3J5M0j02k27K90L1
5882D3K8n8qQ9j65l9J98j65K23k76j9K6K68k86L15k62J57j08OK6j57Q1J7K6P6
$$ plain form
5907 36 50 61 -102 99 105 103 261 -124 194 231 66 -116 -42 167 -139 -193 46 79 -102 -195 61 -206 22 -6
5931 -6 -129 230 33 -11 55 202 20 24 175 94 32 -146 -78 368 -95 -12 108 -196 33 -4 -31 8 -30 -53 -35
5956 -35 62 -40 -148 -53 152 -55 -141 -134 -127 -259 9 134 149 243 274 251 44 189 191 -106 69 -137 -26 151 -45
5981 -45 -110 5 -173 -50 -7 69 -99 -39 126 -226 -108 -169 97 -250 56 -151 74 39 -151 11 169 224 189
6004 189 -57 221 142 9 55 20 -3 -107 -45 42 61 -96 104 -345 -156 17 -45 106 31 -231 -36 60 118 -51
6028 -51 -205 -141 197 -71 141 65 81 145 204 13 114 -49 274 -4 5 -183 92 -26 -32 -148 74 -254 -252 41
6052 41 -98 -125 -20 186 54 1 -253 45 282 -61 -334 138 -116 85 55 141 282 -355 106 228 248 -269
6074 -269 548 -138 376 86 545 856 -374 -210 419 -570 -655 534 129 942 -639 63 300 -334 198
$$ packed form
5907C6J4J1j63K01OkJ58l85L18L7j65j82P4K09l06n4K39L3j81r3K56k67K28k8
5931fj23L59j97m4O6J47j82MJ51q1o2j78O8M46m63Q3J20l04K29l7k7L9l8k3J8
5956c5R7j02j08R5K05k07q6PPj32K68J25J5R4L1k3k07J45Kk97J75k06J11J77j96
5981d5o5J15j78J23M3P6j68O0J65l52J18o1K66l47L06k07K25l5j90J62J58N5l5
6004A89k46K78p9j33M6l5k3j04O2Q7J9j57K00m49J89J73o2J51p5k62J95R6N8j69
6028e1j54O4L38k68K12p6J6O4N9j91J01j63L23k78Rj88K75j18oj16K22l28KK93
6052D1j39k7J05K06j32n3k54K98K37l43k73M72k54K01l0Q6J41o37M61J22K0n17
6074b69Q17o86N14k90M59L11j230J64O29r89q5J189m05Q13j581P02K37o34N32
$$ plain form
6093 198 604 -65 1175 373 90 -182 748 -393 384 256 -328 -13 101 -253 127 608 586 -165 62 297
6113 297 269 704 537 115 -529 -147 -95 594 -365 310 42 -61 -197 -12 296 -22 -266 232 -27 39 -58
6134 -58 -143 272 -7 -556 -295 -78 -214 -26 -18 12 76 198 -163 254 135 -119 -370 -184 -125 -111 6 -234 -44
6157 -44 130 0 -222 168 423 25 -141 -104 113 -18 221 181 23 -100 -65 -173 182 76 -45 -36 -71 -270
6179 -270 -128 -200 -174 22 102 -202 26 45 -34 136 -71 67 63 -37 -76 134 -245 89 -50 37 -147 -178 -35
6202 -35 151 47 -12 183 -222 63 -50 107 -318 -141 81 -31 67 145 93 -83 113 353 470 331 -315 -216
6224 -216 -6 238 370 160 23 83 105 32 3 28 130 -131 34 96 57 -104 -104 29 -205 48 92 -3 -51 368
6248 368 -166 -57 -238 -97 166 131 -3 125 151 43 -94 -190 -232 7 279 -269 232 -28 -240 85 -121
$$ packed form
6093A98M06o69J240q02k83k72R30j141P77j28n84L15J14l54L80M81k2p51K27K35
6113B97k8M35j67m22o44L82N2O89r59O75k68j03j36J85L08l18k44M98k59O6r7
6134e8q5M15k79n49K61K17j36J88QL0O4J22l61M17j19k54k51J86N9J4J17k40J90
6157d4J74j30k22L90K55l98j66L7K17j31K39m0j58j23L5j08L55j06j21Rl5j99
6179b70J42p2K6J96Q0l04K28J9p9J70k07J38mj00l9K10l79L34j39Q7j84l1J43
6202c5J86j04n9J95m05K85j13J57m25J77K22j12R8P8n2j76J96K40J17j39o46R9
6224b16K10K44J32k10j37O0K2p3k9K5J02k61J65O2l9j61%J33k34K53M4r5m8M19
6248C68n34J09j81J41K63l5j34J28K6j08j37r6m2K39K72n48N01k60k12L25k06
$$ plain form
6269 -121 69 -70 215 141 -237 44 -256 17 90 -62 138 -51 -83 113 204 13 -45 -54 85 20 54 -135 -30
6292 -30 67 40 -216 15 -190 -41 -67 57 -204 -60 261 -122 -378 202 -172 -199 50 58 -9 -83 386 -58 92
6315 92 -11 127 -35 -54 100 230 -252 -17 39 9 -70 157 136 -29 -171 -158 87 -145 22 133 -92 -244
6337 -244 -237 -209 174 212 22 -134 -329 89 81 71 -58 71 191 271 160 122 29 397 -49 -77 60 -101 -207 191
6361 191 -204 -310 -390 -58 108 -255 81 -221 11 409 313 -71 -170 376 -127 -135 202 -10 -15 29 28 318 209
6384 209 198 -292 115 194 -235 -111 -26 -359 -140 80 418 524 -317 326 -359 -272 -52 276 -205 330 222
6405 222 -231 187 258 46 118 359 -175 494 222 -239 -59 79 -362 27 -223 -82 -398 -37 318 -99 -133
6426 -133 266 173 -391 -31 187 -251 -133 -310 -277 -484 200 -137 -33 92 -334 67 42 -2 189 -154 -164 -189
$$ packed form
6269a21J90j39K85p4l78K81l00K73P3j52K00j89l2J96R1j91n8rJ39o5L4j89J05
6292c0R7k7k56K31k05J49k6J24k61J44L21l83k56N80l74k7K49Qo7p4M69m44J50
6315I2j03J38j62j9J54J30m82K35N6l0p9K27k1j65j42J3K45k32J67J11k25j52
6337b44PK8L83L8j90j56j95M18qj0j29J29J20Q0j11l8r3L68m46k8J37j61j06L98
6361A91l95j06q0L32J66l63L36l02K32L98r6l84r9N46n03qL37k12nM4jK90j09
6384B09j1m90M07P9m29J24Q5l33K19K20L38J06q41O43o85Q7K20L28m81N35j08
6405B22m53M18P1k12P2K41n34O69k72m61J80J38m41L89k50J41l16L61L55m17l4
6426a33L99r3n64L60K18m38J18j77L3k07O84l37J04J25m26M01k5m4J91l43j0k5
$$ plain form
6448 -189 -324 114 145 83 -22 175 -256 634 -464 -769 -831 -490 551 333 179 -422 -90 392 467 -132 161
6469 161 19 -321 308 662 -394 65 296 260 -477 -458 166 200 -356 327 76 29 -364 -252 533 -246 415
6490 415 -380 234 -442 313 67 120 39 93 -95 -517 273 -14 467 -340 326 -91 -658 -572 239 486 -132
6511 -132 -294 -150 -500 162 -857 -329 200 320 -344 -650 -374 -783 -401 -508 -883 -181 130 -71 -1068 -973
6531 -973 -376 171 18 290 -9 -536 441 -76 -243 -155 -200 -936 -42 1325 -415 472 -258 421 -88 -114
6551 -114 126 -56 237 86 -356 -673 -279 -667 -588 -609 346 413 105 113 255 532 -63 551 -314 -661 -390 -290
6573 -290 12 -226 -63 -694 -27 572 78 32 -114 -223 -133 124 -192 -671 1 463 -673 -195 474 -307
6593 -307 622 4 -313 -67 90 257 26 -182 -205 -1 -131 201 421 -113 595 146 -532 71 -311 437
$$ packed form
6448a89j35M38L1o2j05J97m31Q90j098l05o2L41J041k18j54o01L32M82P5n99K93
6469A61j42l40O29L54j056M59K31l6p37J9O24L4n56O83k51m7l93J12P85p79O61
6490D15p95O14o76P55k46N3q1N4j88m22P90k87M81q07O66m17n67Q6Q11K47o18
6511a32j62J44l50O62j019N28N29J20o64l06K76m09L82j07l75P02L11k01r97R5
6531i73N97N47j53K72k99n27R77n17j67Q8m5p36Q94J367j740Q87p30O79n09k6
6551a14K40j82K93j51m42l17L94l88P9k1R55O7l08QJ42K77n95O14q65l47K71J00
6573b90L02k38J63o31O67N99m94m6j46j09R0K57l16m79O72M62j136M78O69p81
6593c07R29o18l17K46J57J67k31k08k3K04j30L32K20n34P08m49o78O03l82P48
$$ plain form
6613 437 232 375 -250 83 -22 96 -156 111 -240 39 313 163 -125 -59 -260 -97 -463 -16 184 -131
6633 -131 -106 -94 154 -118 -107 -108 -29 -120 167 111 110 159 93 -124 -43 -232 -2 162 -376 -101 -24 4 -168 -80 16 160
6659 160 168 -282 162 -97 -346 207 -155 435 -203 -386 162 98 -40 -118 49 259 -151 93 189 -260 552 -164
6681 -164 -91 -170 112 -185 -14 -185 108 -324 -23 6 210 76 -251 -138 175 -336 98 -34 48 218 -136
6702 -136 -122 126 217 650 -234 -14 327 -159 -341 767 192 -189 100 -153 495 -356 218 -227 -133 -766 -794
6723 -794 -237 112 308 555 -175 -389 234 -236 90 -42 255 -343 76 -96 -90 -26 -225 -274 -267 10 175 -31
6745 -31 -67 -176 366 -1 -121 -552 129 -107 -1 -28 -55 -205 -45 93 202 77 56 238 -188 -664 -106 -154
6767 -154 78 430 -204 -63 -642 436 -392 -158 78 249 -599 61 141 -11 -110 172 -9 258 22 -840
$$ packed form
6613D37k05J43o25L33j05J18k52K67l51K79K74j50k88O6k01J63l66M47K00l15
6633a31K5J2K48k72J1jP9r1K87n6jM9o6k17Q1j89K30J64n38K75P7K8j72Q8R6J44
6659A60Qm50M44k59k49N53l62N90o38j83N48o4j38p8J67K10m10K44R6m49Q12p16
6681a64P3p9K82k97J71j71K93m32L01K9K04j34l27J13L13n11M34j32Q2J70l54
6702a36J4K48R1M33q84K20L41m86j82J108n75l81K89k53O48q51N74m45R4o33k8
6723g94N57L49J96K47p30k14O23m70L26j32K97n98M19j72OO4j99m9PK77J65k06
6745c1l6j09N42l67j20m31O81k36J06k7k7j50J60J38J09j25k1J82m26m76N58m8
6767a54K32L52o34J41n79J078q28K34K36J71q48O60Q0j52r9K82j81K67k36q62
$$ plain form
6787 -840 73 -56 540 -124 126 192 305 217 -100 543 226 -204 -494 -126 -230 70 35 -256 294 70 333
6808 333 -232 15 181 399 223 194 661 -631 19 -43 679 544 -197 -543 287 -187 -176 240 212 -78 -33
6829 -33 142 68 431 -340 -314 102 12 -167 -250 20 -542 517 -83 -97 -4 542 99 169 210 -342 99 -237 127
6852 127 392 184 362 303 32 -369 419 -425 45 112 -237 30 -444 449 -322 -128 -210 196 457 -219 -637
6873 -637 -51 -78 -78 465 -305 207 494 95 132 -238 -19 -362 -126 -13 -86 -120 -271 125 362 -153 -270 -307
6895 -307 297 432 530 -105 -213 -13 -206 -65 -277 190 278 255 -591 8 -275 -434 -306 523 473 243 -203
6916 -203 194 -267 -17 291 -358 -382 17 -148 473 -137 -260 248 47 67 362 -741 348 426 -157 490
6936 490 388 -182 160 146 -325 -272 -243 -110 -717 128 -198 101 164 -207 932 -397 -221 289 307 -351 253
$$ packed form
6787h40R13j29N96o64K50O6J13q8l17O43l17m30k90L68j04L00l5k91N50k24K63
6808C33n65K47J66K18j76k9M67j292O50o2P22j35p41l46Q30m74J1M16k8k90M5
6829c3J75p4L63p71K6M16r0j79q3K70n62J059o00j4R3N46m43P0M1n52M41l36L64
6852A27K65k08J78n9k71m01P88q44M70O7l49K67m74Q93p71J94q2M06K61o76m18
6873f37N86k7%N43p70N12K87l99L7l70K19l43K36J13p3l4j51L96K37n15j17l7
6895c07O04J35R8o35j08K00j93J41k12M67Q8k3q46N99k83j59J28Q29n0k30m46
6916b03L97m61K50L08o49k4L99j65O21o10j23N08k01K0K95j103J089P8n83O47
6936D90j02n70L42j4m71N3K9J33o07Q45l26K99O3l71J139j329J76N10J8o58O04
$$ plain form
6957 253 -629 233 -685 329 1113 141 70 -256 662 -41 472 299 586 -854 -342 433 -24 -110 -714 641
6977 641 -72 -73 -14 350 -339 281 -609 126 149 731 587 -279 400 -59 -97 -101 72 -16 387 -509 55 -379 199
7000 199 163 365 -229 -118 514 -114 -108 297 241 -391 383 -336 -191 509 374 6 277 -205 380 -5 203
7021 203 4 288 -450 176 593 -393 383 169 347 473 -273 -164 552 54 -149 -274 615 -853 -337 419
7041 419 464 -767 -509 374 1060 -83 397 239 -55 967 -42 -211 -17 -87 18 -99 -268 -810 793
7060 793 296 758 247 481 -32 -172 1144 663 192 266 816 -402 55 5 363 253 157 622 165 253 283
7081 283 -407 553 16 764 810 -496 568 470 23 157 -59 33 129 180 -77 -142 900 564 596 -702 703
7102 703 283 106 443 -372 13 -334 -584 177 365 -264 226 -111 -180 -245 -416 -51 53 702 -357 61
$$ packed form
6957B53q82Q62r18J014P84r72p1l26R18p03N13j73K87j440N12P75m57q6o04J355
6977F41p13jN9L64o89O20q90P35K3N82j44q66O79m59l8mJ73q8M03q96N64m34N78
7000A99l6K02n94J11O32o28OM05n6o32P74p19J45P00j35l68K71m82N85l85K08
7021B03j99K84p38O26M17r86P76k14J78J26p46J09P16m98k03j25Q89j468N16P56
7041D19M5j231K58Q83O86j143M80j58k94J022j009j69J94p0J05j17j69n42J603
7060G93m97M62n11K34n13j40J316m81m71P4N50j218M57n0L58j10r6M65m57Q8L0
7081B83o90R60n37P48M6j306J064r8m47J34k16R2R6N1k57o5J042l36L2j298J405
7102G03m20j77L37q15L85l47k50P61J88o29M90l37o9o5j71L65J04O49j059M18
$$ plain form
7122 61 167 206 -487 325 -377 708 -29 -454 -289 -203 6 372 643 711 -271 184 419 -80 557 -436 626
7143 626 -467 193 301 -470 153 -667 325 -336 20 -74 164 366 748 -94 140 241 -672 -13 -757 -262
7163 -262 292 -268 322 85 -282 58 201 827 389 -720 190 -116 324 133 -439 -124 385 -232 814
7182 814 -10 -72 -509 -221 -263 -321 -110 -52 -322 -404 -308 108 -462 702 -543 -1127 272 421 835 262 -111
7203 -111 -16 -486 298 -210 140 -428 -460 317 397 34 325 80 -368 302 -108 299 202 -626 616 -33 149
7224 149 373 86 -456 51 -187 63 -162 -243 284 394 341 -4 102 275 612 -183 252 -21 487 -3 434
7245 434 -231 -257 299 -117 -221 517 13 -646 256 565 -264 561 335 429 34 209 511 -288 45 -374 152
7266 152 -16 588 27 140 195 122 -330 -222 647 204 -266 -401 100 -274 -487 169 143 -685 8 -255 188
$$ packed form
7122F1J06L9o93Q12p02J085p37m25J65Q6K09L66K71O8r82M55K35m99O37r93J062
7143F26j093O60J08p71O23q20R92o61L56r4K38K02L82q42K34J01r13O59p44M95
7163b62N54n60N90k37l67L40J43O26m38j109R10l06M40j91n72L15N09o17J046
7182H14q24o2m37K88m2n8K11N8k70q2R6M16n70J164j245n84J399J49M14n73l73
7203a11R5m70P84n08L50n68l2P77Q0l63K91k45m48O70m10M07r7q28J242o49J82
7224A49K24k87n42N07k38K50k25q1N27J10n3l45J06J73L37p95M35k73N08m90M37
7245D34o65k6N56m16j04P38n04o59R02L09q29Q25k26R4l95J75L02p99L33m19N26
7266A52j68O04n61J13N5p3m52J08Q69m43m70j35N01l74k13O56k6q28O93k63M43
$$ plain form
7287 188 306 -131 327 67 -275 -189 137 -78 371 54 -330 -148 -38 709 525 -183 187 -542 386 306 219
7308 219 -12 -660 268 375 480 -477 301 -135 211 -167 172 12 -287 310 81 131 213 318 -231 -357 -206
7329 -206 -286 -36 187 246 156 103 -341 -522 45 -33 483 -330 188 -258 417 -101 170 281 239 -425 78 126
7351 126 209 -18 336 -328 347 -631 -62 616 -116 -116 -58 482 378 539 -201 -54 689 178 -270 -258 720 -290
7373 -290 55 -58 278 -493 508 62 106 -45 -535 -496 -44 -31 -94 -331 -207 -67 -90 7 144 84 -154 161
7395 161 -82 239 266 313 18 159 362 -367 49 -399 445 -692 -594 126 -231 -445 -471 -227 857 -28 -144
7416 -144 621 47 427 10 -167 82 50 385 313 -296 363 370 -195 -292 -527 -242 -264 -335 349 149 179 -540 -837
7439 -837 -351 463 560 458 911 -106 318 -550 1327 -372 -154 -292 85 527 -77 593 -112 683 -1259
$$ packed form
7287A88J18m37M58k60l42Q6L26k15M49l17l84J82J10P47j84p08L70p29R28q0q7
7308B19k31o48R28J07J05r57P78m36L46l78L39j60k99N97k29N0Q2J05n49j26J51
7329b06q0K50K23N9r0n3m44j81N67p8N16q13N18m46O75n18K71J11m2o64N03M8
7351A26Q3k27L54o64O75r78N69O78p32%N8N40j04J61p40J47P43n11m48J2R78j010
7373b90L45j13L36p71J001m46M4j51m90L9M52J3o3k37J24J40k3R7J37o0k38L15
7395A61k43L21K7M7k95J41K03p29M16m48Q44j137R8P20l57k14k6K44J084q85j16
7416a44P65n74L80m17j77K49l2L35p2o09O59Pn65r7k35K85k2p1O84k00L0p19k97
7439h37M86Q14R7j02M53j017M24q68J877j699K18j38L77M42o04O70p05P95j942
$$ plain form
7458 -1259 -86 384 647 -510 -682 74 -613 -977 -428 -94 -66 187 133 -48 -418 32 626 233 -301 109
7478 109 129 579 -275 -467 -74 -74 -198 102 224 39 -59 40 -54 217 911 -334 728 76 -389 11 237
7499 237 272 -143 27 -44 -631 181 383 388 -73 -253 1033 -427 -490 486 -64 -187 349 -233 99 -120 -416
7520 -416 -122 497 -170 381 466 448 -494 -238 -342 0 391 -525 214 -794 630 19 608 265 -165 -508
7540 -508 164 -9 -86 86 69 211 -144 183 75 90 130 77 -149 187 -316 -440 283 445 102 110 -243 -67
7562 -67 -148 -115 -610 298 182 -634 -499 -100 733 172 -9 24 -247 -222 -115 -308 65 -434 618 -546 387
7583 387 -196 -226 137 -464 -360 241 14 232 -317 -185 105 51 -5 57 -33 104 -105 7 -141 -78 38 230
7605 230 -460 -129 -75 367 -121 121 56 -125 -47 74 -26 -177 -303 -121 86 -12 57 -190 64 288 452 -232
$$ packed form
7458a259J173M70K63j157j72P56o87l64N49L34K8K53n4j81l70M50N94l93n34M10
7478A09K0M50q54j92L93%j24L00J22j85r8R9r4K71O94j245J062o52m65M00K26
7499B37L5m15J70p1n87Q12K02Nm61j80J286j460o3R76n50j23N36n82L32k19k96
7520d16K94O19o67N51Q5j8r42K56j04L42L91r16P39j008J424o11N89l43m30l43
7540e08O72j73p7J72j7J42l55L27j08J5M0n3k26L36n03j24P23J62l43Ql53J76
7562f7q1L3m95R08j16q16J35L99Q33n61j81L3k71K5J07j93L73m99J052j164R33
7583C87n83l0L63o01J04O01k27K18n49J32K90n4n6O2r0J37k09J12j48O3J16J92
7605B30o90L31N4M42m88K42o5j81P8J21j00j51j26J82K07r8O9k47K54K24J64o84
$$ plain form
7627 -232 346 -16 11 222 -32 -170 -140 -160 115 -137 -164 -96 -104 -149 -38 -442 -12 300 -318 -322 192 17 616
7650 616 313 -74 -214 -394 -205 454 92 67 549 -398 8 -412 -491 -357 80 265 318 66 -281 -141 459
7671 459 76 -21 103 -270 494 111 36 196 209 152 -288 -94 5 -122 87 -4 -29 64 74 118 -82 96 161 86
7695 86 -195 260 55 -18 -84 -121 -135 121 186 222 -19 -89 -14 -73 107 113 87 11 234 136 4 52 -28 40 175 -95
7721 -95 5 129 28 -74 -191 34 139 36 -93 -17 -175 -131 -156 -78 -76 -26 99 -122 150 -55 -121 51 -124
7744 -124 75 -17 10 -57 143 -311 268 -93 -4 157 -255 -182 181 -102 83 131 35 -10 -204 38 -9 -17 -85 273
7768 273 170 128 -117 114 -285 -276 -11 -8 230 246 -128 -43 32 9 -224 -148 3 83 7 -179 55 87 -260 14
7792 14 -108 105 -9 -100 102 -216 253 -74 -168 -63 -12 -243 -81 3 105 137 106 155 -53 99 -98 57 234
$$ packed form
7627b32N78l62K7K11k54j38L0k0K75k52k7O8qm5J11m04M30L12o18mN14j75N99
7650F16l03l87j40j80J89O59l62k5M82r47M06m20p9J34M37J85N3k52l47J40O00
7671D59l83r7J24l73P64l83p5J60J3n7m40J94R9j27K09r1k5R3J0M4k00J78O5p5
7695H6k81M55k05p3o6l7j4K56O5L6k41p0P5n9J80Ok6p6K23r8j32M8q0O8J35k70
7721i5J00J24j01j02j17K25J05j03j29P6j58M4k5P8KN0J25k21K72k05o6J72j75
7744a24J99r2K7o7K00m54N79l61Q9J61m12P3L63k83J85M8r6m5j94K42m7qo8L58
7768B73j03m2k45K31l99RK65LK38J6l74Q5P5k3k33P6J51Q0p6j86K34L2l47K74
7792A4j22K13j14r1K02l18M69l27r4J05N1k31J62Q4J02L2l1M9k08J52j97J55J77
$$ plain form
7815 234 -19 -118 -64 -206 -14 0 -343 173 14 154 -143 87 258 35 271 -90 -11 59 81 48 -2 24 313
7838 313 -58 -152 154 122 -41 110 175 40 -126 -56 -35 157 -230 -4 -44 -204 -259 58 120 -71 -84 53 -31
7861 -31 57 224 -80 145 -161 74 54 -180 404 -18 29 -38 108 -7 -27 227 -76 126 -271 260 -74 -51
7883 -51 -61 -40 -308 69 53 152 198 -26 328 38 -158 -207 -6 15 72 -282 -32 -17 -304 184 -45 -19 67 -3
7907 -3 -52 -104 -9 -126 -106 77 0 105 -97 16 74 42 -130 340 41 -157 -32 -78 310 -214 248 167 167 134 97
7932 97 251 -157 -133 -207 106 -206 -217 -302 -14 2 31 -368 49 466 122 56 -475 323 -137 -82 -264 -171 -24
7955 -24 272 494 16 19 19 132 -230 -862 -97 521 -233 164 -180 -100 -74 250 87 276 303 123 414 268 509
7978 509 377 -333 441 488 546 -59 -535 89 313 123 -527 570 147 17 633 -571 297 -711 158 30
$$ packed form
7815B34k53r9N4j42J92J4l43N16j59J40k97K30J71k23K36l61P9P0K2l3n0K6K89
7838C13l71r4L06l2j63J51O5j35j66P0K1J92l87K26m0j60n5L17O2j91j3J37q4
7861c1Q8J67l04K25l06K35k0k34N84m22M7o7J46j15k0K54l03K02l97N31l34K3
7883e1j0K1k68L77j6R9M6k24L54k90j96m9K01K1N7l54K50J5k87M88k29K6Q6p0
7907cm9n2R5j17K0J83p7J05k02J13N8l2j72M70k99j98J25m6L88n24M62q1%l3l7
7932I7J54m08K4p4L13l12j1q5K88J6K9l99M17M17l44o6n31P98m60N5j82R3J47
7955b4K96K22m78L%J13l62o32P65O18p54L97l44Q0K6L24j63J89K7j80K91j46K41
7978E09j32p10P74M7N8o05m76O24K24j90o50J097m23j30O16j204Q68j008Q69j28
$$ plain form
7998 30 745 -575 200 424 457 263 -361 319 350 -132 -391 70 -118 346 -719 -57 354 109 -187 28
8018 28 -560 -176 264 -264 -103 220 62 -953 -319 -138 -1021 -80 -117 54 245 -709 -107 363 359 508 604
8039 604 -113 268 -80 -38 142 319 -328 -239 212 37 -719 326 31 512 -180 58 258 -693 299 -173
8059 -173 -621 5 134 -221 522 510 -28 295 158 -65 -212 -502 183 171 284 -128 -166 169 251 316 -61 263
8081 263 51 -33 -117 413 -234 -219 112 501 174 -1 -355 -527 49 -153 -127 -229 198 -89 -63 454 -252 13
8103 13 -461 -56 38 -441 -533 -353 -212 -185 -209 -356 144 -40 -14 133 32 266 85 50 397 151 564 4
8125 4 -301 -511 -256 -237 -88 747 141 231 186 -283 -63 481 -19 -693 210 154 -100 -791 -487 -369 -348 -116
8147 -116 -735 308 416 -336 149 391 768 641 390 -475 399 43 108 26 125 -25 -331 189 301 9 -338
$$ packed form
7998C0P15j320P75K24L3j94o24O80L1m82k59M61j88M64j065O62M11k45k96K15
8018B8n88L84M40n28J61L23j58j015O34J81q83R41l7J71J91r54O02M70mJ49R6
8039F04p17L81l48M2J80J77o47Q9M51j75p56J045k95M81o92K38K00r51R92m72
8059a73m48O26J29l55P43j2n38L23j37k23j47k90O85j2J13m12l8L35Q2O5l77L24
8081B63k12q4q4N30o47J5L31L89l27j75l54j72N76k02K6j02M27k87K6N17p06K65
8103A3m74M05R4m79r2J80J41K7k4j47N00j84K6J47j01K34j81l5L47k46M13n60
8125Dl05k10K55J9J49Q35o06R0m5m69K20N44n00o74R03n6k54o91L04J18K1K32
8147a16o19J043J08p52M85K42L77j27k51q65Q74l56O5q2R9j50l06N20J12k92l47
$$ plain form
8168 -338 522 -52 292 650 -48 132 -104 -96 -317 -9 66 -193 237 124 -439 -294 149 281 -194 -451 -152
8189 -152 310 -42
$$ packed form
8168c38Q60n74L44L58o98J80k36Qk21L08P5k59M30j13n63J45M43J32m75k57K99
8189a52M62l52
8191d2
$$ Imaginary data points
##PAGE= N=2
##DATA TABLE= (X++(I..I)), XYDATA
$$ plain form
0 0 0 0 0 0 0 0 0 0 0 0 0 0 0 -7 8 -8 8 -8 12 -16 16 -23 24 -31 32 -40 47 -52 60 -69 79 -89 101 -113 128 -143
36 -143 162 -179 201 -222 248 -274 304 -336 372 -410 452 -497 546 -602 664 -732 807 -891 988
55 988 -1096 1219 -1364 1535 -1737 1989 -2300 2705 -3247 4021 -5199 7198 -11196 22142 -110846
70 -110846 -297375 145593 200544 -100026 -5590 156953 -48734 -51396 176969 54554 -168410
81 -168410 -1521 121078 -37313 -71490 28640 -8068 -33089 32889 17528 -41985 -9725
92 -9725 3818 -31909 9243 23150 -76128 -50659 70540 19613 -55931 28117 43508 -37377
104 -37377 30366 98550 -43216 -85265 74686 48333 -89717 -9768 49671 -56770 -23615
115 -23615 85414 6329 -59381 36868 51464 -20352 14641 21486 -65356 -24926 56168 -21145
$$ packed form
0@%%%%%%%%%%%%%pJ5j6J6j6K0k8L2l9M7n5O3p2Q7r9J12j29J48j68J90k14K41k71
36a43L05l41L80m23M70n22N78o40P08p82Q62r49J043j148J266j396J539j698J879
55I88k084K315k583K899l272L726m289N005n952P268r220J2397j8394L3338j32988
70a10846j86529M42968N4951l00570R4436J62543k05687k662K28365j22415k22964
81a68410J66889J22599j58391l4177J00130l6708k5021O5978j5361n9513L2260
92i725J3543l5727M1152J3907r9278K5469J21199n0927p5544Q4048J5391q0885
104c7377O7743O8184j41766m2049J59951k6353j38050P9949N9439j06441L3155
115b3615J09029p9085o5710R6249J4596p1816L4993O845q6842M0430Q1094p7313
$$ plain form
127 -21145 -76262 -8203 14840 -5295 17663 4899 -39035 13390 77820 4036 -59560 8195
139 8195 41702 -8082 -15716 -363 -15308 948 36338 4898 -31607 17724 43327 -12386
151 -12386 -15728 18295 -5190 -14908 5845 -15306 -23149 17075 6310 -35293 -144 32390 -16101
164 -16101 -20568 21938 -8543 -26424 19166 2795 -34978 7068 28084 -12924 -3407 36714
176 36714 11451 -7186 31624 24753 -13082 8042 16310 -17254 -9636 7346 -21520 -30129 4664
189 4664 2050 -33352 -13889 18619 -8757 -19368 13709 6941 -13216 8510 15596 -9741 677
202 677 29728 4328 -17812 19732 27353 -6396 -831 8378 -5412 7147 12702 -21523 -23028
215 -23028 16002 9666 -24812 -11318 5114 -9670 2710 11292 -21518 -15681 21399 7097 -20654
$$ packed form
127b1145n5117O8059K3043k0135K2958j2764m3934N2425O4430p3784o3596O7755
139H195L3507m9784p634J5353j4945J6256L5390l1440l6505M9331K5603n5713
151a2386l342L4023k3485r718K0753k1151p843M0224j0765m1603L5149L2534m8491
164a6101m467M2506l0481j7881M5590j6371l7773M2046K1016m1008R517M0121
176C6714k5263j8637L8810o871l7835K1124Q268l3564P618J6982k8866q609L4793
189D664k614l5402J9463L2508k7376j0611L3077o768k0157K1726P086k5337J0418
202F77K9051k5400k2140L7544P621l3749N565R209j3790J2559N555l4225j505
215b3028L9030o336l4478J3494J6432j4784J2380Q582l2810N837L7080j4302k7751
$$ plain form
228 -20654 -4319 10514 -3455 -1255 12609 -2658 -7671 17147 13238 -6066 4925 11988 -1365
241 -1365 95 12336 2532 -12925 1556 10149 -9397 -8018 3791 -9970 -10549 5513 -3120 -16622
255 -16622 -3375 5731 -7384 -6388 7049 -4056 -7066 12729 4721 -7331 8718 10085 -3368
268 -3368 5912 14526 -419 -4784 11731 8774 -6825 1408 4940 -6813 -839 3540 -9043 -9866
282 -9866 245 -1622 -9300 -7493 -1971 -5822 -4005 2422 -5031 -4520 7193 3925 -2489 4290 8503
297 8503 3320 1530 8722 5522 -2310 6821 6828 -4824 937 7189 -2605 -3731 2363 -512 -5639 -2170
313 -2170 -476 -8232 -5856 666 -7820 -7435 1047 -4080 -5006 1808 1471 -885 2401 5386 2448 2104
329 2104 7603 2954 -989 6943 5427 -1541 2089 4353 1961 1842 2808 495 -4071 823 2719 -7981
$$ packed form
228b0654J6335J4833j3969K200J3864j5267n013K4818l909j9304J0991P063j3353
241a365J460J2241r804j5457J4481Q593j9546J379J1809j3761n79J6062q633j3502
255a6622J3247R106j3115R96J3437j1105l010J9795q008j2052J6049J367j3453
268c368R280Q614j4945m365J6515k957j5599Q233L532j1753N974M379j2583q23
282i866J0111j867p678J807N522l851J817O427p453N11J1713l268o414O779M213
297H503n183j790P192l200p832R131Pj1652N761O252r794j126O094k875n127L469
313b170J694p756K376O522q486L85Q482n127r26O814l37k356L286K985k938l44
329B104N499m649l943P932j516o968L630K264k392j19R66k313m566M894J896j0700
$$ plain form
345 -7981 -9420 -2688 -5021 -7529 -6762 -6748 -4128 6 2050 -325 -727 6209 6905 3948 4582 853 973
362 973 7483 3682 -2451 637 5330 3996 1423 3504 2335 -2674 2256 3325 -8076 -9164 -4183
377 -4183 -4661 -7138 -8069 -5379 -3325 -333 3579 1858 535 5325 4760 2685 2510 -1078 -1364 614
393 614 -632 -1000 722 3023 2679 2212 8422 7815 511 1857 3044 229 -1269 -5884 -9276 -6983
409 -6983 -2840 -2344 -7874 -7207 1701 3575 973 -951 -2991 663 2695 -482 -3477 -4832 383 5583
425 5583 3396 3319 5377 7443 11198 9466 4527 2594 127 -668 -2181 -7154 -10083 -11033 -6100 -2511
441 -2511 -6808 -5054 1342 2061 2676 1741 -264 389 211 -1225 -2815 -3385 89 1529 1280 3076 5814
458 5814 10026 8654 1704 5414 9576 1976 -3475 -4344 -4474 -2885 -4908 -8233 -7407 -2212 2063 -1845
$$ packed form
345g981j439O732k333k508P67J4K620M134K044k375m02O936O96k957O34l729J20
362I73O510l801o133L088M693j334k573K081j169n009M930J069j1401j088M981
377d183m78k477r31K690K054K992L912j721j323M790n65k075j75l588k86J978
393F14j246l68J722K301l44m67O210o07p304J346J187k815j498m615l392K293
409f983M143M96n530O67Q908J874k602j924k040L654K032l177k995j355N215N200
425E583k187p7K058K066L755j732m939j933k467p95j513m973k929r50M933L589
441b511m297J754O396P19O15r35k005O53j78j436j590n70L474J440k49J796K738
458E814M212j372o950L710M162p600n451q69j30J589k023l325Q26N195M275l908
$$ plain form
474 -1845 -3763 -324 653 243 -1916 -5631 -2143 -608 -2408 -634 2073 4408 7407 5521 6620 10875
490 10875 8549 2598 -208 2136 -56 -6659 -7229 -7537 -7280 -1856 -2982 -5746 112 3214 2612 2984
506 2984 1982 754 156 -849 -1710 -2640 -1901 -4563 -4102 3725 3497 -1245 499 2595 5721 7335 -965
523 -965 -5314 2120 6487 2003 -4452 -2833 3897 6147 3575 -1317 -1642 3304 1388 -2843 -4725 -8680
539 -8680 -6223 -3533 -9114 -7005 -1011 -3214 -3524 3422 8241 4942 2380 5750 8297 8633 5738 -2181
555 -2181 -623 6082 2855 -2007 -4278 -4267 3263 3490 -5564 -6472 -1084 -1002 -3964 -3989 -3991 -5521 -2400 -182
573 -182 -3370 358 2716 -2632 1236 8114 4853 653 85 2746 6915 4611 -1252 -2319 3768 6115
589 6115 1705 -1481 -2059 521 4590 -1285 -8229 -2825 -656 -5201 -4788 -4164 -5186 -2089 -1661 -1906
$$ packed form
474a845j918L439R77m10k159l715L488J535j800J774K707K335K999j886J099M255
490A0875k326n951k806K344k192o603n70l08K57N424j126k764N858L102o02L72
506B984j002j228n98j005q61r30P39k662M61P827k28m742J744K096L126J614q300
523i65m349P434M367m484o455J619O730K250k572m892l25M946j916m231j882l955
539h680K457K690n581K109N994k203l10O946M819l299k562L370K547L36k895p919
555b181J558O705l227m862k271J1P530K27r054r08N388Q2k962k5kj530L121K218
573a82l188L728K358n348L868O878l261m200n68K661M169k304n863j067O087K347
589F115m410l186n78K580M069n875o944N404K169m545M13O24j022L097M28k45
$$ plain form
605 -1906 1296 2954 -304 -758 6175 6683 1510 1609 1546 3067 7863 2141 -5254 450 4406 947 -1988
622 -1988 -3318 -2222 158 719 -3645 -4287 777 -52 -4264 -549 639 -1081 -1818 -2220 441 2859
638 2859 -2478 -3976 102 2476 2281 -184 -2653 739 7007 5880 -2354 -1349 5948 5047 1864 496
654 496 -3134 874 5050 -2459 -5214 -857 -1287 -3615 -2701 -1754 -3729 -3898 -2011 -2003 -232 422 -3496
671 -3496 -234 4516 1865 1991 2537 518 4358 6889 1187 -1847 2436 5228 1009 -2167 -637 -35
687 -35 567 -1131 -3415 -1181 -1255 -4331 -1095 -829 -4080 -2304 -1856 -2828 -130 1394 -1721 -2838 2144
704 2144 4950 1623 258 875 3363 6379 2228 -2357 2692 4228 1130 646 -1796 -1738 2000 1343
720 1343 -4165 -4443 101 94 -3532 -2713 -2022 -2642 160 -1568 -3224 -269 -463 -442 1337 81 395 2254
$$ packed form
605a906L202J658l258m54O933N08n173R9o3J521M796n722p395N704L956l459k935
622a988j330J096K380N61m364o42N064q29m212L715J188j720p37m02K661K418
638B859n337j498M078K374j95k465k469L392O268j127q234J005P297r01l183j368
654D96l630M008M176p509k755M357m30k328R14R47j975j69J887QJ771O54l918
671c496L262M750k651J26N46k019L840K531n702l034M283K792m219l176J530O02
687c5O02j698k284K234p4l076L236K66l251J776M48r72K698J524l115j117M982
704B144K806l327j365O17K488L016m151m585N049J536l098m84k442N8L738o57
720A343n508k78M544pl626Q19O91o20K802j728j656K955j94K1J779j256L14J859
$$ plain form
738 2254 1929 2060 3054 3612 1274 1331 4267 1897 -947 1050 394 -117 99 -2829 -1876 -59 -2222 -2270
756 -2270 -1826 -2807 -2657 -969 -1839 -3552 -1814 445 -1436 -622 2818 966 1206 3457 3037 3913 3304
773 3304 712 1961 3523 1956 -1083 -1413 -91 -372 -735 -1306 -3237 -1182 1612 -1045 -2283 -2199 -2279
790 -2279 477 -644 -4391 -2753 -236 -56 -563 -139 500 1593 3406 3633 1016 1511 2895 1689 1961
807 1961 644 -1347 1099 1077 -411 168 -140 -603 49 198 -918 -2610 -1826 -1485 -3259 -2497 -2263 -3212
825 -3212 -1459 -378 -368 1436 1016 1871 3102 2641 2245 2028 1084 1168 1172 1121 110 -631 1255 1539 176
844 176 662 -136 -498 411 -1271 -2286 -2210 -3438 -2641 -1993 -2883 -2925 -610 1067 -21 132 2137 1865 1560
863 1560 2764 2057 36 1488 1153 1628 296 134 1775 2610 1580 512 313 817 -139 -1724 -621
$$ packed form
738B254l25J31R94N58k338N7K936k370k844J997o56n11K16k928R53J817k163m8
756b270M44r81J50J688q70j713J738K259j881Q14L440j852K40K251m20Q76o09
773C304k592J249J562j567l039l30J322k81l63n71j931K055K794k657j238Q4q0
790b279K756j121l747J638K517J80n07M24O39J093J813K27k617M95J384j206K72
807A961j317j991K446k2j488N79l08m63O52J49j116j692P84L41j774P62K34r49
825c212J753J081J0J804m20Q55J231m61l96k17r44Q4Mn1j011p41J886K84j363
844A76M86p98l62R09j682j015P6j228P97O48q90m2K315J677j088J53K005k72l05
863A560J204p07k021J452l35M75j332j62J641Q35j030j068j99N04r56j585J103
$$ plain form
880 -621 -2623 -2804 -1903 -3149 -3352 -1720 -1507 -119 -123 124 1142 1426 815 1384 1181 1058 534 795 1518
899 1518 774 1668 1805 1336 2226 1876 443 747 445 -1163 -951 -1652 -1999 -2300 -2728 -1714 -2134 -1609 -304
918 -304 -968 -219 1271 -534 286 139 -238 809 764 740 488 984 2509 1551 1187 2566 1951 1560 1479 481
938 481 247 -320 -968 -911 -1902 -1915 -1371 -2209 -1477 -1040 -2125 -1328 -1207 -838 -81 -631 -634 135 856 2159 1068
959 1068 853 2909 2781 2353 2427 1598 1528 1598 838 301 -859 -970 -946 -1735 -1247 -1214 -2616 -1780 -1372 -978 -1005
980 -1005 -1653 -1161 -229 124 340 -919 -583 2024 1472 810 855 764 2160 2013 993 911 563 1172 1148 168
1000 168 31 -149 -887 557 71 -1139 -1081 -1628 -797 -562 -1857 -2162 -2217 -1307 288 -926 -1538 -483 877
1019 877 1661 467 -203 1747 2005 1706 1241 706 1715 1554 471 1095 602 63 221 -610 -395 -286 -1074
$$ packed form
880f21k002j81R01j246k03J632K13J388mK47J018K84o11N69k03j23n24K61P23
899A518p44Q94J37m69Q90l50j433L04l02j608K12p01l47l01m28J014m20N25J305
918c04o64P49J490j805Q20j47l77J047m5k4k52M96J525r58l64J379o15l91q1r98
938D81k34n67o48N7r91j3N44q38P32M37j085P97J21L69P57n50lP69P21J303j091
959A068k15K056j28m28P4q29p0P0p60n37j160j11K4p89M88L3j402Q36M08L94k7
980a005o48M92R32L53K16j259L36K607n52o62M5r1J396j47j020q2l48O09k4r80
1000A68j37j80p38J444m86j210N8n47Q31K35j295l05n5R10J595j214o12J055J360
1019H77P84j194o70J950K58k99m65n35J009j61j083O24m93n39J58q31K15J09p88
$$ plain form
1038 -1074 -1615 -2410 -830 -443 -2240 -2261 -1169 -666 614 -617 -1753 365 1527 543 213 358 1378
1055 1378 1287 1202 1337 803 1935 2030 335 1195 1094 -314 271 -483 -946 -311 -1729 -2493 -1514 -626 -1675
1074 -1675 -2752 -1208 -345 -1030 -438 -926 -295 1759 517 -84 1302 1488 1035 1281 907 1796 2069 1270
1092 1270 241 459 1579 534 -1329 -1075 -596 138 -101 -2785 -2455 589 -991 -1351 -1617 -1316 381
1109 381 165 -760 -808 92 1395 -1 460 1329 1012 1006 1676 609 1374 2279 -29 60 1329 1007 109 -1029
1129 -1029 -712 184 220 -1265 -2191 -706 738 -1483 -2191 -1212 -1486 207 204 -1186 -618 867 -61 564
1147 564 1731 859 515 1046 977 1990 1658 683 -323 1995 1730 -552 -304 -874 -36 1133 -1736 -3020
1165 -3020 -350 -212 -948 -1516 -1722 -1110 155 -196 -1152 -792 1237 846 -791 1408 1288 240 1492
$$ packed form
1038a074n41p95J580L87j797k1J092N03J280j231j136K118J162r84l30J45J020
1055A378r1q5J35n34J132R5j695Q60j01j408N85p54m63O35j418p64R79Q88j049
1074a675j077J544Q63o85N92m88O31K054j242o01J386J86m53K46l74Q89K73p99
1092A270j029K18J120j045j863K54M79P34k39k684L30L044j580l60k66L01J697
1109C81k16r25m8R00J303j396M61Q69l17oO70j067P65R05k308Q9J269l22q98j138
1129a029L17Q96L6j485r26J485J444k221p08R79k74J693lj390N68J485r28O25
1147E64J167q72l44N31o9J013l32r75j006K318k65k282K48n70Q38J169k869j284
1165c020K670J38p36n68k06O12J265l51r56L60K029l91j637K199j20j048J252
$$ plain form
1182 1492 1084 671 1872 1451 34 706 1661 707 -641 -729 565 89 250 -1323 -2177 702 -888 -1938
1200 -1938 -1326 -1429 -1262 -261 -1167 -1005 225 931 -410 26 1021 1087 623 1172 152 1753 1915 28
1218 28 541 2026 378 -145 -71 -694 -535 -503 -1734 -1523 -1237 -31 -1039 -1469 -863 -936 -986 -800 -1135 -357
1238 -357 937 -940 281 1227 669 752 1247 776 1601 1019 1175 192 891 1403 410 229 347 -475 39
1257 39 100 -1086 -88 -707 -1428 -855 -850 -791 -101 -235 -1226 -934 968 254 -269 729 643 186 1781 913 677
1278 677 2528 1710 473 1563 944 627 358 344 -80 -905 220 -949 -1066 417 -1266 -1513 -1280 -1284 -904
1297 -904 -166 -995 -732 29 -145 293 366 742 952 473 1738 389 329 1823 1370 371 1544 231 -149
1316 -149 589 -272 -1228 -391 -1366 -1794 -1297 -690 -168 107 -767 -459 -983 79 -889 -261 836 -1116 791
$$ packed form
1182A492m08m13J201m21j417O72R55r54j348q8J294m76J61j573q54K879j590j050
1200a938O12j03J67J001r06J62J230P06j341M36R95O6m64N49j020J601J62j887
1218B8N13J485j648n23P4o23J59L2j231K11K86J206j008m30O06p3n0J86l35P78
1238c57J294j877J221R46n58Q3M95m71Q25n82J56r83O99N12r93j81J18q22N14
1257C9O1j186R98o19p21N73NN9O90j34r91K92J902p14n23R98q6m57J595q68k36
1278F77J851q18j237J090o19l17k69j4m24q25J125j169j17J483j683k47K33mL80
1297i04P38q29K63P61j74M38P3L76K10m79J265j349o0J494m53r99J173j313l80
1316a49P38q61r56Q37r75m28M97O07N22K75q74L08n24J062r68O28J097j952J907
$$ plain form
1335 791 615 23 993 666 963 617 1363 960 1484 1014 697 564 587 341 -150 8 41 -1164 231 288
1355 288 -1770 -1015 -1158 -1279 24 -379 -926 -773 249 142 573 401 1196 223 1168 1632 266 1180 615
1374 615 1246 1710 824 1021 858 498 -57 -640 -520 -1518 -16 403 -1268 -913 -988 -597 -1335 -562 174 -525
1394 -525 -102 -186 -494 -283 1089 922 958 1267 1179 1238 1021 517 1129 1500 1034 529 1317 -229 -871 -140 -783
1415 -783 194 -828 -1169 -859 -505 -394 -535 -1858 -1026 -1162 -212 11 -52 0 -3 144 1372 920 906 499 288
1436 288 1232 664 1628 2026 1299 687 152 -277 -127 502 -452 -372 -1224 -1080 -498 -862 -1798 -2291 -1162 -67
1456 -67 -210 -679 -256 -341 135 709 351 672 463 1091 992 2007 860 371 1215 1334 1046 710 -567 228
1476 228 595 457 -172 -681 -761 -1512 -1271 -528 -1596 108 -362 -1063 60 -617 -432 214 412 1103 583
$$ packed form
1335G91j76n92R70l27K97l46P46m03N24m70l17j33K3k46m91J58L3j205J395N7
1355B88k058P55j43j21J303m03n47J53J022j07M31j72P95r73R45M64j366R14n65
1374F15O31M64q86J97j63l60n55n83J20r98J502M19j671L55p5L91p38P73P36o99
1394e25M23q4l08K11J372j67L6L09q8N9k17n04O12L71m66n05P88j546o42P31o43
1415g83R77j022l41L10L54J11j41j323Q32j36R50K23o3N2lJ47J228m52j4m07k11
1436B88R44n68R64L98p27o12n35m29J50O29r54Q0q52J44N82l64r36m93J129J095
1456f7j43m69M23q5M76N74l58L21k09O28r9J015j147m89Q44J19k88l36j277P95
1476B28L67j38o29n09q0p51K41P43j068J704m70p01J123o77J85O46J98O91n20
$$ plain form
1495 583 522 1379 1514 1335 1640 673 333 1242 372 648 -281 -634 1163 -520 -986 -910 -1319 37 -419 -978
1515 -978 -710 -394 -272 5 -791 -138 134 226 309 122 229 1258 303 786 1210 1002 446 239 707 844
1535 844 864 1069 -407 -218 613 -303 -706 -942 -1054 -318 -358 -529 -1230 -959 -468 -410 227 -221 190 -889
1555 -889 1063 1182 863 857 462 1438 1789 1007 251 833 1625 984 603 -160 313 -195 259 -492 -121 -674
1575 -674 -1181 -745 -331 128 -439 -202 -275 -169 -801 402 -68 -460 132 421 207 1091 569 1250 1751 1914
1595 1914 1646 1666 1910 42 374 -70 1604 -364 -1109 -690 348 -226 -299 -1154 -258 -1209 -866 -368 -1077
1614 -1077 -375 -793 -100 351 964 663 722 413 241 1264 1369 205 860 538 1741 372 -386 936
1632 936 402 190 -459 450 32 -289 -551 -716 -1204 7 -812 -1039 -65 -542 -1523 175 -844 -331 305
$$ packed form
1495E83o1Q57J35j79L05r67l40R09q70K76r29l53J797j683m66P6m09J356m56n59
1515i78K68L16J22K77p96O53K72R2Q3j87J07J029r55M83M24k08n56k07M68J37
1535H44K0K05j476J89Q31r16m03k36j12P36m0j71p01K71M91N8O37m48M11j079
1555h89J952J19l19ol95R76L51p82p56N82P92o41l81p63M73n08M54p51L71n53
1575f74n07M36M14M59n67K37p3J06o32J203m70l92N92K89k14Q84n22O81N01J63
1595A914k68K0K44j868L32m44J674j968p45M19J038n74p3q55Q96r51L43M98p09
1614a077P02m18O93M51O13l01N9l09j72J023J05j164O55l22J203j369p58J322
1632I36n34k12o49R09m18l21k62j65m88J211q19k27R74m77r81J698j019N13O36
$$ plain form
1651 305 219 89 275 976 1465 1036 1225 839 180 1169 -266 479 1221 -131 141 660 -521 -24 -202
1670 -202 305 -914 660 -267 -488 -1591 -266 73 -5 -301 -317 -188 327 1458 -235 638 146 627 767
1689 767 202 -54 720 795 446 986 3 -342 -384 -367 -141 -503 84 -742 -1476 -804 -1452 417 -612 -720
1709 -720 172 88 -102 619 505 119 636 265 441 -63 886 1008 1023 895 967 -1023 751 46 421 494 -114
1730 -114 153 -701 -697 -594 -1081 230 -295 19 -953 -18 334 -214 -68 -161 959 542 -266 689 1090 -319
1750 -319 1527 722 497 659 571 953 147 77 450 -909 -70 -236 -598 -247 -227 -716 78 -184 -641 -1654
1770 -1654 -1323 -963 -101 -268 -638 -272 859 562 506 678 -86 1339 1372 -258 864 3125 -151 1161
1788 1161 723 151 461 93 53 -560 -758 -143 -967 -1279 -116 -401 -919 -896 -990 -342 -921 -999 -41 60 582
$$ packed form
1651C05q6j30J86P01M89m29J89l86o59R89j435P45P42j352K72N19j181M97j78
1670b02N07j219J574r27k21j103J325L39p8k96j6J29N15J131j693Q73m92M81J40
1689G67n65k56P74P5l49N40r83l45m2J7K26l62N87q26p34O72o48J869j029j08
1709g20Q92q4j90P21j14l86N17l71J76n04R49J22J5j28P2j990J774p05L75P3o08
1730a14K67q54MJ03m87J311n25L14r72R35L52n48J46r3J120m17q08R55M01j409
1750c19J846q05k25J62q8L82q06p0L73j359Q39j66l62L51K0m89P94k62m57j013
1770a654L31L60Q62j67l70L66J131k97n6J72p64J425L3j630J122K261l276J312
1788A161m38n72L10l68m0o13j98O15q24l12J163k85n18K3r4O48n79p8R58J01N22
$$ plain form
1809 582 1262 404 1958 984 779 747 2223 1000 578 336 501 -383 -20 -61 -406 -354 -205 -991 83 68
1829 68 -701 133 -737 -1000 -443 -1153 -755 -120 -430 -15 -320 498 715 492 927 453 51 723 785 1000 710
1850 710 533 -69 -174 -48 750 -452 -99 468 -240 -772 -552 202 -983 168 -327 -551 -858 -223 583
1869 583 162 192 168 227 550 390 308 775 100 86 1433 851 -174 482 711 614 289 185 -259 -506 -225
1890 -225 -355 -1060 -389 -659 -661 130 -298 -1691 -203 -820 314 300 98 439 629 -124 64 776 732 501
1910 501 264 549 383 743 1074 321 710 463 -577 -535 -531 -796 -129 -9 -95 -533 90 -595 -832 -69 -38
1931 -38 -444 -516 334 -592 532 900 -147 522 546 215 819 1197 897 114 381 -13 380 30 -72 -432
1951 -432 152 -238 -1200 -374 -629 -744 -362 -1037 -811 20 -654 367 -327 -694 128 777 -37 678 120 580
$$ packed form
1809E82O80q58J554r74k05l2J476j223m22k42J65q84L63m1l45N2J49p86J074j5
1829F8p69Q34q70k63N57p10L98O35l10M15l05Q18K17k23M35m74m02O72O2K15k90
1850G10j77o02j05J26P98j202L53N67p08n32K20P54j185J151m95k24l07O35Q06
1869E83m21L0k4N9L23j60q2M67o75j4J347n82j025O56K29r7l25j04m44k47K81
1890b25j30p05O71k70kP91m28j393J488o17J134j4k02L41J90p53J88P12m4k31
1910E01k37K85j66L60L31p53L89k47j040M2Mk65O67J20q6m38O23o85k37P63L1
1931c8m06p2Q50r26J124L68j047O69K4l31O04L78l00p83K67l94L93l50j02l60
1951d32N84l90r62Q26k55j15L82o75K26Q31o74J021o94l67Q22O49q14P15n58M60
$$ plain form
1971 580 908 573 638 1131 841 666 -86 156 -44 328 407 -225 10 -320 -774 -630 -309 -89 -75 -496 -777
1992 -777 131 -896 -528 81 -467 511 190 502 661 961 136 864 726 1114 551 38 960 381 551 404
2012 404 101 -212 -123 -544 -351 -1076 -484 -570 -815 -877 -770 -140 315 52 -359 -611 -505 403 338 -419 469
2033 469 511 268 473 330 656 1314 -80 633 -148 -805 393 -511 -419 -1 -807 -690 245 -490 1 154
2053 154 316 -487 -732 -82 -339 458 -181 -350 -69 38 614 834 722 1119 795 409 123 701 -161 542
2073 542 453 53 -257 499 447 -81 -581 -943 -122 -800 -503 -796 -1102 -739 -355 -258 -163 -883 362 41 96
2094 96 182 392 681 1007 656 336 346 328 509 408 314 361 -513 -766 -496 -665 -615 172 -942 -466 -767 -908
2116 -908 384 111 34 -558 -256 225 378 -93 -59 -182 226 643 -299 341 607 -136 -251 231 630 876
$$ packed form
1971E80L28l35O5M93k90j75p52K42k00L72P9o32K35l30m54J44L21K20J4m21k81
1992g77R08j027L68O09n48R78l21L12J59L00q25P28j38L88n63n13R22n79J70j47
2012D04l03l13Q9m21J93p25N92q6k45o2J07O30M55k63m11k52J06R08o5p57Q88
2033D69M2k43K05j43L26O58j394P13p81o57J198r04R2M18q06J17R35p35M91J53
2053A54J62q03k45O50k57P97o39j69K81J07N76K20j12L97l24l86k86N78q62P03
2073E42q9m00l10P56n2n28n00l62Q21o78K97k93l06L63L84R7R5p20J245l21N5
2094I6Q6K10K89L26l51l20J0j8J81j01r4M7q74k53K70j69N0P87j114M76l01j41
2116i08J292k73p7n92L02M81J53m71L4j23M08M17r42O40K66p43j15M82L99K46
$$ plain form
2136 876 224 -27 -357 23 1043 -23 45 -416 -749 -316 -327 -660 -13 -383 -568 -312 -389 -29 -647 88
2156 88 216 378 441 147 303 880 92 667 1115 297 510 408 -102 -307 -145 -441 -496 -565 -122 373 -314
2177 -314 -877 -486 -322 -359 -374 -616 -68 -117 -76 -245 -51 263 686 -235 359 611 633 673 380 415 620 -60
2199 -60 416 428 -210 305 -401 -741 -116 -236 -713 -665 -957 -892 -158 -302 -613 -403 -745 -128 108 504 82
2220 82 -152 660 765 1339 269 563 484 -676 -6 21 24 207 50 33 -255 -948 -945 -233 -227 -54 -682 26 250
2243 250 -232 -7 446 -227 -157 12 -458 -207 -221 111 5 -272 644 519 808 190 313 109 188 230 159 522
2265 522 209 -77 311 -176 -24 -473 -723 151 -234 -674 -348 -894 -674 -454 23 178 282 517 210 153
2285 153 422 426 599 819 390 851 538 262 -99 397 -156 -270 -436 -614 -29 50 -214 -410 -643 -67 -590
$$ packed form
2136H76o52k51l30L80J020j066O8m61l33M33j1l33O47l70j85K56p7L60o18P35
2156H8J28J62O3k94J56N77p88N75M48q18K13j02n10k05J62k96n5o9M43M95o87
2177c14n63L91J64l7j5k42N48m9M1j69J94L14M23r21N94K52K2M0k93L5K05o80
2199f0M76J2o38N15p06l40O25j20m77M8k92O5P34j44l11K10l42O17K36L96m22
2220H2k34Q12J05N74j070K94p9j160O70K7LJ83j57j7k88o93LP12OJ73o28P08K24
2243B50m82K25M53o73P0J69m70K51j4L32j06k77R16j25K89o18J23k04P9M2p1L63
2265E22l13k86L88m87J52m49k50Q74l85m40L26n46K20K20M77J55J04K35l07n7
2285A53K69MJ73K20m29M61l13k76l61M96n53j14j66j78N85P9k64j96k33N76n23
$$ plain form
2306 -590 -1168 -204 -639 -186 183 -168 -363 279 650 473 292 376 751 546 680 489 108 304 126 360
2326 360 362 -166 -133 -164 -169 -294 -175 -710 -690 -729 -552 -519 -832 -756 -242 -431 265 -285 168 93 -80 470 508 397
2350 397 854 600 522 291 553 606 64 320 544 -96 163 -366 -320 -628 226 -473 -702 -94 -341 -579 -82
2371 -82 -1173 -276 297 61 218 -84 501 419 -323 380 -140 114 424 310 -139 138 -113 565 28 -120
2391 -120 233 -217 277 -162 -279 -282 66 -834 -106 -471 -219 -79 -384 355 -100 -361 -471 216 298 53 205
2412 205 929 685 786 464 55 642 -30 680 224 -159 -91 176 -707 -321 -4 -251 -601 -352 29 -382
2432 -382 -443 -735 -414 -22 490 165 -218 691 -327 -37 305 87 482 327 897 384 106 376 289 196 -194
2453 -194 -191 -256 99 -329 -98 -175 -466 -910 359 -894 -305 -150 -428 -602 -471 -186 -27 -181 96 407 131
$$ packed form
2306e90n78R64m35M53L69l51j95O42L71j77j81Q4L75k05J34j91l81J96j78K34
2326C60Kn28L3l1nj25J19n35K0l9J77L3l13P6N14j89O96n50M53p5j73N50L8j11
2350C97M57k54p8k31K62N3n42K56K24o40K59n29M6l08Q54o99k29O08k47k38M97
2371h2j091Q97N73k36J57l02N85q2p42P03n20K54L10j14m49K77k51O78n37j48
2391a20L53m50M94m39j17lL48r00P28l65K52J40l05P39m55k61j10O87Q2k45J52
2412B05P24k44J01l22m09N87o72P10m56l83O8K67q83L86L17k47l50K49L81m11
2432c82o1k92L21L92N12l25l83R09j018K90L42k18L95j55N70n13k78K70q7r3l90
2453a94Lo5L55m28K31p7k91m44J269j253N89J55k78j74J31K85J59j54K77L11k76
$$ plain form
2474 131 74 487 390 223 447 413 533 346 264 57 215 581 237 -336 -136 -527 -14 71 -754 -2 -453 -215
2496 -215 247 -549 174 -42 -252 331 391 224 20 242 493 359 592 540 683 519 554 -145 330 -10 -13 -81
2518 -81 99 -463 36 -520 -394 -475 -265 90 -46 -244 -203 -404 -142 7 42 152 -33 -213 250 -40 197
2539 197 356 51 100 229 253 218 330 133 160 105 24 -120 81 -282 -210 -346 -310 -671 -449 -666 -217 -285 -329
2562 -329 92 -240 -71 -74 237 177 378 195 215 695 249 235 546 363 337 181 -60 158 -61 -345 -59 -4
2584 -4 -179 -373 -324 -138 -405 -456 -179 -16 -158 -308 -105 397 288 98 243 374 306 307 172 232 575 18 229
2607 229 109 42 248 -43 220 -215 50 -145 -188 -273 -201 -231 -63 -460 -397 80 -370 -44 70 -127 -188 262
2629 262 48 206 222 235 339 169 444 215 410 297 290 89 212 30 -93 48 -42 -310 -190 -532 -264 -126
$$ packed form
2474A31n7M13r7j67K24l4J20j87q2k07J58L66l44n73K00l91N13Q5q25P52m51K38
2496b15M62p96P23k16k10N83O0j67k04K22K51j34K33n2J43j64L5o99M75l40lo8
2518h1J80n62M99n56J26q1K10L55j36j98M1k01K62J49L5J10j85j80M63k90K37
2539A97J59l05M9J29K4l5J12j97K7n5q1j44K01l63P2j36L6l61K22k17M49o8m4
2562c29M21l32J69lL11o0K01j83K0M80m46j4L11j83k6j56k41K18k19k84K86N5
2584dj75j94M9J86k67n1K77J63j42j50K03N02j09j90J45J31o8Jj35O0L43n57K11
2607B29j20o7K06k91K63m35K65j95m3q5P2l0J68l97O3M77m50L26J14j97o1M50
2629B62k14J58J6J3J04j70K75k29J95j13pk01J23j82j23J41r0k68J20l42K68J38
$$ plain form
2651 -126 -459 -84 -581 -353 -28 12 135 -3 185 388 -182 -150 407 220 173 195 -93 290 444 185 355
2672 355 241 443 380 60 48 57 386 -249 -245 -234 -466 -489 -252 -258 -352 -155 -559 -158 61 14 -154 23 220 349
2696 349 375 526 781 395 210 448 370 231 151 247 -194 -331 -209 -667 -477 -430 -461 -209 4 -436 -8 39
2718 39 -175 114 -316 242 147 140 211 522 140 651 385 391 312 231 121 309 193 77 -8 -169 -277 -273 -261 -33
2742 -33 -451 -127 -96 -672 -94 -407 -210 -186 -376 -116 85 -133 138 93 70 234 281 365 278 418 270 300 127
2765 127 261 174 -123 -166 -277 31 -8 -130 89 -301 -141 -355 -356 -585 -140 -71 -95 -208 -197 19 -263 56 -195
2788 -195 129 286 294 172 352 242 460 600 357 74 137 147 1 -114 14 156 -107 -412 -502 -260 -321 -325 -477
2811 -477 -285 -289 -253 22 -238 65 209 70 343 160 268 -45 212 226 325 242 259 -47 152 272 -34 -167
$$ packed form
2651a26l33L75m97K28L25M0J23j38J88K03n70L2N57j87m7K2k88L83J54k59J70
2672C55j14K02o3l20j2RL29o35MJ1k32k3K37or4J97m04M01K19m7j68J77J97J29
2696C49K6J51K55l86j85K38p8j39q0R6m41j37J22m58J90M7l1K52K13m40M28M7
2718C9k14K89m30N58r5pP1L11l82N11k66Op9q1j10J88j16j16q5j61j08MJ2K28
2742c3m18L24L1n76N78l13J97K4j90K60K01k18K71m5k3J64M7Q4q7J40j48L0j73
2765A27J34q7k97m3j11L08l9j22K19l90J60k14jk29M45O9k4j13J1K16k82L19k51
2788a95L24J57Qj22J80j10K18J40k43k83O3J0j46j15J28J42k63l05r0K42o1mj52
2811d77J92mL6K75k60L03J44j39K73j83J08l13K57J4R9q3J7l06J99J20l06j33
$$ plain form
2833 -167 -88 -153 36 -199 -280 -66 -271 -365 -471 -221 -316 -220 140 -132 -168 -110 23 148 333 214 80 522 197
2856 197 125 452 39 453 150 160 10 -15 -209 28 -292 -39 -98 -230 -42 -233 -351 -173 -225 -434 -9 -335
2878 -335 -272 -49 -31 207 191 254 242 206 136 347 187 197 121 173 241 211 157 258 -57 -278 -239 -395 -264 -318 -239
2903 -239 -312 -368 16 -314 -108 -108 -180 -236 44 275 99 269 262 384 521 230 356 155 201 488 146 165 -14
2926 -14 207 -159 -256 -113 147 -231 -285 -144 -153 -193 -421 -240 -282 -211 94 -241 -74 58 -79 270 30 126 70
2949 70 -5 -50 249 251 73 280 317 94 250 -140 84 -5 -235 -256 -301 -31 -343 -379 10 -134 -110 -155 -70 -337
2973 -337 -424 326 174 283 236 116 -30 54 420 235 793 535 -114 453 116 -112 166 63 212 -356 -280
2994 -280 -450 -129 -590 -537 -419 -49 116 271 216 -221 99 393 -336 -457 -3 50 289 417 373 531 238
$$ packed form
2833a67P9o5J89k35q1K14k05r4j06K50r5R6L60k72l6N8J33J25J85j19j34M42l25
2856A97p2L27m13M14l03J0j50k5j94K37l20K53n9j32J88j91j18J78n2k09M25l26
2878c35O3K23J8K38j6O3j2l6p0K11j60J0p6N2O8l0n4J01l15k21L9j56J31n4P9
2903b39p3n6L84l30K06%p2n6K80K31j76J70pJ22J37k91J26k01M6K87l42J9j79
2926a4K21l66r7J43K60l78n4J41rm0k28J81m2P1L05l35J67J32j37L49k40R6n6
2949G0p5m5K99Kj78K07L7k23J56l90K24q9k30k1m5K70l12l6L89j44K4m5Q5k67
2973c37q7P50j52J09m7j20j46Q4L66j85N58k58o49N67l37k28K78j03J49n68P6
2994b80j70L21m61N3J18L70J65J55n5m37L20K94p29j21M54N3K39J28m4J58k93
$$ plain form
3015 238 168 311 362 245 -204 100 17 111 50 127 -208 389 -307 -1226 -43 -377 -194 17 148 -75 -53 39
3037 39 425 421 -81 193 225 -267 300 116 -46 -220 147 17 -1073 1096 875 -514 13 -61 -178 363 -103
3058 -103 57 107 -610 347 387 133 -86 547 -1053 -58 23 199 -225 887 34 -57 1005 979 589 -630
3078 -630 384 -181 169 -71 290 705 -364 32 -1 -549 -555 -46 -702 -266 -26 41 34 -1176 362 166 206
3099 206 -453 112 600 415 808 287 362 219 735 586 356 753 531 249 329 -314 -214 434 492 -16 595
3120 595 -83 -216 -82 -991 242 187 -265 90 140 507 650 437 146 753 -267 271 -1077 1034 596
3139 596 1305 146 224 639 -86 -293 -590 -234 194 347 1007 110 507 -457 -223 -349 -70 328 -336 -165
3159 -165 -657 -297 388 -134 124 164 -169 651 442 422 438 1071 140 56 700 431 574 165 374 768 -511
$$ packed form
3015B38p0J43N1j17m49L04q3R4o1P7l35N97o96r19J183l34J83K11J31k23K2R2
3037C9L86mn02K74L2m92N67j84j62j74L67j30j090K169k21j389N27p4j17N41m66
3058a03J60N0p17R57M0k54k19O33j600R95Q1J76m24J112q53r1J062k6l90j219
3078f30J014n65L50k40L61M15j069L96l3n48oN09o56M36K40O7pj210J538j96M0
3099B06o59N65M88j85L93n21P5j43N16j49k30L97k22k82Q0o43J00O48N8n08O11
3120E95o78j33J34r09J233n5m52L55N0L67J43k13k91O07j020N38j348K111m38
3139E96P09j159P8M15p25k07k97L56M28J53O60q97L97r64K34j26K79L98o64J71
3159a65m92L60O85n22K58M0l33Q20k09k0J6O33r31q4O44k69J43m09K09L94j279
$$ plain form
3180 -511 335 74 368 -273 -1096 -179 -861 -490 -236 -419 145 305 15 272 0 -503 -97 594 -605 441
3200 441 24 420 42 -121 9 -161 116 382 -268 -43 248 110 -93 275 -580 -60 -326 -37 -195 -557
3220 -557 -185 -204 -372 -351 49 -88 225 -10 481 233 -69 183 137 -61 174 -41 -150 151 301 450 -445
3241 -445 -94 68 -490 -166 93 115 98 305 -649 75 -37 -315 342 -98 -525 -124 382 -157 -693 592
3261 592 108 43 489 -637 250 -395 587 -284 -87 40 1 373 142 -521 -404 -532 -106 -190 -336 -3 65
3282 65 -487 138 248 42 29 286 -229 -364 63 195 70 475 -540 270 878 -75 -111 343 209 578 1
3303 1 4 608 378 271 -351 -393 136 -340 -215 -114 -79 -68 562 -530 565 57 -541 75 133 -94 -333 509
3325 509 222 747 503 617 -163 -169 622 -244 501 37 345 243 424 -7 597 -226 -468 -330 487 -341 234
$$ packed form
3180e11Q46k61K94o41q23R17o82L71K54j83N64J60k90K57k72n03M06O91j199J046
3200D41m17L96l78j63J30j70K77K66o50K25K91j38k03L68q55N20k66K89j58l62
3220e57L72j9j68K1M00j37L13k35M91k48l02K52m6j98K35k15j09L01J50J49q95
3241d45L51J62n58L24K59K2j7K07r54P24j12k78O57m40m27M01N06n39n36J285
3261E92m84o5M46j126Q87o45R82q71J97J27l9L72k31o63J17j28M26q4j46L33O8
3282F5n52O25J10k06j3K57n15j35M27J32j25M05j015Q10O08r53l6M54j34L69n77
3303ALO04k30j07o22m2N29m76J25J01L5J1O30j092J095n08n98O16N8k27k39Q42
3325E09k87N25k44J14p80oP91q66P45m64L08j02J81m31O04q23k42J38Q17q28N75
$$ plain form
3346 234 -181 -83 -687 -872 133 -562 49 238 73 105 850 -199 277 -38 52 89 189 -133 509 -88 -36
3367 -36 114 186 225 -97 -543 -548 -339 -107 74 289 -168 -672 -191 -101 -94 -260 -66 307 20 -84 632 477 690
3390 690 335 589 400 271 477 113 -173 141 426 -556 -122 -480 293 -392 23 -423 -402 60 269 -196
3410 -196 -234 83 -317 211 -364 12 310 -110 -273 20 -275 214 479 914 -53 83 681 -95 352 88
3430 88 -391 483 -105 -49 -35 -277 30 385 299 23 166 -416 -182 -385 -87 -188 238 451 228 -386 -145
3451 -145 -48 70 41 200 188 493 765 127 -292 32 -153 -32 -188 91 -453 143 -416 -144 -144 -115 -451 57
3473 57 114 315 -50 -24 -188 235 -212 -393 230 -218 1047 348 -218 84 16 32 130 138 52 186 122 22 43
3496 43 -320 -45 -162 259 -256 187 -254 -79 -662 244 -175 152 -41 -91 215 161 -220 136 264 -559 350
$$ packed form
3346B34m15R8o04j85J005o95O11J89j65L2P45j049M76l15R0L7J00l22O42n97N2
3367c6J50P2L9l22m46nK09K32J81K15m57n04M81R0Pj66J94L73k87j04P16j55K13
3390F90l55K54j89j29K06l64k86L14K85r82M34l58P73o85M15m46K1M62K09m65
3410a96l8L17m00N28n75L76K98m20j63K93k95M89K65M35r67J36N98p76M47k64
3430H8m79Q74n88N6J4k42L07L55q6k76J43n82K34k03K98j01M26K13k23o14K41
3451a45R7J18k9J59j2L05K72o38m19L24j85J21j56K79n44N96n59K72%K9l36N08
3473E7N7K01l65K6j64M23m47j81O23m48J265o99n66L02o8J6R8Qq6J34o4j00K1
3496D3l63K75j17M21n15M43m41J75n83R06m19L27j93n0L06n4l81L56J28q23R09
$$ plain form
3517 350 118 128 564 409 584 688 202 553 -35 165 -438 -437 247 -139 -105 -367 -205 11 -245 -209 -263 -54
3539 -54 463 71 -4 73 -259 97 -206 607 418 -45 -172 182 294 231 198 -148 650 136 -218 141 -421 24
3561 24 -216 -424 -269 -236 112 -244 63 130 -534 359 -270 -322 -183 -91 264 80 461 555 260 337 436 42 -21
3584 -21 203 267 416 -21 -88 -149 50 -189 -172 -155 -463 203 -240 224 -375 26 147 -223 -603 -460 -278 351
3606 351 215 -12 586 88 66 235 417 394 359 -35 -517 179 27 -135 -64 -243 -172 124 18 -292 -26 190
3628 190 112 -246 70 301 -496 -6 -160 277 210 2 61 696 270 131 -18 328 147 -307 477 306 -198
3649 -198 26 2 -184 231 -146 -185 252 83 -52 -112 -252 -266 -351 29 390 -69 108 -289 -4 37 539 368
3671 368 26 599 383 92 192 57 108 -58 195 -147 440 49 178 -308 -48 -723 -204 0 -94 194 47
$$ packed form
3517C50k32J0M36j55J75J04m86L51n88K00o03JO84l86L4k62J62K16k56L6n4K09
3539e4N17l92p5P7l32L56l03Q13j89m63j27L54J12o3l3l46P98n14l54L59n62M45
3561B4k40k08J55L3L48l56L07O7o64Q93o29n2J39R2L55j84L81R4k95P7R9l94o3
3584b1K24O4J49m37o7o1J99k39J7J7l08O66m43M64n99M01J21l70l80J43J82O29
3606C51j36k27N98m98k2J69J82k3l5l94m82O96j52j62P1j79P1K96j06l10K66K16
3628A90p8l58L16K31p97M90j54M37o7k08N9O35m26j39j49L46j81m54P84j71n04
3649a98K24k4j86M15l77l9M37j69j35o0j40j4q5L80L61m59J77l97K85M1N02j71
3671C68l42N73k16k91J00j35N1j66K53l42N87l91J29m86K60o75N19K04r4K88j47
$$ plain form
3692 47 -152 -302 232 -29 -200 -134 61 137 297 50 689 -197 341 573 599 784 398 -421 397 103 39 -219
3714 -219 44 -229 -675 84 -203 49 -165 -55 45 -228 -10 -210 -232 81 -19 231 28 40 177 -29 82
3735 82 143 206 -87 315 32 328 287 -376 -113 100 481 -437 -32 -146 67 303 -242 -450 -502 -1187 275
3756 275 -674 -499 -638 -984 -253 -170 289 83 -390 -458 510 -241 584 196 59 1203 -150 -147 -152 89 -522
3777 -522 -129 62 -252 17 -80 51 -485 119 87 -118 116 -132 -332 -30 -589 -174 -237 -155 3 574 112
3798 112 81 -221 -4 317 10 102 149 354 -396 450 -12 519 -378 127 -60 -372 -40 -12 -4 -151 -312 -394
3820 -394 -266 -100 -114 -348 405 327 -81 -72 -166 419 -146 970 312 443 -34 -199 302 -149 166 535 152
3841 152 361 -399 543 69 -112 183 142 -75 -411 -280 -586 -170 77 90 -378 63 -71 423 -300 -238 272
$$ packed form
3692D7j99j50N34k61j71O6J95P6J60k47O39q86N38K32K6J85l86q19Q18k94o4k58
3714b19K63k73m46P59k87K52k14J10J00k73K18k00k2L13j00K50k03J2J37k06J11
3735H2O1O3k93M02k83K96m1o63K63K13L81r18M05j14K13K36n45k08n2o85J462
3756B75r49J75j39l46P31Q3M59k06m73o8R68p51Q25l88j37J144j353LnK41o11
3777e22L93J91l14K69r7J31n36O04l2k05K34k48k00L02n59M15o3Q2J58N71m62
3798A12l1l02K17L21l07R2M7K05p50Q46m62N31q97N05j87l12L32K8Qj47j61q2
3820c94J28J66j4k34P53p8m08Rr4N85n65J116o58J31m77j65N01m51L15L69l83
3841A52K09p60R42m74j81K95m1k17l36J31l06M16K47J3m68M41j34M94p23O2N10
$$ plain form
3862 272 -85 -596 -129 571 -51 296 1226 95 -270 -555 -475 121 419 -208 10 -25 -100 -1038 29 -51 241
3883 241 5 38 -476 -279 -205 -35 241 -316 -489 450 3 334 -244 -314 351 219 -503 1039 4 246
3903 246 200 -263 -698 178 -499 -553 -259 -222 -329 -28 162 -368 -422 660 60 -874 566 -220 -473 -607 -781
3924 -781 356 295 6 230 -1026 -186 -60 -225 -38 -81 -379 572 -468 -216 54 -486 -791 -143 -345 -456
3944 -456 -311 375 -228 -337 -102 -627 180 -363 -65 -222 92 -521 -265 -582 132 34 63 -251 118 54 61 67
3966 67 194 439 -277 286 -548 -37 -270 -18 -85 -3 51 -219 -166 -58 -171 -14 -112 -10 177 -115 216 -159
3988 -159 -135 387 285 251 290 -146 121 -48 -42 96 -178 -54 49 2 -220 39 -323 -94 -482 7 -382 -355
4010 -355 141 -123 64 65 91 218 426 -107 -42 5 230 170 250 344 26 -42 -101 -23 -111 -156 25 -54 -34 -236 114
$$ packed form
3862B72l57n11M67P00o22L47R30j131l65k85Q0N96K98o27K18l5p5r38J067q0K92
3883B41k36L3n14J97P4J70K76n57j73R39m47L31n78p0O65j32p22J542j035K42
3903B46m6m63m35Q76o77n4K94L7j07L01J90n30n4J082o00r34J440p86k53j34j74
3924g81J137o1k89K24j256Q40J26j65J87m3k98R51j040K52K70n40l05O48k02j11
3944d56J45O86o03j09K35n25Q07n43K98j57L14o13K56l17P14r8K9l14L69o4PO
3966F7J27K45p16N63q34N11k33K52o7Q2N4k70N3J08j13J57r8J02J87k92L31l75
3988a59K4N22j02l4L9m36K67j69OJ38k74J24J03m7k22K59l62K29l88M89l89K7
4010c55M96k64J87JK6J27K08n33O5M7K25o0Q0R4l18o8n9P8q8m5J81p9K0k02L50
$$ plain form
4035 114 53 -463 -258 -3 69 221 -96 149 -408 -7 49 -98 -203 213 46 55 -135 -144 63 -104 187 30
4057 30 -47 171 43 -188 -352 2 54 98 -79 -237 -113 -62 196 -275 -411 69 162 -38 29 50 52 255 54
4080 54 12 -116 159 160 31 82 295 92 15 301 437 212 80 -64 -98 -109 -130 -33 -265 -468 -217 135 -31
4103 -31 91 -140 100 -115 -220 422 -461 127 -264 133 83 234 163 277 -26 259 91 211 243 474 231
4124 231 19 -321 -307 -112 -141 -35 -234 146 65 -12 -250 -202 115 153 -41 106 -294 -121 -20 -87 96 112 -96
4147 -96 57 148 180 271 151 346 28 -309 48 -50 58 -412 22 -45 -229 -332 -56 114 206 381 59 -95
4169 -95 -118 400 252 -77 244 43 186 -58 74 58 138 -7 -60 378 250 -30 119 64 -132 -58 108 -104
4191 -104 -215 83 115 -111 -370 -117 -63 -141 -200 97 44 -284 -55 118 135 313 361 126 250 198 -53 37 123
$$ packed form
4035A14o1n16K05K55P2J52l17K45n57M01N6j47j05M16j67Rj90rK07j67K91j57
4057C0p7K18j28k31j64L54N2M4j77j58J24N1K58m71j36M80R3k00O7K1KK03k01
4080E4m2j28K75Jj29N1K13k03p7K86J36k25j32j44l4j1k1R7k32k03K51L52j66
4103c1J22k31K40k15j05O42q83N88l91L97n0J51p1J14l03K85j68J20L2K31k43
4124B31k12l40J4J95k9J06j99L80q1p7k38M8L17L8j94J47m00J73J01o7J83J6k08
4147i6J53R1L2R1j20J95l18l37L57r8J08m70M34o7j84j03K76J70R2J75l22j54
4169i5k3N18j48l29L21k01J43k44J32j6Q0j45n3M38j28k80J49n5j96P4J66k12
4191a04j11K98L2k26k59K53N4p8n9K97n3l28K29J73J7J78M8k35J24n2k51R0Q6
$$ plain form
4214 123 175 -90 -38 57 -46 -329 5 -101 -247 -94 -152 -129 15 135 -262 155 102 86 166 275 245 -201 -81
4237 -81 192 32 73 148 75 -16 30 -28 13 96 -259 40 237 120 -41 11 21 32 -315 49 11 12 -271 -49 -8
4262 -8 -380 66 -279 -172 -123 -76 166 86 186 58 207 221 44 79 323 220 9 81 -207 -319 28 99 67
4285 67 -190 -235 -358 -124 -209 -150 -307 -239 -312 -118 140 -88 -57 263 -148 -196 93 -125 59 255 -185 77 210
4308 210 502 -187 198 129 -79 -111 -26 -118 7 -109 -381 -187 321 66 -154 -62 -405 -136 412 -425 -115 94
4330 94 -94 108 -13 24 -193 109 -9 136 241 -165 77 20 298 196 19 98 -45 -282 -19 24 -227 -186
4352 -186 85 -152 -133 -110 -182 53 -136 -314 -59 -188 -24 -178 40 195 26 201 221 266 31 266 119 -4
4374 -4 136 23 -44 -48 -71 53 119 -237 52 -229 -129 -296 -159 -92 -88 132 346 -31 -214 168 198 -8 -168 14
$$ packed form
4214A23N2k65N2R5j03k83L34j06j46J53n8K3J44J20l97M17n3j6Q0J09l0m46J20
4237h1K73j60M1P5p3r1M6n8M1Q3l55K99J97j17j61N2J0J1l47L64l8Jk83K22M1
4262hl72M46l45J07M9M7K42q0J00j28J49J4j77L5K44j03k11P2k88j12L47P1l2
4285F7k57m5j23K34q5N9j57O8p3J94K58k28L1L20m11m8K89k18J84J96m40K62J33
4308B10K92o89L85o9k08l2Q5r2J25j16k72J94N08k55k20R2l43K69N48q37L10K09
4330I4j88K02j21L7k17L02j18J45J05m06K42n7K78j02j77P9j43k37K63M3k51M1
4352a86K71k37J9K3p2K35j89j78K55j29J64j54K18J55j69J75K0M5k35K35j47j23
4374dJ40j13o7mk3J24O6l56K89k81J00j67J37O7MK20K14l77j83L82L0k06j60J82
$$ plain form
4398 14 37 59 -15 -58 420 202 41 -130 251 282 285 -25 -58 47 -218 152 -84 -25 -368 -390 52 43 32 -315 -296
4423 -296 -236 -164 76 -13 176 -297 102 145 23 187 -17 210 -155 226 107 204 -129 89 -4 -177 -146 280
4445 280 -49 -208 -160 308 -179 126 -51 -401 -221 94 -33 -119 88 149 107 148 416 16 33 -146 -178 9
4467 9 -35 44 13 191 216 -38 125 -222 -45 -132 -333 -219 -90 -191 -375 -330 -10 161 -174 12 -200 99 -83
4490 -83 173 -6 241 -295 194 289 140 -102 280 -50 -71 -183 -118 -219 148 -27 264 -18 10 34 72 -86
4512 -86 -111 388 150 301 162 -201 -224 13 -370 -182 491 174 -29 266 113 251 196 29 467 58 148 122
4534 122 121 245 -19 202 -445 -273 210 179 394 -206 19 5 -39 -273 -553 282 -189 -117 -372 327 -229 -34
4556 -34 243 -203 793 238 -128 112 -87 -26 196 461 8 37 101 -383 -307 -177 168 100 -561 -285 279 -239
$$ packed form
4398A4K3K2p4m3M78k18j61j71L81L1Ll10l3J05k65L70k36N9l43k2M42rj1l47J9
4423b96O0P2K40q9J89m73L99M3j22J64k04K27l65L81j19R7l33K18r3j73L1M26
4445B80l29j59M8M68m87L05j77l50J80L15j27q6K07O1m2M1K68m00J7j79l2J87
4467Im4P9l1J78K5k54J63l47J77q7k01J14J29j01j84M5L20J71l35J86k12K99j82
4490h3K56j79K47n36M89R5j49k42L82l30k1j12O5j01L67j75K91k82K8K4L8j58
4512h6k5M99k38J51j39l63k3K37l83J88O73l17k03K95j53J38n5j67M38m09R0k6
4534A22jJ24k64K21o47J72M83l1K15o00K25j4m4k34k80Q35m71P2k55O99n56J95
4556c4K77m46R96n55l66K40j99O1K22K65m53K9O4m84P6J30L45o8o61K76N64n18
$$ plain form
4578 -239 -437 -139 256 162 -125 107 566 258 103 -45 -468 -111 -178 424 65 -388 -178 389 330 138 65
4599 65 401 558 10 364 102 -196 483 -444 -527 -66 -695 -222 -471 51 71 194 5 -34 594 -473 205
4620 205 172 -241 203 -409 -221 -103 50 402 710 -366 68 -631 0 -410 64 242 38 403 30 11
4640 11 -43 10 142 -361 157 -361 283 135 -249 96 836 392 -242 -246 -291 197 -349 755 364 192 -46 123
4662 123 -9 -231 -436 -340 -112 134 -348 -294 156 -340 492 483 -110 -59 49 210 415 558 538 -383 640 -38
4684 -38 181 124 365 -72 -150 210 -399 -253 74 -210 -401 -304 97 376 82 -94 279 -21 -491 -258 -186 244
4706 244 -312 -362 203 87 100 -449 -350 253 288 400 103 155 396 -125 120 104 -209 -92 243 197 -209 105
4728 105 -63 -350 127 -314 118 466 -158 -46 97 -172 425 -112 -161 -115 -352 -472 409 35 500 412 502
$$ packed form
4578b39j98K98L95r4k87K32M59l08j55j48m23L57o7O02l59m53K10N67n9j92p3
4599F5L36J57n48L54k62k98O79r27q3M61o29M73k49N22K0J23j89l9O28j067O78
4620B05l3m13M44o12J88J18J53L52L08j076M34o99O31m10M74J78k04L65l73j9
4640A1n4N3J32n03N18n18O44j48l84L45P40m44o34mm5M88n46J104l91j72k38J69
4662A23j32k22k05R6K28K46m82N4M50m96Q32rn93N1J08J61K05J43k0r21J023o78
4684c8K19n7K41m37p8L60o09J46L27k84j91R7M01K79k94j76L73l00m70K33P2M30
4706B44n56n0N65j16J3n49R9O03L5J12k97N2K41n21K45j6l13J17L35m6m06L14
4728A05j68k87M77m41M32L48o24J12J43k69N97n37m9M6k37j20Q81l74M65q8R0
$$ plain form
4749 502 -154 -3 35 227 -124 -192 776 92 218 -67 -298 -62 231 320 851 -376 216 -646 -292 -85 536
4770 536 185 233 -56 -460 -228 -63 44 193 -37 668 119 214 217 188 -243 674 585 -22 234 -66 -408 111
4792 111 138 -234 -828 456 169 215 -48 -509 720 6 509 615 466 641 300 -155 525 177 333 327 943
4813 943 256 186 -1183 213 -134 -21 -417 48 569 21 -583 -196 3 19 326 33 -514 407 25 136
4833 136 918 -503 494 -317 -50 276 134 161 670 611 524 44 -202 563 -356 989 -39 -758 -370 -97
4853 -97 55 760 -1203 -697 -655 79 -310 253 -125 839 -877 -842 86 903 387 25 23 -627 466 139 -118
4874 -118 621 459 -227 564 493 -163 -456 507 614 505 541 418 -272 -120 36 135 260 -76 -370 139 370
4895 370 -774 -180 -51 -44 615 749 -901 457 630 8 381 -217 195 -46 56 361 318 -460 -232 377
$$ packed form
4749E02o56J51L8J92l51o8R68o84J26k85k31K36K93Q9N31j227N92q62L54K07O21
4770E36l51M8k89m04K32J65J07J49k30P05n49R5Lk9m31R17q9o07K56l00l42N19
4792A11K7l72n94J284k87M6k63m61J229p14N03J06j49J75l41m55O80l48J56oO16
4813I43o87p0j369J396l47J13l96M65N21n48o04L87J99J6L07k93n47R21l82J11
4833A36P82j421R97q11K67L26j42K7N09n9q7m80k46P65r19J345j028p19L88K73
4853i7J52P05j963N06M2P34l89N63l78R64j716L5R28Q17n16l62ko50J093l27k57
4874a18P39j62o86P91p1o56k93R63J07j09L6j23o90J52J56R9J25l36k94N09K31
4895C70j144N94J29PO59J34j650J358J73o22L73n98M12k41J02L05m3p78K28O09
$$ plain form
4915 377 -333 -418 278 -116 -670 408 -397 378 773 568 -291 -180 -301 207 -283 -413 -284 -497 381 381 360
4936 360 235 580 27 30 -127 -395 1112 663 286 -299 323 -628 80 -121 416 137 -556 293 -145 72
4956 72 614 -31 332 330 212 879 116 -214 80 465 118 175 404 -605 -237 -100 595 257 -5 1620 575
4977 575 78 -146 -148 -134 -103 -320 -13 -662 -202 256 -160 -282 -21 -233 -230 740 176 -330 -471 262 69 146
4999 146 447 -29 -442 564 1089 84 909 437 147 -539 -287 178 494 204 386 31 -390 -273 360
5018 360 -501 -40 151 -26 204 154 -528 678 -602 -304 628 229 -231 170 -118 -148 318 -359 329 -245
5038 -245 445 570 169 94 113 333 461 -295 -319 -75 -15 140 848 -314 565 781 228 68 -628 760 -20
5059 -20 -574 -498 288 296 -220 -175 -525 -349 277 14 303 -472 -342 167 -68 680 -323 471 339 -202 -857
$$ packed form
4915C77p10q5O96l94n54J078q05P75L95k05q59J11j21N08m90j30J29k13Q78%k1
4936C60j25L45n53Lj57k68J507m49l77n85O22r51P08k01N37k79o93Q49m38K17
4956G2N42o45L63kj18O67p63l30K94L85l47N7K29j009L68J37O95l38k62J625j045
4977E75m97k24kJ4L1k17L07o49M60M58m16j22K61k12LR70n64n06j41P33j93P7
4999A46L01m76m13J006N25j005Q25m72k90o86K52M65L16k90J82l55m21J17O33
5018C60q61M61J91j77K30n0o82J206j280K98R32l99m60M01k88l0M66o77O88n74
5038b45O90J25m01p5J9K20J28p56k4K44O0J55P08j162Q79K16n53j60o96J388p80
5059b0n54P6P86Qn16M5l50J76O26k63K89p75J30N09k35P48j003P94j32n41o55
$$ plain form
5080 -857 254 -116 187 -154 -465 269 538 -277 1107 -445 297 -68 475 428 -431 531 399 650 320
5099 320 -163 252 18 -197 2 -479 -573 303 188 -27 -410 -268 32 -24 16 -877 -221 -54 -297 355 -32
5120 -32 750 761 234 60 739 -370 -83 -64 300 -120 -84 611 -119 153 -537 571 449 -344 -162 367 -153
5141 -153 -45 413 -182 72 -258 -339 279 -12 630 -521 -186 634 -553 -364 -192 -261 58 -443 -528 88
5161 88 391 370 151 -94 -172 78 -334 163 263 136 246 -68 -126 -215 -168 -594 223 1140 496 -85 -215 608
5183 608 70 108 -166 36 74 286 340 -198 228 242 2 353 352 244 -194 358 36 -181 339 170 287 -72
5205 -72 9 20 -368 -350 -574 222 -123 -245 192 17 86 125 237 537 45 750 241 455 153 302 -555 346
5227 346 595 -282 13 337 501 798 198 284 -115 106 -581 16 -603 -183 703 -537 -133 -691 -37 -424
$$ packed form
5080h57J111l70L03l41l11P34K69q15J384j552P42l65N43m7q59R62j32K51l30
5099C20m83M15k34k15J99m81r4Q76j15k15l83J42L00n6M0q93O56J67k43O52l87
5120c2P82J1n27j74O79j109K87J9L64m20L6O95p30K72o90J108j22p93J82N29n20
5141a53J08M58n95K54l30q1O18k91O42j151L35Q20j187J89J72o9L19n01q5O16
5161H8L03k1k19k45p8K50m12M97J00j27J10l14n8q9M7m26Q17R17o44n81j30Q23
5183F08n38L8k74K02L8K12N4n38M26J4k40L51jj08m38N52l22k17N20j69J17l59
5205g2Q1J1l88J8k24P96l45j22M37j75O9L9J12L00m92P05n09K14l02J49q57R01
5227C46K49q77K95L24J64K97o00Q6l99K21o87N97o19M20Q86j240M04n58O54l87
$$ plain form
5247 -424 71 368 76 297 192 -38 -454 -282 -31 84 113 609 -87 349 217 -141 -110 100 67 -219 -158
5268 -158 -443 -333 67 326 190 -749 7 -320 170 199 -8 -63 -399 249 -364 -65 290 298 187 188 19 -66
5290 -66 -118 -130 74 322 -84 97 319 -199 156 -353 200 178 165 397 10 -127 -88 -157 -503 -448 155 -66 -468
5313 -468 43 554 485 422 166 -593 -211 154 204 -73 377 213 79 415 -599 -323 -610 -60 -606 -361 -97
5334 -97 -401 -245 -324 -293 -265 -610 27 164 -335 391 784 257 281 218 -236 155 -194 -119 401 196 -35 70
5356 70 439 -285 158 248 116 -102 -166 -416 478 277 -47 764 91 -480 -190 490 223 642 314 185 1315
5377 1315 -122 -349 -1008 -674 107 440 -297 -704 -146 -1072 439 651 292 287 333 -659 -30 -1113 -335 -169
5397 -169 -26 144 -137 221 513 656 -169 147 145 336 245 -848 -302 -21 293 -452 209 486 -17 174 -286
$$ packed form
5247d24M95K97k92K21j05k30m16J72K51J15K9M96o96M36j32l58L1K10l3k86O1
5268a58k85J10M00K59j36r39P56l27M90K9k07n5l36O48o13K99L55Qj11Jj69q5
5290f6n2j2K04K48m06J81K22n18L55n09N53k2j3K32l87j37L9o9l46N5O03k21m02
5313d68N11N11o9o3k56p59L82L65N0k77M50j64j34L36j014K76k87N50n46K45K64
5334i7l04J56p9L1K8l45O37J37m99P26L93n27K4o3m54L91l49P5N20k05k31J05
5356G0L69p24M43R0j32k18o4k50Q94k01l24Q11o73n71K90O80k67M19l28j29J130
5377A315j437k27o59L34P81L33p37m07N58r26J511K12l59nM6r92O29j083P78J66
5397a69J43J70k81L58K92J43q25L16kJ91r1j093N46K81L14p45O61K77n03J91m60
$$ plain form
5418 -286 -402 -561 -394 -244 318 223 214 211 -207 -457 235 -444 -569 177 -166 15 -280 48 432 -167 331 112
5440 112 -78 322 455 1093 603 -177 -52 33 -128 -57 -198 -69 -98 129 -276 75 -527 -275 -314 -24 328
5461 328 -511 -164 -68 56 3 164 68 -27 -157 272 -77 -387 169 -43 501 -38 286 -122 -310 -200 230
5482 230 -92 -376 -226 35 -134 -191 -657 -168 14 -719 -213 -2 39 576 -415 -284 -69 -389 -165 206 166
5503 166 64 376 139 -49 78 212 -59 -77 -100 -70 28 -322 172 81 132 -128 -253 -26 0 -37 -91 -172 -168 -145
5527 -145 -121 203 -138 -85 -141 81 297 -146 -88 -182 20 319 158 79 -272 -46 65 -118 -89 76 -233 -250 -158
5550 -158 8 121 33 35 84 -324 34 -51 59 -123 -164 57 70 43 179 0 48 52 71 -110 -68 7 309 123 15
5575 15 -145 37 -86 -143 23 232 94 -41 -131 102 115 66 -176 -27 116 -131 -92 -296 53 -65 -80 186
$$ packed form
5418b86j16j59J67J50N62r5rlm18k50O92o79j25P46l43J81k95L28L84n99M98k19
5440A12j90M00J33O38m90p80J25Q5j61P1j41J29k9K27m05L51o02K52l9K90L52
5461C28q39L47R6J24n3J61r6r5j30M29l49l10N56k12N44n39L24m08j88J10M30
5482B30l22k84J50K61j69n7m66M89J82p33N06K11M1N37r91J31K15l20K24L71m0
5503A66j02L12k37j88J27J34k71j8k3L0R8l50M94r1N1k60j25K27K6l7n4q1MK3
5527a45K4L24l41N3n6K22K16m43N8r4K02K99j61p9l51K26J11j83K9J65l09j7R2
5550a58J66J13q8KM9m08L58q5J10j82m1K21J3k7J36j79M8MJ9j81M2P5L02j86j08
5575A5j60J82j23n7J66K09j38j35r0K33J3m9k42J49J43k47L9k04L49j18j5K66
$$ plain form
5597 186 237 167 66 -110 249 -131 334 166 -114 395 45 82 -134 0 -9 -250 -175 384 145 205 92 -107
5619 -107 69 -94 -312 58 -265 17 -68 212 -115 265 -154 70 220 -67 -52 -78 174 6 -6 -125 -249
5640 -249 -195 -134 -42 3 -110 86 8 -173 127 43 40 -84 -18 123 133 51 170 219 140 165 86 -22 44 328 -167
5665 -167 190 3 -120 -32 323 15 -39 -219 -272 99 -3 342 -90 -22 -147 -78 -258 -138 42 -195 -25 -28
5687 -28 3 26 -117 155 -24 -15 112 34 191 160 44 210 90 -157 14 -31 118 -46 -213 83 -88 146 -147
5710 -147 -102 48 -71 84 24 -216 -190 67 253 -29 99 3 -217 65 179 97 104 99 -34 -66 -44 180 79 -92
5734 -92 -34 -73 -147 -209 -194 -144 -45 -49 -228 -77 -191 -279 -291 -60 73 95 35 -55 68 20 -136 101 47 186 -5 -172
5760 -172 -170 -128 157 171 157 -100 127 46 11 -160 157 -48 -4 -397 -192 -77 -56 194 -214 15 107 -6 210
$$ packed form
5597A86N1p0j01j76L59l80M65j68k80N09l50L7k16J34rk41P5N59k39O0j13j99
5619a07J76j63k18L70l23K82q5K80l27L80m19K24J50k87J5k6K52j68j2j19j24
5640b49N4O1R2M5j13J96p8j81L00q4lj24O6J41J0q2J19M9p9K5p9j08O6K84m95
5665a67L57j87j23Q8L55l08n4j80n3L71j02L45m32O8j25O9j80J20J80k37J70l
5687b8L1K3j43K72j79RJ27p8J57l1j16J66j20k47J71m5J49j64j67K96j71K34k93
5710a47M5J50j19J55o0k40K6K57J86k82J28r6k20K82J14q2Pnj33l2K2K24j01j71
5734i2N8l9p4o2J5N0R9mj79J51j14q8j2K31J33K2o0r0J23m8j56K37n4J39j91j67
5760a72KM2K85J4j4k57K27q1l5j71L17k05M4l93K05J15K1K50m08K29R2j13K16
$$ [...]
8191A13
##END NTUPLES=NMR FID
##END=
