##TITLE=1H_Pr Dep80
 200.13Hz,CDcl3.
 8 sc
 
1.1.2026
##JCAMPDX= 6.0         $$ Bruker NMR JCAMP-DX V2.0
##DATA TYPE= NMR FID
##DATA CLASS= NTUPLES
##ORIGIN= UXNMR, Bruker Analytische Messtechnik GmbH
##OWNER= pz
$$ XWIN-NMR		Version 3.5
$$ Wed Apr  1 15:25:08 2026 Russian Standard Time (UT+4h)  she@DPX200
##.OBSERVE FREQUENCY= 200.1313
##.OBSERVE NUCLEUS= ^1H
##.DELAY= (6, 6)
##.ACQUISITION MODE= SIMULTANEOUS
##.ACQUISITION SCHEME= undefined
##.AVERAGES= 8
##.DIGITISER RES= 18
##SPECTROMETER/DATA SYSTEM= spect
##.PULSE SEQUENCE= zg30
##.SOLVENT NAME= CDCl3
##.SHIFT REFERENCE= (INTERNAL, CDCl3, 0, 14.3821)
##AUDIT TRAIL= $$ (NUMBER, WHEN, WHO, WHERE, WHAT)
$$ ##TITLE= Audit trail, XWIN-NMR		Version 3.5
$$ ##JCAMPDX= 5.01
$$ ##ORIGIN= Bruker BioSpin GmbH
$$ ##OWNER= she
$$ F:/spectra/data/she/nmr/H-C/1/audita.txt
$$ ##AUDIT TRAIL=  $$ (NUMBER, WHEN, WHO, WHERE, WHAT)
(   1,<2026-04-01 15:23:26.84 +0400>,<she>,<DPX200>,
      <created by zg, POWCHK disabled, PULCHK disabled
       configuration hash MD5:
       00 E9 B6 7A A2 85 ED C7 34 08 36 98 17 FE 4E 26
       data hash MD5: 16K
       5E 28 A6 C2 8B 01 C2 2E 73 01 C4 EC FA 04 73 2E>)
$$ ##END=
$$ 
$$ hash MD5
$$ 38 76 3B FA DF 8D 94 E9 CB 69 B8 B3 F6 FB 34 5D
##$RELAX= 
##$RELAX= 
##$RELAX= 
##$RELAX= 
##$RELAX= 
##$RELAX= 
$$ Bruker specific parameters
$$ --------------------------
##$DU= <F:/spectra>
##$EXPNO= 1
##$NAME= <H-C>
##$PROCNO= 1
##$TYPE= <nmr>
##$USER= <she>
##$AMP= (0..31)
100 100 100 100 100 100 100 100 100 100 100 100 100 100 100 100 100 100 
100 100 100 100 100 100 100 100 100 100 100 100 100 100 
##$AQSEQ= 0
##$AQ_mod= 1
##$AUNM= <au_zg>
##$AUTOPOS= <>
##$BF1= 200.13
##$BF2= 200.13
##$BF3= 200.13
##$BF4= 200.13
##$BF5= 200.13
##$BF6= 200.13
##$BF7= 200.13
##$BF8= 200.13
##$BYTORDA= 1
##$CFDGTYP= 0
##$CFRGTYP= 5
##$CHEMSTR= <none>
##$CNST= (0..31)
1 1 145 1 1 1 1 1 1 1 1 1 1 1 1 1 1 1 1 1 1 1 1 1 1 1 1 1 1 1 1 1 
##$CPDPRG= <>
##$CPDPRG1= <>
##$CPDPRG2= <>
##$CPDPRG3= <>
##$CPDPRG4= <mlev>
##$CPDPRG5= <mlev>
##$CPDPRG6= <mlev>
##$CPDPRG7= <mlev>
##$CPDPRG8= <mlev>
##$CPDPRGB= <>
##$CPDPRGT= <>
##$D= (0..31)
0 0.7 0 0 0 0 0 0 0 0 0 0.03 0 0 0 0 0 0 0 0 0 0 0 0 0 0 0 0 0 0 0 0 
##$DATE= 1775042606
##$DBL= (0..7)
120 120 120 120 120 120 120 120 
##$DBP= (0..7)
150 150 150 150 150 150 150 150 
##$DBP07= 0
##$DBPNAM0= <>
##$DBPNAM1= <>
##$DBPNAM2= <>
##$DBPNAM3= <>
##$DBPNAM4= <>
##$DBPNAM5= <>
##$DBPNAM6= <>
##$DBPNAM7= <>
##$DBPOAL= (0..7)
0.5 0.5 0.5 0.5 0.5 0.5 0.5 0.5 
##$DBPOFFS= (0..7)
0 0 0 0 0 0 0 0 
##$DE= 6
##$DECBNUC= <off>
##$DECIM= 32
##$DECNUC= <off>
##$DECSTAT= 4
##$DIGMOD= 1
##$DIGTYP= 9
##$DL= (0..7)
0 120 120 120 120 120 120 120 
##$DP= (0..7)
150 150 150 150 150 150 150 150 
##$DP07= 0
##$DPNAME0= <>
##$DPNAME1= <>
##$DPNAME2= <>
##$DPNAME3= <>
##$DPNAME4= <>
##$DPNAME5= <>
##$DPNAME6= <>
##$DPNAME7= <>
##$DPOAL= (0..7)
0.5 0.5 0.5 0.5 0.5 0.5 0.5 0.5 
##$DPOFFS= (0..7)
0 0 0 0 0 0 0 0 
##$DQDMODE= 0
##$DR= 18
##$DS= 0
##$DSLIST= <SSSSSSSSSSSSSSS>
$$ [...]
##$SUBNAM0= <"">
##$SUBNAM1= <"">
##$SUBNAM2= <"">
##$SUBNAM3= <"">
##$SUBNAM4= <"">
##$SUBNAM5= <"">
##$SUBNAM6= <"">
##$SUBNAM7= <"">
##$SUBNAM8= <"">
##$SUBNAM9= <"">
##$SW= 18.0517328524113
##$SWIBOX= (0..15)
0 0 2 0 0 0 0 0 0 0 0 0 0 0 0 0 
##$SW_h= 3612.71676300578
##$TD= 16384
##$TD0= 1
##$TE= 0
##$TE2= 300
##$TE3= 300
##$TEG= 300
##$TL= (0..7)
0 120 120 120 120 120 120 120 
##$TP= (0..7)
150 150 150 150 150 150 150 150 
##$TP07= 0
##$TPNAME0= <>
##$TPNAME1= <>
##$TPNAME2= <>
##$TPNAME3= <>
##$TPNAME4= <>
##$TPNAME5= <>
##$TPNAME6= <>
##$TPNAME7= <>
##$TPOAL= (0..7)
0.5 0.5 0.5 0.5 0.5 0.5 0.5 0.5 
##$TPOFFS= (0..7)
0 0 0 0 0 0 0 0 
##$TUNHIN= 0
##$TUNHOUT= 0
##$TUNXOUT= 0
##$USERA1= <user>
##$USERA2= <user>
##$USERA3= <user>
##$USERA4= <user>
##$USERA5= <user>
##$V9= 5
##$VALIST= <valist>
##$VCLIST= <CCCCCCCCCCCCCCC>
##$VD= 0
##$VDLIST= <DDDDDDDDDDDDDDD>
##$VPLIST= <PPPPPPPPPPPPPPP>
##$VTLIST= <TTTTTTTTTTTTTTT>
##$WBST= 1024
##$WBSW= 4
##$XGAIN= (0..3)
0 0 0 0 
##$XL= 0
##$YL= 0
##$YMAX_a= 176920
##$YMIN_a= -205992
##$ZGOPTNS= <>
##$ZL1= 120
##$ZL2= 120
##$ZL3= 120
##$ZL4= 120
##$ABSF1= 10
##$ABSF2= 0
##$ABSG= 5
##$ABSL= 3
##$ALPHA= 0
##$AQORDER= 0
##$ASSFAC= 0
##$ASSFACI= 0
##$ASSFACX= 0
##$ASSWID= 0
##$AUNMP= <proc_1d>
##$AZFE= 0.1
##$AZFW= 0.1
##$BCFW= 1
##$BC_mod= 2
##$BYTORDP= 1
##$COROFFS= 0
##$CY= -3
##$DATMOD= 1
##$DC= 2
##$DFILT= <>
##$DTYPP= 0
##$F1P= 0
##$F2P= 0
##$FCOR= 0.5
##$FTSIZE= 0
##$FT_mod= 4
##$GAMMA= 1
##$GB= 0.15
##$INTBC= 1
##$INTSCL= 1
##$ISEN= 128
##$LB= 0.25
##$LEV0= 0
##$LPBIN= 0
##$MAXI= 10000
##$MC2= 0
##$MEAN= 0
##$ME_mod= 0
##$MI= 1.114404
##$NCOEF= 0
##$NC_proc= 0
##$NLEV= 6
##$NOISF1= 3.799351
##$NOISF2= 2.8
##$NSP= 1
##$NTH_PI= 0
##$NZP= 0
##$OFFSET= 14.38212
##$PC= 1
##$PHC0= -3710.203
##$PHC1= 9.592311
##$PH_mod= 1
##$PKNL= yes
##$PPARMOD= 0
##$PSCAL= 0
##$PSIGN= 0
##$REVERSE= no
##$SF= 200.129724274929
##$SI= 16384
##$SIGF1= 3
##$SIGF2= 2
##$SINO= 400
##$SIOLD= 16384
##$SREGLST= <1H.CDCl3>
##$SSB= 0
##$STSI= 0
##$STSR= 0
##$SW_p= 3205.1282051282
##$SYMM= 0
##$S_DEV= 0
##$TDeff= 0
##$TDoff= 0
##$TI= <>
##$TILT= no
##$TM1= 0
##$TM2= 0
##$TOPLEV= 0
##$USERP1= <user>
##$USERP2= <user>
##$USERP3= <user>
##$USERP4= <user>
##$USERP5= <user>
##$WDW= 1
##$XDIM= 8192
##$YMAX_p= 0
##$YMIN_p= 0
$$ End of Bruker specific parameters
$$ ---------------------------------
##NTUPLES= NMR FID
##VAR_NAME=  TIME,          FID/REAL,        FID/IMAG
##SYMBOL=    X,             R,               I
##VAR_TYPE=  INDEPENDENT,   DEPENDENT,       DEPENDENT
##VAR_FORM=  AFFN,          ASDF,            ASDF
##VAR_DIM=   8192,          8192,            8192
##UNITS=     SECONDS,       ARBITRARY UNITS, ARBITRARY UNITS
##FACTOR=    0.0002768,     1,               1
##FIRST=     0,             0,               0
##LAST=      2.2672688,     0,               0
##MIN=       0,             -205992,         0
##MAX=       2.2672688,     176920,          0
$$ Real data points
##PAGE= N=1
##DATA TABLE= (X++(R..R)), XYDATA
0@%%%%%%%%%%%%%%%%%%Nj3J6j6J6j6J7k4L1l2L7m5M9n5O3p0Q1r3J03j16J32j48
$$ 0 0 0 0 0 0 0 0 0 0 0 0 0 0 0 0 0 0 0 5 -8 8 -8 8 -8 9 -15 16 -16 21 -24 25 -30 33 -37 44 -49 54 -62 70 -78
40g8J64j81J99k21K46k70K97l28L61l97M38m84N35n92O54p23Q02q94J002j129
$$ -78 86 -95 104 -117 129 -141 156 -172 189 -208 230 -254 281 -311 343 -380 422 -472 530 -599
60e99J283j473J713k032K477l138M238o389J2121n5546j58647J52487K15472r5645
$$ -599 684 -789 924 -1108 1369 -1769 2469 -3920 8201 -47345 -205992 -53505 161967 66322
74F6322j55691J2905Q8226K6216n0023K6553l4889m2952L3371O9503P331j08601
$$ 66322 -89369 -76464 11762 37978 -12045 14508 -20381 -63333 -29962 39541 46872 -61729
86f1729j3615O5666M0130l1207m3224L2012j7053K554L3992J0233m4363m7790
$$ -61729 -75344 -9678 30452 -755 -43979 -11967 -29020 -26466 7526 17759 -26604 -74394
98g4394P8756L8645o0462m9278M4065N4491n8988j4157L6597N438l6310n224N4342
$$ -74394 4362 43007 -17455 -66733 -22668 31823 -27165 -41322 -4725 713 -35597 -40821 13521
111A3521k9498l2832L6592L8052m0525o3027O8439O0571n3538q0084M0484J06672
$$ 13521 -15977 -48809 -12217 25835 -14690 -77717 -9278 51293 -2245 -82329 -41845 64827
123F4827m0695r1924O625Q6493O428p7317Q212M2723k427l8408J4091L8515l0935
$$ 64827 24132 -67792 -61167 25326 31754 -45563 -37351 5372 2945 -35463 -21372 17143 -13792
136a3792j6840J8444K1675j5059j1574K2980j6781j1230K2124K5756k7513m4792
$$ -13792 -30632 -12188 9487 -5572 -17146 5834 -10947 -22177 -53 25703 -1810 -46602
148d6602L5084L8280j4609m2709O997L9377j6052j8197J4041K3232k4061k8786
$$ -46602 -11518 26762 12153 -30556 -23559 15818 -234 -18431 -4390 18842 -5219 -34005
160c4005L8357K8492k2913l8889J7293L3690j1882o007K100r035j9367K3014M5503
$$ -34005 4352 32844 9931 -28958 -11665 22025 10143 4136 6236 -2799 -22166 848 46351
173D6351k9958n8108N638P1940J5654o4325k7418L5447M2741j5039k9770L93O945
$$ 46351 16393 -41715 -36077 35863 51517 -12808 -40226 -4779 37962 22923 -6847 -6454 491
186D91J1563O698K180j9625j3731J9467J4978n098k1077J324R758j308P649J32
$$ 491 12054 18752 20932 1307 -12424 7043 22021 16923 -4154 -2830 6928 5620 13269 13401
200A3401j4098j4088K0355K8147j6749l0806K523L7912L646l0934p373J6537J5153
$$ 13401 -697 -14785 5570 33717 16968 -13838 -11315 26597 30243 -691 -8064 8473 23626
213B3626j1205j0561J629n57M188N357o86j7487n54K2312K041j9219j1658K3166
$$ 23626 12421 1860 3489 2932 7120 12477 11791 -5696 -6250 16062 18103 -1116 -12774 10392
227A0392J3903j9814j0536J2486J1406j3015n244J0675J599j0237n582J3449K175
$$ 10392 24295 4481 -6055 6431 17837 4822 -422 10253 11852 1615 -3967 9482 11657
240A1657j4527l615Q903P451p054n171K120L12K223L868J925j1273k646J4348
$$ 11657 -2870 -6485 2418 9869 2815 -2356 -236 76 2299 6167 8092 -3181 -5827 8521
254H521O093j2163j3117J1195J1763q167r646J968P497m420l804L059N99k444
$$ 8521 14614 2451 -10666 529 12292 4125 -5521 -3553 3944 -476 -4280 -1221 -622 -3066
268c066k319N424J130k579n88L50J188K07M048k171o920N44P262K895j1247n624
$$ -3066 -5385 39 1169 -1410 -1998 -1648 -460 -253 3795 1624 -5296 -4752 2510 5405 -5842 -11466
284a1466R037P034p472q509N203N328j764l025J257J517k059L598L278m679m228
$$ -11466 -2429 4605 -2867 -11376 -6173 -845 -2609 -5634 -4377 -2860 -4919 -1321 1957 -2722 -6950
299f950M338O809m930o724K757N642k862o627L777L109m149l513M479O086n944
$$ -6950 -2612 4197 -733 -7457 -4700 942 -1920 -8547 -4770 -1661 -5810 -9323 -4844 1242 -4702
314d702o357O503P767l624o896L536N396o80m712J010K439l173P16K296k186l714
$$ -4702 -11059 -4556 3211 -413 -7309 -3773 1623 943 -3769 -2759 -320 -3493 -2777 -481 -2667 -6381
330f381J56M998k98m941n59N731J285l835J30K408J983j412j329L205l6k238J43
$$ -6381 -6225 -1227 -1525 -6466 -7025 -1294 -9 -3844 -3714 -1306 677 -735 -2064 1141 1105 -1133 -990
347i90J469m37j674r00P8J769j043q73p78m19L948J551l860j299L753L147r10
$$ -990 479 42 -1632 -2532 -2454 -685 -1728 -2601 -3379 -3798 150 1701 -2159 -3458 295 3442 2532
364B532k778k74K686P00k66K6l273j122K424K149j298m848k49M439J904l741j666
$$ 2532 -246 -520 2166 2866 2600 2626 -647 -1769 655 2804 1506 -3342 -3591 848 2752 -989 -2655
381b655K744J669l66N39J878j28m698K820M581j038n355o38M027K55l171j326
$$ -2655 89 1758 1392 1931 3809 3681 -1017 1803 6384 5346 -9 -647 3380 3635 464 -862
397h62K261j429j583K358P83p0j852q90L706K201p07k688M32J324J21K184o21
$$ -862 1399 -30 -1613 745 1528 1458 -394 -1284 2422 4623 3916 1228 1660 2984 3105 5289 4668
414D668n335k080N713M753o168o430J051O525K029l721m041K38L805L069k86l446
$$ 4668 -667 -2747 2966 7719 1551 -4879 -3828 2697 4726 1005 -3036 -2798 1007 4076 3790 344
430C44j597K160L111K374k368n593j076N882L334n837l308K33K993J52n84j34
$$ 344 -1253 907 4018 6392 4024 -1569 -2645 3237 6571 734 -2574 -2341 652 804 220 86
446H6j430m80R39J696J865q0l931q46N600K331m069k995K179j43j557K637L209
$$ 86 -1344 -1824 -885 811 2676 2596 -1335 -2181 3419 5750 1681 -1314 865 722 -835 1802 5011
463E011o633r030O363J1679j162j1482n986P374J2045p71j1689l876P873P039
$$ 5011 -1622 -10652 -4289 7390 6228 -5254 -11240 -3866 8179 7408 -4281 -8157 -284 6755
477F755j247n127k741k145K787Q615J189j3017p411Q419J0446j264j0826m129
$$ 6755 5508 381 -2360 -4505 -1718 6897 8086 -4931 -12342 -3923 6523 5259 -5567 -9696
491i696O757P480n85p536l407N733N626j221j322j465m213O11O028J463n243l405
$$ -9696 -2939 4541 3956 -3580 -6987 -1254 4372 3151 1829 364 -3849 -3238 2790 4253 -990 -4395
507d395L230K197k802k404R18J483N34l84n99M209K68o775j571Q284P507n918
$$ -4395 -1165 1032 -1770 -4174 -3256 -1773 -1239 -1623 -2222 1987 2255 -4520 -6091 2193 9700 3782
523C782r846P56Q327L365n199o037j164N856L774l574n130n03K452L602L600r73
$$ 3782 -6064 -5308 3019 6384 1185 -4852 -6016 -160 3614 40 -5090 -5593 -3141 461 4061 3088
539C088p577m003P904R843l312r594k362P583O057m105q843p01O599M063m182
$$ 3088 -4489 -8492 -588 9255 5943 -3651 -6013 1570 7627 3522 -5321 -6022 577 4640 458
554D58l474l30J69M60K889J978k342k192J610K462P4q63J58N58n10j243J312K773
$$ 458 -3016 -3346 -3177 -2717 172 2150 -192 -2384 -774 1688 1762 899 1057 1615 1105 -138 1174 3947
572C947k242o065j208P747N266p882r421L548J1152K544q341o006M518O974m73
$$ 3947 1705 -4360 -5568 2179 7445 -437 -9858 -6310 4842 7386 -955 -6961 -2443 4531 4058
587D058l432P5j48j872K857O171l036j2325j112J4204O037j2041j0372M546J2063
$$ 4058 626 701 553 -1319 1538 7709 4673 -7652 -8764 5440 11477 -564 -10936 -6390 5673
602E673R77q712m529M287O199R47m055k155J70K098M143P48o103m203M628M216
$$ 5673 6650 -2062 -6591 -2304 3895 4842 787 -1368 -1198 900 5043 5791 -312 -4515 113 4329
618D329k109m191kJ658l74k60l69n50R68K134n51j507K406K25l300J388L362M04
$$ 4329 2220 -1971 -1973 -315 -689 -949 -1318 -1868 -900 1234 683 -824 1582 1807 -1493 -105 3257 3661
636C661l269j126K533j048k835J463K213j721j546j558J923L780k605m222K672
$$ 3661 392 -734 1799 751 -2084 -621 1592 -129 -1675 -3233 -1310 2470 -135 -4357 -1685
651a685O715p98n976n99M086Q22r66J464k384l127K492K926l433l396K661L425
$$ -1685 5030 4232 -1744 -2343 1743 2565 1599 3063 679 -2448 44 2970 -463 -3859 -1198 2227
667B227l223k650L317N44j897l49K741K597j310l557k60M186J258l306j149K675
$$ 2227 -996 -3646 -329 215 -1682 -2031 710 3307 1997 -1560 -1820 2366 3624 318 -831 1844
683A844j14k898j03K439k956k432M041K429m043k230L265J525j879R75K085j446
$$ 1844 1730 -1168 -1271 1168 -1788 -4220 -179 2250 -1793 -4023 -758 767 -1112 -137 1948 502
699E02j827K190K419j561k801j6K067J535j925l944M25L266R57l169j526J931
$$ 502 -1325 865 3284 1723 -1078 -1094 973 2508 583 -3361 -2936 330 1287 -1882 -3408 -1477
715a477J407Q42j168q08N79K428K42k694K29K428p39j746J021J238k190k168K421
$$ -1477 -70 772 -396 -1204 -625 1803 2045 -649 -420 2008 1269 -477 544 1782 -408 -2576 -155
732a55J137k483j722K009J472j285k10N88P54k64N01J958j009k380J166L154o87
$$ -155 982 -1501 -3223 -1214 258 -1027 -1237 -649 105 -159 342 2300 1291 -1089 77 3231 2544
749B544l593j267L244K115m837k274M121Q49k937n48K108J243k196j63L214N44
$$ 2544 -1049 -2316 928 3043 -1794 -4068 53 902 -2035 -2583 -475 768 -1428 -1591 1623 2167
765B167k854M23K400J82j684q08O97O98j300l41M25j228m48R58Q91q55k043R92
$$ 2167 -687 -264 2136 2318 634 -174 523 1221 -79 -420 5 -1223 -1671 -713 178 -677 -2720 -1728
783a728L007k85k198K93J727J278r77q41L88M19J65k17j146j09M81j15j345M85
$$ -1728 1279 994 -1204 -911 816 2094 1117 276 664 1083 1248 1031 -115 -224 257 142 -1203 -718
801g18m14j6J32N49N34k82q77R83K035q27j249O45J485k79j288j50O10j052m40
$$ -718 -1132 -1148 -1016 -467 67 -215 -1092 -109 1926 1099 -150 495 1980 1701 413 263 873 -179 -619
820f19N16J53j504m15J217J003j354j400K109J793j186j162J271J654p47j607
$$ -619 -103 50 -1454 -1869 -652 351 -1003 -2403 -294 1499 313 -849 422 2076 1329 -278
836b78J275J467j840j351R5J084k21j934K8J564n92q12Q36O58m91l86R25J188
$$ -278 997 2464 624 -727 -632 452 231 -1703 -1675 -111 -703 -1515 -679 -21 -512 -898 27 1215
854A215l12p08L91J015m59p66K40L22p72r25M66P51r32j592M18J577j86o80m71
$$ 1215 903 195 586 1601 1142 376 616 938 166 -759 -293 458 -474 -2066 -1648 -71 -257 -937 -1408
873a408J047R93k47k17R84k52m62K43P65K65j226j755J184J461j205j928O1J001
$$ -1408 -361 632 385 168 1152 900 438 681 1446 1711 485 -1270 -86 1375 170 -1758 -1697 -696
891f96M86o62l53P63n33M05J972k42j055l72J110J719r45k370M31J699l82j262
$$ -696 -210 -872 -1225 -462 -995 -590 1382 1140 85 -287 823 2542 1597 -773 -342 1357 975 -287
909b87q28N15R2j036L23J521j109j321J248J606K03r08m72J428K84o66L28r9m65
$$ -287 -1115 -600 -508 -1544 -1221 300 -809 -2130 -882 724 927 19 -453 975 1259 593 921 822 357
928C57J46l42K38L66k193j078J783R21o69o66j4P04j1O66Q18j197p36K170J320
$$ 357 503 161 399 765 -1428 -2506 -723 198 -471 -1137 -1151 -447 -458 208 1026 -171 -907 1263 2583
947B583j049j724q25J682J549j371k047r3Q42L14j017j06R76j014k83K173O37
$$ 2583 1534 -190 -1015 667 2216 845 -1202 -1295 -453 -139 -1156 -1262 -286 -1300 -1583 590 1227
964A227k342k69K542J964j791j627P37P98o73j003L13Q81j25k086o63K086J68
$$ 1227 -1115 -1384 1158 3122 1331 -296 441 1239 566 -437 -124 757 632 -1454 -2117 -31 137
981A37k345N44K434N34k009j11J490l02r66K098J105j566j821L92J419O33j582
$$ 137 -2208 -1664 770 1304 -705 -816 674 372 -594 1504 2609 1043 -778 -386 1033 1666 84
998H4k594J591K171o98k982k46K709L42j352J239L77j391pK568J29j251q43M81
$$ 84 -2510 -919 1252 554 -2428 -2674 35 377 -975 264 641 -750 -757 1811 1940 689 -154 327
1016C27J054M20j821j871J438K280j459k743Q09J811k161J60K521lj912N57J767
$$ 327 1381 1801 -20 -1891 -453 1827 368 -2375 -1566 245 -1916 -1756 765 762 -1150 -593 1174
1033A174k37r67L91J453j212K78q6r95p3L20j148K08J706j181k173R44K141l84
$$ 1174 937 -30 361 1814 602 880 794 -201 -274 46 -1102 -894 812 -369 -2542 -1598 543 159
1051A59j206R57N10j489J110K334j674j689K422L55j248j138J27K25k59J381p19
$$ 159 -1047 -90 420 -1069 41 2375 701 -988 1434 1789 541 -597 -470 -245 -504 877 158
1068A58k373L32J224o82L71J753j100p23K007M03k013k99K307Q95j623m99Q47
$$ 158 -2215 -1883 -659 -1341 -970 783 -317 -1040 967 1370 -643 -942 1365 2260 637 138 985
1085I85j308l60R36k87q65R58l79j753Q34J190q92k43K246M87k132J4K505j153
$$ 985 -323 -683 253 -34 -899 59 -320 -2073 -1239 -49 -941 -1184 1062 1549 -583 -569 1936 783
1103G83j538J886J702k103j344k52O00M7J06n90l39O30O9j314LK280m70q80J914
$$ 783 -755 1131 2833 730 -614 -866 -266 -219 -113 -703 -1042 -412 -343 -1657 -1654 626 156 -724 1190
1122A190J005k390j011K508Q83j915n88J301k28j257j00j48J14L18K59j051L41
$$ 1190 2195 -195 -1206 1302 2185 270 -318 983 755 -502 -602 -750 -636 -318 -59 -1110 -769
1139g69N03q03K15J648K97j112O7J661q23j671J339J165j090q60K99k58k63k37
$$ -769 -266 -1069 -854 794 1091 -21 46 1707 884 -787 552 1717 627 -233 66 -192 -455 -692
1157f92k04J99N81J3p89J35Q43k8o76J159J363j489m38R76L10p47p53P24J25p49
$$ -692 -896 -697 -116 -103 -892 -757 86 58 -618 541 1904 415 -23 953 1263 516 -237 487 612 -137
1177a37o91K94K6k08l7k69R23j45q89P75J305n17o39N36J126l51j543R44R25j065
$$ -137 -828 -534 -508 -716 -753 -1022 -99 -244 -1133 -358 947 430 -209 327 1453 1102 -441 503 1428 363
1197C63j272R90J58m93j213j37J843r5j198k66J337j64q8K65R40K23j464M20J235
$$ 363 -909 81 239 -254 -1467 -1604 239 144 -1054 -1320 17 -147 -235 30 970 1193 -271 149 1384
1216A384m01o35L50m07n3p87jM32n99n07L81O79ol65l28J072N49m54j2N67J43
$$ 1384 983 348 698 291 238 -549 -550 -118 -717 -1224 -843 -164 -170 -535 -863 209 758 304 292 859 1002
1237A002n08r3K35J81n55m97Q6J6l23n66l4P61J52p83l4J117L18o73l1J075N7
$$ 1002 494 401 636 817 262 -235 -149 -133 -456 -1022 -1056 -295 -143 -926 -960 157 475 -198 -229 846 903
1258I03n63J98M63k94p75ON77j1j160k80M52M50q75k00R31L95j023m0J052O95
$$ 903 340 538 1001 707 -68 -62 515 504 -656 -936 -484 -34 -909 -1109 -178 217 -806 -846 206 901
1278I01j197J69J278k9q20m65Q72K20j085n06P43L39j441n8J067J66q93q81J103
$$ 901 -296 -127 1151 1122 302 -163 709 929 -156 -662 81 420 -1021 -1079 -12 154 -739 -1620 -517
1297e17J634j267m22J376k0n35J70M6M81r33J15O41o3j434R1O53n64j09r62P42
$$ -517 1117 -150 -572 804 784 249 419 465 946 13 128 769 706 -728 -637 16 -548 -657 -1619 -877
1317h77M51N0j81M01O36l40L46j57N07l3p35K89J47R4r4j244P12O4q81l88R60
$$ -877 -426 -376 -557 -156 480 140 486 329 836 803 68 357 504 598 504 -740 -28 36 -845 -1233 -273
1338b73J16j88p77J078N33j90j188J266Q00o70n38O71K50l73q36J12Q46r60k35
$$ -273 -157 -345 -1122 -44 489 299 -889 377 1177 507 -31 640 890 517 -319 -207 639 -321 -556
1357e56K40L07k09j288J003N87m21K0L47R99r00K69j25R63j08q16J29J25n43n28
$$ -556 -316 -9 -218 -1506 -503 84 -337 -317 30 1029 129 398 273 1236 1128 312 441 566 23 -505
1377e05M3O45l54p72L22N26m97l35N12L30M53o77M45P11j71m70K66M74k24n23
$$ -505 -462 183 -171 -943 -621 -95 -592 -927 -415 -85 368 -309 136 847 676 206 472 946 722 199
1397A99m15N90m9q43l70M98J58o81K66M08K29o99L86M66P63o91j53K07J043q08
$$ 199 -216 374 325 -518 -888 -390 -232 -913 -647 -239 -10 -709 -323 143 906 215 62 269 1312 504
1417E04q28N99M48m63l32j04K82j017n81Q90O77o04K68L36K92n17l72M44r5J566
$$ 504 -324 275 723 260 -72 -176 106 -911 -1492 -602 75 -529 -261 75 367 -150 -522 -78 -173 1393
1437A393j816p3J269J66j083q69J420m17n61Rnl68k36J084M9k56K52m29R40k6
$$ 1393 -423 -496 773 939 -144 -1013 407 -10 -571 -562 -567 -935 -1171 -87 -38 -294 -42 -471 469 443
1457D43J32m44P46k4k27p45P22J26n71k84J03j79n18n3N78l91q0Q28n58N81K62
$$ 443 575 131 877 853 626 -119 603 729 158 -126 -23 -202 -720 -773 -195 -586 -666 162 -396 185 447
1478D47q52O78K62M67j276K89J77L63p91k6R88o61j184P13M51j369L37J036J5
$$ 447 -405 273 535 1002 -274 15 192 555 -236 -262 726 65 -1119 -406 45 -1324 -987 49 64
1497F4l91J08O44k34L90m47l78K007j550L68o98N66l0j152J35P03K34j606J07
$$ 64 -327 -219 425 191 581 134 -244 1763 213 581 -117 449 419 -733 -598 105 339 -1267 -1160
1516a160O59k59K42K2L17L7J09p6K27R25r14N25o30J134p89o51K76Q26j985O03
$$ -1160 -501 -760 -518 -496 -179 -142 -33 -109 118 1043 129 654 24 1158 369 -282 -6 820 -1165 -562
1536e62O45q92O95n46J36o61R80N55k00k68P25n47l44Q21N47q71j45O01l64j126
$$ -562 83 -809 -114 -660 -524 -1185 -205 350 150 -118 607 60 -284 537 1084 213 68 669 305 -821
1556h21K4Q79j69q76N23L57o37k00N62L32K52J06k09K52K41j17m09K95R85j120
$$ -821 -797 82 -87 -963 -440 -83 -720 -920 -358 -26 226 332 123 375 616 499 90 385 1370 250
1576B50j058O76O51j393K58R29n22o66L12L05o18O00M4M77K32K2k26o7J67L29
$$ 250 -808 -132 519 -874 -616 313 -209 -875 -563 -258 -876 -276 -232 245 477 499 273 206 373 702
1596G02n06N7N56o99j073O90M78p98m1M82J82o49N3M31J37j31O62k00O02J30p83
$$ 702 196 253 809 110 -963 -273 205 -593 -634 -152 30 -619 -566 -135 2 -129 533 333 935 1065 282
1617B82m44N19M89r09J12L67k83j145L20P78m57n39O94m1k05m8L86O75L6L57n65
$$ 282 -162 357 846 -63 49 416 133 -1012 -692 86 -371 -910 -216 -257 -462 -510 -124 551 587 944 379
1638C79j19j9L61k07k77M50r96n44R38M3p49k57O87J77q34M10R76m47l40J073
$$ 379 260 241 602 395 118 568 -428 -972 -34 9 -740 -997 -310 -133 -967 -557 419 -28 -368 705
1658G05m64Q8P16r73m01R66M94j739M58L95n47n69k9J253p43m93M79P01q69L67
$$ 705 241 329 1045 72 -329 637 1131 -608 -150 245 -302 -871 -900 353 -390 -883 -404 297 -572 -205
1678b05K17N09N9k11l19J69J8Q27j279K86P91l47j171J027l51j533O30R26J16
$$ -205 12 521 580 369 50 219 237 1064 -215 71 862 515 -656 371 20 -1513 -883 43 159
1697A59o57N01M19l25L44m67R38N5l36l97j93L01M48p56m14Q77n25j057K3J476
$$ 159 -498 3 422 97 441 -26 912 967 631 234 41 342 790 34 -380 497 -28 -1085 -1062 414
1717D14o18m81J16Q07n76J83J74P06o55L1K25J36L28q81M0l68M90j81P7J41mp09
$$ 414 -204 -685 -569 238 -338 -155 19 725 70 101 326 462 790 -91 -51 -419 71 -110 -33 108 104 -605
1739f05m7P20j50m30K5M93k4K13J76J140o53m55m3K22L34p62p3k72N07l90m69
$$ -605 -652 68 -82 -512 -487 6 -18 195 371 1511 858 403 360 582 916 154 81 -191 316 -74 -543
1760e43L28K53o90j94L07J58L96p39J087K97m02l71K69N94l70k09R3P50j070q1
$$ -543 -215 38 -652 -846 -539 -381 15 -724 363 660 258 -113 156 750 380 171 264 1014 -56 -137
1780a37n02L53O05p64M7O49j40m26k1P80k37J08K14k26M98q98P40k50l50o88R08
$$ -137 -639 -286 319 -445 -398 251 111 -315 -336 444 207 315 529 303 801 -97 643 393 43 -645 263
1801B63J73n81l82j54O27L41j704J75J361j33k94P34j40L57m27L53j81q91O09
$$ 263 436 -145 -527 -681 -54 287 -1417 -1242 119 -14 -308 426 286 643 216 569 388 -503 106
1820A06L06Q5o86l36K94m60Q18m80k55N8N89n45k03M20Q36m66J13P9L23J96p52
$$ 106 412 497 -189 -525 -231 -691 127 -353 -608 -550 39 -506 -709 -289 547 81 194 273 596 792 40
1841D0k57J050n61o06L99J41m90r9j14M51j46j13n6o6N46j2j017J204j18j59J20
$$ 40 -217 833 272 -334 65 206 -284 -383 -497 -46 -192 -305 -361 -427 119 107 -910 294 176 17 137
1862A37M09J46p45J8k7M02n23l01J67R2k4k63J10L78k82k76M20M81k15L2K36R8
$$ 137 546 692 -53 -35 -62 340 -183 -484 -317 -225 -249 -512 -402 -24 -306 -582 -162 319 104 136 372 470
1884D70J09n59m7J74j60o8j58O16l47p85L82J83R8m81N20M16o27N6K05J40K5Q
$$ 470 579 20 -27 147 -13 -81 -239 377 30 -755 -373 -190 -92 -573 -53 363 -264 -208 -3 137 162 170
1906A70J73o1Q2l20M81n80L8j02n03M01K70l05m38M10N7j35L40L5L62m91j47J109
$$ 170 343 282 364 44 525 -55 -17 -119 -622 -221 49 -256 -694 -284 -227 -362 -22 13 375 -116 -263 846
1928H46n31m53K74J07k42j54J32r5qj8k81L96L24l00l48L42L16j26n33N36J79
$$ 846 315 -138 136 243 1 -153 -21 -116 -124 -142 -423 -27 297 -3 -351 -9 307 181 -352 184 363
1949C63j48l61R17Nk85l86k92M88k45j07p01O34M76j414R0R47p3l19K20M33n2
$$ 363 215 -146 771 776 491 105 -187 301 56 -51 -752 -118 358 -1056 -966 -19 -92 -411 -191 242 190
1970A90m91N06J12J15J00n68Q08n02k75k21l52P93j41p32L1L49L8j10J57K96j67
$$ 190 -301 205 317 432 532 -36 772 270 -5 -226 -578 215 74 -658 -627 -278 -240 -350 -193 103 -64
1991f4k82N48J73p25N79L82O4j92j31r6o43P33m61K37l63K18m32l1L88j11j63
$$ -64 -346 202 375 -350 229 611 675 483 352 256 -387 346 -115 122 -241 -23 -455 -486 -98 -209 -372
2012c72N11M83k42n68L32O5K9k15M37L13p19P0j92n1N2N9m04K02J95m03j63K93
$$ -372 139 622 380 -188 144 209 238 23 460 773 54 124 -68 -119 -67 -8 -412 -210 -15 -418 -581 -288
2034b88R65p99r7P03l0p57M89M08l08k90P6j8L36p70%rK77j73j19o3K69K63n00
$$ -288 677 -122 -219 484 454 -303 186 594 286 -4 72 54 390 -380 -380 -389 -112 -285 -404 -467 -198 65 -435
2057d35K60Q99m48k55M32L7l04j58K86r5l08q9K56j021M68Q79p87J78M48n47K21
$$ -435 -175 724 276 21 453 490 186 28 314 219 -89 -178 78 -943 -475 404 -383 -205 243 -304 -83
2078h3O38k00n62J03R95O2j969J091o3N2k35K4K28j73n2j80p1J98K78l78O4J11
$$ -83 555 355 -207 -104 891 953 -1016 75 12 64 -171 -147 81 -92 -144 -324 -395 -197 81 -297 -233 -122
2100a22j03l56R94K18n78j66M60K04l65k38K25P2m26J30k6j62l05L55j19K73k3
$$ -122 -225 -581 413 631 53 -113 347 551 186 -52 173 245 -181 -51 -77 -239 -544 -189 -308 -35 -58
2121e8l68J13L28j41k68Q49P0n3m40L39J28l75l32M89M0l75k17j4k33K32n1P5
$$ -58 -426 -313 15 -126 -394 455 525 472 32 371 499 124 -208 281 321 -54 -271 -285 -518 -286 -337 -262
2143b62J60J56l61m0L83L11J47k20J54O12j458N64J46l13j51J75M8p8m06p4N0
$$ -262 -102 54 -307 -347 36 347 494 274 428 1040 -418 146 292 -21 -172 3 51 -27 -433 -507 -457
2164d57J47K18j64o1L56O9l91L00O00k53l36O01j77j93k62O48j43q65J80j25K37
$$ -457 -310 -92 -256 -317 39 108 -283 17 617 364 28 629 452 259 -3 645 502 -363 -183 -308 -71
2185g1l01P0J17K17J75n12Q5M85jk40J36K84j96j97Q2L17k82k81k31K32J49m97
$$ -71 -372 -302 -185 32 207 -305 -220 265 264 24 160 444 248 51 133 450 168 -113 -344 -112 37 -460
2207d60J98J8k9Ll5M00J87k81j94L76M08m75q2LJ87k71o9K89j44lm56J96J26k93
$$ -460 -262 -244 -273 -270 -305 95 282 1 -193 183 591 116 34 37 224 -47 -116 173 29 26 -430 -234 -108 -401
2231d01Q0L95n7j06k10L50K52J3k62K67J36k54l57M01n9m2m78K03J57j08j69L4
$$ -401 -321 74 17 -89 -299 51 303 316 54 321 457 203 -154 247 188 146 -332 -129 28 -80 -249 -215
2253b15K6o6P5n6L32J57j97N4J26K0l45K74k1o2l57K84j64J12k99j08J69J98j96
$$ -215 -189 -255 -180 -236 96 253 56 110 236 256 -89 185 164 102 -255 29 -135 -23 -322 -430 -261 -63 -259
2276b59m5o8N49l66J00K18O11p83j02N30J55L9k70p55L97L73n23O26m56p5k86
$$ -259 -304 -372 177 -189 -89 129 740 -43 -145 385 540 579 309 -446 -49 324 -199 427 -29 -104 -390
2297c90K7K26j61l1L09J70k13l0K90K57l01oJ48P6n94l1L74k51L09l02j25N10
$$ -390 -363 -137 -298 -329 -20 150 -63 -93 197 454 153 147 295 371 -223 -254 120 -131 178 -124 -249 261
2319B61o02j2R8K53k36O8J87K26j04K19l22M28r8n97N73l74N0j67l3K64o5k63
$$ 261 -341 -353 -255 -2 -238 -170 17 243 139 358 36 464 366 -231 342 -32 18 -149 -182 82 17 -246
2341b46j36K28N6j31r0K62P8P1j23J70J27k3l05K33L58j80n45K34J85m37r3M5
$$ -246 -382 -154 -98 -229 -319 -57 21 92 -31 139 266 243 -62 171 529 349 -196 38 223 -214 -307 -262
2363b62K68j61r8Q7L38j88n0J85j53J52M3J36pR0n26J55mP2p1j91N5p9r5J05J32
$$ -262 6 -155 -253 -166 172 -16 -66 119 -34 118 161 297 290 380 -146 9 5 77 6 -185 -130 -209 -304 -199 -67
2388f7r8J52lK3l1oo0N07J50m53jj1O4p4k43K62P2k64J7kJ5k75m1K74O1K14k82
$$ -67 -165 -13 -16 7 -24 -30 -90 417 567 114 113 102 166 92 -151 111 183 -81 -64 -66 -51 -326 -367 -93 -32 182 -100
2415a00K26J91l54r2K04K69l8k51J3K58m47j29J51o8J6j15j20L56j93lK67k29
$$ -100 126 317 -37 -129 75 344 306 55 68 326 -121 -250 -99 -167 -151 -266 -386 -30 -223 -226 41 -188
2437a88K08o5RJ00L39m33m2M77k54O5j69j32J98m72J09K0P2L9r9O9J09M4j5J30
$$ -188 20 -45 -36 64 403 -30 -72 405 151 216 47 -85 113 -359 -250 -230 -158 -119 -218 -149 -40 4 -11 119
2461A19L47k94k27L33j17LK4l63K84l85K8J84j64O7j06o4L13j36j49K58m9L29
$$ 119 466 172 -55 278 161 164 188 -175 109 -276 -248 -64 -228 -161 -267 -331 -18 -154 -303 -45 -94 235
2483B35j09O3L5J38r1l18M24r2m16n3jJ31k60Q1K18k0j73k2m4J16K24j68M01r2
$$ 235 126 189 224 362 271 -47 377 285 -131 -184 -185 -54 -314 -233 -15 -35 -208 -230 -274 -158 66 -102 299 207
2507B07Q8k7jR8l04j40L84q7l32O4O6j07j46J57k48K47n1N1R2n8K03k0r7K97p5
$$ 207 295 268 267 365 61 -79 305 218 -114 -50 16 -91 -237 -80 -328 -81 -132 -81 11 -47 156 136 39 336 261
2532B61l81P1J78n7k33J77J43k52o4J41Lk88L2K39j47J94M8Q9J34k5O3k86K38
$$ 261 -120 -49 129 72 -161 16 159 -93 -157 -16 -13 -301 -269 -30 -177 17 65 154 288 263 326 40 278
2555B78J76m17j96L36j64j40j15L44n83J02K95P4j8r5L77l38JL30k69J61J51q4
$$ 278 454 37 -159 177 13 -127 -242 102 -481 -379 -84 -10 -28 -123 254 -84 -83 247 -22 139 290 206
2577B06l32J40L14k93j06Q1J76l37R9j17Q6j53R4K45j37l31N53oj72K49r5k9o3
$$ 206 -126 14 328 35 -71 10 186 -151 -52 -169 -83 -236 -142 103 -34 -365 188 182 10 259 164 135 72
2600G2M05l89KJ27k61j26J9P3j46j48L08k0j99K65L00l91K49k03J26O2J86j79
$$ 72 477 88 90 217 -44 -170 -151 -78 -224 -372 -64 -84 -283 -18 282 -109 140 -63 63 125 311 132
2622A32j28j80P3K6k20O75j95n08J16O3kj12j8K72O1k58J89K00j00K14j25M3k1
$$ 132 4 -176 -103 -77 -297 378 183 -325 -209 -146 -148 -260 -278 -6 55 -203 -14 186 86 300 175 218 197
2645A97j10L8j86J16j91J41r5K71m38p0K98O7l58K08J68J5j11K38M4j38K04qr7
$$ 197 87 125 -61 55 -136 5 -90 181 -257 -327 -29 38 -320 -112 56 71 -40 198 242 104 308 300 203
2668B03j65M3j9j40K18j31r0k04N09l93j98K93J01j13n1J81J85l6R0m19J78R5
$$ 203 38 81 62 -78 140 9 -81 -285 224 -169 -367 -74 27 -86 -137 44 229 193 283 -136 42 137
2690A37j81R0k20L63k87j35K14R6j20j94K6J74k52K59K63j15k66J50K61K0j00
$$ 137 -44 46 -174 189 -98 -233 -19 77 -43 -237 -211 -37 -289 -30 233 118 -148 2 263 283 183
2711A83k22mL34k30k3n1R6r9j78M6J44j78J75j88J12m5K45MJ82k65J83n6M15l06
$$ 183 -39 -43 291 61 38 -13 83 -16 -194 -148 -4 -182 -7 -195 -83 -128 117 121 303 38 221 165 580 274
2735B74m23P7J43P0k29J6oj7j48K49N3P6k72J02J4L07m68K33rL00o6m76K88N9
$$ 274 -149 -72 71 141 -88 -72 -78 -95 -243 6 59 135 -137 -35 -21 286 -182 51 42 342 276 -200 88 147
2759A47k18k53K44J53M1l59O6N34n82J32k43l4K50P5P2K72j13l99M5N65n5Mn9
$$ 147 -71 -324 -80 73 114 -245 -179 355 -227 -95 -338 -372 -122 -47 25 297 184 -215 -170 395 340 344 285
2782B85l40J14K4k47J18m81M91Nl10M57l60N21Pl7J34K7m68j45N50L6l10q4k62
$$ 285 -55 59 83 -164 -46 -527 -36 -31 -341 116 -244 277 284 247 381 408 -60 -205 345 381 71 -13 -275
2805b75L41l1j91O3k04M85n04k6k48M10M33r4k94L68k34k30L0J84J7L6l73N09
$$ -275 66 35 -156 -93 -297 188 -316 -342 -590 -180 253 159 -135 233 -1 -231 -201 -17 0 36 -337 172
2827A72o7PJ23l02nM3N3J99n4m29m95J165k20n80L86k11P41m77r0L0k15N65o7
$$ 172 105 112 235 -67 -72 -29 24 223 169 -260 -755 410 190 -390 -4 -215 526 49 -41 -11 -226 339 272
2850B72k66L74k01J15l17p6J55j0K4k92j6L14r6J00N43r65L12J79j2k86o2L78
$$ 272 6 380 179 294 -23 -99 56 46 70 -222 -238 76 -20 80 623 -342 -30 149 137 -149 -211 167
2872A67k3k03K17l52k11K87r4J17M54J94k49J68k77L8k33NM09o8l07J28K9m52
$$ 167 144 -59 158 -194 -405 -118 -212 -95 359 553 304 472 195 233 0 5 414 346 39 167 196 -256
2894b56L24m74M57n67L23%J26j93J01K40j43o2J83j3L2K75k55K26k43O9k42J64
$$ -256 68 -406 51 -516 -193 -193 -67 -260 -159 81 -62 -124 59 46 78 353 98 324 81 150 -92 72
2916G2j21R0K5l96K60L19m61q8L47kJ3k86K13J09K24k92Q1R5j8j65L2k12L24m49
$$ 72 -49 41 66 -330 -70 249 -212 -300 47 45 58 -228 -15 94 318 26 107 202 184 19 51 -161 163 -286
2940b86K63j48p0P1Q7J13j82O4O6J88J63k25K31j39j68j39L55j96l1n2J43k42
$$ -286 -23 -171 -241 -170 -83 30 -152 -88 -22 166 329 104 335 196 28 -111 244 48 17 -35 108 -134
2962a34M6j97J23o7K62j86R5J19O8q2L99k28m69j1L87J73L4l51K36j29J29l90
$$ -134 -88 -285 -162 -229 33 -153 -58 61 129 47 446 218 -251 -262 125 298 332 -19 217 88 217 -173
2984a73O3J91J60l57J01J66k45M6q0K75l50K91l31M20k04L8k5l11N58l80p1J29
$$ -173 -110 81 241 -116 -15 151 -94 -48 -128 147 -203 88 -243 177 -27 11 -14 -325 233 -147 -218 -89
3006h9K88j24l78k24K12M96p73M73j06K58k55j01K53L51m26R6K18j85l28P61j36
$$ -89 199 75 -303 -527 -315 181 -592 -119 -225 33 -222 -323 -70 281 -145 -49 169 -16 -344 417 281
3027B81o67M33k23N9j36K58j37L3j2k54J8M75o9J91l53K29j45M9R0P7rr6j22N6
$$ 281 -386 47 -176 -117 -253 5 -132 -99 -111 -365 -347 128 59 250 -103 126 -19 30 120 197 188 92 -30 26
3051B6j86J24N0j10k17L34l4L0j34M7o0K32R0j52j63N07j98l50R1J44J02j27J15
$$ 26 -160 -36 14 -96 -313 21 -13 17 -117 -70 -130 102 192 40 -123 384 186 -164 -73 71 173 46 161
3074A61j15Q2o75O88k32J22m54K08J30K19l56N2N25l60N1k31N77j84k88O7p5P3
$$ 161 46 128 -547 141 -91 31 -423 -215 -85 134 -222 -170 355 -5 46 -185 392 208 -80 -13 -88 -15
3096a5p9m7J0L4q3R9k04L06o4pk6J43J29j70P8J8l4j0P9n3r0j85K20j26J03j48
$$ -15 -94 -141 -131 -97 -180 -81 -285 21 -43 -50 -76 67 196 26 104 122 88 78 157 104 14 -171 49 -77 26 -122
3122a22J14j97K67p7P9j63J51R0l73K83J84k68K90K8J62l68J28k00N8k08jJ49
$$ -122 -8 -205 62 -15 64 -99 52 142 -231 52 236 -32 258 286 448 80 208 8 66 -142 -143 6
3144Fl5p7p1R4R9J30q2k27K93j94J3K2J15J73j30Kj57k2Qn7J06J35q4j49j73K78
$$ 6 -29 -106 -177 -83 16 146 64 -163 130 -64 -51 -29 86 259 129 131 -26 -48 -40 -97 9 144 60 -89 -262 16
3170A6qk3pJ65j68J07j73L79k65RJ42l9j15k71K93o9j39N3j5J92k69j12L58q3
$$ 16 8 -15 -22 143 -25 82 -91 288 23 32 174 135 20 -251 42 -27 -166 -113 -128 64 -205 -317 41 -42
3194d2P3J63j46P1q7k70J95M25k34K2O3k14J77k91j8P1j73L47l02Q3N9n2p7K95
$$ -42 31 194 48 119 32 -238 -43 382 148 170 233 19 196 -95 -113 -42 -215 132 -170 -87 -28 -80 -157 138
3218A38j49r2K14m7p5p1q8M41k86J4P6Oj3k14J95k3k2k18J60q8J56L6Joq8K23
$$ 138 -11 -103 111 64 -11 -82 -170 271 -15 -1 75 81 68 -146 49 26 4 -214 -54 -142 14 50 51 45 -43 180
3244A80j98m9J25k83K02J89J38l77NJ02J31l05J81k02J07R5K3m3o8R7j96RK58
$$ 180 -18 -67 58 -225 -23 166 304 -73 -68 34 165 -140 41 -161 -54 41 64 21 -47 50 -146 -137 121
3267A21o1p8j57L80j9k86K09k3o7j05J67j18rj05K8n0K00P1k43K59j88L6J35j94
$$ 121 60 -18 -175 205 186 -100 109 86 19 -86 81 -37 -46 -151 -123 -173 27 98 -145 114 -74 -38 97 -97
3291i7J32k8j9K78j36j47l95M73j40j11nJ74%M0m52M69L4l52M90k38l2K4K1J92
$$ -97 35 7 -12 266 130 -17 -412 61 -79 -190 -195 -21 -21 19 -433 36 70 -282 208 -30 -62 -38 -17 175
3315A75j7j29o5l2R4j47J6O9o1J37j12J57k4l5J25r2N3J16j99k5J93j18J7N1Q6
$$ 175 158 29 -36 -68 26 -121 -105 -36 -97 40 -72 85 61 26 151 59 112 228 29 4 197 79 96 147 233
3340B33l12P4L0j6P2k51R5L92l65jk7K2N8o3N4O4N1J7l04K7K15k08J01o3O6L3
$$ 233 -79 -5 25 9 81 -170 -75 317 -48 -49 -76 -54 4 -59 -5 59 110 127 -177 -150 65 -143 -42 -105 -39 -6
3366fk25K75k20oJ63j26J00pO3l7J17j6j39K96n9r8j94k62M46J04J70j68m7k51
$$ -6 -231 44 -176 -182 -19 -145 -45 -52 11 -26 91 75 -64 232 173 75 -119 -381 65 169 339 171 124 -127
3390a27r2p3K86K83l92J21j29K42l37J56K7R2n9J12n9kq4j14L81l86Q2R6j38J64
$$ -127 -219 -292 -6 277 -115 6 -123 119 -218 -62 -35 57 -2 110 51 49 -35 -149 232 -154 -72 24 -114 50
3414E0m2r6MR6P9J41l00j2J52O4O3k2j7l03N2K57o6r2m8M5k05R3J2J8j32J27j3
$$ 50 8 -88 -84 12 91 232 -68 -80 72 136 199 177 160 -143 -91 166 100 8 -40 5 -200 -107 -95 -77 -209 -82 -95
3441i5K40j07J65o9p8j36N4L3n2J8J50k03J93J5j43o3r1p4J51K1M7P0p9q7O3K66
$$ -95 145 38 203 134 56 -80 -26 7 -45 -27 123 -80 113 128 -15 -78 -169 -243 -92 -71 -24 46 -33 -120 -57 209
3467B09k41k06M22j79o1J16L02l55o8Q4k02K93m3j72K0r8J7K19r6k5j64M23q1
$$ 209 -32 -238 184 5 -56 60 362 7 -61 23 -179 114 71 -101 -81 -179 -162 57 -39 -64 -228 195 114
3490A14k3P8r4L8K23l96o4J67N5m51J96j81N0L48j9j52R2j83K94oj80K8J49n7
$$ 114 91 169 75 113 336 -60 -124 43 98 -353 -157 -338 -288 60 41 -111 -19 -202 92 86 -94 -66 83 26
3514B6J3R4m01L03K7k69J82Q5p1P9k63J18K34k84l3K16j0M0lk15J01J59j32N6
$$ 26 39 133 -268 35 62 -207 -25 60 -11 68 -195 -77 157 -127 -160 56 46 86 83 -132 -31 128 -4 52
3538E2r9J51K12r5n54K46K7P1J78k82j51M2j43M51k15N6L8O0j01n8K68l0j91N1
$$ 52 -47 104 316 221 -333 -87 -60 11 189 -93 -244 -202 -345 106 -109 -53 -15 45 -56 -114 154 124 -67 -16
3562a6P7k5m2j14J0J12j13R7N6L0j76K10j67J88k67L15j02j88J81j40K10K5J3
$$ -16 61 36 -6 -120 -110 2 -111 -14 42 72 -104 106 -61 127 -140 175 73 -115 66 -74 136 161 174
3585A74j17o6K61k87j63J13L39o3m28N02j69l31J67P7m7l7K58j58j97K44p9j16
$$ 174 57 -9 252 -35 -198 -85 254 191 -237 265 96 -235 -68 9 -38 -75 183 25 -172 72 -7 -123
3607a23k5J47N3j90j45N03n01L73j13K69j02k89K48j12R8p6J04m8R0l92J92J8
$$ -123 -148 -1 52 -138 -283 220 -281 92 -21 248 146 -143 105 -7 91 15 119 71 161 -231 -39 -21
3629b1K04k92k25M94j4l58K29j43K16l6k29R0kL44j29p9o03M96P3J79J53l08j83
$$ -21 183 -109 -334 160 146 -212 17 -126 90 54 -175 -85 -87 257 128 49 -554 -58 15 194 347 39 -144
3652a44L93n37N83m75k43M95J39j15m3L11l38O8n1m4j40K10m3K21k03K5M03q06
$$ -144 249 -288 295 -180 -423 72 211 96 53 364 26 94 43 -1 -141 69 26 247 44 69 472 -334
3674c34M11k4o4j24K42J80m55O43p81R4N60o38L12j16k73O37k25j35k5K83M6L34
$$ -334 77 53 -11 -135 107 287 -168 475 -306 -212 348 -290 22 -94 -367 270 45 -90 -115 168 214 548
3696E48n83L44j63j86l11L83o45R61q78P30P63j111K71l24O94p03Q94l62j47j299
$$ 548 -35 309 146 -40 -351 32 -613 348 -530 200 963 -148 123 -201 493 -210 684 322 175 -1124
3716a124Q14j8O33J2K65r72Q23m13p13K60O75m23J91o04M77k05J60J19M00n72
$$ -1124 -310 -328 305 317 582 -390 433 20 -693 -433 242 -181 10 -594 -117 -322 -162 -43 357 -215
3736b15p0O19J16j54l12r9J51n7M18o21K76m6n64M17K28L44n19K44j3K59o14M0
$$ -215 -285 334 450 296 -16 -115 36 -21 397 -224 52 6 -558 -141 87 431 -88 156 143 402 -212 -172
3758a72K59J34m5l61L59j19j50J62k71K57k73J98j50J31N3N6l1o7j11L7K70O7
$$ -172 87 221 176 -185 174 55 -95 67 -204 53 -220 -22 -172 -41 12 68 37 -30 -141 -104 166 233
3780B33m71M74k63j00j1K10J36j34j8o9j2K9K11l00m2l5J03O0J91Nl00Q3J09j19
$$ 233 -238 236 -27 -127 -138 72 208 74 56 -13 -25 4 215 -85 -127 -162 -59 1 192 197 -103 -20 89 -30
3804c0r3M13l28Q3J7j79J37N1j47N7j46J48P3n0j74l1K89k12J09K14l88M90k73
$$ -30 -123 290 -38 45 62 -117 20 71 -76 -19 -165 -17 56 6 -168 -199 90 -122 -13 201 -187 303 30
3827C0J35Jo8j60K33l04j03j7K21P4k60K25J58j80Mo1R6J6M0j27K19j0k06J68
$$ 30 165 166 98 -62 171 -133 -236 -253 -32 42 -218 7 165 -15 -11 -72 24 40 80 -47 172 162 -44 124
3851A24J54l02K1J23j4j21J75j57J55j02Qm1J25j88J35j38Q5R6j70j27J57J95
$$ 124 278 -24 -3 120 106 -15 160 3 158 56 64 23 148 -40 95 -43 42 138 -32 -159 -2 193
3873A93j08P9o4J77l11j90M53M7l4j102L27O62L5k41P1J16j8m1j47JK8K53j19
$$ 193 85 164 100 277 -34 -224 229 276 242 -860 -533 129 164 -77 -6 110 92 51 -96 -95 -67 186 67
3896F7k0l7j03o3O1J06q4L2J37j30K7L7m4K15l45J31J20p3r7O7l8J31J8j28l0
$$ 67 47 10 -93 -156 -95 11 -73 -41 96 -34 -7 30 -14 201 -144 -13 107 34 -63 4 -34 97 115 -13 -43
3921d3J04P3l30K25L2j61J26q4K88k37q7k9L53k76J5J00M1j38J21j52J22k7Rj08
$$ -43 61 134 -196 29 61 -100 26 -58 230 -7 -94 -123 230 -46 -31 69 110 -28 93 -59 63 36 45 -63
3945f3P0p9O9j55J61J99k92j1O8K34j68j28M8J44r0q2RO4j1J88j01j06J12j62
$$ -63 7 -72 -3 -158 3 202 -90 -101 -33 201 33 -95 -47 97 7 -75 -66 -2 -13 175 74 -32 80 -82
3969h2J75k6j33n9N6r9K02k4l9K0J90j97O8J21l17J02J41j50p8L6L19l12q1n1
$$ -82 93 67 -66 -125 -69 -168 34 10 -29 -9 181 -16 52 173 -144 -42 99 -51 -129 -93 226 -86 -167 -218
3993b18Q1K10p8l9j16K87Oj68M9J12p7j20J25P6k48M8j06L83j28l44K50k28K47
$$ -218 -137 73 -5 -44 -160 127 133 -35 14 126 49 -71 54 130 -118 -70 -176 207 79 -265 -15 -243 4
4016Dq4K6l0L3P1R4p2j12j12K86K9j42l0LK20K4k30q8J26R2j70l3j3M5nJ49p5
$$ 4 -80 -54 -84 -51 20 114 42 -70 -182 104 133 -9 -39 -36 184 208 -22 -110 16 108 -62 -95 -108 -63 -68 81 6
4043Fk1q7o1J34J17K9k08K19o3q8k14K89J04p3j84K1J5lJ9oJ50l1j68J9l7K17
$$ 6 -15 -102 -163 -29 88 117 -91 128 65 -23 -237 52 156 83 -101 -80 -65 -68 -49 -55 95 64 -104 -85 -122 95
4069I5j58o3K28m2o4m7J81k04J55O0l41R4J60l56O9n2M15j76M4k9k9m0P0K56j93
$$ 95 -63 -126 102 60 -4 -51 130 -74 81 141 -200 -106 54 -302 -233 -285 130 -46 -2 -31 -60 -100 -30 226 33
4094C3R6L5r8q2n1M5K0M4j66l4J59k7P7k21J81jmj92K47q4j5K14n8k92J29R4o9
$$ 33 129 164 66 -16 -67 -22 -2 42 -124 -158 1 -26 51 -170 11 10 6 -186 61 -23 -38 176 118 -174 -45 49 -20
4121b0N8p0P5J99j63r2Q7p8P1j01j68K21k6k79L33J70l28J72M0J52m08J2K35k68
$$ -20 38 -32 43 242 79 -13 74 -4 67 -34 -202 19 -7 -286 47 217 -111 61 101 253 -155 -143 92 -176
4145a76J56K0J10j8q8J33J84l67K78k45j18J62L5j12P3M4j47p0K17q8L8J53k16
$$ -176 -20 0 110 92 4 137 321 -46 232 -13 -131 31 66 -46 27 71 -76 -146 71 -17 21 174 -42
4168d2R2Q4j64p5l7LJ95o2l38L80P6r8n2J8J59l9J4J00O0j64j82N4O3o7K08m72
$$ -42 50 134 -30 -105 -142 -139 56 -6 -344 36 112 14 -38 -20 139 100 114 214 274 110 -72 -18 45 -22 186 -286
4194b86M27k44p9J62L41k41Nn5q6J57J9j12j98K2K69m6k51K92l05M75j62N0jj62
$$ -286 141 -103 -182 -20 321 80 85 30 -56 101 120 8 -190 -168 101 55 -196 96 -209 266 104 154 153 -9
4218ij78L38k09R9J21n0k04M38l99K72j84O5J68k91K97k13J77j19R2k55L01k73
$$ -9 -187 151 -58 41 162 112 -92 346 -53 219 35 100 268 -23 274 61 238 119 211 -44 257 -16
4240a6J7L2j56M9K07k01rK84J28m60k89L35K36J06mm28J30j01J58Q6l22M32q9
$$ -16 1 33 -123 -74 133 -68 -77 207 335 -125 -414 -79 157 263 259 -169 -39 -140 18 104 -218 214 125
4263A25j13l31K49n5R3J97p4j77P0oNj22J98n6n7Q5l9P6r1R4j55K46Q3j13j68
$$ 125 12 -319 -70 -125 -32 165 91 -86 -16 -22 -17 -139 59 3 -54 31 -8 68 -23 71 -84 162 245 132 -36
4288c6j18J23j31K47j52J55l00N27j91j7o3J86l73P6l24M10J99n74J55K60l7j12
$$ -36 -154 -31 -162 85 -67 88 -212 315 124 107 44 230 -143 -67 -391 19 218 -356 -201 59 22 -90
4310i0k26L44L6j79K19k65J56j05K1J09P4J3l63L96j77R6k58K63o8j35K42j13
$$ -90 -316 28 64 -115 104 -161 -5 -110 -89 20 94 107 -256 140 -37 59 -199 64 -4 -139 103 -10
4332a0qJ20j63l9M3K30q2r7M9N3k19J16M2j0n7J06j6k12J61r5J77n0j45K6j4j28
$$ -10 -18 102 -61 -100 -57 173 91 -6 43 96 -123 -7 35 25 -32 74 58 -154 7 -88 89 39 -106 -80 -94 -222
4358b22K22J41j2k17q8M18j45L2R9m47K65n5M0k4j67J36k18L35O0j72j59J37j33
$$ -222 0 141 129 -88 -176 242 97 129 228 -219 46 -9 31 7 -160 -24 -242 93 153 -19 -178 -41 -174
4381a74M5K14j28Q8n5N5k86L72k11J29o8K18k74J40K20l98K53p0j40jJ55j93J13
$$ -174 -129 85 -43 45 -10 45 -241 131 -80 49 -19 199 -75 65 285 -113 140 70 -70 -71 84 -109 4
4404Dj9KoQ3N1O2k64N8K78j71j89M3J95J15oj80K4J81o45K55K83L2K0j08j07L31
$$ 4 -15 -13 -19 64 115 177 -87 -29 249 78 -111 -68 127 242 236 56 80 261 -384 -129 154 186 206 98 -9 322
4430C22j39k83J69J31l34K11j18J73m5n9L70k94L07m60R3l19J2L49qj00j49N50
$$ 322 183 -100 69 200 -134 77 -41 132 87 28 398 104 411 -49 44 -275 -263 86 78 -22 -171 379
4452C79m32N87p69j37K96n04J079q77P20r5j90m8o8L84l50J84p98P19L79p48O53
$$ 379 -53 534 -235 -372 -76 -580 499 -378 342 247 57 9 -59 325 -25 159 -639 80 459 -289 364
4473C64m35L95m72K7q6N82J39q97O75k54k54N95p67O21j2k33j91J02J32k64L15
$$ 364 -71 324 -148 -121 -207 375 514 -383 292 38 -216 379 -388 233 221 -12 -203 -101 31 -233 82
4494H2o4M5O0Jj54l5l9J32J56k76k0m7mQ2j14j1L3K66m80J35O9k9K85K01l10L22
$$ 82 18 63 123 124 -30 -65 -104 28 184 -92 -112 -159 -163 -81 -195 -206 -173 93 -387 -252 -183 -212 73 274 -36 286
4520B86m95kL08m26K13L7k1m02M24j50O28n91L38O3l14Q1pj36l3M91q3k54n0Q1
$$ 286 -209 -211 97 -329 -116 -79 -100 -502 -78 -228 400 -191 147 210 -104 -23 -30 -166 -199 292 209 -45 -95 -14
4544a4K78l06j70k65P97K0j52j97m24m85J127l7l64kM13j46l92J29P89o02mM73
$$ -14 264 -42 -212 -477 320 340 188 -9 -433 -918 209 172 -192 -194 219 73 -319 -190 599 -3 -7 466
4566D66m94k93L81j76j38L0qP29q60Q6Q53k02p48L76o5P66p12j84J68p0K13j67
$$ 466 -28 -321 60 -116 -254 -224 -232 497 -363 -277 576 374 -374 2 -63 703 -9 -193 -25 -95 118 -49
4588d9J66l44Q9L71J49o38J12j35M5N16p55L99m7J97n11L86k64K11M66j239P93
$$ -49 117 -227 -138 233 382 -256 -144 -279 -234 282 -473 -74 -121 76 -435 -49 -313 -102 364 -875 -82
4609h2J30k08J82p9J49L14r77N22J57m27k5K85O1k07J81rj70k9J77N0j71K63j2
$$ -82 48 -160 22 -57 92 406 -571 -49 108 -319 -344 -59 2 -205 -24 -33 -203 -232 -55 -5 -176 87 75
4632G5j0k50M73n63L68l13M34o85K31K07j94k4N26n89NP11l25j01k89M29k29l54
$$ 75 65 -185 288 -275 93 -220 214 -471 -240 -33 -227 -251 275 -314 -309 402 77 -24 -313 116 -113 -467
4654d67M81k99J16M81J78j042rQ56m54N78n44K64L8J9j77l8J04k26r7Q34n80k60
$$ -467 14 -285 -169 312 490 -552 -561 295 -159 419 -125 139 177 196 19 -19 85 -141 -238 596 16 -244
4676b44o33L39K24k32Q29n27J83k45N52l38l06L52N33o45L58q91O64J88n52L26
$$ -244 -877 -538 -314 -546 283 -244 -61 -306 246 -92 -398 -46 487 -158 200 -691 -27 161 -391 -65
4696f5M58J51k43r9Mj070Q05M00J01q15K62j91j96K91R55r99p4M67k29L76n39
$$ -65 393 544 301 202 206 -864 -59 341 442 -373 -111 -302 -498 -207 748 -251 -325 142 -87 289 -250
4717b50Q76j028O50k21Nq12Q74J69k17m22M47l26N87n55N47m15j58l85O98n65
$$ -250 626 -402 248 27 32 -780 94 263 46 -376 71 -255 332 -223 324 -91 -249 -634 64 -501
4737e01J74L99p75K49M97k89M48n52Ok0P00n82M22k15o88L49N96m21K98m82M03
$$ -501 -327 72 -703 -454 43 -246 202 -350 -344 -364 336 -246 176 -39 -727 -378 218 -203 95 -387 16
4758A6K59l9j89k65k00O35n1j50L00l63J24k03j70M17l39k76Q44m76M85j64l59
$$ 16 275 236 47 -218 -418 217 166 16 316 -47 77 -126 -296 121 -218 -494 350 -126 359 195 -164
4779a64ol62L86L22J20l22Q8k25O4K48k87K06n0n9Q3L49m88j22M20l0o4k95M58
$$ -164 -170 -532 -146 176 296 -26 62 -163 -99 149 -138 68 18 -41 42 391 -97 -219 201 171 107 -188 270
4802B70l47k30M48J92k68j04n75O86l91L36l04M20l28n7L76qn30j92O60k80N23
$$ 270 -77 -307 141 333 65 -39 -614 72 -319 17 -287 133 -195 -252 124 116 -414 -606 54 -226 297
4823B97n57M57m01oJ66K90l72N1j37j03L24L39l41n9n50P44j31l55k85Q56l00
$$ 297 -260 197 -204 -210 -44 246 -126 -75 -212 -315 9 348 7 -52 -602 142 11 -344 -629 227 -73
4844g3j25K97P2M74m22o2m80N68k45r5L05k86J64j23k06J14L28j10k94J18K28
$$ -73 -198 99 171 645 223 161 -319 249 4 -91 214 -72 92 -31 -237 -123 205 95 -199 -81 147
4865A47o30N86n88J82J69j15P20r48L79N6j17K76N0n0j36L0N65k63p0m28K48m94
$$ 147 -483 103 -485 -303 -134 -249 471 -477 -98 -42 -159 117 167 117 -19 11 576 313 243 -185 63 -431
4887d31q9M28J84m25N24o32J62L82k67l28K36l3L23J40l1j27K90l49J59j5j82
$$ -431 -520 -92 92 -333 191 -441 -279 103 -164 -492 -256 -289 34 174 143 16 306 -43 116 101 -81
4908h1k44L55J58l62P64j62j38k55o74J200q53L45J92n97N44Q9l74j34M92j88
$$ -81 -325 30 188 -174 590 428 290 35 -639 561 -292 53 245 -352 192 281 -93 -227 265 77
4928G7J55k88j25j79p4M89k33m60R70j43l05NM7J36j91j2K97j7J45k60m8L99m92
$$ 77 232 -56 -181 -360 -434 55 -178 -638 332 189 -116 -111 -64 72 -119 -131 166 149 294 34 -14 385 -107
4951a07N9N34m72l4%L54l97j75J72N2J56j94J46M9l39L48l5q4M06l73l35J48j5
$$ -107 -48 486 14 -20 -20 334 -63 -238 -66 -14 142 -52 94 143 -196 152 117 33 439 66 -269 -121 -136
4974a36J59o1K2j11pj04K50l10M74K40j85k37M01j10K84o82N28l63J69j16j09
$$ -136 23 -38 -16 -127 -134 -238 12 -298 176 416 231 -6 395 285 569 -113 415 52 221 105 -4
4995dm13P02k94K56k08r9l6M6J9J49K04n65M93k02n17M04K70j82j88R5J07p6K30
$$ -4 -417 285 -9 247 39 -60 -96 -50 -31 118 322 -243 250 48 -469 -65 205 23 -165 -70 37 -39 191
5018A91k44J86l18N2K05J62j09l44N33n50K73j3l2L11j25l34N2K71L0l75K10P8
$$ 191 -53 133 -185 -133 72 234 125 -219 314 -236 37 24 -8 303 178 -156 -104 167 197 -178 32 110
5040A10k8k2L1M4k49j23K0K24m8N0J89p75L07L25j59R4L17k89q3M61l36K94k37
$$ 110 82 60 91 135 -114 -237 -217 7 -41 9 198 -577 -270 55 -104 -10 307 18 -65 396 60 354 117
5063A17p52L91m53O44k2o6K44k91O1l4j6K67K4K73Qj210M87N93j78o26j65O63
$$ 117 -635 -244 -697 -53 -75 -141 103 -188 -127 -161 -177 90 114 387 395 -815 -328 265 87 -539 -704 -41
5085d1J71n17P64p2j48n32K60P6j38M80j97j91R3K15L56q47J48J07j23K3J87j67
$$ -41 130 -387 377 305 157 -375 -115 -39 -177 303 106 -85 8 223 579 -268 -120 -13 -136 -113 74 -93
5107i3O1J10j33R5o6j79K70qj49P4o2J01j27Q5r4L09j48P9l0J4n4J20j79J49j55
$$ -93 -32 78 -55 40 -26 -205 65 57 -92 -18 -80 21 -106 -21 -115 194 46 125 95 109 55 175 -4 145 -10
5132a0J64k34j3J53j9l48L98j47J4o8P1K16J47o17L68k07m46L60l95O50n51O35
$$ -10 154 -80 -93 60 41 -307 91 -56 -42 -110 -39 177 324 -293 75 -132 -578 -218 -613 37 -514 121
5154A21r4o2m28K22K50j33L8K36j50l7Q1j65J68J88N04m14m13R8Q2r5m4O3j99
$$ 121 27 -35 -463 -241 9 -124 -86 150 0 -37 44 -121 47 235 739 325 -88 10 92 -3 -47 16 -183
5177a83Q0K61l86K19N9j37K15lp9j38J79l6k76N4J24L32m47L21l08N1L5j10J26
$$ -183 -103 158 -228 -9 50 -87 128 125 46 -92 87 51 -225 -171 -47 285 -162 159 -149 -98 -63 -173 -47
5200d7R0j03O4q7mo9K06M8j13J25j49L01l07L71k67J4Pq9K59k03m9K60m08J16
$$ -47 43 -60 4 -83 -87 -156 50 98 -15 110 -39 262 -45 326 59 73 80 -9 250 47 -2 258 -150 -34
5224c4rJ36p4k58L63k11L65k53j09N49j27l29N0j13L02l08M3j34j19J69K54j54
$$ -34 -43 93 19 -239 124 -87 278 25 -84 465 338 9 59 -54 248 -60 -17 -151 -270 -101 153 -1
5246aM8j3p5J8L6j40J94j69k0J8K07O0l08M99k30Q2j6k78J87n19M19L80m57k3
$$ -1 47 34 -41 -23 13 -127 67 -102 -122 -104 103 163 -145 354 124 206 190 -88 99 -420 -1 379 -78 -101
5270a01N06j144Q28j23K9l57M99J67k98j86J34l8K85k21l63J75n2L02j65r7M54
$$ -101 405 -739 89 -34 -5 -362 137 304 6 -180 -46 -84 201 -20 -383 -208 -260 42 -123 -220 234
5291B34L28n39n14M07j98Q8Op4M01q1J81q24O08j80K50r7R3j82J79r5N1k65K73
$$ 234 562 23 -491 -84 -282 -194 -188 -262 139 58 239 -585 23 -157 93 -4 89 -93 86 -9 42 -223 50
5314E0J43j24k77J91j1r8M5oJ38jq5n5K2j0J13J2q1j36K31k15J34J53j49p4K3
$$ 50 193 69 -208 -17 -28 -126 -81 -87 51 50 -35 -90 -68 -78 35 47 -34 -170 61 -154 -20 133 -16 -90 -67
5339f7j22K27o6J21J29j03k16J81j06K77o93o6O39k89K58k55J77j18R5j6q0K76
$$ -67 -189 38 -28 93 222 119 -97 84 -22 255 -438 -504 135 -154 104 -151 26 -92 3 -13 -93 183
5361A83j83j06K3O9J16qj74J69o8o9J83j88J67p3n8N9j21p8J76o4J47k54J41k57
$$ 183 0 -106 -83 -14 102 94 -80 89 21 -48 135 -53 114 41 -17 42 -79 -157 19 -45 102 -152 -11 -268
5385b68L72J46j0l78J54L6J70m6k25J62j97J4J35L9j13K20k60J26j7q8r1K57n6
$$ -268 104 250 240 -138 16 52 222 176 -49 113 -84 -70 65 104 -9 211 -49 77 60 -28 -119 138 82
5408H2j74l4j7J85j1j38k6R2k52L08m6N4k92K55J2j31O1j59K09k25J34O8Lm0o6
$$ 82 -92 -126 -143 42 31 -107 -133 -41 -293 15 -31 23 -269 -14 -2 -133 -72 -231 -22 -247 -113 -45 -42 -82 -148
5433a48K49j11J6J60k85J80M8l72J24J29J8J94K6j19j55o0O3J41r3R1q6K39Rk33
$$ -148 101 -10 6 166 -119 61 109 -263 -139 -10 8 202 228 109 -46 -106 -43 98 5 96 10 249 258 25
5457B5j72K00j68K8N5p0M00m26J27J7j46J68o9J35k76J77K39k86j72K93N1P8j38
$$ 25 -147 53 -115 -87 -32 -102 298 -128 -1 16 -130 38 -31 104 -172 5 244 -42 -214 79 130 208 70
5480G0J04j94Q8r9N9O0q7N7j34K27p4j31o0J7J76%O5o6M1k01Q1j82J65K78l62
$$ 70 174 -20 68 -31 28 88 1 58 -76 151 77 -54 -114 -97 79 79 144 78 119 -82 -1 -183 -18 260 -102
5505a02L12l76J89M0k12J71J8m6j4k3J34j61l9J58k66J98q7K12q5P8J3q1q3k92
$$ -102 210 -166 23 63 -149 22 40 -6 -20 -43 91 -70 -109 49 -217 -19 -106 106 21 99 112 31 -52 -344
5529c44N46k77n5J74K80j40k68j05L57k3o6j52j52M88k51Jj97N91m00J42J74n40
$$ -344 202 -75 -130 44 324 184 -84 -189 168 145 79 -73 -225 263 12 13 -184 407 7 149 323 -217
5551b17J35R1J80R6j71P3k02j22L53j04k83J44K15j94R1k7k13J20J76r1j59M8
$$ -217 -82 9 189 285 114 187 -15 -137 216 112 -171 -27 188 -6 85 58 -155 -35 141 50 -109 -61
5573f1J66o6j76J46m2r0k2K75m2J9k10J19l12J16J64k97R3K53nK7j59O2K1K26
$$ -61 105 39 -137 9 -33 -123 -145 130 88 107 -103 16 -296 -180 -16 -313 -220 33 28 55 -104 -42 -21 205
5597B05k94J50l0q8pK30k82M19l97l58P23j8l49n0L59m87L34r3k8K40j71oJ93
$$ 205 -89 61 31 -57 -64 166 -116 303 -94 -452 271 253 -96 -146 213 -274 60 -33 -61 179 8 2 195
5620A95l02J33j99J02L2oM4p8J44j49O4J25q1q9J90J9q5j95K45j70K30M1j08l23
$$ 195 -107 26 -173 -71 -39 -45 -1 -79 65 -84 -20 105 24 -65 125 144 59 -136 109 -61 169 210 102 -221
5644b21L53j47k07L07j61k8L0J10m76L55o3J72r2J67l14n2j0L62n5j2j46P5M3
$$ -221 132 -15 -222 85 -76 -104 -74 36 -440 -85 -148 24 -68 99 -215 -267 -277 85 30 18 -128 -53 -10
5667a0k15l77O77L37k95P8Lk97j81M44K17l36k32j64K92K86m88L70q0J88m46M86
$$ -10 -225 -602 75 412 117 195 198 -99 -280 164 381 45 -187 -351 -59 227 -261 109 29 217 -229 257
5689B57j13k34L32l73J92m3m2J09n7O0q7r3L73k36r6K1K17l87J2J88L7q4K32k90
$$ 257 144 -90 242 -131 61 18 -24 85 28 88 1 -92 281 45 -51 -30 187 -200 -188 0 37 -47 185 -105
5713a05M1L4m7r8n6L87j75n3j19J62M5j9L5p5k8O7j34J97m4k5J0k7j05K66K9l6
$$ -105 -64 -30 -77 -175 -231 156 -19 -72 -191 -29 16 -3 32 -43 -71 -4 -138 59 15 -10 0 -27 -132 134 163 127
5739A27r0o0mJ71k88J10j44l6J84n8l5lL26p0l06J44J14l89M68l60L07q2m88O73
$$ 127 37 -23 -27 144 -144 -34 -178 -214 -30 -88 -123 -126 200 130 -176 -32 82 -307 161 -199 108 26 -462 211
5763B11j15j75P1J53k15J43l44L34J52k06j31J3j5J40N07n26J06k19o7J09J04
$$ 211 96 -79 -8 145 -70 73 -271 63 215 9 -122 -109 -124 16 523 -3 103 -116 -183 -74 30
5784C0j60M19n51K44j56J59j61K31P4k20J76j97L41j93j52K54k64O9oJ90J94n18
$$ 30 -130 289 -262 -18 -174 -15 -176 55 129 -91 85 -112 229 36 -116 138 -126 -57 -63 127 321 -197
5806a97K71J64k4J74l93j77j43N9P89o69L47l42k0R0J75k2J70l07J6J30o0Q9j98
$$ -197 74 238 214 388 -5 -182 -325 -266 523 -146 201 -141 -161 -71 104 82 252 -55 -39 91 31 120 -78
5829g8K21j80j37L9M9K13j51K9j20L3J87M2n2j29%J01n2m6k9J86r7j53k8J20L23
$$ -78 143 -37 -174 -135 -86 127 -24 5 -115 -82 105 147 95 -34 -34 67 15 -31 -60 126 29 -124 -152 -32 291
5854B91j67m8p2J25k52KJ67kNp7J17k61K35j99K12l13M12n5j42k2Q4j90J22J0
$$ 291 124 76 4 129 -123 -121 46 44 49 -28 89 -172 63 -136 76 -237 175 120 -22 -44 40 -150 -28 -18
5878a8J94k8k36n1J55j5n4K3K13r0j83P0r0j03J03J66N2J1j30j19J87o5J47p1
$$ -18 176 148 -88 -139 16 1 -53 -30 183 93 -90 -20 -110 -213 -110 56 108 119 -11 -130 57 -8 139 68
5902F8m7p9R1n8L8K7q9k0K26l69J60j17J56j79J10j58L11Pj26JQ2l4k6L1j65K7
$$ 68 21 -58 33 -25 13 40 -49 -69 157 -212 -52 -169 -13 -192 -82 -240 71 78 -48 -47 35 1 -25 6 -159 -132
5928a32K63N7j84o0K19k56J35NJ1p6K4k4l8q6lR8l6J48k23L04k91J99k0p0qr8
$$ -132 131 188 4 -56 163 -93 42 47 58 -18 6 -18 -56 -142 -145 -47 -83 65 -158 146 -145 54 34 -36 -44 -142
5954a42M0L5J81%k32l6J7m6K40k47K67j94J85m5j39r6L27O2k15o0p3K54n8j38
$$ -142 -102 -67 114 114 -118 -154 -137 -183 57 -190 77 -117 68 23 -116 -212 115 177 -38 -98 -171 83 25 -113
5978a13m0Q7K36j7j22l9j07j8L7O6m2j01L25m02L37n3k0J80j26q2J51j65QR9p5
$$ -113 -153 -66 170 153 31 -8 -115 -133 -96 -30 -72 -173 152 -250 87 34 14 194 68 -14 137 -28 -20 79 4
6003Dk1p7p0M6M7k3L0o5J54m3K14k20L1J42k34K29N1k60L40k56j14J06j49Q0R1
$$ 4 -17 -94 -164 -118 -71 -94 -64 -129 25 -18 196 -24 7 149 -85 144 195 -65 275 19 -95 11 -138 -58 33
6028C3PQ5j47J39j84q0l9K05N6j74j5J93J04k89PO1K67lm54J81o8J98k96M83k79
$$ 33 40 125 -22 117 -67 -147 -186 19 75 -99 -114 79 183 -106 -99 -38 229 226 -228 -47 -115 83 -213 270 -9
6053iP3k42L75j66K16l04m52N08K09m1j22P7j79K48q4R4l84N33l65q7J3L88k51
$$ -9 64 -178 197 31 247 -57 -509 -1 208 167 45 122 -57 191 107 201 -183 350 -15 -102 -89 299 48
6076D8j97K09k52Q1p5K20l8m4q2J17J33P0M42q62K33j88K04j68J53N1m5j52K29
$$ 48 -149 60 -192 -111 -186 34 -4 -48 -130 -13 120 190 632 -230 3 -185 19 -149 4 55 10 -142 87
6099H7j02N6k22J28J22j23J37l34J51L5J06k34L26n1q2N8k27KQ7J56j31j25K33
$$ 87 -15 41 -181 -53 69 -54 83 -251 -100 -65 41 -193 133 82 0 58 -169 -167 -80 76 -55 -180 53
6122E3J16j30k7j32K88J37m03j26j95M55K61r34M30K62j53K33j68J12M4J2k35
$$ 53 169 39 12 -120 168 305 -98 -224 -419 36 297 -637 -207 55 -98 135 -33 79 123 135 -100
6143a00j06L23j58J01j78M04m29K75m0n6Q9m8j96J96KJ33l98P4K44j92J24k39
$$ -100 -206 117 -41 60 -118 286 -143 132 92 36 125 77 -119 77 79 212 -186 -112 132 -60 64 -175
6165a75J89k42K15J10n6o1L93r46K31M13l03j21K92N4k5N5k1J6J93k32j48K45
$$ -175 14 -228 -13 97 41 -20 373 -573 -342 71 -232 -353 -61 -7 -32 23 2 18 211 -21 -169 76
6187G6j61M46l47M5%r3J29k13L30k88K05l29J25K6K7L78k29n9o02M02J00j00p
$$ 76 -85 361 14 59 59 -34 95 -118 212 -76 129 -200 -75 -49 -22 356 127 68 -534 -132 -32 -132 -139
6210a39J14J49n2m98N46n91O12k11j3M7j94M8j93N20l23n0K25j6N2j13J46j64
$$ -139 -25 124 72 -426 120 -471 141 -70 -83 -36 -230 -182 -375 145 -178 -228 -3 -19 33 -80 66 -98
6232i8k5J17Q0j77P7J09k13K94j45J64j47K1j55M34l64Q1J69n63L60j31N61q18
$$ -98 -123 -6 74 -103 -26 83 -130 164 19 183 36 57 -98 336 -28 53 222 -341 19 -112 449 -369
6254c69J72N02m26N59p27M50R2n6M3K7k74P8K12m88Q5oL75j00nmm4K29m52k6K88
$$ -369 -197 305 -121 438 -289 161 253 197 240 267 -7 71 283 -205 -120 -126 249 149 144 140 96 325 -127 -153 135
6279A35j30O4j12o9K00j89j15J67K8J78q9o1m9M7j76J39j24o3J78k1LL9J07o3
$$ 135 5 69 -43 -112 88 -101 -216 -49 -21 157 68 7 -42 5 -171 -32 -156 -219 -41 -62 -59 -20 87 24
6303B4J02k32k6J09R3j08J93r6k58K44j80P7J20L6k31R3J14k9j34k10N99j72l6
$$ 24 126 -106 -132 -23 70 -38 155 59 -199 45 -135 -58 62 98 -133 -40 74 45 -89 -299 300 128 92
6326I2m5K9l34K31K15k20J75l5l81L40J76l28j1L43p30K50K2N2J77k98M23j69
$$ 92 47 76 -258 -27 188 -32 143 108 -273 67 243 -85 -96 247 -483 -233 -211 -159 18 -280 143 -26
6348b6K92l70J16o6p6m3M31j30j9m3J97M7j58q55J50P1K80L40K96q83L81n12N24
$$ -26 266 -104 12 -54 -130 -173 258 128 109 66 263 310 152 -703 -553 -482 -202 138 434 -449 -68 -580 -56
6371e6o4J94J014j442L35O73q53o97K46L74P60r65O94q60M08k55J686j495K50
$$ -56 -120 74 1088 -354 -19 654 -199 -896 -650 -276 484 -481 213 -647 -239 -494 1192 -303 -53
6390e3K6m2m5J13l01j92N41j54K93m66L32M24n40j4K59k85k31M56j94M8LK48L3
$$ -53 -27 -69 -114 -1 -302 -494 47 -107 186 -280 52 476 -64 -78 181 -104 -335 121 -73 -25 -22 226 259
6413B59j6l26l44M25L77j41l70L31m81J23L30l27j4M52P3l80l4J94j19K8J74p59
$$ 259 243 -83 -427 -2 375 234 -136 195 -286 -163 167 -160 -174 278 351 -29 -63 131 12 40 214 -545
6435e45J86J37N3N5P5P1j67L47n5Q2j2k63J26J69l78O8J53j53n0O8Kj28N7J59
$$ -545 -359 -222 -169 -114 -39 32 -135 212 157 239 227 -36 90 259 -119 -51 102 -51 -101 -33 -31 -159 -102 57
6459E7j41qJ26n0N1r6J26p6j04jK7rJ24r3K7j02M68l82R6p1r3K57p0J00k85L5
$$ 57 -84 -92 34 -16 35 -61 65 -11 -115 -116 -89 -98 26 -67 -40 -142 326 -56 40 -31 -124 133 63 163 -122 -87
6485h7L19P7j98j02K7m45M39j43J85j00j71K79o8q3M4o7Po6Q9N9j28K40j85J70
$$ -87 232 309 111 9 36 -409 30 -113 72 -28 -199 80 12 -71 -27 -94 -87 -153 -64 -5 -133 107 -78 92
6509I2j45nk9K31j21j95K17j03K82k46r7L35n9J6m97J70J28k9J00J26j14R5k43
$$ 92 -53 -58 -87 144 23 -172 45 -58 224 -22 -119 216 157 173 -324 -154 -26 -55 45 171 57 152 -91
6532i1r9l26O60o4j6k07K67m39J75j3N42k90j54K49j31K60n94J10O67n48L71q22
$$ -91 -190 -516 144 80 64 -143 124 -315 -140 -153 389 99 -55 194 63 323 -271 -161 506 -42 329 -493
6554d93O64k42Q8J6J82l67K70j07j88L9J59m64N50M37p93M03m12m2JM47m62K49
$$ -493 171 -71 17 33 215 -152 118 11 -177 -138 21 -443 107 544 -249 154 -258 -300 -299 148 -314 -65
6576f5r7L85q3O1m17j36K10J16l3L86l40L23m99K80p7j66N4L31l67q2K50R5J72
$$ -65 -162 223 140 201 -216 -352 -142 -26 -59 327 -13 310 -189 91 14 -152 -98 233 -134 -216 34 129 301
6599C01k51J83k66on0M3Q6j4k49O6K23n25M68P7k83L8J07K01K43l07m4O4j29J53
$$ 301 50 233 -33 -39 -89 -46 40 26 -223 -157 66 -459 9 86 -197 -159 -52 149 392 85 41 105 -24 129
6623A29j31k72K97r2P6L51o52N72k55r7j37L99j19J0j34J40Pq2l22M46j02n0K99
$$ 129 -2 -274 23 -69 7 358 -294 278 23 -74 -211 188 69 79 -55 85 92 10 -312 134 32 -18 281
6646B81k92K72l36l0K81l32N07n27J27l3kK31R7k71N7m2K5K45n16L16k11K68j49
$$ 281 -11 261 -75 -105 176 -156 351 -176 -49 -82 -84 147 244 -27 30 -12 13 258 -258 58 -153 115 -34
6669c4J88k54L14j08m7r3p3M3k18J62J30M7j75J29j02K6KM8P4J9o3m0OJ38j8k10
$$ -34 154 -100 214 106 59 -34 -107 -64 -282 -120 10 57 -118 11 -91 -65 -63 -15 59 78 15 -25 -19 119 101 -109
6695a09L1kR4p8K12k51K45o0k26N2J42j76K45j16j67P5l83N10J71k19j9Q9m0j6
$$ -109 -78 -80 14 -64 148 -103 142 82 -144 -92 50 -126 119 3 -164 -89 -472 38 209 -10 -29 60 20 4
6719Dk2q5K55j65k4q5K51k95J5J21J16J05j79J30j69O7L0m1j03J00p2K24k87J79
$$ 4 -18 -103 152 -13 -37 -122 129 -166 -151 -30 86 191 12 142 -27 40 70 29 -74 26 -46 178 -109 70
6743G0n4k5K80n01M27j69p6O6j04J13j57m2L58l24K70l4p7k97J23K35%l69L06
$$ 70 16 -9 271 -230 197 28 -48 18 -86 27 -130 -172 186 -138 132 98 21 -276 -153 82 82 -287 19
6766A9j03l7J37K1o1j64J03k97M40j16O2j8J44j80K50q8r6O8q7M7k12J94J67m10
$$ 19 -84 -121 16 37 -24 -188 -85 -382 58 -58 4 -14 130 -50 200 112 16 84 -3 44 -168 26 193 -217
6790b17J14Q3J41K4r2p1nk4n1N5K23l81L49j38o0J55k41J63q8N9J94Mk86J98M8
$$ -217 -103 -20 121 145 53 -18 -23 -47 -98 -43 180 -201 148 10 -50 105 -136 27 -61 -2 192 196 -90 108 156
6815A56k27L0J47k51J52o2P0q7P8lq2j19J92J11j84L20j10m1j36qn9L1J22j7r6
$$ 156 -71 -41 106 -145 7 -55 15 -72 6 3 -79 -198 -6 105 -79 241 131 90 -46 -54 -113 -82 40 23 -73
6840g3P8J7mkr0K86k67J15k11J58p2J16j9j9J36k24J93k34J02J73k3p0j08J47
$$ -73 5 22 18 16 -74 212 -55 60 -151 7 -65 51 32 13 149 -75 118 -116 -14 159 136 66 -42 105
6864A05p6J0K0J83l19J63M6k77R0q5J84j70P1O7r2K8j06J75N7r1j1o6p0L8J71
$$ 105 29 39 59 242 -77 86 132 -145 -55 -140 44 -126 -55 12 -80 -52 -158 17 74 -17 -28 -94 -164 -126 45
6889D5M49m54k86J0P34k40l02J06k8o0J73k32P3M9n7j37L1L09j75J7J29n9J4K7
$$ 45 494 40 -246 -236 498 258 -44 62 34 -26 147 -85 -12 37 -20 -157 -126 183 8 25 154 95 109 136
6913A36j5j50M5l3j26L4J08K7R6m7p2k0J64k53J66MM8p7j21Q4K9m8J74P5k27l46
$$ 136 121 -29 16 -17 -143 -109 -1 26 122 75 3 -17 147 -106 60 64 112 35 -86 -2 27 -21 153 228 1 -345
6939c45L55mj34J43k4J95j36j43RJ63k54J61m2j14m4L16qj21J6J51k84J17J74
$$ -345 10 6 -128 15 -9 186 50 -93 -84 79 -175 -14 -56 -170 -214 102 94 -27 -11 140 -144 -27 147
6962A47m00L32J66j55j34K02k13J36l1n2J9MKj36K11M5k42J21r6N7j07m6n6K53
$$ 147 -253 79 245 90 -44 158 -55 81 50 -2 17 21 23 -113 98 143 -99 22 -74 -17 -124 -170 -226 27
6986B7%r2J56j75l9J06k29J46j35J28Q9j41J26J55j00j5k15J65J06J4k7Kk53K56
$$ 27 27 -65 91 -84 -123 -17 -246 -100 -235 -107 -18 -159 -33 122 22 7 -208 -43 63 77 50 52 -201 55
7010E5j16k7M1QJ15k36J17J97k74L99k09l08L09J79k04l9j56K74j17R1J12m82
$$ 55 -61 -88 -47 -39 76 -160 -43 154 -120 279 70 -238 71 250 46 7 -149 125 8 99 211 -271
7032b71J20j59K39J87j36p9L36j58Q1l76K5K63L8l13J57j9J38j6k46J02N00l90
$$ -271 -151 -310 -71 116 -20 -99 237 79 160 -216 -191 72 110 -203 -46 -65 73 57 -189 -87 413 23
7054B3p6M30p48O61j209J071l91P1l6N37m45L82j76J4l2O5P5m36N17m33R2%J21
$$ 23 -53 377 -371 290 -919 152 -239 -168 -204 333 -112 270 94 108 76 141 216 -220 297 -136 -44 -44 77
7077G7K72m96Q6R6Jj89O03l91L4n0k02N3K94j45J47K4l70J31m2RM3O4J2l6l0L03
$$ 77 349 -147 -61 35 36 -153 450 59 93 43 -159 -106 188 43 190 214 -156 -25 -67 -58 -15 49 61 25 -5 298
7103B98l71k36K72J10N54p06n0l8K40j19K66M66p36P8k64L40O8o6k77k74K54L57
$$ 298 -73 -309 -37 73 627 -79 -129 -167 73 -46 220 686 -50 28 -236 104 172 106 -171 -445 -191 166
7125A66l47K72L56l08k09n01R82l88l95l04P18l15j40L32J12R2k21J44p89J504
$$ 166 -181 91 447 139 -70 -571 411 23 -372 -676 42 -273 -413 -81 31 123 -98 46 -743 761
7145G61j377Q51N3O2j79j57l20K50L3K08m79j95J57N73N2J30k91m61P3o26J815
$$ 761 -616 235 288 350 171 14 -306 -56 -23 185 -294 -489 -332 241 293 423 132 -329 -256 -882 933
7166I33j240R15l94o45J007j24Kj658Q94o25K67R13J6q80M64m44R26K86n43r14
$$ 933 -307 608 214 -431 576 452 454 -1204 -310 -935 -668 245 261 -619 -155 -599 327 613 70 -844
7186h44J87J057j006Q65p57K9L81L21k60K45q01J75O65p22R95j430L53M44L27
$$ -844 -657 400 -606 259 -498 -469 -88 233 -27 218 -583 -408 257 -465 530 -900 -547 -103 224
7205B24J55m03J36p17J194n90k7k16R1K32l94M19K5j49N25m16l76JM28k81J8N8
$$ 224 379 -24 112 -605 589 -1 -28 -244 -153 79 -315 104 129 -20 505 89 -287 -286 142 -139 -121 -63
7227f3K19p3o3j51J23r1J49j79L01q8k52K64l03K62K37l37OR8k82K23J44m05L04
$$ -63 156 83 20 -131 -8 -99 50 -129 172 84 -168 96 -207 55 292 -45 -39 59 -223 0 144 -261 43
7250D3k78J07K42n96Q66p07L52k0J00k37M21m89L43j30k83O4q9k02K39M52k8j34
$$ 43 -235 -128 114 -482 384 -323 29 9 109 -128 293 -196 147 17 -266 -202 -291 -493 -254 198 170 36
7272C6k7J55k66J65j14p6k76O00L0m72K41l2q1J06l75J36K29J80J07m45M34k49
$$ 36 9 164 -102 63 -51 -127 -403 197 227 -245 -4 -36 -117 -11 -386 -250 -21 159 266 -179 255 6
7294Fn84J60M8M8K87K61n43P94l79l30j30M18o26k46J394p41l38K53J82j07M5
$$ 6 -578 -418 -370 -322 -35 226 -317 477 98 -232 -362 56 -570 -816 578 -163 -501 -248 -66 -173 -128
7315a28J49J75J3k29M5K16j20o4j81K02j43K83l25J76r3R8k01L4k4J24l7Jl2J66
$$ -128 21 196 209 -20 25 241 121 57 -124 78 -65 218 -107 69 -24 74 -127 -93 -117 7 -30 -29 -61 105
7339A05l09J74p0oL95l74j30J11J33k76J9L02n3r5l4Ql67O57n97RO09j4Q9j25
$$ 105 -204 -30 -100 -106 289 -85 -215 -104 29 -247 -228 74 21 -74 -108 -100 -467 190 -407 -398 211 197 286 161
7363A61l83R15j220Q96k54l4N37n41N9j11R6m75L32J9J2J85j37j3j54n6J27k56
$$ 161 -222 693 -527 369 115 81 618 77 136 25 121 -354 -22 -3 9 194 57 44 -110 -166 -39 -295
7385b95O67n4k63J87Lm58k0N84q38N69K92q24o3M01P0K19J70m59k69J11n4M37
$$ -295 372 318 55 242 245 -213 -233 351 -487 82 374 -450 -513 -112 -42 177 347 -112 -381 -270 -324 113
7407A13j60M4K01l46l8K09O78l16q15O67l91LJ3R5nQ7k25j06M04k07J13J52j92
$$ 113 -47 -3 198 -148 -186 23 701 385 -430 237 -154 -151 -138 -43 -48 39 -186 -292 112 -95 18 170 -22
7430b2j00N6j05N95p15O12K33n69o3j89N29l35p2K29J6j11J40k02J38mK48m23
$$ -22 -122 -66 -171 424 -291 321 554 -15 -78 -267 262 -73 -145 84 100 -11 129 -73 65 61 309 -114
7452a14J63k60J98J33n1N55m15j54j38j56j08N63j79K76p0l08M10p10j49O85M86
$$ -114 49 -211 -13 120 69 624 209 55 -83 -239 -347 216 37 313 243 -65 345 -365 -514 171 657
7473F57n69n75K48L23L20M42r05J8R2K48k40n27Q60k03k15K10K72p31n76P89j69
$$ 657 88 -487 -239 84 404 846 -59 -41 51 299 59 -468 392 189 -26 184 456 -275 -851 -62 -231
7494b31K79J8k9j04L52k59m99L58l82L46m71K44O70Q5q90L18R4M35k90N8j9M59
$$ -231 48 66 37 -67 285 26 -473 -115 -497 -151 -622 -378 292 377 -513 -195 -101 334 44 102 83 542
7516E42o79N7k77L87o80M50k9L56o9k56k91J80L43j78J11l41P13k06q5k42J60
$$ 542 -137 -80 -357 30 -650 -200 -229 127 58 -198 -489 -309 34 -144 -33 -374 339 133 48 -194 -34
7537c4N3l0p8Q8MJ07J33J1q5r2L46k93j8k66M79m89m16Q60k12m61K21O4l1M34
$$ -34 19 -11 -89 -1 3 110 243 254 169 77 423 130 112 -154 325 -164 -580 280 68 -393 -172 -108 -139 295
7561B95m32L63o68O92Q3k65J91l51j31J17J07p2K87l60J96k02No25J051k14j2
$$ 295 -137 226 -442 250 333 68 259 -92 -223 -106 1 -71 216 -144 52 -150 -145 -770 281 67 55
7582E5j28K50l08J85j89K7K29J47n95M99j23o5K40K3m17R7j02L13k43N28n91Q1
$$ 55 -73 177 -131 54 -135 -108 121 268 -327 172 49 -16 224 247 -170 -73 -175 138 -105 423 -168 -87
7604h7L08l39L24m52L80k2l62J90K68j54j98k11P07m31L39l10k59L42r4J68k3
$$ -87 221 -118 206 -246 134 112 -250 -60 208 54 -144 -355 352 -79 260 -50 -309 33 -61 107 84
7625H4k74M47p2n17J78J14J21M9k78K4j01K26J62p9l19K36k74L32m1n03N55k1
$$ 84 -190 257 185 -332 -154 -40 81 130 -148 -124 -225 1 163 84 -235 1 -273 59 18 -485 70 49
7647D9J94j73j66q6L36k68N59Q3n28m8K43L21n15m28N88K74p73M82k41j0L26n63
$$ 49 243 70 -96 -182 154 -114 445 528 0 -48 195 516 1 -427 161 435 -338 144 -97 -107 219 -344
7669c44k3N49j82k66P71m85j8m34p3J15L96M51M34j455Q4K59j48N93p3L11n43
$$ -344 -367 182 0 -266 505 20 2 -432 -505 -390 6 457 891 -564 -480 -221 -369 224 151 462 -81
7690h1l65J32k1N05J62m71L06l84k92K93L17l52Q04j038l84P17K37l82L04L91
$$ -81 -446 -314 -335 170 332 -139 167 -217 -509 -216 101 -251 553 -485 -869 -152 85 -297 7 398
7710C98p27K13R21j248K92k03Q12q65P03j79k42J60j33k44P0J44L21k05R0J52
$$ 398 -329 -116 805 -443 -151 -354 458 -407 296 117 -125 35 -98 -342 -272 -128 193 -12 78 230
7730B30j30k77M92m16k51K1k28N01K50O0NK97k69r2k47k77M91j02j7n0n5N5K67
$$ 230 100 -177 315 -101 -352 -331 -559 -58 192 252 257 554 285 193 -54 -331 160 58 41 -9 -64 -9 258
7753B58Q2n62J32K50o50O94k34o2P5o5k72L75Q3p6L9Mq2L37n98Q78n55j56M9m02
$$ 258 340 -222 -90 160 -490 204 -30 -92 -17 -82 -354 21 104 28 67 71 -11 326 -272 606 51 -105 -56 -458
7777d58M39M36K18k91q51M08j44K09m9l75O18k07j29J105K5q90p27N45q1J06P28
$$ -458 -19 417 635 344 -507 -99 -243 -34 -83 -458 160 -47 -176 929 954 64 -663 -118 -199 -93 635
7798F35q35O33l78k21J92j63M31k94n4p02R62J97p92O09k77R8j49L7J83j14km4
$$ 635 -200 433 55 -166 26 -137 294 0 -54 -756 206 403 -389 220 -57 41 -108 -71 112 -2 -4 -48
7820d8J05m72M99N7m8j23l55K21O6K70l72K75j09K23R6p8r7m7k71J02K24j93K21
$$ -48 57 -415 84 141 93 -30 -385 -164 -98 172 -200 75 -34 189 285 207 110 63 -208 -106 118 -75 146
7843A46l80L52j81K68n2M43o52M6j45l10O61j24q0o9K58j94k28k68J44M30k99
$$ 146 -234 118 -63 205 153 596 -56 -10 -155 -465 196 72 -8 -77 181 -13 -241 -509 -365 65 -234
7864b34k37K65N41j33o52M14J68k83M38l31L91n78q04Q58k23O53k22j54j86L78
$$ -234 -471 -206 335 202 -450 -36 132 -151 287 -44 347 -231 -1035 -177 -400 253 31 -123 -309 69
7884F9R2k26r2k46M08l39M84l20K49q5l37N95j07k16P7N16n39Q0J73k94K3k31
$$ 69 161 -65 -157 -403 5 -334 150 -170 79 -6 -343 252 145 -71 6 522 -17 63 236 -58 -35 -266
7906b66M9N62m57j93N93o36K07k44J01J50M08n31J78mn07O42j93R8K20l60K86
$$ -266 -217 345 -112 -305 288 -348 -141 -385 -284 -134 274 -257 -79 -83 -590 52 -141 -43 177 -183 103
7927A03j61M7M8L3j1J6N3k0o2j40K61j97j35K24r9M2O8p2m4r5J38l1j0K55j81
$$ 103 -58 -11 37 70 59 75 128 108 46 -94 167 -30 -165 59 -40 2 70 -2 -46 -141 -3 -34 -44 211 30
7952C0k1o9kJ95j91p1N8J03n8J2M8j36l9K24r7J34j93q9J28K36k40j29J06K8M8
$$ 30 9 -60 -62 133 -58 -129 -71 32 -26 -14 34 -102 -141 83 -14 120 -73 -162 -34 202 -38 -167 -61 -33 15
7977A5P9r7J93o3j57o85R77j67K25J88q66J86l1P70n12L81j91n48O97m8p50O17
$$ 15 94 -3 190 127 -30 -715 262 95 320 508 -358 -172 -203 567 55 436 245 -303 394 346 -404 213
7999B13j96P9l4j88N45k76j72l1M25m87K46l5j15P5J12k05OK04k32r7o0K53j47
$$ 213 17 96 62 -126 419 143 -29 -60 365 -122 124 89 -26 49 161 -44 -38 166 -66 -163 -223 30 -117
8022a17L69l16J63r4q6J52k16K71Q1m35J05J11q2l0K4k17M90j69k8j33J80L0J29
$$ -117 252 -64 99 5 -81 71 -145 126 207 -228 -123 -12 -94 -124 -100 -317 173 4 -24 -157 23 53 182
8045A82j73J67m95K53L25J38m75J78m2O7l18N27N1l16L37n21R6M9j92K8J80K3
$$ 182 9 176 -319 -66 259 397 -78 100 58 125 -193 334 385 69 406 -115 -19 30 -162 -134 46 69
8067F9o1J12j11J22k13J47J26m58L58l21M71l67J82k96L30r1O7k07K59m06L50
$$ 69 8 120 9 131 -82 65 191 -267 91 -230 241 -126 56 -240 90 -1 66 -141 118 -288 62
8088F2k45K07Q9j31o4q6l8M14o18M12j70K0L74j37j14k10J65M02k12m32J36J42
$$ 62 -183 24 113 -18 -82 -168 -206 208 -410 2 -168 -148 226 89 -25 -235 -70 332 120 -312 -176 -34
8110c4L66j75r5J61k17K44j09J27k03k07K43J5p68O04Q4m4R6J38m1j13R9l0j84
$$ -34 332 157 62 223 6 250 141 268 65 -142 101 116 -652 -48 36 -8 88 226 185 72 171 141 -43
8133d3Q4Lk59K90k32J73J12j78j6K71L8o27M21j5n67L37P0L40k67Jm7J33j34J14
$$ -43 41 44 -215 75 -157 16 128 -50 -66 205 243 -384 37 22 -545 -208 -138 202 -65 -64 -111 22 -112 2
8157Bk9o8K09j30O4j09Q9L7J10j86k0K09j07J96k97j50J21p8J79r6j29p9N75j49
$$ 2 -27 -95 114 -16 48 -61 28 65 175 -11 -31 178 71 267 -30 -180 -59 -137 42 -54 -183 -262 313 164
8181A64k14K4l1NK28n8j21M6l21K71
$$ 164 -50 -26 -57 -52 176 118 -3 43 -278 -7
8191g
$$ Imaginary data points
##PAGE= N=2
##DATA TABLE= (X++(I..I)), XYDATA
0@%%%%%%%%%%%jRj6J6j6K3l1L2m0N5o3P1q6J02j18J39j63J89k19K50k83L22l65
$$ 0 0 0 0 0 0 0 0 0 0 0 0 -1 8 -8 8 -8 15 -16 16 -24 31 -32 39 -47 55 -63 76 -87 102 -117 133 -150 172 -193
34a93M11m64N23n88O56p31Q15r05J006j115J233j365J508j663J834k019K224k450
$$ -193 218 -246 277 -311 345 -386 429 -476 530 -585 648 -717 791 -872 962 -1057 1167 -1283
52a283K698k978L289l636M029m480N001n609O332p209Q295r688J1549j4168J8160
$$ -1283 1415 -1563 1726 -1910 2119 -2361 2640 -2969 3363 -3846 4449 -5239 6310 -7858 10302
67A0302k5066M0354j36162O0912K26580j47875j58202J1470J67152k4008m1057
$$ 10302 -14764 25590 -110572 -49660 176920 29045 -129157 -117687 49465 25457 -15600
78a5600j5162K453j7129J8024Q0860l2118q8370m098P0186N6427p5888k1910J6143
$$ -15600 -30762 -28309 -45438 -27414 53446 21328 -67042 -71140 -954 55473 -20415 -42325 -26182
91b6182J5912k491Q311K4366n8990j4352O2866L7413n2856o6040P4170L8194m3204
$$ -26182 -10270 -12761 -4450 19916 -39074 -53426 9440 46853 -6003 -72043 2127 40321 -2883
104b883l0101L5550K6893n5236R535L6796j3243l4252J7961N2599n4361l9282
$$ -2883 -32984 2566 29459 -25777 -16242 20554 7311 -26941 -8980 43619 -10742 -50024
116e0024N3966N6016m9192q4845O4714Q5055l5734r7072J4813J04637j3125p1017
$$ -50024 3942 59958 10766 -74079 -9365 75690 39956 -57116 -42303 62334 49209 -21808
128b1808o521N9288K229n1860K1467K5407j7043k9271K0681K9825k7948n363J0837
$$ -21808 -28329 30959 33188 -18672 2795 28202 11159 -18112 2569 32394 4446 -917 9920
141I920J564j3199J3118K9318l5815k5617K8318M2063j9736n1324J9458L1819
$$ 9920 11484 -1715 11403 40721 4906 -20711 7607 49670 29934 -21390 -1932 29887
153B9887n135k9814J0457K6110k8699j7322K5575L0612k9279l9722K9314L0441
$$ 29887 24752 -5062 5395 31505 2806 -14516 11059 41671 12392 -27330 1984 32425
165C2425o577k4163M877K661j5574K5990K4874k4728n3947J5744P1218l263o4155
$$ 32425 25848 1685 6562 9223 -6351 19639 44513 19785 -34162 -18418 52800 49537 -14618
178a4618k8056N2325L8100k9629l2528l86K3741M881J587j926j9287k148J6252
$$ -14618 -42674 9651 47751 18122 -14406 -14792 8949 13830 15417 13491 -5796 -7944 8308
191H308J8208j3372k1800O989J1034L644n746J24j1341j1197K1922J5664j5010
$$ 8308 26516 13144 -8656 -1667 9367 13011 7265 7389 -3952 -15149 6773 22437 7427
204G427l2272R128L7604k819l0638r481K7098J2012j4806r809J965Q883j348K971
$$ 7427 -24845 -15717 21887 19068 -11570 -21051 6047 18059 3253 -6556 -4591 4292 2944 5915
218E915k469j4975L687J5606K951k3299p906K2446R825j7688j5463J8296J0940
$$ 5915 3446 -11529 -7842 7764 10715 -12584 -20490 1956 11781 -5907 -21370 -3074 7866
231G866j2907n536Q526O651j1564k381J3217Q79j1577n990J2960L944q880n920
$$ 7866 -5041 -10577 -2051 4600 -6964 -9345 3872 4751 -6826 -12816 144 4088 -4792 -10712
245a0712J743N529k073J981m55r641P03J1530P143j4485q718J3500J1386p169
$$ -10712 -8969 -3440 -5513 -3532 -3987 -13628 -12925 -1395 5748 -8737 -17455 -3955 7431 262
259B62j3483O563Q347l004m719J169K921n083r60L477R38k939k802L341L47M48
$$ 262 -13221 -6658 1689 -1315 -6034 -4865 -1944 -7027 -7987 -4510 -3572 -6511 -9313 -5972 -5625 -5177
275e177K282j567k812P59R250O62r203l518Q771P843r752p496O005O384l473n966
$$ -5177 -2895 -4462 -7274 -6515 2735 3397 -5806 -9324 -553 7290 -2462 -9958 -3953 2431 -1042 -7008
291g008J880J399j170J924K189k852m325O148N863m171n649L548Q246l858n652
$$ -7008 -5128 -3729 -4899 -2975 -786 -3638 -7963 -1815 4048 -123 -5772 -2224 6022 2164 -3488
306c488L300M337l652n661N079M546n719o528N728P504o204o220M264O633p11
$$ -3488 -188 4149 497 -5164 -85 4461 -1258 -7786 -2058 5446 -758 -6978 -2714 3919 3208
321C208n450K122L434j098m19K678m56m041J865L288q42n065j587O055j12m521
$$ 3208 -2242 -120 3314 2216 1797 4475 4019 -22 1843 5131 4289 -776 -2363 3692 3580 -941
337i41j242L174J817k542p75J965K179k112L22K978p73o94l96R44J114j270r99
$$ -941 -2183 991 2808 266 -509 1456 3635 1523 1845 4823 4050 3356 2960 3904 5018 3748 2749
354B749j060m15K144M21m518j996M394K298j950l038M22L744P13n95r5r40n23
$$ 2749 1689 1274 3418 3839 -679 -2675 1719 4017 2067 -971 -549 3195 3908 3313 3218 2278 1755
371A755L031J882l039l215k98M455J144n584k016K358J443k041m80J965r11k305
$$ 1755 4786 6668 3629 414 116 4571 5715 131 -1885 473 1916 -125 -605 1360 449 -1856
387a856J647N503j682n207J504M846L53l062j410J722n56j055P2O44m44k888m19
$$ -1856 -209 5294 3612 -1595 -91 4755 5108 2046 636 2358 1802 747 819 1463 1019 -1869 -2288
404b288K838J536k864k651J155K408J554J58m77k601nN182K629n098o090L583
$$ -2288 550 2086 -778 -3429 -2274 134 1688 1846 1369 -1232 -1237 3945 6574 1476 -4614 -1031
420a031N564p7n902l262q6M405L296l852l202j937M150L891r1k635l827J963O379
$$ -1031 4533 4456 -1446 -4708 -4794 -389 2907 -945 -4147 -6084 -1934 1957 1866 -769 -4596 -2633 3746
437C746J509n339l861K411M419j250k252j202j27p50P28R99k4j360k709o60N899
$$ 3746 5255 -84 -3945 -1534 2885 1635 -617 -1819 -1946 -2696 -1968 -969 -993 -2353 -5062 -5722 177
454A77K028m479j893L071K527j269J755J004n346n279O842R421l945j2344l242
$$ 177 2205 -2274 -4167 -1096 1431 162 1917 2921 -2425 -7704 -862 8559 4614 -7730 -10972
469a0972R451R249m534j2552j640J0658O313m167o456k37J931L942O403j612j0890
$$ -10972 -1521 7728 3194 -9358 -10998 -340 5973 1806 -4650 -4887 -2956 986 7389 5777 -5113
484e113m672J0909R142n467j1134k506Q160O651l943q438j590P198M925l690k575
$$ -5113 -9785 1124 10266 4799 -6335 -8841 -681 5970 2027 -6411 -8001 -803 4122 432 -2143
499b143k56j338K129O062Q15n606k642L919L554l810k470J203J770j168j493o52
$$ -2143 -2399 -3737 -1608 4454 5269 -337 -2979 940 4494 684 -1786 -583 1187 19 -1474 -2126
515b126K173q04m347p45Q053N239p516q561L855J0401K148o305n036J938O040
$$ -2126 47 -757 -5104 -5849 2204 7443 -73 -8634 -4779 5622 7770 1465 -3571 -1633 4407
530D407K435n588m982R25L784K087l9k863o025j870Q600P951n700r958N55R558
$$ 4407 6842 1254 -3728 -2803 981 3068 3029 166 -5859 -7729 871 8822 3122 -6836 -6281 3277
546C277N293o130p563K615Q441J969n818m447J176J684J3J397K98k917k944J955
$$ 3277 8570 2440 -5123 -2508 5933 7902 2084 -2363 -1187 497 510 1907 2205 -712 -3656 -1701
562a701K711p78j324O19O85L95j67J022K116j108m631L16P710K496q567p989N574
$$ -1701 1010 232 -1092 -473 212 607 440 1462 3578 2470 -2161 -1845 5865 8361 -206 -8195 -2621
579b621J0453p63j0798n226O509P279k517n243M29K188k75K108M225k910r329
$$ -2621 7832 7069 -3729 -8955 -2446 4833 2316 -2927 -2498 -310 -585 1523 5748 2838 -6491
594f491J683J3595L590j3356r442Q088J0887j906j0686l951O589O448l194m554
$$ -6491 -4808 8787 12377 -979 -10421 -2333 8554 6648 -4038 -7989 -1400 5048 1854 -2700
608b700j676J908L872J648n09m902k593O736M297l188m856J088K783o46j439o12
$$ -2700 -4376 -2468 1404 3052 2543 -2359 -4952 1784 6081 2893 -1963 -875 1908 1262 -177 -789
624g89j23m09J859k71l009M42J626k049J516L422m6l262n74K817L18j558J600
$$ -789 -912 -1321 538 267 -2742 -2300 -674 -2723 -1207 2215 2169 -1093 -1667 1150 1468 -90 1510
641A510J705j977k309o71K012K016k920m350K752N707k482n968k16N483J802k255
$$ 1510 3215 1238 -1071 -1742 270 2286 -634 -4984 -2232 3475 993 -4975 -5191 292 2094 -161
657a61O65p30j977K901L743l570l387L541K850l464l513K253K064l305o68K887
$$ -161 504 -226 -2203 698 4441 871 -2516 1025 3875 411 -3102 -849 1215 -2090 -2758 129
673A29J077j935l122P56M320J394m004k79L350R12k705j61L188k271k760L783
$$ 129 1206 -729 -3851 -3095 1225 2619 -1385 -1664 1686 2598 -107 -268 2920 649 -2111 1672
689A672K024m550l128L457J311k013l95J641j048j974K296K595j570k176J292
$$ 1672 3696 -854 -3982 -525 786 -1227 -1622 19 -1029 -3003 -707 1888 318 -1858 -566
704e66K359J313j822l336J703L615l72l411j595J397J433n07j441r57K91K084
$$ -566 1793 3106 1284 -2052 -349 3266 2894 -517 -2112 -715 718 211 -1230 -2187 -1896 188
720A88Q04k741j66L021K6j304J242J286j359j569K149J657k660k315K363Q36k045
$$ 188 992 -1749 -1915 1106 1132 -172 1070 2356 997 -572 1577 3234 574 -1741 622 1458 -587
737e87j104P58J7l45J72R79k98j861J480L121l54l160r9L983J590l948k315L606
$$ -587 -1691 -933 -916 -1261 -1089 -110 -408 -2269 -789 2332 1978 -1182 -1281 2702 4292 344 -1971 1635
755A635J549l380j805K102P17j987j018K276L20k920K89L081L16j454k84J212
$$ 1635 3184 -196 -2001 101 818 -1169 -2187 89 409 -2511 -2222 859 1175 -279 -563 649
771F49J485p39p78P78m80n90P94L08j465j413K04K152m48l633R60K270L04j052
$$ 649 2134 1395 617 1395 915 325 1119 1427 -38 -1451 -1247 905 457 -3176 -2216 54 358 -694
789f94q36R64J654n3q50O74j82O24L38j183M25J38j123k01N62o75m26j268J012
$$ -694 -1530 -566 1088 1035 185 859 677 1301 1639 456 881 1019 -104 -305 257 -418 -844 -2112 -1100
808a100J508q41j240R30J384M3p42J09J260l35m01P41l9j252k84R62M05j846j462
$$ -1100 408 -433 -1673 -743 641 684 -58 51 1311 976 575 1316 1277 25 -259 703 1108 -738 -2200
827b200J311J486j395j751J332J990r50j477J398J934q63j446J462J547o75j221
$$ -2200 -889 597 -798 -2549 -1217 773 -177 -1654 -256 1678 815 -631 831 2378 1703 482
843D82m14J310o61j354J88P19j254q39P32P19j91j054N47J160J48o56R22M51k99
$$ 482 68 1378 717 -637 -449 270 -984 -1823 -1091 -372 -563 -1617 -1070 90 238 -418 504 955 656
862F56j52M71O50p82j234L39J149q46j353l77P32M02o65o62R44N9l71O99J018
$$ 656 504 975 1625 843 -391 -52 1097 251 -1102 -1479 -747 -345 -1010 -1672 -728 -669 -1040 -341 677
881F77L40r40m22J258J651j451j669O18J004J30j285q50L11n01k92J301k01j633
$$ 677 1017 77 -345 913 2564 1113 -556 62 1066 1196 -89 -939 -628 -1129 -1421 -120 -321 -1954
899a954L31J438J070k45j809P58K425j44j178n13N30M65p37n26J083j277j916
$$ -1954 -1623 -185 885 640 -1169 -411 2014 1870 692 179 709 1174 437 -89 994 -283 -2199
916b199J395J068n54j308j89J237P96q10K78M78R8K58O65l5J02j205m93J416O46
$$ -2199 -804 264 -290 -1598 -1787 -550 246 -564 -286 192 290 548 1213 1178 1280 75 -418 998 1644
935A644j536j270J89N10j43j53N70j048q04J884J429j514j101L89K071J376q64
$$ 1644 108 -1162 -973 -463 -606 -759 -189 -1237 -2041 -157 1272 -242 -1343 -954 1117 2493 1629
952A629j876K08J507J47j365m27N52p18j148J569J55k441j73K602J011j732j304
$$ 1629 -247 -39 1468 1615 250 -177 375 -343 -1491 78 233 -2208 -2381 221 1232 -500 -1804
969a804J024J751l73k54L29R79N8j861k43J674J93k690K9J940j91k904N7K131
$$ -1804 -780 971 598 344 673 1652 1710 -151 -394 1280 1473 -1217 -1188 752 561 -2343 -2286 -155
987a55q5j427J667J434j820r88J211J826M73j453j384J270K017j221k964L8K645
$$ -155 -240 -1667 0 1434 -386 -1374 -163 1663 2136 683 -701 569 2586 1365 -1599 -1561 1084
1004A084K9k128J61M98j330rK343j57j811j20J293J439J28j065j191J967J750
$$ 1084 1113 -1015 -854 -356 -1686 -1695 648 491 -1320 -1440 -147 1292 1420 355 -836 1131 2881
1021B881j052l186P74J841j683p78J928n56k175K5J991k34j176P07R41k41J18
$$ 2881 1829 -1357 -583 1258 -425 -1203 725 169 -2006 -1981 10 -224 -1400 -693 248 7 125
1038A25O35k94l68J282n77n59J786j304k201N59K000q41j808M00R27j220N19K048
$$ 125 760 466 98 1380 803 244 2030 726 -1475 -916 1084 243 -1565 -1165 -238 -1458 -939 1109
1056A109j547j304K433O00j379m28N97J062Q0J011j039k228J6J861m73j426J489
$$ 1109 -438 -1742 691 1291 -88 -516 81 1143 1223 2234 1195 -1033 -1017 844 371 -1055 434
1073D34j228j015J532N09j937p5K314J036k014M2J356o12m02J481kj200M85l74
$$ 434 -794 -1809 -277 232 -1705 -1780 534 1570 -444 -402 954 342 -60 1421 1419 219 704 330
1091C30j083M16P59r06o93J099L87k365j6K805l59j680J540J723j408j406P93
$$ 330 -753 -337 422 -484 -1177 -78 309 -2056 -2072 733 374 -1306 234 1957 549 -857 -64
1108f4J335J43J4q18l68M44k16j702j77J745k65j299Q76J023k486m27K782J339
$$ -64 1271 1414 1428 610 242 686 470 -1232 -1409 336 71 -1228 -352 671 -1815 -2242 540 1879
1126A879k194j96J687K74j449K79O99j10j69N1j016l71K62n60J20J013k29j539
$$ 1879 -315 -511 1176 1450 1 280 979 869 700 751 -265 -636 -374 -934 -814 199 -30 -1569
1144a569L37J717o13j330J518J767r23j171P44K73Q1j77j26j65K08m45q37j58
$$ -1569 -1232 485 -128 -1458 60 1827 904 -267 477 750 831 654 528 363 571 126 -711 -869
1162h69P13l74p83O45R09j114p21J404J278r15o2O72O69p55o75O62M70j039j38
$$ -869 -156 -530 -1313 -668 241 -873 -1594 -190 1088 173 111 783 1452 697 22 684 1154 115 -23
1181b3j51L88k05j476N16J434j098q29P79R45L3j113O38J802p13j005R73M48m61
$$ -23 -174 214 9 -1467 -951 483 -615 -1444 -665 280 313 -800 -162 1640 927 -78 895 1343 882
1200H82r38l4J097p83r94k8P70k17p52k78R12K71j284K69J704p51l67Q18O98k84
$$ 882 -56 -90 1007 224 -770 -798 -28 -245 -997 -1275 -363 -92 -1376 -1107 597 -154 -521 297 995 711
1220G11n87L66O83n98r78L68R7l47o45k74O78M52r02RP38J39k05mO62L47l4k30
$$ 711 124 490 1173 575 -403 -35 62 -285 -930 -1204 -526 -74 -976 -967 -229 -90 -295 -299 363 710 676 446
1242D46M75K4l06n27j54Q78k19j345k79R77j51q39k99J095R6o26J22J188k9p22
$$ 446 921 945 639 112 -42 836 617 -728 -1007 -30 -181 -1020 -1319 -224 -128 -754 -632 556 527 -195
1262a95M84Q91j80o50k71Q09P6j284j87P66Nj366k48J113K30j238k67J588M37
$$ -195 289 1180 1000 350 79 888 964 -320 -507 259 264 -1102 -1350 -237 -7 -1245 -1512 76 513
1281E13j159qJ145L25r69K5J000M24j174m38J234n27l43p13P83J9r06n22J018
$$ 513 -646 -654 491 816 -153 -128 872 1296 122 -316 918 391 48 -665 118 137 -769 -1291 -273
1300b73O65r91p8N87L84r3j36K28P96p94K0O06N7m16p43m7L98l23p59M23P73q30
$$ -273 392 -599 -677 -90 294 201 65 293 1089 295 315 921 978 562 -181 -228 170 -153 -912 -489 284 -546
1322e46j58k95N28O52l21m7Q74j38J36k1M3O53j399l41Q42M8p74m92L4P97n97
$$ -546 -704 -999 -471 181 -140 -187 687 549 685 664 707 1360 -39 -380 462 510 -264 -756 -722 75 -522
1343e22q05N49Q71j67j067J132N05m46n53O07J334n89j254R78O72q37q78q3Q95
$$ -522 -1327 -778 93 -74 -1141 -9 496 50 -503 104 1438 849 -405 573 1245 408 -470 -553 342
1362C42p29j006J092M1K79j292J001J12L55p35P82O45m65j72L44Q95q67j031Q70
$$ 342 -387 -1393 -301 -260 19 -1273 -272 -160 195 -540 242 887 422 250 594 1489 622 -409 461
1381D61M46q33o18J99LK7m76n4M91K96o26L19O78J29l44J01P38R5q78j49R83p20
$$ 461 907 74 -544 -345 -342 -315 -791 -845 -354 -58 -684 -365 313 442 98 199 937 1032 154 5 988 268
1403B68j78l98K75k68l88j28O13m50N2l53J025L02n44l85L04J337k79m78N67K48
$$ 268 90 -308 -33 -301 -689 -817 -204 -654 -602 -955 70 372 -172 -557 -253 1084 805 327 894 1142
1423A142j128m33Q44R8o18n86N58O69j299L42p20M43J547j482N84O82M61j083
$$ 1142 14 -419 425 523 -95 -681 -123 546 -753 -411 -1131 -688 859 -623 -39 643 1104 21
1441B1J65J588p68p48k57J117q23m66R7K37j082R9K37m65O92k12k10N85J102j323
$$ 21 186 1774 1006 258 1 1118 295 -171 -74 163 -919 -820 -583 -1048 -356 -568 -778 -193 909 -414
1461d14J24O92O89J78j415M91Q45j29j516Q31l31q51J72j33R68r05J14M85l03
$$ -414 -290 402 1091 1269 -146 345 1190 1061 -455 376 45 -806 -634 -767 201 -704 -590 -105 -408
1480d08J396j288k08J076Q7o09P3M45o30j85P94J81l71j186J004k53j93l80L71
$$ -408 988 -300 -508 568 655 46 119 564 -66 -251 543 724 353 -833 171 -82 -275 -655 -284
1499b84m56k07M12J13J280m77r49O67m01J107l45l91J294m12k47m75L10k60q76
$$ -284 -740 -947 -535 -422 858 381 -568 99 -302 805 460 69 1363 951 704 229 539 279 -597
1518e97J10K73j28o08o77Q18L56K50l68k00J111m56l71J172N48q03k8j8R13j686
$$ -597 -487 -214 -342 -950 -1627 -809 -453 -203 -571 -771 340 -116 -487 685 1233 430 402 384 1297 -389
1538c89J36J040m68l98m83O06q89L75k83J35Q70M21m70o01Q63N27r47QJ011k32
$$ -389 -253 787 319 -79 -562 44 -845 -470 -753 -618 252 673 203 -398 465 992 45 53 1064 832
1558H32r64K06M48q91n99P83K41m33j1k88j9N05k8j61P97K46j62o95O02M58n32
$$ 832 -132 74 522 -369 -968 -185 56 -377 -388 -676 -695 -190 -218 -379 418 664 502 -193 409 867 335
1579C35m88J338n61j125J81M45q79K55p2J46j65N7K58o33Q47J00p1j54J264n67
$$ 335 -153 1185 624 -501 -320 125 -754 -499 -571 -425 -590 -533 -275 -908 -61 39 -32 -186 1078 511
1599E11j022O57Q33o62L7k47N49j040l62M82J63k91j33K43j19Q17m58j27N97L91
$$ 511 -511 146 979 317 354 107 656 -384 -746 -264 -101 -392 -525 -282 -401 416 -42 -169 428 819
1619H19p93p3M21Q15j452K04J047l18p84l9L07q56l13Q01l0J3k10n54lJ375k86
$$ 819 26 -47 374 1189 -263 -59 988 670 -114 -153 154 -702 -1015 -214 -244 -231 -441 -995 -998 377 91
1640I1m25N37J191q74o52Q85L28r79m32Q12K71j605q8O16M26m80l87Q26r40M23
$$ 91 -334 203 1394 520 -132 753 1081 102 -330 482 753 -852 -940 -324 102 -378 -765 61 -879 -456
1660d56J79j94P24O48n52m40Q45j73o07j38J578j019j151K99K30l17j68N67L34
$$ -456 -277 -471 253 901 349 -91 754 581 -26 -164 1414 395 -756 -457 -227 -544 -712 -145 189
1679A89p04k07K42P41N2j84M8J11M65q09m41J046l2j111l11J345L76j452O7j0
$$ 189 -515 -722 -480 261 313 129 177 288 753 -56 -497 549 517 -594 -905 440 816 -636 -569 -579
1699e79J69M8l46Q76k97j51K60K96q3N35r75N15N03j01j062P61Q05r57o13N63
$$ -579 -410 -362 -708 168 -129 -280 -20 276 193 728 -247 268 771 670 -392 369 1174 217 -396 167
1719A67j15m36j065J209k40K8J22K10M90m46N2R5R68l75M35j217N82jn2m24K60
$$ 167 52 -384 -1449 -240 -480 -452 -330 -120 370 -76 -24 71 1039 664 1099 -118 464 463 411 -13 247
1740B47l6p14J049q33M36p49L82J05j99M51o93M75l74J469q91P39o6l07p44M84
$$ 247 211 -503 546 -287 149 -600 -218 -113 -312 139 -554 -79 -453 1016 125 864 798 491 -253 231
1760B31M44j011k39l97J148p5j554Q34Q66o58N2j53J267k22P2j3K60O0q70N36
$$ 231 675 -336 -575 -972 176 101 -1453 -619 247 -411 -359 -512 755 533 605 592 852 912 42 578
1780E78l97O76o55J68q4p68l78M47k1M51o85J39O82m70l20j77J259m53M16O8O6
$$ 578 181 857 202 370 286 -482 -860 -413 -434 17 -668 -529 153 -317 -637 -814 445 -8 408 476 542
1801E42j99n04J70M35rK69j358J48O73q74K7P85j38p39O88M12l20j16M36L77k17
$$ 542 343 -161 9 444 435 704 -654 -506 167 -707 -680 105 -33 -772 -84 328 8 -108 328 705 488
1822D88p99O74R3L03m23o67Q27k96l92j68KM76o27K45K53R3n76Q25k41M19L5o27
$$ 488 -311 363 456 759 336 -331 496 200 -192 -360 -358 118 -509 -264 -11 82 -494 331 90 509 544 -83
1844h3N88k06N43o55lL55l8m49n1k10M4j54m43J010o17k39J87L35J49k09j50M60
$$ -83 505 299 842 187 184 539 501 52 1 -209 -165 -319 -762 248 -369 -608 -421 -86 63 -146 -296 164
1866A64O87l42n89O16k41r3l07k70O03n23k65K57K86k55l58L76K84l66K81O1J41
$$ 164 851 509 -80 536 295 202 -105 -375 228 -295 -560 -303 -17 -272 -630 -254 30 -336 -55 6 147
1887A47J75l29L00N22k13n85K10o9J28n72K70K46m01m83L37N04l47L54m32M23
$$ 147 322 -7 293 815 602 17 227 158 286 -286 -16 230 -171 -654 -317 187 -160 194 -238 185
1907A85k2k24P01r6l86n2k15N23Q9n31N2r2j63L83p10M84k22l01O04J39k15n8
$$ 185 163 -61 640 544 158 106 -109 414 503 -28 24 -68 -231 152 -558 -74 -296 -597 7 146 -69 -127
1929a27k83L01J56L6k50L22j37M01l49K10l10k21l84K80M94N3p39M39j09N8m43
$$ -127 -410 -109 47 83 -167 155 18 419 70 280 -30 -251 -635 -355 139 192 -547 -108 -217 -159 -602
1950f02R56m82J80m2l8Q03o9r26M02L96r4j41m06k0L77p21j28L40l8M7m38J109
$$ -602 354 -128 52 10 -28 775 706 -220 182 578 484 343 -63 -83 294 -427 -555 -215 -253 -206 -644 465
1972D65p74K87k5O10J21m79K38m73M36j88m84K79L82k50m62M10r7n36M7M5M18
$$ 465 -309 -22 -47 563 684 205 443 -30 406 218 -266 13 395 145 -317 93 -4 -540 -493 -448 -30
1993c0l61J33P13l70k20M64k21j46M61o88K98O99n99J98q29M63mq40N19O12l89
$$ -30 -391 -258 455 85 -135 329 108 -38 423 -265 33 732 133 331 -498 -35 -39 -879 -360 252 -137
2014a37o53L15P03n28L2M42K84m48K0L57M2K6k99j97K11k0l88k97J09M89o58l5
$$ -137 -790 -475 228 -300 -268 174 458 10 30 387 429 455 156 -41 170 150 -238 -535 -426 63 -595 -630
2036f30P96m12n70M65O52j71J31K21P0l06J21k08jJ03j66j23l04N75k50p13L03
$$ -630 166 -246 -816 -351 301 130 261 482 552 246 367 159 158 261 95 -28 -332 243 -7 -720 -417
2057d17N40l72l78M40J86J5J50K71J58m70o2N75l25p2Kj42k98J53o32M73r0K98
$$ -417 123 -249 -627 -187 -1 14 164 435 593 123 61 636 311 239 241 99 -199 -46 -678 -205 -295 3
2079Cm98j89J128l22p45K82J238j231N20n39P70p7m71K70M9L00J46q18p0L68Q1
$$ 3 -495 -684 444 122 -623 -341 897 -334 186 -353 417 340 -131 139 188 488 634 -184 -254 114 195
2100A95q51O75J98o31r9L58K89l75K37M04m7k79K14j3j76K28k31K34K0l85l68
$$ 195 -656 19 217 -414 -513 -155 134 -241 -4 400 353 74 288 275 99 327 96 330 350 -35 -403
2121d03J90J92Nn01M27J54k67k08J25M19J26m93P36j9k07j46J21Oj16n1j52J36
$$ -403 -213 -21 -16 -517 -90 64 -203 -411 -286 133 259 -234 502 483 276 130 251 257 141 90 -62 74
2143G4o4k79l30L37M04l83j6N94k9k97j08N47p03L28M10l36J41l63QK46j64N8
$$ 74 10 -269 -599 -262 142 -241 -257 337 308 11 -97 450 -253 75 485 149 290 -73 -65 181 17 75
2165G5j83k18K99j68m91M36M08n31J91p4K58j69L5L53J71J1O8l22N3J64m19p0
$$ 75 -108 -326 -27 -195 -686 -250 158 -373 -182 -256 2 -167 -132 221 392 403 471 149 202 366 -53 -123
2187a23KJ09l06K5K33k47J40j03L15J02l35K78M36m29K0K25O9j55k49K4J73j38
$$ -123 -121 -12 -318 -293 -60 -307 -167 -270 45 147 -188 90 526 97 117 342 411 256 7 31 204 66
2209F6j02k24J16J55k62k01M12J0j02o9J85J80jo9L62p1j66o0J82k53j70Kj09
$$ 66 -36 -260 -144 11 -251 -452 -40 -30 -132 -201 -16 164 163 94 456 385 219 159 341 88 -82 -80 -189
2232a89K37j78j89K08J02k63j99M06L14j79k56L11K75j78q9J89J37j73l28J15
$$ -189 48 -130 -319 -111 -9 -272 -471 -65 249 70 -186 125 400 222 133 322 459 286 -42 73
2252G3n4N6m26R6Q4j00kk1r7N61m73l6N13J76k25k22M04j7j07k05L8J30l3k47
$$ 73 19 75 -351 -255 -171 -271 -273 -294 -391 170 -303 -339 174 350 125 -97 307 290 183 -22 16 146 113 -134
2276a34K72l5k09j64N35l88K93p74R49n16L5l12N41J96O02o96n46J301o45p7l3
$$ -134 138 103 -106 -270 265 -123 170 -604 345 -171 -136 -448 93 289 891 195 -351 950 305 228 195
2297A95k73K84o44K08N53k36n22J11L54q8m5k58N83j63k11K74N28m88l11k38K87
$$ 195 -78 206 -438 -230 323 87 -435 -324 30 -58 -103 -361 222 59 -152 122 650 162 -149 -387 -100
2318a00J93l59K44p4J64k27j48K44M3o5l06L31J46k21Q3L75N6j5l37M94m27q8
$$ -100 93 -266 -22 -96 68 -159 -307 -63 -20 -85 -391 -60 86 -135 -52 323 379 364 27 521 94 6
2340Fj25L19j86j22r9k2J4J43k96K62p1J6J03O0J75q5j62L42O9J14l24J03J50
$$ 6 -119 200 14 -108 -207 -229 -215 -72 -368 -106 -177 -161 -58 2 177 92 -70 272 341 455 131 234 384
2363C84m45k2J8mj2ln6j7L01m56Q3L15j97K13J12l5jk00J34L35k76j83j03N9k2
$$ 384 -61 -83 -65 -69 -81 -84 -140 -157 144 -312 -229 86 -111 102 214 179 178 -22 112 447 171 -12 -115 -56 -78
2388g8m5J9r9q1M6j48K58J44k59J57K00J8J07k11L13J1q9k06K91k88Q1k36j57
$$ -78 -123 -104 -203 -284 -238 -386 -128 16 -243 -86 114 132 239 28 341 352 263 57 348 60 141 -95 -252
2411b52K20k49m8P3N3m1L9M1K73j00jq7M50l16j2P9K20k71N7j50K8k69O6L48n17
$$ -252 -32 -281 -329 -256 -203 -244 -205 -164 109 9 8 -79 371 55 43 122 342 71 128 -22 6 -263 -197 151 -366
2436c66J59j22Q1K02K63k18j53L25k01P3K33j82K97k24j04K32k03j84M2p5N8j71
$$ -366 -207 -329 -248 -46 217 -1 -154 171 -30 43 276 94 391 167 63 295 92 -92 -50 -125 -67 -238
2458b38j53J76J81r5j1P1L4J04K6ln9r2P1J21J96m00Q5l%m2l34M31r0l45KK0J12
$$ -238 -391 -215 -34 -129 -140 -69 -35 69 95 92 33 -59 12 133 329 -71 14 11 11 -31 -365 66 -24 -369 -367 -347 -235
2485b35K94k58l8N63j04n29N90Q3k66J5k3K10j48k02mo6j70K41r1j06L49j57j26
$$ -235 59 -199 -237 326 222 -307 283 366 100 115 92 302 154 -48 -52 -118 -288 -47 -138 -244 105 -52 -178
2508a78M2K22q6j69L73O6j82j53K90l3k87J72N8l11p5j58J33Q2K56l18J80p6K40
$$ -178 -136 86 0 -169 204 270 88 -65 225 192 -95 77 135 -176 -251 -409 -276 -194 62 -256 -76 -152 88
2531H8k18K22P8n8o2J7K24j90J8K12j08m03jK60l9l53J89Q4j38J18j77j09L48
$$ 88 -130 92 170 112 50 67 291 101 119 331 223 -180 -181 79 40 -313 -124 -40 -178 -60 -237 -346 2
2554BOj67J92M49k04k46j54M63j49j02KJ20k00j93m3J94j75J46k15J4K55R0k83
$$ 2 8 -159 33 482 278 32 -122 341 192 90 92 212 12 -181 -224 -30 -205 -59 -274 -260 -5 85 -198
2577a98L86J69j93rj22K72k52n3K10J85n55N2J39k87m8J72P4n2J7m5j27r2M61
$$ -198 188 357 164 155 33 305 53 0 210 395 -160 -108 31 -256 -304 -132 -58 -110 -93 -138 -265 -357 104
2600A04j00MM11o4k70k00N21m94n0L58j22q2l13R6L77m91mK42J05n6L7K6q3K53
$$ 104 4 8 419 355 85 -115 406 -88 -138 220 98 16 -297 -201 176 -315 -319 -77 28 -28 9 35 -48 205
2624B05N2m19M17Rl06k90O22j89l24K31J11m24k18L59j8j93M13r5N0K21k07k0
$$ 205 257 -162 255 264 -42 -332 290 101 -223 8 119 -305 -523 -164 -182 -375 38 -57 -7 214 7 -13
2646a3K10K73j16k24J6P3m8n20L52M7k79J75m8k5j01O8Q9o5J78J16j6l9K16j52
$$ -13 197 470 354 130 146 219 171 -349 3 50 -229 -54 -102 -127 -228 -160 -71 -136 42 158 142 103 319 167
2670A67L6P3k33J04k63J92q9p3R6R4k75J25k24J85J40l74J07M1o1L22N5L0J1o
$$ 167 203 276 43 147 -116 76 -13 -86 10 104 -171 -46 -270 -85 55 -319 -212 -171 -232 90 145 175 186 180
2694A80m6J4J58l86q9J67o1k0J62k66J38j09Q4k3J10j45K80l5k26K56j48Q5J98
$$ 180 134 148 306 -80 -169 -2 -63 -83 79 -187 -49 -158 -74 -97 13 -132 148 113 -113 143 -5 80 278
2717B78j54j14J24q1j68MN5J29k33o0L04k75J74J00j78M7n3P3K48j35K46k80r
$$ 278 124 10 134 53 -115 -111 -56 73 -160 -220 84 -191 -17 83 -95 -48 -101 -28 220 85 331 51 42
2740D2O0M9k00j55K87l02M00j78K16k17k29J65J69k77L88k71K80N8j47n6J56J84
$$ 42 102 151 -49 -204 83 -219 181 3 219 2 -227 -62 107 -170 218 -53 227 285 138 82 238 422
2762D22m86J91P2l00R4k95O27k89q0n7j92K41Q4L2j21J60PL29o31M09j9l09O14
$$ 422 -64 127 199 -101 -7 -302 325 36 -44 -101 -293 -52 32 64 -57 103 110 439 -192 217 198 -111 503
2785E03k1m96q1j25P44r90N78n94Q92k58nk97J49p6j15N59l01pk7K88j72K98n13
$$ 503 482 -14 -95 -220 524 -466 112 -482 410 152 147 -150 -1 -77 -192 367 66 59 32 320 148 446 -67
2808f7K49j0k48j24O7J36M12p94j16K72K3N25P6o67M25L42r13M95K03p82J051
$$ -67 182 172 -76 -200 -133 3 415 -379 -495 -223 -200 325 401 -266 159 501 -412 83 286 -496 555
2829E55j36l17J13j07K66j4m58J25K61m5n13Q36n52j08j01L06Q7P4m05o1K91J65
$$ 555 419 102 215 108 374 360 -98 27 288 243 -270 566 14 -94 -195 111 198 272 -133 -194 97 262
2851B62n15k47P54J20m46O9m57N39J97m38K29j53J1M5J08K55l95l04N07l13J02
$$ 262 -253 -500 254 374 -72 -3 -460 79 276 -162 67 -86 -75 -30 78 333 -62 -366 141 -172 -70
2872g0m4L3j6K35Q2p98M94j77k58J41L74P50q10k94l0K38n0K31l8J61JN2KN24
$$ -70 -114 -81 -97 138 220 -578 -84 -261 -519 -378 -4 746 -64 -358 -388 -150 -200 31 -7 154 155 207 209 733
2896G33m64J69l48M6m3j98J21Ro6r9L7Q7J52k59J5K47p8j5J78m8J00k64m8J6j0
$$ 733 269 438 90 136 93 -105 16 25 -41 -140 -103 -16 136 -123 -108 139 61 46 224 176 276 12 -36 -20 -30
2921c0q0K05j32K18l51j84K93L82m68pK99n1k21L61J15j64p3P1J31j46k1M0q3
$$ -30 -110 95 -37 181 -170 -354 -61 321 -147 -154 145 94 -127 234 349 185 112 183 314 168 147 187 104
2944A04rk00k06J39j3M9j29J56n4j57K09K75Lj71M6J3J56k08j2P7J0m4m2n9R2
$$ 104 95 -105 -311 -172 -185 -136 -265 -109 -163 -320 -111 164 167 -4 42 55 211 3 -9 68 78 34 -8 -67 25
2969B5j72p5j00j42M42j66J02N80l98No7q2R0j84K91O8j25l42L18k5j43K42m05
$$ 25 -147 -222 -322 -464 -22 -188 -86 494 96 101 34 -48 42 -142 149 217 92 -250 68 43 -100 142 -263
2992b63R0K06j05m6k9K18k29L74N3J51l23o92P05L55q55J44J31K4L51n6q4l70
$$ -263 -173 33 -72 -118 -147 71 -158 216 269 420 97 -595 110 465 -390 -246 -115 -91 260 204 120 -250
3014b50K18N0p7L47l53rqJ29J47k17k85O77l19%P5k2n0N1Np8R3r4j55O5p2rp9
$$ -250 -32 18 -59 288 -65 -74 -82 47 194 -23 -308 369 50 50 125 103 53 104 109 31 124 30 -125 -60 -132 -141 -220
3041b20L82%m17J00J61K1N0R5J21j28p6l3n6J80j83R2m5j23J38l60L44R0j25k20
$$ -220 162 162 -255 -155 6 27 77 172 293 165 89 56 0 180 -3 89 44 -79 59 -301 43 133 8 -212
3065b12L80p3k45J16K18j11J13J86j55j79q3J34O6J1J78n30j9Q5k81P02J32l98
$$ -212 168 95 -150 -34 184 73 186 372 217 38 -45 89 155 166 344 -186 -205 -120 -401 301 433 35
3087C5R2n13L89O7p3J32l5J45j38P3j38Q8Pj01L6j60M5J3j3K9j52j09jK27O4j02
$$ 35 127 -386 3 70 -3 129 94 239 101 174 36 124 131 30 66 -94 -49 -36 -49 -20 -172 -281 -282 -55 9 -93
3113i3K08J74j40k42J59l4j48J49R1o1m3k67nO7L38o1l61J41l3J57r9K10J44k47
$$ -93 115 289 149 -93 66 32 -116 33 124 63 20 -247 -252 -185 153 92 -269 -128 -161 -4 -103 107 251 4
3137DJ85j62j9K57j17n2O1j33k18J07P6k07K53l86L00J06j54j24K64K7j80K11
$$ 4 189 27 8 265 148 96 157 24 -194 -87 -11 -218 35 -351 -51 55 -99 -223 41 68 -112 99
3159I9p1J99j1ok61j09J90j32K12Q7k15P6l28J12Q3J72l7J56l64N9K14k19J0L03
$$ 99 28 227 216 210 -51 -160 30 -102 110 197 -18 58 -270 -158 -75 97 60 216 -148 -89 125 -94 -84 219
3183B19N2j05k10J06K18l14L66n60K42N7k61K47j47m9J70q7m8M17l75j2K49o5
$$ 219 271 166 -44 62 280 -34 332 -228 14 71 -190 57 -90 -139 31 -56 -104 313 -62 -74 175 110
3205A10J6K4J54l87J11J19k48L5N6O2l50O27k84k38K1J74m3j16O8J57O0l75J60
$$ 110 126 150 304 -83 28 147 -101 -66 -10 52 -298 329 45 -193 -172 2 -41 -157 -89 68 128 -247 -87
3228h7K74j46J16j15M1o2q9q4R1L25k75j1J03o5O2m85J52L12j96J69J76K38m59
$$ -87 187 41 157 42 83 21 -68 -152 -61 264 -11 -22 81 16 78 -407 -255 57 -139 30 206 444 -15
3251a5R3j06J82k12P3J2o2j87L85p5n81M55p9N2O0j22j39K51RNJ22j68P0J8J79
$$ -15 78 -28 154 -58 15 27 -35 -222 163 88 -493 -38 -117 -65 -5 -127 -266 -15 -6 -1 121 -47 23 41 220
3276B20p4j64J03k17J62j41JkQ7J3K34k10k47L38l6r5J51j08k8J37q2K35k37P
$$ 220 146 -18 85 -132 30 -111 -110 -112 -25 -12 222 12 -235 103 67 -28 123 15 -13 124 42 277 40 47
3300D7l8N1j03K28k30Q6m55K52N4P8k12L43j43j11J74%nk7J68J1n8O5n1j21j70
$$ 47 9 60 -43 185 -45 41 -414 -162 -108 -30 -242 101 -42 -153 21 21 16 -11 157 168 110 175 124 3 -167
3325a67R7K1k7j1Lk6J15n8k1K91j93q9L2M0L7j57LK41j08jJ47l53J33L4P7M3K
$$ -167 -70 -49 -76 -87 -84 -110 5 -53 -74 217 24 -65 -33 7 44 -113 -110 131 23 22 169 -184 -51 -17 60 103 105
3352A05k76J26P1O3j66J03n3J72q4p7K55j38O4q6K6j6k55m8M8J56J63j63l25K42
$$ 105 -171 -45 26 89 -77 26 -27 145 61 -16 239 101 165 79 105 89 -166 -214 -166 -10 153 -10 -335 -93
3376i3K43j62j7K93k74r4Q8L66l51M3K01N6J90l58J54l81j1l4l2j03K81K16m20
$$ -93 150 -12 -29 264 -10 -104 -16 350 -1 42 243 299 489 131 285 -96 -107 -141 -173 -276 5 221 -199
3399a99P6J32k12J57qj6r1Q8J92p0n4J42J62l51L5o6J46l0r6j0J88j68K0J0K1
$$ -199 -123 9 -203 -46 -54 -70 -161 -73 119 49 -5 137 299 -52 -17 -83 63 33 -63 -73 115 -53 -33 -23 -2
3424bJ03j76J96K0j21k7J00O8o6j69J44k18K66j91L5J52K3j52Nj0Q6j57j17K36
$$ -2 101 -75 121 141 20 -7 93 161 95 -74 70 -148 118 -73 -38 114 137 -15 -10 -20 66 -91 -208 28
3448B8Q2Rk68L49k03L17j82l6j18k41L36j42L7q3j52K94q3J25j70n1J37L8n9j53
$$ 28 110 119 -149 200 -3 314 132 96 -22 -263 73 -69 -32 -115 -267 27 -56 69 -101 -152 -15 23 -36 -189
3472a89K84n7p4K69k83J67l85L35J38m56N3M0K30l08J66L88m74p0M46j66j44L2
$$ -189 95 38 -36 233 -50 117 -268 67 205 -251 -198 -158 72 -236 -70 318 -156 -226 220 54 -90 -58
3494e8J89p1p9K2K6j4J49J17k83q7J44j1l23J87J70p1j79J8j36K63K32j18o8K59
$$ -58 131 60 -19 3 29 15 164 281 -2 -89 55 44 -279 -92 78 7 -172 -154 -290 -27 205 87 19 278
3518B78k26q3Q6K40k96k85N32k89j77M3L78p8j54J52k43j01J62m7o4j5L93k43
$$ 278 52 -31 55 295 -1 -286 246 -43 -220 -177 201 123 -31 121 -122 -223 -61 -108 -172 -187 206 -37
$$ [...]
8191d1
##END NTUPLES=NMR FID
##END=
