##TITLE=1H_Pr Dep3
 CDCl3
 8 sc, 
 2.09.2022
##JCAMPDX= 6.0         $$ Bruker NMR JCAMP-DX V2.0
##DATA TYPE= NMR FID
##DATA CLASS= NTUPLES
##ORIGIN= UXNMR, Bruker Analytische Messtechnik GmbH
##OWNER= root
$$ XWIN-NMR		Version 3.5
$$ Fri Sep  2 13:29:54 2022 Russian Standard Time (UT+4h)  she@DPX200
##.OBSERVE FREQUENCY= 200.1313499994
##.OBSERVE NUCLEUS= ^1H
##.DELAY= (6, 6)
##.ACQUISITION MODE= SIMULTANEOUS
##.ACQUISITION SCHEME= undefined
##.AVERAGES= 8
##.DIGITISER RES= 18
##SPECTROMETER/DATA SYSTEM= spect
##.PULSE SEQUENCE= zg30
##.SOLVENT NAME= CDCl3
##.SHIFT REFERENCE= (INTERNAL, CDCl3, 0, 15.7039)
##AUDIT TRAIL= $$ (NUMBER, WHEN, WHO, WHERE, WHAT)
$$ ##TITLE= Audit trail, XWIN-NMR		Version 3.5
$$ ##JCAMPDX= 5.01
$$ ##ORIGIN= Bruker BioSpin GmbH
$$ ##OWNER= she
$$ F:/spectra/data/she/nmr/H-F/1/audita.txt
$$ ##AUDIT TRAIL=  $$ (NUMBER, WHEN, WHO, WHERE, WHAT)
(   1,<2022-09-02 13:28:46.32 +0400>,<she>,<DPX200>,
      <created by zg, POWCHK disabled, PULCHK disabled
       configuration hash MD5:
       00 E9 B6 7A A2 85 ED C7 34 08 36 98 17 FE 4E 26
       data hash MD5: 16K
       79 52 49 CD 51 A5 D3 D9 50 31 95 91 2D 98 B6 92>)
$$ ##END=
$$ 
$$ hash MD5
$$ C1 65 03 AF DA 18 29 94 26 0E 40 00 C7 C8 01 A4
##$RELAX= 
##$RELAX= 
##$RELAX= 
##$RELAX= 
##$RELAX= 
##$RELAX= 
$$ Bruker specific parameters
$$ --------------------------
##$DU= <F:/spectra>
##$EXPNO= 1
##$NAME= <H-F>
##$PROCNO= 1
##$TYPE= <nmr>
##$USER= <she>
##$AMP= (0..31)
100 100 100 100 100 100 100 100 100 100 100 100 100 100 100 100 100 100 
100 100 100 100 100 100 100 100 100 100 100 100 100 100 
##$AQSEQ= 0
##$AQ_mod= 1
##$AUNM= <au_zg>
##$AUTOPOS= <>
##$BF1= 200.13
##$BF2= 200.13
##$BF3= 200.13
##$BF4= 200.13
##$BF5= 200.13
##$BF6= 200.13
##$BF7= 200.13
##$BF8= 200.13
##$BYTORDA= 1
##$CFDGTYP= 0
##$CFRGTYP= 5
##$CHEMSTR= <none>
##$CNST= (0..31)
1 1 145 1 1 1 1 1 1 1 1 1 1 1 1 1 1 1 1 1 1 1 1 1 1 1 1 1 1 1 1 1 
##$CPDPRG= <>
##$CPDPRG1= <>
##$CPDPRG2= <>
##$CPDPRG3= <>
##$CPDPRG4= <mlev>
##$CPDPRG5= <mlev>
##$CPDPRG6= <mlev>
##$CPDPRG7= <mlev>
##$CPDPRG8= <mlev>
##$CPDPRGB= <>
##$CPDPRGT= <>
##$D= (0..31)
0 1.2 0 0 0 0 0 0 0 0.06 0 0.03 0 0 0 0 0.0002 0 0 0 0 0 0 0 0 0 0 0 0 
0 0 0 
##$DATE= 1662110925
##$DBL= (0..7)
120 120 120 120 120 120 120 120 
##$DBP= (0..7)
150 150 150 150 150 150 150 150 
##$DBP07= 0
##$DBPNAM0= <>
##$DBPNAM1= <>
##$DBPNAM2= <>
##$DBPNAM3= <>
##$DBPNAM4= <>
##$DBPNAM5= <>
##$DBPNAM6= <>
##$DBPNAM7= <>
##$DBPOAL= (0..7)
0.5 0.5 0.5 0.5 0.5 0.5 0.5 0.5 
##$DBPOFFS= (0..7)
0 0 0 0 0 0 0 0 
##$DE= 6
##$DECBNUC= <off>
##$DECIM= 32
##$DECNUC= <off>
##$DECSTAT= 4
##$DIGMOD= 1
##$DIGTYP= 9
##$DL= (0..7)
0 120 120 120 120 120 120 120 
##$DP= (0..7)
150 150 150 150 150 150 150 150 
##$DP07= 0
##$DPNAME0= <>
##$DPNAME1= <>
##$DPNAME2= <>
##$DPNAME3= <>
##$DPNAME4= <>
##$DPNAME5= <>
##$DPNAME6= <>
##$DPNAME7= <>
##$DPOAL= (0..7)
0.5 0.5 0.5 0.5 0.5 0.5 0.5 0.5 
##$DPOFFS= (0..7)
0 0 0 0 0 0 0 0 
##$DQDMODE= 0
##$DR= 18
##$DS= 0
##$DSLIST= <SSSSSSSSSSSSSSS>
$$ [...]
##$SUBNAM2= <"">
##$SUBNAM3= <"">
##$SUBNAM4= <"">
##$SUBNAM5= <"">
##$SUBNAM6= <"">
##$SUBNAM7= <"">
##$SUBNAM8= <"">
##$SUBNAM9= <"">
##$SW= 18.0517283424941
##$SWIBOX= (0..15)
0 0 2 0 0 0 0 0 0 0 0 0 0 0 0 0 
##$SW_h= 3612.71676300578
##$TD= 16384
##$TD0= 1
##$TE= 0
##$TE2= 300
##$TE3= 300
##$TEG= 300
##$TL= (0..7)
0 120 120 120 120 120 120 120 
##$TP= (0..7)
150 150 150 150 150 150 150 150 
##$TP07= 0
##$TPNAME0= <>
##$TPNAME1= <>
##$TPNAME2= <>
##$TPNAME3= <>
##$TPNAME4= <>
##$TPNAME5= <>
##$TPNAME6= <>
##$TPNAME7= <>
##$TPOAL= (0..7)
0.5 0.5 0.5 0.5 0.5 0.5 0.5 0.5 
##$TPOFFS= (0..7)
0 0 0 0 0 0 0 0 
##$TUNHIN= 0
##$TUNHOUT= 0
##$TUNXOUT= 0
##$USERA1= <user>
##$USERA2= <user>
##$USERA3= <user>
##$USERA4= <user>
##$USERA5= <user>
##$V9= 5
##$VALIST= <valist>
##$VCLIST= <CCCCCCCCCCCCCCC>
##$VD= 0
##$VDLIST= <DDDDDDDDDDDDDDD>
##$VPLIST= <PPPPPPPPPPPPPPP>
##$VTLIST= <TTTTTTTTTTTTTTT>
##$WBST= 1024
##$WBSW= 4
##$XGAIN= (0..3)
0 0 0 0 
##$XL= 0
##$YL= 0
##$YMAX_a= 121022
##$YMIN_a= -49696
##$ZGOPTNS= <>
##$ZL1= 120
##$ZL2= 120
##$ZL3= 120
##$ZL4= 120
##$ABSF1= 10
##$ABSF2= 0
##$ABSG= 5
##$ABSL= 3
##$ALPHA= 0
##$AQORDER= 0
##$ASSFAC= 0
##$ASSFACI= 0
##$ASSFACX= 0
##$ASSWID= 0
##$AUNMP= <proc_1d>
##$AZFE= 0.1
##$AZFW= 0.1
##$BCFW= 1
##$BC_mod= 2
##$BYTORDP= 1
##$COROFFS= 0
##$CY= 11.3945322036743
##$DATMOD= 1
##$DC= 2
##$DFILT= <>
##$DTYPP= 0
##$F1P= 2.36226072786647
##$F2P= -0.459571619588291
##$FCOR= 0.5
##$FTSIZE= 0
##$FT_mod= 4
##$GAMMA= 1
##$GB= 0.15
##$INTBC= 1
##$INTSCL= 1
##$ISEN= 128
##$LB= 0.24
##$LEV0= 0
##$LPBIN= 0
##$MAXI= 10000
##$MC2= 0
##$MEAN= 0
##$ME_mod= 0
##$MI= 1.114404
##$NCOEF= 0
##$NC_proc= 0
##$NLEV= 6
##$NOISF1= 3.799351
##$NOISF2= 2.8
##$NSP= 1
##$NTH_PI= 0
##$NZP= 0
##$OFFSET= 15.70392
##$PC= 1
##$PHC0= -18032.91
##$PHC1= 7.400689
##$PH_mod= 1
##$PKNL= yes
##$PPARMOD= 0
##$PSCAL= 0
##$PSIGN= 0
##$REVERSE= no
##$SF= 200.130013532006
##$SI= 16384
##$SIGF1= 3
##$SIGF2= 2
##$SINO= 400
##$SIOLD= 16384
##$SREGLST= <1H.CDCl3>
##$SSB= 0
##$STSI= 0
##$STSR= 0
##$SW_p= 3612.71676300578
##$SYMM= 0
##$S_DEV= 0
##$TDeff= 0
##$TDoff= 0
##$TI= <>
##$TILT= no
##$TM1= 0
##$TM2= 0
##$TOPLEV= 0
##$USERP1= <user>
##$USERP2= <user>
##$USERP3= <user>
##$USERP4= <user>
##$USERP5= <user>
##$WDW= 1
##$XDIM= 8192
##$YMAX_p= 0
##$YMIN_p= 0
$$ End of Bruker specific parameters
$$ ---------------------------------
##NTUPLES= NMR FID
##VAR_NAME=  TIME,          FID/REAL,        FID/IMAG
##SYMBOL=    X,             R,               I
##VAR_TYPE=  INDEPENDENT,   DEPENDENT,       DEPENDENT
##VAR_FORM=  AFFN,          ASDF,            ASDF
##VAR_DIM=   8192,          8192,            8192
##UNITS=     SECONDS,       ARBITRARY UNITS, ARBITRARY UNITS
##FACTOR=    0.0002768,     1,               1
##FIRST=     0,             0,               0
##LAST=      2.2672688,     0,               0
##MIN=       0,             -49696,          0
##MAX=       2.2672688,     121022,          0
$$ Real data points
##PAGE= N=1
##DATA TABLE= (X++(R..R)), XYDATA
0@%%%%%%%%%%%%%%%Qj6J6j6J6j7K5l2L3m1M9n7O5p3Q8j04J17j30J49j69J89k13
37a13K39k67K98l31L70m10M52n01N56o14O75p47Q24r07J000j101J214j341J483
56G79j643J828k042K293k593K956l409L992m780N907p657J0792j8186P3201N9584
71A21022l6714q680n0938m0304k1492L71j2961O983J6987P235q277R825J0294
84f649m00j284J3466R98q540J885J3412K087L380J3455M629j7133j5120j0035
98e849j7484j4507P879J6197P563R256J5687p17j3424l688J142r162m452J0141
112a418M731n576M746J0591k136m172O223k390j6172j0174j119o953j702J5760
126i761J7904O203N634M982j0680j9285r427l790o187L281J5483J0949L644Q155
$$ y = [0, 0, 0, 0, 0, 0, 0, 0, 0, 0, 0, 0, 0, 0, 0, 0, 8, -8, 8, -8, 8, -9, 16, -16, 17, -24, 25, -32, 33, -40, 48, -56, 61, -69, 80, -89, 100, -113, 126, -141, 157, -174, 196, -214, 238, -263, 293, -321, 354, -393, 431, -476, 524, -577, 637, -704, 779, -864, 964, -1078, 1215, -1378, 1578, -1831, 2161, -2619, 3288, -4369, 6423, -11763, 61438, 121022, 84308, 75628, 24690, -15614, -37106, -36735, -49696, -42713, -25726, -18491, -26768, -16943, -6649, -7049, -8333, 5133, 6131, -2409, -524, 12888, 14975, 18355, 31810, 36439, 19306, 4186, -5849, -23333, -37840, -29961, -13764, -6201, 3055, 18742, 18025, 4601, 913, 2055, -7107, -11559, -1418, 3313, -2263, 2483, 13074, 10938, 6766, 12989, 10599, -5573, -15747, -16866, -23819, -25521, -9761, 8143, 14346, 19980, 24962, 14282, -5003, -14430, -18220, -24407, -21126, -5643, 5306, 8950, 17105]
140A7105Q030l649n682j21n160j3317q038j223n314l084Q213R448J053J894M498
155D653l801q185O87M580O3K901Q601Q96o959k624l83n295j456P540N546L56K751
172I871L508l634n316R1j498o690n039j561n804n441K736P183N951Q016J0741
187A3114M192k805k684l148p100m949J559J750j771Q32K062k497l931J505J289
202b582j519P03L643k38j846K197L914L78J302L418o67m461k513j711m080k195
218f257J588P98j641p04n8j952j014L582M585L346M091L754J62k448j776j788
234D268k523j473P67l14j864q76N57p88j92K047J584o10o86o24k100k478J61J042
252d102L91J147J947N0k28P78J686R60J508J999j07j761j325j827k754m55N25
$$ y = [17105, 25135, 21486, 15804, 15683, 10523, -2794, -10832, -12055, -17369, -20453, -12240, -2792, -1739, 155, 4653, 852, -7333, -6646, -2066, -2003, 898, 9499, 10395, 3436, 812, 429, -4866, -6322, 1218, 6764, 7120, 9871, 13379, 9745, 4429, 4520, 3022, -3668, -8707, -10268, -16072, -21513, -18777, -11594, -5643, 2373, 13114, 17306, 14501, 11817, 8669, 1569, -3380, -1821, -71, -1842, -1010, 1052, -1445, -5376, -3871, -2582, -4101, -3398, 245, 7, -1839, 358, 4272, 4650, 5952, 9370, 8703, 4242, 1729, 18, -4062, -6257, -4669, -3871, -5512, -6216, -6274, -8226, -9240, -5658, -1073, 2273, 6364, 10118, 10280, 7832, 6056, 4268, 1745, 272, 1039, 725, -1139, -2015, -1458, -2246, -2438, -391, 1193, 583, -103, -727, -2827, -5305, -5144, -4102, -3711, -2564, -617, -567, -795, -17, 1669, 2629, 4137, 6136, 6029, 4268, 2943, 1116, -1638, -2093, -1568]
269a568J107O89O15N1q11q70k27k47M19J48K4m79j277n32J90P38J068J622J111
288A771L29p40p39q13n28N3R17M99k9L73o05j20P58J050P17Q92o2j464j813j936
308a490j401o23R4R35Q49L63M60m25l51j40k78L79M63L47M15R33P87J172J165
327C654Q67k9j332j690k225k089n30M04K073K569K103P17o53j383k886k577k010
344e017n01K33J611K053J959J344J275M7j091j967j646k033q00O92J971K674L410
361D214K545J071r44k287l036l401k296m40J165J922L218J848Q51j222j738l037
377a567k944k162n52P63J681L578L675K129J257K26k310l894k541j869j302J421
393d411M123L847L262K911O10k720m272l746m435l828p13J181J615L042L988K741
$$ y = [-1568, -461, 228, 843, 894, 83, -787, -1014, -1261, -842, -694, -670, -1149, -2426, -2958, -2768, -2030, -962, 660, 1771, 2100, 1360, 621, -192, -720, -667, 250, 749, 720, 1093, 488, 368, 1126, 2176, 2893, 3785, 3723, 2259, 446, -1490, -2891, -3514, -3420, -2485, -1636, -1273, -813, -1238, -1589, -1729, -2007, -1628, -1165, -818, -403, 530, 1317, 2489, 3654, 4521, 4492, 3160, 1470, -755, -2844, -3374, -2970, -897, 1672, 3775, 4492, 3839, 2456, -430, -3007, -5017, -5518, -5285, -3674, -1621, 338, 1682, 2957, 3004, 1913, -54, -1700, -3733, -4533, -3841, -1870, 804, 4214, 6759, 7830, 6886, 4599, 1563, -1838, -4134, -4574, -3409, -1487, 1731, 3579, 4430, 3208, 1470, -1567, -4511, -6673, -7225, -6462, -4781, -1203, 2472, 4601, 5858, 6084, 3774, -120, -2661, -4530, -5832, -4411, -288, 3559, 6821, 9732, 10342, 7622, 3350, -396, -4831, -8659, -9372, -8191, -6576, -3534, 454, 3195]
409C195K58k6m25k501k878n17M40N78K140L778K011o26o30k342m985m496j455
426h481l68J03M590N690L998K489K574M25l727k983k430l906l199M29O53k51J012
443c382K391k24k186n36p09k403k32L435L331L174N689N006P41k311k202n270
459D312p435n125j567j337Q95N611N494K507K610K419j669m591k470j579l194
474e119m61L356K603K27K020J527k949m213r89r12k336K008N339L129J627M446
490I303J177l640l467j661l926m245Q57K454N7J767M129J419k275jm1l234l508
507d835J234O72j506J785L455M17j262K016J048k742j023K220m64k224J326K358
523B475k063q52K731j54k636M43J716k721k645K094J095k365J697M398J02r71
$$ y = [3195, 3453, 3427, 3002, 501, -2377, -2894, -2454, -1876, 264, 4042, 6053, 5427, 4797, 2455, -2530, -7026, -8481, -8849, -8746, -4156, 1534, 5532, 8021, 10595, 11020, 7293, 4310, 1880, -2026, -5225, -4796, -4143, -4394, -3382, -991, -1215, -3401, -3937, -4646, -7049, -7281, -3846, -515, 2659, 8348, 13354, 14095, 11784, 9582, 4312, -3123, -8248, -9815, -11152, -10257, -4646, 848, 3355, 5965, 8384, 6715, 2124, -346, -1925, -5119, -5580, -2224, 379, 606, 2626, 4153, 1204, -3009, -3998, -4910, -7246, -5238, 101, 3230, 4857, 9303, 10480, 6840, 3373, 1712, -2214, -6459, -5602, -3148, -3091, -1324, 2805, 4224, 1949, 1948, 1907, -1327, -4835, -3601, -2929, -4435, -2650, 805, 1222, -40, 1976, 3024, 282, -741, 1479, 1015, -1209, 117, 2475, 412, -440, 2291, 2137, -499, -56, 1660, -1061, -3706, -1612, -517, -2882, -1185, 3213, 3315, 2344]
539B344K147k52n090k710M00k835l085J975K936j32J042N330J685q88K342L245
555H454j412j661J979n35n029j613m84m056m081P19J393j808J703N106J514j052
571h63L949K441j914o64K914o84l348J25O37m333l562O67j072k975K166M699J795
588b2J398N290K603k298r30J061l665m587J45M71k918n82K581p11l003R70J854
605b343k568o88M064J785m40L432M123j129j863J283j492m727j985P28k266j812
621e898K951K776q82J256L852O0k372Q66O44l324j895J806q83j916J289K369r34
638b35j406J750n25l005n54J960p83Q9L454K801o12N69J740j963l347n5J39k533
656b516K83L131J050p18J345J027k653k891J10j127k276P28K604M03L85K667J053
$$ y = [2344, 4491, 4239, -851, -3561, -3161, -5996, -9081, -7106, -4170, -4302, -3260, 2070, 3755, 2867, 5209, 8454, 7042, 5381, 7360, 6825, 1796, 183, -301, -4357, -8438, -7719, -6326, -8134, -6431, -1325, 189, -863, 3086, 5527, 3613, 2949, 5863, 5179, 1831, 1956, 2593, -1740, -5302, -4635, -5707, -8682, -6516, -1817, -22, 1376, 6666, 9269, 6971, 6041, 7102, 3437, -1150, -1005, -534, -3452, -4034, -1453, -2164, -5167, -4197, -2343, -4911, -5599, -1535, 250, -190, 3242, 7365, 6236, 4373, 5656, 4164, -563, -2548, -1820, -4086, -5898, -2947, -171, -1053, 203, 4055, 4115, 1743, 2609, 3253, -71, -1966, -160, -1043, -2959, -1670, 699, -235, -1641, 109, -416, -3421, -3975, -2015, -2798, -2709, 745, 3546, 2934, 3503, 5243, 3280, -67, -122, 17, -2516, -2233, 898, 1948, 1230, 2575, 3602, 949, -1942, -1832, -2959, -5235, -4507, -1903, -1500, -1115, 1552, 2605]
673B605j675n44O99j247j513J213J434q57M59J986l79j780N24K36j920n76J371
690C6M93p44N52J468p50r35M52j95j739n46Q50j129j009J379R39m82O47J683J30
709A100n03P15P97j229n01M53L8j022L06O50k69j81Q88j00o53m17L22p88p76L97
729g73K3n10K13M31O5k97K68M60k71l02N51r1o80N31R63l55Q6J059R5n59J59k5
751A041n03n55K71M58m30K43O17j2o42k60m63r10r52K8k99l0P24J001N05J15N28
772D75k2o27n41K08Mp2J601Q18J100M42Q6m27j121j431j262j542l74L37K91O30
792a427J100Q72J62K28l76n17j066k30k17qK12Q26R62L72L49M26q79R0p56k87
812a64m84K69L11J34O53K56K1l44k00m38n06j07R9J82M49K88M2k15k60n70o27
$$ y = [2605, 930, 386, 1085, -162, -1675, -462, 972, 115, 574, 2560, 2181, 401, 925, 1161, -759, -1335, 36, 529, -215, 337, 1805, 1055, 120, 572, 377, -1362, -1908, -1058, -2187, -3196, -1817, -878, -1360, -713, 970, 1100, 597, 1312, 2109, 880, 379, 832, 870, -152, 154, 804, 535, 354, 1242, 1142, 489, 72, 394, -394, -1170, -773, -750, -1260, -1047, -616, -551, -848, -580, -120, -391, -693, -142, -233, -913, -382, 581, 226, 312, 1371, 1466, 907, 1066, 1041, 538, -17, 254, 712, 282, 525, 1142, 1130, 488, 228, -235, -1145, -2097, -2069, -2368, -2398, -1674, -673, -168, -53, 475, 453, -174, -715, -507, -503, -575, 1026, 1844, 2944, 3386, 3472, 3045, 1924, 493, -769, -2311, -2685, -2348, -2057, -1427, -327, 545, 707, 935, 559, 42, -1024, -1254, -1471, -1479, -1267, -441, 521, 893, 1242, 1668, 789, 879, 123, -164, -648, -379, -68, 66, 719, 975, 996, 652, 452, 14, -492, -599, -500, -318, 131, 419, 461, 246, -14, -584, -1211]
833a211q56j92j87N34Q15Q35R39O63N74k75J36k09r52o19k0j71L94N18J39N45
853A400No8l17q07j039p98n44j62KM87N93M77K12M14K07N4J73M07K69j11J12m1
875I25k80j01k75l15M29q0L50M10N4n2l79n77n62p28q2k46j45L63N02L47K61Q75
897F94J9l22q7n0n60l14P20R4Q7K15L67n14m23l1m02n76L75J114P24O67P29M56
919B982r91j115p12j302j086l67P43n5O43Q05K67n66J60Q1p62n61R93J397O07
938A161R01J589j83p18o41j018j955j536M6n03P0J543J311O65N76R09l46q78o62
957C31j02r71k63M69L61o31Q5K60r39j128K24L55m97Q35K062J295N58J851Q38
976D993j085p84P5k062k550n38m59j122K49J351J215j83J075J130j017r69J65
$$ y = [-1211, -2067, -2259, -2446, -1912, -1097, -262, 677, 1340, 1914, 1639, 1775, 1566, 614, -5, -25, -196, 198, 716, 855, 1400, 1405, 1337, 1020, 213, -826, -1624, -2168, -2330, -2328, -1841, -1248, -771, -559, -145, 62, 116, 289, 696, 965, 854, 966, 925, 645, 544, 269, -46, 383, 303, 653, 1063, 1117, 1065, 686, 109, -453, -1181, -1263, -1509, -1654, -1291, -789, -442, -181, 694, 713, 391, 304, 254, -306, -620, 100, 194, 281, 496, 863, 349, -74, -105, -507, -1083, -708, 406, 1130, 1797, 2526, 2982, 1991, 876, 164, -1138, -2224, -2591, -1848, -1903, -1260, -455, -188, -754, -594, -513, -1275, -1836, -843, 554, 1161, 2062, 3651, 3468, 2750, 2109, 1091, -864, -2400, -2354, -2857, -2787, -1244, 67, 732, 1308, 2217, 1871, 993, 331, 229, -742, -1005, -536, -175, -806, -721, -461, -1400, -2528, -2304, -1949, -2446, -1611, 451, 1746, 2304, 4155, 4993, 3908, 3124, 3199, 1137, -1413, -1951, -2410, -3532, -3283, -1932, -717, -900, 175, 1305, 288, -681, -516]
993e16r1q57N29J511P14k00J246L1j649j184k85j222r55J339J930N02Q38J597
1011C278j99j738q92o34j723j373Q90J443r2J336J890n6j054k60n73k137q41N92
1029b143k2j69J794J938k28L2J135m10j560m74O61j241j75J109R02q04N86P37
1047A668o58j314j73L02j466n30J202J90q75J287J508o19n47R38l73j662n66Q46
1065h42o73k06J828R92m63M44J073p54j615O12N69j176Q25K161N2j123J45l63
1083A486k696k129j57p33j245J170K814N37J167K042R87j175p1R79j239j563L39
1100E13N56j432n51J166n14j425J077Q69q40j54J395P1j315M03Q01r69p36R63
1118a22Q05q48L19J422n79j104P01k07j469n49J034k22j137R30Q99q21L07J748
$$ y = [-516, -607, -1464, -935, 576, 1290, 1090, 2336, 2367, 718, -466, -751, -1973, -2928, -1589, 341, 843, 1681, 3278, 3079, 1341, 449, -185, -1908, -3281, -2391, -948, -1040, 296, 2186, 2130, 1076, 816, 243, -1894, -2735, -2143, -2165, -2334, -540, 1398, 1170, 1202, 2337, 1927, 367, -107, 554, -687, -862, 247, 1149, 345, 931, 1668, 1010, -304, -477, -175, -1641, -2171, -969, -779, -1654, -367, 1141, 522, -25, 913, 540, -1122, -1688, -842, -1515, -1721, 107, 1099, 636, 1080, 2153, 1399, -216, 396, 965, -211, 614, 2775, 2827, 1704, 1849, 1486, -1210, -3339, -3496, -4229, -5474, -4304, -1490, -953, 214, 2256, 3243, 2068, 1997, 2976, 1737, 174, 513, 1069, -363, -914, 252, -262, -1687, -610, 259, -581, -735, 660, 731, -584, -181, 620, -349, -1085, -122, 683, -165, 154, 1576, 997, -107, 594, 387, -1082, -1631, -597, -819, -1956, -1026, -127, -948, -641, 1107]
1136A107K3p14J110J094o64p00N45m67j811m94P04r70j46J322O39j020J62Q47
1154E67j132j196O7L02j308L04J730L93K16J156J244k56l43J107kj200m72M94
1172A671j311j656L83k55r65J46J461m00N6J054L95j003j66M82r13m03Q22Q84
1190B82k69O7J340J96o06O24J14q32j028J88k03j202l25M53j30m44R66Q92K20
1209C03R34P95o7n57N9k41j415q97p4m09n55N57O24L41L66O02p4l78j92L03k17
1230a92m02M70M31k95K98O95Q7j38O37M56n52j06M0q44r98p58m49n15m94M92N12
1251a625j01P53P27K80M91J14L96k72m54J89j0k1%O88R7J17J76j59k98o06p38
1272b56p21r28j44j37N8M39Q32M29R98P02K66k50j52k32l53o26j32n5k04k08N02
$$ y = [1107, 1130, 416, 1526, 2620, 1956, 1256, 1801, 1334, -477, -971, -267, -1237, -1383, -61, 578, -442, -280, 567, -565, -1761, -1694, -1392, -2700, -2396, -666, -273, -57, 1099, 2343, 2087, 1744, 2851, 2849, 1649, 1177, 1671, 360, -1296, -913, -1168, -2133, -1987, -526, -926, -870, 184, 579, -424, -590, -108, -1021, -1424, -602, 282, 13, 80, 1420, 1616, 1010, 1634, 1748, 916, -112, 76, -127, -1329, -1654, -1201, -1331, -1775, -809, 83, 303, 1237, 2032, 1965, 1408, 1467, 1226, -189, -1086, -1160, -1569, -2124, -1567, -943, -602, -236, 366, 292, -86, -278, 25, -192, -594, -124, 307, 12, 310, 1005, 1092, 954, 1591, 2047, 1495, 1389, 1429, 585, -413, -1171, -1620, -2135, -2629, -2137, -1625, -1726, -973, -246, 34, 525, 639, 1035, 763, 309, 498, 488, 467, 467, 1155, 1252, 1369, 1545, 1386, 1088, 482, -256, -977, -1905, -2049, -2186, -2128, -1689, -857, -428, 570, 1272, 1538, 1288, 1136, 904, 551, -75, -207, -262, -466, -674, -172]
1293a72m59O6J46M18L1J02J65K56J33o0M8L8o44j60N8m12M1L50K37L93K66j52
1315F89j98q93n57p10j42m37K7Q12O32J128P01O05M05N2l45p22l94n81l10LM9
1336a86L05M16R5k24n1k19p14m43m88K9J72M6O15L82K37k9M52M3R3K76l39M65
1358I33k64M21P5j25n04k80n28m71J34j30J00N5M59L29L05j22R9m26j59o53j26
1379h78n0L8M64O29J18L98J62k77m04m06l62m44mJ76N32J82P40L07j78K13K07
1400A163j78l91k66l80q3k03J91j85j20J10P1m97l94K82k27J73K26P75RJ80M33
1421F89J32m81J77j42L64m58OL13M8q6L07l99m39l01n1n86j27K52N19k13N84M76
1443E84m98n04M36Q4r72K04K81n8j00N26N14l46J22N74j95k26OJ54n83J93L56
$$ y = [-172, -631, -565, -419, -1, 30, 132, 297, 553, 686, 626, 674, 712, 68, -92, -34, -446, -405, -55, 182, 575, 841, 689, 491, -402, -959, -1669, -1811, -2248, -2221, -1409, -777, 351, 1052, 1657, 2062, 2114, 1769, 1047, 653, 72, -238, -235, -186, 119, 535, 630, 406, 355, 136, -578, -1021, -1509, -1480, -1308, -1262, -647, -265, -28, -57, 395, 438, 531, 807, 468, 933, 669, 1090, 1165, 1040, 536, 256, -272, -743, -609, -739, -639, -584, -125, 204, 509, 387, 486, 60, -99, -752, -878, -928, -890, -426, 203, 321, 719, 881, 604, 200, -206, -568, -1012, -1016, -840, -308, -126, 614, 921, 743, 956, 1163, 985, 594, 328, -52, -135, -338, -147, -332, -452, -342, -271, -768, -1162, -880, -1107, -934, -708, 67, 76, 256, 689, 821, 340, 517, 375, 739, 281, 287, 600, 648, 562, 869, 470, 31, -270, -321, -907, -1034, -782, -263, -476, 108, 584, 86, -418, 18, 102, -870, -666, -385, -443, -543, -17, 497, 151, 273, 847, 652, 426, 432, 586, 3, 196, 552]
1464E52k3p25J41K74l24k34rJ72r07M33N98p48J15M68N49n39q6N44p7n25M74L
1486A26n19J99O67K87j69J70L4k68o37M74M0q95J79N50k39k85M85j12m43n48P82
1507a22l87m72R23L60p23N6Q18l80o39L82K56m41K52O63K09m82K77L85q67l00
1527b32N76l8p93L86P65m21l77J71K49o46j48L25Jo68N95M53q59l21P27j10o36
1548a001L72J140l60J17O22K85o38k26N39m70l82N08J97p26p3Q21m33o92m26P43
1568h3o39m89Q78p9o03QO96l23l91R18K33j0l3J071o0n81M68l70j010m84Q00J25
1590D2o14N85R39p49L9L91k71p98n2O79k85j71M88j49o41J17N53m43m61O18N11
1611C28l10l0L36k75p81J81O71n27j51P88N68l31M72O45q25o67L02J77q64j14
$$ y = [552, 529, -196, -55, 219, -105, -339, -348, -176, -1083, -650, -52, -800, -685, -217, 332, -207, -293, 251, 174, -351, 123, 126, -393, -194, 473, 760, 591, 761, 795, 527, -110, 364, 404, -491, -312, 238, -1, -286, 199, 87, -356, -904, -122, -509, -981, -58, 302, -421, -365, 453, 73, -566, -184, 72, -369, -117, 546, 755, 273, 550, 935, 68, -232, 344, 306, -487, -101, 664, 243, -134, 37, 286, -360, -508, -183, -182, -850, -255, 198, -661, -982, -255, -365, -1001, -629, 511, 151, 268, 890, 1175, 537, 311, 850, 380, -2, 506, 703, -23, -96, 725, 292, -400, -826, -83, -722, -1211, -333, -412, -1015, -1007, -311, -634, -1025, -107, 126, 116, 83, 1154, 1094, 513, 981, 611, -399, -883, -83, 42, -572, 13, 952, 203, 242, 633, 362, -436, -488, 191, -94, -265, 223, 74, -567, -450, 103, -340, -801, -183, 328, 18, -12, 324, 49, -732, -551, 120, -407, -558, 230, 798, 467, 939, 1584, 759, 92, 394, 571, -293, -407]
1631d07P84m53o10J80K42o05m8K68L79m99P30J92l55o4N15L8n14O2Q64k74P1Q54
1653A350J28p97p1J46p42p39L47J32n59n5N62Q9n28K21O65n58j41P30J03n84K33
1674f8N70o44m33L49L79m62M01M84j09j29L56o3o62j04K84k45m06N88M07o39q7
1695b33L85K00p83M14K94q94K7M07R8n15k13O88l44m14N71M52j32Q2O63j30k74
1716C49o9K34m04J63J97M7m70L48K39n29k23J41m9n06L1K27n77J06K01K03m82
1737h23M16O88l57PL59K90l09q6L24k73J04Q3lj56m33M91R8j6j38J2l0m53J55
1760e0M9l33j4J21j24k01L02J85k11J87J73j81j86J13L94j29N5J10k38N4oJ60
1782B30l4Q7l7M4J7k24R2j0l7p4m09K87l44J87j50k33K27J09N5l69L27L41k78
$$ y = [-407, 377, -76, -686, -506, -264, -869, -917, -649, -270, -769, -39, 153, -202, -266, 249, 287, -227, -165, 699, 425, 496, 1350, 1478, 681, 610, 756, 14, -725, -378, -246, -805, -860, -298, -209, -737, -516, 149, -409, -550, 180, 283, -301, -68, 502, -142, -575, -226, 153, -309, 92, 576, 467, 338, 694, 631, -31, -135, 149, -96, -502, 86, 493, -146, -233, 152, 352, -431, -17, 277, -617, -590, -183, -85, -600, -813, -125, -469, -883, -312, 140, 8, 90, 753, 623, 349, 280, 514, 110, 273, 470, 517, 47, 395, 634, 105, -118, 23, -26, -532, -501, -274, -851, -745, -544, -341, -823, -407, 281, -76, -69, 290, 580, 271, 185, 509, 236, 340, 423, 420, 264, -169, 322, 420, 404, 266, 278, 248, -205, -50, -1, -334, -348, -227, -351, -552, -250, -65, -276, -89, 84, -97, -283, -170, 224, 95, 150, 260, 22, 76, 70, 230, 196, 283, 246, 290, 307, 83, 175, 165, 128, 54, -355, -68, -412, -225, -375, -608, -381, -272, -217, -586, -259, 82, -196]
1805a96K41k21L01o0n6K01J64J7K30j96K5j22J50j37l52l0J4J0r2q5m23K87J04
1828b26O6P4k35J38j89N7L58k65J53j22K91q3K01J40j51j45J25j53P7L24k15M42
1850F62k56K59k23k52j09j22k48j58J63p7o6r7q9J92K37P2L2j9J59m3J30P0J52
1873C69j8O8j25J55k15n5l0j11L41o04L30n2j2J54k10J32l7l6j63J4j55o6j54
1896d80q6K12r0K99kJ63j64K85koK26q9K4K12k5k55j4l0J81m73J46k6j91M25K17
1921D57o26K91j94K61n50M7J19m4m76L33Op3J92K11K60j40P9K95j27k54J06J97
1943C70p1m01L35j73J98k09M96l50l6K56k08m62J48J64n88J90o2k66j00L73K39
1964a57l15j5L89K5K43lL77Lj37L70q5o54K79m0k06j69J07J57l42l1K00l42k76
$$ y = [-196, 45, -176, 125, 65, 9, 210, 374, 391, 621, 425, 450, 328, 478, 341, -11, -41, -27, -17, -109, -194, -617, -330, -226, -160, -86, -321, -183, -372, -315, 43, -222, -69, -191, 100, 17, 218, 358, 207, 62, 187, 34, 111, 435, 220, 662, 406, 665, 442, 190, 81, -41, -289, -447, -284, -361, -427, -524, -613, -421, -184, -112, -80, -99, 60, 17, 147, 217, 369, 351, 419, 294, 449, 234, 179, 149, 38, 379, -225, 105, 53, 41, 195, -15, 117, 80, 44, -119, -105, -260, -326, -480, -566, -354, -444, -145, -147, 16, -148, 137, 135, 129, 355, 266, 290, 502, 477, 222, 208, 178, 359, -114, 32, 6, -185, 240, 457, -169, 122, -72, 189, -361, -314, -195, -239, -715, -382, -376, -449, -257, -46, 214, 74, 153, 448, 321, 67, 173, 370, 299, -102, 233, 60, 258, 49, 545, 195, 159, 415, 207, -255, -107, 57, -531, -341, -403, -669, -769, -396, -157, -472, -487, -98, -73, 170, 167, 544, 547, 410, 780, 695, 41, 320, 280, 74, -95, 12, 169, -173, -204, -4, -346, -622]
1987f22J51K90k52O6N87N3l36n5L97l27m61K11K10l72J26N80j44m22N54j3k27
2008fK8M99n9p8N7K17l95m03K10l2o98K22M67m89l0L46K10m56J09Q9l08L0K44
2031b26M77q4k80Q01j49n93r3N85m24j20P02Q8o36J38J96p30J7J14J19j89J75
2052a12J99l10k59N67j09n81Q4K94l83J65N16K23k99K3M51k19k92M1P46p39n3
2073d7M57j89l29L0j43l35oO34K79m14K02K83j89o30N9M33n03J8N61j83k42J44
2095a10J52n51l41P02KN7M64N14k59k48N85n2o55n65N66l41m61O37p5m86j12M62
2117a15rn48K24M73j19n0N99K57o35J41M8l97n93N11j2j37J44L93J02n12M12N70
2139G47p62Q0M53L0k99K16j74n55k88L81l51j65J31O01k48k66K82K18j76k32O01
$$ y = [-622, -471, -181, -433, -367, 220, 273, -63, -118, 279, -48, -509, -298, -88, -460, -334, 246, 102, -320, 234, 221, -6, 22, 521, 462, 384, 441, 658, 263, -140, 70, 38, -660, -438, 29, -460, -490, -144, 66, -390, -281, -192, -500, -470, -226, 251, 167, -113, 688, 539, -54, -147, 438, 14, -106, 596, 684, 48, 186, 382, -348, -331, -217, -98, -287, -112, 87, -223, -482, 85, -24, -605, -521, -227, -610, -445, 71, 294, -5, 18, 469, 250, -42, -1, 745, 6, -47, 410, 221, -108, -78, -221, -556, -562, 72, 351, -63, 139, 422, 233, -397, -338, 95, -408, -390, 171, -12, -254, -110, 42, -509, -850, -148, -146, -89, 375, 889, 630, 382, 967, 915, 260, -305, 261, -80, -541, 96, 21, -465, -577, -115, -124, -672, -448, 25, -94, -144, 455, 712, 77, 218, 266, -131, -724, -213, -225, -362, -218, 175, 277, -235, 177, 747, -15, 65, 518, 548, 249, 465, 291, -264, -552, -171, -522, -687, -556, 45, -203, -469, -187, 31, -145, -377, 224]
2160B24j00k38K40P16n88j76L16l22k90J22J21O4j15N01J25n20J00N11q53j53
2180c15R8J89o18L96l3J49k63l6N77l40k3N63R0j94O2K29l99j02K42k84k02J51
2202f3L68k75K7K61J37k76k78L80l88k48K48J43l15j34K74l0m05P20j75j25J85
2223C1O9K26l24kJ46l54J11K27j67o5K30L52l85J03K16j35k96J57Q8Q9r9J08n0
2246B76k12m16L28k84l66J19J6j45K07q3J30J71p2O98Q3J22L14p7r4k07K2l93
2268A37j19j46j20l53L57Pl97K12K25J39J98o9K52rl57m3j59K92m74L25R0j27
2290a39J61L29j72J6Qk5J85l35p3k06J61q8L12j02J7Q3j8k9K20j00k9j89P7k82
2314b18J27p8J39l04J88Q0n4K51k37K59k32J54Q1l28K92m9p9K33o7J19K79J56
$$ y = [224, 124, -114, 126, 842, 254, 78, 394, 72, -218, -96, 25, 89, -26, 475, 600, 80, 180, 691, -162, -315, -217, -28, -646, -250, -283, -134, -397, -433, 144, -196, -219, 344, 434, 240, 302, 531, 132, 30, 272, -12, -214, -63, 305, 30, 57, 318, 455, 179, -99, 281, -107, -355, -107, 36, -279, -413, -139, -169, -574, 146, -29, -154, 31, 100, 326, 2, 0, 146, -208, -97, 130, -37, -102, 128, 480, 95, 198, 414, 279, -17, 140, 228, 317, 218, 326, 276, 64, -352, -24, -308, -674, -555, -539, -684, -477, -560, -430, -259, -331, 367, 450, 572, 886, 809, 715, 508, 530, 137, 18, -128, -248, -601, -244, -237, -634, -422, -197, -58, 140, 71, 323, 314, -43, -86, -245, 47, -427, -102, -12, -139, 22, 351, 179, 195, 203, 178, 363, 28, -45, -251, -90, -178, 134, 32, 49, 132, 114, 85, 305, 205, 176, -13, 64, -218, -91, -169, -30, -334, -146, -66, -120, 131, -106, 153, -79, 75, 156, -172, 120, 71, -8, 225, 158, 277, 556, 712]
2336G12k57K07l66O5k78m49j38l77j96J20L76j68L38M91l10M17K26J49k93n9Q8
2357B98L6p6l5L9Q9r8j58K02m14m5l0J10l50J92n5K7N2j75K93J73j38J56J04Q0
2381B77J16k68j45J6q0k65k3J85k16K95K58P3j09J99j04K67n32L70r2j21l16l01
2403e16L09J7L66r6L1J69k6k23K85m73k62O5k04k74J92O1M01J26J68J92M17r8
2425F27m07J82K91k77m17K35k2l30L57j17o3n2j10m7j15J33L5j85J1j06n7Q7k2
2448c69J80J53j80L66N65j51j60J11k90O4l10J46j79k53j05K65K87k22K43K5l23
2469a37M37m96n5kM51l10OJ1L36m13P0q1M4k21K05J48n46K18J71O4k00K61K67
2492B28L47l22m2N7m9l7m5J40j22k85K57k72o3K44j99j35J15o6K5q5K26L1k29
$$ y = [712, 455, 662, 296, 361, 83, -366, -504, -881, -1077, -957, -581, -749, -411, 80, -230, 187, 413, 562, 269, 210, 298, 334, 258, 223, 262, 351, 253, 95, 297, -117, -162, -192, -82, -432, -240, -295, -268, -216, -391, -98, 75, -63, 93, 197, 277, 393, 125, -20, -4, -84, -349, -372, -187, -403, -108, 150, 223, 114, 313, 209, 476, -56, 314, 222, 101, -215, -516, -207, -190, 176, 80, 111, 280, 254, 31, 316, -157, -419, -354, -558, -832, -640, -579, -178, -52, 116, 308, 725, 627, 220, 402, 693, 416, -1, 234, 212, -118, 239, 122, 59, 7, -103, -150, -265, -132, -97, -282, -271, -377, -434, -347, -369, -189, -36, -216, 150, 715, 564, 404, 515, 225, 289, -21, 125, -54, -307, -412, -147, 140, -82, 161, 186, -137, 300, -196, -251, -253, 198, -112, -106, -95, 241, -172, -102, -183, -139, -360, -155, -7, -553, -335, -164, -100, -300, -39, 228, 575, 253, 211, 268, 219, 182, 137, 277, 155, -130, 127, -145, -208, 36, -163, -298, -183, -249, -224, -309, -83, -52, -281]
2515b81J37K62l94Q7J04K34J30r4L61k45n4Q3j80l05k06L82k71l39M33J41l80
2536c95J87L03k98k60K71L34q9n64O65K06n89J52K56k66m58O37j01L28j62M83
2556F40k2n64M21o2l77k49M06k99j36J87l4q5p0Q7K42k05o3M70k56k24L39l05
2578a59m49K33J87J2j73K61L39k84O4K30j52k13O33j53j81m7K97k94o8m71M2m82
2600h28k2M07N1J04L75O44k36l02M8j06m7j3r4k87l5J64J53m54rL67j76J52K84
2623A40J99J10j29L97J46n72n3J97p57j50K44l41m82Q4O10k56L2N8P17K8J77M18
2645H17n9k27K51k04n65j61K00k85k46K96j64M2J1K02pj51K32M02L87l06j1M0
2667D94n47k6o9k14n22N1L35J20J42L20K75k82k0K19k55k0J9L47k08J88L9n0k99
$$ y = [-281, -144, 118, -276, -189, -85, 149, 279, 185, 546, 301, 247, 330, 150, -155, -361, 21, -250, -589, -156, -15, -395, -208, 95, -203, -463, -192, 142, 53, -511, 154, 360, -229, -77, 179, -87, -545, 92, -9, 319, 157, 640, 618, 54, 475, 413, 36, -213, 193, -106, -242, -55, -89, -174, -244, -157, 85, -120, -183, 287, 31, -193, 146, -159, -608, -375, -188, -176, -349, -88, 251, -33, 31, 261, 109, -104, 529, 376, 195, 148, 445, 151, 83, -388, -346, -828, -850, -443, -392, -288, 87, 731, 495, 193, 241, 135, 88, 75, -19, -306, -341, -177, -24, -478, -487, -120, -296, -144, 140, 339, 449, 320, 717, 863, 291, 238, 435, -322, -472, -228, -569, -1051, -967, -357, -613, -581, -523, 194, 222, 399, 817, 758, 531, 782, 578, 13, -148, 52, -233, -479, -183, -347, -305, -294, -92, -99, -250, -18, 384, 771, 465, 454, 494, -53, -79, -148, -362, -884, -833, -498, -378, -236, 84, 359, 77, 57, 276, 21, 1, 20, 367, 159, 347, 386, 336, 37]
2690C7l07K20l60R6K81k49K35J03R5p3l12R5k7k27J09K41l69L25j86K47J82K0
2712A76J7k20k5L14l85J17J0J92j52j79L06pL67k48J14l25j54J87J7m66J79j49
2734c14J94k7j70J53o3k57J26R0R5M33N0J28k14L05O1j32j70Q5k25k4l71Jj14
2757c60J04K59l49J28O9J98Jj64K55r5K05n3m7j32k68P5J36l9j58l3J41r2K29
2780A0K55kN0Q1M5k55j49J12o9j12j01J93j8l29J59o1o0L71j35pl1j66K86j39
2804g2K68k33J28r3J20j99MJ52m7o5k6J13K49j78J7J35k90J46l3J20j51j84j48
2827b67J44l57J47j77M8J48j73J50L43j67J76n7L86j30R8J51o27M87j79j88j55
2848a99o3K61Qp5k0J91j55J99J26k68k00K84k13J54p3l01J62J0mK78j66R9K68
$$ y = [37, -270, -50, -410, -314, -33, -282, -47, 56, 151, 78, -234, -139, -166, -393, -284, -43, -412, -87, -273, -26, 156, 176, 193, -27, -52, 262, -123, -6, 4, 196, 44, -135, 171, 164, 531, 283, 397, 72, -82, 105, 122, -344, -165, -314, -120, -147, -317, -164, -227, -484, -358, -268, -173, 260, 310, 438, 224, 529, 590, 458, 288, 373, 148, 124, -247, -246, -360, -256, 3, -346, -218, -149, 49, 50, -114, 141, 46, 251, 198, 151, 19, -249, -174, -38, -77, -235, -268, -127, -219, 10, 265, 263, 313, 394, 439, 184, 35, 147, 78, -34, -135, 58, 40, -289, -130, -191, -251, 120, -15, -22, -53, -219, 67, -72, 196, -37, 91, -2, 118, -81, -77, 75, 28, -37, -63, 50, 299, 121, 138, 273, -17, 129, 96, 216, 65, -119, -267, -123, -480, -333, -510, -462, -314, -487, -337, 6, -161, 15, -42, 344, 214, 312, 463, -164, 323, 144, -44, -199, -262, -1, 7, -68, -88, 103, -52, 147, 273, 5, -195, 89, -124, 30, -43, -344, -182, -172, -176, 102, -64, 35, 303]
2871C03o3l15O3j81J63pj1QJ79K00r9R4%j35k89j0P5k70K59M3j07k82J35J51k62
2896c58N6K20l2l2m5P1N9J09n6R8Q2m9j4J02j8p0k8J42J32p1m58K63p7k00J58
2921a6k63L13p6j54K41m9n7L3J8kj1Q0N5p4k03Q8J84j55J71K3j06J61j26J5K29
2946C19k55K63m61j68L45M7j01P0Jl6L34k88j27J11k07k1k9j66K28o1J44m6J41
2969C7K09J8r0j64J65L3j84L7J41q4j16J49k0j39O0k77P2R2J11p2j45J15j1O1
2993bq1J93m26l4j42J91m1j02L50K43K5J26L6j99J5J13mk74L96l95J44mL05p49
3017c16J3j86J14m25L11L06o7K25J2N00k57J1q7r3k87R2M06m58r3K69j21nm4K66
3041H6p0k5K97K03j12j40M6P4l06q9j45k43MlK66k81J47Q5j67M3L71K18rk24L05
$$ y = [303, 240, -75, -12, -193, -30, -37, -48, -40, 139, 339, 240, 334, 334, 199, -90, -100, -25, -295, -36, 7, -100, -382, -247, -96, -358, -302, -82, -114, -146, -191, -120, -61, 48, -8, 90, 172, 123, 109, 211, 193, 123, 95, 237, 369, 298, -160, 103, 26, -174, -16, -279, 34, -42, -196, 45, -4, -61, -28, -10, -12, -23, 57, 112, 38, -165, -77, 107, -48, 123, 146, 40, 201, 75, 90, 319, 64, 327, -134, -302, 43, 90, -11, 59, 60, 24, 358, 70, -57, 54, -153, -174, -203, -369, -141, -202, -58, -104, 37, 246, 264, 174, 10, 175, 208, 24, 61, 202, 118, 2, 151, 131, -8, 52, -225, -153, -61, 50, -22, -167, -52, -63, -2, -83, 110, -316, -350, -492, -301, -342, -444, -94, 149, 174, 300, 336, 137, 152, 265, 261, -13, 383, -12, 132, 128, 433, -316, -303, -489, -375, -800, -489, -183, -250, -25, -13, 487, 230, 241, 154, 61, -226, -134, 272, -186, -279, -10, -131, -136, -180, 86, 16, -9, 288, 491, 379, 239, 285, 359, 53, -36, -181, -424, -420, -423, -157, -438, -291, -206, -373, -330, 41, 259, 250, 26, 331]
3066C31j45j60J03n9j39j00J60K5J19m1J98km52J06J45n32L41P2m4j33j10K69
3088d8j59J76l7J96l39M72K4j94K23N2l13l82m1J51J4k79O06j14n5J54J76r3o0
3111A30K67N3k19J01j6l36j43N4jp20J58J23J28r5M18L49q1l7M98j77l02qJ25
3134B69l3k93L09k74l10J27J49k38M6J35j2L3K59J63k7J27J8k26j28l78kj44k57
3157f87J54Q9l3K56R2J6L52J3J76j36q2K65N3l18r6rk56k9p4Q8k46P6J73j07J52
3182a18J39L20M1p0K75m72j13j0j01j99k7J21K17J3j11J13L62n64L98J81n19Q7
3204c7K29n4m9n3N49l40q1L5m96O4j37L6K60k01K23Q3J2j55J34k27r6K28J44k44
3228a73J64L48j49J88k9p2j04P7k99j3j32k9n7L31j33N50m62l10L56k74J64m2
$$ y = [331, 186, 26, 129, 70, -69, -169, -9, 16, 135, 94, 292, 290, -162, -56, 89, -443, -102, -30, -74, -207, -317, -48, -207, -31, -68, 128, -211, 261, 285, 91, 314, 366, 53, -329, -370, -219, -205, -484, 122, 8, -47, 107, 283, 190, 130, 397, 450, 231, 332, 316, -20, -163, -109, -110, -830, -672, -549, -421, -516, -98, 251, 170, 133, 631, 454, 152, 144, 269, 236, -57, 252, -22, -332, -205, -56, -294, -248, -113, -125, -92, 167, 330, 303, 430, 448, 222, 94, -284, -286, -430, -687, -533, -444, -477, -221, -129, -113, 239, 252, 428, 292, 210, 475, 528, 210, 114, 105, -151, -180, -254, -166, -412, -336, -163, -270, -118, 21, 341, 382, 312, 587, 115, 2, -8, -109, -308, -335, -214, 3, 16, -95, 18, 380, -184, 214, 395, -124, -37, 192, 138, 89, 36, 585, 245, 164, 199, -297, -233, -370, -334, -74, -275, -52, 31, 43, -112, 22, -205, -301, -73, 71, -173, -9, 339, 190, 378, 349, 277, 173, 250, -49, -62, -194, -223, -280, 51, -82, 468, 6, -304, 52, -222, -58, -100]
3250a00L7o4K88k36M12k56L01k95l1m05j80L83RO1L8P4M74k76K38j84j21j55k51
3273b39J40j78K86m5J82j18j79J02r5j03J40k87M51L3l50L05P9o7q0J47l6j4j11
3296c7j54J53o0K04k9K38L3k16R6j27j97n5l03K71J15k40L27P2J26k0j02k14L5
3319h4L4m07K58K64o8J79j8k69K16J90k23J61k37p7J51l8k0K20l65N72m69n1j64
3342b45K53k7l46M43J41j87k35J41M1r8O7k60K71j34Q0L39l77J02K26O1l23K22
3364A55K2p2k67K40j68Q2K2j11R7N2j66lJ49K0qo6q0M6l71N16j21J28k27J47k24
3389b08J69J9K14j95R0j44l5O8k17M02p3K64Ol49L0J6Kk1j35N9J94k64J26k42
3413b24P4k7R0k37M1M04k26J23j48J32P2K9j12L1j39L03j05J04P2J87q7m16P9
$$ y = [-100, -63, -127, 161, -75, 337, 81, 382, 87, 56, -349, -529, -146, -137, -76, -38, 36, 510, 234, 472, 288, 167, 12, -239, -99, -277, 9, -36, 146, 28, -151, -49, -144, -247, -107, -394, 57, 90, -260, 45, 124, 57, -23, 124, 88, 74, -37, -191, -38, -98, 106, 77, 315, 348, 132, 228, 101, -96, -151, -454, -183, -68, -308, 19, 91, 217, 197, 95, -119, -84, -50, -457, -199, 65, -3, 176, 158, -111, 105, 295, 72, 233, -4, -81, 70, 32, 12, 232, -133, 439, -30, -81, -245, 8, -19, -365, 78, 219, 32, -203, -62, -21, -119, -52, -312, -41, -175, -95, 244, -133, -31, 195, 256, -67, 155, 177, 105, -162, 78, -90, -8, 14, -97, 0, 52, -114, -117, 32, 52, 44, -22, -102, -56, -427, 89, -32, 96, -131, 16, -208, -39, -20, 194, -1, 89, -55, -90, -22, -239, 163, 90, 354, 360, 11, 41, 57, 59, 38, -97, -38, 156, -108, 18, -224, -150, -177, -87, -324, -283, 121, -105, 18, -130, 2, 74, 103, -9, 22, -117, 186, 81, 185, 257, 444, 357, -59, 20]
3436B0k9l6j97J53j50j23M6J91J94j23m3J41M7k83K38K92m29J33J58k60L03m6
3458A97m1R1k68R8lL1J46k65P2j66j22J17k51K82o4p7K11N9PK33O2p0k53j8k30
3483b22r9O6Q2J16j61K70L64j08j11k2j99K55J8N2k95L34j76p0j5l17L7J69j73
3506b05lQ4J39j21J01K69j24J64j04n8r3k60k06L11k52L86K1k43L60K71l07k35
3528a05K54q4O5Lj0j05J24p9K57j98m98J25m15o9k12P46J11J67J75L50P3k28l8
3551D09m01k88K68k16N9k29M20K2l19K76Jk76J60L4M5L2j8K50J35kk71K25k76
3574D0j30j40k15J05K19M5j17j26O13M4l9j12k11M8j65O3Q9l4J96J33Q9k63K36
3597C68q0l71j66P1r0l76L70L30j45j26J99Q2l25K01O7l46K43nL51P2L45l91R9
$$ y = [20, -9, -45, -242, -89, -239, -362, -316, -125, 69, -54, -97, 44, 91, -192, 46, 338, -91, 42, 200, -60, 243, 197, 156, 247, -21, 77, 74, 105, 251, -14, 58, -108, -230, -113, -364, -82, -146, -223, -12, 47, 54, 287, 349, 279, 26, 8, -222, -321, -255, -173, -57, -218, 52, 416, 308, 197, 175, -24, 231, 249, 301, 6, 340, 164, 94, 79, -238, -201, -32, -205, -208, -124, 15, -106, -5, 264, 140, 304, 200, 142, 49, -211, -417, -106, -358, 28, 49, -194, 166, 437, 130, -105, 149, 65, 130, 133, 123, 18, 142, 63, 320, 122, -376, -251, -666, -735, -947, -201, -90, 77, 252, 602, 675, 447, 409, 8, -280, -12, -228, -169, -398, 22, 44, -275, 1, 2, -274, -114, -80, -35, -3, -21, 229, 364, 362, 91, 316, 40, -90, -230, -445, -340, -121, -76, -193, -319, 294, 338, 299, 187, -24, 24, -141, -78, 11, -23, 173, 306, 395, 132, 368, 288, -83, -249, -178, -268, -644, -274, 56, -89, -215, -16, 66, -259, -58, 9, -337, -94, -99, 252, 324, 669, 278, 377]
3620C77j74l30k8k73M5J10P2n9J83K79j35J0l49K92j32L8J84k58J51O9J6l40Q
3643b44J22l68r2K96Q5J7j04P08m9j9J11q8k55j28j37l19K11r2K7m2K26R2K27
3666A85j48J58q6j63j2j59N2P2L42J45k43o4O3k51k59N5L19k73J08M20Q1K9o9
3689C02p1O4l15K66l72o5K33k12J68k03L24O4j38j66K7j04q8L00k21J37R4pL86
3712D03m72J9M2J03n4k41K22k35N00j48Q3l45J40j2n6%n7P8K5j60J96k40J3L15
3736A19k54J6K51k04J35k48J44K16j64j68J69J65k30N34l98j71J58j04Qk9J64
3757A09O8r1q0j6K9k11j77L60q6J7k14K12j33K12Kl0n6K72k41K62k38r9J45J65
3781A81p0R8k77P4n5O1J71k97K34n4j3K15j27o6j74k24M89k23j77R6K12k42o6
$$ y = [377, 203, -127, -155, -428, -383, -273, -201, -260, -77, 202, 67, 77, -272, 20, -112, -74, 110, -148, 3, 72, 88, -252, -244, -122, -490, -582, -286, -201, -184, -288, 420, 371, 352, 463, 375, 120, -8, -145, -464, -253, -345, -318, -360, -134, -42, 185, 37, 195, 109, -54, -66, -225, -173, -101, 241, 386, 143, 79, 142, -109, -368, -313, 6, -267, -159, 261, 342, 371, 302, 231, 295, -20, 246, -126, -191, 42, -170, -2, -205, 119, 183, 45, -121, -94, -198, -286, 14, -207, -70, 24, 17, 403, -69, -50, -8, 95, 41, -200, 22, -213, 287, 139, 222, -123, 17, 5, -51, -51, -108, -30, -5, -165, 31, -209, -196, 119, -135, -119, 132, -72, 63, -185, -41, 175, 11, -157, 12, 177, -53, 481, 83, -88, 70, -34, -26, -55, 109, 177, 86, 6, -10, 19, -192, -369, -9, -95, -78, -292, -80, -213, -1, 1, -29, -85, 187, -54, 208, -30, -129, 16, 181, 111, 209, -68, 6, -49, 12, 183, -114, 120, 66, 53, 268, 141, 75, -99, -323, 166, -57, -234, -138, 74, -168, -234]
3804b34L96Kj04j57J60j4l9J20j97J69k41K86j25J39r2MJ93j89p1j41n9J44j42
3827a92P6J40Q5Mk62J68l34L70j04K18O1k55R1J7n4L26j24j77j02Q1j56P0M4J54
3851A45j33Q9P9k67LQ2o5L4l2K7K17j58L2j30J30K35m59n3Q6j84K67J02j08M09
3875C48j72r5j43Q6J28j87K75j78n2K1j24J16J16k11J56j99J06m6r2J40J38k98
3897a67J99J01j78l3m5k34K73K27m19J29J55J41q7J54q3j7J1j30N1K7j77j30M21
3920A89k27K32k54J00j59j15L5j06J28K07k0J22n2J33J01n9j13j28j52J6K99l13
3942a36K50J74l77L6K69j37j10Lk19P8QJ10j18K13L57j86m0k29l7q0N1k46M26
3965F0O9k32L17j45L2j74J24k46m1L6R4j18K74M47k70J22j50j73l9k22J9L9M0
$$ y = [-234, 162, 164, 60, -97, 63, 49, 10, 130, -67, 102, -139, 147, 22, 161, 69, 73, 266, 77, 6, -135, -194, -50, -192, -116, 24, 109, 113, -149, 19, -315, 55, -49, 169, 230, -25, 66, 83, 29, 355, 231, 54, -48, 33, -123, -53, -9, 145, 12, 101, 180, -87, -84, -2, -67, -33, -65, -38, 179, 21, 53, -77, 53, 288, -171, -224, -138, -322, -55, 47, -61, 348, 176, 81, -62, 24, 152, -35, 240, 62, 10, 31, -93, 23, 139, -72, 84, -115, -9, -55, -147, -7, 131, -167, 32, 133, -45, -78, -123, -357, -84, 143, -276, -147, 8, 149, 62, 216, 133, 116, 127, -3, 48, 75, -102, -232, 189, -38, 194, -60, 40, -119, -234, -199, -305, -177, 30, 10, 132, 80, 213, 314, 255, 142, 14, -138, -122, 177, -136, 114, 288, -89, -53, 216, 79, -31, -28, -247, -169, -161, -51, -169, 44, 401, 215, 175, -54, -91, -171, -120, -366, 60, 129, -103, 214, 69, 101, -73, 51, -195, -236, -200, -106, -224, 50, 497, 227, 349, 199, 26, -13, -235, -216, -177, -137]
3988a37N6J62j61J67j9M0k96K07J33l72K77k26L07R0k72J30M9j44r5K35k24J93
4010A00N4L2k12J39R8n9J10k26J81k04k58K85k63j0l4L16j28n8K59k98J7j6N3
4033a22J94J97p1j47J09m1J67k84J19o3j28k10J02K04l11J96J51j52Q9K17o2r9
4055E5L1k41j0N8l7K60O4n06K69r7J01r7J03J69k06K71k4j29O6Mr6M8j28R5K28
4080B51j75j03j23J44J0j78K34l0LM0j29l0m9P6J54j49KQ5J9J4n8%j26J94P7k19
4106f6K66j96O8j14K3N1k55L12m0l2K43j29m0j49n1N1J19l26J6L45k43J67R2r9
4130A3j54n9K96j32J45k03P5J62p8J72p5l28K37l6m42L14L65m68M3J76k00j16
4152b93K9K32J1n7J25Q4j42m3J84k74J78j74J79j0M5j26J96l98M65o0r4lL2M2
$$ y = [-137, -81, 81, -80, 87, 68, 108, -188, 19, 152, -220, 57, -169, 138, 228, -44, 86, 135, -9, -104, 131, -93, 100, 154, 186, -26, 113, 211, 152, 262, 36, 217, 13, -245, 40, -223, -233, -267, 49, -79, -137, 122, -176, -159, -175, -122, 72, 269, 198, 51, 160, 119, 286, 2, 121, 58, -70, -280, -178, 26, -285, -89, 62, -90, -1, 216, 154, 55, 86, -155, -165, -107, -144, 116, 180, -326, -57, -154, -53, -150, -47, 122, -84, 187, 163, 34, 100, 104, 8, 56, -72, 23, 251, 76, -27, -150, -6, 4, -174, 60, 30, 33, 73, -56, -86, -135, -59, 95, -54, -52, 33, 52, 66, 8, 8, -118, 76, 153, -66, 200, 4, 72, -42, -19, 32, -223, 89, 49, 17, 260, 131, 91, -58, -109, -58, 61, -265, -249, 96, -147, 20, 112, 13, -141, -200, 96, -36, 109, -94, -19, 143, 65, 237, 162, -166, 71, 35, -407, -93, 272, -196, -153, 23, -177, -293, -264, -32, -21, -78, 47, 131, -11, -54, 130, -144, 34, -140, 39, 29, 74, -52, 144, -254, 211, 151, 57, 54, 86, 128]
4176A28N9k11L4K6j24M3j02R3Lkp8j20J62RM6j9K32k72j09K23j03n6K76k30J54
4201F2L3J20k74p4j1J52j1J71r2N2l24K45j78L32l17M3j34mJ54J49r8j65J6K03
4225E0L7o2J4J71j53j76K46j48k2K51l5m4l3R6J15m20nJ7J36m1N3k97L14o9K21
4250B16l06J55J95l22R4j11J15rR4M6j06j16O1r4j38J55J17K8p4M2j32K62j58
4273A4l9M1J98mk12Q2j52j15L47l03L4Q2P0j1n2K6L5j25P5J77j89J83k9j70J63
4298A26k21L5J68k40L51k16o2J6J00m9Q2k06K39j51r3J45%on4m2J08Rr2K63l37
4323a27Q2m8J91j21K39k43K27M0k64n9J19j75J15j12p9L20j10k6j84L85m16K61
4345A5J4j38K7J86j53R3n2n9K81j59O7j91j71K73q4j73J85m4J45j93N3R6kj4l9
$$ y = [128, 187, -24, 10, 36, -88, -45, -147, -54, -51, -53, -131, -251, -89, -80, -34, -53, 179, -93, -202, 21, -82, -138, 138, -92, 62, 95, 215, -59, -133, -144, 8, -3, 168, 76, 128, -196, 49, -129, 203, -114, -71, -205, -209, -55, 94, -4, -169, -153, 50, 87, 25, 39, 210, 57, -119, 127, -21, -43, 208, 173, 129, 96, 192, 307, -113, -118, -101, 35, -6, 47, -250, 64, -5, 216, -90, 65, 260, -62, 32, -79, 36, 27, 121, 167, 61, -55, 6, -88, -226, -71, 46, 74, 0, 42, -90, 172, 14, -25, 16, 214, 210, -2, 80, -72, -187, 160, -143, -109, -27, 43, 32, -20, 6, 41, -84, -9, 168, -21, 162, 133, -37, 126, -95, -60, 108, -132, 219, 3, -59, -43, 57, 8, 90, -116, 123, -28, -121, 24, 24, 18, -36, -78, 30, 39, -53, 210, -127, -45, -93, 98, -23, 216, -27, 200, 240, -24, -83, 36, -139, -24, -136, -215, 105, -5, -31, -215, 170, -246, 15, 29, -109, -82, 104, -49, 44, -8, -67, 214, 55, 122, -69, -240, 33, -51, -224, -39, -83, 62, -131, -78, 18, 16, 2, -37]
4370c7K62k59n3K17k33J68k00J26O3O4j73j33J24o5n5K28l5K8q4M46n04J7J28
4393D0j69J6J10k3K09j32J08nk95O5j02K02jo9J47O7j57MJr9j96K27J07j64q3
4418a92RJ20J07o4P6J14J55m45q4J98k4Lj15L52k93R3l1p9R3K0mjp4J83k49L20
4444A88n4j01R2n28M32q7M0n3N4j19rL16j68l7q4K5J33J08l5R0j22J89k23K94
4468C41j69j04j53J28nk62L05n3m0J4R0L39n86K31M0j48j3k14K30M6j56L30j70
4491B1m9l2r2Q3J48M4j70P9LNM9O6j38j63j5J30rr6N4o3K41k33j0P1J06J55kj86
4519cM2r2K0Q3q8J35K5N5j96K39l95Q4R7k1l2L1K7P0J62q5r9q2K53m62J92k71
4545c11K35J24NJ12j50j61J35M4j71o2K75J4k43L83j72j95K83l72K9J48J16k55
$$ y = [-37, 225, -34, -87, 130, -103, 65, -135, -9, 54, 118, -55, -188, -64, -129, -184, 44, 9, 37, -47, 399, -105, -88, 40, -129, -113, -3, -26, 183, 51, 159, 154, -141, -76, -178, 24, 23, -46, 101, 168, 11, 15, 16, -83, -279, -52, 55, -109, -192, -183, -63, 44, -20, 56, 170, 325, -120, -204, -6, -30, -27, -142, 210, -83, 10, -21, -100, -7, 13, 9, 8, -66, 117, -132, 188, 134, 33, 125, -403, 29, -58, -18, -71, -17, -136, -145, 171, 3, -34, -118, -93, 40, 148, 113, 203, 81, 270, 47, 341, 172, 68, -85, 43, 38, -224, 81, 28, -12, 2, 92, 431, -155, 76, 116, -32, -45, -259, -29, 17, -139, 191, 21, -28, -60, -152, -69, 79, 123, -47, 32, 35, 40, 89, 155, 17, -146, -161, -31, -40, -136, -82, -145, 96, -137, -147, -76, 30, 185, 183, -3, 39, -53, -33, 50, -38, 97, 122, 177, -19, 220, -175, -91, 6, -15, -47, -16, 11, 81, 243, 158, 59, -23, 230, -232, -40, -311, -76, 48, 53, 165, 15, -146, -11, 33, -138, -200, 75, 89, -154, 229, 57, -138, 145, -227, -198, -50, 66, -189]
4567a89j13J60P4j14J05RQ9K50k13N5r1j3k99K46n7P8j11N70o30K17KK47k35j15
4591g8k3KK04j64J8j32L8n3J86k6K14l17L81j04l33L84k78P3M7j44J02k02K84
4614G9k41J06J19k19M75l91L49j38j42J5r0J6J45j70J46k42J76k29K51j95p3K30
4636b3k13L12q5J55k47L1J95j36J15o1J6R5j29O2l04J50N1j04K21k08K18K6k89
4659a52J81L3k27M20k43J40j51k09M27m95J35J83j5P7l17K7K90J2j14k92K13l2
4681a09K31l92R0K41r8J49j22K8j28K77J12k88p5J64l7J06p7p4J2k66L9K99r1
4704im07N73l12J5J26Q9j7K27j01m28J01L34k31j50N96l18k42L90l59Q7J60O7
4726A91m40L19j20J93m5j49o1j5K96k10J4K66k29k71J28P9r0J0K22k59K29l19
$$ y = [-189, -302, -142, -68, -182, -77, -68, 21, 271, 58, 113, 22, 9, -290, -44, -101, -23, -134, 436, -194, 23, 25, 272, 37, -78, -101, -99, 105, -59, -41, -173, -135, -188, -2, -28, 186, -131, 250, 146, -187, 197, -81, -8, 39, -105, -3, -205, 79, -162, -56, 63, -156, 319, -72, 277, 139, -3, 12, -78, -62, 83, -87, 59, -183, -7, -236, 15, -180, -253, -23, -236, 76, -9, 146, -101, -70, 125, -11, 104, 43, 59, 154, 25, 87, -217, -67, -16, -120, 101, -107, 111, 137, -152, 29, 62, -165, 255, 12, 152, 1, -208, 219, -276, -141, 42, 27, 104, -213, -186, 104, 116, 2, -290, -77, -109, 122, -270, -180, 61, -37, 112, -10, 18, -110, 167, 279, -9, -84, 80, 43, 149, 72, -2, 10, -256, -217, 82, -9, -416, 157, -155, -140, -14, 75, 58, 285, 184, -244, -143, 191, -40, -190, 406, 88, -154, 236, -123, -36, 124, 191, -249, 70, -50, 143, 98, -51, -112, -127, 169, -41, -27, 239, 10, -261, -133, -54, -144, -134, 88, -171, 58, -261]
4748b61L54n3J3j52J83o9OJ00j81J15m6oR5l06J93j15j03J46j18K37l15K99j77
4771a61J31n8m7p2l9M58l47Q1j6j7P6Lj04R9K09K8k89K72j51n5P2k07j90L45k2
4796ao5P0Q3r7Pj6M4j28j06J28n5K02KL7k59R5j9nJ90q8J33j26M7q1K49k32J43
4823A52j76N9r2j5K83j33p9m2n9K32r9j50r8J23J26l1J36k01R0q8R1j2o9J40k92
4848b04L10j30NJ31j07j33L59JKom37K09N8l02K12n2J5L83l08q6J24M2n6j1k16
4873a97M7J82Q6j33J45o0k17K84k75L54j99M5l1j1j14m7J74K35j27j91J18pl60
4896b99N0K2J19K0N4J65N7o8k38Q1L0j09o5J57oQ1J54j17NJ02J6m11M03j98j65
4921a60j43L18o6q8L79l35J59j52K39j9j36RK63j76q5K2j3j3j42L84k36R4K14
$$ y = [-261, 93, 40, 53, -99, 84, 15, 21, 121, -60, 55, 9, 3, 98, -208, -15, -130, -233, -87, -205, 32, -283, 16, -161, -30, -88, -135, -207, -246, 212, -135, -54, -70, -87, -11, -8, -112, -13, 196, 224, -65, 207, 56, 1, 73, -134, -324, 21, -1, -66, 4, 87, -10, -3, -19, 25, -103, -209, -81, -136, 66, 68, 105, -154, -59, -78, -83, 107, 19, 152, 26, 73, -8, 241, 9, 152, -24, 35, -57, -72, 211, 78, -1, -43, -102, 130, 31, -119, -217, -94, 32, 1, 137, -64, 26, -62, 29, 17, -52, 88, -204, 106, -24, -19, 112, 5, -128, 231, 232, 234, 228, -209, 0, 58, -244, -32, -84, -69, 314, 6, -80, 44, 86, 30, 19, -197, -150, 32, 118, -15, 130, 70, -147, 137, -138, 216, 17, 62, 31, 20, -94, -141, 33, 268, 141, -50, 68, 61, -299, -249, -227, -108, -88, -34, 131, 188, 120, -118, -37, -7, -116, -181, -24, -30, 51, 205, 88, 93, 195, 211, -200, 203, 5, -160, -303, 15, -51, -139, 240, -95, 64, -88, 151, 132, -4, 5, 268, 92, 7, 29, 16, 3, -139, 245, 9, 103, 317]
4944C17m22P9P0j7J38k01J64r8J71k18j15K05j28j24J09J54j48K73l02J36m3P5
4966G5j26K02j12j53Q0Q5q5J52k38k2J06J35k2K2n8L0j3l19L46j6m4LP4K4q6k73
4992b33J76K4K9k05K65k11j55L25O3k19J70m6k8J20l4k22K16J10r9J1q4J00j29
5015e6Q8p9mj23L13k63JJ87m4n9j10M7J79j9j34J44k55J48K25j04q7J05m3K8M0
5040A25r8O5m6j70m0L30q1n3Q9k98J23J81O2m62M07j49Rj65l6K50J47k87K14n3
5064F4j24J53o9m0j78J87L53k24j67j72P5J75J10P0k67j56K97l34O4J31J55l9
5086F4l52L28k31Q3K28l18K21L86o72J57j1K60q8j06p7Q2J29J68k64p5K51l6j19
5109HP9J34k19qK11k26j7J01p2j17K15Nj01K39n1m5j72l1J39jl52K00L00j94O5
$$ y = [317, -105, -26, 44, 27, 165, -36, 128, 30, 201, -17, -132, 73, -55, -179, -70, 84, -64, 209, -93, 43, 0, 75, -51, 151, 39, -114, -34, 51, -34, 118, -120, -142, -36, 99, 77, 99, 41, 71, 58, -261, 85, 69, 25, 28, 102, 126, 40, -233, -57, -33, -4, -209, 56, -155, -310, 15, 78, -141, 29, -17, -45, 75, 41, -181, 35, 145, 46, 57, -27, 73, -56, 32, -47, -51, -174, 139, -124, -123, 64, 20, -39, -149, -102, 77, 58, -76, 68, -187, -39, 186, 82, -5, 100, 57, 85, 125, 27, 92, 46, -124, -164, 166, 85, 32, 121, -177, -54, 127, 189, -273, 134, -15, -6, -171, -207, 43, 190, -97, 117, 64, -60, 93, 24, -16, -194, -7, 346, 122, -45, -217, -142, 33, 143, 213, -54, -210, 87, -247, -183, -52, 103, 64, -288, 40, -191, -108, 120, -198, 23, 409, -263, -106, -117, 143, 55, -51, -128, -46, 83, 251, -13, -88, 163, 127, 8, 87, 221, 2, -6, 205, -21, -38, 63, -9, -126, 89, 94, -7, 232, 181, 136, -36, -67, 72, 71, -281, -81, 219, 25, 90]
5134I0lj54J41k2P7j10N3k47R2J1J09j20n1L26n4l29J84k49L41j52k89L00J54
5157I8o1l0p4l3k63K67O8M4j01K37n6k30K50j75kL51l55k3J8k3o1J79m4K4J02
5182A07j84j07K05p8J44j2P9k00P9L5L0j78j05J24J73j09J70j29M3j02k0K08j09
5205F4L07l05pj87L40k42l9j02j03J9L69Jk05R7k09L04j62J40r6K6Q0M3l75J36
5229a06P2KJ53k06L12l1l40J35J47l30p6K28K67j84l98M40l6m0M8l4L7k5k58J61
5253f2K43k21o5J76j26o5K18k04n3R0P1N4oj09J99j22r3J63jJ12j31J1Rl08O1
5278a59J49J43M6q7l21L99k45K67j7j87j36m2J76J15j50j02K30j54J26l3K06l89
5300a65K28P4j07R9l87K07K8j1Q4o7J17l82K42p6R0J60m18K3N0J13P0r1L11l37
$$ y = [90, 87, -67, 74, 52, 129, 19, 72, -175, -83, -72, 37, -83, -134, 192, 138, -191, -7, -256, 85, -67, -356, -56, 98, 37, 7, -67, -100, -363, -96, -28, 16, -85, 152, 96, -134, 116, -59, -61, 290, -65, -88, -70, -93, -154, 25, -19, 5, 107, -77, -184, 21, -57, 87, 75, 154, -46, 33, 68, 98, -80, -185, -61, 112, 3, 173, 44, 87, -15, -35, 173, 64, 371, 66, 59, -128, 212, -30, -69, -171, -274, -255, 114, 115, -90, 7, -202, 102, -60, 80, -16, 10, 90, 133, -242, -106, -34, -32, 121, -85, 227, 196, -144, -9, 138, -192, -268, -40, 227, 43, -355, 85, 49, 9, 57, 23, 60, 35, -223, -62, 181, -40, -105, 71, -55, -120, 98, -106, -159, -69, 2, 56, 50, -59, 140, 18, -75, 88, 87, 199, 68, 79, 88, -220, -159, -10, 133, 179, 92, -229, 170, -75, 192, 175, -12, -148, -190, -14, 101, -49, -151, 79, -75, 51, 18, 224, -165, 63, 137, 30, 129, -258, -51, -23, -34, 50, -17, 100, -282, -40, -116, -26, 134, -284, -261, -211, -98, -28, -119, 192, -145]
5324a45Q5p3J45q4L12k51rJ57m26L24nK28l88L23k41O3Q5n3R8l97L40j05L6p1
5348e2n9j44K17L19l76p5J92j4k36L21J79j22K4k42M5o1J17L8o5n4J89l42J58
5371d3J73k3n5K16l54j7K41l66L35j51J09j14o7J09lJ62j70O3jJ10jr0K4r6K1
5396A2j9o6J19k9rN9q8J12m8o9j63K08OO9p6p7M7J02R3j66j10J87j44J29k79L79
5422A79k46J04Q5j52o1m0J98M3l69K13J11J47q3j43K05l06J84j61K94k13k8j58
5444a97K41j83J89l04N68n02L08p6N8j15K07j15K6L8j28j35J89J08l41K23j97
5465a38N4L8M0j41J51P3rk68K4K7J50J4J77ml81K76j20p2K94j94k10J49m0J08
5489bj20O3J09J58j57j56l4P7R3O7j05j64K28l2l2N1n3j60K54j04r1J59J32k65
$$ y = [-145, -60, -133, 12, -72, 240, -11, -20, 137, -289, 35, 30, 258, -130, 193, -48, 15, 100, 47, 145, -252, 88, -17, 19, -52, -111, -255, -38, 281, -95, -170, 22, 8, -228, 93, 272, 150, 174, -68, -23, -84, 33, 71, 6, -48, 141, -201, -43, 130, 107, 52, 268, -86, -103, 138, -228, 107, -44, 65, -49, -116, -7, -10, 152, -18, 45, 44, 154, 153, 63, 87, -9, 12, -7, -73, 46, 17, 8, 67, -21, 91, 43, -26, -189, 19, 25, 94, 18, -59, -12, 90, 183, 17, -93, 94, -50, 79, -200, 179, -67, 37, 122, -30, -91, -131, 67, 110, -259, -46, 65, 212, 129, -14, 191, -115, 69, -92, 202, -11, -39, -197, 44, -139, 50, -254, 314, -188, 120, 44, 102, -13, 194, 79, 105, 143, 15, -120, 69, 177, -164, 59, -138, -84, -46, -6, -147, 4, 77, 68, -200, -176, -149, 1, 15, 192, 188, -193, 83, -37, -109, 185, -9, -219, -70, -110, -2, -122, -59, 50, 208, 51, -105, -139, -62, 31, 98, -7, -171, 57, 25, -7, 44, -9, -169, 85, -19, -110, 49, 181, -84]
5513h4k1K82n7J3n4Q3q0J48j92P0M0l21K04l6O9J3j64J04K18j23j28J50M9k84
5537a01P4J03j36j79Nk9L82j45j35J47M3L47k71m3K9q7J03nQ2p2l44K85%J56k81
5562g2N4j61J74J62k6k8k3j60J8j82K23j49J95k11L78l31K2J54J5m6j95K03j68
5585a54k4J46L9j48J96N8j40j6L06m85J75L2J3M08l17k11J57m32O16l34o6K94
5607A13j37k69K41K34k69n7o0J53Q3P7J04j79n4J73j73J17p9j19J07k5%K97J4
5630B92ol62m7K50k17J44K5j32N9K8m5J28k89K04j78l7J29j78K34j79K64k33J46
5653@Q2q2j34K31j06N2k01J47j77K02J04l64K50R9j82j4K47M7oJ7k94O8Q3k96
5677b27O0n9K97j78P5mL8j28j61K81k54R2K35k94M37n8j27l7J47j77J75k66K03
$$ y = [-84, -105, 177, 120, 133, 79, 162, 82, 230, 38, 108, 148, -173, 31, -5, 64, 77, -87, 17, 235, 112, -16, 134, 183, -101, -27, 76, -60, -239, -234, -263, 119, -26, -161, -14, 29, 376, 105, 62, 91, 4, 107, 102, 184, 112, -232, 53, 53, 209, -72, -18, -179, -5, 157, 131, 103, 80, -80, -62, -244, -21, -170, 25, -186, 192, -139, -117, 37, 52, 6, -189, 14, -154, -178, -32, 7, -141, 55, 113, -27, -43, 263, -222, -47, -15, -2, 406, 89, -122, 35, -397, 219, -115, -181, 113, -24, -293, -52, 182, -87, -144, -204, -51, 32, 109, 213, 34, -20, 153, -20, 97, 18, -101, 6, -19, -19, 278, 292, 286, -76, -123, 127, -90, 54, 79, -53, 6, 34, -11, 117, -172, 32, -146, -183, -54, -232, 2, -177, 87, -146, 0, 82, 0, -134, 97, -9, 43, -158, -11, -188, 14, 118, -246, 4, 103, -79, -93, 154, 201, 195, 212, -82, -14, 69, -227, -167, -226, 71, -107, -32, -36, 2, -126, -287, -6, -260, -168, 67, -227, 210, 152, 25, -12, 135, -42, 133, -133, 70]
5700G0l0Q0k04J88l37N30j69j11J56l6j42k7o0Q1qj0m5K21j49l6k6QL6mPl9J81
5727A25J0l03K28J03j00j06L7o6k4N4K22j47j8j09j27J62o7K4J84j34O8oJ3M3
5751F6r0n6n1K91j08p9l2l9J14j32L28j40l1j04j69Q7Q1J84l85K3K27n9j01K88
5775A13O4j20j59J21J39k73K17r1k06K32k39L19k24J49J88j97q1j53J3M04m34
5796b18Q9J32R2j4j9J70r4j76Kk68M15k77L37k30j45J86l6k66K32N5k5QQR2R2
5821A42j76n6j11L91k13O1L2O1k59n2P9pk3L0j10K33Q0j58L4J32m59K27K19r0
5845Gn2J5k3r7M06l15R6k55k2M10l04K78O5j56j83K32oj11L1k00K07K19n05J82
5869h1QJ97j56k1oR9J12l18K01j15m8L44p9J0l32J81J79k1l09J65Q3m5N4l67J73
$$ y = [70, 40, 120, -84, 104, -233, 297, 128, 17, 173, 137, -5, -32, -92, -11, -19, -29, -74, 147, -2, -38, -64, -56, -20, -24, -17, -56, 125, 135, -168, 60, 163, 63, -43, -6, -72, -96, -42, 180, 33, 15, -94, -221, -59, -126, -102, 82, -52, 16, 10, 23, 66, -24, -80, -131, 160, 52, -27, -59, -98, 16, -116, 212, 72, 41, -63, -232, -145, -64, 120, -265, -242, -15, -74, -175, 113, 177, 57, -102, 19, 158, -115, 102, 11, -195, 37, -202, 117, -107, 42, 230, 33, -48, -201, -188, 216, -218, -129, 3, 95, 81, 62, 232, 138, -38, -36, -304, 111, -166, 171, -59, -204, -18, -54, -320, -88, -33, -58, -50, -42, 50, 142, -34, -90, -201, 190, -23, 38, 70, 131, -128, -180, -101, -108, -131, -101, -211, 22, 102, -56, -22, 110, -349, -122, 97, 7, -45, -30, -53, -150, 256, -59, 37, -218, -240, 170, -134, 144, 209, 53, -130, 102, 96, -15, 16, -184, 23, 242, -263, -81, -73, 124, -32, -53, -59, 40, 152, -166, 35, -80, -128, 216, 137, 147, -185, -4, 175, 154, -155, 10, 93, 48, 102, -265, -92]
5894i2J13j03K0L14l00Q1J59M6k97N2Q6j16R2p0j46K19RK2J86j31j07q5j64M01
5918A89o7k65J59Nk4r1Q9Q8K20r6l35moK59L6k93L5lM9J54q9nK3m8r8J60p7K49
5946B14j70j27j10J50k5J29j4j68J99p6J22j49po6o5K75l35J85j27N12l43j08
5968a04m1J92P4l16J88N6L9J53k48m4Oj09Q8K29j24j47K10l56K87m6o5J30j74
5991a22K52o1M2k25J97o3r0O6j74L99k60R7M1Rk49R1K61j59j9j6J47k71K50k96
6015a53L22n3l57L49j90qJ18j10L8j73J58K14l26K42j39J8k05L21P2l37NJ30Q0
6038A6k25K40j95K1J50j50J19K27m43L80p1R6l07K82q5k33J92j40J57O3k90R8
6060i8L73l51J8j44K5K03Nm4j38J53K99k98K91k66j17Q7j65k45N18j02j07p2K71
$$ y = [-92, 21, -82, -62, 252, -48, 33, 192, 238, -59, -7, 79, -37, 55, -15, -161, 58, 67, 89, 275, 144, 37, -48, -212, 189, 122, -143, 16, 21, -3, -94, -5, 83, 303, 207, -128, -132, -138, 121, 157, -136, -101, -104, -55, 99, 10, 5, 28, -20, -118, 42, -35, 214, 44, -83, -193, -43, -68, 61, 47, -121, 78, 2, 124, -25, -32, -98, -163, 112, -223, -38, -165, 347, 4, -104, -145, 47, 121, -195, -7, 49, 88, 241, -7, -51, -45, -154, -66, 163, 39, -108, 102, -254, 33, -13, -78, 52, -122, 130, 69, 111, -114, 83, 20, -70, -4, -178, 221, -39, 58, 99, 108, -141, -50, 211, 52, 33, 17, 164, -107, 143, -153, 169, 116, -241, 108, -82, -90, 28, -82, -44, -217, -59, 155, -171, 71, -68, -50, -255, 66, 138, -199, -194, -64, 16, -209, 31, -164, -143, 7, -143, -24, 203, -240, 140, 69, 165, -142, 140, 55, -178, 14, -126, 31, 94, -196, -98, 275, -76, -58, -202, -177, 26, 31, -13, -151, 2, 301, 3, 294, 28, -89, -2, -167, -412, 106, 4, -103, -175, 96]
6083I6Qo3l1P0r9J14N1P2m6k01J97l29J18J38n33K44K33r1J23J38k48K7J60k47
6107i9J19P6N6R7n9j17o9r6L10k43%L70l58j47P9j4n9K79l2k15J33L2R1j27l1
6132b4j67J31o4J04J1J16j18N8O1J70j17j70n2K62j89jJ34j77j49J47Ko2J20P
6156C3k06j07K92r4J59k4l8j1j68J25kq6j24L42J4k37K20j9J3j05M1M7j71k29
6180c35N51k95J68n6Oo3rO0k31L21j84j26J51O0k67J03J40R0l6l4N2j77L5K6j34
6205a84K00k5Q2P8k69M9J59j2Pro9rO6P7k2n33K68k33M77J20j17l87K07J19J7
6230E7p7N5K82j08j50j03n0J49j94J84j79Q4q3O7K49p9k33J03j02oL11m1j78P9
6254C7k8j56K06l4K7n3j46j05j15N96L5l23J85J38k84J64j04j31K36j70j03l4
$$ y = [96, 104, 41, 10, 80, -19, 95, 146, 218, 172, -29, 168, -161, -43, 95, -438, -194, 39, -52, 71, 209, -39, -12, 148, -99, 20, 96, 152, 249, 190, 73, 4, -92, 218, -25, -25, 345, -13, -160, -81, -95, -154, 125, 93, -122, 11, 43, 134, 7, -24, -191, -60, -124, -20, -9, 107, -11, 47, 108, 278, 161, -9, -61, 201, 12, 11, 145, -32, -181, -34, -32, -94, 26, 33, -173, -280, 12, -82, 77, 53, 15, 4, -164, -39, -41, -127, -251, 91, 105, -132, 88, 69, 82, -23, 18, 65, -106, -335, 216, -79, 89, 33, 39, -24, -33, 27, -204, 117, -67, -193, -42, 18, -249, -146, -6, 84, 48, 14, 66, -111, -76, -50, -184, 16, -9, 73, 151, -118, -69, 90, 78, 85, 76, 7, -2, 64, 141, 119, -414, -146, -379, 98, 218, 101, -286, -79, 40, 57, -20, 35, 317, 209, 59, -44, -94, 55, -139, 45, -134, -50, -133, -66, 183, 104, -129, -26, -128, -134, 177, 136, -42, 37, 9, -147, 59, 25, 52, -1, -147, -252, -367, 229, 264, -59, 126, 264, -20, 144, 40, -91, 145, -25, -128, -162]
6276a62K87J12N4j28j73J73k8N2k12J24j39M8K7l5o4n8O9M9l6K85l80j08M61k45
6300b7J94j89M0M7j4n4O0P1n2k0k35K70q3N7m2k8J02m42M08N0k08J70M8l12l7
6325b26L18j87m7J81j76j21M46k37J08m9J2n8k3J30n5j40L19j60J82k43j9K27
6347A82q1k83L0R3K2K19l73J20N3J03m0j08J64O8j16j97O2J04k89J49K39l57K01
6370c5J35j07K50l37N0J90k37n8J2M5P3l4K3k19Q7K22j08N5j38J40j23O0J36k89
6394b07K74j83OJ1O4l8J29J87l23J19j63J33j28O4n1J30K6j79O2j02K69o9L5q2
6418a6K17k14J09k47O8Q7j16k31L98j30P5K53k44O2K7O0j89J57j20J76l00L57
6440B39j68m1j94Q2J82j30NL5k47J95p1L9J17l2n4L35l93N2l7P4k3P6j39J08Q3
$$ y = [-162, 125, 237, 291, 163, -10, 163, 135, 187, -25, 99, -40, 8, 35, 0, -64, -122, -53, -4, -40, 245, -135, -243, 218, -27, 167, -22, 18, 65, 51, -3, 57, 128, 76, 56, -179, 91, 8, 65, 23, -5, 97, -345, 63, 113, -95, 75, 123, -189, -226, 92, -95, -142, 39, -137, -258, 188, -49, 59, 10, 22, -36, -59, 71, 16, -124, 195, 35, 217, -26, -45, 182, 101, -182, -152, -59, -37, 182, -191, -71, -18, 85, 45, -63, 101, 169, 53, -144, -82, 22, -267, -118, 121, -236, -35, 100, -7, 243, -94, -44, 146, -91, -149, -137, -92, -19, -53, -30, -249, -162, 60, -48, 7, -131, 9, -114, -54, 82, -207, 67, -116, -110, -99, -35, -73, 56, 243, -80, 39, -124, 9, -119, -55, -106, 24, 50, -129, -67, -169, 100, 31, 66, -16, 201, -13, 96, -151, -83, 4, -112, -343, 55, -75, 0, 253, 9, 71, 98, 158, -31, 126, 6, 182, -118, 239, 71, 30, -164, -82, 100, -30, -25, 10, -237, -42, -113, -74, 43, 11, -43, 292, -101, -49, -86, -12, -35, 41, -98, 10, 93]
6465I3%Q6j97J36k46J23L67j54k10j52K48K38l17Pj86K17j13J08K95m86J17j13
6487a39J77P9j58K97m1k79J01Q6j60J72m49N10j75Q1J76k37p1K52j62j19O0j1
6509a0j67R8k6J36j3j99J13J06j44j12M34k95K25k30J31Nn7j8j54M19j42J17n44
6532c27K79J04q0J28j33J52K57m72J76j61j51K35N8L0l52K82k35K7J99p0J32M2
6554A20L4k00j61P2N6J31q8J67j73j97M46j3j91J08l80L94m79K58Q0pl2j01p5
6577b31K88P1J6j24J9o7P1j54N3J20j9j76Q3K77k60J08K80k84J75m11J09J62j61
6600e5j32P3Q6j1M4j41Q2k29L62j4Q5j79j3J30j63J00J00k6k12j3K01j24p1J14
6624fk16K11J04o1k41L81l9n2k10p6M80k32j89K32L8o3K0o5J38l91L74m75L20
$$ y = [93, 93, 179, -18, 118, -128, -5, 362, 208, -2, -154, 94, 332, 15, 22, -164, 53, -60, 48, 343, -143, -26, -139, 38, 117, -41, 256, 215, -64, 37, 123, -37, 135, -314, 196, 21, 102, 278, 41, -30, 222, 60, -59, 1, -10, -177, -79, -105, 31, 18, -181, -68, 38, -106, -218, 216, -79, 146, -84, 47, 52, -5, -23, -177, 242, 100, 217, -327, -48, 56, -24, 104, -29, 123, 380, -92, 84, -77, -228, 7, 65, 95, -257, 25, -210, -183, 16, -54, 78, 120, 154, -46, -207, -135, -79, 52, -36, 131, -42, -239, 207, 194, 3, 111, -269, 125, -354, -96, -16, -23, -55, -156, -231, 57, 128, 144, 20, 39, -28, 43, -111, -58, 62, 43, -133, -50, 227, -33, 75, 355, 71, 246, -165, -56, 106, -55, -187, -114, -28, -39, 5, -136, -54, -283, 79, 65, 150, -29, -42, 88, -75, 25, 125, 99, -113, -126, 75, -49, -120, -6, -222, -11, 93, 32, -209, 172, 133, 81, -129, -205, 275, 43, -146, 86, 124, 61, 81, 16, 154, -237, 137, -338, -18]
6647a8o7J76J94%j29k42L6J54k33J17J07q5K67l76P8P2p9J44k98J13JO1K72m70
6671b05M01k97L97m49J81j53R4K8P8l04L40k3q9J21k7j42p8N5K1m9J07J4o1J84
6695A44j67M0k00J93jj07K55j20n6j65J33J16k9j1k14M34k37r9J08K43j83o7N3
6718F3R8o1j62J13J19mk14L5O5k42K51p1J65J30k10Q5k37K40J61k75j79J14K13
6741A97k57lk64L67O2Q0n25M35R3j60j1J05j09K56m14rM21p5m13J28J09K47Lk62
6765AP7j21j8N1l3k03j7M9n8K22N3J7k10M02k3l40K82R8m19K76k91J33J99l42
6789b15K70k74K22J72k70K29j19O1N6k34J96l09L74k48M5Lj10L51j71O2k39NJ80
6812C7M4m8q1NJ01m13M76j55K1K22k39Q7pj9P7j75j86K22K04r4q6k24J93pq0L24
$$ y = [-18, -85, 91, 285, 285, 156, -86, -50, 104, -129, -12, 95, 10, 277, -99, -21, 51, -28, 116, -182, -69, -68, -7, 265, -205, 196, -101, 296, -153, 28, -125, -31, -3, 75, -229, 111, 88, -1, 120, 93, -49, -127, -72, -51, -100, 7, 21, -40, 144, -23, 17, -183, 10, 9, -98, 157, 37, -19, -184, -51, 65, 36, 25, -189, 245, 8, -91, 17, 260, 77, 10, 63, 161, 100, -62, 51, 170, 166, -48, -13, 52, -190, 61, -10, 155, 285, 75, 160, -77, 163, 324, 49, -130, -16, 197, -60, -63, -327, 40, 102, 182, -343, 92, 185, 25, 14, 119, 10, 266, -148, -157, 264, 189, -224, -96, 13, 260, 263, 1, 78, -43, -61, -10, -43, -246, -263, -214, -272, -50, 3, 20, -190, 212, 189, -151, 131, 229, -190, 86, -205, -72, 127, -215, 55, -219, 3, 175, -95, 134, 15, 76, 132, -102, 94, -215, 159, -89, -44, -41, -151, 200, 29, 91, -148, -143, 37, 81, 33, -48, -43, 58, -355, 121, -34, -13, 209, -30, 57, 50, 31, 108, -67, -253, -31, 173, 79, -7, -231, -38, -45, -125, 199]
6838A99m02L44O0l06r1J36J00rJ18O5m08K60k09J81N9j13n2L10q0j08j65Q7j14
6861a38K25l13J75j2j77K20j30l4j00J97J82J36k44M7J61k31O8pO0j69NK19j74
6884c4J55k26J80R4q4K95n32L4J53pr4m9K78j64O7M3q1n9j92J70m4J53J58l68
6908a54J31k60K67J86O9k83o3o0p1K71j12mM61o02J96m2J77j9k95P0J17J97k51
6931g4j14P1J00J44k09l8M0P8j95K68J63k64J87j03Pj08K15k14O2k55M19k43j47
6954b10J07J08L7K72k26l09N53k16jj80O7J6K9l5j63N7J23j20m0K8L16n3k00J3
6978b7L00k68J14k30K41k8k40J13K82n30K33p6M6J08j38Q2j47K63j75N2J80k33
7000g8K05l81M12l1l75L60j62J41M8OJ68m30k0J14J63j47K92n8j34j91J25r9N4
$$ y = [199, -203, 141, 201, -105, -196, -60, 40, 31, 149, 214, -194, 66, -143, 38, 97, -16, -68, 242, 162, 54, -111, -24, -138, 87, -226, -51, -63, -240, -20, -150, -184, -284, -87, 95, 231, -13, 34, 195, -36, 32, 25, 85, -84, -79, 140, -34, 121, -105, 75, 169, 85, 380, -152, -118, 35, 28, -66, -115, 163, -1, 66, 109, 28, -31, -223, -53, -97, 56, 214, -154, -23, -283, -16, 170, 239, -44, -107, -167, -238, 33, -79, -83, 378, -224, -28, -70, 107, 88, -207, -137, -20, 177, -74, -188, -117, -17, 127, -82, -120, -80, -2, -197, 71, 234, -30, 157, 54, 61, -47, 168, -46, 16, -239, 180, -63, -210, -103, 5, 42, 314, 88, -221, 332, 116, 115, -65, 2, 18, 47, 12, -151, -94, 29, -91, -131, -103, 213, 160, -40, -27, 273, 5, 119, -111, 130, 102, -138, -25, 257, -273, -40, -116, -70, 38, -100, -18, -165, 98, -77, -25, 155, -78, 127, -254, 158, 127, -248, 112, -50, 91, 139, 145, 313, -117, -137, -23, 140, -7, 285, 227, 93, -98, 27, -72, -18]
7023a8K82l39j3J93N4j98j07L6K28k70L77o5k58P0q1M50q8n13L07k2j7P0l70K00
7047i2K34J4m44L28p2J04j88J15l3R3J47k99J29N2p6o6J35PN1k91M8R3k79N38
7071B48l3j38j15O2O5r3J52k14J57l65K77j15J66K9l01K47k56J34L8j31L17j52
7093b1j82L11l02m0J25O4jJ72o2j13j08J51m7O4K9k26J01J98K2o1q3J23J76m0
7117B50k94R1K30l21j2k1J49j1Lj59%l1L2m0K6J90j8M1R7k68K01l31J10n2K35
7142I7k1j67P4M5J42l89J81J21l52L09l1j20J46Pk17K75k41K44k00P7J63j64P3
7165E2j6n1M6K38l60K92j81l0j55M14l15k72M14j06J63m55L40j74N8K3J0O6j34
7188a33N7J00l6q0J76O1m77M05o8j05k8o3L68L1M1j56k25j55L66j18K25k52J84
$$ y = [-18, 264, -75, -88, 105, 159, -39, -146, -110, 118, -152, 225, 160, -98, -28, -109, 341, 253, -260, 47, 25, 8, 78, -292, -92, 142, 156, -288, 40, -32, 72, -116, -1, -34, 59, 206, -93, 36, 88, 12, -54, 81, 88, 139, -152, -104, -11, -290, 248, 215, 77, -38, 24, 89, -4, 148, -66, 91, -274, 3, -112, 54, 83, -218, 29, -227, -93, -55, -186, 131, -21, -203, 108, -194, -234, -109, -45, -46, 126, 64, -49, -157, -6, -53, 11, 40, -186, -85, 113, 135, 74, -9, 114, 290, 250, -44, 47, 277, -44, -56, -77, 72, 61, 64, -95, -95, -126, -94, -134, -108, 82, 64, 105, 202, -66, 135, -196, -86, -138, 97, 76, -91, -17, 28, 170, -219, -38, 83, -269, 40, 9, -111, 35, 42, -175, 100, -141, 103, -97, -20, 143, -21, 52, 36, -15, 31, 269, -91, 201, 20, -10, -165, 249, -66, -338, 76, -30, 133, -322, 18, -156, -98, -75, -65, 1, -133, -76, 24, -12, -92, 84, 145, -332, 73, 5, -100, -128, -191, 177, 208, 249, 93, -132, -287, 79, -39, 186, -66, 118]
7211A18j29J39o7Q1k76J97l1j22j27J76J25r0J32j98L4L1J03n19L29J02p0J59
7233I7o3q0K79j66j6R2j16J07j26j16j02K79j26j6k85L33J56k27P4K31m09L30
7255A30k97R0j8j56R3L04j75j68K38q1J16q3J12j85j31J87%k7rr0L30j65j09L51
7279B57l76J05Qj9k12M12j62l20J54K74J0k04Q9l7Q3J40j93r3p2Q0j5J14K17l92
7303a52K67k94J18J42l02J72K58k49K8j85Q5K11k00J97k1k54K6J31R3j54J7j09
7325a75J85q6J19j5M9rj93J45j67R1k2%J51j48K11p1o6J48j46q9L77m59K21m8
7349CJ78n1m1j45P0L2K9j50J66j48j97L11r0K13r5J41l59J16P2j40KJ49k0K03
7373B49k71J48j29q2J9p3lK15j24K08m2k8o0o9oL90m10J2kLR2m9j58K83K70m23
$$ y = [118, -11, 128, 61, 142, -134, 63, 32, -90, -217, -41, 84, -6, 126, -72, -38, -7, 96, -423, -94, 8, -62, 97, 34, -46, 233, 67, 51, 143, 27, 134, 8, -108, -210, 69, -57, -73, -358, -25, 131, -96, -22, 209, -200, 130, -167, -77, -95, -251, -158, 146, -29, -197, 41, -40, 76, -7, 105, -80, -211, -24, -24, -51, -60, -150, 180, 15, -94, 257, -119, -14, -6, -25, -237, 175, 13, -307, -153, 121, 131, -73, 16, -21, 62, 202, 9, -84, -156, -76, -91, 23, 240, -152, 115, -179, -61, 81, -221, -49, 209, -40, -12, -197, -112, 99, -101, 96, 75, -179, -153, -22, 71, -83, -66, -175, 10, -76, 43, 28, 77, 68, -125, 20, -147, -56, -78, -78, 73, -75, 136, 65, -1, 147, 1, -88, 289, -170, 51, 3, 181, 130, 89, -56, 14, 46, 75, -75, 91, -57, -254, 57, -33, 180, 85, 226, -133, -17, 55, -85, -83, 66, 46, 249, -22, 126, -3, -85, -66, -139, -142, 73, -51, 157, 115, 87, 27, -42, -48, 342, -68, -56, -58, -55, 37, -12, -170, 113, 383, -40]
7399d0L22j07l21L66k24k40M09k60J11P0j40J30k37R6L09m52J81J49l79K42rj33
7421a57k9J33jK15K43l17q4k68L94j28J23j45k8J78j52J23j43QJ60K8m20L91n2
7444G2j2J20n0k65j12K21n9J19q9Rr6J01R5J83kl69L26l02L08j05k49K09j11J78
7468A20J47l92J32l70K37K17%r5J01q1r9k17J83J86q7K37k98K17k33m0J00k48
7490b83K99l4n8K31j61Q5O1P4l25M50l96j67J24K19k36L03k57L2O5j70J4K45k45
7513a30K53k03J37Kj26J85k34K16J70l03K92k59P0o0k53K44k9K19l95P6L2L09
7535B13k25J35rn3r5j00K80m27K27J14L8lo2j00r4L20q7j95M2j25K32k72J35R8
7559a3J76l99L33q2n5K39j90M8j5J9k19n0K06j21L23qk45L07j52j77J3o4P1n8
$$ y = [-40, 282, 175, -146, 220, -4, -244, 165, -95, 16, 86, -54, 76, -161, -65, 244, -208, -27, 122, -257, -15, -24, -157, -186, -53, -54, 161, 404, 87, 3, -265, 129, 1, 124, -21, -49, 129, -23, 100, -43, -35, 125, 153, -267, 124, 72, 60, 180, 130, -135, -247, -26, -85, 34, -55, -46, -142, -41, 54, 237, 235, -134, 192, -110, 198, 93, -156, 53, -58, 120, 267, -125, 7, -363, -126, 91, 91, -4, 97, 16, -83, -300, -117, 69, -18, 219, -79, 138, -95, -135, -35, -283, 16, -18, -76, 155, -6, 79, 140, 214, -111, 339, -57, -224, -100, 119, -117, 186, -71, -39, 26, -144, -130, 115, -130, 123, -80, 57, 59, -67, 118, -116, 100, 270, -33, 259, 0, 70, 10, -243, 1, -28, 191, -204, -128, -96, 213, -12, 123, 114, 61, -34, -134, 146, -281, -54, 60, 98, 95, 33, -67, -161, 159, 72, -123, -81, -206, 26, -246, -111, -13, 163, -236, 97, 15, -40, 199, 9, 57, 42, 61, -158, -208, -2, -123, 200, 192, -53, 254, 102, -75, -62, -126, -55, -113]
7583a13j14K92m0J10k69JN4K73l48P3K02j90l1J14j42Q0J03l4j79R1J86j80J46
7606H5q0LJ28o7q2k49K39L13r3j29K37m41J79L12l20l8M0j78K10L5j27K05k95
7629a13J01O8o6K30k83P7J86k72r8K27q9N3j44L3J30q7K40k00r6j09J07J48j48
7652a05K02j15P4J67M1j99j76K25j03K86k92j16j65J24J19k65K41k19J67Q4O0
7673C5qq0J29k72n5K06N3k6pR2p4j31J13M4j8r1N7j19K34j24k00M20k73j2M04
7698B97j45L6n75L25L81l79J7J29mo5j68k38J45R3J4K28k82M41k46j62K48k03
7720a13K0J15N9j14j12J70l74N28j05j02pJ26j95J66j62R9k0m1J86j20j18J7J48
7743E1k4J85k20J71k75r5J67j06K25L0l48L89p7L2l6J7MJ03k43n7L72k18nj14
$$ y = [-113, -227, 65, 25, 135, -134, -133, -79, 194, -154, -81, 121, -69, -100, 14, -128, -48, 55, 21, -158, -67, 119, -61, 85, 5, 8, 136, 69, -13, -262, -23, 290, 197, 68, 305, -136, 43, 355, 35, -3, 37, -141, 69, 104, -23, 182, -113, -12, 56, -10, 220, -63, 14, 200, -72, -170, 57, -32, 21, -123, -90, 40, -47, 193, -7, -103, -212, -105, 43, -105, 97, -18, 56, 223, 264, 65, -111, 114, 11, 297, 5, -111, -276, -152, -33, -298, -57, -276, -109, -25, 35, 27, -53, 76, -196, -251, -45, 8, -18, -25, 67, -7, -138, -25, 19, 1, -90, -33, -152, 82, -42, -242, 178, -95, -107, 297, 152, 188, -387, -62, 319, -60, -43, 86, 82, 17, -151, -389, -244, -151, -137, 91, -191, 250, 4, -158, 90, -113, -93, 22, 81, -33, -145, 25, -349, 179, 74, -28, -35, 91, -104, 62, -100, -1, -21, -62, 124, 4, -114, -97, 51, 27, 212, -8, 163, -112, -207, -40, -146, 79, 109, -239, 150, 73, 105, 69, 86, 90, 193, -50, -107, 265, 47, 42, -72]
7767g2n5J01r3l6J12Q7j86Q5m3K61J0k05Q3J42k31M9N7j61L07j34Q3k96K60j57
7791c2Q5%Q9r0q9k1J30l9K05k58j49K05J28k0m78L32J62j51j92J63m5K09r6P1
7815A19r7J82k54n4K42L13m69O0J30l53J42K65j07n2j67J45j05l4q2K93q2J15
7837A50j20l14K46k09J83L73k78L3j20K1j09K02k15R7L6k8K45r8K5l46M26j41
7859E9j48R9J48j14o0k85N91m34K17N2o1l9L2j26R3j98N4J09j07R5R5j09j39J90
7883A4P6k13K21q2k39K44O0J16m11K97k8j67N0N0k31J12K24l8K6j29K8J03J10
7906A93l46o3J48L6K41j21k23K99l50L88l55J72M9l14N09l01n3m2J85j7k42K20
7928A3k97L73j99K53l15j45N21k01p2J96J5j16rn5K03j63j27qP6J05j18q7K38
$$ y = [-72, -127, -26, -119, -155, -43, 44, -142, -57, -100, 161, 171, -34, 49, 191, -40, 9, 66, -95, 212, 78, 161, -135, 125, -32, 53, 53, 142, 52, -37, -58, 72, 33, 238, -20, -169, 36, 164, 144, -334, -2, 160, 9, -183, -20, -65, 144, 48, 119, 22, 204, -50, -104, 138, 451, -18, 42, 172, -181, -39, 226, 119, 67, -100, 45, -60, -94, -176, 117, 35, 150, 30, -284, -38, -247, -64, 309, 31, 64, -56, -35, -144, 58, -157, -60, -24, -52, 193, 95, 120, -226, 200, 59, -89, 10, 158, 44, -16, -301, 290, -144, 73, 125, 64, 25, 57, -69, 24, -174, -120, -11, -118, -23, 72, -37, -176, 14, 90, -123, 98, 16, -223, 21, 81, 197, -214, 83, 55, -112, -62, -12, -243, -131, 93, 55, 81, -48, -20, 83, 193, -153, -216, -68, -32, 209, 88, -135, 164, -186, 202, -153, 19, 68, -246, 263, -38, -91, -133, 52, 35, -207, 13, -284, 89, -110, 143, -172, -317, 204, 3, -69, 127, 142, 26, 17, -38, 165, 2, -125, -133, -57, 48, -70, -157, 81]
7951H1o0j86J51j6K9p7j5K4J80k0K1j16J22k51P8J3k42K06l3J71j95K93k02rN5
7976BJ14j67o4L20j51l05K37m1J34j54J95N8l95L66j00k08L73j17N2r8l13N90
7998C28n46N4K55P7l00J27p4J7O6j72J87pm5q2J22l0JJ2J44J38k09j54J73l53
8022b71L64jj02l9m5j67M39r7L2l26K12j33J40n0n3J56j47J13K8j32Q7K41r5m0
8046A14k85P2J18J44p3l5J75j78j58P5J5j21Q7Nm7J09j34J03j65M2J37j46RnJ38
8071dk43J96J42K4j95K30k06J09mJ15k50N0P9J24j64n6Q1k34K58R4O7l36N2j79
8095b50J35N6o0jJ81j4P5K0k61R9Q9o2j1jk42J20M1J58k46J06lJ77k36j0J75j7
8121A8k75L15Nj97K07j03R0j14r8K39q9r1L2J95j4o6J52k18J8m8m8M1J06r3M4
$$ y = [81, 21, -165, -14, -30, -1, -78, -93, -69, 111, 91, 112, -4, 118, -133, -55, -42, -284, -78, -111, 60, -135, 158, -44, -53, 2, 116, -51, -115, 205, 54, -251, -14, -55, 79, -75, 120, 178, -217, 149, 49, -159, 214, 97, 149, 51, -262, 328, -218, -164, 91, 168, -132, -5, -79, -62, 4, -168, 19, 12, -33, -115, 7, -23, -22, -10, 134, 272, 63, -91, 82, -271, 93, 92, -10, -49, -94, -261, 178, 81, 113, -213, -1, -134, 6, -44, -97, 59, -88, 25, 53, -79, 8, 249, 154, 114, -171, -99, 19, 163, 90, 55, 230, 52, -106, -31, -16, -137, -50, -45, -92, 17, -117, -14, -179, -137, 0, -146, -137, -142, -4, -247, -51, 91, 115, -80, 150, -56, 53, 49, 164, -86, -36, 43, 167, 3, -53, 28, -206, 52, 146, 213, -123, -71, -250, -115, -59, -119, -120, 61, 47, 122, 142, -119, -20, 69, 7, -4, -5, -247, -127, -86, 72, -174, -68, -71, 106, -130, -140, 35, 18, -257, 58, 63, -134, 73, -30, 60, -54, -152, 87, -2, -93, -61, 134, 120, 54, 206, -12, 6, -42, -90, -49, 57, -36, 8]
8146Hr9p7K42j56J70q1Q7j53R4l1J43k57j31O7j8K02J45j10l8L6lk97K85r2l06
8171c70M22q6J99l10K74J0k84QJ84j43N2J9J61l25m8K02k5J80k38J22
$$ y = [8, -91, -168, 74, -82, 88, 7, 94, -59, 35, 4, 147, -110, -241, -174, -192, 10, 155, 45, 7, 43, 40, -257, 28, -64, -370, 52, -34, 165, -145, 129, 139, -145, -137, 47, -96, -44, -25, 136, -189, -237, -35, -60, 120, -118, 4]
8191D
$$ Imaginary data points
##PAGE= N=2
##DATA TABLE= (X++(I..I)), XYDATA
0@%%%%%%%%%%%%%%%%%%Mj2J6j6J6j6J7k5L2l2L8m6M9n7O6p4Q6r6J06j19J33j48
40g8J65j84K04k26K50k77L06l37L72m10M53n00N50o06O69p41Q22r12J017j143
60f06J293j473J699j991K382k941L802n327Q836l1663l20P0603K8448Q176n3n216
76G5649l4557k6260q517j0337j9275N86Q265l309l481J3613N454q536l775K799
90a1681r632q680J2258J9676J0164J5594J7985l216k1787j5950j2853j9404o850
103c4376J5176J4082M929J0338R112r684j3360j77j268r574K376J1884L35k223
117b430J1298Q968m052j76M274r992j7643n854r23n594N064J7903J1451J879L596
132A7769j49j3477j3686k882l125n929L818R446K543J234J0834R890J151L589
$$ y = [0, 0, 0, 0, 0, 0, 0, 0, 0, 0, 0, 0, 0, 0, 0, 0, 0, 0, 0, 4, -8, 8, -8, 8, -8, 9, -16, 16, -16, 22, -24, 25, -32, 34, -40, 46, -50, 56, -63, 70, -78, 87, -97, 107, -119, 131, -146, 160, -177, 195, -215, 238, -262, 288, -318, 351, -390, 432, -480, 537, -606, 687, -786, 913, -1078, 1304, -1637, 2165, -3162, 5674, -25989, -26309, 44294, 72742, 80918, 80865, 75649, 41092, 14832, 6315, -4022, -23297, -22711, -14446, -17755, -21236, -7623, -2169, -10705, -14480, -11681, -21313, -29993, -17735, 1941, 12105, 27699, 45684, 42468, 20681, 4731, -8122, -27526, -34376, -19200, -5118, -189, 10149, 19261, 9577, -3783, -3960, -5228, -14802, -12426, -542, -207, -2430, 8868, 17836, 13784, 13608, 17882, 7890, -9753, -15607, -16530, -22124, -17060, 843, 12294, 14173, 17769, 17620, 4143, -9543, -12425, -15550, -21479, -17661, -8215, -5672, -4438, 6396, 16286, 17437, 21026]
146B1026N040o079j3520p974m695q654q95R975O673j96K592J405q548p335K403
161h782K392P6N856P872k173n545k66k210o186R71O641K684J023O483N808j154
177A3490L51K927l758r192o383o234r229n054M027O666M980P824Q307M15l472
192E665n65j238l799K9M005J021k523Q3p83m538k726K217K35k023J189J921k142
209c972j350L673L035N88L690L585p03k791o8r32k531j059O67j955m075k333k055
226h586k996k92M054L346K857L396K724m89j024O39R00j146L2P09j584k576o09
243f45K72p3J057K799P94j309r70j089l250j783O71L38n99M10L75j133m04J538
261c001J538J919K421J729j01j463r91j345j145L56Q17O70K58Pn60p81j01L78
$$ y = [21026, 26066, 19987, 6467, -1507, -6202, -14856, -15751, -5776, 897, 701, 3293, 4698, -3850, -11185, -8782, -6390, -6314, -458, 7414, 5241, -304, -570, -2780, -8966, -7995, -1354, 1330, 2353, 8836, 14644, 13490, 13841, 16768, 13010, 3818, -2565, -8799, -18028, -23082, -19055, -12389, -7409, 415, 8722, 9137, 5665, 5100, 3862, 63, 92, 4097, 5118, 2595, 2678, 1895, -2643, -5369, -3152, -2917, -4940, -3751, -1830, -3972, -5322, -1649, 1386, 1974, 5664, 9249, 8546, 5755, 5687, 4755, 2224, 1165, 1832, -123, -4198, -6531, -8586, -11582, -11874, -7820, -4474, -1617, 1779, 4503, 4014, 2990, 3629, 4529, 3383, 3415, 4124, 2540, -36, -645, -373, -446, 611, 3410, 4204, 2895, 1925, 836, -2414, -4197, -3526, -3188, -3787, -3377, -3002, -4135, -4539, -3001, -1463, 456, 2877, 4606, 4505, 3042, 2051, 706, -439, -83, 734, 1404, 1662, 1669, 1109, 328, 227, 605]
279F05K24M45l00q23j532j580j71L30P89J305J419J35m67o48o61o63L13R00K01
298a79m68l12j05l35M99J705J491J550J022j32j315j641j247j143l27L47K14K80
316i6q4k64o97o79k93r7m70l90j44L80Q91J073K124J949J134l75j344j904k412
335a698j228k83J330K240K555K242L89o27j644k674k562j441n63j30J209J795
351a090J350J474J227l51j469k363k409k305p69Q66J991L480L505K951N52p57
367E883j932l197l139j259M96J809K240L143J789Kq03k173l375l967j646r63j28
384g220K090L793K874J973J467o85l164l697k516k023q28K272M481M181L650L570
400A0218O00k227l008l588m051l433p58P31L44K333K772J931J94j3p18k760k629
$$ y = [605, 829, 1274, 974, 151, -1381, -2961, -3132, -2802, -2013, -708, 711, 846, 379, -269, -930, -1593, -1280, -380, -179, -647, -959, -1064, -1399, -900, 805, 2296, 3846, 4868, 4736, 3421, 1780, 533, -610, -937, -590, -376, -96, -180, -444, -1141, -1820, -2113, -2210, -2680, -3070, -3214, -2834, -1943, -870, 1254, 3203, 4337, 3962, 2618, 714, -1698, -2926, -3209, -1879, 361, 2916, 5158, 5547, 4920, 3276, 602, -1960, -3401, -3964, -4094, -2885, -1090, 260, 1734, 2961, 2610, 1141, -1222, -3631, -5936, -6705, -5839, -3848, -368, 3137, 6088, 6640, 5883, 3951, 754, -2385, -3644, -3148, -1339, 901, 4044, 5833, 5835, 5032, 2859, -516, -4483, -6129, -7092, -7220, -5130, -1337, 1537, 3510, 4977, 4292, 1128, -2569, -5085, -7108, -7936, -5664, -1183, 2998, 6648, 10218, 10818, 8591, 5583, 1995, -2056, -5489, -6247, -5516, -5172, -2839, -67, 1864, 2058, 2045, 1327, -1433, -4062]
417d062J35M87J006L263M236J963K02n45k779o021m650k147k192L8M394N253L559
434B140L949L847K06k775j558j395m023k194J398R45m05J797J022k246l698k091
450e081l463m163K80L651L997M432P354N200P30j087j650n541o868l423r47j885
466h464J488M828L317J088J876J950k194l414j45q77k680J119L162O91l32J710
482C123j82l936k714m04k141k321K595M106J469K213M627J280k005r91m33m582
498b96l839O06M81j030K654N017N93m70J140p11m802l229M09j365j644L350L742
515F06k06J13K619r58l984m50J483j706n45L802K098j389Q81K217k520l196J197
532F2q3l440q7L381N6r79K987K771j926l01K335n40l542r5K39l872l374N95n82
$$ y = [-4062, -3927, -3440, -2434, 829, 5065, 7028, 7230, 6685, 3906, -2115, -6765, -8912, -11104, -11066, -6672, -1419, 2140, 6089, 9936, 10142, 7367, 5809, 4414, 391, -1803, -405, 540, 135, 1932, 2954, 708, -2990, -5081, -8544, -12707, -12427, -8776, -4779, -347, 7007, 12207, 12937, 11850, 10200, 4659, -2209, -5632, -6579, -8464, -6976, -2148, 1169, 2257, 4133, 6083, 3889, 475, 330, -547, -3227, -2108, 1054, 1745, 1413, 3123, 2941, -995, -3709, -4113, -6254, -8575, -5980, -1874, -405, 1808, 6435, 7715, 5710, 4719, 4286, -296, -4135, -3529, -3048, -4078, -1424, 3593, 4186, 3716, 4856, 4145, -657, -3886, -3477, -4842, -6486, -3136, 606, 400, 513, 3132, 2174, -1810, -2260, -777, -2483, -3028, 774, 2872, 1483, 2364, 4581, 2061, -1135, 62, -21, -3461, -3548, -167, -111, -1090, 1897, 4668, 2742, 2441, 4776, 4236, 694, 599, 838, -3034, -6408, -5813, -6395]
551f395l507J494M321J261J470N528L612j179L35K316k160l905J61J57m371j805
567b667J195j769l733P07J784j455K88M933L288n21K699L660j826l194Q85j695
583B579n282j730J207k138k657K652K415j379J419N187J667r07K611K733k696
598E681k179J030j624m161k86J884k182j905K228j27l674o45K386o61n71M496
614c10M193l49J458L048k103m948j486j194m149j303L566J739J02L465L580j805
630C504j519O91j080l689L36K632n45l86L031Q02k921j439M07k892k864J010J939
647b983p57J437L872R78j636J013P00k516j431J475J01j352J661K377m54p16J632
664C401J17k598p84N80j918k128R10O96j285J111K362J22j332J277M76j681r34
$$ y = [-6395, -9902, -8408, -4087, -2826, -1356, 4172, 7784, 6605, 6940, 9256, 7096, 3191, 3352, 3509, -862, -2667, -1472, -3241, -6974, -6267, -4483, -5938, -5650, -717, 2571, 2050, 4749, 8409, 6583, 3389, 4274, 2579, -2703, -4433, -3226, -5364, -8021, -5369, -2954, -4333, -2914, 2273, 3940, 3033, 5644, 8377, 5681, 3502, 4532, 2908, -1253, -1539, 345, -1837, -3742, -1514, -1641, -5315, -5960, -3574, -4235, -4806, -310, 3883, 3534, 4992, 8040, 5937, 989, -497, -1691, -5840, -7143, -3577, -1838, -1736, 1729, 5309, 3504, 1985, 2676, 1596, -2093, -1757, 875, 330, -56, 2975, 3777, 856, -583, -176, -3068, -5932, -4922, -2983, -3740, -2303, 1569, 2547, 911, 1924, 2624, 108, -1323, 152, 253, -1099, 562, 2939, 2485, 1769, 3401, 3518, 920, 136, 716, -1202, -3330, -2420, -1724, -3009, -1898, 464, 586, -746, 531, 1007, -674, -1608]
681a608J059L61j346J380J653m28n08J130P9k087l17R42p45j53J662J241o81J85
699A819J330j475k028m20k52j526p17J463L66m41Q00J456n47l33N82Q1l91K7J084
718H78m40n11N34O57j184M62Q36l59k38O20P9n38p07K39l13q12J22J59R2l39P73
739A0k28m29o6O9k98p78O49Q28m18M87P67K53o28K54l3p19r3P17K11M53O53O33
761B294l07n30N5q99r61m63m73n06K43P22J69L24nKk43j014n54k16L14N07J197
782c44J425R09J136M21m43n72j442r18j325k22j30J98O23R84L88J82p0k60o16
801g6q41m27n76k28N32R25P05M43K73K23n22q1p66p5K6j49O48L91L38L92k40J4
823I29j85q86j8J6Q0N76K83K72M38j30m79n14j006q82o48l51J34M53R05N16P36
$$ y = [-1608, -549, -188, -1534, -154, 1499, 1071, 563, 1693, 1772, -315, -632, 310, -435, -588, 1074, 2315, 1634, 1819, 3149, 1674, -354, -774, -1026, -2552, -3269, -1806, -1440, -1881, -1081, 375, -172, -505, 77, 158, -233, -206, 878, 438, -73, 461, 1118, -66, 396, 1232, 873, 635, 1255, 1334, 796, 89, 328, 15, -797, -675, -516, -424, -763, 10, -218, -647, -713, -644, -942, -1720, -1071, -243, -661, -174, 593, 846, 218, 472, 439, -280, -373, 344, 555, 1008, 1661, 2294, 1987, 1457, 1512, 613, -348, -811, -1284, -1790, -1547, -825, -656, -332, -337, -335, -578, -1592, -2146, -2362, -2048, -1541, -344, 1081, 1990, 3126, 3547, 3104, 2532, 1090, 172, -1153, -1375, -1505, -1307, -684, 300, 688, 870, 800, 540, -76, -917, -1344, -1920, -2148, -1616, -691, 14, 457, 730, 953, 431, 350, -416, -491, -465, -614, 34, 425, 763, 1155, 915, 929, 744, -142, -160, -144, -64, 512, 795, 1067, 1505, 1375, 896, 382, -624, -1506, -2154, -2505, -2371, -1918, -1013, -497, 239]
844B39M64K43J9o06l96k72l12L16J49R18P24N82L79n0m18o90o27q47p84l45l20
865a634O2J67J85J4J92l6M14J82L51M08P2J69o3j90o86K78L50k40M20P45N90p2
887A678R8m45l52r18m51l97n01l1M85L36J9L11N26j43n36p4Q8n10R0Q20K59j4
909C38M90j00j142l83j60n30k04O89J087M83R94J158O1o14m17l36j243r32J50
928f11L02p50J22Q26n72p38q0k50j135J58R99P65P61J607J459p1j75K87j237j739
948g2r78n98r10o5J178J133L80J379Q30k43o97l5l54j316k0J136j38k57M40k05
968E88j621j449o99q01j035J332J831J344K008K257J245p96m97m33j906k078K86
985d24k00r93N85J370k15n75N18q6j168p58Q94k87j27J289J138k14J34P76l64
$$ y = [239, 703, 946, 965, 359, -37, -309, -621, -305, -156, 762, 1486, 2068, 2447, 2397, 1979, 1289, 662, -185, -969, -1314, -1634, -1572, -1405, -1220, -1206, -1014, -1050, -636, -454, -103, 305, 377, 546, 483, 293, -393, -115, 235, -5, 415, 1160, 1750, 1678, 1776, 1331, 979, 61, -390, -787, -1288, -1319, -834, -498, -479, -168, 358, 215, -321, -395, -307, -817, -727, 93, 352, 338, 828, 728, -414, -797, -957, -1487, -1691, -1002, 85, 568, 1562, 2720, 2781, 2167, 1750, 1414, 171, -761, -611, -309, -1059, -937, -111, -683, -1421, -1501, -1751, -2886, -2728, -1729, -964, -203, 1404, 2863, 2792, 2617, 2904, 1667, -72, -1050, -1648, -2558, -2623, -1445, -312, 68, 1447, 2277, 2034, 1337, 1302, 948, -368, -388, 748, 610, 353, 793, 588, -1033, -2482, -3181, -3982, -5017, -3685, -1854, -510, 1498, 3755, 5000, 4204, 3707, 3274, 1368, -710, -424, -624, -1617, -1032, 338, 123, -452, 66, -20, -1188, -1946, -1052, -1339, -1466, -177, 961, 747, 881, 1657, 1293]
1004A293j652m77R7q45o92J245J131K04Q42J773o34p86j93n64k111q07Q41J6N1
1023a268J753J663k2m07P76j527k232o90r7j281J56J782J549L03J064R47r85j623
1041a39k49k06j575L72J990Q80j24J614R29j660j664K62j000j827M00J748M0J01
1059a08J496L21j399n20K75j281j271J284R35o11J84J407o25j332L73M25r32k16
1077a595K421M04k38J214J532n76j044P87n27k125j104j17j862j539N43P39n90
1094c677J195K626Q26j88J439Q84j616j078P44r54j438Q91J024k68n83R56J53
1111I36j608j16J157r14q28J350Q52j231J87J456n93j353O83Q15o23P6J199k70
1129A175q59j23L74k091j331J065k65o56J437J483J69L0J303K61j272N8P08l74
$$ y = [1293, -359, -836, -739, -1584, -2276, -1031, 100, 304, 1146, 2919, 2285, 1499, 1306, 742, -1369, -2176, -1335, -1319, -1268, 485, 2148, 2126, 1719, 2495, 968, -1264, -1954, -2051, -3332, -3176, -1394, 155, 458, 1522, 2469, 1484, -139, -388, -594, -2169, -1797, 193, 1073, 949, 2563, 3492, 1832, 168, 430, -570, -2397, -1997, -249, -209, -108, 1388, 1709, 310, -210, 65, -1216, -2487, -1203, -268, -879, -695, 712, 87, -1245, -872, -447, -1379, -1595, 826, 1230, 992, 2206, 3738, 3162, 2118, 2905, 2378, 253, -851, -968, -2830, -4369, -3826, -3087, -3677, -2482, 144, 970, 782, 2221, 3105, 1489, 411, 1155, 201, -1237, -346, 678, 410, -173, 783, 936, -672, -788, 369, -545, -1373, -23, 829, -402, -215, 1241, 648, -705, -22, 793, 170, 246, 1445, 1175, 316, 193, 567, -1524, -2855, -1790, -2055, -2711, -1274, 209, 378, 408, 1711, 1972, 700, 758, 1466, 1092]
1147A092j217R47M85q98k60Q67k84r28M69O97j332m93M78o53j943J04M90l91M3
1166b727K077J549m20J245J383n84r58J58L0j572l69P92n97m46L60M97j078j11
1184g71Q66l30j002M10N44o89n95J020j29p98P34J109K26P0J027M33q43j23J02
1203A261j222j305p3j47p45Q5J118P86M9J025J149k98l34M00k08j107l48L0q48
1222g32o38M04J49k83L81P00j06l14K13J50q42j52J70j37o2L65Q79K41N55R22
1242A863K53j77K10K31p22p40k24p67j104k33j59l20j8P29K54J07L16M55k05n6
1262c07k52L23k54j49O86O40M92N40P78l34q0m70p64p78q55l86p55J19jQ27M06
1283e74N20M64N77j66K84l20k45l63N5l21j13j38N3o4m04o5M40k75N02K82mM93
$$ y = [1092, -125, 822, 1307, 409, 149, 1016, 732, -196, 273, 970, -362, -855, -377, -1030, -2973, -2869, -2379, -2770, -2727, -650, 899, 479, 1724, 3107, 2523, 1565, 1723, 1753, 181, -188, 604, 7, -439, -79, 418, -660, -771, 95, -235, -1237, -827, -283, -972, -1567, -547, -676, -1474, -740, 369, 595, 665, 1692, 2125, 1282, 1159, 1261, 39, -1266, -1339, -1486, -2231, -2146, -1028, -242, -193, 832, 1981, 1683, 1349, 1749, 1541, 434, 86, 116, -732, -1370, -966, -817, -1100, -719, -19, -125, -439, -226, -76, -918, -1070, -900, -1037, -1099, -734, 145, 386, 941, 1863, 2116, 1939, 2149, 2380, 1658, 918, 694, -73, -1177, -1410, -1569, -1889, -1907, -1178, -924, -817, -501, -46, -251, -307, -559, -236, -490, -639, 47, 687, 1179, 1719, 2497, 2163, 2083, 1613, 849, 71, -784, -1170, -1925, -1806, -1807, -980, -574, -54, 410, 987, 821, 1105, 785, 540, 177, 232, -89, -202, -340, -287, -351, -755, -820, -380, -655, -153, 129, 125, 618]
1305F18j41J64j72k7o93j4K9K96J57Q06J81R0L51m19q51p31r66n78n19k14M21
1326b212P99N75Q41O70N13p1k5m10r1n45j00K30K74N28J92K22R5k92o42m69n78
1347d96m39l29k5P8K86J56j24L35k74M59QK20J71L73J74N02k8N2m42l61r5n38
1369c37k03q7K70K38O58J9K56k3l41l74l83l12k14l44K87L62Q52J17K62K56l24
1390F35l33k09o21o56j7J10L61P4O05O40rJ92j13K3j4mj79l2J63O9k67k85j96
1413f3O8o47j90k0L0l75L40O34l32K21K92Q7j13O5J05j52KM57N06m32K56L22j73
1436H88l86j63n7p16m4N0M6J29K61L09p4o3J41m63p32mL41p28L52P10M2n0J14
1459i7O70p03p5K91K77l86M22O18r9m34N22j31r72l9K32k44n82K11N78n25L0N40
$$ y = [618, 477, 641, 469, 442, -251, -265, -236, 60, 217, 1023, 1204, 1294, 1645, 1226, 375, -356, -1322, -1900, -2419, -2633, -2212, -1413, -838, 3, 673, 1186, 1115, 1090, 680, 589, 44, -56, 174, 448, 976, 1168, 1390, 1485, 1193, 551, 82, -496, -935, -1264, -1289, -1211, -925, -769, -893, -558, -832, -373, -365, -145, 26, 399, 573, 1075, 1047, 1099, 657, 296, 201, -337, -540, -627, -357, -119, 539, 558, 814, 791, 450, 76, -307, -619, -833, -1177, -890, -528, 324, 441, 703, 959, 635, 302, 93, -528, -1184, -1201, -1091, -730, -656, -51, 589, 580, 772, 659, 682, 668, 664, 485, 453, 616, 685, 418, 133, -63, 5, -642, -832, -852, -822, -1197, -857, -223, -555, -334, -42, 45, -68, -3, 102, -50, -48, 409, 915, 483, 739, 1061, 888, 502, 339, 282, -434, -478, -428, -382, -253, 8, 317, 243, 180, 321, -142, -874, -878, -537, -1265, -913, -203, -161, -211, -97, 573, -130, -205, 86, 363, -23, 399, 1017, 918, 484, 1006, 875, -97, -136, 96, -148, -730, -519, 59, -466, -436, 104]
1481A04k77l29l8K81n85J02N67J22l66K90N50n13j33M74L35n15Q6O62o8n53L99
1502E95J52o26m31N28o6k86J65M39n03k03K07j8n50j06Q52o25L9L55j63n84J49
1523f80M52j68j32P43N80j58j39K66k76j013O90L59r19M9J011K76o79Q8M08m95
1543B63r21K85L70j194M04O10l28l92N69M59q16J15O71J89p79R79Q36o02k86K79
1563G11m1o39J29O32r2o63O72L65j359j38M49r58n46M22P84m70j11J145j56n48
1583d12N29N35p00J5Q85p5n05qK01o28n16L37M28m52K56J090j31n64L51J74j094
1604b84m33N27j93m33P16M45l15K6N48l09j220K44O08l18m59P90Q8o15Q2P13l89
1625a81l04Q51L27j20J91P95l11p11n9J84p22p91J054l16n66M70M87m47n97N52
$$ y = [104, -173, -502, -540, -259, -844, -742, -175, -53, -419, -129, 421, -92, -225, 249, 584, 69, 155, 817, 749, 196, 595, 747, 121, -310, 218, 152, -134, 31, 470, -33, -236, -29, -47, -597, -703, 149, -476, -437, -82, -245, -829, -680, -228, -396, -528, 215, 795, 637, 498, 764, 488, -525, 165, 524, -395, -346, 665, 941, 262, 350, 758, 263, -658, -373, -3, -1197, -793, -183, -511, -903, -334, 125, -691, -576, 95, 284, -495, 484, 1320, 718, 432, 711, 670, 31, 160, 792, 700, 37, 709, 1074, -285, -423, 26, -932, -1478, -1056, -272, -742, -853, 292, 136, -412, 117, 652, -48, -33, 852, 777, 272, 264, 465, -163, -679, -342, 86, -366, -110, 980, 849, 285, 636, 810, -284, -717, -190, -383, -816, -100, 345, 30, 56, 604, 295, -925, -681, -73, -391, -850, -60, 28, -587, -505, 208, -181, -485, 366, 693, 573, 764, 1559, 1248, 537, 478, 662, -60, -851, 203, -113, -679, -209, 278, -169, -766, -214]
1645b14m22p33K06P71r5j9N08M38l49p7O94L49q60Q58L12q33j93L19k66q28j81
1666f15M97j82k51Q71j03l70K48M95m16r96P48J17p04K21N69M1l95J97K77k81
1686c2l84P12N8k49J74L92l22o14L67J01m97M70J45m4j11K46O4p14K68O0m08m76
1708g94K81K19l16j16N59k0k32L97R0k95J22M61k57r2L30J71k80k51M71P5j98
1729C25K30K45j30n03j10j39m97j85L33j71j59pN54p5k7M80j01j85q1M25r4q4
1751D4K87K67n44J3M21l18j70K60J51j1k84J19nk36j34J10l56L15j43L4k25K52
1773a53k26r3K29k22L35n1M3J53j23L05r2N6K5pj55J85o1K23J20j71j01K9j5j04
1797A29l8j2j77N8k03p8n4j20m0K97k19LN8k65N87l07O22l59M2M16p0K19M9j73
$$ y = [-214, -636, -1369, -1163, -392, -487, -506, 2, 440, 91, 14, 708, 1057, 197, 1055, 1367, 534, 341, 660, 394, -434, -615, -118, -300, -551, 320, 217, -153, 95, 590, 174, -822, -74, 43, -661, -440, 129, 170, -225, -28, 249, -32, -416, 296, 354, 105, 279, 671, 349, -265, 102, 203, -294, 176, 321, 277, 166, 412, 476, -238, 30, 90, -318, -794, -513, -294, -610, -726, -167, -187, -419, -22, 68, -227, -105, 356, 99, 7, 337, 508, 228, -23, 448, 523, 325, 555, 800, 670, 167, 57, -82, -579, -764, -431, -602, -761, -768, -214, -289, -316, 164, 63, -122, -203, 222, 128, 44, 331, 598, 54, 67, 488, 170, 0, 260, 411, 400, 116, 235, 230, -6, -140, -30, -386, -71, -214, -180, -405, -153, -379, -472, -243, -465, -130, -181, -138, 15, -108, 197, 105, 161, 186, 179, 24, 209, 148, 371, 491, 320, 219, 248, 233, 129, 91, 79, -98, -40, -243, -321, -375, -495, -535, -238, -457, -454, -396, -661, -74, -381, 241, -118, -76, 340, 270, 489, 538, 365]
1821C65M56m50j61N5R3k74j13N4k82L64k59j28K07m0l12M60k67L6J63j42J77j34
1843a32J1R7j42j29n6L94J27L3J60%N8K12qj10J24k04k40N5k31jQ3m35M9j4J52
1868a47l07J50k42L86k11L51l14R5K89J55K29k32j21j3qJ61J42l95J91j38L41
1889C62j69j05R5J27j20l02J14l6l00J55q1J76j55k8k01o2J20K75q3M24p6K2N1
1912B03j73L93k32k0j54r2m2L83j09j09L56m2J33k46P9k17j55j00J02k82k71L41
1934b54j17K17l80N77l44K22L73n7l37J61OO6j54K2M79n33J45K92l73J14L18K33
1956F76l34k03K71n0j54l29Q2n22m05L92J54l72J73M02j0Q6j64M82j22k82N78
1977C49k37Q1L63k2j80k67L98k79o89L13L75l15o3L10nm87K90J00k81j79N76J66
$$ y = [365, 821, 371, 210, 265, 358, 84, -29, 25, -257, 107, -152, -280, -73, -113, -425, 35, -232, -196, -33, -175, 2, -132, -121, -24, -166, -295, -351, 43, 170, 203, 363, 363, 421, 633, 625, 515, 639, 435, 195, 250, 19, 18, 101, -334, -285, -299, -147, -454, -304, -546, -160, -371, -20, -334, -239, 50, 205, 434, 202, 81, 68, 60, 221, 363, -32, 159, 21, 362, 193, 88, 183, 310, 190, -112, 2, -34, -334, -179, -260, -84, -239, -267, -468, -530, -410, -135, -218, 206, 130, 152, 203, 30, 423, 191, 171, 17, -75, -117, 266, 157, 48, 404, 362, 495, 249, 328, 111, -44, -144, -42, -324, -595, -254, -371, -154, -534, 43, -301, -79, 294, 237, -100, 61, 67, 133, -21, 1, 480, -53, 92, 384, 11, 125, 443, 676, 342, 139, 410, 360, 206, -123, -41, -563, -968, -576, -422, -794, -621, -219, -229, -143, -307, 175, 53, -229, 349, 112, 193, 556, 534, 354, 87, 485, 206, -483, -170, 205, -110, -173, 137, 132, -355, -65, 35, -246, -425, 151, 317]
1999C17m85J58O2j91k99J09J34l71l2P69j15k22M00L01j22l13M03l9n09J69N51
2020F75m22n39M00K94q31pJ85K18m26M55M4l73m11N52P5o88K95N76l51J01L46
2041A68J38m77K09M29l63j88L86J92m29J29M79l40m50K42J94m81j79M76P5o04
2061c94K28M6l70l22J84J77k88K54Q23n2k47N65l57j99J2J85l04J50K8L22m76
2082c5J19L20j13o65K50N30l50k97Q48p8n91J92p7m26m49M74O6n13J23N54p3n32
2104g23O13K95l65K45O39r3k16L34J28o07k22J20k12k91K5O39p19L90J45k40l40
2125d55L79J80j45j18M40K2m61J26j18O7l67J76J40k59L27J85K95k29L99l1j03
2146D50NK39k15j88j59L73n58l01K98j63m45q7M50l3l15M46N26n98K81J62j14
$$ y = [317, -168, -10, 52, -139, -438, -329, -195, -566, -598, 171, 56, -166, 234, 535, 413, 100, 503, 464, -45, 124, 675, 253, -286, 114, 408, -423, -430, -245, -27, -453, 2, 46, -327, -738, -186, -111, -799, -504, 72, -279, -178, 168, 306, -171, 38, 467, 104, -84, 302, 494, 65, 194, 673, 333, -117, 125, 319, -162, -341, 135, 210, -394, -166, -120, -490, -812, -628, -451, -739, -485, 338, 286, 39, 604, 247, 48, 60, 245, -59, 91, 119, 441, -35, 84, 404, 291, -374, -124, 406, 56, -241, 607, 529, -62, 130, 53, -373, -822, -348, -282, -795, -672, -118, -191, -723, -110, 185, -180, 65, 704, 611, 395, 729, 857, 250, 28, 148, -64, -355, -330, 309, -410, -20, 125, -115, -455, -76, 104, -41, -159, 281, 303, -158, -32, -150, -83, -450, -274, -134, -393, -66, 119, 414, 185, 584, 553, 450, 455, 694, 479, 291, 132, 505, -53, -354, -56, -219, -664, -751, -301, -334, -649, -203, 323, -275, 6, 168, 54]
2167E4l69L87L1m55K2M64K0m54J4O19L6j75K69K04m71K04L2m21l14j19J41m28
2189g09K21K80k7l5L68j4M0l82K38j04L2k19O13m16K62R6J84o18K48K77j8k05
2211A12K68K6J36m46r3j69k57L10j4j5j34L98r6j01K24j67J03l16J31k58K55j1
2233a14o8P6k11J64K34J0k51L25R4n2Q4J25j01j93R8K46J5l01M50m45l09j68Q
2256b84n44j7J19L2o5J84L02K18J71K33M84l72L77k56l3k26j07k43l17J41j21
2277c24j56K90n4K26%R5P1r7j8K2j42l59L39k38J73M5r5J42j15N54l43J07j1l17
2301b05L0J29J93k33J41N0J53Q9j51j50K27q3j45J03M1l67K15p2j69J02J67j98
2323a33L25k45J39N7l91n4N5m7J0j78L74o4N8L72K15P7M10k9j41k64k97j31q3
$$ y = [54, -315, 72, 103, -352, -330, 134, 154, -300, -286, 333, 369, 194, 463, 667, 196, 400, 432, 11, -303, -422, -281, -709, -488, -208, -235, -270, 98, 84, 124, -258, -20, -124, -92, -311, 302, -114, 148, 244, 428, -190, 58, 335, 317, 112, 380, 406, 542, 96, 3, -166, -423, -113, -127, -142, -276, 122, 26, -75, 149, -18, 85, -231, -100, -358, -103, -114, -182, -106, -317, -153, 81, 91, -160, 165, 259, 207, 291, 416, 315, 122, 220, 466, 481, 180, 630, 185, -124, -292, -284, -828, -845, -726, -694, -759, -575, -273, -55, 116, 349, 833, 461, 838, 582, 549, 323, 216, -27, -344, -203, -324, -480, -190, -244, -18, -18, 77, 148, 51, 33, 55, -87, -446, -107, -345, -172, -127, -222, -80, -195, 359, 16, 123, 112, -205, -175, -46, 147, -86, 55, 105, 258, 347, 196, 46, 273, 190, 45, 148, 189, -178, 37, -35, -204, -102, 65, -133, 192, -53, 86, 143, -248, -302, -247, -294, -284, -462, -88, -152, -94, 278, 493, 570, 980, 951, 810, 546, 249, 118, 35]
2346C5m97k5r3j65p1K61k40L60L14P8j90J27K35l56K79j14L43pj54J0J29K00l15
2369A44K65m97M4n2k55O9k7j41L89m6l4j13M71J54j84J76j23j94N0l10K4l84M67
2392a07l37J55RL9M44MK11j37J4k22J00m35j6j61N23k98M09L2M7O10n45R2l7m41
2416d7K55o80N1k13O1n2M74q5K7J75j12J70J66J42J5j37K27k18O5k28J85Nj4j82
2440E0N2L5k13K34j24l96q8J36j46l66L44L83l55K69L03J64j59L49j33P2k59J02
2462B54o4m17j38M52O4k55K40j90K62j18R9j21l0J58k02q5k01N32j43j3k7K27
2484B84n71N7K90j96q3m3R3j00J43K26m8j06o6k3L81l1J25R8o5j97J12P8j89j12
2508E7P3j72j10K13k41J6k57N38m90k08L98K99o73K03L73lk36M95J91l01K93K01
$$ y = [35, -462, -487, -580, -745, -816, -555, -795, -435, -121, -43, -233, -106, 129, -227, 52, -62, 281, 274, 120, 130, 259, 459, 144, 409, -88, -44, -96, -351, -282, -309, -450, -61, -107, -141, -254, 217, 371, 187, 363, 240, 46, 96, -214, -190, -574, -107, -444, -289, -280, -241, 203, 207, 418, 281, 295, 73, 173, -262, -278, -439, 84, -214, 195, 227, 274, 884, 339, 431, 394, -47, 208, -472, -421, -634, -573, -625, -151, -236, -209, -34, -146, 24, 190, 332, 347, 210, 437, 219, 284, 56, 241, 246, 232, 50, 102, 137, -76, 158, 34, -362, -450, -314, -460, -826, -482, -99, -454, -185, 118, 282, 123, 472, 339, 411, 152, 254, 190, -227, -365, 87, 151, -104, 136, -54, 208, 90, 189, 68, 38, 196, -6, -91, -292, 240, 97, 84, 57, 284, -287, -230, 60, -136, -219, -262, -169, -269, -126, 100, 52, -54, -120, -143, 238, 207, 332, 430, 365, 168, 280, 358, 169, 57, 130, -42, -152, 61, -180, -164, -421, 117, -373, -581, -183, 116, -557, -354, 19, 16, -220, 275, 466, 165, 458, 659]
2530F59j97m46J62J82l90l16J56K62l82J74N88n31J46J02p5l59J63J07k52r2L56
2551A7L8m26J97J19k50M3J74L27k57P6N43J6m47J62J87p64j92L53K2m25M34J66
2573A13l6k18M86K0m48j40J22P0m47M78J31l30m50N94j87k32J77M47j32J01L56
2594D75J6j25R2l3j1m90K80k59l38l44M12l4l88M71N80k25J10L90l17k44K47K08
2616D73o63k94L80l59J9N8M9J92k25K46k1M14n8O84j86J70l9K73o09l14k17n37
2638e64l92K77j56o4K01M77j75M35j6K08l83M62J17K3r8k45M86m31l66l53J10
2659d47j58J91p1L50k9M32L70l77M25j39Nm61J02j97l72k89N01p4k83M14K4j22
2681b05L00R4o9j76R0K88o5k88K09N1j04R1J02j86q2j91K74m55L28P5Q4k37L7
$$ y = [659, 462, 16, 178, 360, -30, -346, -190, 72, -310, -136, 452, -79, 67, 169, 94, -265, -102, 5, -247, -339, 17, 55, -371, -174, -55, -305, -262, -88, 239, -18, 58, 601, 617, 170, 332, 519, -245, -437, -84, -62, -487, -53, 113, 77, -141, 345, 365, -83, -223, -101, -31, -478, 0, 131, -199, -649, -55, -242, -474, -297, 150, 18, 119, 475, 491, 366, 458, 425, 414, -76, 204, -55, -393, -737, -325, -359, -747, -276, 304, 79, 189, 579, 262, 18, 265, 473, -190, -484, -104, -463, -444, -386, -337, -145, -370, -124, -145, 269, 211, 895, 709, 879, 840, 1113, 504, 190, -27, -564, -956, -679, -835, -899, -698, -221, -396, 39, 23, 231, -152, 310, 427, 450, 352, 107, 593, 162, -204, -557, -447, -605, -414, -485, -135, -164, 268, 638, 261, 686, 547, 552, 91, 193, -4, -376, -665, -164, -238, -521, -107, -83, -205, 95, 189, 120, -56, 34, 322, 257, -31, 178, 229, 125, 216, 318, 132, 50, -141, 133, -322, 6, 81, 165, -72, -35]
2704c5J51j05l80Q0l6O5J99j03K16qMK75n75K29q3r4m6ML68m13L49J58N0j50k48
2729a28N72m49m4K41J00m74M18j08j17r3lJ3k92m15J07K98J53K36K05k82L21L13
2751E72N0k85L45k95L0l27P7J23p17K43O8k16K57k17L25j75J61K23R4l5jR0k79
2774A11J18j37%m47J64N8j42n0J6M50J4K4N29o31J84Mj12L9k09J67nl19k2m6Q3
2799a59L17m06L22Oj66q3Q2j3L13k96P6j08q9J25L72l69l8O0l59L11l3R3P1M9
2823G8J5l6K75n7L02n1l50n7m43K16m7k83N8P9L7K88j48Q1M0p5K43l92K75j74
2847a26L19l9l18L28j42o8J42m2j44Q0j32L03j74M3j7J13m2j11l14N12j54p2k39
2870b94M1J99r5J03n3q5o6R2o5J70J9m4P6L79j64R7j62J71n9j21l21J73p4P4o2
$$ y = [-35, 116, 11, -369, -289, -325, -260, -61, -164, 52, 44, 48, 323, -252, -23, -106, -200, -246, -242, 126, -287, 62, 220, 270, 120, -128, 444, -5, -49, 192, 292, -182, 236, 128, 11, -82, -85, -72, -364, -779, -672, -374, -221, 15, 220, -62, 259, 572, 622, 337, 682, 387, 417, 90, 167, 290, -427, -184, -116, -332, -75, -292, 33, -142, 19, 242, 336, 301, 300, 390, 111, 229, 92, 92, -355, -191, -133, -275, -325, -309, 141, 155, 179, 708, 77, 261, 265, 153, 192, -17, 150, 145, -174, -196, -242, -159, 158, -248, 74, 80, -86, -169, -87, -100, 213, -83, -7, -115, -204, -79, 293, -76, -114, -54, -413, -102, -135, -42, 29, 78, 93, 57, 332, 275, 577, 526, 176, 119, -324, -108, -155, -438, -380, -301, -264, 24, -124, -43, -3, -78, 165, -227, 48, -126, 193, 154, -164, 164, 22, -46, 96, 54, -90, -10, -142, 161, -13, 30, 13, 126, 84, -27, -341, 171, 17, -55, -294, -253, -54, -149, -46, -99, -184, -250, -158, -223, -53, -34, -78, -2, 377, 213, 310, 148, 319, 260, 139, -182, -9, -83, -9, -71]
2895g1k0J21k15J69k1J69l70J18J45l11M9N2j45L25j49M8n1J82m8K10k87K80O8
2918B48Q0k8k46l9M8N8M2k78J11O5N7r8n4J07J0j15l90L49n5R6k50J16L34k19
2942e1mJ46o4K06k19J52N9n2j88J84j61M7P0m2m6L4KJ54j62J29k40Q6k74k28K61
2967b01j67j36J60J82J74J74j37k00J84J4J2k19K06J98j0P7j96k33J79q2r6J50
2989C3j23j18J86O7L37l77J92k11Q2j96p6K38k77n4J39N9N3j96J81n5J53k2K59
3012B74r2J71L93n33J05j0p0n37M39k43O7n62M90k50J46J76J58L47k80RJ77j17
3034B58l03O8j70j85j86M42j98J34l4J19K08N8j56K2K8L47K05k12k25J28R0m79
3056d1j76J20j50p8n1K6J43qM99k55p1J74n8K7%om0nn7J48l04K60p1K56j54OL46
$$ y = [-71, -91, 30, -185, -16, -37, 132, -238, -120, 25, -286, -237, -185, -330, -5, -154, -106, -157, 25, -23, 187, -100, 180, 248, 328, 300, 54, 15, 63, 121, 163, -115, -4, 61, 118, 20, -34, 73, 83, -32, -422, -73, -128, -32, -282, -166, 168, -51, -55, 91, 27, 233, 14, 166, 225, 173, -15, 169, 8, 55, 125, 83, 37, 71, 73, 227, 65, 194, -46, 40, -234, -462, -201, -368, -504, -344, -162, 12, 186, 49, -151, 33, 47, 59, -160, 46, 244, 234, 311, 115, -118, 61, -21, -117, 33, -90, -208, -22, 45, 382, 5, 197, -14, 68, -128, -204, 34, -243, -297, -158, -99, -46, -242, -61, -116, 37, 15, 274, 182, 353, 746, 213, 318, 308, 238, -299, 140, -103, -36, -598, -108, -358, -212, -36, 122, 469, 189, 198, 375, 258, -45, 23, -147, -332, -518, -76, -274, -140, -174, -55, 153, 211, 55, 77, 105, 452, 657, 445, 220, 348, 438, -41, -217, -97, -247, -325, -376, -350, -207, -215, 284, 29, -42, 132, 74, 101, 101, 95, 55, 50, -7, 141, -163, 97, 26, 282, 128, 134, 480]
3083D80l07j8L2j23j85l41K59j53j55L10L95m26J13L98l13J1J6J26J40k27J2k37
3105a93l12L42j53J00j03L51j22K23M1J40N8K03j30J21k26n94N35l82k38J92k45
3126c92r6n09P44J27j46L30J56K81l44J87J21l43j43J56l6j8k67J25j82j12J91
3147a70q6j26L47L35j41M29L63l97l63k1k56j77j99Q8k6k77J08O85k97OnJ53K75
3170B48n4R8J87j34M44l19j89j05j80n9l31J49j03K03r3N15r7J0M6L5k37N7N8
3193A49l98j15K81n8J44L4r1k70N2j40K11K0N9j12M75k01L21K30j04K8L7k87o3
3216B02k57k81L66m29K69K98n9j80J8K12m02j21M9K1k43L54L36Q2J76p4k8j6l3
3239B60k97l3j99L47q0M0J02K12pl32p2k42J96M7j10L56k27N0M99k14j22l21j27
$$ y = [480, 173, 155, 187, 64, -121, -462, -203, -356, -511, -201, 194, -232, -119, 279, -34, -23, -7, 119, 259, 32, 44, -193, -505, -163, -316, -216, -319, 32, -90, 133, 174, 314, 372, 575, 445, 566, 340, -254, 281, -101, -339, -147, -392, -488, -997, -253, -126, -272, 58, 214, 495, 151, 338, 459, 116, -27, 129, 93, 75, -192, -67, -249, -361, -170, -256, -382, -35, 300, 159, 588, 951, 554, 191, 170, -86, -263, -462, -374, -400, -677, -569, 116, -181, -175, -180, -27, 248, 194, 292, 479, 345, 789, 470, 281, 176, -4, -63, -394, -245, -348, -145, -238, 277, 180, 190, 236, 271, 34, 91, 149, -249, -364, -83, -141, 3, 37, -54, -324, -272, -412, -201, -181, -122, -234, 241, 40, 361, 591, 487, 515, 552, 265, 202, -55, -336, 30, -399, -130, 168, 109, -71, -53, 159, -243, -364, -315, -294, -537, -183, 153, 235, 411, 337, 309, 293, 260, -37, -70, -269, 78, -2, 38, 140, 352, 345, 13, -59, -301, -105, -58, -168, 188, -39, 11, 510, 296, 174, -147, -274]
3262b74k7k1k61J12J64L31J81r5m9L32l83J21k84J40Qn8R8M4k2J91O7k87K2m76
3286d26K49r9J13j00Q7L03k69L72J22k87n3k96Q2Ln2J05q2M03N4R9j24j7k68N1
3310c0J63k94N5j3Q2J44j30K61j14qN0m29n2K82j73j66L32l7J53j24J86j82K26
3333A82n06j31O59p7j42K9J48K4N4n8J32l66k09L73k17P3P3K04k42k03J29J3j88
3356b46J65L1k47L0L0l2o7L33N10n35L87k69K30q6j55j34JJ67k42j0J62O3M8j10
3380B4o5J21k79N6Jo8J7o9K20k13R1J84j89K39j34O4K12j35j28J06l5l3j37J89
3404C9oo7M2J6K6K31k49K05j22J17j94O2j69m16J75J17J52j67k07K57m4J22J21
3427D1k19O3q9J65n1M16k94M4P2R6L2K37k90k45m5K8J18O7Q3k22j51Q2j05K64
$$ y = [-274, -301, -322, -583, -471, -307, 24, 205, 110, 61, 393, 10, 131, -153, -13, -5, -63, 35, 79, 57, 248, 315, 28, 50, -426, -177, -276, -163, -263, -176, 127, -142, 230, 352, 65, 12, -284, -202, -199, -251, -146, -228, 175, 229, 328, 204, 187, -81, -30, 133, -161, -106, -119, -37, 107, -23, 238, 124, 116, 166, -263, -315, -33, -206, -372, -40, -77, 76, -48, 138, -44, 182, -324, -455, 204, 127, -15, 14, 162, 186, 240, 182, 314, -52, -261, 112, -105, -32, 41, 245, 3, -200, -71, -58, -246, -81, -50, -297, -267, -237, -269, -336, -3, 507, -28, 359, 90, 320, 234, 79, -55, -54, 113, -129, -139, 23, 86, 134, 24, -41, 80, -199, -143, -142, -210, -193, -262, -42, -255, -164, 20, -169, 70, -64, 0, 212, 77, -51, 55, 20, -13, -150, 39, 33, -34, 8, 24, 50, 281, 32, 237, 115, 232, 38, 100, -69, -485, -310, -193, -41, -208, -415, -158, -202, -80, 41, -178, -115, -204, -39, -90, 326, 32, 76, 148, 244, 276, 513, 223, -22, -67, -39, 79, 146, 229, 7, -144, -62, -167, 97]
3451I7l60J72R6o4P0J05l4o3J7jL4l2j9J81k79J26P1R3j97J33m22o3%K15j50K63
3477a1n9J73N1J51O1j58j9k41j62j94L03k41J42l3J74p4o3K85j12j1J1J46J6L36
3501D71n08M91j53l22n0j61L44l87l0J68J12r3M39j88J38r7L4m2j85l30J54o6
3523b61p9K63R5k0rl8J56R2L4j65L0M4L13O5j43k2k27L8j25k6o11J85k20j03J69
3548e65M45K07L03L47n14J18p5k71J39j23J2l00M20Rr6lK08j24m57J98r2p5K37
3571e2M92k65L24J18m93q2l1o8k58k44M06J11k18M65K23m63J38k37Op8j60J42
3593b24J12J9J97O14j97k84K65m10k56K24j01K83k35m2Q4k05J29k00p0j05K73
3614a29K0k31L15J8J9j95N24J16k73k6j37nj09O2j20K8p1N5J92j43J88P2MQ7k8
$$ y = [97, -263, -91, 5, -59, 11, 116, 82, 19, 36, 35, 69, 37, 18, 199, -80, 46, 117, 210, 13, 146, -276, -339, -339, -124, -274, -11, -70, 103, 154, 305, 366, 208, 189, -52, -214, -408, -105, -346, -204, -237, -63, -137, -200, 85, -27, -38, -27, 119, 135, 471, -37, 454, 301, -21, -71, -232, 112, -275, -305, -137, -25, -118, 321, 133, 271, 174, 208, 166, -19, -349, -195, -261, -340, -77, 18, -2, -11, -49, 107, 199, 233, 68, 98, 142, 455, 520, 377, 355, 128, 166, 41, 15, -596, -411, -631, -734, -565, -120, 87, 390, 737, 223, 341, 266, -5, 134, 11, 23, -277, 143, 152, 56, 53, 261, 137, -320, -122, -214, -289, -52, 440, 175, 499, 617, 124, 42, 11, -57, -315, -559, -153, -42, -260, 205, 428, -35, 103, -134, -128, -206, -366, -224, -112, -93, 104, 718, 521, 237, 502, 92, -164, 60, -41, 242, 7, -35, 49, -156, -27, -227, -297, -402, -129, -109, -340, -25, -7, 12, -183, 341, 457, 184, 158, 21, 16, -93, -31, -151, -123, -194, -139, 53, -90, 98, 170, 174, 261, 233]
3639B33j91j9j3O3N0l29M19n83M15o58K88j00k21M25M71j93K60J15k3l7l51P3
3661I4j62j02j53J52QK54k9m2j22K12l07j24L72k9j40J91L27j33r3l13K25j6m90
3684d20L00J10j60j4K29R1J61q4K72j31j88oK89o13K54K6k56L23k8m7k12mj79
3707b87M08n30J99P9j83M31KK4Q5Rk19n3po2K59k34j28L04j84NL78k32J5R7p0
3732A06l3j31L0K09k09j25K96j97p7L52j62%j94K01k90rK04J54k93K95k96K42
3754G3o9q6J58j43J34r2LN9KL2j42M6K6m0kQ2l77K8R4K32J82j10k94K21q6J08
$$ y = [233, 42, 23, 10, 73, 123, -206, 213, -370, 45, -613, -325, -425, -646, -221, 250, 57, 317, 432, 409, 372, 21, 94, -68, -170, -323, -171, -163, 91, 62, 20, -102, 110, -197, -321, 51, 22, -118, 73, 400, 267, 174, -139, 86, 70, -420, -120, -10, -170, -184, 45, 136, 297, 213, 485, 354, 166, 160, 449, -164, 90, 116, -140, 183, 155, 108, -104, -108, -287, 121, -409, -210, -131, -314, 117, 119, 143, 228, 237, 18, -35, -42, -104, 155, -79, -207, 97, -87, -82, 296, 64, 79, 176, 106, 73, -58, -28, 181, -28, -153, 143, -54, -131, 221, 59, 59, -135, 66, -224, -233, -29, 125, -168, 127, -169, 73, 4, -82, 76, -67, 67, -25, -22, 37, 39, 71, -71, -25, 1, -39, -41, 41, -336, -308, -214, 18, 200, 90, -204, 17, -69, 39]
$$ [...]
8191A00
##END NTUPLES=NMR FID
##END=
