##TITLE=1H_Pr Dep-X
 200.13MHz,CDCl3,
 8 sc
 
 7.7.2025
##JCAMPDX= 6.0         $$ Bruker NMR JCAMP-DX V2.0
##DATA TYPE= NMR FID
##DATA CLASS= NTUPLES
##ORIGIN= UXNMR, Bruker Analytische Messtechnik GmbH
##OWNER= pz
$$ XWIN-NMR		Version 3.5
$$ Mon Jul  7 15:27:41 2025 Russian Standard Time (UT+4h)  she@DPX200
##.OBSERVE FREQUENCY= 200.1313
##.OBSERVE NUCLEUS= ^1H
##.DELAY= (6, 6)
##.ACQUISITION MODE= SIMULTANEOUS
##.ACQUISITION SCHEME= undefined
##.AVERAGES= 8
##.DIGITISER RES= 18
##SPECTROMETER/DATA SYSTEM= spect
##.PULSE SEQUENCE= zg30
##.SOLVENT NAME= CDCl3
##.SHIFT REFERENCE= (INTERNAL, CDCl3, 0, 14.3821)
##AUDIT TRAIL= $$ (NUMBER, WHEN, WHO, WHERE, WHAT)
$$ ##TITLE= Audit trail, XWIN-NMR		Version 3.5
$$ ##JCAMPDX= 5.01
$$ ##ORIGIN= Bruker BioSpin GmbH
$$ ##OWNER= she
$$ F:/spectra/data/she/nmr/H-C/1/audita.txt
$$ ##AUDIT TRAIL=  $$ (NUMBER, WHEN, WHO, WHERE, WHAT)
(   1,<2025-07-07 15:26:09.64 +0400>,<she>,<DPX200>,
      <created by zg, POWCHK disabled, PULCHK disabled
       configuration hash MD5:
       00 E9 B6 7A A2 85 ED C7 34 08 36 98 17 FE 4E 26
       data hash MD5: 16K
       64 2B 22 76 EB B7 17 60 5C 3E 5F C6 A7 10 ED 85>)
$$ ##END=
$$ 
$$ hash MD5
$$ D7 01 84 BD D3 F1 59 7E 6A 07 A0 D0 6B 33 BC 32
##$RELAX= 
##$RELAX= 
##$RELAX= 
##$RELAX= 
##$RELAX= 
##$RELAX= 
$$ Bruker specific parameters
$$ --------------------------
##$DU= <F:/spectra>
##$EXPNO= 1
##$NAME= <H-C>
##$PROCNO= 1
##$TYPE= <nmr>
##$USER= <she>
##$AMP= (0..31)
100 100 100 100 100 100 100 100 100 100 100 100 100 100 100 100 100 100 
100 100 100 100 100 100 100 100 100 100 100 100 100 100 
##$AQSEQ= 0
##$AQ_mod= 1
##$AUNM= <au_zg>
##$AUTOPOS= <>
##$BF1= 200.13
##$BF2= 200.13
##$BF3= 200.13
##$BF4= 200.13
##$BF5= 200.13
##$BF6= 200.13
##$BF7= 200.13
##$BF8= 200.13
##$BYTORDA= 1
##$CFDGTYP= 0
##$CFRGTYP= 5
##$CHEMSTR= <none>
##$CNST= (0..31)
1 1 145 1 1 1 1 1 1 1 1 1 1 1 1 1 1 1 1 1 1 1 1 1 1 1 1 1 1 1 1 1 
##$CPDPRG= <>
##$CPDPRG1= <>
##$CPDPRG2= <>
##$CPDPRG3= <>
##$CPDPRG4= <mlev>
##$CPDPRG5= <mlev>
##$CPDPRG6= <mlev>
##$CPDPRG7= <mlev>
##$CPDPRG8= <mlev>
##$CPDPRGB= <>
##$CPDPRGT= <>
##$D= (0..31)
0 0.7 0 0 0 0 0 0 0 0 0 0.03 0 0 0 0 0 0 0 0 0 0 0 0 0 0 0 0 0 0 0 0 
##$DATE= 1751887568
##$DBL= (0..7)
120 120 120 120 120 120 120 120 
##$DBP= (0..7)
150 150 150 150 150 150 150 150 
##$DBP07= 0
##$DBPNAM0= <>
##$DBPNAM1= <>
##$DBPNAM2= <>
##$DBPNAM3= <>
##$DBPNAM4= <>
##$DBPNAM5= <>
##$DBPNAM6= <>
##$DBPNAM7= <>
##$DBPOAL= (0..7)
0.5 0.5 0.5 0.5 0.5 0.5 0.5 0.5 
##$DBPOFFS= (0..7)
0 0 0 0 0 0 0 0 
##$DE= 6
##$DECBNUC= <off>
##$DECIM= 32
##$DECNUC= <off>
##$DECSTAT= 4
##$DIGMOD= 1
##$DIGTYP= 9
##$DL= (0..7)
0 120 120 120 120 120 120 120 
##$DP= (0..7)
150 150 150 150 150 150 150 150 
##$DP07= 0
##$DPNAME0= <>
##$DPNAME1= <>
##$DPNAME2= <>
##$DPNAME3= <>
##$DPNAME4= <>
##$DPNAME5= <>
##$DPNAME6= <>
##$DPNAME7= <>
##$DPOAL= (0..7)
0.5 0.5 0.5 0.5 0.5 0.5 0.5 0.5 
##$DPOFFS= (0..7)
0 0 0 0 0 0 0 0 
##$DQDMODE= 0
##$DR= 18
##$DS= 0
##$DSLIST= <SSSSSSSSSSSSSSS>
$$ [...]
##$SUBNAM0= <"">
##$SUBNAM1= <"">
##$SUBNAM2= <"">
##$SUBNAM3= <"">
##$SUBNAM4= <"">
##$SUBNAM5= <"">
##$SUBNAM6= <"">
##$SUBNAM7= <"">
##$SUBNAM8= <"">
##$SUBNAM9= <"">
##$SW= 18.0517328524113
##$SWIBOX= (0..15)
0 0 2 0 0 0 0 0 0 0 0 0 0 0 0 0 
##$SW_h= 3612.71676300578
##$TD= 16384
##$TD0= 1
##$TE= 0
##$TE2= 300
##$TE3= 300
##$TEG= 300
##$TL= (0..7)
0 120 120 120 120 120 120 120 
##$TP= (0..7)
150 150 150 150 150 150 150 150 
##$TP07= 0
##$TPNAME0= <>
##$TPNAME1= <>
##$TPNAME2= <>
##$TPNAME3= <>
##$TPNAME4= <>
##$TPNAME5= <>
##$TPNAME6= <>
##$TPNAME7= <>
##$TPOAL= (0..7)
0.5 0.5 0.5 0.5 0.5 0.5 0.5 0.5 
##$TPOFFS= (0..7)
0 0 0 0 0 0 0 0 
##$TUNHIN= 0
##$TUNHOUT= 0
##$TUNXOUT= 0
##$USERA1= <user>
##$USERA2= <user>
##$USERA3= <user>
##$USERA4= <user>
##$USERA5= <user>
##$V9= 5
##$VALIST= <valist>
##$VCLIST= <CCCCCCCCCCCCCCC>
##$VD= 0
##$VDLIST= <DDDDDDDDDDDDDDD>
##$VPLIST= <PPPPPPPPPPPPPPP>
##$VTLIST= <TTTTTTTTTTTTTTT>
##$WBST= 1024
##$WBSW= 4
##$XGAIN= (0..3)
0 0 0 0 
##$XL= 0
##$YL= 0
##$YMAX_a= 101714
##$YMIN_a= -127123
##$ZGOPTNS= <>
##$ZL1= 120
##$ZL2= 120
##$ZL3= 120
##$ZL4= 120
##$ABSF1= 10
##$ABSF2= 0
##$ABSG= 5
##$ABSL= 3
##$ALPHA= 0
##$AQORDER= 0
##$ASSFAC= 0
##$ASSFACI= 0
##$ASSFACX= 0
##$ASSWID= 0
##$AUNMP= <proc_1d>
##$AZFE= 0.1
##$AZFW= 0.1
##$BCFW= 1
##$BC_mod= 2
##$BYTORDP= 1
##$COROFFS= 0
##$CY= -3
##$DATMOD= 1
##$DC= 2
##$DFILT= <>
##$DTYPP= 0
##$F1P= 0
##$F2P= 0
##$FCOR= 0.5
##$FTSIZE= 0
##$FT_mod= 4
##$GAMMA= 1
##$GB= 0.15
##$INTBC= 1
##$INTSCL= 1
##$ISEN= 128
##$LB= 0.25
##$LEV0= 0
##$LPBIN= 0
##$MAXI= 10000
##$MC2= 0
##$MEAN= 0
##$ME_mod= 0
##$MI= 1.114404
##$NCOEF= 0
##$NC_proc= 0
##$NLEV= 6
##$NOISF1= 3.799351
##$NOISF2= 2.8
##$NSP= 1
##$NTH_PI= 0
##$NZP= 0
##$OFFSET= 14.38212
##$PC= 1
##$PHC0= -1200.053
##$PHC1= 10.39238
##$PH_mod= 1
##$PKNL= yes
##$PPARMOD= 0
##$PSCAL= 0
##$PSIGN= 0
##$REVERSE= no
##$SF= 200.129724274929
##$SI= 16384
##$SIGF1= 3
##$SIGF2= 2
##$SINO= 400
##$SIOLD= 16384
##$SREGLST= <1H.CDCl3>
##$SSB= 0
##$STSI= 0
##$STSR= 0
##$SW_p= 3205.1282051282
##$SYMM= 0
##$S_DEV= 0
##$TDeff= 0
##$TDoff= 0
##$TI= <>
##$TILT= no
##$TM1= 0
##$TM2= 0
##$TOPLEV= 0
##$USERP1= <user>
##$USERP2= <user>
##$USERP3= <user>
##$USERP4= <user>
##$USERP5= <user>
##$WDW= 1
##$XDIM= 8192
##$YMAX_p= 0
##$YMIN_p= 0
$$ End of Bruker specific parameters
$$ ---------------------------------
##NTUPLES= NMR FID
##VAR_NAME=  TIME,          FID/REAL,        FID/IMAG
##SYMBOL=    X,             R,               I
##VAR_TYPE=  INDEPENDENT,   DEPENDENT,       DEPENDENT
##VAR_FORM=  AFFN,          ASDF,            ASDF
##VAR_DIM=   8192,          8192,            8192
##UNITS=     SECONDS,       ARBITRARY UNITS, ARBITRARY UNITS
##FACTOR=    0.0002768,     1,               1
##FIRST=     0,             0,               0
##LAST=      2.2672688,     0,               0
##MIN=       0,             -127123,         0
##MAX=       2.2672688,     101714,          0
$$ Real data points
##PAGE= N=1
##DATA TABLE= (X++(R..R)), XYDATA
$$ [...]
$$ plain form
1639 -177 623 787 -383 797 612 -343 622 -203 -343 508 -851 -489 242 -1064 20 81 -819 318
1657 318 -139 -369 897 30 49 993 -228 288 853 -374 501 165 -540 568 -219 -727 394 -689
1675 -689 -732 93 -920 112 424 -506 313 337 -378 817 234 -172 891 -330 74 576 -634 -70 199
1694 199 -942 3 -336 -761 416 -277 -332 644 -206 -32 624 -309 501 572 -377 717 150 -375 855
1713 855 -389 -323 341 -861 -266 281 -925 87 104 -744 228 -5 -218 627 -61 -31 706 -269 156 660
1733 660 -368 477 92 -542 454 -230 -467 362 -658 -495 226 -560 15 182 -504 395 216 -193 677
1752 677 -21 -219 859 -153 159 563 -613 273 310 -596 134 -131 -545 385 -359 -375 505 -581 -115
1771 -115 506 -420 443 254 -430 734 201 -186 738 -55 -258 464 -708 122 516 -660 118 -135 -740
$$ packed form
1639a77Q00J64j170J180j85r55R65q25j40Q51j359L62P31j306J084O1r00J137
1657C18m57k30J266q67J9R44j221N16N65j227Q75l36p05J108p87n08J121j083
1675f89m3Q25j013J032L12r30Q19K4p15J195n83m06J063j221M04N02j210N64K69
1694A99j141R45l39m25J177o93n5R76q50J74O56r33Q10P1r49J094n67n25J230
1713H55j244O6O64j202N95N47j206J012J7q48R72k33k13Q45o88L0P37r75M25N04
1733F60j028Q45l85o34R96o84k37Q29j020J63P21p86N75J67o86Q99j79m09Q70
1752F77o98j98J078j012L12M04j176Q86L7r06P30k65m14R30p44j6Q80j086M66
1771a15O21r26Q63j89o84J164n33l87R24p93k03P22j172Q30L94j176P78k53o05
$$ plain form
1790 -740 235 -178 -327 549 -387 -59 686 -387 401 771 -207 568 324 -521 573 -168 -468 437 -683
1809 -683 -420 46 -747 -82 121 -713 312 216 -490 929 114 1 857 -64 15 596 -384 239 174 -768
1829 -768 159 -170 -655 404 -410 -389 302 -635 48 480 -254 503 583 -280 710 188 -313 827 -273 -227
1849 -227 542 -703 -218 203 -886 200 -122 -907 285 -172 -220 551 -115 -24 807 -286 426 611 -200
1868 -200 422 119 -605 394 -230 -574 357 -778 -514 311 -723 -12 239 -643 428 204 -242 906 336
1887 336 -106 789 -296 -6 686 -383 130 178 -795 94 -256 -755 354 -495 -349 316 -410 81 478
1906 478 -209 254 414 -487 486 169 -324 567 -390 -360 181 -724 -68 255 -652 104 -93 -592 341 50
1926 50 -218 582 -200 75 603 -177 256 528 -439 428 234 -527 108 53 -424 330 -418 -320 410 -447 68
$$ packed form
1790g40R75m13j49Q76r36L28P45j073P88L70r78P75k44q45J094p41l00R05j120
1809f83K63M66p93O65K03q34J025r6p06J419q15j13Q56r21P9N81r80O23o5r42
1829g68R27l29m85J059q14K1O91r37O83M32p34P57Q0q63R90n22n01J140j100M6
1849b27P69j245M85M21j089J086l22p85J192m57m8P71o66R1Q31j093P12J85q11
1868b00O22l03p24R99o24l44R31j135K64Q25j034P11K51q82J071k24m46J148n70
1887C36m42Q95j085K90O92j069N13M8r73Q89l50m99J109q49J46O65p26M91L97
1906D78o87M63J60r01R73l17m93Q91r57L0N41r05O56L23r07P56j97m99R33k91
1926E0k68Q00p82K75N28p80M33K72r67Q67j94p61O35n5m77P54p48R8P30q57N15
$$ plain form
1947 68 305 -453 308 107 -308 795 -6 -115 705 -299 -31 526 -414 191 128 -757 353 -240 -536 275
1967 275 -373 -270 310 -513 65 390 -522 305 303 -210 470 112 -73 537 -186 -139 410 -359 58 173 -396
1988 -396 -38 -278 -711 223 -168 -462 428 -204 19 594 -292 376 600 -310 527 187 -252 569 -34 -354
2008 -354 462 -528 -195 173 -623 9 -44 -499 300 -14 -210 704 46 130 455 -123 221 375 -407 417 147
2029 147 -707 98 -279 -660 41 -506 -376 110 -488 89 434 -364 283 240 -80 736 11 44 719 -135 -97
2050 -97 297 -411 179 -33 -681 -26 -182 -590 463 -19 -96 435 -200 74 658 -4 583 464 -223 361
2070 361 69 -262 207 -268 -419 103 -681 -376 134 -669 63 171 -431 395 162 -74 684 84 169 626
2090 626 -345 29 505 -423 303 12 -792 97 -285 -449 298 -572 -314 412 -442 364 427 -286 382 322 -171
$$ packed form
1947F8K37p58P61k01m15J103q01j09Q20j004K68N57r40O05o3q85J110n93k96Q11
1967B75o48J03N80q23N78L25r12Q27kn13O80l58j85O10p23M7N49p69M17J15n69
1988c96L58k40m33R34l91k94Q90o32K23N75q86O68K24r10Q37l40m39Q21o03l20
2008c54Q16r90L33L68p96O32n3m55P99l14j96R14o58Q4L25n78L44J54p82Q24k70
2029A47q54Q05l77l81P01n47J30M86n98N77L45p98O47m3l20Q16p25L3O75q54L8
2050i7L94p08N90k12o48O55j56m08J053m82p7N31o35K74N84o62N87j19o87N84
2070C61k92l31M69m75j51N22p84L05N10q03P32J08o02Q26k33k36P58o00Q5M57
2090F26r71L74M76r28P26k91q04Q89l82j64P47q70K58P26q54Q06O3p13O68o0m93
$$ plain form
2111 -171 601 63 -275 819 -479 -197 323 -440 52 232 -501 97 -167 -421 411 -164 -207 545 -181 -136
2131 -136 561 -200 408 460 -449 299 140 -431 162 -110 -246 347 -456 -111 286 -355 160 32 -473 337
2151 337 204 -397 509 -81 -11 720 -315 63 366 -206 -7 -29 -347 339 -217 -496 403 -337 -368 280 -476
2172 -476 16 436 -372 434 178 -187 534 291 39 362 -249 -127 493 -384 65 192 -561 59 -210 -610
2192 -610 413 -130 -207 322 -327 70 529 -17 257 232 -246 424 131 -313 448 -123 -213 188 -566 -47 134
2213 134 -554 74 -84 -315 137 -13 -84 618 -17 37 589 -48 338 540 -213 310 -41 -423 352 -158 -295
2234 -295 210 -442 -144 291 -494 84 222 -345 328 181 -127 442 9 -46 633 -193 112 322 -311 -34
2254 -34 -66 -581 116 -182 -503 285 -247 -173 225 58 31 501 12 202 207 -393 459 230 -4 214 -277 -280 268
$$ packed form
2111a71P72n38l38J094j298K82N20p63M92J80p33N98k64k54Q32n75m3P52p26M5
2131a36O97p61O08N2r09P48j59n71N93k72j36N93q03L45L97o41N15j28n05Q10
2151C37j33o01R06n90P0P31j035L78L03n72J99k2l18O86n56k79Q99p40l1O48p56
2172d76M92M20q08Q06k56l65P21k43k52L23o11J22O20q77M49J27p53O20k69m00
2192f10J023n43p7N29o49L97M59n46K74k5m78O70k93m44P61n71r0M01p54N19J81
2213A34o88O28j58k31M52j50p1P02o35N4N52o37L86K02p53N23l51l82P75n10j37
2234b95N05o52K98M35p85N78J38n67O73j47l08N69m33n5O79q26L05K10o33K77
2254c4l2n15O97k98l21P88n32P4L98j67k7M70m89J90No00Q52k29k34K18m91lN48
$$ plain form
2277 268 -400 33 99 -282 -5 -101 -466 355 17 28 563 -82 188 368 -271 297 217 -475 231 -105 -329
2298 -329 192 -218 -501 206 -317 -138 220 -143 157 242 -91 376 205 -180 465 -86 21 458 -527 -123
2318 -123 296 -388 -145 -27 -614 149 -140 -328 268 -59 -181 426 -23 42 322 -227 195 -30 -315 484
2338 484 0 -266 313 -109 -293 173 -171 -10 139 -515 255 72 -295 267 7 -67 522 -308 -172 577
2358 577 -126 223 224 -362 168 176 -369 410 -143 -295 231 -343 -18 142 -336 193 231 -321 334 85 -198 428
2380 428 56 62 122 -252 -21 329 -378 132 255 -536 159 -238 -279 242 -76 -246 279 -365 88 322 -165
2401 -165 231 132 -128 445 109 -149 355 -93 -93 213 -262 14 68 -498 -86 33 -276 294 -177 -87 386 -72
2423 -72 41 299 -79 111 132 -150 174 -158 -145 228 -37 -202 68 -303 -90 215 -359 116 47 -315 331
$$ packed form
2277B68o68M33O6l81K77r6l65Q21l38J1N35o45K70J80o39N68q0o92P06l36k24
2298c29N21m10k83P07n23J79L58l63L00Q5l33M67j71l85O45n51J07M37r85M04
2318a23M19o84K43J18n87P63k89j88N96l27j22O07m49O5K80n49M22k25k85P99
2338D84m84k66N79m22j84M66l44J61J49o54P70j83l67N62k60p4N89q30J36P49
2358E77p03L49Jn86N30Qn45P79n53j52N26n74L25J60m78N29L8n52O55k49k83O26
2380D28l72OO0l74K31L50p07N10J23p91O95l97m1N21l18j70N25o44M53K34m87
2401a65L96r9k60N73l36k58N04m48%L06m75K76N4n66M12J19l09N70m71R0M73m58
2423g2J13K58l78J90K1k82L24l32J3L73k65j65K70l71K13L05n74M75o9l62O46
$$ plain form
2444 331 51 -179 412 104 -40 138 -132 203 269 -318 30 -32 -354 239 -139 -257 26 -269 -138 274 -176
2465 -176 262 194 -284 235 241 32 302 21 -42 146 -291 -261 124 -261 -20 -48 -500 43 54 -97 214 14
2487 14 75 403 -253 67 399 -151 206 39 -337 373 12 -228 409 -300 -179 232 -403 -97 93 -190 145
2508 145 161 -184 228 238 -91 361 -43 44 373 -337 85 374 -287 87 -4 -404 48 -166 -12 196 -168
2529 -168 -54 231 -281 205 267 -114 226 -64 -235 361 11 -30 302 -313 -161 193 -359 -24 17 -173 -4
2550 -4 -20 -155 366 -3 -245 202 -165 106 293 -193 232 199 -246 202 -187 -326 185 -84 28 179 -345
2571 -345 249 90 -335 126 106 -249 209 76 -116 379 102 69 229 -216 146 204 -417 107 -14 -258 158
2592 158 -56 -305 310 -284 -77 174 -373 45 263 -340 325 204 -266 568 147 -145 328 -199 -40 283
$$ packed form
2444C31k80k30N91l08j44J78k70L35O6n87L48o2l22N93l78j18K83k95J31M12m50
2465a76M38o8m78N19Ok09K70k81o3J88m37L0L85l85K41k8m52N43J1j51L11k00
2487A4O1L28o56L20L32n50L57j67l76P10l61k40O37p09J21M11o35L06J90k83L35
2508A45J6l45M12J0l29M52m04Q7L29p10M22K89o61L74r1m00M52k14J54K08l64
2529a68J14K85n12M86O2l81L40k90j71N96l50m1L32o15J52L54n52L35M1j90J69
2550dj6j35N21l69k42M47l67K71J87m86M25l3m45M48l89j39N11k69J12J51n24
2571c45N94j59m25M61k0l55M58j33j92M95k77l3J60m45L62N8o21N24j21k44M16
2592A58k14k49O15n94K07K51n47M18K18o03O65j21m70Q34m21k92M73n27J59L23
$$ plain form
2612 283 -307 -10 -74 -553 63 31 -416 240 -116 -120 249 -136 71 418 -92 234 18 -151 320 132 -42
2633 -42 29 -275 50 90 -265 44 154 -216 147 -49 -209 343 85 -146 306 -53 -95 288 74 197 -36
2654 -36 -124 151 -13 -305 151 -239 -108 115 -315 -136 187 -319 246 149 -120 322 97 -80 269 -66 -206
2675 -206 299 -144 20 84 -379 -43 -161 -285 -12 10 -121 209 -69 -319 323 29 255 347 -220 56 230
2696 230 -170 49 18 -310 -8 -217 -234 59 -221 23 20 -309 -68 108 -115 285 210 -106 317 -86 -56 228
2718 228 -167 166 27 -293 3 -62 -144 106 55 -258 213 -235 -12 88 -287 193 268 -183 83 245 -209
2739 -209 258 71 170 153 -279 30 18 -266 101 -28 -185 -98 -139 -351 60 -122 38 317 -337 123 89 -187
2761 -187 176 -144 -95 143 31 40 135 -288 33 214 -205 110 -121 -185 4 -72 -254 219 -102 -110 118 -136 185
$$ packed form
2612B83n90K97o4m79O16l2m47O56l56mL69l85K07L47n10L26k16j69M71j88j74
2633d2P1l04L25M0l55L09J10l70L63j96j60N52k58k31M52l59m2L83k14J23k33
2654c6q8K75j64k92M56l90J31K23m30J79L23n06N65r7k69M42k25j77L49l35j40
2675b06N05m43J64O4m63L36j18j24K73K2j31L30k78k50O42k94K26R2n67K76J74
2696B30m00K19l1l28L02k09j7K93k80K44ll29K41J76k23M00p5l16M23m03L0K84
2718B28l95L33j39l20K96o5q2K50n1l13M71m48K23J00l75M80P5m51K66J62m54
2739b09M67j87R9j7m32L09j2k84L67j29j57Q7m1k12M11j82J60K79o54M60l4k76
2761a87L63l20M9K38j12RR5m23L21J81m19L15k31o4J89p6j82M73l21qK28k54L21
$$ plain form
2784 185 124 3 53 178 -253 65 -35 -159 135 -159 -76 81 -458 -122 163 -217 -17 25 -21 90 87 55 212
2807 212 -19 17 315 -110 -193 -6 -283 4 -93 -312 139 -17 -181 172 -92 -94 69 -75 69 147 -49 224
2829 224 43 -175 314 32 -172 294 -161 -89 -14 -149 206 -118 -189 -57 -36 -137 248 -4 90 258 -145 85
2851 85 286 -181 68 -109 -59 89 -198 -161 104 -129 -344 70 -205 16 119 -183 191 160 -270 388 16
2872 16 -22 273 76 -184 269 -156 82 84 -136 -27 -2 -225 67 -62 -190 100 -67 -17 3 20 228 221 4
2895 4 251 76 -67 43 -130 -7 -54 -67 -122 41 -313 6 136 -211 214 32 -132 368 -126 -69 173 -146
2917 -146 125 69 -115 74 0 -251 75 -8 -224 178 39 78 -57 -167 17 280 -227 92 -33 24 271 -37
2939 -37 -227 181 -99 -48 231 -34 87 55 -242 -9 -134 -107 228 -85 -91 -66 -206 156 157 -125 264 115 82
$$ packed form
2784A85o1j21N0J25m31L18j00j24K94k94Q3J57n39L36K85l80K00M2m6J11ll2J57
2807B12k31L6K98m25q3J87k77K87r7k19M51j56j64L53k64kJ63j44J44P8j96K73
2829B24j81k18M89k82k04M66m55P2P5j35L55l24p1J32K1j01L85k52R4J68m03K30
2851H5K01m67K49j77N0J48k87L7K65k33k15M14k75K21J03l02L74l1m30O58l72
2872A6l8K95j97k60M53m25K38Kk20J09K5k23K92j29j28K90j67N0K0J7K08pk17
2895DK47j75j43J10j73J23m7j3n5J63l54L19J30l47M25j82j64N00m94N7K42l19
2917a46K71n6j84J89p4k51L26q3k16M02j39L9j35j10J84K63n07L19j25N7K47l08
2939c7j90M08k80N1K79k65J21l2k97K33j25K7L35l13oK5j40L62Jk82L89j49l3
$$ plain form
2962 82 103 291 -65 159 -8 -13 9 -354 -117 84 -206 166 116 -379 159 104 -116 120 9 -84 142 -153 21
2985 21 122 -119 162 11 -98 301 -137 -131 145 -112 -250 36 -200 124 114 -240 90 -21 -151 225 73
3006 73 -50 146 -99 -182 176 77 231 246 -147 -74 -104 -124 84 -208 -229 -5 -132 50 148 -185 127 108 -87
3029 -87 133 198 117 49 -79 -43 164 -137 -31 14 -204 28 -49 -266 107 -3 -64 155 -120 -82 234 -19 138
3052 138 121 -194 28 -56 -158 -76 -150 82 -76 -291 -239 30 -381 -86 75 -185 150 138 -95 169 -1 -73
3074 -73 243 70 165 139 -74 48 66 -207 100 -26 -191 216 9 -169 61 -326 10 153 -162 174 78 -121
3096 -121 287 139 -46 283 -184 -129 103 -335 230 48 -145 174 -52 -119 130 12 -96 234 -53 116 270
3117 270 -203 292 184 -262 183 24 -141 23 -81 -147 118 -113 -216 92 -112 -125 -10 -54 77 152 -37
$$ packed form
2962H2K1J88l56K24j67nK2l63K37K01k90L72n0m95N38n5k20K36j11r3K26k95J74
2985B1J01k41K81j51j09L99m38OK76k57j38K86k36L24j0l54L30j11j30L76j52
3006G3j23J96k45q3L58r9J54J5l93P3l0k0K08k92k1K24j27J82R8l33L12j9j95
3029h7K20O5q1o8j28L6K07l01J06M5k18K32p7k17L73j10o1K19k75L8L16k53J57
3052A38j7l15K22q4j02Q2p4K32j58k15N2K69m11K95J61k60L35j2k33K64j70p2
3074g3L16j73R5k6k13J22J8k73L07j26j65M07k07j78K30l87L36J43l15L36r6j99
3096a21M08j48j85L29m67N5K32m38N65j82j93L19k26o7K49j18j08L30k87J69J54
3117B70m73M95j08m46M45j59j65J64j04o6K65k31j03L08k04j3J15m4J31P5j89
$$ plain form
3138 -37 267 -125 -138 177 -153 77 166 46 19 -90 -133 108 -140 -180 -73 -186 60 295 -102 110 166 82 129
3161 129 -49 -68 333 -9 -67 112 -24 96 206 -79 14 72 -135 -10 -88 -212 106 -55 -103 137 -19 89
3183 89 -20 -131 10 243 -38 70 34 -273 224 62 -94 33 -12 -72 175 -162 -83 13 -200 -21 5 -56 134
3206 134 -250 -30 116 6 255 62 -251 161 57 -313 201 -183 -322 89 -134 -106 150 -314 -10 96
3226 96 -123 -78 133 -78 187 69 -132 189 118 56 128 -16 -47 -50 -48 -30 14 -219 271 -323 39 109 -105 124
3250 124 89 126 42 16 -121 206 -50 -45 47 -86 -134 72 -219 65 171 -55 -169 34 -121 120 47 -56 208
3273 208 -216 171 151 -172 -77 30 -323 79 40 -2 159 -77 64 113 -31 -144 122 -90 185 92 -153 115
3295 115 62 -46 110 78 -135 86 -237 -10 -81 -172 152 -118 -169 56 -20 13 152 -133 -95 79 -232 9 59
$$ packed form
3138c7L04l92j3L15l30K30Q9j20k7j09m3K41k48m0J07j13K46K35l97K12N6q4M7
3161A29j78j9M01l42n8J79j36J20J10k85R3N8k07J25p8j24L18j61m8K40j56J08
3183H9j09j11J41K33k81J08l6l07M97j62j56J27m5o0K47l37P9R6k13J79K6o1J90
3206A34l84K20J46j10K49j93l13M12j04l70N14l84j39M11k23K8K56m64L04J06
3226I6k19M5K11k11K65j18k01L21p1o2P2j44l1lKJ8M4k33M90n94L62P0k14K29
3250A24l5L7q4k6j37L27k56NR2j33m8K06k91K84J06k26j14K03j55K41p3j03K64
3273B08m24L87k0l23R5J07l53M02l9m2J61k36J41M9j44j13K66k12K75r3k45K68
3295A15n3j08J56l2k13K21l23K27p1r1L24k70n1K25p6L3J39k85L8J74l11K41N0
$$ plain form
3318 59 -94 -30 46 -5 184 -35 -69 72 -53 -105 156 -195 -136 -14 -155 110 -65 -259 -19 -99 -69 53 -198
3341 -198 91 62 -65 48 -68 58 158 -176 -126 211 229 -147 106 2 94 7 -58 -46 61 -100 97 -227
3363 -227 22 126 63 -24 132 -55 26 146 -144 195 -139 -208 171 -72 -98 -91 -141 -45 89 -30 -50 210 -65
3386 -65 163 -100 -236 133 85 -48 255 -4 -157 110 -148 -68 74 -130 -128 14 -295 108 -32 -133 122 -127
3408 -127 76 49 9 87 95 -10 140 -19 -95 23 11 -248 16 -151 -137 121 -131 -83 69 -224 122 -2 -101
3431 -101 -1 53 -37 258 -38 -37 124 -186 109 65 -269 9 -284 -135 68 -162 17 44 -113 107 126 -178
3453 -178 201 -1 38 39 52 -79 158 -117 47 -25 -72 4 146 -154 50 -20 -98 203 -35 13 -52 -212 -70 309
3477 309 -104 130 98 -244 202 -13 -104 94 -16 48 70 -76 109 108 -35 150 174 -142 287 187 -91 148
$$ packed form
3318E9j53O4P6n1J89k19l4J41j25n2K61l51N9J22j41K65j75j94K40q0L0J22k51
3341a98K89k9j27J13j16J26J00l34N0L37J8l76K53j04R2q7o5J2J07j61J97l24
3363b27K49J04o3q7J56j87Q1J20k90L39l34o9L79k43k6Pn0R6J34j19k0K60k75
3386f5K28k63j36L69m8j33L03k59j53K67k58Q0J42k04KJ42l09M03j40j01K55k49
3408a27K03k7m0P8Qj05J50j59p6J18j2k59K64j67J4K58k52M8J52k93L46j24r9
3431a01J00N4r0K95k96JJ61l10K95m4l34K78k93J49K03k30J79K7j57K20J9l04
3453a78L79k02L9JJ3j31K37k75J64p2m7P6J42l00K04p0p8L01k38M8o5j60J42L79
3477C09m13K34l2l42M46k15r1J98j10O4K2j46J85jj43J85K4l16M29j00k78K39
$$ plain form
3499 148 -76 41 70 -130 52 -97 -179 123 -41 -286 39 117 -5 -23 -255 -53 114 -136 42 198 -72
3520 -72 -31 14 -196 79 -126 -121 152 -146 -116 -15 -226 -6 12 -196 40 -36 26 141 -207 -62 121 -108 -3
3543 -3 237 -83 10 111 -70 175 -184 -13 73 35 175 1 -96 142 23 -174 33 156 -110 116 -26 -11
3565 -11 240 30 101 66 17 141 125 50 78 -3 -30 229 -127 -27 77 -119 149 -12 -173 50 -191 -162 140
3588 140 151 41 207 -86 -107 133 -1 39 78 -249 21 31 -230 26 9 -72 95 -152 -132 103 -5 86 -27
3611 -27 -150 50 29 -24 224 -98 -75 220 -96 -168 125 -190 -102 -97 -69 -139 14 43 136 -173 36 205 3 81
3635 81 219 -5 113 151 27 56 -125 -157 62 -2 -82 -1 -114 -84 184 -35 -19 80 7 272 -58 -55 162 -173
3659 -173 -111 45 -34 -48 42 -162 -106 -58 -181 -136 67 -109 60 -265 -32 238 -30 105 12 -151 179 116 -61
$$ packed form
3499A48k24J17K9k00J82j49q2L02j64k45L25P8j22j8k32K02J67k50J78J56k70
3520g2M1M5k10K75k05NK73k98L0J01k11K20J8k08K36p6O2J15l48J45J83k29J05
3543cK40l20R3J01j81K45l59J71Q6l8J40j74r7K38j19j97K07J23k66K26j42J5
3565a1K51k10P1l5m9J24j6p5K8q1k7K59l56J00J04j96K68j61j61K23k41K9L02
3588A40J1j10J66k93k1K40j34M0L9l27K70J0k61K56j7q1J67k47K0K35j08R1j13
3611b7j23K00k1n3K48l22K3K95l16p2K93l15Q8NK8p0J53K9R3l09K09J69k02P8
3635H1J38k24J18L8j24K9j81l2K19o4q0Q1j13L0K68k19J6R9p3K65l30LK17l35
3659a73O2J56p9j4R0k04N6M8j23M5K03j76J69l25K33K70k68J35r3j63L30o3j77
$$ plain form
3682 -61 101 -70 -169 180 -85 -22 -33 -238 35 55 -209 -32 129 -12 109 -34 100 194 9 -19 -36 -50 34
3705 34 -7 -169 6 -27 -6 28 34 -121 96 -158 -57 46 109 -64 151 62 262 -104 -224 106 11 -70 108 -117
3729 -117 -63 106 -285 -33 22 -175 165 -65 48 27 -141 -60 -18 -241 85 103 -25 90 -54 -8 -68 -37 -125
3752 -125 -82 -40 -78 -37 -219 76 -83 -104 175 -219 -146 -48 -107 -49 147 -73 -36 -18 -118 -37 152 -181 29 -30
3776 -30 -196 52 -100 -41 44 -115 7 12 1 44 65 -35 -43 -72 -30 145 -53 9 192 -34 94 38 36 -90 -43 -88
3802 -88 -62 47 -125 -31 -205 -72 59 -72 20 161 -31 59 -63 -103 88 85 -30 119 -52 32 -52 -185 -28
3825 -28 -112 -101 -33 187 -18 -3 -96 -15 170 -162 82 98 11 -120 25 65 50 -90 -65 129 -43 53 -104 -116 -155
3850 -155 -162 -80 7 -51 -190 93 -3 19 22 -73 56 129 -154 121 58 -15 -30 -43 -71 -175 -114 -98 229 -154 240 23
$$ packed form
3682f1J62j71r9L49k65O3j1k05K73K0k64J77J61j41J21j43J34R4j85k8j7j4Q4
3705C4m1j62J75l3K1L4Oj55K17k54J01J03O3j73K15q9K00l66j20L30r5q1J78k25
3729a17N4J69l91K52N5j97L40k30J13k1j68Q1M2k23L26J8j28J15j44M6o0L1q8
3752a25M3M2l8M1j82K95j59k1K79l94P3R8n9N8J96k20L7J8j00Q1J89l33K10n9
3776c0j66K48j52N9Q5j59J22Nj1M3K1j00qk9M2J75j98O2J83k26J28n6kj26M7m5
3802h8K6J09j72R4j74J33J31j31R2J41j92R0j22m0J91lj15J49j71Q4q4j33J57
3825b8q4J1O8K20k05J5r3Q1J85l32K44J6q7j31J45M0j5j40K5J94j72R6j57j2l9
3850a55pQ2Q7n8j39K83r6K2Lr5J29P3k83K75o3p3j5j3k8j04O1J6L27l83L94k17
$$ plain form
3876 23 31 26 31 -59 -19 28 -44 162 -24 -90 62 -141 23 79 -98 89 -125 -158 37 -74 -270 172 -27 -152 60
3901 60 -159 153 -22 -6 35 -239 -103 -38 5 0 59 -75 -69 -23 -168 106 -72 -81 -142 -94 107 56 -37 65 101 -180
3927 -180 -66 28 -138 99 -3 -273 133 -147 -144 59 -203 -51 -83 -141 -135 -55 81 -68 -70 -95 202 18 76 88
3951 88 17 16 136 59 162 38 -84 48 -11 -199 127 -95 -43 142 -116 284 55 37 -15 27 80 -53 -115 -56
3975 -56 105 -176 -55 49 -15 -238 12 108 23 118 -113 37 52 -42 105 35 -36 138 -43 230 279 9 132
3998 132 141 -74 52 142 -196 291 -96 0 18 -72 -107 -7 -75 98 71 -150 218 -91 53 73 8 74 74 -57 125
4023 125 -117 -70 27 -14 -78 -117 -43 -66 120 -107 -100 189 -85 18 42 -25 280 -64 -178 -116 -59 -99 140 -91 -57
4048 -57 -57 0 -146 51 -109 255 -32 -59 283 43 -30 64 -57 128 28 -35 92 -8 -91 -145 -36 -136 23
$$ packed form
3876B3QnNr0M0M7p2K06j86o6J52k03J64N6j77J87k14l3J95j11j96M42j99j25K12
3901F0k19L12j75J6M1k74J36O5M3nN9j34OM6j45K74j78ro1M8K01n1r3J02L6k81
3927a80J14R4j66K37j02k70M06k80LK03k62J52l2n8OQ0J36j49kk5K97j84N8J2
3951H8p1jJ20p7J03j24j22J32n9j88L26k22N2J85k58M00k29j8n2M2N3j33o2N9
3975e6J61k81J21J04o4k23K50R6q5R5k31J50J5r4J47p0p1J74j81K73M9k70J23
3998A32Rk15J26R0l38M87l87R6J8r0l5J00o8J73k7k21L68l09J44K0o5O6%j31J82
4023A25k42M7R7m1o4l9P4k3J86k27PK89k74J03K4o7L05l44j14O2N7m0K39k31L4
4048e7%N7j46J97j60L64k87k7L42k40p3R4j21J85j00o3J27j00q3n4J09j00J59
$$ plain form
4071 23 -91 -153 119 -69 130 -37 -84 101 -36 27 -58 -73 185 354 -84 58 174 -260 122 -112 -77 105
4093 105 -134 148 -96 -131 -38 -18 -149 -106 250 -44 144 170 99 -35 -147 -129 90 -48 50 47 -66 -29 -37 -167
4117 -167 7 -16 -180 -38 -31 -23 109 46 -70 56 -15 71 48 -2 26 36 -92 57 124 90 -4 22 -92 82 -182
4142 -182 48 -43 117 205 -84 27 106 -60 -31 -70 242 188 11 -108 -112 -63 -168 128 -50 -115 189 48 -191
4165 -191 167 101 127 -66 -81 8 39 0 -91 49 -179 150 -146 -18 9 -51 230 -63 -94 93 102 -235 319 -53
4189 -53 -72 158 8 -159 -48 -111 94 122 -131 222 -10 -30 151 141 -90 60 -154 -166 99 -128 -212 38 -124
4212 -124 81 -15 75 111 63 -55 135 2 47 146 -133 -8 28 -228 186 -25 -105 8 -18 -34 -68 12 -71 203
4236 203 45 26 121 23 -52 182 -109 37 -27 -133 -118 -88 81 4 -164 -8 -2 -231 257 21 -140 262 -62
$$ packed form
4071B3j14o2K72j88J99j67m7J85j37O3q5j5K58J69m38J42J16m34L82k34L5J82
4093A05k39K82k44l5R3K0j31M3L56k94J88K6p1j34j12J8K19j38R8lj13L7qj30
4117a67J74k3j64J42PQJ32o3j16J26p1Q6k3n0K8J0j28J49O7l4r4K6j14J74k64
4142a82K30r1J60Q8k89J11P9j66K9l9L12n4j77j19mM9j05K96j78o5L04j41k39
4165a91L58o6K6j93j5Q9L1l9r1J40k28L29k96J28K7o0K81k93l1J87Rl37N54l72
4189e3j9K30j50j67J11o3K05K8k53L53k32k0J81j0k31J50k14j2K65k27q4K50j62
4212a24K05r6R0L6m8j18J90j33M5R9k79J25L6k56M14k11q0J13k6j6l4Q0q3K74
4236B03j58j9R5r8p5K34k91J46o4j06J5L0J69p7j68J56Ok29M88k36j61M02l24
$$ plain form
4259 -62 -48 276 -27 188 258 -35 5 0 -90 141 16 8 62 -118 23 10 43 82 -40 -126 34 106 -262 177 -138
4284 -138 68 192 15 59 105 -88 4 29 -54 -175 16 -47 -80 -124 32 198 -143 69 146 -77 157 -69 5
4307 5 181 -150 -70 23 -73 1 24 -38 79 176 -70 96 -76 -75 116 14 186 -28 31 -24 116 27 116 108 37 241
4333 241 140 -48 42 -37 -64 -44 23 117 -85 -105 -2 158 -115 85 -209 -5 147 -62 17 300 -7 79 141
4356 141 -135 111 -111 -223 90 -50 154 16 -48 -67 -70 -60 -90 118 -184 58 -69 150 161 -138 -92 129 -93
4379 -93 112 -182 -33 -4 -9 -48 -34 131 -265 66 -26 -24 88 -108 178 145 -167 111 -57 -11 97 58 -80 159
4403 159 -160 -87 27 -258 -12 69 61 -11 -65 -180 76 30 -147 224 57 28 257 -55 189 64 10 100 137 -194
4427 -194 -3 126 -15 69 -35 -133 131 -289 112 16 -109 65 60 -5 163 158 -59 143 -14 60 140 -30 156
$$ packed form
4259f2J4L24l03K15P0k93M0nr0K31j25qN4j80J41j3L3L9j22q6J60P2l68M39l15
4284a38K06J24j77M4M6j93R2K5q3j21J91o3l3m4J56J66l41K12P7k23K34k26P4
4307EJ76l31Q0R3r6P4K3o2J17R7k46J66j72JJ91j02J72k14N9n5J40q9Q9qp1K04
4333B41j01j88R0p9k7K0O7R4k02k0J03J60k73K00k94K04J52k09P9K83l07Q6O2
4356A41k76K46k22j12L13j40K04j38o4j9lJ0l0K08l02K42j27K19J1k99M6K21k22
4379i3K05k94J49K9nl9J4J65l96L31r2KJ12j96K86l3l12K78j68M6J08l9j38K39
4403A59l19P3J14k85K46Q1qp2n4j15K56m6j77L71j67k9K29l12K44j25n4R0L7l31
4427a94J91J29j41Q4j04r8K64m20M01r6j25J74no5J68nk17K02j57P4Q0j70J86
$$ plain form
4450 156 -81 -117 248 -119 -9 -4 -111 -16 116 -15 -4 130 -53 -51 35 -73 47 65 -57 -18 -89 -19 18 -5 29
4475 29 52 -168 60 -36 -223 90 -31 122 95 46 61 132 -83 83 9 -10 -98 -37 112 12 -161 3 58 -197
4499 -197 -225 82 -18 -24 73 -98 139 -124 -26 -22 -114 -72 152 62 90 97 -125 -8 38 -87 56 17 -138 79 50
4524 50 -63 59 -198 0 127 67 -16 -5 -129 317 15 -80 33 -179 184 84 -135 152 -46 108 17 69
4546 69 -141 202 -45 -126 -38 -201 64 -26 57 298 60 -147 123 123 -163 124 50 -61 51 -321 100 51 -56
4569 -56 7 76 -134 254 15 -27 149 -10 108 68 54 21 167 -138 -57 -54 -63 -19 -29 -54 149 -43 9 -26 -216 56
4595 56 117 9 177 12 10 -96 -115 85 320 -76 87 166 -73 -121 -160 14 78 -34 -85 -81 38 -7 131 -22
4619 -22 65 2 106 -80 313 -176 4 27 -20 55 -60 -44 116 27 -143 21 -88 22 172 -137 -44 -33 14 182
$$ packed form
4450A56k37l6L65l67J10Nj07R5J32j31J1J34j83KQ6j08J20J8j22L9p1P0L7k3L4
4475B9K3k20K28r6j87L13j21J53k7m9J5P1k15J66p4j9q8O1J49j00j73J64N5k55
4499a97k8L07j00oR7j71K37k63R8Mr2M2K24r0K8Pk22J17M6j25J43l9j55K17k9
4524E0j13J22k57J98J27o0q3J1j24M46l02r5J13k12L63j00k19K87j98J54r1N2
4546F9k10L43k47q1Q8j63K65r0Q3K41k38k07K70%k86K87p4j11J12l72M21m9j07
4569e6O3O9k10L88k39m2J76j59J18m0j4l3J46l05Q1LrM4j0k5K03j92N2l5j90K72
4595E6O1j08J68j65kj06j9K00K35l96J63P9k39m8l9J74O4j12n1MJ19m5J38j53
4619b2Q7o3J04j86L93m89J80K3m7P5j15J6J60q9j70J64j09J10J50l09R3J1M7J68
$$ plain form
4643 182 99 12 271 -37 -34 132 -68 68 -160 -34 170 -82 -17 110 -45 -29 30 -11 -68 120 -83 42 186
4666 186 -106 37 -133 49 71 -11 13 45 -174 148 -98 -162 -180 -90 175 63 34 92 -60 -132 -11 82 -60 195
4690 195 -10 -58 -6 29 -20 55 -198 -212 -41 -174 -53 -22 -42 -59 -15 1 125 -42 -65 90 18 41 154 -118 53
4715 53 46 -5 2 43 -20 -10 -45 -143 170 -98 -145 -14 -67 92 -30 -81 54 18 -71 88 -24 32 6 -35 20 15 56 -28
4743 -28 -14 -125 124 -53 25 207 69 -66 155 21 -3 -40 -20 -111 74 52 -12 -21 84 -27 -81 73 -64 -12
4767 -12 -158 46 13 -67 26 -27 48 13 53 -137 -25 68 -75 42 35 246 -234 -29 -52 -29 -9 -99 -41 122 -39
4792 -39 -52 -126 -24 81 18 -167 112 197 52 295 91 11 -39 -73 -170 -114 8 -86 -159 -213 -13 51 -88 155 -193
4817 -193 -35 30 -82 48 279 -97 138 134 -153 -46 -134 136 57 -25 -46 24 110 -17 50 -80 -72 -49 -106 151 185
$$ packed form
4643A82q3q7K59l08LJ66k00J36k28J26K04k52O5J27j55J6N9m1n7J88k03J25J44
4666A86k92J43j70J82K2q2K4L2k19L22k46o4j8R0K65j12k9N8j52p2J21R3j42K55
4690A95k05m8N2L5m9P5k53j4J71j33J21L1k0j7M4J6J24j67k3J55p2K3J13k72J71
4715E3pn1PM1o3J0l5r8L13k68m7J31n3J59j22n1J35l6q9J59j12N6k6m1N5nM1q4
4743b8J4j11K49j77P8J82j38j35K21j34k4l7K0r1J85k2o4rJ05j11n4J54j37N2
4767a2j46K04l3q0R3n3P5l5M0j90J12R3j43J17pK11m80K05k3K3K0r0N8J63j61
4792c9j3p4J02J05o3j85K79Q5j45K43k04q0n0l4r7N6J22r4p3n4K00O4j39K43l48
4817a93J58O5j12J30K31l76K35mk87J07q8K70p9q2k1P0Q6j27O7j30QK3n7K57L4
$$ plain form
4842 185 77 127 76 11 -51 105 98 -23 -269 115 -11 -113 -41 -25 26 55 -103 -24 -13 75 93 -53 -68 190 -59
4867 -59 -77 188 6 145 79 -192 -40 -86 -21 5 -90 15 -123 -177 -16 0 -146 71 -75 -14 35 -28 -128 211
4891 211 26 -114 -72 190 -131 -29 -180 95 83 189 -27 101 -100 73 -44 -20 152 74 -103 185 -39
4912 -39 -99 57 -173 -49 -10 -145 -22 -139 -88 90 -85 -65 73 25 148 43 -120 27 -24 -71 -53 28 159
4935 159 80 -7 37 172 33 -45 -3 -98 -18 -11 -118 29 182 69 54 -10 -37 18 -65 100 146 -28 41 1 -21 -22 -128
4962 -128 -73 195 -56 -79 54 8 72 88 -188 -151 -130 -200 37 -81 11 100 53 -33 63 158 152 -35 -90 112 53 -29
4988 -29 102 -59 -163 115 66 -73 -54 140 -13 68 -16 108 148 -34 150 110 -169 22 -16 -16 -1 -62 158 54
5012 54 30 -9 99 -20 73 69 -76 178 1 -53 173 53 142 -17 -17 -6 -38 -9 30 -84 -98 -14 -118 -57 55 -55
$$ packed form
4842A85j08N0n1o5o2J56pj21k46L84j26j02P2J6N1K9j58P9J1Q8J8j46j5K58k49
4867e9j8K65j82J39o6k71J52m6O5K6r5J05j38n4J61J6j46K17j46O1M9o3j00L39
4891B11j85j40M2K62l21J02j51K75j2J06k16J28k01J73j17K4J72p8j77K88k24
4912c9o0J56k30J24L9j35J23j17N1J78j75K0J38m8J23j05j63J47n1m7J8Q1J31
4935A59p9q7M4J35j39p8M2r5Q0Pj07J47J53j13j5o4k7N5q3J65M6j74O9m0k2jj06
4962a28N5K68k51k3J33m6O4J6k76L7K1p0K37j18R2Q9m7q6R6R5oj87n5K02n9q2
4988b9J31j61j04K78m9j39J9J94j53Q1q4J24M0j82J84m0k79J91l8%J5o1K20j04
5012E4k4l9J08j19R3mj45K54j77n4K26j20Q9j59%J1l2K9L9j14j4Q4j04O1J12j10
$$ plain form
5038 -55 221 77 -60 52 -16 -114 27 -8 -115 -39 28 161 89 -55 -129 -78 -197 56 -50 -109 131 29 60 245
5062 245 -156 27 57 -80 93 -88 73 124 -8 -65 -7 -28 -133 31 -64 61 -28 -28 67 -31 91 98 -180 -51
5086 -51 30 -5 -109 77 -200 69 21 -85 19 60 59 -90 76 5 13 56 218 99 -41 97 33 32 -121 82 23
5111 23 -116 23 -102 145 -8 54 112 -30 -210 148 74 -40 -65 -78 -6 159 -127 12 -43 72 -30 -22 161
5134 161 -31 -36 -79 -121 12 85 -78 120 111 19 97 91 42 -172 2 84 -2 87 -148 -59 -128 30 -64 -99 -1 -45 -137
5161 -137 180 35 -60 73 -29 -11 -84 -58 -147 -56 -14 -63 93 -125 -8 -35 -125 -105 56 -48 125 -94 173 70
5185 70 -237 -40 154 -142 62 -121 -77 106 -107 -62 -96 86 83 103 -70 93 -15 -58 19 -58 -89 7 -44 58
5209 58 125 120 288 82 -168 175 1 -7 137 -35 59 161 -8 -54 3 -115 90 218 77 147 -42 7 -98 12
$$ packed form
5038e5K76j44j37J12o8r8J41l5j07P6O7J33p2j44p4N1j19K53j06n9K40j02L1J85
5062B45m01J83L0j37J73j81J61N1j32n7N8k1j05J64r5J25q9%R5r8J22Pk78J29
5086e1Q1l5j04J86k77K69m8j06J04M1jj49J66p1QM3J62j19j40J38o4jj53K03n9
5111B3j39J39j25K47j53O2N8j42j80L58p4j14k5j3P2J65k86J39n5J15j02QJ83
5134A61j92nm3m2J33P3j63J98rr2P8om9k14J74Q2q6Q9k35Q9o9J58r4l5R8m4r2
5161a37L17j45r5J33j02J8p3K6q9R1M2m9J56k18J17k7r0K0J61j04J73k19K67j03
5185G0l07J97J94k96K04j83M4J83k13M5l4J82lK0j73J63j08m3P7p7l1R6n1J02
5209E8O7nJ68k06k50L43j74qJ44j72R4J02j69m6N7j18K05J28j41P0j89M9j05J10
$$ plain form
5233 12 -34 15 -41 -21 -18 -113 -48 -149 -111 46 -227 42 195 -23 -3 124 34 -12 108 167 99 35 -157 -147 8 -45
5259 -45 37 65 49 -75 84 47 1 -4 -11 -51 -23 73 -49 -15 113 -147 -166 103 -111 22 -112 -50 -146 -89 -30 53 -13
5286 -13 88 -67 -53 -28 -184 -4 94 -28 -16 208 -76 -124 80 -49 7 -82 -67 -82 44 -9 65 -108 42 -85
5310 -85 -4 210 39 11 -55 32 78 -16 -126 -183 63 -64 -94 138 -198 -55 -81 -68 -128 22 -217 89 -59 -152
5334 -152 202 -149 55 -3 76 119 240 -102 33 -112 -110 32 41 72 102 -99 30 -3 43 96 84 -182 152 24
5358 24 -13 41 -109 66 122 -27 -65 -124 -217 67 53 -93 -50 52 -69 4 -65 178 -122 -125 44 98 -1 50 -61
5383 -61 -175 5 13 -65 38 3 -56 90 122 104 236 -186 96 6 -164 -87 -55 25 -41 -48 9 97 -155 -24 -25 58 96
5410 96 -66 -150 105 -122 -27 10 -211 -147 114 -147 32 -12 51 -93 100 -148 89 -25 -169 150 -131 88
$$ packed form
5233A2m6M9n6K0Lr5O5j01L8J57k73K69J53k18K0J27r0m6J20N9o8o4j92J0J55n3
5259d5Q2K8j6j24J59l7m6npm0K8R6j22L4J28k60j9K69k14J33j34O2r6N7N9Q3o6
5286a3J01j55J4K5j56J80R8j22J2K24k84m8K04j29N6q9J5j5J26n3P4j73J50j27
5310h5Q1K14j71k8o6Q7M6r4j10n7K46j27l0K32l36J43k6J3o0J50k39L06j48r3
5334a52L54l51K04n8P9M3J21l42J35j45KJ42RL1L0k01J29l3M6N3j2k66L34j28
5358B4l7N4j50J75N6j49l8n9r3K84j4j46M3J02j21P3o9K43l00lJ69N4r9N1j11
5383f1j14J80Qp8J03l5n9J46L2j8J32m22K82r0j70P7L2Q0o6pN7Q8k52J31jQ3L8
5410I6j62q4K55k27R5L7k21O4K61k61J79m4O3j44J93k48K37j14j44L19k81K19
$$ plain form
5432 88 -52 -129 -184 -39 -168 13 -78 -260 -56 -157 -38 95 -45 98 -15 -131 -76 10 -43 131 -150 -207 158
5455 158 -46 -3 110 -156 -204 -85 -30 30 -17 34 27 -175 77 85 -27 102 -16 -71 -117 -14 -50 -41 -32 -38 111 -102
5481 -102 -78 165 8 1 74 -40 -31 41 -10 99 -156 -173 180 -96 -86 205 -29 -51 -59 35 -149 -125 -63 13 -69 -44
5507 -44 -4 34 -53 75 6 110 -4 7 35 -63 41 231 -50 52 24 14 37 40 -160 -22 -96 -89 212 13 30 7
5533 7 -10 64 46 -3 27 23 26 3 129 -205 21 62 -1 175 -6 -25 -59 38 -2 47 -14 7 82 -31 70 -74 40
5560 40 72 -101 102 -27 -7 45 68 41 73 133 58 -159 -124 41 34 -102 130 122 -31 69 -121 -88 130 -43 33
5585 33 132 155 -59 -39 -220 9 68 -56 76 3 -112 -161 18 -112 -78 -90 -8 67 20 -62 -121 -108 -168 19 -107
5610 -107 -4 135 90 39 -265 -82 -48 28 80 0 80 -128 120 -48 -146 -32 68 233 43 3 45 -46 -84 -68
$$ packed form
5432H8j40p7n5J45j29J81r1j82K04j01J19J33j40J43j13j16N5Q6n3J74k81n7L65
5455A58k04M3J13k66m8J19N5O0m7N1pk02K52Qj12J29j18n5m6J03l6RRoJ49k13
5481a02K4K43j57pP3j14RP2n1J09k55j7L53k76J0K91k34k2qR4j84K4O2P6q2K5
5507d4M0L8q7J28o9J04j14J1K8r8J04J90k81J02k8j0K3Lk00J38p4PL01j99J7k3
5533Gj7P4j8m9L0mLk3J26l34K26M1o3J76j81j9l4R7m0M9o1K1P5j13J01j44J14
5560D0L2j73K03j29K0N2K3k7L2O0p5k17L5J65pj36K32qj53J00j90L3K18j73P6
5585C3R9K3k14K0j81K29N9j24J32p3j15m9J79j30L4j2Q2P5m7q2n9J3o0J87j26
5610a07J03J39m5n1l04J83L4P6N2q0Q0k08K48j68r8J14J00J65j90m0M2r1l8J6
$$ plain form
5634 -68 -150 -42 -87 -58 248 63 60 142 169 35 24 83 2 -119 25 -81 191 -23 61 39 -63 -8 -251 -26 24
5659 24 -150 39 -110 -58 -21 22 -105 -49 57 41 32 -65 -51 -136 -166 24 -43 -36 173 8 -60 1 16 -3 -157 -89 86
5686 86 -12 -33 -14 126 21 14 183 34 19 62 133 130 88 -144 -32 -144 -325 -52 -4 37 -56 145 179 -47 31 212
5712 212 -58 -39 57 67 102 43 -129 133 -53 -236 66 -33 95 42 -135 -71 -23 -36 158 31 8 43 115 -90
5736 -90 104 -56 44 60 11 120 116 -142 23 47 -4 -59 -49 208 -50 163 63 140 -51 -34 76 -219 71 171
5760 171 -60 95 18 119 125 13 -28 93 -44 37 -102 -134 85 -9 -19 13 -64 17 157 -108 49 -16 -153 260
5784 260 44 -198 211 -51 24 153 -15 2 -89 -153 -73 48 -18 68 24 7 27 18 -86 30 -44 -40 69 -60 -60 -84
5810 -84 -194 17 110 -160 128 -147 35 -122 -29 -29 -26 53 20 -15 -23 37 -21 -188 57 -131 -50 50 23 106 9 37
$$ packed form
5634f8q2J08m5K9L06j85lQ2K7j34j1N9q1j21J44j06K72k14Q4k2j02N5k43K25N0
5659B4j74J89j49N2L7M3j27N6J06j6rr7J4q5l0J90o7PK09j65o8O1J5j9j54O8J75
5686H6r8k1J9J40j05pJ69j49j5M3P1lm2k32J12j12j81K73M8M1r3K01L4k26P8J81
5712B12k70J9R6J0L5n9j72K62j86j83L02r9J28n3j77O4M8j3J94j27k3L5P2k05
5736i0J94j60J00J6m9J09mk58J65K4n1n5J0K57k58K13j00P7j91J7J10k95K90J00
5760A71k31J55p7J01Oj12m1J21j37Q1j39l2K19r4j0L2p7Q1J40k65J57o5j37M13
5784B60k16k42M09k62P5J29j68J7r1o4Q0J21o6Q6m4j7K0rj04J16p4MJ09j29%k4
5810h4j10K11R3k70K88k75J82j57R3%LP9l3l5qO0n8j67K45j88Q1J00k7Q3r7K8
$$ plain form
5836 37 127 37 8 -3 -208 -189 5 -13 -32 101 -1 -66 86 -25 -13 -133 -144 -130 51 -55 31 -34 82 0 24
5861 24 127 -116 -94 103 4 -10 90 2 -2 76 -96 -42 -53 7 27 -87 -21 -72 140 -156 33 86 -5 12 -22 -80
5887 -80 181 -195 35 -15 -21 46 -7 15 23 -96 14 49 16 185 110 -15 110 -66 -89 101 -99 -88 78 3 79
5912 79 -61 75 169 24 -13 -77 3 -11 39 -103 9 -59 6 127 125 -43 20 46 -16 3 57 1 75 106 103 -5 70
5939 70 -71 -95 -89 -48 97 9 118 -21 125 91 -84 48 43 -58 44 119 75 56 79 -57 6 -54 -64 -25 74 63
5965 63 -61 -132 -133 -30 20 71 -53 40 -101 15 62 45 -138 41 221 86 59 -85 -166 42 200 -122 118 -85
5989 -85 -15 113 -36 -40 -31 -104 121 88 206 -42 92 -172 -66 -49 96 -82 66 139 73 -14 32 -88 -225 -65
6013 -65 39 63 -95 -44 124 78 -69 -125 -121 4 -70 76 -53 24 8 -70 25 155 42 76 -46 -23 -92 -56 8 -2
$$ packed form
5836C7R0r0k9j1k05J9J94j8j9J33j02o5J52j11J2j20j1J4J81j06Q6o5J16q2K4
5861B4J03k43K2J97r9j4J00q8mP8j72N4j1O0K0j14O6n1K12k96J89N3r1J7l4n8
5887h0K61l76K30n0oO7n3K2Qj19J10L5l3J69p5j25J25j76k3J90k00J1J66p5P6
5912G9j40J36R4j45l7o4Q0j4N0j42J12o8O5J21kj68O3K6o2J9N4n6P4L1lj08P5
5939G0j41k4OM1J45q8J09j39J46l4j75J32nj01J02P5m4j9K3j36O3o0j0L9R9j1
5965F3j24p1jJ03N0N1j24R3j41J16M7j7j83J79J80j35k7j44q1K08J58l22K40k03
5989h5P0J28j49mRp3K25l3J18k48J34k64J06J7J45j78J48P3o6q7M6j20j37J60
6013f5J04K4j58N1J68m6j47n6MJ25p4J46j29P7j6p8R5J30j13L4j22K3o9L6O4j0
$$ plain form
6039 -2 -108 -15 -99 -18 28 -154 -114 79 50 134 30 -19 54 -34 78 110 78 -47 12 -49 169 67 -73 -43 27 47
6065 47 44 -56 -61 172 -151 -132 125 23 -70 -20 -47 -16 67 40 31 -150 -14 -33 -94 2 52 -55 -95 -102 -4 17 -15 -4
6093 -4 57 266 -50 -57 -92 -52 -49 -133 -9 49 -21 87 -238 -6 67 -12 -43 -34 -22 -103 21 -119 -107 -18 53 34 37 -121
6121 -121 24 -21 91 -29 52 95 37 -75 -62 5 22 -9 91 4 -27 -147 104 84 -100 29 1 -28 165 24
6145 24 101 119 -10 161 103 -161 60 -142 -72 28 -90 51 34 14 -78 119 -34 -29 43 -21 -31 38 -23 -41 1 -26
6171 -26 7 -44 -9 -96 19 110 119 -104 72 -159 25 -16 13 -115 -98 -65 -36 155 -91 15 -4 -32 140 -123 -132 54
6197 54 41 -103 163 -131 -11 227 163 21 105 -87 -47 -40 80 -105 -40 -124 42 -29 47 -26 -48 -132 38 -76 -11
6222 -11 -32 91 -32 75 -38 23 115 -114 5 -23 -180 44 65 -113 92 89 137 62 -53 -52 53 30 66 14 -24
$$ packed form
6039bj06R3q4Q1M6j82M0J93k9Q4j04m9P3q8J12L2l2j25N9o1K18j02j40L0P0K0
6065D7lj00nK33l23J9K57j02r3N0k7L1Q3k7rj81J36j9o1R6N0j07m0pR8K1l2J1
6093dO1K09l16pl5M0Lq4J24N8p0J08l25K32P3p9l1RJ2q1J24j40J2Q9P1j9Lj58
6121a21J45m5J12j20Q1M3n8j12J3O7J7l1J00q7l1j20K51k0j84J29k8k9J93j41
6145B4P7J8j29J71n8k64K21k02P0J00j18J41j7k0r2J97j53NP2o4j0O9o1j8M2k7
6171b6L3n1L5q7J15R1Rk23J76k31J84m1K9j28J7L3K9J91k46J06j9k8J72k63rJ86
6197E4j3j44K66k94J20K38o4j42Q4j92M0PJ20j85O5q4J66p1P6p3k2q4J70j14O5
6222a1k1J23j23J07j13O1R2k29J19k8j57K24K1j78K05lM8p5j15JJ05k3L6n2l8
$$ plain form
6247 -24 -29 49 21 -78 20 -36 179 38 -79 -130 -107 68 6 -62 84 -76 41 2 -144 -28 36 -24 54 -18 -8 157
6273 157 -3 -167 -57 -48 77 -2 25 123 23 -107 230 -95 -174 144 -140 -138 113 72 84 75 -84 200 85 -65
6297 -65 50 -50 10 -1 28 185 104 -30 73 -75 47 30 -107 -57 87 69 121 -76 -33 164 4 -58 -4 -152
6321 -152 107 194 11 29 164 -15 44 103 80 107 -17 19 -8 -132 87 10 11 144 -92 -121 -44 11 -28 110 32
6346 32 1 -60 -97 93 62 3 -38 -80 -228 -49 -62 -24 136 53 -162 136 15 -3 3 -30 153 84 110 159 -137 -82
6372 -82 -30 4 -74 46 18 -226 -252 -3 -86 -102 -11 49 -147 -36 87 104 -25 -36 93 -78 -33 -91 -14 72 17 -33
6398 -33 40 296 -30 -196 -89 33 -6 132 -5 108 122 -137 31 129 219 -2 -185 -55 41 97 -24 -68 -42
6421 -42 -111 -42 78 -30 50 -112 -72 -111 -119 -34 14 -65 69 65 -199 -67 -67 -131 56 80 -11 -12 -96 -4 43 5 92 -117
$$ packed form
6247b4nP8k8r9R8n6K15j41j17n1K3J75o2o8J46j60J17l9j46J16O4o0P8p2J0J65
6273A57j60j64J10RJ25p9K7R8j00j30L37l25p9L18k84KK51m1J2rj59K84j15j50
6297f5J15j00O0j1K9J57q1j34J03j48J22j7j37N0J44j8N2j97M3J97j60o2N4j48
6321a52K59Q7j83J8J35j79N9N9k3K7j24L6k7j24K19p7JJ33k36k9P7N5l9J38p8
6346C2l1o1l7J90l1n9m1m2j48J79j3L8J60q3k15K98j21j8Ol3J83o9K6M9k96N5
6372h2N2L4p8J20k8k44k6K49q3j6R1O0j96J11J23J7j29j1J29j71M5n8P7Q6n5n0
6398c3P3K56l26j66J07J22l9J38j37J13J4k59J68R8R0k21j83J30R6N6j21m4K6
6421d2o9O9J20j08Q0j62M0l9qQ5M8p9J34mk64J32%o4J87K4r1jq4R2M7l8Q7k09
$$ plain form
6449 -117 -248 -37 -19 124 100 53 11 74 181 103 28 56 69 116 86 25 13 -13 112 -86 -6 -126 -117 3 -11 3
6475 3 26 67 -197 -94 1 -127 23 73 44 90 87 -135 5 22 8 112 -10 166 -28 111 7 -38 139 -5
6499 -5 -23 -1 -31 3 -174 83 -39 -5 -37 -37 40 -50 228 223 49 47 12 -132 -39 -158 -20 68 -125 -42 -199 50 61
6526 61 106 74 -17 74 -131 -10 -123 -43 30 54 -89 -78 37 2 40 58 85 32 -137 -31 -29 3 104 20 27 200 -73
6553 -73 -11 -117 -124 -65 19 -131 131 -65 -200 -53 -6 -193 -140 -27 61 -24 47 66 -35 -75 -85 73 21 16 -36 81
6579 81 -7 -17 -9 131 -29 -119 76 131 38 -49 4 95 -87 134 17 175 52 1 126 -102 18 -206 -106 105
6603 105 -113 -157 -30 -158 -11 -63 96 161 -63 243 13 26 124 -44 -144 -64 -143 76 -37 -55 -54 -13 -8 96
6627 96 2 -96 54 -46 -164 -48 20 -109 71 3 65 44 -208 -58 -123 142 -6 -9 125 66 -54 -42 20 -97
$$ packed form
6449a17j31K11J8J43k4m7m2O3J07p8p5K8J3M7l0o1j2k6J25j98Q0j20RJ20j4J4
6475CK3M1k64J03R5j28J50N0k9M6lk22J40J7j4J04j22J76j94J39j04m5J77j44
6499ej8K2l0L4j77K57j22L4l2%P7r0K78nj74kl5j44R3j19J38Q8j93Q3j57K49J1
6526F1M5l2r1R1k05J21j13Q0P3K4j43J1J15l5L8J8K7n3j69J06KL2J01q4PJ73k73
6553g3O2j06pN9Q4j50K62j96j35J47M7j87N3J13Q8q5P1J9j01m0j0J58n2nn2J17
6579H1q8j0QJ40j60r0J95N5r3q7N3R1j82K21j17J58j23n1J25k28J20k24J00K11
6603A05k18m4J27j28J47n2J59O5k24L06k30J3R8j68j00Q0p9K19j13j8JM1NJ04
6627I6r4r8J50j00j18J16O8j29J80o8O2k1k52J50o5K65j48lJ34n9j20J2O2j17
$$ plain form
6651 -97 61 73 46 -98 216 28 61 209 -21 -72 -47 164 -25 1 -8 -127 88 56 161 -90 33 -19 -85 -208
6675 -208 -114 -12 55 180 125 144 -14 8 -23 34 156 -34 98 12 -91 -183 104 -26 -11 -140 0 63 -84 140
6699 140 122 -113 6 -77 -86 10 -28 -3 101 -51 -164 -33 -29 90 17 -67 -120 186 -5 222 -78 -37 138 -93
6723 -93 138 -88 108 79 -133 -11 -97 -108 -38 47 122 -12 119 -6 -101 194 -222 157 37 -245 57 3 -31
6746 -31 -33 -54 105 151 -39 16 -129 20 81 15 -96 -62 -89 89 105 -218 -174 115 16 75 39 -111 -48 -236 -34
6771 -34 45 -83 -81 -16 77 -4 -68 126 37 81 -95 -69 8 -70 83 63 -57 -148 48 60 34 47 151 68 -49 -100 -3
6798 -3 -101 -57 -24 -70 146 -25 34 34 73 -13 -183 -82 -28 109 -14 37 75 33 -32 -239 9 -90 90 -19 14 97
6824 97 60 87 90 155 -18 -134 111 -17 -55 -52 -52 112 -31 9 20 -17 -135 93 146 90 58 -15 48 203 -10 -77 228
$$ packed form
6651i7J58J2k7j44L14j88L3J48k30n1K5K11j89K6rj19K15l2J05k51J23n2o6j23
6675b08R4J02O7J25n5J9j58K2l1N7J22j90J32q6j03r2K87j30J5j29J40O3j47K24
6699A40j8k35J19q3rR6l8K5J04j52j13J31MJ19p3q4n3L06j91K27l00M1J75k31
6723i3K31k26J96k9k12J22q6j1P0Q5P5j34J31j25r5K95m16L79j20k82L02n4l4
6746c1kk1J59M6j90N5j45J49O1o6j11L4k7J78J6l23M4K89r9N9l6j50O3j88K02
6771c4P9j28KO5R3q1o4J94q9M4j76K6P7p8J53k0j20r1J96J2k6J3J04q3j17n1R7
6798cr8M4L3m6K16j71N9%L9q6j70J01N4J37j23N1L8m2o5k07K48r9J80j09L3Q3
6824I7l7K7LO5j73j16K45j28l8L%J64j43M0J1l7j18K28N3n6l2p3O3J55k13o7L05
$$ plain form
6851 228 5 35 -112 2 -99 -108 10 -23 -98 107 68 -49 -124 -271 5 -2 74 -195 -56 -13 -68 43 150 -117
6875 -117 -69 -100 5 89 -60 129 -166 -38 -28 95 80 -93 -86 104 72 -120 -111 -41 -181 -59 91 -135 22 -3
6899 -3 -52 163 38 32 -37 31 36 121 54 85 91 18 227 15 70 66 17 17 27 -27 27 -169 44 -70 -124 -144 120 38 41 39
6929 39 -34 43 -13 -150 -60 -150 -44 262 -72 -97 8 -204 13 -52 -110 -41 -18 146 -54 20 27 -67 -7 69 119 -50
6955 -50 163 -96 7 147 -194 93 -13 -95 -6 -40 -86 -61 128 -64 82 218 31 148 41 -158 26 -78
6977 -78 -25 128 57 97 -74 -28 -50 -47 33 -82 -63 -3 -77 59 -49 50 -33 -121 120 -169 -16 -21 114 222 -32 -27
7003 -27 -50 183 55 -42 -96 -18 73 18 60 2 22 -27 -26 19 84 13 93 -13 -17 -28 15 106 -125 120 -89 15 -126
7030 -126 51 14 -259 87 -9 46 -58 130 -50 0 -115 -108 -101 -126 -28 119 -50 -287 114 -85 -48 -13 63 43 -84
$$ packed form
6851B28k23L0j47J14j01rJ18l3p5K05l9j17p5j47K76pP6k69J39M3n5J11J07k67
6875a17M8l1J05Q4j49J89k95J28J0J23j5j73PJ90l2j92RP0j40J22J50k26J57k5
6899cm9K15j25oo9O8NQ5o7L1Op3K09k12N5mm9%J0n4N4j96K13j14n4k0K64q2Lk
6929C9p3P7n6j37R0r0J06L06l34k5J05k12K17o5n8O9K3J64k00P4Pr4O0P6N0j69
6955e0K13k59J03J40l41K87j06q2Q9l4m6K5J89j92J46J36j87J17j07j99J84j04
6977g8N3J53p1M0j71M6k2LQ0j15J9O0p4J36j08R9q3q8K41k89J53nJ35J08k54N
7003b7k3K33j28r7n4P8R1n5M2n8K0m9JM5O5p1Q0j06mj1M3R1k31K45k09J04j41
7030a26J77l7k73L46r6N5j04J88j80N0j15PPk5R8J47j69k37M01j99L7L5P6k0j27
$$ plain form
7055 -84 -55 27 -98 17 -120 107 28 9 -96 -10 -94 22 44 -115 -134 -177 38 86 -137 -12 -38 38 -101 86
7079 86 10 -129 125 -143 192 28 -65 -23 185 -31 66 184 -104 -24 131 -88 40 -108 -18 128 -39 -4 -110
7102 -110 -23 33 -44 101 -34 21 -33 95 -26 68 17 -129 74 206 2 169 -47 142 -134 -80 -98 46 -60
7125 -60 -11 79 -1 -101 20 -115 -153 7 -65 -74 -2 -100 -10 -100 -8 -35 48 76 -60 4 118 167 -208 33 22 52 -24
7152 -24 -115 110 -16 -84 95 -81 -1 115 -44 -162 -76 -58 130 98 -43 133 10 -209 126 -203 -13 84 145
7175 145 31 167 -115 56 93 -32 224 -25 -58 -84 15 150 76 30 -78 -107 -72 -141 -14 17 15 -35 -31 107 -34
7200 -34 -84 26 79 53 -136 78 115 78 -126 94 151 48 -18 82 113 -191 -80 53 85 95 41 153 167 39
7224 39 9 72 -38 -140 77 61 -171 -166 -55 -22 182 -25 -147 13 72 -8 1 30 -53 31 -44 -77 79 -62 110
$$ packed form
7055h4K9Q2j25J15j37K27p9j9j05Q6q4J16K2j59j9m3K15M8k23J25k6P6j39J87
7079H6p6j39K54k68L35j64r3M2K08k16R7J18k88Q0J55k19J28j48R0J46j67L5j06
7102a10Q7N6p7J45j35N5n4J28j21R4n1j46K03J32k04J67k16J89k76N4j8J44j06
7125f0M9R0q0j00J21j35l8J60p2rP2r8R0r0R2k7Q3K8j36O4J14M9l75K41j1L0p6
7152b4r1K25j26o8J79j76Q0J16j59j18Q6J8J88l2j41J76j23k19L35l29J90R7O1
7175A45j14J36k82J71L7j25K56k49l3k6R9J35p4m6j08k9L5o9J27L1kn0MJ38j41
7200c4n0J10N3k6j89K14L7l7k04K20N7j03o6J00L1l04J11J33L2J0n4J12J4j28
7224C9l0O3j10j02K17j6k32NJ11L3K04k07j22J60N9q0RK9q3Q4p5l3J56j41J72
$$ plain form
7249 110 -40 56 7 52 -27 57 -1 -117 30 -180 14 77 -104 63 43 99 155 -122 -136 224 -129 -82 72 119
7273 119 -58 -32 -250 191 73 100 89 11 -67 -26 -2 -32 91 -35 -2 -95 72 175 181 -30 121 27 18 -26 -57 92
7299 92 31 220 161 -184 75 -19 15 -91 11 -25 149 39 -4 -26 17 24 149 82 -93 -89 -4 -50 -44 176 -31 116
7325 116 -123 -67 -18 130 3 9 166 -39 -201 -85 -78 35 62 14 5 -1 -19 35 123 -68 -41 -104 -38 46 47 -83 -126
7352 -126 32 -10 -4 -38 -51 -106 108 -80 31 -79 -187 -9 -50 -6 71 148 28 45 50 -42 -11 21 39 18 131 59
7378 59 -211 21 121 -64 144 -123 -23 150 -61 3 13 52 -104 52 -151 -98 57 47 -80 -74 258 122 -74
7401 -74 99 104 26 -20 37 113 -5 -175 -21 -81 -15 2 152 -19 82 76 -39 41 -182 -74 83 26 35 3 -9 7
7427 7 -101 -135 -24 100 -69 129 -83 83 -81 -93 62 -35 134 36 -93 -75 29 11 4 89 83 53 1 -10 0 116
$$ packed form
7249A10j50R6m9M5p9Q4n8j16J47k10J94O3j81J67k0N6N6k77j4L60l53M7J54M7
7273A19j77K6k18M41j18K7j1p8p8M1K4l0J23j26L3r3J67J03Ok11J51r4rm4l1J49
7299I2o1J89n9l45K59r4L4j06J02l6J74j10m3k2M3PJ25o7j75MQ5m6OK20k07J47
7325A16k39N6M9J48j27OJ57k05j62J16PJ13K7m8roj8N4Q8j91K7o3O6Q4Jj30m3
7352a26J58m2Ol4j3n5K14j88J11j10j08J78m1M4P7P7j20J7Nr2L1L2J8k1J13p2
7378E9k70K32J00j85K08k67J00J73k11O4J0L9j56J56k03N3J55j0j27OL32j36j96
7401g4J73Np8m6N7P6j18j70J54o0O6J7J50j71J01oj15Q0k23J08J57n7Rl2j2J6
7427Gj08l4J11J24j69J98k12J66j64j2J55r7J69r8j29J8J04j8pQ5ol0n2j1J0J16
$$ plain form
7453 116 -31 51 -105 75 -66 -11 110 21 14 20 -134 37 42 -132 -149 26 -44 59 -48 217 31 -25 80 18
7477 18 60 -137 -28 -7 -2 -15 -29 -37 79 25 15 -94 -15 -38 149 -164 -116 -195 -28 14 -100 -37 20 -5 -39 39 -82
7504 -82 -37 115 -58 -76 28 -62 6 6 160 15 81 171 -14 92 122 31 62 -204 23 -88 -29 -64 89 -156 12
7529 12 -98 -49 39 -101 -34 -32 126 38 -222 14 11 -102 0 92 -183 6 60 -24 45 124 70 -45 12 107 32 132
7555 132 53 50 -109 -58 99 114 13 -172 -79 -88 -96 53 17 -133 51 -53 -9 160 -128 11 -38 -105 -9 8 -111
7580 -111 -7 48 24 67 -21 -6 -105 0 37 -17 -70 49 -31 -74 -52 -226 21 83 -21 -178 42 -64 93 -37
7604 -37 -21 60 181 19 70 53 -60 23 100 -90 43 -133 29 -26 50 55 -8 -153 33 81 -96 75 -80 132
7628 132 -56 149 -31 -49 -26 56 33 67 -146 -252 -54 -16 78 182 86 67 -121 19 -106 -5 102 75 -160
$$ packed form
7453A16j47Q2j56J80j41N5J21q9pOj54J71Nj74j7J75p0J03j07K65j86n6J05o2
7477A8M2j97J09K1Nj3j4qJ16n4j0j09P9k3J87l13M8p9J67M2j14O3N7k5l4P8j21
7504h2M5J52j73j8J04r0O8%J54j45O6R0j85J06L0r1L1k66K27j11N9l5J53k45J68
7529A2j10M9Q8j40O7KJ58q8k60K36lj13J02R2k75J89N4q4O9P9n4j15N7R5p5J00
7555A32p9lj59N1J57J5j01j85R3rqJ49l6j50J84j04M4J69k88J39m9o7R6J7j19
7580a11J04N5k4M3q8J5r9J05L7n4n3J19q0m3K2j74K47O2j04j57K20j06J57j30
7604c7J6Q1J21j62N1j7j13Q3P7j90J33j76J62n5P6No3j45J86M8j77J71j55K12
7628A32j88K05j80j8K3Q2k3L4k13j06J98L8R4J04r6j9j88J40j25J01J07k7k35
$$ plain form
7651 -160 118 147 128 -167 -39 135 -169 15 -7 -21 -10 -79 -12 -30 44 -128 47 57 -22 78 128 67 47 -29 -69
7676 -69 -103 -49 -57 15 113 -19 -14 -135 73 -83 11 29 -25 134 59 129 27 -98 -62 37 111 211 0 -60 -70 81
7702 81 -68 12 168 -207 39 71 -137 94 -26 5 47 -97 109 -114 -117 -75 -173 -97 130 -17 108 65 -17 -80
7726 -80 -41 32 -23 -89 -9 65 -6 108 48 -60 -88 -1 39 -39 -38 -12 67 82 -107 -18 143 -35 -110 23 -98 18 -25
7753 -25 10 -12 59 126 -94 5 -36 41 111 44 -51 -80 -3 -70 -89 30 -64 -8 -138 176 36 -67 12 -219 108 -36
7779 -36 33 -33 -51 -10 -34 -152 -145 -156 91 35 110 6 -38 -47 129 -13 -131 -71 -44 -156 15 72 -99 141 177 176 -56
7806 -56 65 -31 -90 22 -63 -112 -75 39 -84 63 119 -21 127 14 56 -42 80 1 40 -114 45 -11 -50 -89 -17
7831 -17 -18 -23 58 99 -101 75 19 -90 29 39 133 -47 -2 71 63 111 294 120 -82 17 17 111 -11 -31 -9 91 -60
$$ packed form
7651a60K78K9j9k95J28J74l04J84k2j4J1o9O7j8P4j72J75J0p9J00N0o1k0p6m0
7676f9l4N4qP2R8j32Nj21K08j56R4J8n4J59p5P0j02j25L6R9P4J00k11o0j0J51
7702H1j49Q0J56l75K46L2k08K31j20L1M2j44K06k23lM2r8P6K27j47J25m3q2o3
7726h0L9P3n5o6Q0P4p1J14o0j08k8Q7M0p8JK6P9J5j89Q9J61j78p5J33j21J16m3
7753b5L5k2P1O7k20R9m1P7P0o7r5k9P7o7j9J19r4N6j30L14j40j03P9k31L27j44
7779c6O9o6j8M1k4j18Pj1K47n6P5j04m4rJ76j42j18O0K7j12J71N7j71K40L6jk32
7806e6J21r6n9J12q5m9L7J14j23J47N6j40J48j13M2r8J22p9L9j54J59n6l9l9P2
7831a7jnQ1M1k00J76n6j09J19J0R4j80M5P3qM8J83j74k02R9%R4j22k0K2J00j51
$$ plain form
7858 -60 47 -140 35 128 123 71 -11 147 68 116 -60 49 16 -125 54 -90 -134 -65 -16 67 -25 34 -66 79 -68
7883 -68 -99 82 97 -44 214 139 -4 112 -9 134 61 -58 109 73 -50 -110 -54 -122 51 89 -56 59 -8 11
7907 11 125 10 -59 -14 -103 64 137 75 -28 190 130 -19 26 -40 -157 -25 7 -41 133 89 60 16 112 -129 -61
7932 -61 51 63 146 157 -107 20 52 -111 200 33 4 -46 85 -82 -52 -71 -180 52 -19 -73 2 -27 88 -65
7956 -65 -5 -125 -19 23 74 43 -24 -234 99 61 -95 -208 60 -7 18 55 -17 -14 2 28 -147 96 -52 -138 120
7981 120 44 42 31 -99 34 -12 35 -47 -121 -156 70 -5 2 -78 -41 28 23 -15 -117 -26 -1 8 75 -72 -9 16 10 -12 138
8010 138 -134 -48 68 23 94 136 80 -86 -43 86 -39 138 15 -46 -14 -195 -56 -68 -105 -50 -86 -58 -225 128
8034 128 25 145 43 41 -65 36 -88 -92 111 -17 2 -44 -75 -110 49 166 110 52 47 159 -2 16 39 55 38
$$ packed form
7858f0J07j87J75R3nn2q2J58p9M8j76J09l3j41J79j44m4O9M9Q3r2N9j00J45j47
7883f8l1J81J5j41K58p5j43J16j21J43p3j19J67l6j23o0N6o8J73L8j45J15o7J9
7907A1J14j15o9M5q9J67P3o2j03K18o0j49M5o6j17J32L2m8J74m4k9m4R6k41O8
7932f1J12J2Q3J1k64J27L2j63L11j67k9n0J31j67L0j9j09K32p1n4P5k9J15j53
7956f5O0j20J06M2N1l1o7k10L33l8j56j13K68o7K5L7p2LJ6K6j75K43j48q6K58
7981A20p6kj1j30J33m6M7q2p4l5K26p5Pq0L7O9nl8j02R1K5RO7j47O3K5ok2J50
8010A38k72Q6J16m5P1M2n6j66M3J29j25J77j23o1L2j81J39j2l7N5l6K8j67L53
8034A28j03J20j02kj06J01j24mK03j28J9m6l1l5J59J17n6n8nJ12j61J8K3J6j7
$$ plain form
8059 38 96 97 11 -127 -114 -6 -92 146 9 -76 74 -12 36 85 38 9 -195 23 73 0 -12 -51 -29 138 20 -31
8085 -31 174 49 -17 39 93 -81 97 -14 104 -193 -62 9 46 89 30 -145 9 -94 116 194 -75 -94 68
8108 68 -65 84 11 61 4 -156 -81 -49 -41 78 96 64 -11 2 39 -113 -166 108 -85 -99 -15 251 -40 107 54 -101
8134 -101 -91 -43 181 118 149 39 39 25 -20 72 51 142 6 58 96 -68 111 -24 118 -69 -17 -38 -86 65 -96
8159 -96 -150 63 100 -10 12 24 74 14 -3 -34 145 -105 88 -168 -137 -23 -8 -53 20 228 90 23 81 -23 -3
8184 -3 34 36 -11 -2 19 -38 -133
$$ packed form
8059C8N8Jq6j38J3J08q6K38j37q5J50q6M8M9m7k9k04K18N0p3j2l9K2J67j18n1
8085c1K05j25o6N6N4j74J78j11J18k97J31P1L7M3n9j75J54j03K10P8k69j9J62
8108F8j33J49p3N0n7j60P5L2QJ19J8l2p5J3L7j52n3K74j93j4Q4K66k91J47n3j55
8134a01J0M8K24o3L1j10%j4m5R2k1R1j36N2L8j64J79j35J42j87N2k1m8J51j61
8159i6n4K13L7j10K2J2N0o0j7l1J79k50J93k56L1J14J5m5P3K08j38o7N8j04K0
8184cL7Km7RK1n7r5
8191a33
$$ Imaginary data points
##PAGE= N=2
##DATA TABLE= (X++(I..I)), XYDATA
$$ plain form
0 0 0 0 0 0 0 0 0 0 0 0 0 0 0 0 8 -8 8 -8 8 -16 16 -16 24 -24 32 -32 40 -48 56 -64 72 -80 94 -104 120 -134
36 -134 151 -168 189 -210 234 -261 288 -319 353 -391 431 -476 524 -578 635 -700 772 -851 941
55 941 -1041 1156 -1288 1439 -1616 1831 -2094 2424 -2849 3428 -4262 5579 -7966 13711 -59949
70 -59949 -7133 101714 2572 -58405 -47934 21821 23078 -12975 -3732 5421 -18630 17351 26996
83 26996 -14295 -33878 -7524 41499 36151 -47567 -48360 17163 26411 2722 -19021 -25945 513
96 513 3559 5842 14215 -19852 -23014 22711 20400 -3303 -10742 -4926 17458 6315 -12694 5553
110 5553 -4638 -13998 15977 9038 -20117 -22239 -3845 28975 12480 -33874 -11979 17514 5595
123 5595 1627 -348 2904 4722 -10072 9176 20954 -19850 -18492 20135 17721 -9236 -29788
$$ packed form
0@%%%%%%%%%%%%%%Qj6J6j6J6k4L2l2M0m8N6o4P2q8J04j20J36j52J74j98K24k54
36a34K85l19L57l99M44m95N49o07O72p44Q22r07J000j102J213j335J472j623J792
55I41j982K197k444K727l055L447l925M518n273O277p690R841j3545K1677p3660
70e9949N2816J08847r9142o0977J0471O9755J257l6053R243R153k4051L5981R645
83B6996m1291j9583K6354M9023n348q3718p93O5523R248k3689k1743o924K6458
96E13L046K283Q373l4067l162M5725k311k3703p439N816K2384j1143j9009J8247
110E553j0191r360K9975o939k9155k122J8394L2820j6495m6354K1895K9493j1919
123E595l968j975L252J818j4794J9248J1778m0804J358L8627k414k6957k0552
$$ plain form
136 -29788 -7168 30001 1230 -26359 -1041 7138 2055 -526 -7832 4110 4787 -3453 12766
149 12766 3058 -16024 1620 9424 4132 -247 -11637 1871 8209 -13607 -4857 7898 -2760
162 -2760 -1752 -4186 -4261 4973 -4862 -179 11688 -4072 -2695 6552 -3780 1383 5419 302 4514
177 4514 -6141 -6392 10560 -2025 -9938 1948 -153 1199 -3041 -10173 6905 5453 -9019 2529
191 2529 3714 -1142 4579 -820 3744 5047 -8790 3941 11737 -5557 -4332 -1491 -1438 4917 -5937
206 -5937 -6361 5714 -3872 -3658 2066 -5907 2385 6684 -465 4498 -2965 -5263 11615 5774 -2849
221 -2849 1133 -3264 1790 2695 -8388 726 1971 -7245 1402 -1941 -7662 2212 184 1767 5138
236 5138 -6010 807 8002 -725 4747 2686 -4410 4910 1256 -2494 3108 -7430 -4576 5836
$$ packed form
136b9788K2620L7169k8771k7589K5318Q179n083k581p306J1942O77q240J6219
149A2766r708j9082J7644P804n292m379j1390J3508O338k1816Q750J2755j0658
162b760J008k434p5R234r835M683J1867j5760J377R247j0332N163M036n117M212
177D514j0655k51J6952j2585p913J1886k101J352m240p132J7078j452j4472J1548
191B529J185m856N721n399M564J303j3837J2731P796j7294J225K841N3O355j0854
206e937m24J2075r586K14N724p973Q292M299p149M963p463k298J6878n841q623
221b849L982m397N054R05j1083R114J245r216Q647l343n721R874k028J583L371
236E138j1148O817P195q727N472k061p096R320l654l750N602j0538K854J0412
$$ plain form
250 5836 -3772 -4058 -2217 -5312 5318 875 -6762 5425 2848 -284 6610 -1814 -383 6209 -262
265 -262 4494 1466 -8683 1706 1447 -5338 1228 -4218 -4326 3560 -4925 -2201 4024 -3289 3505
280 3505 5449 -2778 3422 1289 -287 8943 -1105 -3747 4590 -2957 -2000 1352 -5893 623 43
295 43 -6721 1642 -1692 -4681 5821 -140 -1426 4863 -1913 2562 5451 -2985 3865 3327 -4314 2901
311 2901 -660 -3484 3260 -4779 -3750 3433 -5338 -1349 2641 -4424 1619 1342 -2871 5564 715
326 715 -1405 5892 -1799 -1093 5442 -2000 1384 1972 -5912 836 -148 -4542 3222 -1678 -4300 2301
342 2301 -3734 -491 4580 -3175 1812 3761 -3736 2630 1854 -1436 5257 -491 -2348 3184 -3525
357 -3525 -837 3760 -4590 -496 816 -4976 1524 -527 -3546 4121 -804 -1794 3802 -2558 1025
$$ packed form
250E836r608k86J841l095J0630m443p637J2187k577l132O894q424J431O592o471
265b62M756l028j0149J0389k59o785O566n446j08P886q485K724O225p313O794
280C505J944q227O200k133j576R230j0048k642Q337p547R57L352p245O516n80
295D3o764Q363l334k989J0502n961j286O289o776M475K889q436O850n38p641P215
311B901l561k824O744q039J029P183q771L989L990p065O043k77m213Q435m849
326G15k120P297p691P06O535p442L384N88p884O748r84m394P764m900k622O601
342B301o035L243N071p755M987J949p497O366p76l290O693n748j857N532o709
357c525K688M597q350M094J312n792O500k051l019P667m925r90N596o360L583
$$ plain form
372 1025 5036 -1749 2354 1967 -3672 3291 1019 -2731 2578 -2816 -2407 2423 -4148 -771 2103 -4490
388 -4490 1068 1019 -3798 3253 1299 -997 3964 -1732 -313 4816 -1211 1305 2496 -3854 1271 348
404 348 -3831 2315 -1256 -3993 614 -3493 -746 3304 -2479 971 2082 -2920 3174 2368 -1173 4566
420 4566 873 -983 2768 -2800 -699 3132 -2727 -536 -1543 -5786 1686 708 -3341 1416 -1747
435 -1747 -682 4094 -1510 774 3822 -657 3514 2079 -3281 2494 733 -1231 2692 -3812 -4142
450 -4142 1227 -2308 -386 -323 -5227 1295 1771 -2251 2722 532 -108 4706 -231 453 3567 -1694
466 -1694 1612 2590 -2747 -448 -2368 -3038 3846 -1561 -5177 -402 -2067 1127 3028 -2968 833 2300
482 2300 -929 4370 1897 -1858 3303 728 408 1774 -5165 -1379 4089 -1624 -1606 -3351 -4475 3592
$$ packed form
372A025M011o785M103l87n639O963k272l750N309n394M09M830o571L377K874o593
388d490N558m9m817P051j954k296M961n696J419N129o027K516J191o350N125r23
404C48m179O146l571k737M607m107K747M050n783L450J111n002O094q06l541N739
420D566l693j856L751n568K101L831n859K191j007m243P472r78m049M757l163
435a747J065M776n604K284L048m479M171j435n360N775j761j964L923o504l30
450d142N369l535J922O3m904O522M76m022M973k190o40M814m937O84L114n261
466a694L306R78n337K299j920o70O884n407l616M775j665L194J901n996L801J467
482B300l229N299k473l755N161k575l20J366o939L786N468n713J8j745j124Q067
$$ plain form
498 3592 991 -2965 969 -1932 170 5058 -833 379 2615 -881 3617 1569 -3562 1059 -30
513 -30 -309 2645 -4716 -3945 2400 -1018 218 -694 -4496 2236 2217 -1761 2722 -122 -937 3568 -197
530 -197 1080 2072 -3976 1156 3748 -2678 -1220 -2073 -1023 3902 -2074 -3987 1286 -1506 481 3065
546 3065 -2344 62 907 -1054 4630 658 -3534 2835 1589 322 1076 -4389 226 3851 -2336 -869
562 -869 -1346 -3825 2837 1171 -2204 961 -2371 -221 4175 -1424 -117 1994 -1400 3028 1418 -3209
578 -3209 1617 1114 -181 2058 -3832 -2674 3253 -924 -819 -532 -3528 1782 1086 -2503 2456 78
594 78 -1211 2941 362 442 2028 -1747 2313 2383 -3702 394 1118 -1698 1116 -2067 -2434 1756 -2386
611 -2386 -1030 2263 -2364 239 1375 -1319 2812 979 -1111 3864 190 -1464 2365 -1052 49
$$ packed form
498C592k601l956L934k901K102M888n891J212K236l496M498k048n131M621j089
513c0k79K954p361P71O345l418J236r12l802O732j9l978M483k844q15M505l765
530a97J277R92o048N132K592o426J458q53J050M925n976j913N273k792J987K584
546C065n409K406Q45j961N684l972m192O369j246j267P54n465M615L625o187J467
562h69m77k479O662j666l375L165l332K150M396n599J307K111l394M428j610m627
578c209M826n03j295K239n890J158N927m177J05K87k996N310o96l589M959k378
594G8j289M152k579Q0J586l775M060P0o085M096P24k816K814l183l67M190m142
611b386J356L293m627K603J136k694M131j833k090M975l674j654L829l417J101
$$ plain form
626 49 1304 -2991 -130 -269 -3614 1196 -250 -2632 1321 -1133 -971 2448 -737 1469 2886 -1246
642 -1246 1732 1684 -1530 2615 644 -1653 925 -2699 -1224 1718 -3026 -1758 514 -2153 613 67
658 67 -1513 3001 830 -872 2999 -459 487 3272 -384 503 337 -2584 1446 174 -3179 286
674 286 -1694 -2074 851 -2035 -555 1820 -1463 1244 1677 -1429 2328 1644 -81 2498 -1026 -997 2711
691 2711 -1122 -712 283 -2770 -354 -206 -2373 907 -757 -1442 2137 -883 -633 2298 -195 1339
707 1339 2218 -1524 1333 955 -1270 2126 -336 -2043 759 -1812 -818 1215 -2402 -423 774 -2105
723 -2105 825 272 -1021 2489 271 -548 1937 -783 795 2712 -1358 182 304 -2224 1292 -138
739 -138 -2212 857 -1543 -1303 1381 -1613 12 1503 -1635 1003 1157 -1570 2406 945 -656 1950
$$ packed form
626D9J255m295K861j39l345M810j446k382L953k454J62L419l185K206J417m132
642a246K978m8l214M145j971k297K578l624J475K942m744J268K272k667K766n46
658F7j580M514k171j702L871l458R46K785l656Q87j66k921M030j272l353L465
674B86j980l80K925k886J480K375l283K707M33l106L757o84j725K579l524K9L708
691B711l833M10R95l053K416J48k167L280j664o85L579l020K50K931k493J534
707A339Q79l742K857l78k225L396k462j707K802k571R94K033l617J979J197k879
723b105K930n53j293L510k218q19K485k720J578J917m070J540J22k528L516j430
739a38k074L069k400K40K684k994J625J491l138K638J54k727L976j461j601K606
$$ plain form
755 1950 -1148 -710 2305 -1124 -81 702 -2446 257 207 -2221 1003 -467 -1344 1377 -975 -606 2167
772 2167 -854 820 1582 -1541 1444 1046 -946 2047 -323 -1461 1424 -1366 -683 1060 -2374 -46
788 -46 470 -2519 711 279 -1353 2025 -267 -951 1979 -492 1056 2407 -1409 819 1075 -1696 1488
805 1488 -190 -2019 1195 -1666 -1866 1180 -1823 -258 1190 -2079 677 1079 -1325 2313 1164 -774
821 -774 2247 -454 -178 2269 -1066 56 866 -2527 261 -188 -2420 864 -765 -1976 1257 -1228
837 -1228 -438 2429 -729 838 1711 -950 1733 1349 -766 2129 -345 -1611 1143 -1496 -1013 941
853 941 -2378 -635 246 -2506 894 462 -1378 2093 -51 -360 2624 -215 604 2347 -1068 686
869 686 873 -1933 1066 -284 -1840 788 -1825 -1903 1308 -1551 -267 1178 -1647 974 1118 -722
$$ packed form
755A950l098M38L015l429J043P83l148K703n0k428L224j470q77K721k352L69K773
772B167l021J674P62l123K985l98j992K993k370j138K885k790O83J743l434K328
788d6N16k989L230m32j632L378k292o84K930k471J548J351l816K228K56k771L184
805A488j678j829L214k861k00L046l003J565J448l269K756M02k404L638j149j938
821g74L021k701K76K447l335J122Q10l393K788m49k232L284j629j211L233k485
837a228P90K867l158J567Q73k661K683l84k115K895k474j266K754k639M83J954
853I41l319J743Q81k752L400m32j840L471k144l09K984k839Q19J743l415J754
869F86J87k806K999j350j556K628k613p8L211k859J284J445k825K621J44j840
$$ plain form
885 -722 2166 852 -744 2072 -341 -571 1768 -1139 -225 439 -2609 -119 9 -1825 941 -586
901 -586 -1568 1281 -547 145 2321 -930 653 1641 -942 1248 923 -999 1561 -584 -1558 903 -1611
918 -1611 -680 1202 -1888 -525 184 -1859 1423 668 -1278 1576 43 -239 2110 -553 229 1848
934 1848 -1201 631 441 -1803 1005 30 -1464 592 -1530 -1105 1383 -1370 -128 893 -1733 805
950 805 1047 -957 1491 399 -310 1922 -593 -588 1509 -743 213 266 -2171 507 200 -1533 1058 -761
968 -761 -1521 798 -796 242 1460 -1148 664 1548 -1094 1389 782 -654 1372 -586 -878 1316
984 1316 -1414 -532 991 -1867 -504 -211 -1661 1333 35 -1709 1050 -333 -147 1855 -622 604
1000 604 1717 -1001 853 676 -1381 1443 -86 -1591 841 -1563 -929 999 -1525 -350 467 -1710
$$ packed form
885g22K888j314j596K816k413k30K339k907R14O64l048K490J28j834K766j527
901e86r82K849j828O92K176l251J583R88k583K190l25j922K560k145r74K461k514
918a611R31J882l090J363P09k043L282p55j946K854j533k82K349k663P82J619
934A848l049J832j90k244K808r75j494K056k122M25K488k753J242J021k626K538
950H05K42k004K448j092p09K232k515NK097k252R56N3k437K678l07j733K591j819
968g61p60K319j594J038J218k608J812Q84k642K483o07j436K026j958k92K194
984A316k730Q82J523k858J363K93j450K994j298j744K759j383J86K002k477J226
1000F04J113k718J854j77k057K824j529j505K432k404O34J928k524J175Q17k177
$$ plain form
1016 -1710 1015 846 -722 1627 219 -41 2050 -641 316 1881 -1295 19 458 -1676 255 -406
1032 -406 -1836 1054 -1261 -1846 1054 -669 35 1339 -1020 970 1351 -909 1963 1107 -871 1291
1048 1291 -361 -725 1151 -1654 -412 844 -2309 -508 90 -1606 1233 48 -1150 1480 -346
1063 -346 7 2257 -279 625 1600 -1155 773 837 -1164 1199 -554 -1767 590 -1456 -1189 1039 -1385
1080 -1385 -229 699 -1609 1189 1169 -759 1984 465 -374 1639 -310 302 1697 -1546 -152 636
1096 636 -1989 29 -198 -1486 803 -823 -1150 1658 -696 -46 1753 -636 827 1051 -902 1836
1112 1836 760 -1391 1287 -281 -1045 741 -1273 -548 603 -1977 87 379 -1631 836 227 -922
1128 -922 1273 -329 -125 2088 -408 332 1208 -1227 419 665 -1187 871 -430 -1647 941 -1001
$$ packed form
1016a710K725j69j568K349j408k60K091k691R57J565l176J314M39k134J931o61
1032d06j430K890k315n85K900j723P04J304k359J990L81k260K872q56j978K162
1048A291j652l64J876k805J242J256l153J801N98j696K839j185j198K630j826
1063c46L53K250k536R04R75k755J928O4k001K363j753j213K357k046K67K228k424
1080a385J156R28k308K798k0j928K743j519q39K013j949O12J395l243J394P88
1096F36k625K018k27j288K289j626l27K808k354O50J799k389J463K24j953K738
1112A836j076k151K678j568p64J786k014P25J151k580K064K92k010K467o09j149
1128i22K195j602K04K213k496P40Q76k435J646K46j852K058j301j217K588j942
$$ plain form
1144 -1001 -771 1029 -1188 -274 595 -1318 1002 660 -995 1626 135 -782 1253 -171 155 1218
1160 1218 -1341 101 592 -1613 537 180 -1463 564 -601 -973 1135 -1014 -191 1329 -889 455
1176 455 953 -487 1397 433 -889 1449 -273 -639 1245 -817 -503 507 -1686 202 95 -1554
1192 -1554 781 -3 -1073 971 -545 12 1581 -527 537 1213 -863 759 634 -654 917 -365
1208 -365 -1182 696 -1151 -830 870 -1419 -373 296 -1196 756 401 -776 1441 13 -412 1650
1224 1650 -145 171 1302 -943 121 289 -1342 436 -291 -1456 229 -922 -808 704 -940 78
1240 78 1092 -945 773 1000 -324 1555 462 -431 1208 -418 -456 985 -1247 -461 117 -1686 55
1257 55 -79 -1329 797 -183 -1085 1385 -16 296 1561 -170 661 1063 -889 952 735 -882 687
$$ packed form
1144a001K30J800k217R14Q69j913K320l42j655K621j491r17K035j424L26J063
1160A218k559J442M91k205K150l57j643K027j165l72K108k149Q23J520k218J344
1176D55M98j440J884r64j322K338j722l66J884k062L14J010k193J888j07j649
1192a554K335p84j070K044j516N57J569k108J064O76k076J622j25j288J571j282
1208c65q17J878j847L21J700k289J046O69j492J952l55j177K217j428m25K062
1224A650j795L16J131k245J064J68j631J778p27j165J685j151J14J512j644J018
1240G8J014k037J718K27j324J879j093q93J639j626l8J441k232P86N78j803J741
1257E5j34j250K126r80r02K470j401L12J265j731Q31M02j952J841k17j617J569
$$ plain form
1274 687 -554 -1263 522 -1242 -769 630 -1394 -14 580 -1039 1013 416 -429 1653 -50 -251 1725
1291 1725 -180 137 985 -1288 198 187 -1442 407 -426 -1597 455 -880 -745 1056 -571 262 1141
1308 1141 -925 731 960 -540 1284 292 -411 1007 -684 -474 922 -1193 -356 286 -1534 157
1324 157 155 -1146 686 -198 -714 1406 -385 -135 1472 -595 258 634 -869 993 479 -964 863
1341 863 -561 -991 779 -975 -460 655 -1316 90 536 -1064 816 578 -627 1119 -112 -363
1357 -363 1215 -482 53 984 -1046 233 421 -1213 682 -180 -1332 554 -667 -897 1045 -810
1373 -810 -257 590 -893 599 587 -513 1140 349 -763 1105 -268 -196 1055 -711 -284 244 -1347
1390 -1347 168 24 -1020 678 -432 -801 1050 -188 -52 1228 -430 308 1077 -631 1048 602
$$ packed form
1274F87j241p09J785j764M73J399k024J380N94j619K052n97q45K082j703k01J976
1291A725j905L17Q48k273J486j1j629J849q33j171K052j335J35J801j627Q33Q79
1308A141k066J656K29j500J824r92p03J418j691K10J396k115Q37O42j820J691
1324A57kj301J832q84n16K120j791K50J607k067Q53L76j503J862n14j443J827
1341H63j424m30J770j754N15J115j971J406M46j600J880k38j205J746j231k51
1357c63J578j697N35R31k030J279J88j634J895q62j152J886j221k30J942j855
1373h10N53Q47j483J492j2j100J653p91j112J868j373P2J251j766M27N28j591
1390a347J515j44j044J698j110l69J851j238J36J280j658P38P69j708J679m46
$$ plain form
1406 602 -713 681 -491 -767 712 -837 -802 504 -1293 -412 290 -810 552 376 -565 974 76
1423 76 -6 1347 -90 307 773 -753 168 462 -933 339 -461 -1182 337 -796 -605 810 -683 8
1441 8 740 -674 843 907 -140 1068 365 -537 1075 -98 -138 704 -942 -317 -75 -1306 96 -34
1459 -34 -1007 349 -492 -507 1056 -208 167 1199 -306 639 742 -540 843 267 -832 444 -460 -887
1477 -887 302 -812 -357 214 -1189 -105 450 -577 771 367 -436 1128 -18 17 1260 -178 80
1494 80 573 -950 228 91 -1118 306 -487 -1001 336 -691 -220 719 -728 258 807 -379 673
1511 673 682 -394 964 72 -518 874 -446 -312 409 -844 -57 155 -1206 423 87 -795 304 -272
1529 -272 -360 988 -172 47 919 -523 393 528 -329 754 -35 -685 613 -434 -605 556 -820 -344
$$ packed form
1406F02j315J394j172k76J479j549L5J306j797Q81P02j100J362j76r41J539q98
1423G6q2J353j437L97M66j526R21K94j395J272q00p21J519j133J91J415j493O91
1441HP32j414J517O4j047J208p03r02J612j173m0Q42j646O25K42j231J402j30
1459c4r73J356q41j5J563j264L75J032j505R45J03j282J383n76j099J276r04m27
1477h87J189j114M55N71j403J084N55j027J348m04q03J564j146L5J243j438K58
1494H0M93j523J178j37j209J424p93n14J337j027M71R39j447R86N49j186J052
1511F73Rj076J358q92n90J392j320J34P21j253P87K12j361J629l36q82J099n76
1529b72q8J348j160K19Q72j442R16J35q57J083p89o50J298j047j71J161j376M76
$$ plain form
1547 -344 373 -1115 137 293 -723 782 342 -424 835 -90 -205 990 -486 43 718 -625 527
1564 527 102 -767 548 -382 -820 461 -502 -450 468 -709 179 516 -565 559 242 -326 1013 41
1582 41 -360 1005 -211 11 687 -770 -1 225 -1175 348 -199 -884 379 -221 -501 663 -401 85
1600 85 857 -558 482 881 -269 869 243 -637 711 -339 -527 620 -666 -577 96 -1079 4
1617 4 175 -802 543 122 -596 888 41 190 1202 -203 249 494 -684 372 310 -941 303 -472
1635 -472 -953 144 -658 -563 439 -914 -98 501 -515 711 559 -399 776 72 -354 1008 -203 -146
1653 -146 594 -608 -303 175 -899 186 -171 -1029 407 -299 -475 800 -237 75 850 -309 449 701
1671 701 -373 699 83 -692 438 -563 -412 278 -794 -429 35 -724 30 223 -562 439 64 -275
$$ packed form
1547c44P17j488J252J56j016J505m40p66J259r25j15J195j476N29O75j343J152
1564E27m25q69J315r30m38J281r63N2R18j177Q88L37j081J124l17n68J339r72
1582D1m01J365j216K22O76j457P69K26j400J523n47o85J263o00k80J164j064M86
1600H5P72j415J040L99j150J138o26q80J348j050j88J147j286Q9O73j175J083
1617DJ71r77J345m21p18J484q47J49J012j405M52K45j178J056o2j251J244p75
1635d72m81J097q02R5J002j353Q16N99j016J226j52r58J175p04m26J362j211N7
1653a46P40j202L05M78j074J085l57q58J436p06j76J275j037L12P75j159P58K52
1671G01j074J072o16p75J130j001J51O90j072L65M64p59P54J93p85J001l75l39
$$ plain form
1689 -275 783 78 78 1026 -302 97 413 -488 263 247 -601 133 -279 -764 224 -515 -363 399 -564 90
1709 90 580 -286 663 489 -270 663 -71 -320 765 -424 -212 85 -840 -1 81 -549 357 -154 -650 488
1729 488 -183 -32 837 -203 254 713 -183 307 534 -282 480 155 -629 529 -281 -463 382 -648 -206
1748 -206 203 -809 185 261 -507 525 -24 -296 866 -128 154 733 -381 179 487 -392 261 186 -710
1767 -710 361 -481 -634 312 -505 -243 240 -767 209 524 -483 431 261 -106 742 -4 -76 878 -208
1786 -208 118 507 -645 125 130 -696 214 -196 -877 387 -523 -307 577 -335 167 655 -401 447 572 -217
1806 -217 773 153 -226 737 -225 -301 359 -648 -257 324 -911 239 58 -584 361 -114 -315 848 -1
1825 -1 206 801 -231 330 746 -540 441 134 -735 238 -316 -534 270 -579 -241 370 -732 185 399 -575
$$ packed form
1689b75J058p05%R48j328L99L16r01P51j6q48P34m12m85R88p39J52P62r63O54
1709I0M90q66R49j74p59R33p34k49J085j189K12K97r25Q39Q2o30R06n11m96J138
1729D88o71J51Q69j040M57M59q96M90K27q16P62l25p84J158q10j82Q45j030M42
1748b06M09j012R94P6p68J032n49k72J162r94K82N79j114N60L08q79O53p5q96
1767g10J071q42j53R46q17K62M83j007R76L15j007R14j70l67Q48p46p2R54j086
1786b08L26L89j152P70Nq26R10m10o81J264r10K16Q84r12N02M88j056Q48J25p89
1806b17R90o20l79R63r62p6O60j007L91N81j235J150j81o42R45m75k01J163q49
1825aK07N95j032N61M16j286R81l07q69R73n54k18Q04q49L38O11j102R17K14r74
$$ plain form
1845 -575 668 353 -156 653 143 -118 834 -276 -162 435 -701 -22 42 -776 164 -308 -849 145 -238
1864 -238 -214 591 -354 330 733 -207 488 519 -167 494 102 -495 390 -257 -345 298 -627 -258 95 -688 172
1885 172 173 -553 261 138 -273 895 -53 84 775 -352 263 531 -580 345 212 -660 267 -308 -738 399
1905 399 -525 -211 350 -464 211 501 -267 451 236 -325 607 45 -202 463 -465 -217 227 -489 -17 130
1925 130 -645 201 -251 -946 518 -139 -84 437 -347 233 636 -250 285 341 -381 471 -27 -452 483 -288
1945 -288 -363 336 -581 -20 239 -485 286 71 -588 399 -88 -288 421 -19 153 492 -304 186 474 -401
1965 -401 245 -3 -459 281 -221 -460 349 -537 -295 152 -499 46 168 -428 578 91 -159 520 -57 79
1985 79 699 -366 42 402 -476 216 91 -578 -45 -270 -493 346 -129 -204 376 -354 79 437 -252 376
$$ packed form
1845e75J243l15n09Q09n10k61R52j110J14N97j136O79O4q18R40m72n41R94l83
1864b38K4Q05r45O84M03r40O95L1o86O61l92n97Q85o47q8O43r25L69L53p83Q60
1885A72Jp26Q14j23m11J168r48J37O91j127O15K68j111R25j33q72R27n75m30J137
1905C99r24L14N61q14O75K90p68P18k15n61R32n62k47O65r28K48M44p16M72J47
1925A30p75Q46m52o95J464o57N5N21p84N80M03q86N35N6p22Q52m98m25R35p71
1945b88p5O99r17N61K59p24P71k15o59R87m87k00P09m40J72L39p96M90K88q75
1965d01O46k48m56P40n02k39Q09q86K42M47o51N45J22n96J006m87k50O79n77J36
1985G9O20j065M08L60q78O92j25o69N33k25k23Q39m75p5N80p30M33L58o89O28
$$ plain form
2005 376 319 -164 380 136 -290 532 -108 -180 244 -493 -119 13 -589 214 56 -469 443 -47 -160 591 -29
2026 -29 254 601 -347 362 471 -174 223 121 -592 216 -323 -376 280 -648 -166 209 -300 203 278 -334 374
2047 374 187 -248 580 -57 1 536 -61 85 187 -389 36 -9 -700 30 -439 -467 458 -232 -127 551 -433
2068 -433 250 570 -96 566 234 -114 391 37 -260 487 -532 -447 158 -603 -194 -124 -610 50 -25 -603 439
2089 439 -12 -149 591 77 58 579 -269 296 330 -562 369 39 -649 353 -275 -378 284 -643 -265 235
2109 235 -415 290 222 -196 567 132 -475 710 112 -94 503 -423 83 52 -418 158 182 -674 115 -180 -464
2130 -464 323 -146 -140 502 -404 54 397 -47 251 250 -254 547 -174 -496 529 -188 -178 303 -613 -207 128
2151 128 -463 26 90 -599 413 -113 -238 582 -196 32 457 -288 374 412 -227 207 51 -483 417 -222
$$ packed form
2005C76n7m83N44k44m26Q22o40p2M24p37L74J32o02Q03j58n25R12m90j13P51o20
2026b9K83L47r48P09J09o45L97j02p13Q08n39n3O56r28M82L75n09N03P5o12P08
2047C74j87m35Q28o37N8N35n97J46J02n76M25m5o91P30m69k8R25o90J05O78r84
2068d33O83L20o66O62l32l48N05l54k97P47j019Q5O05p61M09P0m86O60p5n78J042
2089D39m51j37P40n14j9N21q48N65L4q92R31l30o88J002o28j03O62r27L78N00
2109B35o50P05o8m18P63m35o07J185n98k06N97r26N06l1m70N76K4q56P89k95k84
2130d64P87m69OO42r06M58L43m44K98jn04Q01p21l22J025p17J0M81r16M06L35
2151A28n91M89O4o89J012n26j25Q20p78K28M25p45O62L8o39M34j56n34R00o39
$$ plain form
2171 -222 -420 267 -398 -349 93 -533 266 348 -340 420 -5 -98 278 -31 -86 572 -274 196 394 -222 218
2192 218 50 -543 167 -8 -423 317 -349 -238 367 -311 149 381 -198 399 290 -237 249 116 -72 559
2212 559 -278 -202 164 -444 -186 192 -636 203 -222 -396 354 -75 -242 482 -155 106 615 -314 234 332 -214
2233 -214 482 -104 -394 284 -356 -312 337 -392 -250 -130 -492 217 226 -286 392 -1 -71 505 29 251 614
2254 614 -150 111 253 -368 143 -137 -556 121 -227 -593 252 -144 -199 297 -255 323 466 -138 456 328
2274 328 -173 509 -150 -137 320 -377 -224 112 -520 56 138 -472 217 -123 -307 199 -213 -34 492 -69 119
2295 119 298 -366 321 188 -222 175 -39 -200 283 -306 -143 106 -409 -146 189 -318 173 179 -159 416 31
2316 31 -51 441 19 2 312 -117 156 150 -410 177 129 -415 178 -94 -289 363 -272 -134 235 -239 146 255
$$ packed form
2171b22j98O87o65M9M42o26P99Q2o88P60m25r3L76l09n5O58q46M70J98o16M40
2192B18j68n93P10j75m15P40o66J11O05o78M60K32n79N97j09n27M86j33j88O31
2212E59q37P6L66o08K58L78q28Q39m25j74P50m29j67P24o37K61N09r29N48R8n46
2233b14O96n86k90O78o40M4O49p29J42J20l62P09Rn12O78l93p0N76m76K22L63
2254F14p64K61J42o21N11k80m19O77l48l66Q45l96n5M96n52N78J43o04N94j28
2274C28n01O82o59J3M57o97J53L36o32N76Q2o10O89l40j84N06m12J79N26n61J88
2295A19J79o64O87j33m10L97k14j61M83n89J63K49n15K63L35n07M91Ol38N75l85
2316C1q2M92m22j7L10m29K73on60N87m8n44N93k72j95O52o35J38L69m74L85J09
$$ plain form
2338 255 -140 456 61 -508 567 -182 -47 369 -372 -33 330 -436 166 -81 -556 135 -126 -411 441 -74
2358 -74 -123 432 -154 56 347 -287 156 292 -366 338 -89 -224 541 -229 -237 338 -442 -102 242 -558 196
2379 196 130 -367 384 -85 -91 287 -97 -164 381 -107 133 216 -183 276 -17 -380 214 -287 -545 200 -456 -345
2401 -345 126 -293 173 226 -142 312 50 -120 507 54 -80 396 -127 54 148 -453 94 160 -583 11 -224
2422 -224 -381 347 -70 72 271 -200 133 346 -131 226 283 -283 242 -98 -190 194 -231 -166 142 -248 -221
2443 -221 39 -457 187 185 -288 325 54 138 441 18 13 403 -257 171 416 -293 71 -48 -289 139 -123 -338
2465 -338 228 -295 -89 96 -415 113 185 -281 278 42 -147 451 95 42 230 -345 -67 214 -396 50 51
2486 51 -490 85 -143 -228 322 -123 -46 288 -25 92 312 -82 142 122 -257 212 -74 -244 170 -275 -165
$$ packed form
2338B55l95N96l95n69J075p49J35M16p41L39L63p66O02k47m75O91k61k85Q52n15
2358g4m9N55n86K10K91o34M43J36o58P04m27j35P65p70qN75p80L40L44q00P54
2379A96o6m97P51m69oL78l84o7N45m88K40Q3l99M59k93l63N94n01k58P45o56J11
2401c45M71m19M66N3l68M54k62j70O27m53j34M76n23J81R4o01N47O6p43N94k35
2422b24j57P28m17J42J99m71L33K13m77L57N7n66N25l40r2L84m25O5L08l90K7
2443b21K60m96O44km73O13k71Q4L03m23nL90o60M28K45p09L64j19k41M28k62k15
2465c38N66n23K06J85n11N28P2m66N59k36j89N98l56n3J88n75K78K81o10M46J
2486E1n41N75k28q5N50m45P7L34l13J17K20l94K24k0l79M69k86j70M14m45J10
$$ plain form
2507 -165 315 -340 -84 23 -239 191 157 -160 118 -118 -45 392 -192 -21 347 -184 214 190 -237 100 -126
2528 -126 -367 256 -115 28 255 -224 109 189 -267 144 175 -218 330 -133 -91 340 -27 -175 268 -196 -19
2549 -19 263 -373 12 -69 -261 171 -248 -115 257 -138 -175 210 -247 252 317 -268 275 67 -246 354 -90
2570 -90 -135 186 -303 24 196 -324 78 192 -193 43 -15 -90 311 -84 -151 288 -205 101 277 -110 193 184
2592 184 -316 159 -121 -329 245 -254 -53 98 -239 55 253 -298 243 130 -161 261 86 -28 316 -77
2612 -77 22 114 -330 -97 -65 -198 -26 -57 -292 168 -110 -118 124 -165 32 201 -173 -29 304 -163 319 171
2634 171 -5 302 -177 -169 158 -161 -73 25 -399 94 33 -506 66 -123 -11 165 -121 265 382 4 -52 238
2656 238 -296 35 104 -206 129 -51 -231 42 -160 -18 45 -139 14 41 -128 183 35 -161 218 125 -131
$$ packed form
2507a65M80o55K56J07k62M30l4l17K78k36P3M37n84J71L68n31L98k4m27L37k26
2528a26k41O23l71J43K27m79L33Q0m56M11L1l93N48m63M2M31l67j48M43m64J77
2549a9K82o36L85q1j92M32m19J33L72l95l7L85m57M99O5n85N43k08l13O00m44
2570i0m5L21m89L27J72n20M02J14l85K36n8p5M01l95o7M39m93L06J76l87L03r
2592A84n00M75k80k08N74m99K01J51l37K94J98n51N41j13k91M22j75j14L44l93
2612g7R9R2m44K33L2j33J72l1k35M60k78qK42k89J97J69l74J44L33m67M82j48
2634A71j76L07m79QL27l19Q8R8m24M93o1n39N72j89J12J76k86L86J17l78n6K90
2656B38n34L31O9l10L35j80j80K73k02J42O3j84J53K7j69L11j48j96L79r3k56
$$ plain form
2677 -131 245 106 -83 55 -268 53 120 -343 93 -65 -236 72 -190 -71 280 -78 151 243 -152 150 332
2698 332 -190 210 8 -45 283 -199 -110 7 -143 -153 -29 -149 129 -6 -230 170 16 -34 161 -32 -10 276
2720 276 -44 48 124 -200 89 5 -73 244 -100 -309 90 -190 -226 8 -338 -79 118 -87 321 -139 -186 222
2742 222 5 41 289 -159 66 271 -63 160 80 -267 -2 -12 -258 239 -36 38 97 -94 57 61 -123 76
2764 76 61 -292 176 -67 88 240 68 134 151 -178 -138 189 -189 40 -16 -341 100 71 -110 357 -87 -96 128
2787 128 -90 175 261 -92 225 41 -239 203 -23 -159 75 -269 -283 165 -291 -57 59 -192 39 110 -102
2808 -102 114 -38 -162 158 -45 22 186 -82 -87 303 -239 159 -46 -37 121 -139 -240 149 -224 19 -76 32
2830 32 274 129 -96 257 133 -107 404 -136 -124 291 -223 -13 75 -401 -8 -135 -220 -21 -202 -88 322
$$ packed form
2677a31L76j39j89J38l23L21O7m63M36j58j71L08k62J19L51l58K29R2l95L02J82
2698C32n22M00k02n3L28m82Q9J17j50j0J24j20K78j35k24M00j54n0J95j93K2K86
2720B76l20R2P6l24K89q4p8L17l44k09L99k80l6K34l46K59J97k05M08m60m7M08
2742B22k17L6K48m48K25K05l34K23q0l47K65j0k46M97k75P4N9j91J51Mj84J99
2764G6j5l53M68k43J55J52j72O6J7l29M0L27l78K29n6l25M41k9j81M67m44rK24
2787A28k18K65Q6l53L17j84k80M42k26j36K34l44j4M48m56K34J16k51K31P1k12
2808a02K16j52j24L20k03O7J64k68nL90n42L98k05RJ58k60j01L89l73K43r5J08
2830C2K42j45k25L53j24k40N11n40J2M15n14K10Q8m76L93j27q5J99j81J14M10
$$ plain form
2851 322 -26 -15 98 -29 127 217 -8 189 99 5 21 -180 -92 105 -218 -233 0 -292 30 182 -49 121
2873 121 265 -11 185 -51 -97 272 -193 6 356 -107 24 -54 -138 38 -74 -240 240 -104 -133 116 -67
2894 -67 119 194 -31 238 290 -42 145 -81 6 54 67 -100 152 -275 -33 112 -186 -47 190 -257 154 -24
2916 -24 -217 216 -60 108 153 -62 63 288 -170 153 126 -171 -10 50 35 -11 -356 72 2 -214 30 67 -191
2939 -191 0 47 -213 142 -50 60 187 -189 11 -10 -211 16 116 -57 175 85 -152 35 -67 11 91 -217
2961 -217 -65 96 112 -23 -47 -51 236 89 -61 330 -63 53 -39 -58 132 83 -218 -65 -39 -302 84 -188 -83
2984 -83 261 -123 64 147 17 182 231 -57 343 78 -96 65 -130 -62 54 -338 -54 -21 -86 -17 -99 -216 34
3007 34 28 -72 59 28 47 219 -135 35 133 -109 118 32 -116 106 -354 -234 190 -117 -52 40 -176 -76 98
$$ packed form
2851C22l48J1J13j27J56R0k25J97r0r4J6k01Q8J97l23j5K33k92L22J52k31J70
2873A21J44k76J96k36m6L69m65J99L50m63J31p8q4J76j12j66M80l44k9K49j83
2894f7J86P5k25K69N2l32J87k26Q7M8J3j67K52m27K42J45k98J39K37m47M11j78
2916b4j93M33k76J68M5k15J25K25m58L23k7k97J61O0j5m6l45M28p0k16K44L7k58
2939a91J91M7k60L55j92J10J27l76K00k1k01K27J00j73K32r0k37J87j02P8Q0l08
2961b17J52J61J6j35k4mK87j47j50L91l93J16r2j9J90m9l01J53K6k63L86k72J05
2984h3L44l84J87Q3j30J65M9k88M00k65j74J61j95O8J16l92K84L3o5O9q2j17K50
3007C4oj00J31l1J9J72l54J70R8k42K27q6j48K22m60J20M24l07O5R2k16J00J74
$$ plain form
3030 98 -94 105 99 -14 254 77 15 232 -95 166 -53 -170 24 22 -159 -65 -70 -288 191 -118 -52 136 -76
3053 -76 84 281 59 221 202 -21 338 174 -172 21 2 11 54 -179 -46 -27 -255 -44 -120 -246 72 -17 -205
3076 -205 116 -150 54 347 -26 156 183 -130 121 82 -152 -50 -180 -113 214 -76 -45 206 -224 128 -4
3097 -4 46 185 3 -83 244 129 -110 276 -49 -59 85 -196 -70 59 29 196 -189 4 136 -65 -181 245
3119 245 -99 -13 72 -86 216 186 -122 106 -68 12 271 -150 -110 31 -105 -26 104 -261 113 -24 -260 141
3141 141 -25 -48 141 -119 -16 266 -249 -83 62 -248 293 -98 -79 47 -146 -169 7 -96 -128 114 -112
3162 -112 -84 -50 -19 21 159 -158 150 52 -28 201 -101 210 38 -180 80 14 -110 96 -2 27 75 77 -127 140
3186 140 -139 -64 120 38 158 16 52 182 -50 -13 178 -4 -17 135 -11 7 216 -188 17 -96 -115 130
$$ packed form
3030I8j92J99oj13K68j77o2K17l27K61k19j17J94kj81R4nk18M79l09O6J88k12
3053g6J60J97k22J62j9k23L59j64l46J93j9RM3k33J33J9k28K11p6j26L18q9j88
3076b05L21k66K04K93l73J82K7l13K51l9k34J02j30O7L27k90L1K51m30L52j32
3097dN0J39j82q6L27j15k39L86l25j0J44k81J26J29l0J67l85J93J32k01j16M26
3119B45l44Q6Q5j58L02l0l08K28j74Q0K59m21M0J41j36P9J30l65L74j37k36M01
3141A41j66k3J89k60J03K82n15J66J45l10N41l91J9J26j93k3J76j03l2K42k26
3162a12K8L4L1M0J38l17L08r8q0K29l02L11j72k18K60o6j24K06r8K9M8Kk04K67
3186A40k79P5J84q2J20j42L6J30k32L7J91j82j3J52j46J8K09m04K05j13j9K45
$$ plain form
3208 130 -139 -172 223 136 -164 165 -61 48 56 -229 184 200 -160 127 -54 -6 84 -13 -41 13 -122 -67 122 -252
3232 -252 201 65 -225 294 124 202 80 -38 -125 8 -160 -119 -143 -292 153 -32 -144 46 20 -108 47 -131
3254 -131 80 202 -133 198 157 -106 23 26 -56 148 189 -79 -71 -170 79 35 -199 104 -17 -72 34 -185 -63
3277 -63 118 -208 129 34 1 6 118 87 147 42 -66 97 -84 -101 -1 -85 -7 8 -282 244 54 -166 160 69
3301 69 -5 37 -3 -71 -2 -64 -78 -123 -238 332 95 -108 42 13 -190 56 -57 -140 -27 -19 28 20 49 131 2 -208
3327 -208 71 -97 86 250 -187 -44 25 -49 -146 153 -138 90 -135 26 -7 -121 -5 177 -50 -73 118 -113
3349 -113 115 16 31 40 -170 -83 124 -130 32 95 -311 111 212 -142 84 176 -73 146 -50 -101 145 -179 32
3372 32 252 -71 169 19 -25 77 135 -163 -37 -89 20 147 -89 49 -44 -77 -16 -62 37 241 -72 -146 -57 164
$$ packed form
3208A30k69l3L95q7l00L29k26J09Qk85M13J6l60K87j81M8R0r7k8N4j35N5J89l74
3232b52M53j36k90N19j70P8j22j18q7J33j68M1k4j49M45j85j12J90k6j28J55j78
3254a31K11J22l35L31m1k63J29Lq2K04M1k68Qr9K49m4k34L03j21n5J06k19J22
3277f3J81l26L37r5l3NJ12l1O0j05j08J63j81j7J00q4P8J5k90N26j90k20L26r1
3301F9p4M2m0o8O9o2j4m5j15N70k37k03J50k9k03K46j13q3J13QM7qK9Q2j29k10
3327b08K79j68J83J64m37J43O9p4r7K99k91K28k25J61l3j14J16J82k27k3J91k31
3349a13K28r9J5Rk10Q7K07k54J62O3m06M22J01l54K26R2k49K19j96n1K46l24K11
3372C2K20l23K40j50m4J02N8k98J26n2J09J27k36J38r3l3O1m6R9K04l13p4Q9K21
$$ plain form
3396 164 50 239 81 232 138 -102 28 18 -25 -83 -166 -259 260 -42 13 220 -242 -12 304 -116 289 129
3418 129 -92 149 -31 7 53 -8 -26 35 -65 94 -37 -35 -7 25 -60 199 -16 -34 236 -80 193 103 -102 107
3442 107 246 66 101 -26 -243 66 -130 -83 31 -26 -29 71 -87 154 95 0 -14 108 -151 61 -12 -21 70 -103
3466 -103 123 73 27 22 -6 -63 97 33 -217 -50 -36 -92 43 -79 15 130 -216 254 112 -131 108 -41 -113 82
3490 82 -100 103 66 -293 13 -39 -227 31 -86 -252 153 -117 -25 23 76 176 154 -15 114 238 -83 122
3512 122 -14 -55 89 -72 -142 188 -165 1 -225 -166 -53 -94 -48 166 -67 0 39 -8 44 -65 38 108 -48
3535 -48 -127 71 -69 -77 22 18 -38 71 40 158 138 81 -22 29 -123 91 22 -100 215 -54 -64 123 -78 -100 120
3560 120 -32 -135 -1 48 55 -223 -172 63 -132 61 331 -212 53 2 -81 116 197 -41 52 -97 70 49 -113
$$ packed form
3396A64j14J89j58J51r4k40J30j0m3n8q3r3N19l02N5K07m62K30L16m20M05j60
3418A29k21K41j80L8M6o1j8O1j00J59j31KK8L2q5K59k15j8K70l16K73r0k05K09
3442A07J39j80L5j27k17L09j96M7J14n7lJ00j58K41n9r5j4J22k59K12p3rR1j73
3466a03K26n0m6nk8n7J60o4k50J67J4n6J35j22R4J15l46M70j42k43K39j49p2J95
3490H2j82K03l7l59L06n2j88K58j17j66M05k70R2M8N3J00k2j69J29J24l21K05
3512A22j36m1J44j61p0L30l53J66k26N9J13m1M6K14k33O7L9m7N2j09J03P0j56
3535d8p9J98j40qR9mn6J09l1J18k0n7j03N1j52K14o9j22L15k69j0J87k01k2K20
3560A20j52j03J34M9Pk78N1K35j95J93K70n43K65n1q3J97Q1k38R3j49J67k1j62
$$ plain form
3583 -113 -34 41 -136 -14 99 -208 124 -80 -298 19 -21 -20 139 -163 -87 -107 -247 51 80 -2 221 -115 -322
3606 -322 112 -126 61 -38 -160 -89 136 -171 111 38 -159 80 -10 37 161 -137 49 166 -84 191 145 -31
3628 -31 75 7 -136 129 143 -156 82 -4 10 145 -184 215 97 -141 78 174 -109 23 41 -113 122 -68
3650 -68 -147 169 -197 -107 81 -129 -10 106 13 172 -174 -112 165 -5 -16 179 -78 79 98 -126 24 -56 -56
3673 -56 152 -139 86 60 -217 -125 109 -129 112 173 221 192 -115 -35 116 143 -50 9 -111 74 -69 -236 67
3696 67 -176 -148 51 -83 45 85 -155 -68 82 -76 51 63 -8 58 101 -157 -84 -111 -89 274 -65 -23 74 -177
3720 -177 124 -10 -313 -60 -89 -193 -43 74 -21 208 -71 -25 77 26 101 -65 -159 78 -75 -134 156 -11
3742 -11 -127 -54 -50 56 131 -26 15 65 -110 13 88 56 17 -118 67 130 -5 -117 6 -76 22 -217 -183 152 -78
$$ packed form
3583a13P9P5j77J22J13l07L32k04k18L17m0JJ59l02P6k0j40K98K9q2K23l36k07
3606c22M34k38J87r9j22P1K25l07K82p3j97K39r0M7J24k98J86J17k50K75m6j76
3628c1J06o8j43K65J4k99K38q6J4J35l29L99j18k38K19R6k83J32J8j54K35j90
3650f8p9L16l66R0J88k10J19J16r3J59l46O2K77j70j1J95k57J57J9k24J50q0%
3673e6K08k91K25k6k77R2K34k38K41O1M8k9l07Q0J51K7j93N9j20J85j43j67L03
3696F7k43K8J99j34J28M0k40Q7J50j58J27J2p1O6M3k58P3k7K2L63l39M2R7k51
3720a77L01j34l03K53k9j04J50J17r5K29k79M6J02n1P5j66r4K37j53n9K90j67
3742a1j16P3MJ06P5j57M1N0j75J23P5l2l9j35J85O3j35j12J23q2R8k39L4L35k30
$$ plain form
3767 -78 -83 -20 20 12 177 -41 -61 276 -138 65 90 10 32 39 -36 151 -83 86 -98 -203 -130 85 -73 113 -249
3792 -249 -79 142 -104 -33 205 4 2 63 -233 -7 60 -27 83 -123 -74 -20 -58 -32 -110 -7 -56 -5 -143 110
3816 110 15 -63 43 49 -33 9 -121 77 -41 -92 210 -101 -54 -31 6 -257 91 -11 29 22 -57 91 20 -17 110
3841 110 -50 -124 243 32 55 115 -192 -123 94 -78 0 120 -56 47 -13 -176 56 103 -28 77 -187 61
3863 61 99 -198 18 127 61 73 168 -25 49 -52 -1 -85 -144 40 148 50 65 46 -118 223 144 66 71 -33 -5 13
3889 13 -61 89 264 -28 -84 -9 -65 112 -52 -141 -23 36 -25 -39 -81 32 151 -205 -55 -118 -150 31 -92 -131
3913 -131 90 -73 -105 174 -108 -47 78 36 220 72 -100 109 -52 -118 -13 -125 -168 -78 -86 -12 230 -34 100
3936 100 -70 150 22 -89 -70 -57 -27 16 27 -155 117 50 -173 9 -17 -175 172 -172 -182 113 -96 159 70
$$ packed form
3767g8nO3M0qJ65k18k0L37m14K03K5q0K2Pp5J87k34J69j84j05P3K15j58J86l62
3792b49J70K21k46P1K38k01kO1k96K26O7q7J10k06M9N4l8K6p8J03m9N1j38K53
3816A10r5p8J06Oq2M2j30J98j18n1L02l11M7K3L7k63L48j02M0pp9J48p1l7J27
3841A10j60p4L67k11K3O0l07O9K17j72P8J20j76J03o0j63K32M7j31J05k64K48
3863F1L8k97K16J09o6J2R5j93P4j01N1q4n9J84J08r8J5j9j64L41p9p8Nj04K8J8
3889A3p4J50J75k92n6P5n6J77j64q9J18N9o1j4m2J13J19l56J50o3l2J81j23l9
3913a31K21j63l2K79k82O1J25m2J84j48j72K09j61o6J05j12m3R0qP4K42k64J34
3936A00j70K20j28j11J9J3L0M3J1j82K72o7k23J82k6j58L47l44j0K95k09K55q9
$$ plain form
3959 70 -5 60 26 -250 38 -51 -49 -74 -103 159 26 -149 74 192 -60 0 11 55 138 -71 -70 58 -49 -18 122
3984 122 -13 40 102 -236 -128 125 -25 51 -117 -114 -31 -83 -68 46 -60 49 208 -48 -4 -29 31 104 183 -101
4008 -101 -31 118 13 85 61 -16 -13 13 102 -5 -110 -110 134 11 194 11 171 35 -144 265 60 -50 200
4031 200 -56 69 -117 -66 -44 81 15 -72 31 78 130 48 -82 -33 -37 -80 91 -42 -27 140 -32 -73 -32 -101 104
4056 104 -124 -76 18 13 -13 130 153 -157 76 -148 155 161 -200 32 -110 -77 -9 24 -48 106 -181 -127 -91 -194 105
4081 105 -47 -81 148 25 -18 150 76 141 -5 -18 179 37 -33 146 -12 -60 -32 -152 -44 178 -32 -18 141
4104 141 -187 -80 133 -25 25 227 -123 60 44 -73 47 26 -11 -59 -139 -63 90 -68 -5 -36 -114 -42 -19 11
4128 11 316 12 -23 66 162 100 67 -158 51 -8 -123 -10 -134 -96 61 -166 18 -31 -154 31 -84 -155 7
$$ packed form
3959G0p5O5l4k76K88q9Kk5k9K62j33j75K23J18k52O0J1M4Q3k09JJ28j07L1J40
3984A22j35N3O2l38J08K53j50P6j68LQ3n2J5J14j06J09J59k56M4k5O0P3P9k84
4008a01P0J49j05P2k4p7LK6Q9j07j05%K44j23J83j83J60j36j79M09k05j10K50
4031B00k56J25j86N1K2J25o6q7J03M7N2q2j30M9mm3J71j33J5J67j72m1M1o9K05
4056A04k28M8R4nk6J43K3l10K33k24L03Ol61K32j42L3O8L3p2J54k87N4L6j03K99
4081A05j52l4K29j23m3J68p4O5j46j3J97j42p0J79j58m8K8j20J08K22k10J4J59
4104A41l28J07K13j58N0K02l50J83j6j17J20k1l7m8q0P6J53j58O3l1p8P2K3L0
4128A1L05l04l5Q9R6o2l3k25K09n9j15J13j24L8J57k27J84m9j23J85j15p1J62
$$ plain form
4151 7 -14 25 271 -105 -124 122 9 144 -18 -46 22 -10 -203 155 -46 -136 -32 -114 -118 -71 -55 40 147 -157 141
4176 141 32 7 79 -78 22 110 -150 -61 -1 34 126 43 -127 -38 -12 -166 82 -135 -75 175 -107 -37 -100 -180 82
4201 82 179 -48 135 -96 -11 90 -78 -156 15 5 -53 111 -145 -119 -197 -68 78 38 -68 197 -10 95 173
4224 173 -64 112 139 -1 68 4 -16 160 -46 -63 82 -48 17 95 -38 112 159 -140 155 -5 -64 185 1
4247 1 65 140 -159 -99 13 -105 108 -327 -38 137 126 -7 3 -43 61 70 19 -34 62 -49 122 17 -60 83 -141
4272 -141 45 143 -57 -36 130 -186 -33 -129 -158 31 113 76 -32 -94 -48 -86 -177 124 125 -194 52 126 4 77 97
4297 97 -138 34 -19 -60 13 2 -94 8 -77 34 130 16 8 118 46 98 -39 239 -7 -150 -29 113 -265 190
4321 190 135 -82 121 -37 -27 52 -105 30 111 -103 -2 92 -119 106 19 -5 188 20 -101 117 -159 -7
$$ packed form
4151Gk1L9K46l76j9K46j13J35j62k8O8l2j93L58k01r0J04q2mM7J6R5J07l04K98
4176A41j09k5P2j57J00Q8k60Q9O0L5R2q3j70Q9K6j54K48k17O0K50k82P0o3q0K62
4201H2R7k27J83k31Q5J01j68p8J71j0n8J64k56K6p8J29J46m0j06K65k07J05P8
4224A73k37J76K7j40O9o4k0J76k06j7J45j30O5P8j33J50M7k99K95j60n9K49j84
4247AO4P5k99O0J12j18K13m35K89J75j1j33J0m6J04Rn1n3R6j11J71j05p7J43k24
4272a41J86R8k00K1J66l16J53r6k9J89Q2l7j08o2M6l8r1L01Jl19K46P4j22P3K0
4297I7k35J72n3m1P3j1r6J02q5J11R6j14qJ10p2N2j37K78k46j43J21J42l78M55
4321A90n5k17K03j58J0P9j57J35Q1k14J01R4k11K25q7k4J93j68j21K18k76J52
$$ plain form
4343 -7 93 -21 96 -8 14 21 24 -65 172 -94 -23 142 14 -50 43 38 201 69 -71 -82 71 -88 93 -46 44
4368 44 -1 -196 -62 -44 -158 32 -9 -114 148 -112 -218 -29 -15 41 21 15 -11 -52 -87 9 -7 42 -56 -59 -91 8 16
4395 16 -23 184 -71 -62 106 -17 65 -64 37 260 -15 -71 37 -68 -151 192 -99 -71 41 -144 66 14 -215
4418 -215 -104 44 -55 38 -212 116 16 -129 110 -22 -82 52 103 60 -4 -100 27 148 -25 128 -45 -217
4440 -217 -35 -89 -168 25 111 -38 74 -143 -14 28 -106 45 -26 -142 -8 42 -133 -62 -151 -60 109 -61 13
4463 13 166 155 -9 -9 -79 -31 207 102 124 43 -31 108 -83 -31 33 -61 -117 11 -21 96 -33 -124 187 -146 -27
4488 -27 -72 -51 48 -7 -9 8 -45 -226 50 89 -56 250 -101 -14 -50 2 -32 17 -26 25 -92 -224 88 13 -73 -51 21
4515 21 23 129 -19 97 55 -37 41 -7 -110 33 24 -106 -50 -49 84 111 -147 25 16 -89 60 -68 -88 157 37
$$ packed form
4343gJ00j14J17j04K2PLq9K37k66P1J65j28o4R3nJ63j32j40j1J53j59J81j39R0
4368D4m5j95J34J8j14J90m1j05K62k60j06J89J4N6k0ok6m1l5R6j6M9r8ll2R9Q
4395A6l9K07k55RJ68j23Q2j29J01K23k75n6J08j05q3L43k91K8J12j85K10n2k29
4418b15J11J48r9R3k50L28j00j45K39j32o0J34N1m3o4r6J27J21j73J53j73j72
4440b17J82n4p9J93Q6j49J12k17J29M2j34J51p1j16J34N0j75P1q9R1J69j70P4
4463A3J53j1j64%p0M8K38j05K2q1p4J39j91N2O4r4n6J28l2J17j29r1L11l33J19
4488b7m5K1R9n5kJ7n3j81K76L9j45L06l51Q7l6N2l4M9m3N1j17j32L12p5q6K2P2
4515B1KJ06j48J16m2r2P8m8j03J43rj30N6JJ33K7k58J72rj05J49j28k0K45j20
$$ plain form
4540 37 -26 29 -34 -186 128 12 66 -36 -118 170 -60 -61 91 -1 50 191 -118 -130 181 -150 109 26 -31 223
4564 223 -120 -107 -4 12 122 -4 -205 -37 120 -39 170 84 -13 -14 36 47 168 -48 -112 -61 -124 -5 59 -238
4588 -238 71 -115 -113 -42 -44 -139 -19 -71 -96 103 11 79 78 -170 99 122 -54 253 268 19 244 -33 -107 135 -162
4613 -162 165 -157 -51 12 -173 -33 -23 -78 71 -33 -114 145 76 9 8 24 -135 74 39 92 70 -256 -96 -1
4637 -1 -209 -112 46 -29 139 -2 -14 199 -78 -26 26 -33 123 -14 -160 36 112 -92 90 2 -59 69 29 -86
4661 -86 -236 -101 -10 -133 -14 92 -105 -80 82 -96 -34 -68 94 -80 41 -144 34 46 -103 75 -124 3
4683 3 10 -10 -74 -38 -67 146 -32 -148 195 93 -35 135 -21 158 115 -34 -10 277 -127 86 -68 -19 -29 110
4707 110 -126 107 77 -182 157 43 119 100 -3 108 125 -164 143 -73 -112 29 -72 -99 16 -124 -51 -9 48
$$ packed form
4540C7o3N5o3j52L14j16N4j02q2K88k30jJ52r2N1J41l09j2L11l31K59q3n7K54
4564B23l43J3J03J6J10j26k01J68J57j59K09q6r7jN0J1J21k16o4N1o3J19O4k97
4588b38L09j86KP1kr5J20n2k5J99r2O8jk48K69K3j76L07J5k49K25k77p4K42k97
4613a62L27l22J06O3j85J40J0n5J49j04q1K59o9o7jJ6j59K09l5N3k2l26J60R5
4637ak08R7J58p5J68j41j2K13k77N2N2n9J56j37j46J96P6k04J82q8o1J28m0j15
4661h6j50J35R1j23J19J06j97K5J62j78O2l4J62j74J21j85J78J2j49J78j99J27
4683CPk0o4L6k9K13j78j16L43j02j28J70j56J79m3j49K4K87m04K13j54M9j0J39
4707A10k36K33l0k59L39j14P6j9j03J11J7k89L07k16l9J41j01k7J15j40P3M2N7
$$ plain form
4730 48 128 -31 115 114 57 3 266 -5 46 97 -39 -13 -93 -54 -51 86 -16 -43 -53 -16 100 -114 -8 45 -198 -54
4756 -54 143 -151 154 16 -84 172 121 -10 55 36 -120 88 -118 -99 99 -6 -9 47 -36 -27 -32 -165 65 72 85
4781 85 -67 89 -107 181 65 65 193 70 -157 35 -59 69 -81 -27 53 -47 15 -222 -102 -5 37 -75 103
4804 103 -170 44 95 -187 142 107 -112 32 158 -30 66 -126 -33 17 -68 -38 118 -157 -43 153 98 -102 88
4827 88 -138 104 -15 -164 -1 42 -45 90 28 112 -142 -206 -32 -58 -194 18 11 -25 77 -18 55 19 -27 -31 6 -38
4853 -38 31 92 -148 224 -30 -253 85 -80 -60 115 -137 -139 10 44 234 -17 -45 59 55 -37 67 168 76 -40
4877 -40 -68 30 124 -225 130 -146 -183 43 -141 -165 70 36 34 -61 -109 252 -34 118 49 172 -20 44 59 29 69
4902 69 -37 89 28 -51 -64 39 38 -37 -133 -8 78 -66 77 -12 125 37 117 51 45 -208 -70 -12 -28 -158 78 26
$$ packed form
4730D8Q0j59J46jn7n4K63k71N1N1j36K6q0L9LJ37j02k7j0L7J16k14J06N3k43J44
4756e4J97k94L05j38j00K56n1j31O5j9j56K08k06J9J98j05lN6q3Rnj33K30PJ3
4781H5j52J56j96K88j16%J28j23k27J92r4J28j50N4Q0j00O2k37J20R7M2j12J78
4804A03k73K14N1k82L29l5k19J44J26j88R6j92R3N0q5L0J56k75J14J96n5k00J90
4827H8k26K42j19j49J63M3q7J35o2Q4k54o4J74k6j36K12pl6J02r5P3l6m6mL7m4
4853c8O9O1k40L72k54k23L38j65K0J75k52kJ49L4J90k51k8J04mr2J04J01r2j16
4877d0k8R8R4l49L55k76l7K26j84k4K35l4kr5m8L61k86J52o9J23j92O4J5l0M0
4902F9j06J26o1p9j3J03jp5r6J25Q6j44J43q9J37q8Q0o6ok53J38N8j6j30K36n2
$$ plain form
4928 26 -6 121 4 -4 103 -31 100 117 -16 47 1 57 56 -91 136 109 31 9 217 -143 111 17 -199 -95 -189
4953 -189 -99 -49 -96 -21 -65 101 -93 25 -49 -12 -65 -16 170 68 12 141 143 19 -15 -132 119 60 -56 25 -120
4978 -120 130 216 -62 -11 69 -24 -65 244 81 111 -47 -39 -2 16 -45 114 107 -24 -31 102 -15 110 -80 -69 -29 19
5004 19 167 -96 59 160 -71 139 -14 -118 69 4 -31 -17 134 -174 150 3 -135 19 37 -26 192 82
5026 82 256 24 6 25 -35 124 145 -97 -39 -27 31 75 11 114 -177 98 -99 -83 -108 23 52 31 102 45 -263
5051 -263 90 178 16 55 65 67 23 84 39 20 -5 -78 48 -156 -76 -47 -93 10 -8 82 35 -21 114 114 -158 33 129
5078 129 38 0 -21 -97 -25 -46 -130 50 -74 33 40 -82 163 -39 91 223 105 118 154 217 -183 56 159 -57
5102 -57 58 -106 -33 6 -152 -149 -82 -58 11 -12 -28 -89 99 55 -100 -43 153 74 -109 141 -152 56 99 -5 -102
$$ packed form
4928B6l2J27j17qJ07j34J31J7j33O3m6N6jj47K27k7p8k2K08l60K54r4k16J04r4
4953a89R0N0m7P5m4J66j94J18p4L7n3M9J86j02n6J29Kj24l4j17K51n9j16Q1j45
4978a20K50Q6k78N1Q0r3m1L09j63L0j58QL7J8o1J59pj31pJ33j17J25j90J1M0M8
5004A9J48k63J55J01k31K10j53j04J87o5l5J4J51l08L24j47j38J54J8o3K18j10
5026H2J74k32j8J9o0J59K1k42N8J2N8M4o4J03k91K75j97J6k5J31K9k1P1n7l08
5051b63L53Q8j62L9J0Km4O1m5j9k5p3J26k04Q0K9m6J03j8R0m7n6J35%k72J91R6
5078A29r1l8k1p6P2k1q4J80j24J07Pj22K45k02J30J32j18J3L6O3m00K39J03k16
5102e7J15j64P3L9j58LO7K4O9k3j6o1J88m4j55N7J96p9j83K50k93K08M3j04r7
$$ plain form
5127 -102 127 -178 10 -41 -72 126 5 -129 73 24 -43 52 42 134 19 -17 278 -189 -10 33 70 31 -98 75
5151 75 -65 11 -112 60 66 -145 -56 50 -53 67 46 -129 41 -24 -63 87 -178 73 -11 112 -96 103 -111
5174 -111 -25 -79 -80 -200 3 84 81 -54 77 108 -128 -80 48 30 46 63 -64 109 -78 9 89 -138 93 11 26
5199 26 -189 -121 -87 -34 124 -97 22 -55 70 218 -52 -182 144 -48 89 31 -25 -25 -208 -57 12 -113 58
5222 58 135 -186 60 41 -144 217 30 -8 82 -20 -96 181 -55 80 141 -99 3 -100 -56 57 -91 -94 150
5245 150 -122 -42 17 24 74 51 -68 61 61 -107 95 45 -99 113 -105 3 -19 49 -25 -37 -308 45 -61 -87 246
5270 246 -21 32 113 -46 29 48 26 175 -112 18 205 -14 -55 -11 -117 22 169 -62 -44 111 -18 84 94
5293 94 -56 103 -33 -59 -99 103 19 129 -135 -86 24 -106 9 42 -83 -3 -74 -12 70 -18 -26 91 -97 -50 -1
$$ packed form
5127a02K29l05J88n1l1J98j21j34K02m9o7R5j0R2j15l6K95m67J79M3L7l9j29J73
5151G5j40P6j23J72Ok11Q9J06j03J20k1j75J70o5l9J50k65K51q4J23k08J99k14
5174a11Q6n4jj20K03Q1lj35J31L1k36M8J28j8J6J7j27J73j87Q7Q0k27K31q2J5
5199B6k15O8L4N3J58k21J19p7J25J48k70j30L26j92J37n8n6%j83J51O9j25J71
5222E8P7l21K46j9j85L61j87l8R0j02p6K77k36J35O1k40J02j03M4J13j48lK44
5245A50k72Q0N9PN0k3j19J29%j68K02n0j44K12k18J08k2O8p4j2k71L53j06k6L33
5270B46k67N3Q1j59P5J9k2J49k87J30J87k19m1M4j06J39J47k31J8J55j29J02J0
5293I4j50J59j36k6m0K02q4J10k64M9J10j30J15L3j25Q0p1O2Q2q8qJ17j88M7M9
$$ plain form
5318 -1 57 189 72 -153 156 82 -164 61 -161 -165 -55 24 -78 57 -61 -50 61 98 -13 153 204 91 -50
5341 -50 -29 -93 30 112 -25 3 -79 88 -40 32 -77 179 -54 -106 -17 -53 -116 4 265 -40 -24 -102 5 8 84
5366 84 39 -31 -19 111 83 196 154 -68 -78 136 46 49 127 -100 -78 -11 -101 9 76 -25 -11 99 112 64 6 -8 13
5393 13 -1 56 18 38 -19 102 -51 37 40 -106 149 -161 21 119 18 21 -20 43 51 16 -4 54 -71 -12 -6 113 27 -36
5421 -36 -99 -61 54 -71 14 31 59 177 -18 -64 26 -36 93 99 7 264 -130 -27 148 1 89 -80 0 -125 7
5446 7 31 -19 124 6 24 108 141 150 -28 -65 131 -39 29 165 -42 -100 -184 -38 -127 -40 -108 -33 -51 -88 -18 11 -110
5473 -110 140 -98 -70 50 -161 -265 108 -52 61 44 23 156 -145 126 144 -44 128 -45 157 100 185 92
5495 92 105 -149 5 -60 140 -4 -48 -46 -46 -141 21 91 5 -32 78 57 -52 32 -155 6 85 14 32 -2 -47 -18 4
$$ packed form
5318aN8J32j17k25L09p4k46K25k22mJ10P9j02J35j18J1J11L7j11J66N1j13j41
5341e0K1o4J23Q2j37K8q2J67j28P2j09K56k33n2Q9l6o3J20K61l05J6p8J07LP6
5366H4m5p0J2J30k8J13m2k22j0K14r0LP8k27K2O7r0J10O7j01J4J10J3m8n8j4K1
5393A3j4N7l8K0n7J21j53Q8Lj46K55l10J82R8j01Lm1O3Ql5k0N8j25N9OJ19q6o3
5421c6o3L8J15j25Q5J7K8J18j95m6R0o2J29Or2K57l94J03J75j47Q8j69Q0j25J32
5446GK4n0J43j18J8Q4L3Rj78l7J96j70O8J36k07n8q4J46q9Q7o8P5j8l7P0K9j21
5473a10K50k38K8J20k11j04L73j60J13j7k1J33l01K71J8j88J72j73K02n7Q5r3
5495I2J3k54J54o5K00j44m4K%r5J62P0q6l7J10k1j09Q4j87J61P9p1J8l4m5K9K2
$$ plain form
5522 4 100 44 55 -12 106 6 -11 34 86 33 -147 -50 -20 28 -120 227 16 -10 -117 99 -12 -68 23 47 55 -36 19
5549 19 66 -67 -10 27 -69 48 10 151 34 -113 25 -33 -182 189 107 -20 142 -6 -86 69 -53 -1 25 -36
5573 -36 9 70 65 -69 17 -43 158 146 -99 36 -140 85 204 -48 76 63 -86 147 -5 59 168 10 36 -122
5597 -122 -102 77 37 -74 2 -8 13 -23 99 -1 -44 -202 101 59 -9 -69 -148 -135 16 -82 -155 8 -82 -13 43 -69
5623 -69 37 -51 -96 48 58 55 112 69 -66 72 58 -7 52 -68 -156 -103 -27 120 -88 63 -48 -132 50 -63 -147
5648 -147 59 -12 -80 70 -21 -118 29 -25 49 10 -11 199 -53 -43 117 -152 -42 134 112 -129 137 -50 -49 93
5672 93 21 -144 -111 -26 140 46 31 238 -107 -50 -89 -59 11 24 32 45 130 -37 -82 217 -24 168 153 58 21 121
5698 121 -60 116 -108 -33 177 -75 93 -83 -101 166 -74 -110 87 -55 75 -14 -99 -101 152 -45 -59 -64 -157 75
$$ packed form
5522DR6n6J1o7J18j00j7M5N2n3j80R7L0M8j48L47k11k6j07K16j11n6R1K4Qr1N5
5549A9M7j33N7L7r6J17l8J41j17j47J38n8j49L71q2j27J62j48q0J55j22N2K6o1
5573c6M5O1nj34Q6o0K01j2k45J35j76K25J19k52J24j3j49K33j52O4J09j58K6j58
5597a22K0J79m0j11P6j0K1l6J22j00m3j58L03m2o8o0p9J3J51r8p3J63r0O9N6j12
5623f9J06q8m5J44J0lN7m3j35J38j4o5N9j20q8N3P6J47k08J51j11q4J82j13q4
5648a47K06p1o8J50r1r7J47n4P4l9k1K10k52J0J60k69J10J76k2k41K66j87JJ42
5672I3p2j65L3Q5J66r4j5K07l45N7l9L0P0J3QJ3Q5j67m5K99k41J92j5r5l7J00
5698A21j81J76k24P5K10k52J68j76j8K67k40l6J97j42J30q9q5kK53j97j4nr3K32
$$ plain form
5722 75 46 -218 50 36 -118 75 31 -51 28 12 -42 126 109 -123 155 36 -33 72 -83 118 -102 -16 60 -69
5746 -69 -43 212 -177 93 71 12 32 58 23 76 -32 -28 -48 -320 115 -122 -20 -22 162 -1 107 -75 26 -56 -116
5771 -116 107 -127 9 4 28 90 -8 -6 -54 -10 113 -100 -102 -26 -150 -71 -97 52 92 47 -172 101 79 -92 75 7
5797 7 -25 -189 -9 -29 67 130 -232 38 106 -140 73 48 -65 81 76 173 64 -138 54 91 -140 -41 -63 14 -4
5822 -4 -8 93 91 13 -113 38 28 -100 30 -80 -15 87 -107 -6 7 169 -94 -37 -33 203 -21 -263 -45 -165
5846 -165 -54 122 -137 -42 41 143 45 -72 116 92 37 39 7 -180 122 139 -58 161 237 -45 -126 5 -34 4
5870 4 -143 34 160 52 39 57 23 -6 -83 -11 -50 27 -106 37 94 -58 99 -8 19 -233 5 135 -185 54
5894 54 75 91 -84 -80 -79 -54 118 61 -49 34 8 -64 -153 -151 -79 38 -27 -15 26 267 -42 -88 25 51 4 -36 57 -53
$$ packed form
5722G5k9k64K68j4j54J93m4q2P9j6n4J68j7k32K78j19o9J05j55K01k20Q6P6j29
5746f9K6K55l89K70k2n9K0K6l5N3j08Mk0k72M35k37J02kJ84j63J08j82J01q2o0
5771a16K23k34J36nK4O2r8Km8M4J23k13kP6j24P9k6J49M0m5k19K73k2j71J67o8
5797Gl2j64J80k0R6O3l62K70O8k46K13k5j13J46nR7j09k02J92L7k31R9k2P7j8
5822dmJ01kp8j26J51j0j28J30j10O5J02j94J01J3J62k63N7MK36k24k42K18j20
5846a65J11J76k59R5Q3J02r8j17J88k4n5Kl2j87L02J7j97K19P6k82q1J31l9L8
5870Dj47J77J26j08j3J8l4k9p7P2l9P7j33J43N7j52J57j07K7k52K38J30l20K39
5894E4K1J6j75MJK5J72n7j10Q3k6p2q9KP2J17o5J2M1K41l09m6J13K6m7m0R3j10
$$ plain form
5922 -53 75 -111 82 8 132 -117 46 33 221 70 -215 -59 39 -127 -25 -63 33 31 -100 -47 -133 41 104 -24
5946 -24 -61 2 -112 -10 35 1 121 -35 105 -30 76 56 80 98 -128 -94 -131 -16 -9 29 26 178 70 2 49 -10
$$ packed form
5922e3J28j86J93p4J24k49J63j3J88j51k85J56R8j66J02l8R6kj31N3q6J74O3j28
5946b4l7O3j14J02M5l4J20j56J40j35J06k0K4J8k26L4l7J15PL8lJ52j08o8M7n9
$$ [...]
8191I0
##END NTUPLES=NMR FID
##END=
