##TITLE=1H_Pr Dep-Eth
 200.13MHz, CDCl3,
 8 sc
 
 28.5.2025
##JCAMPDX= 6.0         $$ Bruker NMR JCAMP-DX V2.0
##DATA TYPE= NMR FID
##DATA CLASS= NTUPLES
##ORIGIN= UXNMR, Bruker Analytische Messtechnik GmbH
##OWNER= pz
$$ XWIN-NMR		Version 3.5
$$ Wed May 28 16:38:23 2025 Russian Standard Time (UT+4h)  she@DPX200
##.OBSERVE FREQUENCY= 200.1313
##.OBSERVE NUCLEUS= ^1H
##.DELAY= (6, 6)
##.ACQUISITION MODE= SIMULTANEOUS
##.ACQUISITION SCHEME= undefined
##.AVERAGES= 8
##.DIGITISER RES= 18
##SPECTROMETER/DATA SYSTEM= spect
##.PULSE SEQUENCE= zg30
##.SOLVENT NAME= CDCl3
##.SHIFT REFERENCE= (INTERNAL, CDCl3, 0, 14.3821)
##AUDIT TRAIL= $$ (NUMBER, WHEN, WHO, WHERE, WHAT)
$$ ##TITLE= Audit trail, XWIN-NMR		Version 3.5
$$ ##JCAMPDX= 5.01
$$ ##ORIGIN= Bruker BioSpin GmbH
$$ ##OWNER= she
$$ F:/spectra/data/she/nmr/H-C/1/audita.txt
$$ ##AUDIT TRAIL=  $$ (NUMBER, WHEN, WHO, WHERE, WHAT)
(   1,<2025-05-28 16:37:21.95 +0400>,<she>,<DPX200>,
      <created by zg, POWCHK disabled, PULCHK disabled
       configuration hash MD5:
       00 E9 B6 7A A2 85 ED C7 34 08 36 98 17 FE 4E 26
       data hash MD5: 16K
       F9 F6 77 80 3D 0D B9 12 E3 32 1A 25 94 A7 F2 0B>)
$$ ##END=
$$ 
$$ hash MD5
$$ DB 4F C5 04 B5 0E FA EF 09 B5 32 C6 A6 E3 74 A0
##$RELAX= 
##$RELAX= 
##$RELAX= 
##$RELAX= 
##$RELAX= 
##$RELAX= 
$$ Bruker specific parameters
$$ --------------------------
##$DU= <F:/spectra>
##$EXPNO= 1
##$NAME= <H-C>
##$PROCNO= 1
##$TYPE= <nmr>
##$USER= <she>
##$AMP= (0..31)
100 100 100 100 100 100 100 100 100 100 100 100 100 100 100 100 100 100 
100 100 100 100 100 100 100 100 100 100 100 100 100 100 
##$AQSEQ= 0
##$AQ_mod= 1
##$AUNM= <au_zg>
##$AUTOPOS= <>
##$BF1= 200.13
##$BF2= 200.13
##$BF3= 200.13
##$BF4= 200.13
##$BF5= 200.13
##$BF6= 200.13
##$BF7= 200.13
##$BF8= 200.13
##$BYTORDA= 1
##$CFDGTYP= 0
##$CFRGTYP= 5
##$CHEMSTR= <none>
##$CNST= (0..31)
1 1 145 1 1 1 1 1 1 1 1 1 1 1 1 1 1 1 1 1 1 1 1 1 1 1 1 1 1 1 1 1 
##$CPDPRG= <>
##$CPDPRG1= <>
##$CPDPRG2= <>
##$CPDPRG3= <>
##$CPDPRG4= <mlev>
##$CPDPRG5= <mlev>
##$CPDPRG6= <mlev>
##$CPDPRG7= <mlev>
##$CPDPRG8= <mlev>
##$CPDPRGB= <>
##$CPDPRGT= <>
##$D= (0..31)
0 0.7 0 0 0 0 0 0 0 0 0 0.03 0 0 0 0 0 0 0 0 0 0 0 0 0 0 0 0 0 0 0 0 
##$DATE= 1748435841
##$DBL= (0..7)
120 120 120 120 120 120 120 120 
##$DBP= (0..7)
150 150 150 150 150 150 150 150 
##$DBP07= 0
##$DBPNAM0= <>
##$DBPNAM1= <>
##$DBPNAM2= <>
##$DBPNAM3= <>
##$DBPNAM4= <>
##$DBPNAM5= <>
##$DBPNAM6= <>
##$DBPNAM7= <>
##$DBPOAL= (0..7)
0.5 0.5 0.5 0.5 0.5 0.5 0.5 0.5 
##$DBPOFFS= (0..7)
0 0 0 0 0 0 0 0 
##$DE= 6
##$DECBNUC= <off>
##$DECIM= 32
##$DECNUC= <off>
##$DECSTAT= 4
##$DIGMOD= 1
##$DIGTYP= 9
##$DL= (0..7)
0 120 120 120 120 120 120 120 
##$DP= (0..7)
150 150 150 150 150 150 150 150 
##$DP07= 0
##$DPNAME0= <>
##$DPNAME1= <>
##$DPNAME2= <>
##$DPNAME3= <>
##$DPNAME4= <>
##$DPNAME5= <>
##$DPNAME6= <>
##$DPNAME7= <>
##$DPOAL= (0..7)
0.5 0.5 0.5 0.5 0.5 0.5 0.5 0.5 
##$DPOFFS= (0..7)
0 0 0 0 0 0 0 0 
##$DQDMODE= 0
##$DR= 18
##$DS= 0
##$DSLIST= <SSSSSSSSSSSSSSS>
$$ [...]
##$SUBNAM0= <"">
##$SUBNAM1= <"">
##$SUBNAM2= <"">
##$SUBNAM3= <"">
##$SUBNAM4= <"">
##$SUBNAM5= <"">
##$SUBNAM6= <"">
##$SUBNAM7= <"">
##$SUBNAM8= <"">
##$SUBNAM9= <"">
##$SW= 18.0517328524113
##$SWIBOX= (0..15)
0 0 2 0 0 0 0 0 0 0 0 0 0 0 0 0 
##$SW_h= 3612.71676300578
##$TD= 16384
##$TD0= 1
##$TE= 0
##$TE2= 300
##$TE3= 300
##$TEG= 300
##$TL= (0..7)
0 120 120 120 120 120 120 120 
##$TP= (0..7)
150 150 150 150 150 150 150 150 
##$TP07= 0
##$TPNAME0= <>
##$TPNAME1= <>
##$TPNAME2= <>
##$TPNAME3= <>
##$TPNAME4= <>
##$TPNAME5= <>
##$TPNAME6= <>
##$TPNAME7= <>
##$TPOAL= (0..7)
0.5 0.5 0.5 0.5 0.5 0.5 0.5 0.5 
##$TPOFFS= (0..7)
0 0 0 0 0 0 0 0 
##$TUNHIN= 0
##$TUNHOUT= 0
##$TUNXOUT= 0
##$USERA1= <user>
##$USERA2= <user>
##$USERA3= <user>
##$USERA4= <user>
##$USERA5= <user>
##$V9= 5
##$VALIST= <valist>
##$VCLIST= <CCCCCCCCCCCCCCC>
##$VD= 0
##$VDLIST= <DDDDDDDDDDDDDDD>
##$VPLIST= <PPPPPPPPPPPPPPP>
##$VTLIST= <TTTTTTTTTTTTTTT>
##$WBST= 1024
##$WBSW= 4
##$XGAIN= (0..3)
0 0 0 0 
##$XL= 0
##$YL= 0
##$YMAX_a= 580118
##$YMIN_a= -655412
##$ZGOPTNS= <>
##$ZL1= 120
##$ZL2= 120
##$ZL3= 120
##$ZL4= 120
##$ABSF1= 10
##$ABSF2= 0
##$ABSG= 5
##$ABSL= 3
##$ALPHA= 0
##$AQORDER= 0
##$ASSFAC= 0
##$ASSFACI= 0
##$ASSFACX= 0
##$ASSWID= 0
##$AUNMP= <proc_1d>
##$AZFE= 0.1
##$AZFW= 0.1
##$BCFW= 1
##$BC_mod= 2
##$BYTORDP= 1
##$COROFFS= 0
##$CY= -3
##$DATMOD= 1
##$DC= 2
##$DFILT= <>
##$DTYPP= 0
##$F1P= 0
##$F2P= 0
##$FCOR= 0.5
##$FTSIZE= 0
##$FT_mod= 4
##$GAMMA= 1
##$GB= 0.15
##$INTBC= 1
##$INTSCL= 1
##$ISEN= 128
##$LB= 0.25
##$LEV0= 0
##$LPBIN= 0
##$MAXI= 10000
##$MC2= 0
##$MEAN= 0
##$ME_mod= 0
##$MI= 1.114404
##$NCOEF= 0
##$NC_proc= 0
##$NLEV= 6
##$NOISF1= 3.799351
##$NOISF2= 2.8
##$NSP= 1
##$NTH_PI= 0
##$NZP= 0
##$OFFSET= 14.38212
##$PC= 1
##$PHC0= -1549.097
##$PHC1= 8.992201
##$PH_mod= 1
##$PKNL= yes
##$PPARMOD= 0
##$PSCAL= 0
##$PSIGN= 0
##$REVERSE= no
##$SF= 200.129724274929
##$SI= 16384
##$SIGF1= 3
##$SIGF2= 2
##$SINO= 400
##$SIOLD= 16384
##$SREGLST= <1H.CDCl3>
##$SSB= 0
##$STSI= 0
##$STSR= 0
##$SW_p= 3205.1282051282
##$SYMM= 0
##$S_DEV= 0
##$TDeff= 0
##$TDoff= 0
##$TI= <>
##$TILT= no
##$TM1= 0
##$TM2= 0
##$TOPLEV= 0
##$USERP1= <user>
##$USERP2= <user>
##$USERP3= <user>
##$USERP4= <user>
##$USERP5= <user>
##$WDW= 1
##$XDIM= 8192
##$YMAX_p= 0
##$YMIN_p= 0
$$ End of Bruker specific parameters
$$ ---------------------------------
##NTUPLES= NMR FID
##VAR_NAME=  TIME,          FID/REAL,        FID/IMAG
##SYMBOL=    X,             R,               I
##VAR_TYPE=  INDEPENDENT,   DEPENDENT,       DEPENDENT
##VAR_FORM=  AFFN,          ASDF,            ASDF
##VAR_DIM=   8192,          8192,            8192
##UNITS=     SECONDS,       ARBITRARY UNITS, ARBITRARY UNITS
##FACTOR=    0.0002768,     1,               1
##FIRST=     0,             0,               0
##LAST=      2.2672688,     0,               0
##MIN=       0,             -655412,         0
##MAX=       2.2672688,     580118,          0
$$ Real data points
##PAGE= N=1
##DATA TABLE= (X++(R..R)), XYDATA
0@%%%%%%%%%%%%%qJ6j6J6j6K4l2L6m4N3o1P0q2R6j11J27j44J62j86K11k36K65
$$ 0 0 0 0 0 0 0 0 0 0 0 0 0 0 -8 8 -8 8 -8 16 -16 20 -24 29 -32 38 -44 52 -59 68 -76 86 -100 111 -125 140
35A40l00L38l75M18m67N18n74O36p02P75q57R46j041J146j262J389j532J691j866
$$ 140 -160 178 -197 221 -246 272 -302 334 -368 407 -450 496 -545 601 -661 728 -804 887 -979
54i79K065k291K549k851L205l628M141m783N615o728Q295j0662J4620k2376M2832
$$ -979 1086 -1205 1344 -1507 1698 -1930 2211 -2572 3043 -3685 4610 -6052 8568 -13808 29024
69B9024j92857m91579N53948N35858k81535m13415J30094K72626n0818j42979
$$ 29024 -163833 -655412 -101464 434394 152859 -260556 -130462 142164 91346 -51633
79e1633N1024p298r1236R6351J73130r7367k59743K4656L30237N4727l19365j12139
$$ -51633 -609 -7907 -99143 -2792 170338 72971 -186772 -162116 168121 222848 -96517 -208656
91b08656K14690J15579q0591q0094J781J3886J9642O9347p336j34610j795J58057
$$ -208656 6034 121613 41022 -39072 -37291 -23405 -3763 65584 58248 -76362 -78157 79900
103G9900J8636j43833m6538J03280M5715o9764O310N0785p7730m2751J18063M3726
$$ 79900 98536 -45297 -91835 11445 57160 -12604 -6294 44491 -33239 -75990 42073 85799
115H5799j20942o8646J02096J07276p1198j09253N6970Q3047n8485o5841O0522
$$ 85799 -35143 -103789 -1693 105583 34385 -74868 -17898 65149 6664 -59177 1345
126A345N8871p7928n1186J12135L7378j39902l0463J38090L9116j12280n7826
$$ 1345 60216 -17712 -68898 43237 80615 -59287 -89750 48340 87456 -24824 -82650
137h2650P8256N9588m8445l0282L4841J712k6367J4297K7293k1349m4949J9328
$$ -82650 -4394 55194 6749 -23533 11308 13020 -13347 950 28243 6894 -38055 -18727
149a8727N5981j9177n0864J8083L6511j2803k5312P519J5917j3152l813L4974
$$ -18727 37254 18077 -32787 -14704 21807 9004 -16308 -8789 7128 -6024 -9837 25137
161B5137l087n1344L759N3831n68m8854q5M1280q233l5951J9314L0887k8970k9254
$$ 25137 22050 -29294 -25535 28296 27728 -21126 -21211 20069 11836 -24115 -4801 26086 -2884 -32138
175c2138K9584L2401k2731l6213J6030L7537j1075l4796J0242K9618q674j9369
$$ -32138 -2554 29847 7116 -29097 -13067 24470 13395 -21401 -11159 18459 9785 -9584
187i584J2500O327k6627n109L8713J3268l9541j8408L0794J7924j7177j2826K683
$$ -9584 2916 9243 -17384 -22493 16220 29488 -10053 -28461 2333 20257 3080 -9746 -7063
200g063M798N161O231n579j9299K819L1728K695l6684j2619L0184K4622j6073
$$ -7063 -2265 2896 9127 3548 -15751 -12932 18796 21491 -15193 -27812 2372 26994 10921
213A0921k9165M667J9602o00j656L335j0857j0406J3226K0214j1938l3898J1396
$$ 10921 -18244 -13577 6025 5425 3769 7104 -3753 -14159 -933 19281 7343 -26555 -15159
226a5159M4039q956m2943j278L4252J3886k3359j7002J5875R847p340J75p80l734
$$ -15159 28880 19924 -23019 -24297 9955 23841 482 -16520 -645 9202 1862 2037 1257 -2477
240b477J539m55L635m54r231N936Q722p121m200P98K427O235l353k457O94n618
$$ -2477 -938 -1393 2242 1788 -7443 -1507 7215 94 -4106 -3308 -881 5354 2001 -456 238 -5380
256e380P449Q891j3167m269J1451K46q097m222Q343P749j5452m395J7375q48j1773
$$ -5380 2069 10960 -2207 -6476 4975 5221 -2876 -7098 1245 8994 -6458 -10853 6522 5674 -6099
271f099J467P265N545r325r687J4678P672j2180m533M768N632k787j0493Q085
$$ -6099 -4632 2633 8178 -1147 -10834 3844 11516 -664 -5197 -429 5203 2416 -8077 8
285HQ226j3316j744J0267j583l976k380L646O309o960l542P918j59J42j788p249
$$ 8 8234 -5082 -6826 3441 1858 -2118 -4498 -852 5457 -1503 -5045 2873 2714 2856 1068 -6181
301f181P757O353q998l083K362L079K401q554j052R396j109l266j051j089P042
$$ -6181 1576 7929 -1069 -4152 -1790 1289 3690 -4864 -5916 3480 2371 -895 -1946 -3035 4007
316D007j433p817P307K929q144N23N507K341n659p604R780O737j2045l103P192
$$ 4007 2574 -5243 2064 4993 -3151 -2628 2879 5220 -439 -8043 1737 8474 -3571 -6674 518
331E18K654j077o610l1J0149j934p163J591L131K524l443m475O681J446p469K342
$$ 518 3172 2095 -4515 -4546 5603 3669 -3494 -1903 1228 3752 309 -4166 2515 3961 -3508 -1166
347a166L106k042P5j496J758K527m676l87L088O57O21m705k118Q420P94p996L41
$$ -1166 1940 -102 -27 -1523 235 2762 -1914 -2301 787 1444 2065 -2640 -4758 3662 4456 -3540 -3199
364c199N080K022l395n010M755L780m344j067J176M18R66l003L21N035l508n383
$$ -3199 1881 3903 508 -4502 253 4033 -311 -1378 -202 216 1182 -1821 -1500 3535 27 -5356
380e356M468N417k713o577Q27Q698o37p679P59M589J300j841l692Q26M090j138
$$ -5356 -888 4529 1816 -4761 -3934 4764 4127 -3552 -2793 1796 3096 1255 -2437 -1611 2479 1341
396A341k966J066J973k321k901L433M866m181o529M097P072j135o889j813N977
$$ 1341 -1625 -559 1414 -907 -3808 -375 4491 310 -6219 -2122 4950 3815 -3074 -4887 1090
411A090M590l954m973J163M662N38l775j439K005n57j170L706J312o338l028P299
$$ 1090 5680 1726 -3247 -2084 2578 3116 -659 -2098 -93 -650 -1820 1886 3198 -3140 -6168 1131
427A131M953n027o301K748P137P45o652m583M705O751k364o753J230M646k984
$$ 1131 6084 1057 -5244 -2496 4641 5386 -1266 -5849 -1144 5607 3243 -3510 -2280 2366 -618
442f18r53L921j659n218J529O799J904p550n661N945Q475j051r381l948J0376
$$ -618 -1571 2350 691 -4527 -2998 3801 5705 -1845 -7506 -1561 6914 5863 -3518 -7466 2910
457B910N849r437n588M964M724j026l761q3K273k830L12M665q33m241j779L748
$$ 2910 8759 -678 -6266 -1302 3422 2396 -1365 -1448 825 -2005 -1693 2972 2139 -2102 -3881 -133
473a33O780l907r560K340Q545K060o852n308O250N208n766j944K590k105O4L237
$$ -133 6647 2740 -6820 -4480 4065 6125 -727 -6035 215 5423 -343 -2287 303 -1802 -1738 1499
489A499J409j475n361j214P680L111n944o194L652J1132k367j2569J478P628Q46
$$ 1499 2908 1433 -3928 -5142 2538 5649 -295 -6489 -2837 8295 5928 -6641 -5163 2465 3311
504C311k189k807K98L151j506j125J073j744q17J370M442K708r073o521R866P176
$$ 3311 1122 -1685 -1387 1764 258 -867 206 -1538 -2355 -985 3457 6165 -2908 -9429 437 7613
520G613n249p072M1Q279L336p658l611K321K273K231j057k053J70j531J682M310
$$ 7613 2364 -4708 -4667 3612 6948 -710 -4321 -2000 273 2504 1447 -606 -436 -1967 -285 4025
536D025m643n758L798P682J955r152n616Q318M871n079k585j18K733L558k688
$$ 4025 -618 -6376 -2578 5104 7059 -2093 -7709 609 5480 401 -2184 -2302 431 3989 1301
551A301k230l09j754K036L379M0k994m042L289P591m212p647J186N689M772k517
$$ 1301 -929 -1238 -2992 -956 2423 2463 -531 -4573 -1284 6307 2095 -5552 -4366 1323 6095 3578
567C578p857O78N417O67k679k241J859K809j816k81N97l588k39N383J384l742
$$ 3578 -4279 -3601 1816 2483 -196 -2437 -578 2231 415 134 731 -2857 -3096 2287 3671 -71
583g1m293J741P123o4p113k065L957M998m15n873k67K686l31M1J099j560j280
$$ -71 -4364 -2623 4500 4436 -2677 -4742 -785 4213 3798 -2075 -2342 344 13 54 1153 -407 -1687
600a687J106K833k77n341n57N156K257k139l748q23N085K012m483k263J669L219
$$ -1687 -581 2252 1975 -3366 -3923 1233 3490 1351 -2397 -3220 1865 3877 -606 -2869 -1200 2019
616B019Q87l117j618J317Q18K19q58m65J363p70l30J563j24k864j94K844K415
$$ 2019 2906 -211 -1829 -512 306 525 -333 -798 565 -205 -535 1028 904 -1960 -2154 690 3105
633C105j617l778R37L038n07k031J56J396R6j281L22O34q88j061J415J473j055
$$ 3105 1488 -2290 -1353 1685 1178 -853 -697 699 795 -486 -164 470 -418 -1479 -64 1409 354
650C54j928J038K669n08k928p24K173J779j24j738j370K26J831L16j560l10P79
$$ 354 -1574 -536 2133 1625 -1303 -2027 146 1925 1801 63 -1307 -1081 750 1066 -494 -804 -25
667b5L66j36n19j13m45P9J874N76k049j203J401K505j026l544Q72L418j79k549
$$ -25 341 205 -314 -427 -872 -793 1081 1657 -392 -1595 -194 2311 1285 -2259 -1387 2031 1852 -697
685f97q69J345J267j294q36J655K5j325N6R82M73j502p71K584O68k472o66J491
$$ -697 -1566 -221 1046 -248 -1084 571 596 -729 -673 309 782 -720 -1491 1093 1761 -711 -1377 114
703A14J285l53k058j58J830r8o33j34n0P93j117p76K028M26j559J55J10Q71n58
$$ 114 1399 1046 -1012 -1170 660 562 -71 -205 -255 538 -579 -1355 673 1099 -460 -305 -195 676 118
722A18j349J599J486j633q29J67N45Q62j882n78K410J63j695L80L77L67j152r63
$$ 118 -1231 368 1854 221 -608 -441 104 966 -916 -1494 916 1079 -616 -236 141 508 -644 -1607
740a607K392O37k101J37Q59L32m38j408P47K536j431j569L17J050M60j736n68
$$ -1607 785 1422 -679 -542 317 649 211 -1197 -450 2086 655 -914 -597 453 913 -823 -1391
757a391K644l76j784L38L08M87P3j377J218Q27j184j19N86L34Mj804M46K313j572
$$ -1391 1253 877 -907 -569 -261 226 299 -1078 140 967 -217 -336 250 584 588 -1216 -770 1543 -29
776b9q81P13N79R6j235o19K224J64j521M9J93O75M08j980O07K227j830m20O86
$$ -29 -910 -197 382 478 -757 -1376 848 1012 -509 -460 -267 408 816 -1164 -557 1670 -160 -580 106
795A06J96Q7r72K6J516p45j095O56L24N09p76q57J467O92j737k12J229N16m73
$$ 106 302 389 -583 -557 959 214 -881 -225 99 608 -168 -1025 442 1134 -603 -815 414 930 457
814D57j264O72J592j739o45Q34L05L9n85n02J353N9j360N79N45J57n41q99J326
$$ 457 -807 -135 1457 -282 -927 -93 212 251 -334 -836 517 576 -784 -205 340 497 -44 -943 383
833C83Q40j710j84J193J86l91j014K88J411o73j038K98P21J89p79n26J409K68
$$ 383 1223 -487 -671 522 708 317 -697 -409 1002 329 -709 -411 310 499 -280 -806 603 871
851H71j766L35J069L5j018l85J620K96j250n25Q45M88m80o48J9R01j68p67K95
$$ 871 -895 -560 509 544 -474 -859 761 1057 -193 -718 127 615 135 -513 -494 407 239 -528 -233
870b33N80k77n87J21R18m68p65O06Q39j98n42q47Q23Q59o91j045J35J731l92j266
$$ -233 347 70 -517 -396 522 54 -711 -105 734 536 -6 -853 -30 829 138 -907 -772 959 567 -699
890f99n2J218J16j106J35P90j54j004L71R98K3j068l73J114J044j486j264J501
$$ -699 -751 467 583 -523 -388 402 248 -756 -385 613 636 -432 -805 309 1353 -133 -1397 104
908A04J141r31j035L03R33l75n26O25j65k76j59O26K81n94p12N47Q51k96p23l05
$$ 104 1245 314 -721 -418 515 140 -386 239 74 -202 -361 265 546 -48 -760 -213 638 342 -381 -686
928f86P09J144j292n82O04K99J77l77l02M88O0o55L82L42k44m79j40J477J31k047
$$ -686 23 1167 -125 -707 -103 196 373 -4 -306 182 242 -413 -31 311 67 -412 -552 925 1056 -991
948i91k27K280N7j425o32P20J390r98r64Q38J26j16q8O0L18l46r11J256P35j538
$$ -991 -1218 1062 1119 -306 -938 -218 1172 174 -790 48 174 58 -30 30 348 2 -909 347 1082 -456
968d56k99Q00R03k10j543L31Q87j99k41k56j84P39j97m48N48k50n37P06J25r9
$$ -456 -755 45 948 738 -805 -474 413 214 -27 -283 -467 272 75 -373 175 -75 -612 94 219 120
988A20l05l63P30M31o76m85M4R23P31j339r15J173M27n45l74L8Q58l93n67Q28
$$ 120 -185 -548 182 613 -63 -548 -504 419 1150 -189 -1104 69 496 -49 -423 -385 473 80 -487 341
1008C41J11j301L33Q57M28n96r97P31J035q20o71K53M19N62p17l30O89l63m16
$$ 341 452 -849 -516 341 769 173 -824 -93 942 122 -549 -296 123 685 -32 -362 327 -36 -452
1027d52Q91k36m55N01k01M49o48m27K85O23m4M01r18k42R37l49j27m86kQ90k9
$$ -452 439 203 -252 249 48 497 -151 -578 -293 330 286 687 -231 -473 464 115 -12 -498 -500 390 361
1048C61p03N2M21k46R4k24N98K4r58N78O59q25m34M57N72J83p46o09R88J76p51
$$ 361 -342 -290 131 -115 -21 -245 353 377 -581 -3 656 -169 -603 -146 426 609 -137 -746 242 418 -333
1069c33Nj37M76K78n3j44k56l42L32K43J25j80k76M06J2n5j2k41l06O41K24m45
$$ -333 -328 -465 11 289 236 92 -164 -506 -174 69 194 14 -262 144 156 101 89 -152 -458 183 407 -38
1091c8j58K56P1l26l97L29O65k50k26n2j66L02k1M51M8q83j09O99J66m13n07N58
$$ -38 -196 60 131 -195 -592 -263 402 152 -74 -126 -292 10 -11 440 488 -395 -504 195 361 -52 -559 -1
1113aL96k83m12K19O1l3k85J59L27j18l4J29J76r1n84J02O20%m58k05L40P2k60
$$ -1 395 112 -300 -81 -20 -53 -338 -179 148 30 -4 125 301 210 -374 -272 348 348 -110 -315 25 97 -163
1136a63j27J07O22j10l03k86K33M58m35l6K91j52m39K1P23J2p71j19P49N1n27
$$ -163 -290 -183 439 329 26 -260 -27 431 -4 -40 251 99 -340 -319 404 416 -355 -474 275 326 -201
1157b01j2K35J50j76n42M73O34l26n18J19M78k1n88N02L08l16m12K82O4J7n5o35
$$ -201 -213 22 172 -4 -546 -73 561 235 -283 -164 314 293 -295 207 515 199 -213 69 133 150 95 -540
1179e40M02N67k76k38j1K98n3p48L96O58m81j34J58J51J4l16j71N47K37o93J41
$$ -540 -138 429 153 -85 -96 202 149 -599 -203 455 -26 -160 -2 149 163 -153 -324 223 460 -233 -92
1200i2L2L45m65l92M21R13r05k20L76Q8M2l69K43L18m99Q7K62Rj5n03%L65Q5m31
$$ -92 -60 285 -180 -572 -151 762 -143 -363 13 101 143 -226 17 335 -164 -77 185 194 179 -324 -324 41 126 -305
1224c05L99O0j91j96P6J14J61m05K30M21k98J64n43K1M67k6j61j94K93L41m89
$$ -305 94 154 -37 -233 -157 -43 118 -287 -57 364 66 230 -313 -292 175 149 -12 -206 87 428 -61
1245f1m42N20K58n10L24j03K32l18j88J27N65k58k01J13L13q2n07P4N99k13n04
$$ -61 -503 17 275 -235 89 -14 218 -100 -288 -161 404 146 -55 58 371 289 -218 -144 455 242 -262
1266b62kO96n39K0l86O29n3l39%M38K4j19m02K55M21m86l2K56p2J8j08j93K57
$$ -262 -264 432 -107 -87 -473 156 103 -236 -236 202 226 107 -295 -40 381 -105 -137 119 47 65 -43 -236 21
1289B1P3p6k45K00K25N3p65M66M56m25j82N30j03J88o19k4O78j35p54J35N25m0
$$ 21 94 18 -227 -27 198 251 -514 -48 408 -17 -199 331 228 416 -203 -227 451 316 -438 -303 222 182
1311A82n30p2M15L59o18O8M16k0k88l91N48Kj49j19L58Jj98J64k02K37j08k10
$$ 182 -348 -420 -5 354 -264 -196 220 200 -88 -479 69 71 -78 -197 161 162 -36 128 -74 163 55 -155
1333a55J35L23m5l97n3L30j26n1L8Q7m9j16k40J12L15k0l49L47K68k29k31N5K62
$$ -155 -20 303 258 -139 -192 138 12 -39 -1 86 37 -79 -319 -207 108 88 -261 86 354 125 -106 -51 211
1356B11j51m7j12L47J7n38m2M08oj94On1K57m1m8PK71j13m52L22R9p9j86j28K03
$$ 211 60 13 -99 248 265 -273 -315 93 87 -107 -101 -152 105 64 16 23 294 181 -271 51 150 71 -115 -243 -40
1381d0J67k38j23L70j07l13J92J01K22l23K01k78N15l32k36Q2L36j90k71J76K94
$$ -40 127 -111 -234 136 29 -284 -92 9 231 -92 109 -169 346 14 -222 -140 196 6 -265 -89 205
1402B05Q6k94j03L10o1r4j71J10L7l9o3K4Q3J00j90r1L41j97j87L31m0oj98R6
$$ 205 291 -3 -106 204 143 49 -122 -12 25 -14 -77 -53 30 130 -60 -151 190 -7 -194 137 97 91 -107 -11
1426a1L2L42l94j83L95j86J06jj57L42k56j57J09K13j26j63j20L22M1l68K83l4
$$ -11 21 363 -31 -214 181 -5 101 100 -57 285 29 -128 -19 194 68 -95 -215 107 148 -220 63 29
1448B9N2o19L04N42j10k68M3J47L5l41J25N1J90j87j86J21J58j48p0J05R1L3k31
$$ 29 81 -538 -234 308 198 -70 -27 120 155 -186 -61 -10 180 -7 -193 -72 86 -62 -132 -27 64 97 -134
1471a34k78M04J9K6k37n2J80J13j92L07j4k90n5lJ34L01m91L50k6r3j62M6R3J89
$$ -134 -412 -8 11 37 -200 -252 -72 41 -151 156 142 -148 -203 -206 -72 229 -262 88 62 -31 -193 -147 -54 135
1495A35j14p9K01j24l18K70q1K61o8k64L80m2k50r3K04j2j24j18K10j0J26j38
$$ 135 21 -58 143 19 -299 -29 -110 151 83 -181 199 157 -93 -186 18 6 -118 -236 -26 -36 90 -48
1517d8j0P8o3J7j41L9K90l60O1K68P8j68j55P8Q1Q7l37K03R3N5j21l9M1K01n53
$$ -48 -58 20 -43 -26 -167 -128 162 -198 -137 131 209 41 -114 -36 45 132 -205 -2 91 146 25 -14 27 228 -325
1542c25o3L68J57j69j13J54J10k50Q2L0J02j91j07R6L03j52k44K27L26j51k97
$$ -325 -388 -20 137 -32 -145 9 119 -131 -49 -19 83 -108 -215 -119 184 32 -212 15 341 190 -107
1563a07O4K94m3k49o2P6J25k44K4M5M40l83j48K71K01j19k44K5j5K9k01L96k56
$$ -107 -43 251 208 -41 -103 -27 98 -146 -122 -77 363 -20 -168 103 304 185 -59 -34 -49 -20 -221 175 -81
1586h1J75j80j84L88k3k02j13J3L90m60J65J27K19l73K10o1m6N5n4nK94l3l28
$$ -81 94 -86 -270 118 95 -107 -220 -207 183 -277 -112 15 234 -139 71 10 -36 19 -35 -40 254 221 -107
1609a07p9J99P6q6j4M7L3j82K27M3jl57M26k73K30k00j83J68J57nl45K30Q8j80
$$ -107 -186 13 89 3 -11 36 69 -113 114 157 156 -201 225 -48 182 -18 -201 -33 124 119 -226 4 92 -88
1633h8j67J79J85Rj26l3J20K4k86J33K4K75Jj29j30K47P1n67K0K71Lq2K06j18
$$ -88 -255 -76 109 118 -8 -41 79 103 -183 -50 -26 249 250 121 -9 238 309 -258 -238 33 36 -46 160 42
1657D2m9j20P3KK54j94J26j0k41J75k34M07ok19M3kJ92l00j56K31l9K5j36J02
$$ 42 -7 -127 -54 -52 202 8 134 124 -117 58 -176 231 225 6 49 47 239 -61 -217 14 -25 0 -136 -34
1681c4J52o0o9j77L70q4j57K7R1j88J92j35L2J81k10j25K92j3Q7k20m7L86k94
$$ -34 118 58 -11 -188 182 98 -59 -32 59 -129 63 -72 -40 141 -69 -194 98 85 172 -48 -95 291 -3
1704cJ43p3M8q9q7L9N8L8k09J44K15l3k32j20R7J63j02n9j02K33q0Jk32K77j12
$$ -3 140 67 115 26 -61 -22 36 74 -135 9 224 191 -41 -161 -64 99 -3 -62 -164 69 -11 -10 -242 35 -77
1729g7P5k2o4K2n5p9J86nP7k71K66m1l7qj25J69O3k01M4L21j87k22k02M09q3j6
$$ -77 -2 -24 -88 -66 -121 -200 -14 -19 58 -213 53 12 -25 -33 -158 11 74 -127 -83 238 51 -171 -373 36 -47 -63
1755f3n7J96j14K89n17K38M0r3K52j59pl5%J10Q8l45P4J63j14J9k72J82J47r2
$$ -63 -120 76 -38 251 -266 -28 12 -81 171 12 5 -30 -30 80 168 -177 -103 60 -54 -35 -307 -125 22 -70
1779g0J71j92j82L6K5P9J43J54k75jj6J53j16k6J52L52k42j5J32j75J42m19K77
$$ -70 101 -91 -273 -237 -212 -133 10 164 -111 -112 -128 25 -91 -117 35 387 145 130 262 87 229 -190 87
1802H7M6Nj82K8J9K05j48j51N4K57l17Q7j51L68j04l19L47q0r1o4q0J34po4M38
$$ 87 133 138 -44 -16 3 208 60 -91 -37 220 -97 -10 -161 207 103 -216 131 51 -40 -104 -184 -50 -57 -121 317
1827C17k05m3J6j35M3r8J39k05K24Q8k78J40Rj07K08k4j95K76k8l29nQ8K65j76
$$ 317 112 69 85 -50 -7 -105 34 -171 53 141 -137 3 12 -95 113 89 -106 170 142 -187 -192 -104 161 -15
1851a5J0K40k99J17j7j24k5P9K6rN2j3m9M7P2j18m9J01p7O0j05l6J06O6M8r1M7
$$ -15 -5 235 -64 53 36 -88 -113 -34 -8 -17 35 22 -27 20 92 -26 -75 26 -51 9 -96 -132 -26 40 88 -3 44
1878D4j73J21j23j06N02k71k36K20J99j26n1J09k3O9j60J61R8j79k68J21P2J36
$$ 44 -129 -8 -131 -237 265 -6 -242 -22 177 51 0 109 86 155 -5 156 254 75 -193 -72 0 136
1900A36k54J04J6k6J69k4j35j10J28j74J37l4O3O6j68j85K45J37j67j59L75k17
$$ 136 -118 -14 2 -24 145 121 -14 -124 4 -170 -33 -67 -4 62 -106 -291 -46 91 -76 -235 140 -77
1922g7J14Mk0j47Q6K63j32j2r6q6K05Pj60J38l38K56M0p5q8J16q6k0J90r5%J82
$$ -77 37 41 21 -126 -40 223 91 79 -17 -103 102 109 -51 87 -251 5 45 -30 -118 -2 -88 -108 82 -13 -13 169
1948A69j63PjM4j0M1P3o4j70L5K9J42j49k2J76J6l31L01m2r5p8%J42rj94Q9L8
$$ 169 6 13 12 56 46 87 160 96 -74 -39 -10 132 -17 -39 137 153 -178 123 81 -14 -92 -92 50 41 -153 -64 -26
1975b6J9K1j12L15O8k16l16J98PJ77P8l63J72l4L9J44K14m30RK4jq2P0R9J09l24
$$ -26 -7 14 -98 217 285 69 -247 -49 -42 135 213 -150 22 -12 27 171 385 -45 -36 -12 -13 -95 -25 74 183 -141
2001a41o9J79K77j30j17j69J97p6J03q8P0j62N1Q7k6pj62J54J47j51j33K66j46
$$ -141 -210 -31 246 116 -1 -170 27 -49 54 -34 36 -126 -75 12 -14 -21 -183 -29 118 -33 -166 100 -46
2024d6J7J26k0nk77J98n5Qrl0QM3RN9L3J32p7r1j21M2J43j39K51k93O5J70l73
$$ -46 -29 97 77 72 -205 -7 -62 -54 -63 -93 -85 -42 -33 26 59 191 114 23 -98 -56 87 -52 199 -94 -29 141 -232
2051b32J55L2M2O5k69L32p6j41J78j23k57K71K16k87J13l5p4O4k3J7J14k45L2
$$ -232 -77 -45 -3 62 -207 125 49 -92 86 -37 -294 -23 193 -94 19 -16 -90 -26 -49 -32 82 -163 -131
2074a31k1R2K7J57j43J23k16N7j18L61j80m5J51r6L2%j17J11j25J58k67K20j51
$$ -131 -152 -60 -33 124 -19 104 -112 -55 -173 188 8 -37 114 18 50 50 -67 44 -81 77 -190 30 -121
2097a21J83k02K0K87j51J9k33P1M8K38k49J34p0o9K2J3Q7J1J98j68K60j19j27
$$ -121 62 -140 -120 167 16 35 -198 -127 -79 159 -90 44 -26 -95 -73 -60 27 38 236 68 328 209 82
2120H2j35K63k15j34J38N9J23l00J46j27RN9p8J53M2m2O1J06j27k20J72R7k2k3
$$ 82 -53 210 -5 -139 -1 58 181 -119 27 -100 -91 -32 -110 43 85 43 104 210 83 -137 35 132 110 87
2144H7L5p8j5j90m9L50k9j14J21j16j00J45j85J08J37Q4k00j00J64j31K55k64
$$ 87 122 44 29 -161 -210 140 111 -3 118 2 -98 47 -138 -30 107 191 -9 -109 55 -76 179 -85
2166h5O0M0P3r4J62l15J00j18K96j2M3j50n5P1k48M02o1j13m1Q8J4o2jJ35k42
$$ -85 -25 15 88 -6 156 -159 -59 -177 119 107 150 0 -55 16 -232 170 109 -4 -45 43 57 -5 -6 129 -113
2191a13K95l21m7K46j34l2m7LpJ10J7k8J22k8j5K68k17P6n2k0%j02k7O5l2J8P6
$$ -113 182 -139 -186 60 -74 -106 -153 -150 -157 -47 -30 -58 64 36 21 289 72 148 96 76 76 -26 -53 12 -20 -2 74
2218G4k85K27R7L7j11j37J50n5l6J47q4O4K14j74j75m9J0J11k11L18N4k90j16
$$ 74 -211 16 113 150 39 -98 52 -3 -39 108 24 88 302 128 -47 -96 -86 25 -186 132 186 -104 -220
2241b20L2L52o9O7j54L6o0j91J57J55m7r4M8K06M3l17P1K86m30J26M3o7J38k05
$$ -220 -188 164 95 162 8 44 -16 -207 -50 105 58 -36 12 218 261 -56 15 301 -129 -3 40 -27 111 -94
2265i4L7Q6O6k99K67j86O6L8o3N0N1R1j99RkQ6loq9L2L01r7k85Q3r3K40R7j71
$$ -94 -57 29 95 -204 63 -123 -57 -19 -82 -32 19 110 -89 -80 -82 4 1 -5 -94 -62 239 142 -143 -60 -153 87 184 13
2293A3J66m58M12k5Q4j49j13J33O2j94%J29J77j50O5j28L4j27PJ21o7K20l40J93
$$ 13 179 -279 133 108 192 43 -70 63 125 -69 -69 60 237 87 152 24 58 -69 -62 59 -8 212 -128 65
2317F5k40J9J57l3P6k30J91K5J07q4q4J49r7J14r6N3k15J52j30K84j80j16l1K2
$$ 65 -175 -156 1 -32 44 -186 5 30 137 53 -31 118 21 135 39 92 -123 29 -101 183 3 -113 -144 -122
2341a22R9N0n2j4K1p5J09q1J8K04j24j63K54J40j33k20J09R2j76q1K07K08j27
$$ -122 -23 27 -25 -39 -18 -93 16 -65 -47 157 33 -130 124 264 131 -89 20 112 -64 -145 62 270 143
2364A43r4M3n3L9j28k14K49J31j15l8p8K88q3r9k4j34K12j5j70R7J48j18J03M5
$$ 143 49 92 39 78 -50 -264 -15 116 1 -37 -115 173 90 -9 -33 -167 45 30 -140 -43 105 -13 90 135
2388A35O7k64j50K43m0j9j00jJ98l2p3Ljm6M2n3L73k38pm1K3n3J01j34r7J61m8
$$ 135 202 -62 -212 31 -9 -28 -128 -129 69 37 -36 -33 -34 -80 -38 -91 282 44 37 -4 19 -34 67 -67 -164 -3 -51
2415e1r3mK24j27P2K9n5J91j99K25k19J11L1j65J52l1q5j83P7L32l91L6J44M1
$$ -51 -144 -148 76 -51 21 50 -5 186 -13 212 -7 104 135 -30 122 91 6 -177 -100 232 -159 -123 21 62
2439F2k0p3n4J26j34J50J12j48O7o2o5Q1P8L4k17K49j35M7K22k97J76Q1k83j90
$$ 62 42 -31 -85 41 -93 57 169 21 88 26 -39 42 120 154 -63 186 51 98 320 23 199 280 -3 -193
2463a93m1K52N5k50J56K1mP0l9k1r4L1J98j37J42j90J25J06k61J27nr2K64k02
$$ -193 -234 18 73 -177 -21 0 -4 66 27 6 -88 -57 141 4 146 -44 81 187 -74 53 48 -44 220 18
2487A8ML1l71M45j23rL5L7j7k91P1J97J07k29K05j77K87k91r3J99k3o6R4Nj54
$$ 18 22 53 -318 127 4 -5 30 67 50 -241 -170 27 134 -95 110 -67 220 -71 -164 35 12 -54 40 45 -109
2512a09O5K8j31J32O0lj87jJ71r1L09nn1N2j26l2o6o5K34k49M3p3jJ0J15J16q0
$$ -109 -44 -16 -147 -15 45 42 -145 -146 25 -66 243 238 187 239 113 81 15 -50 184 -65 -22 -95 -96 -86 29 145 65
2539F5J00l12J48kQ4j64K8N7J41k31K4K5MJ34j47j38K85j83P4k30K07J11N1j82
$$ 65 165 -147 1 -1 83 -81 -53 4 145 -86 -62 -37 -33 101 -46 -184 101 -82 -8 -238 -31 80 131 -51
2563e1J29k17K40q8J4L7Oq7J26M5p2p3Q5j25lj06J3O9k2l2P8P8O3K0j34j2J22
$$ -51 78 -139 101 13 27 64 70 -17 109 154 82 9 94 -31 -34 -140 -127 -58 -80 -112 -34 44 107 127 -7 -19 103
2590A03m5p6N9m2r1M2R1k5nR4j78J77k09J3J40O9j02p0J00Oj21J81k87O7N0M0
$$ 103 58 -18 41 -1 -92 -50 41 16 11 105 -73 104 -105 -92 48 117 15 -55 45 51 -70 111 -176 -109 -59 -19
2616a9J39k89P8J03K06j74j36l24L73K0J67k03K45l5j15j85J03R3%mJ05l15P8
$$ -19 120 -169 -91 12 218 44 -92 -416 -43 -23 144 -59 186 151 36 -149 -46 47 47 43 148 -167 -89
2639h9K3O3N0p2j47J58rQ2j78K81Jj1j84R8k1L0J44l78J58L8J94j56j51m8J29
$$ -89 -66 -3 47 -25 -172 -14 -23 59 -119 162 163 152 -32 66 45 75 219 -159 -1 37 231 75 -76 -124 5
2664EP5j97K01J9j70K12o3p8j71o8J86OL4k2J41k0m6j10Q8m9J01Pr5j19J49n7
$$ 5 80 -117 84 103 -67 145 82 4 -167 -235 -49 -43 -9 -31 110 90 44 -66 22 -27 74 81 -14 -133 16 -41
2690d1O9O6k84J38K11j22j98K39p4j55J00Q3j22J36Q9j38M2j91R0J10l7m3J16
$$ -41 28 94 -190 -52 159 37 -161 78 4 -151 -51 32 -90 46 135 -3 39 -152 -62 48 11 -32 84
2713H4k6P9q3L1l0O9k99O8J57j28K55pl66K77j61P7m6L2p0J10o7J29o1J40j26
$$ 84 58 137 54 85 55 124 -175 -107 50 -78 177 170 -196 81 -80 -3 -49 -17 -87 23 -44 85 24 164 38
2738C8j14J19M7P6k06J52j62K09p1j7j30ON2L0r7J57n1J3j77J48J41j83K9K10
$$ 38 -76 43 90 166 -40 112 -50 159 88 71 -59 -53 -1 29 -68 89 38 51 -126 22 163 -20 9 219
2762B19m02K00J66l59K99j89P6N4j0r3N3o4J7L1k8J30M4k78K45n3j43J64l10m1
$$ 219 -183 17 183 -176 123 -66 10 64 54 -39 14 -50 -33 -2 -30 100 144 -134 111 58 -85 79 -231 -272
2786b72K13K9j71J76l1K30M3l06K68l9j24kk07J45L2Q4j55J4N1m7N0n3N6J0P7
$$ -272 -59 -30 -201 -25 -56 174 217 -89 179 140 16 14 -193 -48 -16 68 -87 -73 -22 -69 -19 -72 -16 -6 71
2811G1J9rm8LMPR0k77lK61r9j04q0R5j1J11r2J07J36l28J71j37m7K18k22R5J88
$$ 71 90 81 33 36 40 47 137 -140 -143 118 19 -85 -165 -70 -81 30 -62 45 181 -147 24 -113 -160 58 -164 -69 119
2838A19o4j14MJ16k94K17K71l76q6M5J80J14j18rO4m0m2J8j31Q5J75n5q8MJ4j65
$$ 119 55 -59 -55 61 -233 -16 255 -121 -207 -162 18 132 14 5 69 29 -13 5 -126 -41 134 79 -9 -5 9 -156
2864a56K38m5J87k54P3p0k3J6r0K85j79N7r3O7m9J06j90J55k8j41K27o2k4j11
$$ -156 82 37 224 -30 43 -27 -50 -34 -124 161 -18 39 -54 13 -36 70 -120 35 7 -134 93 31 7 -104
2888a04M2j1k13J87J35Q5j16j46M3K5J44k78j1K42J95l45J39L5RR2k15R0oL1J17
$$ -104 -62 -73 -286 -99 36 121 5 -141 -98 -73 71 -207 -218 24 219 -126 13 48 57 149 -66 24 18 49 166
2913A66j46j25R6R0n6j35N5J33k00J54q2R4l9p4J7o7N1lJ2l0oJ34K15k07J63l14
$$ 166 20 -105 -9 81 25 -110 -55 78 -122 32 -50 44 5 -69 -52 -119 -68 -71 -59 -89 -95 39 254 47 210 -104
2939a04J15o7K22j9j4N5p8j9m3j4J02qk72K65j02J69k54k4R1J98j26rP8j42J50
$$ -104 11 -56 166 147 133 188 110 91 48 34 136 128 -144 121 19 188 -66 -90 1 199 73 64 142 0 150
2964A50l33j9K06N2O1j31Q3n3N5K4j79nK26j47%p6p1K89q0n9P0o3j29J11J06O7
$$ 150 -183 -202 4 56 117 -14 69 16 71 95 -84 -89 137 -10 -10 -86 -157 132 52 -7 63 0 -129 -18 88 155
2990A55k02k70M23k04O4J20j17J01j28P8j79K25j86L70j06j70J06j1j24O4L5j48
$$ 155 -47 -317 106 -98 -34 86 -31 70 -58 20 -159 66 -120 250 144 -26 80 69 -55 9 44 -104
3012a04j3L39j22L5J50k98m9p7oR7j33J33R9J10j5j88N7J65l9P7l06N5Q2j7n5
$$ -104 -117 222 100 135 285 -13 -62 -139 -145 -48 -181 -48 51 161 146 -42 15 180 141 218 -88 -33 49 32 -23
3037b3q1N4r7J65j61P1J16j65J35j12P7k2J11pj45o8J26Lo7k1P7Q7M3k03Nj07
$$ -23 -104 -50 -147 18 -143 -72 44 -121 14 -98 -21 -43 68 61 -84 -152 -26 -23 -90 -111 -34 53 96 -107 -102 -209
3063b09L49N8l38Q1r0L2r1o2J75O7j49J37J86j20J23j28k4O2n6N5p6J68k90O7
$$ -209 140 198 -140 -59 -149 -117 -208 -270 -95 -28 -177 -40 146 26 149 21 -3 59 3 58 -18 150 -140 -73
3087g3O5j12L44j77p3Q8m6j72J07K8J04j71K50j08q9J88j57m3P8J00l03J41n1
$$ -73 -8 -120 224 47 -26 62 16 -156 -49 -21 83 -88 162 54 -35 153 -4 -47 31 131 -172 -31 -82
3110h2P6K33l81K58MJ58k33J37o5J14j52j75J16j55R2q7J78Nn0p1q6K33J05m33
$$ -82 -6 227 -154 104 108 266 33 170 105 219 67 -108 8 -147 -55 -142 36 41 -9 -80 -166 67 172 -261
3134b61J20K77j94J18k5N3J09o9m6j39J32l2l65M10j6j00oM3m6j01K20k28K9J03
$$ -261 -141 136 -58 60 35 88 197 128 82 -57 75 43 -322 88 72 -28 -34 9 -37 -138 82 -146 -117 -14
3158a4O0p3J42r0J0j23nP7J24o1Qj22J55k63M75k37j73M9J2K22k35N2kJ44k5j12
$$ -14 46 -27 115 25 35 -88 -93 -16 108 47 55 -67 88 -175 300 63 -110 -61 -49 173 -62 -10 -12 132 107 -5
3184ej86K25PQn6k7J30q0NN0k14j0K65k71K20Rj37j54K26R7J1k61K5o8L07m1Q9
$$ -5 -191 34 41 49 -7 -34 96 16 21 71 -143 -153 112 -159 61 70 -67 -221 5 102 113 -148 -123 -191 116 75 164
3211A64l05J2J12o6J77j07r5J18j93Q9J09k3L3j2Q2j96J14K9j0j08J48r3J48k88
$$ 164 -141 -129 -17 -83 94 -13 -108 10 -183 -94 15 -8 25 13 95 -101 13 42 32 -76 72 -21 127 -161
3235a61N8J41%k1j28K49L0p2Q5j68p2K99k07p9N7N3P8p0j26Q0J4O7j70J30n2j70
$$ -161 -103 38 38 17 -111 138 168 96 181 13 -59 240 33 -46 11 64 142 72 -54 26 40 107 -63 67 15 -155
3261a55J35J39k57J3K17k69L71j24j04J47n7k7J02Q4m56J32K70j07kK7j46j71
$$ -155 -20 119 -138 -125 92 -177 194 70 -34 113 56 29 131 215 -241 -109 161 54 52 79 -67 -238
3283b38L10k5j05l1j13M49l59J32m8J89k63J47q6J21Oq5P9j29N2Q7K7o4J39k19
$$ -238 72 47 -58 -89 -202 247 -112 20 -28 161 -102 45 -41 80 86 1 80 -49 3 90 117 53 192 -27
3307b7j31M6K42j71P7rl0r0j07J41M6J49rj72J34j3o9m0N2k5q9p4J19L30k64J66
$$ -27 -158 -112 130 -41 36 27 -3 -93 -200 -59 -13 136 127 -45 89 76 7 -33 19 -6 -95 -169 -50 280 16 182
3333A82k86J34l7J26j47O6r1J66j73L2m0J22k33l6K13k46K57j36k3k9L08k09j
$$ 182 -104 30 -7 119 -28 38 -53 113 -60 -28 -68 54 -179 -215 -2 -248 9 -127 -150 -179 129 -80 -81
3356h1M7P0q3J84j49O6P1n3R8k33J02J42j11rj09m4J23N8k03O4o4j21K88l3j9
$$ -81 -34 36 -47 137 -12 54 125 72 170 -63 39 181 70 61 -48 -92 31 89 -114 -50 -114 -235 53 20 1
3381AQ7k56J58J27j62j53J58j34K30j85J77Q8k22q0J02J87j00K7m7OM1k7K8n5
$$ 1 88 -168 -10 117 -45 -198 -40 -174 56 -129 48 136 -86 -166 -64 123 23 50 3 9 50 23 51 -4
3405dK45m16J85k4K30l95K70J89l07O0kJ26j06l4j24J90j43M0Mo5J35p0q4J56
$$ -4 241 -175 10 -14 216 -179 91 280 -27 33 31 157 51 17 -107 83 -60 -20 -16 -81 54 -16 -100 56
3429E6j2lo0j01K38J70l20j65J27m8K70j49l9J16j56L2K41k28L3k42K57j8j34
$$ 56 44 41 -19 -120 118 288 -32 -197 -70 -118 152 3 -36 80 -76 -44 197 -31 2 -240 17 -1 -135
3452a35J76k59J99L2r5nL49l31J89k26Q4M7Lr2J65k49K33ol01J47Q7l12K80r1
$$ -135 41 -218 -19 13 -82 -87 262 -69 120 -106 -22 25 28 -64 101 -148 85 79 -222 -75 12 -300 -20 -111
3476a11k4OJ44j61J12j54J84M6J21j65l3M9J15j80J38L0k7m9R2l75L12Pr5j1r3
$$ -111 -135 -129 15 -146 -34 -188 -4 42 163 -2 -35 14 129 -51 87 117 90 41 133 -242 70 77 -18 -29 -122
3501a22J26J93k13j8KO3J1QR9l9M6j58r2L3k36K82M6k3j21K93k75J71o4j43K75
$$ -122 4 197 -16 -34 -32 31 42 50 149 110 156 -2 -94 -61 -297 -15 31 8 -113 180 -95 76 12 -131 144
3526A44k38J55m5Q9J12k19J37j8k07R3K28l40MK9l4J92k15K2K3o8l1L79l01j9
$$ 144 -94 61 16 105 217 -2 135 117 -90 3 231 -109 -105 -76 -110 82 -133 -111 -88 -156 -187 192 -109 -128
3550a28N6O6j09K82n4k35K07n3L4j84O0N1j87Lpl0J53R3K97k77j6k07K48K7l07
$$ -128 -72 -6 -115 167 113 -122 85 32 66 -118 -58 -7 -194 -191 -198 -228 -75 18 315 38 22 -185 63 90 -217
3575b17L13L6N6k17P8j99J56l0mk9M4J15Kj6l3K46l39l5j72K77o6m5P0J09n8j70
$$ -217 96 132 188 -29 49 -150 6 -24 -28 -57 -13 102 104 88 55 301 -38 -73 -245 32 -34 -79 -9 100 42 -128
3601a28Q1Q2r1J84j57k12O6K9J73J24j62j66K24j51L5K91k74R0o8Q1L0l00J75
$$ -128 -47 35 -56 128 -29 -241 -175 -146 27 151 -11 -177 47 -104 -69 222 -52 38 -30 51 81 -219 -44
3624d4N6r0j6K96k27j31J87Q0k30J54j72K66j26O6j72K30k01LJ29k1L1o2j19M5
$$ -44 12 -78 -94 202 -25 -156 31 111 -119 35 -137 129 3 69 -103 127 -74 -71 58 37 68 6 -113 -68
3648f8j26L50j59p9J11k03J49K56k19k12R8lq8J72Q8J0j00oJ25j98P1J4rj29J61
$$ -68 -194 156 -3 -82 29 -174 -25 231 12 -200 -102 -105 -193 -21 67 77 -23 -29 96 -102 -31 -17 -26 -155 6
3673Fm5L25n6j09n5l9R5J64k03r9Ok4j36J66j04J2J83q4ql2J01K6j22P0j56J50
$$ 6 -39 286 230 121 66 27 122 286 83 -16 -10 -34 -170 -4 -108 -96 87 3 -5 -37 64 90 -32 38 -118 32
3699C2j7j39K06k47J63l17L03l5j51N3J93J12r0K6j77J02j23J44r5j9K4p9R9K19
$$ 32 15 -124 82 -165 -2 -319 -16 -51 -202 -149 44 156 66 92 -85 17 -106 38 -57 -76 -52 -131 -32 187
3723A87j97R5N6j88j5K23r6pk57K45N2j87kM9l5j6L1n9K03q3o9J78j06o2P5Q8
$$ 187 -10 85 141 -47 -62 161 65 58 -199 46 98 -89 -91 -42 -77 -93 -62 -121 82 -1 -70 108 2 -60 15 103
3749A03p7J06j42p6L4J25k1R1k48K11L0j78Q8J19l28J10M8K37j99o7J15k39P0
$$ 103 26 132 -10 -86 -52 73 52 143 -105 106 136 -42 46 165 -163 -53 -5 232 33 -34 81 -158 -88
3772h8P0J4Mr7j5J52Q5j56q7o1Q4q9R3K4K01l43J89R8j80J18J83j06M4K4Q6k33
$$ -88 -18 -4 0 -97 -112 40 125 -31 -118 -179 -95 -184 -91 -67 134 -209 -20 78 -102 16 199 93 137 161 247 14
3798A4j13J81k40J15J90k73J97k2J82k84j1oo9O9M5j2k2K29j57k49J26K70j91
$$ 14 -99 82 -158 -43 147 -126 71 49 231 -53 -64 -70 -139 -70 -25 -37 -59 170 13 -236 -110 160 -31
3821c1R4o2k56L08o9n7N2p5L53l43L3R3k40L00j33Q9R4j20M0j18N1j70O4O6J0
$$ -31 63 1 -255 53 -16 -73 -21 -96 257 -86 -53 40 -200 100 -33 56 150 30 70 -48 3 -167 -103 -37 -27
3846b7p9PO3LJ27l2k94K42j34K39j31P3m3R6j27o9p6R9pq4J87RR9o0j13k04j1
$$ -27 -106 -99 -36 -33 94 62 -232 10 -124 115 -16 57 14 110 -17 -86 -162 -63 -70 -154 33 42 141 81 -32 -236 -247
3873b47M08j64m9K38j40j29J4k2Rp2R5J15ol4Jj59P2j24R9j14M57l44J09J19m6
$$ -247 161 -3 -52 186 46 -83 -69 -91 -82 -154 -59 56 50 16 17 -142 -70 -194 -95 -209 248 -96 13 132 86
3898H6m4r3n3K63j68j47k7M87k81J09k23Oq2R2K79r1p3k59L10J00j51k8m5M4J01
$$ 86 42 -51 -104 159 -9 -156 -183 304 23 132 -91 -85 -167 -75 204 113 40 -219 91 191 40 12 -33 11 112
3923A12n9r3R6k53J42J9J34m5oL2o1m8K82l53J06N5l11L88l11K77r9m1L8Lj3l7
$$ 112 53 -40 56 -197 -55 -36 98 53 47 79 18 -30 252 -101 5 60 -251 137 -174 103 4 -37 1 4 -9 -46
3949d6r0L24j82K6j93J17J50k75J79l2L9K9k61K99J17p9j67J36n4o1k04L35J24
$$ -46 -136 188 6 32 -161 -44 106 -169 10 -22 17 46 -215 84 201 122 -45 91 37 -24 -228 107 231
3972B31k04J30j96J01O1jl14K77j76J82j63J09j69M43l77m9J16j12J78j83J4J71
$$ 231 27 157 -39 62 123 122 -192 85 -91 91 -72 37 -132 311 -66 -115 1 -111 67 -116 -102 69
3994F9J9j44P6N8q1J22j36p2J11k6J08n6n6N8m69L96p6J65J10j06k2Pk67K98q0
$$ 69 88 -56 20 78 -3 119 -17 -89 22 -4 104 48 -8 50 -419 -23 -99 66 176 70 48 55 -212 86 6
4019FP3j84K77r7k55J78M1j90J14Q6n4N7J21k49P3J13j38K1k9J70j27n9K71j76
$$ 6 79 -105 172 75 -180 -2 39 -151 -37 49 -5 52 173 -76 -3 110 -28 -7 -36 134 7 -52 219 43
4043D3r4J88r5n8p9R2J03O5j79P2l7Mj44j12M29j14O7j88K13p6o0l4j4j35K04
$$ 43 -51 137 42 -16 -95 -3 100 165 -14 58 21 25 -119 -231 198 84 151 -37 176 100 40 6 -8 -143 61
4068F1j29L9l7L3qK31o3r2M5k20J14m0J61k06K6M2R6j44J64l9J93j68L2p0J27
$$ 61 -68 -29 -66 -33 -41 190 127 35 80 -140 -26 -66 95 -111 -85 -43 53 -91 73 34 227 59 91 21 148
4093A48k65J08p3J57j73J48k42K39j38J58j48K14j17j86J56p7J83k07K04j38J80
$$ 148 -117 -9 -82 75 -98 50 -192 47 -91 67 -81 133 16 -170 -14 -91 92 -115 89 -49 131
4114A31l01J36N0mnJ49k53K95k80J67j87J76m0j16K10oj05R3o0k1r2J63n4n8j76
$$ 131 -170 -34 16 12 7 156 -97 198 -82 85 -102 74 34 -82 128 122 17 110 50 29 -63 100 46 -12 -188
4139a88R1J5N9K1j17K8P5J63J22l32J05j9n7o7j0R4J7m1l4J40L5pj7p8p3p6P4
$$ -188 -97 -82 -23 -2 -119 -91 -16 147 269 -63 42 23 -34 -101 -111 -17 0 -41 -75 65 100 93 76 -2 -75 -151 -77
4166g7K15j5m8Q9k19J58m1j5j92K1L08j74k2KM8r7O8l9M1p1j2R6J2o3P4L8j65
$$ -77 138 123 75 164 -55 103 62 47 -145 -124 184 10 -12 -10 38 -59 9 -30 11 -60 -72 24 36 -27 47 85 -80
4193h0K13R3l56J61L6K17n07J34k5J02l1J77j12J02q8k33J72jj00J86K6m9p2J90
$$ -80 133 226 -130 31 67 284 -223 -89 -114 -12 -43 134 22 124 36 -197 -25 -26 -126 60 86 37 -35 155
4217A55J9r3r6n3J63l19J47J8J40j86J22K51j93J11j37O0j04J15L2k04rn6J69
$$ 155 174 81 -15 -68 95 -224 -77 -59 81 -105 17 268 75 186 49 109 5 120 152 -52 -61 -117 52
4240E2j62J04J8J51k36l6Q7j49L25k89k5K62M7j10jo5K59k93J0j06K11j03J49
$$ 52 -110 -6 12 163 -73 -109 -22 -171 154 -135 -160 102 149 39 38 -27 232 -61 -51 -157 54 -49 100
4263A00k78K01J54n27L42mn3R0r4K32p3K7j12M6J53l59J03j62L44k80K27q0Q3
$$ 100 -178 23 177 -350 -8 -12 -65 25 -69 163 90 117 5 51 204 -155 -52 -214 130 -150 77 -3 80
4286H0n6r9j15L63j19J2pl4m8j04K66l53M56l68K1kK77j39j15J05r6J38l01J88
$$ 80 24 -75 -190 173 54 66 59 25 -23 -127 139 -214 242 -126 -105 -107 170 31 -84 21 -75 63 -238 -50
4310e0j01L07j47j81J80M4o8j55KK11l4n7k5N8j09K20q3P7n1Jk5n9rJ2Q8p0o0
$$ -50 -151 156 9 -172 8 52 -16 -171 -169 42 8 -49 -74 -16 -125 95 12 89 38 39 14 -45 -54 -42 46 -24 -84
4337h4rJ04l0J6M5jJ50k82j6N2J63j40L8J56j62j84M15k52MP9J91l24o9jJ49j1
$$ -84 -93 11 -19 -3 42 41 191 -91 -107 -55 108 -32 6 162 0 -184 231 -21 -17 62 253 -71 -140 -141 8 -3
4363cNr0R7j33K36j58M4k9J03M4k59O18n83J71M8o9O1J62k48nM2K2mj11K25k53
$$ -3 2 -88 9 -124 112 -46 -2 -31 72 116 -143 475 -108 63 111 42 103 265 17 12 54 76 72 -39 186 -67
4389f7P6r6j61N12q5k24K9Q0j6p4j04J86Q7l2k40K50J1q9k14J49J95j03j87J56
$$ -67 9 -87 -248 264 179 -45 -16 64 48 -26 -130 56 143 111 -129 121 132 43 -171 -22 173 70 -117 39
4413C9O5l98J22J28m3O0J73Jp2l70M30k39Q1J23o2r6J25k14K73k25J56j44P0M8
$$ 39 104 -294 -172 -44 -87 -27 146 147 75 -295 135 -104 -23 100 38 -58 67 -147 126 -99 57 -87 -17 31
4437C1Q5k26j51L61k80J99j28J41j29j96K64K62j30K8j02K8q4J07J45o6k90J58
$$ 31 116 -110 -261 100 -180 19 -109 32 -97 -293 -29 233 103 131 29 57 -27 80 225 159 -131 27
4459B7q2m2J20%Q2k25O0p9K47k76M2J51k54M24m5r4j16j32L69l18L40k09Q2M3
$$ 27 -55 -97 23 23 105 -120 -60 -139 108 -168 -126 25 -229 195 150 56 -60 -192 177 -141 199 -10 72 115
4483A15mQr5k53J40J89q2j31N9N4j15m5L4J30J17j16Q8j08Q6k76K63j03NJ12O4
$$ 115 111 119 24 -229 -89 100 18 -113 -54 0 -115 -160 -126 4 121 5 93 -15 71 -205 58 -45 -40 72 136
4508A36j58L7o8l7J53l16M60j08q5O8p9L0J33k32r7J85q5j0o5J54J71l04J84j96
$$ 136 -22 15 -53 -90 63 -253 207 99 14 82 3 33 166 -66 -163 22 -63 -73 -138 16 187 -117 67 -129
4532a29J75J49k51j4O4J56m31J20J95j2P0l14K93L4k22J25k55mM67k17k5J89j02
$$ -129 46 195 -56 -70 -6 150 -281 -161 34 22 92 -222 71 105 -117 8 -247 -251 216 -1 -26 163 61
4555F1J54r7K5j26l3O0r1J46j13QQ7p5k4R8M6k01r0L81k08P5j88M2L6j17J26J28
$$ 61 215 118 143 17 -16 44 -47 99 -14 -6 81 6 -18 80 126 -75 -165 216 8 83 -105 -63 -27 -144 -18 110
4581A10k11LK5OM8k4L3rq8k6J43P4K38l54m3J21j37O0P8k38K65n3j84J21l9j20
$$ 110 -101 -98 -73 -67 -19 -43 -10 -19 -107 -133 10 84 322 -32 -75 46 -91 -31 47 -191 74 21 -163 -42 -81 -201
4607b01K04N7k7j5j3j66K65j33p8K00j00p0N9J53k9j04l5P9k6O8L6j97J4j68J10
$$ -201 3 60 33 18 5 -161 104 -29 -107 93 -7 -77 -18 135 106 2 -33 46 20 88 124 -73 -59 -227 -117
4632a17J09p3M7n0%Q3J70j93j4j16K01j96M40j57k67J74p9J38J5k54J50M9k7K0
$$ -117 -8 -81 -34 -84 -84 -1 169 -24 -38 -154 47 -149 291 134 -133 41 -38 100 115 -139 11 60 33 53
4656E3j85J46Q8l19K30j7O3k16K24j43l2J40k42K34q1nJ93r2j05K22j10j13K1
$$ 53 -132 14 102 -217 13 -4 59 -157 67 -76 -108 32 -210 24 -57 -62 131 39 -66 156 46 -67 -46
4679d6P5L2jj43Q1J61j55rr7J84j50j44J58j03K22k99K73k75K80r8P7M1K2j10
$$ -46 29 61 60 -83 -2 159 4 -5 -102 82 -68 -212 -54 -157 65 -234 39 -236 44 -54 23 64 86 -24
4703b4J95k74m4Q7NJ8l3KO5j89J15K07l2j37P3r4J01M7j32K7N7K1m7M0k28Q8j3
$$ -24 171 -103 -147 -60 -55 -37 -70 -68 -3 -192 -77 130 98 -39 34 -60 41 88 -44 -17 40 61 14 54 -174 -86 -99
4730i9K69P5j66k52K00j93J81J4n8k0jq1R4O5J1j24j56K32N5j34J85J8k71JP3
$$ -99 170 245 79 -173 27 -166 15 29 -29 -49 -50 -131 -37 28 39 -85 -241 -9 46 -88 97 115 -156 -155 -82
4755h2j62J70p0MJ00Pn0Q4O4k71Q9R3l0J16r1j46J00R8K80l85j22K52o3K36k68
$$ -82 -244 -74 -144 -140 -40 -33 -83 1 65 -206 -117 -24 -54 62 -29 -175 -75 23 303 -82 -204 48 -15 221 -47
4780d7NK60j68m9k39N40k71j04O0Q3P6j17j85K81q5j32J06j18J86r6r3J33o2O6
$$ -47 -42 218 50 1 -238 302 31 -73 -13 70 146 29 -156 125 40 -92 14 -104 82 -14 -107 26 -36 30
4804C0m9o3m6L3Q7M8o9j71M33m05L52k8j56q1rJ30P1M5k88O7o3M9L35j76o2J65
$$ 30 -19 -82 -128 -95 -8 40 -29 -200 233 -172 180 152 -4 -85 -94 36 107 152 -136 -69 -132 -83 252 76 14 179
4830A79r5k48J50j25J07K50l17K9J62l16J71P5j10J21k90N8J12L5P6J38j89Q1
$$ 179 84 -164 -14 -139 -32 218 -99 -70 92 -224 -53 22 -88 33 -257 -199 -87 -52 24 162 -27 54
4852E4R1lk30J59J0K8k89K35j39oK38n7M8k40K89k08j9K62l53LJ2J46O8m4J1o1
$$ 54 145 142 -88 71 81 109 -180 55 -84 -90 148 91 139 -101 188 -20 -39 223 -130 -127 -115 31 99 55 66 5
4878EK9j12K58j40m7o7J37j30j36J88O7j99J82j17J89r1P6n1m8J63j61j0M0K70
$$ 5 34 -78 180 40 -7 -74 63 -67 -203 -15 52 -147 35 -82 107 16 92 41 -7 156 -5 -15 25 295
4902B95l44P7l79K9M46r6q2J2J24j66J49J5q0J30k51K31N3k14j01R5M9j23jO2
$$ 295 -49 28 -351 -322 124 28 -54 -42 82 -84 65 80 0 130 -121 110 163 -51 -152 -57 -8 -131 -132 -70
4926g0J22Q3j38Rl7q6P3J38j8k2k8j04R8Q5j17m2K01k07k1J32j12P7j33J23J12
$$ -70 52 135 -3 6 -31 -117 -44 94 76 54 26 -78 20 105 -12 -54 147 -60 -81 51 -61 16 -117 6 118
4951A18r2j14L08l80K08j77K10r8J7J58l33L09k18K05q1j10Q0k29L11k5j53J22
$$ 118 26 -88 220 -160 48 -129 81 -17 0 158 -175 134 -84 121 40 -70 10 -219 92 67 -86 36
4973C6j51K29k09J11N1k28JJ66o4O0j03K21J56q6j74l2o2Mn8L21j45j29m4K26
$$ 36 -115 114 -95 16 67 -161 -160 6 -58 2 -101 120 276 190 16 -16 -78 -74 -132 189 44 -85 -129 97
4997I7p4j13r3K07j31J20n8J71k18M1J93k09J45j52J94j34j22J69j10Q3M7j79
$$ 97 23 -90 -183 24 -107 13 -45 126 -92 -51 142 -67 78 -74 120 -14 -136 33 -77 6 53 -126
5019a26K84k10M7J27o1o5K63k45O6q7kPj02J03j45K30Nj86j51J90J49r2ko9J77
$$ -126 158 -52 -5 122 61 -4 259 14 80 -7 -9 -2 -104 -1 -146 84 89 -97 -248 -58 91 -1 -3 -72 105
5044A05j17J61k06J13J19k90J10J53j55J04o1p9P6o5L0j21K80k72K11k23J71K28
$$ 105 -12 149 -57 56 175 -115 -5 148 -7 97 36 -43 33 -32 -2 -123 157 -115 96 -127 44 272
5066B72j45k47Q4l8N1O2j4J62j23o2m3LL3j40j44J01J34j07J90n5Q6j56J66p8
$$ 272 127 -120 -36 -74 -23 39 25 187 64 2 -41 -38 -5 -145 -289 -188 -54 -161 29 -26 60 -96 70 -8
5090hq9K08q9K18l79J72j60L17m6k0o4P1j80K30r4l0J08l8j00k5j35J75k30K53
$$ -8 -97 111 22 240 -139 33 -127 190 144 124 60 131 -49 181 87 57 165 127 27 2 -133 42 -188 65
5114F5q5n7m1L59k14l0K66l23j07J20m1K4J15o1k5JK00j68n3L5j61R7J46j72R3
$$ 65 -20 -77 -118 241 27 -3 263 -60 -167 -47 -88 -64 51 -10 -35 -34 166 -2 -55 -20 -181 -84 62 -110 -17
5139a7j01K45J7j92J89J03k71J44k66k33K69O6j1J15j91J79o9j50K29N7l39K64
$$ -17 -118 127 144 -48 141 244 -27 117 -149 -382 -113 -47 -58 57 -134 45 -24 -174 55 112 -227 37
5161C7n8J9J35r2l7j47L7P7Q4K9l59K82J11j45OJ23Nkl33J84J95k58R0l7K19k18
$$ 37 -21 -2 133 41 4 -143 -106 -29 55 84 -275 7 118 -27 -21 102 107 105 -228 -44 151 -107 -17 -54 165 -53
5187e3K84l97K18j2n1oJ83k51l5O4pJ82k08R1j33J79k46J28J56k3j43J28l3J9
$$ -53 231 -166 52 40 -11 -17 166 -85 -120 -56 -63 119 -89 2 -131 48 -198 -70 86 63 -80 48 15 34
5211C4L09m40M9J05j42J47j77J84j52M9K3j17n3J04P1J8R7n9l1J2Q3P8l01K45
$$ 34 343 -97 -48 57 -85 62 -115 69 -83 -34 -11 -128 -181 -77 -6 12 109 50 19 31 114 192 -109 136
5235A36j65J40r4L5l93J87L9N4J92j77J74j75N2n7K6k1K6M7O6j5k05K4j37M43
$$ 136 -29 111 17 52 -341 -154 -115 -61 131 -46 128 -47 5 -52 -26 -47 -21 26 92 77 -128 -104 -241 202
5259B02j02q1J2l1N4j26n3k0j14L16k85O1J98j09J15k84J82j36m3M6J18L7J53
$$ 202 100 19 31 0 54 -72 -125 -145 -259 57 -228 -167 31 -78 37 -247 -65 -201 -244 -198 -80 -43 110
5282A10M7k43j2k1J05N0k49R0P4%P9k66J96J9o0N8k36L22j13K05qk71P8O8j56
$$ 110 157 -86 -98 -119 -14 36 -213 -123 -49 -49 30 -236 -40 -21 -81 -23 -259 63 -50 155 147 -124 -46 22 -134
5307a34O6OK52j11j84L0l4J77o7K8k19K79j30J24K3J26l05Q3OJ21q7J40k07J33
$$ -134 -68 -62 190 79 -105 -75 -109 68 1 29 -190 89 -41 83 106 232 -73 10 16 137 50 190 -17 116
5331A16J24k24J12j41j56Q5K88j47j49J8N1j01K28r6o8O0M8n3o8J35l15M17l48
$$ 116 240 16 128 -13 -169 -84 204 57 -92 -74 -23 -124 104 8 -60 0 48 -5 -73 62 -253 164 -184
5354a84K56K1J2j95K38N3j58j93JJ62j43L2J73P5k74m6K43K7k22J10J41j72J65
$$ -184 72 93 105 -90 148 201 43 -150 -149 13 -130 -98 75 150 -124 -170 73 100 -122 -12 129 -43 122
5377A22k20L34j31k11J01Q1o4j79K22p5m3J01lj19J69J06k87mj19K47j91L09k21
$$ 122 -98 236 105 -106 -5 76 12 -167 55 -20 -63 38 35 -84 85 191 -96 -100 -219 28 -163 146 -75
5400g5J49Q5j84K9%J50k10o1N7M4J94j35n1k19L44J09m39N5l0R8J05j29M7oQQ
$$ -75 74 159 -25 4 4 154 -56 -117 -60 -16 178 43 -8 -227 117 226 -213 -158 -188 -90 15 -114 -67 -73 -65 -57
5426e7j23K55J2pj03L4J09n0p3N0k40K21m6M7k6J45k87k83M31j1Oj91J83j3j54
$$ -57 -180 75 87 80 -23 11 120 70 -3 47 -193 28 -18 29 3 148 -139 -422 9 -2 4 -187 -4 -17 -171
5451a71L27kj44r8o3J16N0P8j89P1J19J81m69L4J7J06K6q4J60L5K03j26k73P6
$$ -171 156 154 10 -88 -151 -35 15 93 -96 -25 94 275 -194 -160 -143 -37 -11 -95 65 100 303 177 -96 -20
5475b0k00L01m0o8j85J91J07q6j0M0K5k23J26J27k7j23J90k2l25K47l1O8n3Q7
$$ -20 -220 81 41 -27 -212 -21 86 0 -10 30 55 -168 -42 85 58 -65 125 103 -222 25 -6 62 9 96
5499I6o3O8Q2l46L79k14J71l28L73k94L21m52K01k9J90O8l58J51k39K69k55L40
$$ 96 33 101 183 -163 216 2 173 -155 218 -76 245 -207 -6 -35 155 223 -135 16 -223 46 -209 131
5521A31j83K20j30p4Q0nj19J81l43K22j16K20j40J54m9R5l75K52J62j60PRp7k
$$ 131 -52 168 38 -36 44 39 -80 101 -242 -20 -136 84 -56 98 49 144 -231 21 183 23 30 39 -38 -40
5545d0J91k36Q2lj46M27k16l8op6J2J34q7K23l27J22JJ0J57q0o8J13l3q0Q7k13
$$ -40 151 -85 -3 -6 -152 275 59 21 15 -61 -49 85 -2 221 -106 16 17 27 184 104 36 149 116 36 123 -90
5571i0J52j31N4k77K42K9R4J45r2k20RJ22P1oj19l3J44p4J02r0J67j54j37M4j10
$$ -90 62 -69 -15 -292 -50 -21 73 218 126 -94 -85 37 108 102 -17 -50 94 20 122 32 199 45 -92 -48 -158
5596a58O3J46p4J52k90Q0q6Q2R9R3p2j83J62K0pj86J65j24K68j48M7j23k4R7J16
$$ -158 -95 51 -23 129 -161 -81 -167 -85 14 107 35 -148 14 34 27 -159 6 -118 150 2 49 -74 -98 -1 115
5621A15k24J25p7j88O9J94lJ62m0q4j8j17j16K33k8J4j23J90J5M4N6k75J51j83
$$ 115 -109 16 -61 -249 -180 14 11 173 133 49 31 -86 -202 31 3 17 -106 84 99 143 199 -76 75 -108
5645a08O3k08K15l9L1N6n5K51l17J74j12J97k72J39o2m9J64k63K44nj69J89k1
$$ -108 -45 -253 -38 -77 -46 10 -45 206 -111 63 -49 148 -124 15 -47 -96 68 -195 49 44 -125 64 43
5668D3J85m31L15j08J01m0k00j2rL15l63MJ72J25o7K4N0N1j19Q0l42K70J42o7
$$ 43 228 -203 112 4 105 65 -135 -147 -156 159 -204 -200 -28 97 30 54 104 155 36 116 -226 44 186 119
5692A19j61Q5j16K64j17l6l9j1L0Nm7P5Q2l63K11K06j85j29OL16k25J56r4m6J50
$$ 119 -42 43 -73 191 74 38 -1 -12 18 23 -24 51 133 -230 -19 187 2 -127 -121 195 -30 126 32 -14 136
5717A36ok93Q4J3r4K21J84k39j31L00j55j50J59j44J69J71k95L44l88J09q7P7
$$ 136 130 -163 -79 -66 -160 61 245 6 -125 175 20 -130 29 -115 54 225 -70 274 -114 -5 -92 -15
5739a5K34k12L1m1M1J8m5R0k05J79k36l9K55l00L38k22J94kn6M8n2j26J30j14
$$ -15 219 7 38 -3 38 56 11 101 -104 75 -161 -200 55 -245 93 -129 65 63 7 55 3 -123 7 -107
5763a07R2J23k57K8J13j0QK8N7O2k31OO8j51k7L8J00OK03k02J56j99J9J37m0j00
$$ -107 -15 108 -149 -121 -8 -18 -10 18 75 137 -94 -88 -20 -171 -198 -160 -60 -54 149 -53 103 -96 -77 60 20 -80
5789h0K07l4q3o4J44Nl71J32J3J86j58L6l9J30j57J71j13J44j23k15J82l1K85
$$ -80 127 93 10 -54 90 95 -276 -144 -131 55 -103 -67 -106 24 -133 38 -75 69 -54 -269 -87 -118 167
5812A67l2l59M98l67M07l78J2K32j92J3n1o5p5J40L37j76q7m18K68L21j86L4Q9
$$ 167 135 -224 274 -93 314 -64 -52 180 -12 1 -50 -115 -190 -50 287 111 24 -394 -126 195 9 43 132
5835A32j89P7k2R9j16J01k91J14M0l6KR6N2n4J9p0q9J05L14m28R6q4O0No9K5Q7
$$ 132 -57 20 -2 97 -19 82 -209 -95 -55 -91 -89 7 59 5 24 -46 -135 -30 284 -144 -48 -132 -72 -67 -136 -111 -24
5862b4r7L18%j06k60K86j38J63j39M3J2j27j04R3j73L12j62J04J64m4j85J07J3
$$ -24 -121 197 197 91 -169 117 -21 142 3 46 58 -69 -173 -80 -253 59 -103 1 165 121 -64 43 56
5885E6k9J18k21L7kP4jj20J66O8j06j15J07j92RJ8l2J38L2r4M3L03k06j77J17
$$ 56 27 145 -76 -39 -41 33 32 -88 78 146 40 -75 32 -160 -151 -133 -165 -27 5 -89 -46 257 51 -126 -9
5910iJ52k02P6J85j55m2J21j38J6p8Q7J17j76N0j80J24QL8j0j58Q6j06J60K20
$$ -9 143 -59 17 202 47 5 126 -12 4 -74 13 130 -46 4 -176 -52 -44 -6 -16 -174 -88 -194 -34 186
5934A86l44R0j29O1NJ81kk82K94j84J27l06M10m6k35L02j49L8nK27l54P1J79k62
$$ 186 -158 -68 -197 -136 -131 50 48 -234 60 -124 3 -303 107 61 -174 128 -21 17 12 239 -115 -44 135 -127
5958a27N8PJ22n3l9q2R5j34L21j38p0J3P9j29O2j39k1L52l50L59k71QJ40j50M5
$$ -127 -69 -62 60 7 -32 -114 -19 -153 168 30 -40 -27 52 -77 -15 -154 -175 177 -173 186 -85 -77 63 -87 -42
5983d2K43m5k39J4J08l0k91J66J41k56P1O0J28k67K28l4K5L8M0j84K09N7k64L03
$$ -42 201 156 -83 -69 39 9 -282 -116 25 -231 -160 -100 28 -239 -11 -45 -20 18 58 -126 83 140 -124 179
6007A79k01k19J91J5K0r4J63k93J59J7m6j05L52k00J31Q8r4j65j5J19r0J8J00
$$ 179 -22 -241 -50 -35 -15 -109 54 -239 -80 -63 -109 -214 138 -62 69 157 63 -102 -117 2 -88 -70 30
6030C0r2pk07K25L22k38Q6j57R5j24N9jj8R8O0j81m0j00r7K45J41j29K7J18r9
$$ 30 -62 -69 -276 -51 271 33 119 -38 57 -67 -8 -9 -27 71 131 -50 -90 -190 -287 -42 99 -30 -3 115 16
6055A6L4J21j42J70q3r9o1k1P4j07J38Kj29N9nP7j56K42r4L4k6J16k73Q9M3j07
$$ 16 50 171 29 199 116 17 -44 -65 9 -98 40 42 -87 -28 -33 44 -112 130 36 70 44 160 -113 -24 19 -88
6081h8J3R3J16l30R4J96j02M5j71K40j05j7j03Q4L44m66J97l7J68j01mJ51l18
$$ -88 -75 18 134 -196 -102 94 -8 37 -134 106 1 -16 -119 -35 309 -157 40 3 171 70 66 217 -101
6104a01MJ59j34J88k38K04k14J0M45k87k00J78m7L46m58L1q3J58o3J43j49J83
$$ -101 -97 62 -72 116 -122 82 -132 -122 323 36 -164 14 -33 313 -145 -114 -197 -39 -102 41 -108 75
6126G5j75Q6J62o3n7j72L24j90J79Pj41P7Rj44k3k34L67j54L23l47n0J95l8k4
$$ 75 -100 -14 148 85 28 -144 180 -10 169 176 35 112 121 -23 -46 -280 87 -67 256 -91 -141 54 16 -8
6150ho6K22k33k3L38k42Jj49J90n2L2j87J55j15J85N6j31j7m3J44j95L4J43p3
$$ -8 -74 148 -85 -108 230 -12 -11 -160 30 -22 10 -177 -22 -137 48 104 -27 -44 -87 57 -138 -104 39 -34
6174c4j65L08M1m3j5j92Q4M2K5K6O9M6r0j31P1j79K96k31m4P0J49j2k28L36nl69
$$ -34 -199 109 150 107 92 -100 -16 26 51 77 146 192 102 -29 42 -137 159 -72 -116 -46 103 91 -137 199 194 -175
6200a75R1K51r3j56N0N2j24K34k40L26k23j69J42K9J05J1kO9j73j52j01O8K43
$$ -175 -84 167 74 -82 -32 20 -104 130 -110 216 -7 -176 -34 -5 100 111 109 178 5 -147 -248 -180 63
6223F3j7q1q5J08j01R1j27%K50j17k24J63J10l3J97k17j01K67j59PM6k1Q8o6k3
$$ 63 46 -35 -120 -12 -113 -22 -149 -149 101 -16 -240 -77 33 0 197 -20 -121 146 -13 -6 40 19 107 41 18
6248A8n0N2J12j74RJ05O2l1K3j11j00J91j43J92N0j26j3j90J01m0j88L80j79J82
$$ 18 -32 20 132 -42 -33 72 134 103 126 15 -85 106 -37 155 205 79 66 -124 -23 -63 -251 129 -50 132
6272A32j90j23L7K14Q5k33J91jq2k22L53j52M5r5J70j16j06m7J06K8L2q4j15J18
$$ 132 -58 -181 -144 70 155 -78 113 112 30 -192 161 9 54 -41 129 13 -93 -140 -34 -6 26 -58 -173 -55
6296e5R9j99Q5J85om0j49rJ53P2l5j74q4M44l60Q0O7q5J37j11r2J00m0O8K6k50
$$ -55 44 -155 -70 115 109 69 -80 -89 64 136 101 -73 -157 287 -73 7 74 -11 126 15 -77 23 -17 51 77 -173
6322a73J90j75K43k15J7N9J58r0j51R5q1J47K1o0O9k03J76Qj54M7K22P2k07K17
$$ -173 17 -158 85 -130 -113 -54 104 14 -137 -42 -123 24 45 -15 54 -149 27 35 -119 -72 150 222 15 232
6346B32k62Q9k10M6j16K01J23Nn7j63P1O0o5j44L58k1k62j01J94J06k8k6n8O8
$$ 232 -30 59 -151 -105 -221 -20 103 108 51 -112 -41 19 -46 -190 168 147 -115 -216 -22 84 56 30 -28 40
6370D0j08J10j13Q3J13j2P1j86K2J10r4M4j80L48k01k5P7J57k88j13L50k84QJ42
$$ 40 -68 42 -71 12 125 113 184 -2 20 130 36 80 -100 248 47 22 99 256 -32 -145 205 -79 -71 71
6394G1p9q6J10O2j99J05k2J17O2o5j69p5M33ol35l5j5K29k79P4J12J02k62J60
$$ 71 -8 -94 16 78 -121 -16 -38 79 141 76 -93 -168 265 259 -76 -111 -126 103 -176 -102 10 112 -150 10
6418A0q1J33J52j01j96J41Q2k12J16j90P0J52j48K1L7R3K8j07q4L7N6o2l2J52
$$ 10 -71 62 214 113 -83 58 140 -72 44 -146 -76 76 -72 -51 -14 79 107 0 -84 -47 9 -53 -85 67
6442F7j19p1L16k20K06j65j42n0K90j78J14j22jO2J10j08J50k29K52j00j65L4
$$ 67 -52 -123 193 -27 179 14 -128 -178 112 -66 48 -74 -75 -13 97 -11 139 -90 162 62 -103 -69
6464f9Qj1r6O6m9K16k25K29o5O2j08j14K8J13J98k03R6k93K6M11m40L14P6r1n8
$$ -69 -61 -72 -168 -102 -151 65 -160 69 4 66 -42 -156 -128 -15 183 -20 76 -217 -191 220 -220 94 170 79 21
6489B1K7J10k68K28k86K38o0Pq2J66k49R3J80k14j19J18J74j16J65j90Kk40L53
$$ 21 48 158 -110 118 -168 70 10 17 -65 101 -148 -55 125 -89 -208 -90 84 -32 133 -57 -55 -295 58
6512E8j62J24m2J70k1n2m3j32P0K25k81O1j6K15L3k40k8M7rq7J20o1J41M4j18
$$ 58 -104 20 -22 148 127 75 32 -100 -30 195 -86 -25 -41 174 207 -33 -61 -14 -23 -110 10 -51 90 134 16
6537A6p3K06k46J19MK5O0qj82m0Q9M4j4M9k01L08k53oJ17Q8k61l4J90n3n1J29
$$ 16 -57 149 -97 22 26 51 111 103 -79 -119 -30 14 0 49 -152 156 -97 -103 14 102 -159 -193 -3 -56 -107 22
6563B2Nk5O3N7j76r3K17mnQ8m02K99j08J1J89j71J40r8L2N6j18q2r2J56j47K65
$$ 22 27 2 65 122 -54 -147 70 66 61 149 -253 46 -62 -51 138 -33 107 9 41 97 -21 -103 -195 -39 -186 79
6589G9k5P1j41J12m5p6K1O0j28p0L14P7k59N3k22p6L25k49L36q9J9K0Qr7J09j45
$$ 79 54 125 -16 96 51 -25 -4 56 -72 -142 172 249 -10 43 -179 -255 70 -179 157 68 87 107 115 18 127 -18
6615a8L2j22K05o2l0N9j31j97K25N3j03k9K76p7n6N0jj40P3jM8M4j31j47K32M4
$$ -18 14 -108 97 35 5 64 -67 -264 -39 14 -89 -118 158 81 25 75 74 -66 7 6 54 98 -33 -180 52 96
6641I6k35J21o0O4pk3l2J44j74J20j36K27j85J30j97J88Q2k74K00k1k04J14L01
$$ 96 -139 -18 -78 -14 -21 -44 -76 68 -106 14 -122 105 -80 50 -147 41 123 -151 49 28 -176 -62 239
6664B39j70k34p7L65L2m9j88L06k37j30L8j0q1K58m6j3J4J52k25L7rr9K64j62
$$ 239 69 -165 -242 123 155 106 -82 224 -13 -143 -105 -115 -196 62 16 3 17 169 -56 -19 -28 -127 137 -25
6688b5j8n3P6J71j2k07K61j9j96k1P4K5j54M7l8J8J61j18oK8Q5qm5K0j19P4q1
$$ -25 -43 -96 -20 151 139 -68 193 174 -22 -43 31 56 -98 -51 -89 -71 90 -28 -34 -6 79 71 26 46 -73 1 -80
6715h0L8o6L32l43J01j57K91j56J0l4J01L2j92K88k54J41j42K66k64j46J74J67
$$ -80 -42 -108 224 -119 -18 -175 116 -40 -30 -64 37 69 -123 165 -89 52 -90 176 -88 -234 -60 107
6737A07kl70L82l7J3P9l27J79j88J44j59J5K00L7mK0r4J84m11K31K66l42o8J02
$$ 107 105 -265 117 80 93 172 -155 24 -164 -20 -179 -164 36 73 69 89 -5 179 -232 -1 265 -77 -145 -43
6761d3j7J42p3J67l1l29K19j52J08l2J7j88J56j46K46q2n1J01J17J8k64K47o5
$$ -43 -60 82 9 176 145 -184 35 -117 -9 -41 -24 -212 -56 -202 44 -38 -89 12 129 147 -117 130 65
6784F5nj03J90j69P5k07MK50O5l56R1J90j31K39m8q1j00j70J90J18J92k26l2j1
$$ 65 60 -43 147 -22 53 -154 -150 100 165 -191 -100 90 -41 198 150 69 -31 -201 -11 107 299 73 41 30
6808C0p4PO5kk64L95j53K5J21j38J4qk92L12j22k9J34j34J69r3Q3O5l09j03M56
$$ 30 -44 -37 28 26 -238 157 4 29 150 12 26 18 -274 38 -84 -113 21 -113 56 -37 46 111 -198 -301 155
6833A55j05J11k23J61l48K06J29k4N9k02J92OQ7j45k26M8K43o5q6k7K30j26N8
$$ 155 50 161 -62 99 -249 -43 86 62 121 -81 111 117 204 59 -167 -119 124 59 -27 -54 176 50 108
6856A08k33J03p2R2J90j92n8m7n4K45k16J09j90J20J62j63J12P2j21J09j0j77
$$ 108 -125 -22 -94 -2 188 -4 -62 -109 -163 82 -134 -25 -215 -95 67 -96 16 88 -33 76 66 -111
6878a11j43J79KM8K55l60R6O1N4M6k36L10j94M2r2M8k5o0n2L1L8r8K18NJ13k35
$$ -111 -254 -75 -73 -25 230 -130 -34 27 81 127 -109 201 7 49 -43 5 -20 -80 -132 -101 -63 -161 57 62 175 -60
6904f0J54j9nj25J62j52N6j11n0L56m10J11L6k4J10q7P7K5j84J73l4N9k16K9P8
$$ -60 94 75 70 -55 107 -45 11 -100 -150 206 -204 -93 -57 -81 29 -58 19 44 -140 33 -1 58 -158 -129 -51
6929e1J85l2j19j63P3o5Q1J0M8K06k74N8J2K76k89k4N1k5Q1Kp1j14J16J76l2J7
$$ -51 134 102 -17 -180 -107 -172 -91 -81 -33 173 -101 -43 -31 245 -44 -68 -17 -42 39 41 -30 -144 -28 148 116 133
6955A33k13L35j97J01p9L6j79k03K07M9j79q0L63J87k43p1j10K0j01K17J17j73
$$ 133 -80 255 58 159 80 116 -63 -266 -59 -10 -189 -269 94 281 38 -33 -143 -123 -224 -7 110 -63
6977f3K14J3l07J33J21k74J44n8J18q1l7m5M9J24J21j25N3p1L6rj25L6p3k3J15
$$ -63 151 164 -143 -10 111 -163 -19 -77 41 -40 -77 -122 -73 51 172 47 100 29 65 56 -69 -33 -106 -129 -14
7002a4R7r4k28L98j23K07l57r3J13J09R2j11k2j67J46J1n0J12J6j74J08J23k9
$$ -14 83 -11 -239 159 36 243 -114 -207 -94 15 107 -4 -26 -193 -47 -36 -86 26 42 -132 -24 99 70
7025G0k39J62J7n2J66l03L07j53J87p6j09Qj34K67Oj42j2NJ20j15m6R8j02L18
$$ 70 -169 -7 10 -42 124 -179 128 -25 162 86 -23 -15 -149 118 124 -18 -30 -25 95 -20 -66 32 -70 248
7049B48l7k08J0k1Q3l12K28J35k14J83n8j04Q8j30J68N0j25J54j05o9J65r7n6
$$ 248 211 3 13 -8 75 -237 -9 126 -88 95 37 -67 21 -109 59 109 -16 138 33 -36 129 32 -24
7072b4n4L33j62k31K04%j83K80j88J4L8j49K05j99M3P8l1J8j8m2J83j34J26K3
$$ -24 -78 255 93 -138 66 66 -117 163 -25 -11 27 -122 83 -116 -73 5 -26 -8 -26 -68 115 -19 107 130
7096A30o8J5K58k05m05k9J45K05j27J10K0l0j30J94K5l1p0j00O2R7r2O8q2J40
$$ 130 62 77 335 130 -275 -304 -159 46 -81 29 49 19 -111 83 108 77 7 -93 -31 66 -26 42 -40 100
7120A00m9j05J24j65N7N4qk9J16p7K9m2K96k11j02j07J02N8j94O8Qj31L14j86
$$ 100 51 -54 70 -95 -38 16 8 -21 95 18 47 5 301 90 -12 -119 -17 41 -153 -85 -77 -208 106 -80
7144h0M2K5k1J49j79J84j93J31J82l67J58j42Q5J78j85oJ53J18m09K06j72L58
$$ -80 -38 -13 -34 115 -64 120 -73 58 240 -127 31 -111 -26 152 -33 -39 114 232 -177 29 -143 215
7166B15l04N9J07j84J49J23j59K1J52j72j56M03k49q2J25n3K8Jp8Q5o7j80J25
$$ 215 -89 -30 77 -107 42 165 6 27 179 7 -149 254 5 -77 48 -5 23 24 -54 31 -36 -216 -91
7189i1K01j88J62k24J38r4m0J06K48j10k3J12j95N6j60j43M05l20J26j4J22k51
$$ -91 110 -78 84 -140 -2 -96 -136 -30 218 108 85 197 2 58 -102 -245 160 -160 -34 -48 74 -177
7211a77J21J41j02J26m8j14N2O6j02O3j41L1M8J93Qk22K25j13j41M6O9J49k86
$$ -177 -56 85 -17 109 61 -53 -1 65 -37 26 -115 -84 -36 157 165 -57 168 55 -86 -40 29 178 -108
7234a08J16n9J63J03k04j23qK23q0J6N6qj27M0R1k99J24J21QJ04O6l04o8J51j24
$$ -108 8 -51 112 215 11 -112 -120 103 23 39 95 87 -40 0 91 -208 -84 37 45 149 215 -89 -157 -6 -130
7259a30J02L1n5k05K77J8p8j09K3KJ61J03k35L2Kj4J26j92K20K0r9j28N3k6J19
$$ -130 -28 3 -52 -257 20 38 -40 -149 -126 -124 37 140 -95 -63 -61 -75 51 -141 79 99 0 -128 -75 -101 18
7284A8O8J68k43k92K58J69j41n3j19L57j56MR8j53K00j87N5J35j86k7M5M1j31
$$ 18 86 254 11 -281 -23 146 5 -48 -167 190 34 38 136 -17 183 -4 51 186 0 -27 18 59 -72
7307g2J85q3J48j93J1j68K54j88K44j26J8J28k38p1J58j00L04k44J26n5n2K41
$$ -72 113 30 178 -15 -4 -172 82 -106 138 12 30 158 -80 -151 7 -93 211 -33 93 38 -14 227
7329B27j96j26K55P8k82n9J25o5j15J63l61M26m1j04K11l02J96jK7j65P3o2P3
$$ 227 31 -95 160 238 -44 -103 22 -43 -158 5 -356 70 29 -75 136 -166 30 29 56 -109 -36 -98 -25
7352b5J87k38J62J30j71j22j1J22l1l2K07k75m6J2R2l0L0MJ52m7j12KN5j29M6
$$ -25 162 -76 86 216 45 -77 -88 34 3 -29 178 -97 -143 -131 -39 -69 -39 -35 117 70 -42 -40 15 -114 -68
7377f8J48j7p4J87k08N5j19L18j12k56L65n44J40J62j23O8P2j1M9R5k03l3J7J06
$$ -68 80 63 -11 176 -32 23 -96 222 110 -146 219 -325 -185 -23 -146 -78 -6 -17 32 127 -76 -109 -92 14
7401A4K5o9J6QK2L7q4j42O4J78j1j84K80q5j41K29q2O6j31nj39J70j67J73q5k44
$$ 14 39 -30 -14 -6 16 53 -31 -173 -109 69 58 -126 154 69 -72 157 75 141 10 5 -134 36 -131 42 -43 -287
7427b87L34j77M4J41K6k6j6j75R8j51L31k00Q3L0q2p9J36K1j61k95M42L2j44n9
$$ -287 47 -130 -86 55 81 55 39 -136 -38 -189 142 -58 25 55 -27 -106 30 51 -110 -405 37 69 -75 -134
7451a34K74r7j33R0j10J55j96K57P5j24J26N0l18K49k06K67l39J76J50q1l6j84
$$ -134 140 43 -90 0 -110 45 -151 106 181 57 183 233 -85 164 -42 225 -114 62 212 131 95 -89
7473h9NJ40Q6k22J23N7k82P1m3L82k29J2J32r1j75L24m33L09j75%J16M5r0j8p2
$$ -89 -84 56 142 -80 43 100 -182 -111 -154 228 -1 11 143 52 -123 201 -232 77 -98 -98 18 63 -27 -45 -117
7498a17L72j82j4j61P0k4R0o7k31K85p3q6K36j27j1J49j72Q3j44K57k19J10L2
$$ -117 255 73 59 -102 -32 -56 34 -33 -264 21 -52 -138 98 -29 -40 109 -63 20 -124 133 -86 24 56
7521E6L2j91J96j60N9O6mj36j0L0J6M5j35K03j00j44K74m42L17p8K2K9J8O1j81
$$ 56 88 -103 93 -67 -8 58 54 -82 -92 -62 -46 -1 -136 67 -33 -177 97 -345 -28 -106 -84 -55 -37 24 -157
7546a57K34P3k00J55k38J78K3q8J1ll1o2J20M2j16J00R0J08l17MK28j21o5q0N2
$$ -157 77 150 -50 105 -133 45 68 -20 -9 -12 -43 -105 15 57 -59 41 131 239 -78 -74 154 33 -32 -112 -60
7571f0K2J2QM8N7r7j8q1K39k70J27P6k2o0Q3j07n2L13k72J60k19LK32j03Rn5p3
$$ -60 -38 -26 -18 30 87 -10 -28 -109 130 -140 -13 63 41 -19 64 -43 -95 218 -54 106 -113 -110 122 19 28 -27 -100
7598a00J80j97O5LLo6L54p6j28j6K43j85q6lj7Q8J08j55j43Q4Q4P7j27Jk7J09
$$ -100 80 -117 -52 -49 -46 -112 242 166 38 22 265 80 -6 -9 -26 62 170 15 -128 -44 40 117 -10 -9 -36 73
7624G3J99j24k52K34JJ04k14J9P0r2J22k36j61L0PL39k86j8J80RL2j94J66N5K8
$$ 73 272 148 -104 130 131 235 21 40 110 18 140 -96 -257 -227 -220 119 -167 -185 -5 4 36 -158 8 63 91
7649I1n2K06m09J60R3j04k07J61q1J79j42M0M1R9p1O3lM8j95oj5k2l2J52o9N1
$$ 91 39 245 -164 -4 89 -15 -222 -61 -142 37 -105 -65 -24 75 4 67 64 112 -83 -89 -104 -126 -158 -6 -75 -24
7675b4o7j2J27j6jJ8j23J94k86K32j70J30l4m5R4M1k46k8J12M1j8K53j3k00K01
$$ -24 -91 -103 24 8 7 25 -98 96 -190 42 -128 2 -32 -77 17 58 -188 -216 -104 -63 -81 172 159 -41 160
7700A60j55J87j15p3o1p2Q0J46r5N4j53J46Pj64K19k47J24K9K1P0k0k26K35j83
$$ 160 5 192 77 4 -57 -129 -49 97 2 56 -97 49 56 -108 111 -136 -12 17 38 108 88 -138 97 -86
7724h6Q2J52j61rJ20j41J05R8m3j52m2j42L36k0j39J77k02O1j9j22J09K4R3J1
$$ -86 -4 148 -13 -22 98 -43 62 160 117 -35 -77 -219 117 97 -42 135 -67 -6 -25 -147 -38 -14 79 90
7748I0k32R4o5K06j2n2p1Q7m7J9r0j05J93k49J85L49m60J44N7R3Jk51j80L69p6
$$ 90 -142 -48 -113 93 81 29 -42 45 -2 17 -73 -178 15 -234 -49 300 -160 -16 41 134 135 -116 -296 73 -3
7773cP1j12N0r0J18L1Op1j79J60Q4q3m0J73k72K19L7r8L0j73R5j28L74q5r2N8
$$ -3 68 -44 6 -84 34 65 71 0 -179 -19 65 -18 -58 115 -157 62 99 1 31 -142 -47 -175 199 114 22 80
7799H0j54J23r5k3P8p5O6oN5K21k32JR7k27K32l95L18j14m0K15j17J8j01K8L3
$$ 80 -74 49 -46 -69 9 -66 0 -6 49 270 38 39 136 -91 141 -254 64 -50 -90 125 8 26 -75 -47 -14
7824a4J95j84J91m30L46k44J26K5j2P4J9k4j43K16j66J05l0K55j42r9k55O6J67
$$ -14 181 -3 188 -242 104 -140 -14 11 -1 73 92 68 -75 141 -25 80 50 305 163 64 -191 -125 42
7847D2r5N8n4J56k8l40L27r2N1J2k17J61q8Q5J20Lo1K8j19Q7m3k4M1J54j83j28
$$ 42 -53 5 -49 107 79 -261 66 -26 25 37 -180 -19 -107 -22 98 101 40 68 -51 36 -7 -31 10 164 -19 -147
7873a47J52k16L14m1l5j29J54M6j37M2k6j43K74n1o7P4O9j25m5J4J96j03o8n9
$$ -147 5 -211 103 62 27 -102 52 98 -39 3 -23 -166 108 57 -10 64 133 8 -37 -23 173 70 2 -57
7897e7L9P0k20K50k40J64K24n9J2q8k00J48j46MJ31J54j93J5K1J88k14K7j76K67
$$ -57 -18 52 -168 82 -158 6 230 171 183 95 -105 43 -103 -99 32 186 -7 8 29 217 3 30 -146 121
7921A21j65R3m2N4j97qJ80J9k45OK69m3jlk54K07q7N0j1O7L6oOJ08q4L0L6o6q5
$$ 121 -44 49 7 61 -136 -144 36 55 -190 -184 85 42 41 38 -216 -9 -96 -46 -57 10 46 40 46 154 70 100 136 70 -15
7950a5K4P7l2q2n2L1O8J46k67RK21j85n5J12M0o6R0k3k43J82K3M7Q3l18K26l3
$$ -15 9 86 54 -28 -80 -49 19 165 -102 -93 128 -57 -112 0 40 -26 64 41 -202 -20 3 50 133 -185 41 8
7976HN4R6p4j20K65j41k70K19j23J31kL7J1N1k07J76j14rR3j47LJ14k16K40k58
$$ 8 62 158 84 -36 229 88 -182 37 -86 45 43 80 91 142 -65 111 -3 -12 81 -66 -63 51 -165 75 -183
8001a83K43qo5p0Q0j22O1J06k3O3j87P1k9RJ19j71J9J67j67J91k14K19j75K5K6
$$ -183 60 52 -13 -83 -3 -125 -64 42 19 82 -105 -34 -63 -54 65 -106 -87 80 -87 104 -110 109 -66 -41 -15
8026a5L2j26On8J92L4m7p3j16L21j14q9Q7j6R7j98J60J46k10o5J35Oj29K3nJ10
$$ -15 17 -109 -103 -161 31 65 18 -55 -171 150 36 -53 34 18 115 -83 77 223 13 -52 83 89 -40 -17 -22 88
8052H8j07q3L23l84K45j3qj20J19r4p8J0J25l0j31k1j1K07P1k36J51nJ93k16J4
$$ 88 -19 -102 221 -163 82 69 61 -59 60 -34 -112 -102 23 -7 -138 -159 -170 37 108 -128 23 18 211 -5 9
8077Ij56K75n5j42J3N3j0J77l28K17Rj43J29p9J31j66J20Jj8j95J41K70j40j23
$$ 9 -147 128 73 -69 -56 -3 -13 164 -164 53 62 -81 48 -31 100 -66 54 55 37 -158 -17 253 113 -10
8101a0K38m68K88J48l31L60k55k61M08n1j21J06N3m1j6o2j63K62o2l24L89m9M7
$$ -10 228 -240 48 196 -135 225 -30 -291 117 66 -55 51 104 63 47 -15 -178 84 22 -302 87 38 85
8124H5j79Q0k1k1p4K17j46L1P7j59K02j50N8k51Q3J47Q8j2j05L1L6j05k1J77l22
$$ 85 -94 -14 -35 -56 -130 87 -59 -28 49 -110 92 -58 0 -251 -168 -21 67 55 -50 -19 17 -88 -109 68 -254
8149b54L4J00J98P1k9j0O9l23P0J94j20m3n4M6R0J15j51L0J1r2J33o5r7J04l8
$$ -254 -220 -120 78 149 120 110 179 -144 -74 120 0 -43 -97 -51 39 154 3 33 44 -48 85 20 -77 27 -11
8174a1M7Q7j84P7J42m08L06k38K76j5j79K38j36LNj70J57
$$ -11 36 123 -61 16 158 -250 56 -182 94 79 -100 138 2 5 10 -160 -3
8191c
$$ Imaginary data points
##PAGE= N=2
##DATA TABLE= (X++(I..I)), XYDATA
0@%%%%%%%qQqJ6j6K4l2M0m9N7p2Q9j13J37j61J93k31K72l16L70m31M95n68O51
$$ 0 0 0 0 0 0 0 0 -8 0 -8 8 -8 16 -16 24 -25 32 -40 49 -64 73 -88 105 -126 146 -170 200 -231 264 -304 347
31C47p43Q46r62J090j228J379j547J733j935K156k397K661k950L265l608L983
$$ 347 -396 450 -512 578 -650 729 -818 915 -1020 1136 -1261 1400 -1550 1715 -1893 2090
47B090m395M845n339N881o477P139p875Q695r617J0661j1852J3229j4843J6762
$$ 2090 -2305 2540 -2799 3082 -3395 3744 -4131 4564 -5053 5608 -6244 6985 -7858 8904
61H904j9090K1986k5701L0665l7677M8404o7036J08418l64752J90046O85951m73098
$$ 8904 -10186 11800 -13901 16764 -20913 27491 -39545 68873 -295879 -105833 580118 107020
73A07020m26000J53574L71828j06253j86492K6106Q3368q0426P7080J18122r8700
$$ 107020 -318980 -165406 206422 100169 -86323 -60217 23151 -57275 19805 137927 39227
84C9227k28775P1632K93341K5166l42149q3311K68470J22268j50113r5778L1374
$$ 39227 -189548 -117916 175425 200591 -141558 -224869 43601 165869 15756 -80022 -48648
95d8648N5522J3063L1224j5880j04052k25J51945N871j52617l2677J26344N0249
$$ -48648 6874 19937 51161 35281 -68771 -68996 82949 88820 -63797 -96474 29870 80119
107H0119q6278k7544N9409m2518m5129J02130L9725j24475n1743J14530R0303
$$ 80119 -6159 -33703 25706 -16812 -61941 40189 79914 -44561 -96304 18226 108529
118A08529q5958j12687O2391R8728n7071p3624N7682O1306o5333n4565R3748M3129
$$ 108529 22571 -90116 -27725 71003 13932 -59692 -2010 59296 -6037 -60602 33146 76275
130G6275j30143l2660J42828L2966j27496m9184R5168O3124o1495m7566L9534
$$ 76275 -53868 -86528 56300 89266 -38230 -87414 7754 70878 9383 -38183 1351
141A351J4470k9198R277K5741j9030l5815K0114N2726j8878n4881J9031M3310
$$ 1351 15821 -13377 -4100 21641 2611 -33204 -13090 39636 20758 -34123 -15092 28218
153B8218j6437l0146Q954K0074r193r737K3472k82m4859L942N3808k081n0924
$$ 28218 11781 -18365 -9411 10663 1470 -8267 15205 14923 -29936 -25994 27814 25733 -25191
166b5191N42M5458k734l8474J3708L3053k5173k9638L0142L0158k6728l4541J8719
$$ -25191 -24649 20809 18075 -20399 -6691 26362 1189 -28449 1693 31851 5123 -29418 -10699
179a0699L6797j3729l6871J0738L2936r497k5254R525J2381j7929l347L4803R163
$$ -10699 26098 12369 -24502 -13764 19172 9675 -15579 -6054 6327 -11602 -14949 19854 29017
192B9017m0582j6654L6143J8424k4869j6601R173R269J756L94o732j3035M091
$$ 29017 -11565 -28219 7924 26348 1479 -15122 -5949 3320 5076 5470 -1262 -14297 -10206
205a0206K6084j54l5251o650L5370J9420k2987k7613R764K5967j574j1041J572
$$ -10206 15878 15724 -19527 -26177 9193 28613 5626 -21987 -12223 13744 12170 1129 2701
218B701o662p030J2205J4425j2283k7054J1357L9895j1427m4845N130L9888P878
$$ 2701 -3961 -10991 1214 15639 3356 -23698 -12341 27554 16127 -28718 -23588 16300 24178
231B4178k8085j6275J9729J5048j1868m587K539l230K047K095j61M98p478K980
$$ 24178 -3907 -20182 -453 14595 2727 -1860 679 -2551 -504 1591 1430 1928 -5550 -2570
245b570R782p529o803M589K772L953k515n700K792j429L814Q851j0846p508J2849
$$ -2570 7212 -317 -7120 -2531 241 4194 1679 -4021 -1229 -2658 1156 10007 -839 -8347 4502
260D502R88q902j946P116O179j2019o917J7623J683j5693J911Q876K126p056q569
$$ 4502 5490 -3412 -5358 1758 7937 -4082 -10999 6624 8307 -7386 -5475 3401 5527 -1529 -10098
275a0098J2462R061j4357n112Q963M280k828q500N279J0147j1592n387J2182r28
$$ -10098 2364 11425 -2932 -8044 919 5199 2371 -6129 -850 9297 -2295 -7682 4500 3572
289C572o551M37K443M848n560n440Q734J300m759J00m049M917P863r270m491O096
$$ 3572 -2979 -2542 -99 4749 -811 -6251 2483 3783 -976 -876 -4925 -8 7855 -1415 -5906 190
305A90K544J058n504k896R433n62o663J071j21M041K59q787N185N750q707n22
$$ 190 2734 3792 -1712 -4608 4825 4263 -2400 -1329 -1450 2591 2850 -5937 -752 4998 -3709 -4231
321d231P117N23m662n080P622Q125j1654m813J0754J904m316m635k39Q780r35
$$ -4231 2886 3409 -1253 -6333 1289 9414 -2240 -7053 3701 5605 1289 -3346 -3585 5195 4260
336D260r538J821M819L86k537l987N064L678p529J288N982l006q67K18P78K371
$$ 4260 -5278 -3457 1362 1748 -789 -4776 288 3966 -3563 -2275 3707 701 -166 52 830 3201
352C201l716j977M092O9j542k309k370P074J921q856K2O763L34l684l339M200
$$ 3201 -515 -2492 1600 1669 127 -2182 -4552 2522 4443 -4413 -4391 2372 2706 -978 -4317 -117
368a17N010m638k386L134l9K95j288j159M033k201n487M300M787l835n753J661
$$ -117 4893 255 -2131 1003 964 1259 -29 -1188 2845 644 -4843 -543 4244 409 -5344 -3683
384c683Q294n84q474O58O405L77k886k402Q22M193o28l398J043J823j954k230
$$ -3683 4611 4027 -4447 -3789 2616 2993 107 -2295 -1473 2720 2092 -1306 -263 1560 -394 -2624
400b624K893L982m259o064M485O767k808o409n04O693L233m978m905K804M921
$$ -2624 269 4251 -8 -6072 -1587 5180 2372 -4037 -4541 2152 5385 407 -4498 -1694 3227
415C227p9m004j620K965P41j555J744R05n210j953O767L874o386n697M225O699
$$ 3227 3148 -856 -2476 489 1230 -325 1419 2324 -2886 -4839 1928 5802 -584 -6281 -2056 4643
431D643p70o895k583N826N653l146p036J349O326k085k579L256p90m683J738O050
$$ 4643 3873 -3022 -5605 221 5874 2728 -4308 -2959 3367 1282 -1297 1959 1169 -3514 -1776 4274
447D274O8p717l937P131P108l365q821j999J0336N226j0152n699P567N155k673
$$ 4274 4342 -3375 -7312 -181 6927 3562 -5259 -7258 3078 8304 -1848 -7547 20 5175 2502
462B502m413N1L163j226j249L996j149m633k31M084M265m153q475L339R557j64
$$ 2502 -1911 -1860 1303 77 -1172 2824 1675 -2958 -3189 895 5160 1007 -7468 -4129 5428 5264
478E264p584l838O649N692o190l718M085N6q45L168l09k853l515M26O761J838
$$ 5264 -2320 -6158 491 6183 -7 -3725 360 416 -429 2739 2430 -423 -3938 -3512 3249 5087
494E087o991m258M464R057k939j2548J922J0883j11m800j346N11L046q84k559
$$ 5087 -1904 -6162 -1698 7359 4420 -8128 -6206 4677 4566 -234 -1580 -1069 1977 1093 -1466
509a466J500n10q06K526J885K71p251n095R974P665p839o881K378P673K314q517
$$ -1466 34 -476 -1282 1244 3129 3400 -3851 -8946 1028 8693 854 -6027 -3649 4024 6338 -2179
525b179l798N291L360K52j543l040R09K53K38L298l386n118M965O331j187q742
$$ -2179 -5977 -686 2674 2926 1383 -1657 -748 -495 -257 3041 -345 -5463 -498 5833 4646 -4096
541d096m034R014N662o813l448K608K400K231k826l281J166M78J604K836j848
$$ -4096 -8130 884 6546 -267 -3715 -1107 1293 3524 698 -2583 -1417 -939 665 3501 1653
556A653l059k070K750N784l811q138L218P107J982l982o983J377P240K11l834
$$ 1653 -1406 -3476 -726 5058 1247 -6891 -3673 3434 5416 1434 -5549 -4172 3068 3279 -555
571e55j448J911K680j838j901J320j813j79N001K14m952k597K348O104q49p792
$$ -555 -2003 -92 2588 750 -1151 169 -1644 -1823 3178 3392 -1560 -4157 -1809 4295 3446 -4346
587d346o95N676L880j594n628q02M815k8j091P15j046r09J131J897q15m206m21
$$ -4346 -5041 635 4515 2921 -2707 -3509 1306 1278 187 902 -144 -1053 78 1975 1160 -3046 -3467
604c467N942J095l425l372M90M630J443m815k054L392K882l98l169j601K289J579
$$ -3467 2475 3570 145 -3227 -2737 1893 3336 -1479 -3533 -141 2741 2343 -826 -2427 -138 1441
620A441p04q33n13J055p4r22P96J94k315J3L268J424k660l237J435L538n99k490
$$ 1441 737 -96 -609 446 372 -550 246 440 -1875 -1862 1406 2830 170 -3067 -1632 1906 1307 -1183
638a183M66J852p8j528J80R99r00q51J346R56q30j942P67K106j53l058l82K918
$$ -1183 -717 1135 1057 -471 -291 708 -192 -1043 303 1259 429 -1513 -746 1360 1207 -1851 -2233 685
656F85J729j435j734o83J222J627l36j688J03R18M7l39l77J05k58J05J111J42
$$ 685 2414 979 -755 -1438 -216 1411 1075 -613 -510 408 455 116 -261 -156 -414 -309 802 944
674I44j820q18J450J743q37l043J057M003r24l010n05K164J044j182j101J533
$$ 944 -876 -1694 -244 1499 662 -2381 -1324 2679 1755 -1255 -1760 404 1448 266 -835 698
690F98J6j419K08M90M22j030p39K291M55k705m96K294P36o29j538n3K116j82j338
$$ 698 714 -705 -497 -7 415 -615 -1354 937 1392 -1313 -1809 485 1221 592 -946 -999 1117 935 -403
709d03K58O7L21m05o87J527M66j548m72N98J3K04j188J103J892j686j238Q13P40
$$ -403 -145 -78 243 -162 -849 678 1144 -404 -876 -278 -265 -61 -1249 -146 1746 60 -1178 -365 375
728C75L95j160n69K103K43k083J67P28J94q59q36K063J041k893o0J512k16j01
$$ 375 770 -390 -959 1144 1387 -696 -529 199 393 -466 -1302 761 1802 -1091 -1151 361 145 44
746D4j165N47K522j215j965Q85J001J49j427m74K151J52k428M95J103j02l16r70
$$ 44 -1121 -574 1948 733 -1232 -347 654 803 -624 -1098 1053 1205 -1223 -728 375 273 -43 -1013
764a013Q40J240j442o10J567l82j4j005J50K276j027j716J255O41o00p78k55J378
$$ -1013 -173 1067 -375 -985 582 200 186 -819 -669 1607 580 -1136 119 760 160 -618 -873 505
782E05M15j587k00J069K21n0j400L75K008j214j276J556p8j77m45k40J521o39
$$ 505 920 -667 -867 202 423 373 -1027 -652 1356 142 -1134 422 344 167 -278 -518 1003 364
800C64j341J033M47l40k35r46J127J032j712m07J463J75n47j020P29J522j305
$$ 364 -977 56 503 163 -72 -1018 109 1141 -571 -978 485 660 113 -907 -178 1344 39
817C9j090J207N82k38p66m46J386M2j584M36J006j24r18m02J184P45j722m32J621
$$ 39 -1051 156 738 500 -266 -712 674 716 -868 -432 574 450 -468 -870 314 1059 -663 -1095 526
836E26o3n32o39Q7J656l07j600O40P70j16o54n33J221K35j562l1J342j95p12k45
$$ 526 463 -69 -708 -621 1035 728 -872 -232 538 422 -232 -765 456 691 -871 -902 440 245 -467 -712
856g12J195M73j382m87R78N91n71p42L34R75j24r70K3Q10k53n28k6O28j73o75
$$ -712 483 956 -426 -913 65 656 85 -657 -323 652 528 -442 -419 391 138 -390 -416 212 39 -636
876f36J50J130j62q01m02O92J141p94j131L28J624j31j850J99J189K38j502R1
$$ -636 -486 644 482 -319 -721 -29 1112 318 -813 -485 1139 1008 -842 -643 546 784 -718 -627
894f27R75j27q63j01J439l09r78k45J417L25j180q92J360P08m99j285P44Q76o65
$$ -627 348 221 -642 -743 696 387 -591 -836 581 906 -274 -1166 194 902 403 -882 -138 738 73
913G3o13M16N20r30N7N04J15m10m87O12J026o12q61j35J241N58p49j178P54O43
$$ 73 -540 -124 396 -534 -477 27 142 -268 -755 -143 883 271 -590 -725 516 1074 325 -853 -99 544
933E44k35m13m43O43J60m03L8K38l21k94M67N89K88j890j70K157K17j645n40J112
$$ 544 309 -104 -547 96 256 -147 -109 129 -192 -486 -19 570 858 -1032 -1202 955 1172 -473 -1013 99
953I9J140q86j466R50P90m84k92n6K28J62p60Q83M31j210m84J136O71n12j279
$$ 99 1239 353 -1113 -163 627 143 -149 -205 23 185 -575 308 739 -471 -955 181 852 340 -939
972i39M74J233j99r00L32J38j1J12q40N34L22n01M89J61k00l62m60P17N13p21
$$ -939 -465 768 569 -331 1 139 128 240 -600 -66 256 -245 244 405 205 -157 -617 100 613 -108
992a08p50Q78M33M90j214p78J185N55q86o0K3M99M7r49O96K95r86M9J397j64n79
$$ -108 -858 20 453 943 -271 -1049 136 691 -195 -255 -232 267 314 -635 61 356 -630 -581 816 652 73
1013G3q92P02R29o41q82P20N18K12r29n43J003j89n39P11j8o57J91M80M4n03m74
$$ 73 -819 -117 812 171 -711 9 527 739 -190 -733 270 81 -458 253 235 -422 -231 249 293 -210 -684
1034f84M41O21k10J13n86k34Q05K08o57M8R3M69K42q94k66O39m6k00j36K79R6
$$ -684 -243 378 168 281 -305 -539 266 474 -183 -135 -42 427 669 -225 -491 148 102 -98 -234 45 141
1055A41n77J46P32o42m44M71M85L72o99p73R91K99n87j42J05J90L47m55j49m3
$$ 141 -436 -290 442 -200 -644 -173 312 684 -15 -788 203 502 -85 -227 -122 68 415 -40 -189 -232
1075b32j78M27K16j75r0k11J52L85k82r4k8K54P8L64q48R5L37k9j78j32J27N74
$$ -232 -410 17 233 58 -32 -243 -91 294 12 -82 -110 144 222 586 -262 -167 170 141 -37 -169 -42 532
1097E32p26m2QJ28M2K28M9Q5l71l02O00L18q10l05P07N87n40o14O40j9j64j79
$$ 532 -194 -236 -228 -100 -58 170 219 304 -67 -369 231 549 -261 -566 141 728 188 -426 214 195 31 -148
1119a48R5J54Nm59J59M87j45m18K9O92n0l52k62K64J8%l27J15L95l4n52J10O9
$$ -148 -53 101 106 -353 -194 293 148 -270 -241 451 401 49 -213 51 69 69 -258 -143 252 218 -334 -224 -155
1142a55K91k25qL67n2m05k37P47j1o70k18Q32J89o56n2M02k2l07r1L11N36l51
$$ -155 136 -89 -97 270 218 -187 -424 323 312 -358 -576 256 445 -211 -263 139 117 -190 -281 30 566 215
1164B15p26M11J13J60l98N4P42l20o67L38K24o0j21j58L54K16l27l29O1J71P5
$$ 215 -511 -100 13 173 -225 -171 571 251 -416 -78 146 86 -35 -193 161 377 50 -279 -218 -47 28
1185B8l72K57M99m50q9K00j85K41l06j54O73K05p71L0L2O98m28n07M60O77p66
$$ 28 -344 -87 412 -38 -127 73 -112 129 -177 -331 342 547 -224 -194 -162 536 108 -399 61 738 -28
1206b8l82M80K09n08k29R8P69k23m25L94j63N9k42l9M49N5o39N02J10q9l14J35
$$ -28 -410 70 279 -229 -458 -360 409 186 -239 155 -8 51 -191 -230 219 274 -365 137 247 158 -156 -21
1228b1J02P6k78J31N2k81L35j77l72N59J74o89K22L51j61N8n43M06M94p11J41
$$ -21 81 157 -121 10 62 -219 116 -61 -433 126 300 -389 -167 184 23 81 -462 -56 438 -273 -132
1249a32L12l4j94k35J77M36k59l74K47J37N5l16pP27k97o28M57M19m01j24k32
$$ -132 180 146 -48 -283 -106 330 71 -303 -56 81 136 -180 -187 540 243 -385 72 491 90 -34 -266
1270b66L37K24n42J77K13K8j70l66L34M89l16l30L47j65O5k15J03M03j28m50K92
$$ -266 71 295 -247 -70 143 171 1 -365 -31 458 142 -188 159 -6 59 -156 -53 350 222 -228 64
1291F4j37K31o0k08P7K84j27l63L31N5J70m63j26N53j56m81M10K04l9m82j7O20
$$ 64 -73 158 98 -110 -33 251 124 -239 92 147 317 -146 -272 281 125 -356 54 258 219 -263 -280 340
1313C40O8n34j50M40J44m31j98O53L4m10j38L26K0j65m1M6L27l59o7J0K02j29
$$ 340 408 -126 -276 164 308 -123 -321 332 366 -44 -182 144 164 -1 -42 4 331 -28 -95 -85 117 -12
1335a2lN8Q6L9l53K4K50K51k27l15P4K22j93J0m2M75j24m37LM43j57k81Q4K28
$$ -12 -15 43 129 168 -185 -161 89 340 113 -202 -128 94 -99 -89 -131 344 220 -217 -214 229 72 -209 -125 103
1359A03J62l95r3M78l4o75K85K78l1j1k49P4L15k34r2m2L63j39l52K59M77k54
$$ 103 265 -130 -223 255 221 -454 -169 109 78 67 -182 -108 207 -27 -119 -161 202 63 -289 -30 447 193
1381A93m11K32l1L86m29o6L74k02q7R5J57o1l75l3K91J92k71j39K9M39k52l99
$$ 193 -218 14 -17 369 -60 -126 248 46 -41 54 211 150 -225 -258 33 225 -46 -185 -156 283 31 -368
1403c68L16K00J24m70R7K39R5j76k34J70M2j12j08J11P9n0k57K48M24l88O0j70
$$ -368 -52 148 272 -198 -101 138 233 57 -177 -7 35 -77 -185 -74 5 -45 -302 -54 370 -18 42 -128
1425a28J30L34n48o9L79q8k34J55J64M9j23k46L39J44l59M8O0K49m61n1K81L31
$$ -128 2 336 -212 -281 98 10 -224 -69 95 144 21 -225 114 258 -101 -53 7 256 -205 -256 25 356
1447C56k53j70p8P8K11l95oK56n1J34k16k3P5J07j86K34m3k81L75n7p7N1k53J91
$$ 356 103 -67 -145 -67 144 -251 -257 -1 -52 82 -134 -157 -82 25 -161 73 30 -251 124 67 -10 41 -212 -21
1471b1J13l03J22l6J13K25j27k93K87R1l25J17j75J33K44k58K83j92q2J61p4J11
$$ -21 92 -211 -89 -125 -12 213 86 -207 80 171 -154 -37 -212 -79 165 -93 190 -2 -84 77 3 114
1493A14m7l08K02MO1j7n0P0J77l54N2J73jP1m00K96J45Lm61J64L04l34J64j61
$$ 114 67 -241 -39 -35 26 9 -41 29 206 -148 -96 77 76 147 -253 43 188 191 -270 -106 198 -136 28 -133
1517a33J77J31k39j66K25K0O9p8l0J47k02k0m0K06j69J53q4K55j32M6q5J49k61
$$ -133 44 175 -64 -230 -5 15 84 6 -24 123 -79 -99 -139 67 -102 51 -33 222 90 136 51 200 -61
1540f1l2J9M2K94l48m4j19N31m69K09q3O6J31l16L24p9q0o7j58M64o8l49K96o2
$$ -61 -93 -74 -32 262 -86 -130 -249 282 -187 22 -61 5 136 -180 144 65 -15 -82 -240 224 156 -193 103 41
1564D1lj31J09p1L31k65L4N9J36k19k46K82m3K2k84J74L07k75j4L63k17r7o4k17
$$ 41 38 -93 16 -55 276 11 45 104 240 21 -225 57 14 36 -248 -74 233 -42 -56 307 90 -7 -71 -288
1588b88L54L7j02k79M24L4l0j91J12J46m02j12L29K65l36j38J19J84L9j79p6R1
$$ -288 66 103 1 -278 146 180 150 -41 71 217 -185 -297 32 297 -39 -177 -58 126 165 -14 -90 1
1610AQ2k49K79P5p8m22J57L16J5k83K17k06K53p8k86J12K10k6k41K04j07K2K3
$$ 1 83 -166 113 188 110 -312 -155 161 176 -107 110 -96 157 79 -207 -95 115 89 -152 52 -55 -33 -10
1633a0j69J98o8j65M4J47J45l31J29J89j97J76J00k25k6N0j62j02L61P3k54K16
$$ -10 -179 19 -49 -214 -170 -23 122 -209 -80 109 -88 88 188 -37 -63 -13 -175 -277 84 157 -97 119
1655A19j03k09J19k8J53j27j12K04n8oL7n17N01K37k07j96K43r3K15j38q7K01
$$ 119 16 -193 -74 -102 51 -76 -188 16 -42 -48 -11 -528 -27 210 3 -193 50 -43 172 34 -53 148
1677A48j69k8J78K5k94J65j96Q2L27j58k14R4J68n2l18J47R2p1r4J73L4J52j82
$$ 148 -21 -49 129 154 -140 25 -171 -89 238 80 -134 -40 128 76 -242 -95 -3 -74 -168 5 39 191 9
1700Ij42K87L7j50L63l45n5j92O0K11N4j06m8J81k62K38l14J51J98j49L4K9N8
$$ 9 -133 154 191 41 404 59 4 -188 -128 83 137 31 -17 164 -98 140 -174 -23 175 26 60 89 147
1723A47l9k02J16J50J2k83m9N16l65Q4k06J18n4k89K19J62J10j98J18j05L03k03
$$ 147 108 -94 22 172 184 -99 -148 368 3 87 -119 -1 -55 -344 -125 37 147 -51 67 -38 265 62
1745F2j08j04J27j57J00j10K60Q5p5Om1k3j7m6k65M87j2j73J30o7mk85K65R8k2
$$ 62 -46 -150 -23 -180 -80 -190 70 155 80 86 45 22 5 -41 -306 181 169 -4 126 59 55 -230 35 133 111
1770A11l88K51Q0j77n2O2N5K87j71r5Q0P7j97r2J43K26q9l01J2P2J04j8j46K86
$$ 111 -277 -26 54 -123 -175 -113 -58 229 58 -37 43 120 -77 -169 -26 200 111 -190 -178 -106 -2 -20 -166 120
1794A20j08l02K44R3j1j32K75j39K3k11J97j43J14j01j06L9J14J85m22K75J80
$$ 120 12 -290 -46 47 36 -96 179 40 63 -148 49 -94 20 -81 -187 -148 -34 151 -271 4 184
1815A84j06l38R6M51k36k48K82K17j69j53k23L85m6j53k94M01R1q4j64J39J24
$$ 184 78 -260 -164 287 51 -197 85 302 133 -20 -243 142 96 -57 -351 50 141 57 -107 32 156
1836A56j27Q2k8r0%k01j75N22K35l92p7L91l93J42R9N5m1j90n5R9K75l09q1O9
$$ 156 29 111 83 -7 -7 -208 -383 139 374 -18 -95 296 -97 45 144 199 158 -32 -87 12 287 -22 -103 -34
1860c4J05k7q3pr8J32M7M1k0K15l77j21L59K8k99J31r7j6K6Q3L6J58k85J5J48
$$ -34 71 44 -39 -46 -144 -12 35 76 56 271 -106 -227 132 160 -139 -8 -105 -121 -95 -12 24 182 -103 -88 60
1885F0j55J49k57J90R1jk50J65J77m2Q5n7q1o4j07m3K19m5m1n3p7K99k97l5L86
$$ 60 -95 54 -203 -13 78 77 -173 -8 169 127 212 155 74 10 -97 -140 79 34 -7 -60 -137 162 -135 -170 216
1910B16r2k19J9R2k9L25n27J56J62%k85J60J05k89K13j48K91j00j50K08l6j16
$$ 216 124 -95 -76 16 -13 312 -215 -59 103 103 -182 -22 83 -206 7 -141 150 50 -100 108 72 -44
1932d4PK75l60J95k9k11K12J29j19j58pK75k63J50J0o9J04k54J5L17j2l29j26
$$ -44 -37 238 -122 73 44 -167 45 174 55 -103 -110 165 -98 52 62 -7 97 -157 -142 175 163 -166 -292
1955b92Q2J68K73k52J15l16mJ58m4K5K6L56l98J12R0n1j68N4K0o4J5j21L18j43
$$ -292 -210 -42 231 -21 94 -222 -226 -68 -112 -87 -61 295 -103 9 99 48 -120 -66 -46 -110 -95 -216 102 -41
1979d1j5R6J7o6O8q9R1l5L3j85j21K41m6jJ52q9L0l22K42J75m3L1q5m1J07k84
$$ -41 -56 40 57 -9 59 -30 61 26 59 -126 -247 -6 -52 -53 99 10 40 -282 -40 135 92 123 38 -3 104 -180
2005a80K81Kjk48J27O4j49K32p4J02k17K15j98J65o4P8j10q8J49L4L0k40Q3K1
$$ -180 101 103 102 -146 -19 45 -104 128 54 156 -61 154 -44 121 57 135 25 -63 86 120 150 -90 -7 14
2029A4j43J5K36p6j88J02J4J51L1l13K43k10L33l09K14n6j38j71J26O5o7q1J11
$$ 14 -129 -114 122 46 -142 -40 -26 125 156 -157 86 -124 209 -100 114 58 -80 -251 -125 -60 -127 -208 -97
2052i7K7O8r7L1j05K71k9k10J47j55J0J44j28L21k98n2K19p4J63l55K78l8J11
$$ -97 -70 -2 -99 -68 -173 98 69 -141 6 -149 -139 5 -123 198 -100 -152 67 -7 156 -199 79 41 152
2075A52j96Q1qK0M4o8N4J1k9l2J45k2k64j25K08P4kp0mKn2K7pL8J13jj81J37n
$$ 152 -44 37 29 49 93 25 79 90 61 29 174 152 -112 -237 -29 45 43 -27 -31 -29 -81 -54 -61 -23 90 89 -92 45 40
2104D0k9l7J5j29J80K1j00L0J42k74J18P7l5j6k00K93J22j76L4N2l2k09p9R2J83
$$ 40 11 -26 -11 -140 40 61 -39 -9 133 -141 -23 54 19 3 -197 96 218 42 76 128 96 -113 -192 -100 83
2129H3o9l8j02L06j51j96J8o5L8K89j31q5k7K97k13M9J95j97j51K16k13J78n2
$$ 83 14 -24 -126 180 29 -167 -149 -214 -176 113 -18 -103 -130 167 -46 3 198 1 -150 66 -147 31 -21
2152b1J38O0l78K59k00K23K5k94J45k4K21k49J42P7j80j48K59j96K88j78j8k3
$$ -21 117 177 -201 58 -142 81 106 -188 -43 -67 154 -95 47 124 -56 -204 55 -141 147 -31 -49 -72
2174g2L9L7m1R0r4Q3j47J54Q4j79N2N0j01o6J26j38OR9J50j43J25J37l21l0m2
$$ -72 -33 4 -37 53 -41 42 -105 49 133 -46 6 56 -45 -111 15 -123 -117 -18 132 -11 114 251 -70 -100 -142
2199a42J64n8J71j27q2MRJ97j2j63J46l2J99l02J7R7J13l22K54N4p5k1j63J07
$$ -142 22 -36 135 8 -74 -70 -61 136 124 -39 107 75 274 -28 -11 86 199 -123 131 185 110 89 -74 33
2223C3Q3j33Q5m2l35L29Nk05N4j4q4J16O3j84M3J43J92k02K94k06Lj00l3J7r4
$$ 33 116 -17 68 26 -309 20 25 -180 -126 -140 -224 -108 -45 -229 -186 -43 149 -53 241 35 38 -62 -95 -78 -172
2248a72L69n6k78M0P3l6J97k34K24lM7j68J83n2j90Q8J1k8O9j07l9J69M2K8k03
$$ -172 197 141 -137 -97 -24 -60 137 -97 127 124 171 3 186 134 -56 32 43 15 84 -23 -62 107 149 177 -26
2273b6L8J34K3k81P3j62K75r5k38J25J22J50l8k2n4k03K03k38J08L90j48j36J3
$$ -26 12 146 169 -112 -39 -201 74 -21 -259 -134 -12 138 100 78 24 -179 24 -214 -106 284 136 0 13
2296A3p3J39p0N7k9j35lM3k25J45L18j14N9p9k08L11O7l14J16L18m40LK3j02K59
$$ 13 -60 79 9 66 37 -98 -101 -58 -283 -138 180 66 125 46 -162 149 216 -98 18 336 -104 -101 -78 -180 79
2321G9j72J29k49J61p9K78j79P6j89L53k60K77k99j23J69O5J8j3J04m4j38K53
$$ 79 -93 36 -213 -52 -131 147 -32 44 -145 208 -52 225 -74 -197 -28 37 55 42 146 102 -36 217
2343B17j98p5O1J54j47k74K55j5O6n0r8J62k5j32R8k3j7K37j33l20L96L9q2k61
$$ 217 19 -56 5 159 12 -262 -7 -22 44 -6 -104 58 33 -99 -1 -24 -41 196 63 -257 139 178 96 -165
2367a65J75j81K01P7Q6k67Q7r7M7l0J8J74j53R0Oq3J54m22M13l6j31j96K76n0
$$ -165 10 -171 30 107 193 -74 13 -84 -37 -67 -49 125 -28 62 68 -15 139 -283 130 94 -37 -233 43 -7
2391gj9J19j27L23m2l21J20j87K00l4rK9j5R1j9j80K9J88l00OK58%k55N8J72o8
$$ -7 -26 93 -34 289 247 -74 46 -141 59 25 16 45 30 121 102 -78 -49 139 -161 -155 103 103 -152 -94 78 10
2417A0j03J28j56L9J85l1k07J22J34Ol4o3P8j29J39q9l4M4k29J60o8J05M4k47
$$ 10 -93 35 -121 -82 103 72 -135 -13 121 127 93 30 108 -21 118 29 -5 39 -190 -30 -98 7 51 -196
2441a96L55m4Nk24J09J4N4j22J66k5k27mL20k34R7J62k09P7l5k64J06J79q7J50
$$ -196 159 115 120 -104 5 19 73 -49 117 92 -135 -139 181 -53 44 206 -3 74 39 -225 -119 60 -27 123
2465A23j93J20j62J14n1p2J41r3j42L09K7j08j08L07j94n7R5j10J64M5l76N2J27
$$ 123 -70 50 -112 2 -49 -121 20 -73 -215 94 121 13 -95 212 18 -39 56 -54 110 155 -221 -169 -42
2488d2m6k4Q4J95j88RJ69j05j3k49M33k88l2J85k35J9J36j66L19n1j22J52k08
$$ -42 -88 -112 -28 167 -21 -12 157 52 39 -210 223 -65 -97 88 -147 -128 8 -158 161 110 -12 140 -68
2511f8K37K0j60M5J04j03k12J71k99K94m8J22j38m6J56j42K16k25K0J83j85R9
$$ -68 169 189 29 74 178 75 -137 34 -265 29 -19 103 -35 -81 75 -67 149 -76 -56 127 -58 41
2533D1j2Ko1k3l5Q1o1J72j58q3K43m2k45J25J30k01M7R4j62nJ46J58r7ok5K0M5
$$ 41 29 31 -30 -53 -88 -7 -68 104 -54 -137 106 64 -181 -56 74 -127 -80 14 -148 -153 -7 151 54 48 23 43 88
2560H8j68J80M3l6j09Q8n4q3R7q0r5K03m1l1J02j86Q7N6r7J15j25J51k88K58L
$$ 88 -80 100 143 107 -2 86 32 -51 46 -34 -129 74 33 2 104 -82 5 61 -36 79 -46 105 -183 75 78
2585G8r3K9K4r8j14J26J12l6j78J70P4j18J37m3nMj16o1M3rmj1L51l13%j08J91
$$ 78 -15 14 38 -60 -174 -48 64 28 -150 20 94 -24 113 70 65 69 -47 -108 -65 -74 -78 -89 262 -51 -51 -159 32
2612C2K8j03k15L13J5k69J25O2J82l77J18j17J64J03K4p1j21J25K48k52K6j31
$$ 32 60 -43 -258 55 70 -199 -74 -12 170 -207 -89 -206 -42 61 85 14 -107 18 266 14 40 -91
2634i1l8n6K28j96K84k22J30j55K68k28J94j11m7Q8O0o7l56M30j87J50k2n5L9
$$ -91 -129 -185 43 -153 131 -91 39 -116 152 -76 118 7 -40 48 108 41 -315 115 -72 78 56 1 40
2657D0q8L4P6p7j07R8J19j24J56j25J52j51O9n5o6J14o9o4j86K13Rj36L55J26
$$ 40 -48 -14 62 -15 -122 -24 95 -29 127 2 154 3 72 17 -49 65 -4 -68 -254 -41 -32 -168 187 313
2681C13l47J50j96K17m5l16K61KJ7q6J32j00Ok48K69J35j99J92j30l7QR7j98J45
$$ 313 -34 116 -80 137 92 -224 37 39 56 -30 102 2 8 -240 29 164 -35 157 27 -10 -2 95 -103 42
2705D2j03K21q4j42M7j05K29P0l43J72j30J94l3P5j50p2K1J90k5k18K1J74k57
$$ 42 -61 160 76 -66 -19 -124 105 175 -168 4 -126 68 35 110 -40 -112 -91 99 74 -144 -123 51 -206
2728b06J91l5J02k45M8L21l02J29j18K76j83J53j30lj17N2R7M4o7O1J30r0j90
$$ -206 -15 -50 52 -193 -145 176 -126 3 -115 161 -22 131 1 -2 -119 -67 30 74 7 68 198 108 -82
2751h2J04l5j50J52j19j2J7Q5O9q7L39j87k66M9N4N6Q4k23J39j76K21j30j02J98
$$ -82 22 -13 -163 -11 -130 -142 -125 -40 29 -58 281 94 -172 -123 -69 -13 71 -152 -13 -189 32 -98 -200 -2
2775bO2q9P1j19K48j46j68K35j78m5K00L0k58K68j20Qj28J34O8r6j16J12R5n0
$$ -2 60 -29 42 -77 171 25 -143 92 -86 -131 69 99 -159 109 -11 -3 -131 3 71 -25 -141 -29 66 16
2799A6K9p9J16j07J22J3j52J72j67j5J62j83K25j24Q1j49L5lJ25j04kj93J60K5
$$ 16 45 -34 82 -25 97 110 -42 130 -37 -52 110 -73 152 28 109 -40 -5 -8 117 13 11 -182 -22 3
2823Cj6k9J13m0j37J20j15k9K53p6q3QQ2q6p3J46JL4k01L03k88P2J04j22K2J8
$$ 3 -13 -42 71 31 -106 14 -101 -130 123 47 -36 -28 54 -32 -105 41 42 76 -125 178 -110 -38 66 -56 -34 -16
2849a6j35R9P4O8j01j30L5L0o4K84j96J77o2L7j34Q6l8n1NJ59l42K51j16K9P4
$$ -16 -151 -52 22 90 -11 -141 -106 -76 -140 144 -52 125 63 100 -34 52 14 -37 -32 127 -215 36 -80 -51 23
2874B3K2L3k70J04J28r1L4j1J04j30K5K6k45K55k34L07j09J59m4k18M74l53O9
$$ 23 45 78 -192 -88 40 -51 -17 -28 76 -54 -29 -3 -248 7 -227 80 -29 130 86 -132 342 -11 58
2897E8q7J76j05j71M7J88j20j45K15k8j77l1Q1J46j62J20O1p3R7l06J96n2k43
$$ 58 -29 147 42 -129 -82 106 -14 -159 56 28 -149 -180 -99 47 -115 5 66 -7 90 -216 -20 -72 -315
2920c15M60j29n1m8J5J2j19J83M3q8j2J61p8J7N3j77J95k95K57k4j17j35K52m7
$$ -315 145 16 -35 -83 -68 -56 -175 8 51 -37 -49 112 34 51 104 -73 122 -173 84 60 -57 -192 60 13
2944A3n7J83j41J35j50J6j26L19l20Q5K1m8J7J07n4J49l79J66P4L5q8jQ8j70K26
$$ 13 -44 139 -2 133 -17 -1 -127 192 -128 -43 -22 -70 -53 54 0 149 -230 -64 10 45 -43 -44 44 -126 100
2969A00k25m5p9J41K21j91KK42k51J47m0m3j88K97m05K27J3K32o1k11L80m51J79
$$ 100 -125 -170 -249 -108 113 -78 -76 166 -85 62 22 -21 -209 88 -317 -90 -77 155 94 -117 263 -188 -9
2992iM7rlJ10mm53M44l13K83J26k59J17k31O8J74k7Kj89J18M0J2j41J22M2j06
$$ -9 38 29 26 136 132 -321 123 -190 93 219 -40 77 -154 -86 88 61 63 -126 -8 32 44 -97 25 67 -39
3017c9j29L64k26j5J85j07L5j21K48jp6k07K74j71o1P9k39K02k1P4o9R5k5k11
$$ -39 -168 196 -30 -45 140 33 68 -53 195 194 118 -89 185 14 -47 32 -207 -5 -26 48 -21 74 49 -162
3041a62K55p1n1J32M4l3j5k4j20j51K80m4K5o2j20n2K29j68J06j7Nm7k6J42o5
$$ -162 93 22 -29 103 147 114 99 75 -45 -196 84 40 65 3 -117 -169 60 -108 -2 -19 -14 -61 -87 55 -10
3066a0K67k48J17j80J05J4j2j2j20J86j10j34L3J68Jj46K33q4j11k37L40j43p4
$$ -10 257 9 126 -54 51 65 53 41 -79 107 -3 -137 -104 64 65 -81 152 68 -43 -280 60 -83 -157
3089a57J93J58j28j65J42j4j15N0J17J89l78K71r7l20J10J05j48L37j25k62L33
$$ -157 36 194 66 -99 43 29 -86 -36 81 270 -108 163 66 -254 -144 -39 -187 150 25 -237 96
3110I6j81J23j49M9j27L36m7q8j77K41j08O9j55l1Q5J11o2K06j6k03j32J5L89
$$ 96 -85 38 -111 -62 -189 147 100 12 -165 76 -32 37 -118 -149 -64 47 -15 191 175 -28 -160 -145 244
3133B44j81n3l7J46j85J2J73j85K5K03j17J20j33R4j07j30Nq8K3J34n3K52j10
$$ 244 63 10 -27 119 -66 -54 119 -66 -41 162 45 165 32 126 19 -111 -106 -194 -171 -37 -90 162 52
3156E2j04J6j00J80j37LJ4J08K7N9k54J47j07J88k61l6K29J27k39o5K71J3n9O0
$$ 52 -52 -36 -136 44 -93 -90 -76 32 59 118 -136 11 -96 92 -169 -205 24 151 -88 -153 118 131 72 132
3180A32o3n5l6k74K6J47K9J22j44J12NM2K3m8l6K0J29j15N3J04l28J44P9j38J77
$$ 132 69 14 -22 -296 -270 -123 -94 28 -116 -4 1 43 66 18 -18 2 131 16 69 173 -155 -11 68 -70 107
3205A07k54K5J24j29K76j94n0J15q1lK75l0k53J8L70k19q6m0o7J37NJ29j26j40
$$ 107 -147 -122 2 -127 149 -45 -95 20 -61 -64 211 181 -72 -54 316 97 11 -29 -96 41 46 175 49 -91
3229i1Q5M9j80k2K58j43m3J71j45q9K82J79m05J96o4o1k8n3k8L09l05K16L6j82
$$ -91 -6 43 -137 -159 99 -44 -87 84 -61 -150 132 311 -94 102 38 -23 -51 -104 -132 177 -128 88 124 -58
3253e8J32k76J94k3J40k64J22J1r7J50k13M3l6L15j8j66j6l6Q1J67j42n3O8RN9
$$ -58 74 -202 -8 -31 109 -155 -33 -22 -119 31 -182 -139 -175 140 122 -44 -60 -96 -15 152 10 -43 25 34 93
3278I3k98L11j42k8J12j82J88l9J5l0l3O9m9J9J48j51r4J91J9k11l0K02p3rLl1
$$ 93 -205 106 -36 -64 48 -134 54 15 30 0 -33 36 -13 6 154 3 -91 100 119 -92 -122 80 7 -2 1 -30
3304c0NJ74k02R9J9Q1p4K94m00n8K36j45R5j88J25j68J33j72K40j32K17Jm0j29
$$ -30 -25 149 -53 46 65 146 72 366 -34 -92 144 -1 94 -94 31 -137 -4 -176 64 -68 149 150 110 -19
3328a9mO2j67N5Q2j9p6K06n3j83J43k39K51k39K65k42J68l4O0P1q5m4J20r9J51
$$ -19 -23 39 -128 -73 9 -10 -86 120 67 -116 27 -212 39 -200 65 -177 -9 -43 17 88 3 -41 79 -20 131
3353A31j24L8r2j27K45j04j61K58K0k09J84k42L12l6l24M03k97R0J43K1k47J27
$$ 131 7 45 -47 -174 71 -33 -194 64 84 -125 59 -183 129 93 -231 172 -125 -35 108 129 -118 9
3375Ir3RP3j1k04K22M5J04rk15L8K32k94J11j00O3J25j59J34j72K32k90p1J73
$$ 9 -84 -75 -2 -13 -217 5 50 154 145 -70 -32 200 -94 17 -83 -20 105 -54 80 -92 140 -150 -221 -48
3399d8l6K62l24J59J00k04j24O1K31J1r5J62j62m1Q0k38Q4J42%q3N4J20j99n1
$$ -48 -84 178 -146 13 113 -91 -215 -154 77 88 -7 155 -7 -48 32 -206 -122 20 20 -63 -9 111 -88 -139
3423a39J70o0P2p0p5M8J97j77j50J96LJ08j07J61k10M29o51K24m1J5K70k23j21
$$ -139 31 -29 43 -27 -102 -54 143 -34 -184 12 15 123 16 177 -33 396 -255 -31 -72 -57 213 -10 -131
3446a31l8K14p0Q0k66L03K0J71m07K28j63M9%o5J9O3l0N3K00l12J93j09K1K5j8
$$ -131 -169 45 -25 55 -211 92 112 283 -124 104 -59 -10 -10 -75 -56 7 -23 30 230 -82 111 2 23 48 30
3471C0k2k3K33k16l2k10J94O1n7J76j91M9l4K38j76n5M2L2k35J07P0p8nJ3K21
$$ 30 8 -15 218 2 -30 -240 -46 15 -42 134 -57 -8 -42 196 20 -35 7 39 -196 -89 -19 -97 -102 -89 132
3496A32k26L6M9J85k39J41l55J69j6J94p4j20J64P7j38J48j20J03j63m1J67k13
$$ 132 -94 -58 -9 176 -63 78 -277 -108 -124 70 -4 -124 40 117 -21 127 7 110 -53 -94 73 -140
3518a40K70j6j95M2L7LQ0j15L4j04K71j54jO3j9j12L6j94L82jj34l2r8K10k35
$$ -140 130 114 -81 -39 -2 1 81 -34 0 -104 167 13 12 75 56 -56 -20 -214 168 167 33 1 -97 113 -122
3543a22P1J14j47R2pMRj6O9j05J78j61J57l05O8K85l28L10p0j6j9j93J10J58j45
$$ -122 -51 63 -84 8 1 5 14 -2 67 -38 140 -21 136 -169 -101 184 -144 166 96 80 61 -132 -22 136 -9
3568iM8r0J23j4k44O6M7M9J49L3j50J18l9j25J63k21j21L4J18K1J48j86K38j34
$$ -9 39 -51 72 58 -186 -120 -73 -24 125 158 8 126 87 -38 125 -96 -217 -183 -65 -44 104 -82 156 22
3592B2J28Rk94N8K02Q2l49L4P6J69K5j56q7k1j9R8J10j15p8L63k03q6j2j40M51
$$ 22 150 159 -135 -77 125 207 -142 -108 -32 137 162 6 -81 -102 -121 -23 87 -28 -106 257 54 -32 -44 -184 267
3617B67l07p%J50o8k7r5L3K55k99n6J29K3J58%j23j68q2L83k50J22m9J70n4j25
$$ 267 -40 -47 -47 103 35 8 -87 -54 201 -98 -154 -25 -2 156 156 33 -135 -217 166 -84 38 -11 159 105 -20
3642b0R6l07L18o4Ml2j44L88l08N8k38M38k21J17J9j6J11m31K9K29j91J87L0Q0
$$ -20 76 -231 87 23 27 -5 -149 239 -69 -11 -249 189 -32 85 104 88 199 -232 -203 26 -165 22 52 132
3666A32j67r6K93l51Q2m8L29k43j73J58o1J39j3O6J36j63o4q0M0J54j29mK45j51
$$ 132 -35 -131 162 -189 -107 -155 174 -69 -242 -84 -145 -6 -19 47 183 20 -44 -124 -84 70 -59 -63 182 31
3690C1k00L04l88L05kj85JJ37R5l16K44L0K3j12K46j87k06Q1K16j14q7l7L8Q0
$$ 31 -169 135 -253 52 50 -135 -134 3 98 -218 26 56 79 -33 213 26 -180 -99 117 3 -84 -121 -83 -3
3714cL6j27J60o1k49K49j02pJ55L2l3rp3n6l4P4J44j40j66K35K8K13j50j03n5
$$ -3 33 -94 66 5 -244 5 -97 -104 51 83 50 41 -32 -88 -122 -48 96 -44 -210 25 53 266 116 13 -42
3739d2K01j72P2r3L4M8J8l0m4M0Lj08Q9k3M1j48M4l5J85p5J44j31J14p6K9O2N
$$ -42 159 -13 59 -34 0 48 66 36 -8 32 35 -73 16 -7 34 -114 -70 -105 80 5 149 18 132 56 85 147 152
3766A52r5j01K7R5j09K8Q1J2r2N1j33Q9k04K26o6mk3N3q7J28J62j79pj0j14o5
$$ 152 57 -44 -17 78 -31 -3 78 90 -2 49 -84 5 -199 27 -39 -43 -66 -13 -100 28 190 11 4 -6 -120 -185
3792a85K61k57Q9K40j90j8K32k63J47k44J95L7j62J81k00K5qK80k47J41j18j13
$$ -185 76 -181 -92 148 -42 -60 172 -91 56 -188 7 44 -118 63 -137 -112 -120 160 -87 54 -64 -177
3814a77J92Ok6Q6j63L2K27k06j39L52j57k15L19j40r3L4P3j40M2J80N2k26r8J68
$$ -177 15 21 -5 81 -82 -50 177 -29 -168 184 27 -188 131 -9 -102 -68 5 -135 -93 87 139 -87 -185 -17
3838a7J48j0j10j34J51j62R7po3J3l3K13j78J92j50M6J74k60J74qj31J56l16L39
$$ -17 131 121 11 -123 28 -134 -37 -44 -107 -94 -127 86 -92 100 -50 -4 170 -90 84 76 -55 101 -215 124
3862A24j6q4r0K40j62p0K04j6l04J08q6n3L47k05rJ23Rj27J48M1k83j9J39K4J03
$$ 124 108 24 -66 174 12 -58 146 130 -174 -66 -152 -205 142 -63 -72 51 60 -67 81 122 -161 -180 -41 -17 86
3887H6k88K32r5M1R3j4k08J24P8j26qQ4j78j8K22K51l14N8J63K3n8j68J99m17
$$ 86 -202 30 -65 -24 69 55 -153 -29 49 -77 -85 -1 -179 -197 25 276 -38 20 183 206 148 -20 179 -238
3911b38K47K89j14j43q1r7J34n8J08j34R3l43M29m05K42q4J89lM5j16kQ1k09K94
$$ -238 9 298 184 41 -40 -137 -3 -61 47 -87 6 -337 92 -313 -71 -155 34 31 76 -40 -42 39 -170 124
3935A24K0P5j01l31J61M6J42j67N7J0o3Q3J11j09R4q4L0J17k10K01l13K49j63
$$ 124 144 219 118 -213 -52 -6 136 -31 26 36 -27 56 167 58 152 68 98 215 5 206 -107 142 -21
3958b1pJ63n7M5N9p7p6j21L0J17j81J84j14O4oj3j05J14n3j2N2r8J05K6L7p7M1
$$ -21 -28 135 78 123 182 105 29 -92 -62 55 -126 58 -56 8 2 -11 -116 -2 -55 -67 -15 -113 -8 18 55 -22 19
3985A9J62j47M0K2k6k09O1J00K0l1n8P0NR9l07K48r4J41j49M7k55L00j9N2j24
$$ 19 181 34 74 96 70 -139 -78 22 42 11 -47 23 28 127 -180 68 -26 115 -34 13 -242 58 39 91 -33
4010c3J72k93MK66j86nJ26J4k6R1J16j19n9P2j56J24k16Q6R2L1k43Q2J8K46L3
$$ -33 139 -154 -150 116 -70 -75 51 65 39 130 246 127 68 140 -16 108 -108 -22 70 101 -142 -60 -42 204 237
4035B37l17j03J55j04n5K39m4J6M2o1J38k70J19rL8J81Nj71n1J12j40P0j9K05
$$ 237 -80 -183 -28 -132 -187 52 8 24 66 5 143 -127 -8 -17 21 202 207 36 -15 97 -43 27 8 213
4059B13j12j58J60j70J20j76L2oQ5J2m1K57k28J20j15P0rj55O4pr9J69J1l7M5
$$ 213 101 -57 103 -67 53 -123 -91 -97 -12 0 -41 216 -12 108 -7 63 54 -101 -37 -44 -143 26 37 0 45
4084D5J5Q1q7j71nJ21m3J12K9L9k07j7J91p6J15j62J0j08OJ72j03k9J62k65K82
$$ 45 60 141 54 -117 -122 -1 -44 68 97 136 -71 -88 103 27 142 -20 -10 -118 -112 60 -43 -72 90 -175 107
4109A07j84J56j8j38L27l92J01%P8j71N4N5Q2q1J95p6qJ13k72K45j53o7L0k5r3
$$ 107 -77 79 61 -77 250 -142 -41 -41 37 -134 -80 -25 57 -24 171 95 87 200 -72 173 20 -47 -17 -42 -135
4134a35J96k77J52J51k85R7K89J11j00n2k83jL86k57n1J42K7k79L7L0L47j59m1
$$ -135 61 -216 -64 87 -198 -101 188 299 199 147 -136 -137 249 -8 -59 83 110 -169 -132 -102 245 86 45
4157D5mN3J76k41pk33L9K22Jj61K18J7o7Qj54J56k29J41Pj44O1N7p7J55o7M1J52
$$ 45 41 94 270 29 22 -211 -172 50 51 -110 108 125 58 66 -88 68 -161 -20 -13 -157 -96 -39 -116 39 -28 13 165
4184A65l3j86j58K83KNm6j48L2K01l6m4k4L9l9oN9Q4j10j81J16j6R4o9N6m9k18
$$ 165 132 -54 -212 71 73 78 32 -116 -84 117 81 37 13 52 13 7 66 150 40 -141 -25 -41 53 -16 40 -9 -227
4211b27L22Q9j24j07r6j10J81R7K26l92LN2K93n5j57k5NK4k2Q6P3r9k2o2m1L21
$$ -227 95 184 60 -47 -143 -253 -72 25 251 -141 -138 -86 207 152 -5 -30 -25 -1 -23 63 136 37 15 -47 -88 233
4237B33l21J48q9J04m8J33j38n4O3k1P6K40k69j18K09m50L40j70K57q5n7P5p6
$$ 233 -88 60 -29 75 27 160 22 -32 31 10 86 326 57 -61 148 -302 38 -132 125 40 -17 58 -18
4260a8J00Ko0LM6l1k26J04lJ63J4m1K3J08k97J37rJ41m6pj0j39M5J06J55l81J55
$$ -18 82 84 24 27 73 42 -184 -80 -83 80 94 53 76 184 -113 24 15 156 110 103 93 -46 -1 105 260 -121 34
4287C4j37J38K11l94K79k0P1l41J39J12j58K08k05O2J84k59K27j2j38j64P9j06
$$ 34 -103 35 246 -148 131 111 182 -159 -20 92 -66 142 -63 -1 183 -76 151 139 1 -163 -84 -190
4309a90J62O0m7q6Q3j42J72P1k23J16O4J73j64M7j86R6j10N4J23j07O8j34K86
$$ -190 -28 32 -15 -101 -18 -160 12 83 -140 -24 40 213 49 96 -90 6 -104 -50 73 -34 34 -100 186
$$ [...]
8191a01
##END NTUPLES=NMR FID
##END=
