##TITLE=1H_Pr Dep-D
 200.13MHz, CDCl3,
 8 sc
 
 12.8.2025
##JCAMPDX= 6.0         $$ Bruker NMR JCAMP-DX V2.0
##DATA TYPE= NMR FID
##DATA CLASS= NTUPLES
##ORIGIN= UXNMR, Bruker Analytische Messtechnik GmbH
##OWNER= pz
$$ XWIN-NMR		Version 3.5
$$ Tue Aug 12 14:39:44 2025 Russian Standard Time (UT+4h)  she@DPX200
##.OBSERVE FREQUENCY= 200.1313
##.OBSERVE NUCLEUS= ^1H
##.DELAY= (6, 6)
##.ACQUISITION MODE= SIMULTANEOUS
##.ACQUISITION SCHEME= undefined
##.AVERAGES= 8
##.DIGITISER RES= 18
##SPECTROMETER/DATA SYSTEM= spect
##.PULSE SEQUENCE= zg30
##.SOLVENT NAME= CDCl3
##.SHIFT REFERENCE= (INTERNAL, CDCl3, 0, 14.3821)
##AUDIT TRAIL= $$ (NUMBER, WHEN, WHO, WHERE, WHAT)
$$ ##TITLE= Audit trail, XWIN-NMR		Version 3.5
$$ ##JCAMPDX= 5.01
$$ ##ORIGIN= Bruker BioSpin GmbH
$$ ##OWNER= she
$$ F:/spectra/data/she/nmr/H-C/1/audita.txt
$$ ##AUDIT TRAIL=  $$ (NUMBER, WHEN, WHO, WHERE, WHAT)
(   1,<2025-08-12 14:38:32.29 +0400>,<she>,<DPX200>,
      <created by zg, POWCHK disabled, PULCHK disabled
       configuration hash MD5:
       00 E9 B6 7A A2 85 ED C7 34 08 36 98 17 FE 4E 26
       data hash MD5: 16K
       0B CA CA 70 99 62 E6 AF CF 4B FC 79 DB 34 3A BC>)
$$ ##END=
$$ 
$$ hash MD5
$$ 7B 4A 0C 9B AF 22 29 80 E5 FD 34 33 1F B8 07 FD
##$RELAX= 
##$RELAX= 
##$RELAX= 
##$RELAX= 
##$RELAX= 
##$RELAX= 
$$ Bruker specific parameters
$$ --------------------------
##$DU= <F:/spectra>
##$EXPNO= 1
##$NAME= <H-C>
##$PROCNO= 1
##$TYPE= <nmr>
##$USER= <she>
##$AMP= (0..31)
100 100 100 100 100 100 100 100 100 100 100 100 100 100 100 100 100 100 
100 100 100 100 100 100 100 100 100 100 100 100 100 100 
##$AQSEQ= 0
##$AQ_mod= 1
##$AUNM= <au_zg>
##$AUTOPOS= <>
##$BF1= 200.13
##$BF2= 200.13
##$BF3= 200.13
##$BF4= 200.13
##$BF5= 200.13
##$BF6= 200.13
##$BF7= 200.13
##$BF8= 200.13
##$BYTORDA= 1
##$CFDGTYP= 0
##$CFRGTYP= 5
##$CHEMSTR= <none>
##$CNST= (0..31)
1 1 145 1 1 1 1 1 1 1 1 1 1 1 1 1 1 1 1 1 1 1 1 1 1 1 1 1 1 1 1 1 
##$CPDPRG= <>
##$CPDPRG1= <>
##$CPDPRG2= <>
##$CPDPRG3= <>
##$CPDPRG4= <mlev>
##$CPDPRG5= <mlev>
##$CPDPRG6= <mlev>
##$CPDPRG7= <mlev>
##$CPDPRG8= <mlev>
##$CPDPRGB= <>
##$CPDPRGT= <>
##$D= (0..31)
0 0.7 0 0 0 0 0 0 0 0 0 0.03 0 0 0 0 0 0 0 0 0 0 0 0 0 0 0 0 0 0 0 0 
##$DATE= 1754995111
##$DBL= (0..7)
120 120 120 120 120 120 120 120 
##$DBP= (0..7)
150 150 150 150 150 150 150 150 
##$DBP07= 0
##$DBPNAM0= <>
##$DBPNAM1= <>
##$DBPNAM2= <>
##$DBPNAM3= <>
##$DBPNAM4= <>
##$DBPNAM5= <>
##$DBPNAM6= <>
##$DBPNAM7= <>
##$DBPOAL= (0..7)
0.5 0.5 0.5 0.5 0.5 0.5 0.5 0.5 
##$DBPOFFS= (0..7)
0 0 0 0 0 0 0 0 
##$DE= 6
##$DECBNUC= <off>
##$DECIM= 32
##$DECNUC= <off>
##$DECSTAT= 4
##$DIGMOD= 1
##$DIGTYP= 9
##$DL= (0..7)
0 120 120 120 120 120 120 120 
##$DP= (0..7)
150 150 150 150 150 150 150 150 
##$DP07= 0
##$DPNAME0= <>
##$DPNAME1= <>
##$DPNAME2= <>
##$DPNAME3= <>
##$DPNAME4= <>
##$DPNAME5= <>
##$DPNAME6= <>
##$DPNAME7= <>
##$DPOAL= (0..7)
0.5 0.5 0.5 0.5 0.5 0.5 0.5 0.5 
##$DPOFFS= (0..7)
0 0 0 0 0 0 0 0 
##$DQDMODE= 0
##$DR= 18
##$DS= 0
##$DSLIST= <SSSSSSSSSSSSSSS>
$$ [...]
##$SUBNAM0= <"">
##$SUBNAM1= <"">
##$SUBNAM2= <"">
##$SUBNAM3= <"">
##$SUBNAM4= <"">
##$SUBNAM5= <"">
##$SUBNAM6= <"">
##$SUBNAM7= <"">
##$SUBNAM8= <"">
##$SUBNAM9= <"">
##$SW= 18.0517328524113
##$SWIBOX= (0..15)
0 0 2 0 0 0 0 0 0 0 0 0 0 0 0 0 
##$SW_h= 3612.71676300578
##$TD= 16384
##$TD0= 1
##$TE= 0
##$TE2= 300
##$TE3= 300
##$TEG= 300
##$TL= (0..7)
0 120 120 120 120 120 120 120 
##$TP= (0..7)
150 150 150 150 150 150 150 150 
##$TP07= 0
##$TPNAME0= <>
##$TPNAME1= <>
##$TPNAME2= <>
##$TPNAME3= <>
##$TPNAME4= <>
##$TPNAME5= <>
##$TPNAME6= <>
##$TPNAME7= <>
##$TPOAL= (0..7)
0.5 0.5 0.5 0.5 0.5 0.5 0.5 0.5 
##$TPOFFS= (0..7)
0 0 0 0 0 0 0 0 
##$TUNHIN= 0
##$TUNHOUT= 0
##$TUNXOUT= 0
##$USERA1= <user>
##$USERA2= <user>
##$USERA3= <user>
##$USERA4= <user>
##$USERA5= <user>
##$V9= 5
##$VALIST= <valist>
##$VCLIST= <CCCCCCCCCCCCCCC>
##$VD= 0
##$VDLIST= <DDDDDDDDDDDDDDD>
##$VPLIST= <PPPPPPPPPPPPPPP>
##$VTLIST= <TTTTTTTTTTTTTTT>
##$WBST= 1024
##$WBSW= 4
##$XGAIN= (0..3)
0 0 0 0 
##$XL= 0
##$YL= 0
##$YMAX_a= 162647
##$YMIN_a= -193718
##$ZGOPTNS= <>
##$ZL1= 120
##$ZL2= 120
##$ZL3= 120
##$ZL4= 120
##$ABSF1= 10
##$ABSF2= 0
##$ABSG= 5
##$ABSL= 3
##$ALPHA= 0
##$AQORDER= 0
##$ASSFAC= 0
##$ASSFACI= 0
##$ASSFACX= 0
##$ASSWID= 0
##$AUNMP= <proc_1d>
##$AZFE= 0.1
##$AZFW= 0.1
##$BCFW= 1
##$BC_mod= 2
##$BYTORDP= 1
##$COROFFS= 0
##$CY= -3
##$DATMOD= 1
##$DC= 2
##$DFILT= <>
##$DTYPP= 0
##$F1P= 0
##$F2P= 0
##$FCOR= 0.5
##$FTSIZE= 0
##$FT_mod= 4
##$GAMMA= 1
##$GB= 0.15
##$INTBC= 1
##$INTSCL= 1
##$ISEN= 128
##$LB= 0.25
##$LEV0= 0
##$LPBIN= 0
##$MAXI= 10000
##$MC2= 0
##$MEAN= 0
##$ME_mod= 0
##$MI= 1.114404
##$NCOEF= 0
##$NC_proc= 0
##$NLEV= 6
##$NOISF1= 3.799351
##$NOISF2= 2.8
##$NSP= 1
##$NTH_PI= 0
##$NZP= 0
##$OFFSET= 14.38212
##$PC= 1
##$PHC0= -1570.311
##$PHC1= 24.99228
##$PH_mod= 1
##$PKNL= yes
##$PPARMOD= 0
##$PSCAL= 0
##$PSIGN= 0
##$REVERSE= no
##$SF= 200.129724274929
##$SI= 16384
##$SIGF1= 3
##$SIGF2= 2
##$SINO= 400
##$SIOLD= 16384
##$SREGLST= <1H.CDCl3>
##$SSB= 0
##$STSI= 0
##$STSR= 0
##$SW_p= 3205.1282051282
##$SYMM= 0
##$S_DEV= 0
##$TDeff= 0
##$TDoff= 0
##$TI= <>
##$TILT= no
##$TM1= 0
##$TM2= 0
##$TOPLEV= 0
##$USERP1= <user>
##$USERP2= <user>
##$USERP3= <user>
##$USERP4= <user>
##$USERP5= <user>
##$WDW= 1
##$XDIM= 8192
##$YMAX_p= 0
##$YMIN_p= 0
$$ End of Bruker specific parameters
$$ ---------------------------------
##NTUPLES= NMR FID
##VAR_NAME=  TIME,          FID/REAL,        FID/IMAG
##SYMBOL=    X,             R,               I
##VAR_TYPE=  INDEPENDENT,   DEPENDENT,       DEPENDENT
##VAR_FORM=  AFFN,          ASDF,            ASDF
##VAR_DIM=   8192,          8192,            8192
##UNITS=     SECONDS,       ARBITRARY UNITS, ARBITRARY UNITS
##FACTOR=    0.0002768,     1,               1
##FIRST=     0,             0,               0
##LAST=      2.2672688,     0,               0
##MIN=       0,             -193718,         0
##MAX=       2.2672688,     162647,          0
$$ Real data points
##PAGE= N=1
##DATA TABLE= (X++(R..R)), XYDATA
$$ [...]
1913B26k55q8K11j00K5j94P3J18J66j69J56j28k43L54m1p4M9k20M06J14m17K6
1935ej50K25l9pK4j90j3j55L85j42l01M08l7Q3J6k53L25j51J83K5l56K5J13j37
1959a24J91k09R7j47K03p9J56j96%L30k09O4n0J17J11m00J58J08J04j10j82k39
1981c06n4K08J30P2J34k21K20k04j01L81l98J16J69k90K07r3P9p7k23J79j17L39
2003A50q4j15k8j08K86m42L39m5K13l10j9L13O7l70k01N60j01j45Kj61K4K86k46
2026a35M32k76j66P6o8j8N29l78J38lk02K25J37j64l54Q0N2l28K55kP8J31k17
2049a78M21j80Q5K10k67K26n2l84O5R2l65K54O2J3R4o5j21K34m9nj44k42K72j17
2073a41K2J47l0j25J83j62M3J75k86j28J58J9K1K4K18R1k38r1n8L3L33l46l2R7
$$ plain form
1913 226 -29 -117 94 -6 19 -175 -102 16 182 13 169 41 -202 152 111 37 86 -134 272 386 -31 -5
1935 -5 -155 70 31 24 48 -142 -155 -310 75 -67 -368 40 3 86 102 -151 174 23 206 231 -125 -100 13 -124
1959 -124 67 -142 -45 -192 11 -68 88 -108 -108 222 13 77 27 144 255 -145 13 121 225 115 -67 -306
1981 -306 -360 -152 -22 50 184 -37 183 -21 -122 259 -139 -23 146 -144 63 -30 49 -28 -251 -72 -189 150
2003 150 66 -49 -77 -185 101 -341 -2 -47 166 -144 -163 150 217 -153 -354 206 105 -40 -38 -199 -175 111 -135
2026 -135 297 21 -145 -69 -137 -155 374 -4 134 131 -71 154 291 127 -227 -147 -95 -423 -168 -170 -92 39 -178
2049 -178 243 63 148 358 91 317 265 -119 -54 38 -327 -73 -11 2 96 31 -90 144 95 90 -54 -296 -24 -141
2073 -141 -119 28 -2 -127 56 -106 -63 112 -174 -302 -144 -125 -104 -80 138 229 -9 -100 -158 -125 208 -138 -170 -73
2097g3j71K25n6j01J87K50m18K42j31J91k07R2m5J09k26N11k04m07J66j2J3l8
2119a03K11k12K21k80k9K29o7n3L32j50j24R4L1j28pn3L21q3k47J94k21L2K35
2142A43j80m9P5K3J40J67m59L07q0K1j20M8k91K44J76j30l17P5K01Qo1K2k34M6
2166b25J73J03m5K24p1k41K0J34N7m9k39J66J43k18J60m67r3K86N1q6K61r8K15
2189A61k60K97Ol52Q0L66j28k09K10m16L58O0j45J52k67k59J10j45OO42m61M93
2211B99O3m55J83K26k56J47k27M7Q7n6l08M06l80K04j9J22J22j14j6k72O2L1L76
2234B72l44R6R4m39L70K50k32k5K8k73L85j69j51j79M5K71j7J50Q7k54l64M92
2256I3J00q2P0k18l1K73k79J84J0j02O1l42K7K73K1m2P2j62J86M4l01K89Q1l34
$$ plain form
2097 -73 -244 -19 -75 -176 11 261 -157 85 -46 145 -62 30 -15 94 -132 379 175 -232 -66 -78 -65 -103
2119 -103 108 -104 117 -163 -192 37 -30 -83 249 99 -25 69 100 -28 -35 -88 233 150 -97 97 -124 -92 143
2142 143 -37 -86 -11 12 152 319 -140 167 87 108 -12 36 -255 -11 165 35 -282 -207 -6 2 -59 -37 -271 -225
2166 -225 -52 51 6 230 159 -82 -62 72 129 80 -159 7 150 -68 92 -375 -468 -182 -131 -217 44 -54 161
2189 161 -99 198 204 -148 -68 298 170 -39 171 -245 113 173 28 180 -87 -346 -236 -381 -375 267 -194 299
2211 299 362 -93 90 316 60 207 -20 27 114 58 -250 156 -224 -20 -39 83 205 91 75 -197 -135 -104 272
2234 272 -72 24 118 -321 49 299 67 42 70 -203 182 13 -138 -317 -272 -1 -18 132 219 -35 -399 93
2256 93 193 111 181 -37 -68 205 -74 110 120 18 79 -263 -236 37 58 16 88 -74 112 156 -145 144 225 -109
2280a09J75Pm62M02k05J30KL03k50k0P1mJ50l14JJ84j60L10j79j88K38j11J26
2303I7J64j73k64J76K2P5j00J31j12J34r3K25m40R9L6k34N32k32l03K76j28M5
2325f7J95k11K9j2p6K39j63j2L98k10k69J51j91L81j05l50jK58k40L07R2Ml13
2348a66L74k71q4J01K35j42J29p8K08l69L34j68l87J19j04L91k59J52p3P1l9K
2370b4J92o0j49J80k20J70j54M06k69l13J71J46%l64J45J24J30k3J5R4J82j36
2392B43r4j99K41jj44J12no6j42N8l44L50j69j86N29j74j80J64Q9k13J60N3J00
2415A82J35m38L07j53K24j93j17J86j53n8j44J94j63K78j53m5nK23q9J1Nj3m9
2438b8J31k85L15j24K18j79k83L51k90j47L45k58J63P1k84M16j94j8K37j80q3
$$ plain form
2280 -109 66 73 -389 13 -192 -62 -60 243 -7 -27 44 40 190 -124 -123 61 -99 211 32 -156 82 -29 97
2303 97 261 88 -176 0 22 97 -3 128 16 150 57 282 -158 -59 -23 -257 275 43 -260 16 -112 -67
2325 -67 128 -83 -54 -66 -142 97 -66 -78 320 110 -159 -8 -199 182 77 -273 -274 -16 -256 51 143 147 -166
2348 -166 208 -63 -147 -46 189 47 176 98 306 -63 271 103 -284 -165 -269 122 -137 15 -58 13 -26 -24
2370 -24 168 108 -41 139 -81 89 -65 341 72 -241 -70 76 76 -288 -143 -19 111 88 103 197 379 243
2392 243 149 -50 191 190 46 158 153 87 -55 3 -341 9 -160 -346 183 9 -171 -7 82 -131 29 82 182
2415 182 317 -121 186 33 257 64 -53 133 -20 -78 -222 -28 -191 87 -66 -111 -116 107 18 29 34 21 -28
2438 -28 103 -182 133 9 227 48 -235 116 -174 -321 24 -234 -71 0 -284 132 -62 -80 157 -23 -106
2459a06L98m18K92J48l40O2j32Q4oJ48n9j79%R6J45j7J09j43j17L19l48P1J65
2482A72l22o2K22j81O3L93n06M12K3l06K93m91l6L24M4r7K85n07N09k44j61J64
2504iq6p4K59K57k50O2j47J8J37j23j09J51k57L06k52K12Q7k53n0J27k87J28L39
2527A86P7j81P7l8O2J35n30K93k40K06J52l33J82k03L83l67J35j40K88J17l73
2548a12L64j58j41J41m8j79J04n3J11kj42M05j12k99P1k16K50j8Qk04K79j83N2
2571h2K22l13K1N43o38M95l35K96K28m86J3p4q7L7L60k01%j62j58K42J73j48J48
2594I4j54L20l90K52k5O9k12M6J01l22L78k23l6J03k38J65J1J04P7r2q1L10m88
2617b31J41J25P5J27q4r4J9p9j23J31k19M7P2P4k38L24lk23L14pj49J78o8R5j38
$$ plain form
2459 -106 292 -126 166 314 -26 36 -96 -12 -18 130 71 -108 -108 -12 133 116 225 82 -35 284 -64 7 172
2482 172 -150 -212 10 -171 -108 285 -221 191 214 -92 201 -290 -326 -2 42 -55 230 -277 232 -12 -173 -9
2504 -9 -95 -169 90 347 97 159 12 30 167 44 -65 86 -171 135 -117 95 182 -71 -121 6 -281 -153 186
2527 186 263 82 159 121 183 318 -212 81 -159 47 199 -134 48 -155 228 -139 -4 -144 144 261 -112
2548 -112 252 94 -47 94 46 -133 -29 -82 29 27 -115 290 178 -121 -50 -266 -16 -34 -26 -230 49 -134 -82
2571 -82 140 -173 -152 391 -247 248 -87 209 437 -49 -36 -110 -197 -160 200 -1 -1 -163 -321 -79 94 -54 94
2594 94 -60 260 -130 122 97 166 -46 0 101 -221 157 -66 -102 1 -237 -72 -61 43 120 28 -53 257 -231
2617 -231 -90 35 110 237 153 59 78 -1 -124 7 -212 -165 -93 -19 -257 67 64 -159 155 148 -1 177 109 204 66
2642F6r0j5k35J01L09l00J07j78J71M5K55l50j06J41J76K11k88J00K24m10J83
2663A17l33J34K00j86r2L5j23j51L14O7k42K80J6j88QL30K5%j2L2ql27J16j35
2687a23K34M3l96J87k32j22M36p6j99J1K08K00p2J23O4l75J43K24k64j1K71j97
2709G7m0j00l98O94k8k86K43q8q0J90m58o4L58j2j19L60j99p1k28K30L9M3l66
2732c03M60k87rM10n02J62m4J44R0j60j10K39j86jJ38k92K11J63j19k28J58O0
2754fj79L03j20j5j14q4L04K0Pk04j93J09J54j65Q6J49o7P5k41O6J6J4J42o8j
2779a2K8m1r3K59j17K07k50K4j79K74m64M75j10j00J5M73n61K08J91j37N1o2j49
2802g0J68j5r8K39k71j64K72o5k10J33J40q4K9k63K60k02L61j55J32j88M06l53
$$ plain form
2642 66 -24 -39 -274 -173 136 -164 -57 -235 -64 -19 236 -114 -220 -79 97 308 20 120 344 -66 117
2663 117 -216 -82 118 -68 -160 -125 -248 -399 -85 -18 -260 20 36 -152 -144 186 211 211 199 231 223 -104 12 -123
2687 -123 111 154 -242 -55 -287 -409 27 -49 -248 -237 -29 171 99 222 286 -89 54 278 14 3 274 77
2709 77 37 -63 -461 233 205 -81 162 74 -6 184 -274 -338 20 8 -111 249 50 -21 -249 -19 20 63 -303
2732 -303 157 -130 -139 271 -231 -69 -113 31 121 -39 -149 90 -96 -97 41 -251 -40 123 4 -224 -66 -6
2754 -6 -185 118 -2 -17 -131 -215 89 109 116 -88 -281 -172 -18 -183 -97 52 -15 60 -181 -115 -99 -85 57 -11 -12
2779 -12 16 -25 -118 141 24 231 -19 5 -174 100 -364 111 1 -99 -84 389 -172 36 227 90 141 79 -70
2802 -70 98 83 -15 224 -47 -211 61 -4 -214 -81 59 -25 4 -259 1 -201 160 5 137 -51 355 2
2824BK11k47K06j51l29L0K96k47J95J82m44O16m78j28M24q9J72j99J42j31l18
2845b85L10J23%l64J55j15O4J0O2p0q2P3J67j53J33J96m40J78L81j81o5J8j42
2868b7j23n1k37L08J54k31J17K15m68K97K8M2QL06m55L29j49J11Rl05K55j77j45
2891a89J09j2m3k2K5l5J09q1j06L92l52R8l9K59M5k41J11m5l50L03J79l61L59
2914A13k39L6Q4q2Q0L74m69P5K6j74K12O8j57J40j77N7L32n42L35J06k14M0Lj5
2938A2j33j20L09l41L88k6J86k00k01J51Ml03K42o7L14k14j31M14k34p0k37L25
2960F8k70J68M9p4n0o8J88N4om4p0J49n6o0J18o8j46m7K32p3M0O1k03J21j46K27
2986I4j51J96k70k0no1M67n55M69p9n8N1Lq1P2k24L30l10K26P3l54J99j22QJ52
$$ plain form
2824 2 213 -34 172 21 -308 -278 18 -229 -34 148 -296 320 -158 -286 138 49 221 22 164 33 -285
2845 -285 25 148 148 -216 -61 -176 -112 -102 -40 -110 -192 -119 48 -105 28 224 -216 -38 343 162 97 115 -27
2868 -27 -150 -201 -438 -130 24 -207 -90 125 -343 -46 -18 24 32 338 -117 212 63 174 183 -122 133 -44 -189
2891 -189 -80 -92 -135 -157 -132 -167 -58 -139 -245 147 -205 -107 -146 113 158 -83 28 -17 -367 -64 115 -246 113
2914 113 -126 -90 -6 -88 -8 366 -103 -28 -2 -176 36 104 -53 87 -90 -33 299 -243 92 198 -16 24 27 12
2938 12 -121 -241 68 -273 115 89 275 75 -126 25 29 -274 -32 -99 215 1 -130 284 50 -20 -257 68
2960 68 -202 -34 15 -59 -109 -177 11 65 59 15 -55 94 38 -22 96 28 -118 -165 67 -6 34 95 -108 13 -133 94
2986 94 -57 139 -131 -151 -156 -217 250 -305 164 85 27 78 81 0 72 -152 178 -132 94 167 -187 12 -110 -102 50
3011E0j27l1J5k2O1L0K14j71N6L8j63n8K79n3K12j73r0R3k33K40m06j0L26j00
3035b3l78O65l36P4J32p9k73L40k23J41p0L6j43M29m54L17j86j83K43k61J78P
3057d7J69n3J23l04K63J3j7r3J07j27k5p2K71j96J02m8r2j26J09j95jL19k48J92
3081B4r7M4k0J53j19p7M15n6j85q1R8J45n36L38K95l88q3J12JK8k8M0P7l6P7j42
3107aq4N9j73L23R4l21K84k81J20j23J77j91k1L7L8k3M0%J28j0J1J29j22j22j21
3132a53PK57K7Rj60J00Q8k97J16j58K18L61m51J64k45NQ5j71L40j19o9n4J88j42
3156e4J77k77j25L67n4J47o4j94L67k54p6O3J16J2p1j76J25J94j36M8j9j93J39
3179F2K33k31j59MN5qJ96K07l15k11K00k10l3K83j09k52r9J33L65j65o1M5R5K1
$$ plain form
3011 50 -77 -108 -93 -115 -54 -24 190 19 75 113 -50 -108 171 118 330 157 67 160 -73 167 -239 -249 77 -23
3035 -23 -401 264 -72 2 134 55 -218 122 -101 40 -30 6 -137 292 -162 155 -31 -214 29 -232 -54 -47
3057 -47 122 69 192 -112 151 164 147 54 161 34 9 -63 208 12 114 66 -26 -152 -43 -238 -239 80 -168 24
3081 24 -73 -29 -49 104 -15 -92 323 267 82 1 99 244 -292 46 341 -47 -130 -18 -17 11 -17 23 100 64 141 -1
3107 -1 -85 -26 -199 124 218 -103 181 -100 20 -103 74 -117 -138 -101 -63 -86 -46 -46 82 72 83 212 90 -32 -153
3132 -153 -146 111 138 147 -13 87 175 -122 -6 -164 54 415 -36 128 -117 -112 -27 -198 142 23 -46 -100 88 -54
3156 -54 123 -154 -279 88 34 181 117 -77 290 36 -40 23 139 151 80 -96 29 223 87 135 116 -77 62
3179 62 295 64 -95 -91 -36 -44 152 359 44 -167 33 -177 -210 73 -36 -288 -387 -254 111 -54 -115 -70 25 46
3203D6j29j15K35l8J2l36O56o24R3K81j17q8J72j27L20l01J5K59q1l1J40O1m06
3226a03J61k01O9L20n12K01K0j99M96l47k80L81j89J68K82l45L35Q5J3k11K0m37
3248b73M46l17J50j27O7L3J38l11L8j46K1O08m23R7R3k95KK87l24K71l36K44K97
3271B40o2j36j91K8Q8L03j37K6k63J81Nj94J86o4m5j22J67J0J37m06L23j70J0
3294h6l34O0L53j59o9K86p9M7j95J35J85M4J1oQNj63O3O2k50N4j16m4K56l26Q4
3320a74L36O3l73lJ63r0O3P4j53q8K26j58K21kk11O3J66J40m83L29j71k15Q4J79
3344a4O8qn4r2K80j23m08K25J81j79K25j06j6N7k56K57j14Oj43K97M1q9j44J96
3368H7j23J60j3o4k05N0K00n7J55k00K96k01k5o2j05J67j27J38J83l43L12q1n
$$ plain form
3203 46 -83 -198 37 -1 11 -325 331 -293 -200 81 -36 -124 48 -79 241 -60 -45 214 133 102 242 303 -103
3226 -103 58 -143 -74 246 -266 -65 -45 -244 252 -95 -375 6 -183 -15 267 -78 257 342 355 144 164 -273
3248 -273 173 -144 6 -121 -54 -21 117 -194 -156 -302 -281 327 -96 1 94 -201 -199 88 -236 35 -301 -57 240
3271 240 178 42 -149 -121 -33 270 133 159 -104 77 82 -112 74 10 -35 -157 10 20 157 -249 74 -96 -86
3294 -86 -420 -360 -7 -166 -235 51 -28 19 -176 -41 144 188 199 193 201 206 43 106 168 -82 -28 -144 -188 68 -258 -174
3320 -174 162 225 -148 -151 12 -78 -15 59 -94 -182 44 -114 107 105 -106 -43 123 263 -220 109 -62 -277 -193 -14
3344 -14 54 46 -8 -100 180 57 -351 -126 55 -124 101 -5 -21 36 -220 37 -77 -71 -214 83 124 35 -109 87
3368 87 -36 124 111 47 -158 -108 92 35 190 -10 286 85 60 -2 -107 60 -67 71 254 -89 223 142 137
3391A37K2J00l82J65k9j05J58j89Lk7K87k00K43l45J79r3J47k8p7j80J10o4L83
3414B15l05q6J86l37J72J60k9J72l4K35K0l85J77j20l17L01j37K37j04l98L89
3435A2j71M04l14J48j26r3R6j64N01j06k04P7P3l24J69J48j85J53k76J78L12m07
3457i9J72k40K6Q8j42j8L34n1jNnM0J56m53J96J0n5J47l30J77K10k97L18l10p1
3482a93J70r2K10n5J87l19P0N9K24k87j14L3J39K06l64r3L00k87J81j9j71K81
3504F6j42J58j86K5J20j27m4k6L21k7Mjl73L41k21L00j54o0O8k22J35q7oj0K4
3529a24m2K25O1q6q7J7J12k38K0O5K0n1J82l12J42K54j42j83N8K32R1j03k78K67
3553A00q1QJ61l95L34j90J50Q0m0k40j17K32o0K0j50J73J24k34j99L31K16l17
$$ plain form
3391 137 159 259 -123 42 13 -92 66 -123 -120 -147 140 -60 183 -162 17 -76 71 43 -34 -214 -104 -168 215
3414 215 -90 -176 10 -327 -155 5 -24 148 114 349 369 -16 161 41 -276 25 -112 125 21 -377 12
3435 12 -159 245 -69 79 -47 -140 -44 -208 293 187 -17 60 133 -191 -22 126 -59 94 -182 -4 308 -99
3457 -99 73 -167 -141 -53 -195 -213 121 70 69 74 69 109 265 -188 8 18 -37 110 -220 -43 167 -130 188 -122 -193
3482 -193 -23 -115 95 40 227 -92 -22 37 261 -26 -140 -107 32 238 -126 -219 81 -206 -25 -44 -215 66
3504 66 -76 82 -104 -79 41 -86 -130 -156 165 138 142 141 -232 109 -112 188 34 -26 42 -180 -45 -132 -138 -148 -124
3529 -124 -166 59 120 34 -53 -36 76 -162 -142 -77 -57 -108 74 -238 -96 158 16 -167 -109 123 214 111 -167 100
3553 100 19 27 188 -207 127 -63 87 167 127 -113 -230 2 -58 -38 -188 -15 109 -125 -324 7 223 -94
3575i4l1J33p3l61K33Q0J92L5L5j98j30L7N5K21k52K49k18J41k07M5K41j50j65
3598a82M55j12Qj57j31K04j47L4K4Q8J46l04N7J24l53J21K77j50r6J21j09K29
3620A47j95lo1K03m0j69K16M9k7l24J97Q6k62K58k44m5K17J70k31K05j01P0j22
3643fk2k8j46K28J01j10J74K8k73j0L6M5Nk15K71j77m5j85L49p0K30j58k99J71
3667a06K66k37L96k49k24J33M3JQ7k15m38P34l4j63N6J89m77L46q9J81j5j07J0
3690H8j00j5K58l0k22q4J05j70K21l05R2J75j92J83j72K43l17k3K04J4R6k7J45
3713A67Q8j87M8k22J63k60M17l0j72r7J56j23m4K46K9k93K33j02L08l87L46k50
3735C4j32J58j46J29q3J1m7J52k88j30M08k66K54K4l34L09r5Q6q8K8l4K55j65
$$ plain form
3575 -94 -125 8 -65 -426 -193 -113 79 114 149 -49 -179 -142 -87 134 -118 131 -87 54 -153 -108 133 -17 -182
3598 -182 273 161 169 12 -119 85 -62 -28 -4 84 230 -74 -17 107 -246 -125 152 2 -94 27 -82 147
3620 147 -48 -51 -112 91 51 -118 98 147 120 -204 -7 79 -183 75 -169 -214 3 173 -58 147 46 116 -6
3643 -6 -28 -56 -202 26 127 17 191 219 -54 -64 -28 17 22 -193 78 -99 -144 -329 20 -50 180 22 -277 -106
3667 -106 160 -77 319 70 -154 -21 22 23 110 -105 -543 191 157 -6 50 239 -238 108 19 200 185 78 88
3690 88 -12 -27 231 201 -21 -105 0 -170 51 -254 -162 13 -179 4 -168 75 -242 -265 -61 -47 49 22 167
3713 167 255 68 116 -106 57 -203 214 184 12 -85 71 -52 -96 150 179 -114 119 17 325 -62 284 34
3735 34 -98 60 -86 43 -40 -29 -76 76 -212 -342 66 -200 54 78 -256 53 -42 44 -44 -16 -50 205 40
3758D0m2k3J46J07k69K32l09j17J18L13o0j92J8K64l67J28k68L68k02q0K89N4
3780A48j25n8k85K28L2o5K77q4q6J71nj06l0j67J12K43k28j85J08L59j36k54J48
3803A2J88k44N6j9L09j09m36J78m1Q3L9Qk5j23J77j10k16J93j09L40N4j07N0k17
3827f9J32O1j90K01J0l19L40j64k24J99QJ06q4n7j74M0J34OK4o1O0Q7j61L53j87
3852G1p1J54j31p8N7j5l2J95j51m3J34k42J3K47p4k6J21k35J21p6L47j06j89j89
3876a98J67oq4nJ30pp3L33k06J3j81O7J0K80Ml52K7N3j4p9P8r4L72qj79l0K52
3903B70j49q7K01k12K41m49L05j76j07J24lK41rm25M66j72J06j23Q6j29j28L87
3925B58l48k2J42J0J43j23l8k4p3k7K27l28J76n7K02j1j4M8j64nk81L63j7n8l0
$$ plain form
3758 40 -2 -25 121 228 -41 191 -118 -235 -117 196 136 -56 -38 226 -141 -13 -281 87 -115 -195 94 148
3780 148 23 -35 -320 -92 -60 -125 152 68 -18 153 148 42 12 -155 -43 200 -28 -213 -105 254 118 -136 12
3803 12 200 -44 12 -7 302 193 -243 -65 -106 -23 16 24 -1 -124 53 -57 -273 -80 -189 151 205 98 148 -69
3827 -69 63 124 -66 135 145 -174 166 2 -222 -23 -15 91 7 -50 -224 -184 -50 -44 -20 -81 -21 66 -95 258 71
3852 71 0 154 23 -55 2 -13 -45 150 -1 -44 90 -152 -139 108 34 8 129 -106 15 -61 286 180 -9 -198
3876 -198 -31 -37 -121 -126 4 -3 -76 257 51 64 -117 -50 -40 240 244 -108 -81 -28 -42 -121 -43 -137 235 227 48 18 270
3903 270 121 34 235 23 264 -185 120 -56 -163 -39 -42 199 190 -235 231 59 165 42 128 -1 -129 258
3925 258 -90 -112 30 40 183 60 22 -2 -75 -102 125 -203 -27 -84 118 107 93 141 -23 -28 -309 54 37 -21 -51
3950e1J02MN1q2R8N8k47Q1M0l6l8l3J68k18K06p8o5R3q5O0o2k11J32K73l24K01
3976C7k12p6L26q8j30pL03O6l17j02M46j51r7m6j29K13R6j43K9J6k03J89L2j36
4000h4R2L33n65L3K41q3j21J25p1p5L03j6M1l08l9L54j33P3J24l54L13j97L1k44
4024b27L88k91j06N08j75k21N21k85j42J56k53O3R6K8k97K69k%k7J06o3l41J37
4047a58J78Qj1J69l92J41K1j8K39k06Nl70L61o5q7K77j89J02q5N8l0J24M2M5j90
4072c1j41J39k78M55j38O1n8q2L57l13k50K56l17O9J01K42k44J16L7J29j99R0
4094APj46kJ06J50j09j66J08l9k69J83J11j1J47l46L12j87R1k9JJ39J94k76R8
4118F8L9l23K10J12j96pr2M4L98k65O7J21j85k32K67j79J62k66J35M62q6j17q9
$$ plain form
3950 -51 51 55 106 24 122 180 -67 14 54 18 -20 -53 115 -103 103 25 -40 53 -32 28 -34 -245 -113 160 -164 37
3976 37 -175 -251 75 -13 -143 -150 153 219 -98 -200 246 95 -2 -48 -177 36 132 -11 18 34 -169 20 52 -84
4000 -84 8 341 -224 -191 50 -33 -154 -29 -100 -175 128 112 153 -155 -194 160 27 100 224 -130 183 -14 17 -227
4024 -227 161 -130 -236 272 97 -124 397 112 -30 126 -127 -64 32 60 -237 32 30 30 3 109 46 -295 -158
4047 -158 20 28 17 186 -206 -65 -44 -62 177 -29 -24 -394 -33 -98 -185 92 -97 5 -80 -22 -52 72 114 159 -31
4072 -31 -172 -33 -311 144 6 67 9 -73 284 -29 -279 -23 -340 -271 -170 72 -172 -56 -19 110 -89 1
4094 1 8 -138 -140 -34 116 7 -159 -51 -90 -359 -176 -65 -76 71 -275 37 -150 -59 -88 -87 52 246 -30 68
4118 68 107 -216 -6 106 -90 -97 -189 -145 253 -12 55 176 -9 -241 26 -153 9 -257 -122 340 254 137 48
4141D8R0k67K26n5k75P1J96O5j23j63K44j42j45J92K24k33q3R2L9j32J32J21j92
4164g0O8r7J76Q2k05J25k41K17p9J13n9J73k05m6K53k04m1P9QL50l42m4J5q2l8
4189i4N7J20N2j18l6Q3O3p0m6r8Q1M4m2R6j06r9R4J58j94K78j82J12j00J68k33
4214a2r4J5J73l78J64N0l19L00K04m9j49OJ50j82N0Pm4J39j86L4L0J43K0j19J79
4239A32o0j29L51n99N53k67j43K82k96M4j46M36l16M9plo4Q4j9O0j51L45l15K75
4263I6j30J60k55J96l6pJ3o1J95j45n4l3J17J01k48O1M4R9p9j09J82j3J0k47K11
4288F8n8Q7L7n6J57n21K41K10l82L35q0N8j00K61k53m9L3j0q4M9J06K58k83J98
4312B22l98R6J53r0M0l2L06m43L46j74J69k09k33M12l18MK8P7m6L13l09J22j01
$$ plain form
4141 48 138 -129 97 42 -233 -162 34 99 -24 -187 57 -85 -230 -38 186 -47 -130 -38 1 -131 1 122 -70
4164 -70 -2 -99 77 159 -46 79 -162 55 -24 89 30 203 -2 -48 205 1 -40 39 47 397 55 11 26 -56 -94
4189 -94 -37 83 135 17 -19 64 127 57 11 -87 -6 38 -4 92 -14 -113 -19 139 -55 223 41 153 53 221 -12
4214 -12 -106 -91 82 -296 -132 -82 -401 -101 103 54 -95 -89 61 -121 -71 -64 -108 31 -155 -121 -91 52 72 -47 132
4239 132 72 -57 294 -305 248 -19 -162 120 -176 -132 -278 158 -158 -109 -116 -119 -183 -99 -118 -58 -209 136 -179 96
4263 96 -34 126 -129 67 31 24 37 -24 171 26 -28 -61 56 157 -91 -30 14 113 34 -75 107 94 104 -143 68
4288 68 10 97 134 78 235 -286 -45 165 -217 118 38 96 -4 257 4 -45 -12 -22 -106 -57 49 307 24 222
4312 222 -176 -80 73 -17 23 -9 297 -146 200 26 195 -14 -247 165 -153 -149 -121 -44 -90 223 -86 36 -65
4335f5J59k57L05Q2k76q8j9K11k63J30K65k68J65k86j1K74j30L00k80Q8j01J36
4357G1R6pl46K73k02J44L10n06Q9j59L92l07K52l18O7L48k99J31j64J46K62j92
4379H1j61j34O9J74j53p9J43L5r1J31q4r1M71k20j72J19J31j45k42P4J81J62m29
4402b30K64K9M3k08L03j70m4M9K0N3J25j90j09j05K59j20J02j67J32Q3j82Q0O7
4425H4k22J05l7O0oj15J9K23l27L67m4m8j51j42M45k17Q6j11q0J0j46M58l67N4
4449a02J76m9p3J06k5k17K61l68L28m2j24J26k32M07l25P3k0j84K98l49K56J62
4471H3l86N71j94j10J37j62K80l58K05k2kn5q9m8L35k38J49j8J39l45l7K51N2
4494A38L2o24M74o0J06k06m6NK2J0J86O6q3R9l24K14q6K11m4l59L56k39Q7J79
$$ plain form
4335 -65 94 -163 142 224 -52 -140 -159 52 -211 -81 184 -84 81 -205 -216 58 -72 228 -52 36 -65 71
4357 71 167 160 -186 87 -115 29 339 -167 -78 -237 155 -152 100 -218 -151 197 -102 29 -135 11 273 81
4379 81 -80 -214 -145 29 -124 -203 -60 -25 -116 15 -69 -160 311 91 -81 38 169 24 -218 -144 37 199 -230
4402 -230 34 63 106 -102 201 31 -13 36 56 109 234 44 -65 -170 89 -31 71 -96 36 119 -63 17 84
4425 84 -138 -33 -70 -10 -16 -131 -112 111 -216 151 107 59 -92 -234 211 -6 80 -31 -111 -101 -247 211 -156 -102
4449 -102 74 25 -48 58 33 -184 77 -291 37 -5 -129 -3 -235 172 -153 -80 -100 -284 14 -335 -79 83
4471 83 -303 268 74 -36 101 -61 219 -139 66 44 42 -13 -102 -150 185 -53 96 78 217 -128 -165 86 138
4494 138 170 -454 20 -40 66 -140 -186 -181 -159 -149 37 103 20 119 -205 9 -77 134 90 -269 87 -152 -65 114
4518A14k45K84k05K5j8j02K75l62K95j51M0n7K16l4m4O5K5j72k5n3K09K8Kq7k15
4543a92J80oK54l53k13J20O1J42j3m4P4L4j13O0p5J53n8J8Pj74j2J81M2r2K18
4568A99l02K15r2j60R4J50j21k5J12O7j55j49m9M35l02K70k56P1j24N51n36K09
4590A02k51J78r3LP0j51J23J26m8K2l81N01l93K12j12J06O4l7O9pK1k92K84l72
4614b56K63N9q6J16k52p3J23J60N4k76l0j1K22m6L2K69m59Q7J09k86N82j83j51
4637c3l45J61J06K19Q0k19J61m9l15J62K11k08J34l28n1M58k15O1P8Q0k20J77
4659A05j34N3J41k84J95l25J43l6K1K35l67L19J17j97j3j45K08l1O8j07J82j57
4681ik12K25j76K97j99J93j30L05k82n3K54l52M91o31M76p5j96L53m35K11l19
$$ plain form
4518 114 -131 153 -52 -27 -45 -147 128 -234 61 -90 -50 -107 109 75 31 96 121 -51 -76 -129 80 108 110 23 -192
4543 -192 -12 -18 236 -117 -330 -210 -149 -7 -20 -64 10 44 -69 -9 -84 69 11 29 36 -138 -150 31 73 -19 199
4568 199 -103 112 20 -140 -46 104 -17 -42 70 137 -18 -167 -216 219 -83 187 -69 2 -122 429 -107 102
4590 102 -149 29 -64 -61 9 -142 -19 107 59 81 -300 201 -192 20 -92 14 78 41 110 103 124 -168 116 -256
4614 -256 7 66 -20 96 -156 -229 -106 54 108 -168 -198 -209 13 -33 -1 268 -191 -104 5 -281 301 118 -33
4637 -33 -378 -217 -111 108 188 -31 130 81 -234 -72 139 -69 65 -263 -314 144 -71 -10 68 148 -72 105
4659 105 -29 24 165 -119 76 -249 -106 -142 -121 114 -253 66 183 -14 -27 -172 36 5 73 -34 148 -9
4681 -9 -221 4 -172 125 -74 119 -11 294 12 -41 213 -139 352 -279 197 122 -74 279 -156 55 -264
4702b64K54N2O1j50O3J17j99J44l44J71J86j44K78J8q0j35m0mO2j08K28k90K71
4725A47p3j06L2J15l08J27J34j02J59j13jJ2K6M6r1j96L05j88J99m28M05J12l50
4748a37J39N6l2j25L66k03r9O9J15l17K64j54K12n0R5k68J52k2p4j72K66p3j88
4771a80M71l37J95l24K52l55K04K02l15K26p7j41Q3K74m8l16J73R7l08J32K94
4792B02j06N3j03l24L92j5j53l3Q5j00K8K92l74j10N32k33M5m7L5p1Pl22M40k48
4816a28K47j07m7J79l12j1J29R2m3j60J24l08J69K69j78N3J91Mj93P2j32K45j89
4839c4K12l5j35k6k9K59j95p3L07l84M56m03K08m6j95K81k49J70o8L29l40Q4j21
4862b7j64J59j96K63J41k21L6m2J18m1k92L73l2n3k5K7K3L13l42J06N5k24J58
$$ plain form
4702 -264 -10 42 103 -47 16 133 -66 78 -266 -95 91 -53 225 243 163 28 -12 -16 46 -62 166 -124 147
4725 147 74 -32 0 115 -193 -66 68 -34 125 12 11 23 49 95 4 -192 113 -75 124 -304 101 213 -137
4748 -137 2 58 26 -99 267 64 -35 34 149 -168 96 -58 154 104 199 -69 83 61 -13 -185 81 8 -180
4771 -180 291 -46 149 -175 77 -278 -74 128 -187 39 -38 -179 -96 178 130 -186 -13 84 -224 -92 202
4792 202 96 149 46 -278 114 99 -54 -87 -2 -102 -74 218 -156 -266 266 33 78 31 66 -5 2 -320 120 -128
4816 -128 119 12 -35 144 -168 -179 -50 42 -1 -161 -37 -345 -176 93 -85 -32 159 163 -30 42 -90 155 -34
4839 -34 178 143 8 -18 -47 212 17 -56 251 -133 323 -80 128 82 -113 168 -81 89 21 350 10 94 -27
4862 -27 -191 -32 -228 35 176 -45 -9 -51 67 26 -266 107 75 22 -3 24 47 360 18 124 179 -45 113
4885A13r7l1K2R2j73k09M43K20l84q8j7n7K83l00K40o9pK2J6m5J2r6m5P2L9K02
4911A58j05%K90l87R1j49n8J49j75K60%r7R2J95k15j05J07j67k0K12j30j7L6n8
4935i3K1K73p6rn3J06M9j64p3K6l5M3l03k8K89j6o3L7o6P5Q0pJ8p8K2K25j3l25
4963a38K60j65m7QL28k28J6J80k57j16J22k0J20n3L6k71Q2j32L97j37O7OmJ41
4987A95p8R1j61l03K80ok89O27j73l58k1L77j23j75K12j41J20L7J9k54j7K7J26
5010A2P7j68n2o5L16J64l70n9L39j1k7K4P6L3k75j05j64L35N6o3K12q6J38m10
5034g3j1J09j67L68k15r2R6Q8l4j81j76J52J06K0k4J74n4K89n54L14Q3k65R4K5
5058G2L14m66J6J21k1N9k36o7K46k3Q0j16J38j49K59k65j05O19l92q6k14Q0j72
$$ plain form
4885 113 16 -15 7 99 -74 -283 160 380 -4 -92 -109 -166 117 -183 57 -12 -19 3 19 -26 -14 -110 -155 -83 -44 158
4911 158 53 53 343 -44 47 -102 -160 -11 -186 74 74 -23 69 264 49 -56 51 -116 -136 76 -54 -71 -35 -93
4935 -93 -72 201 125 116 63 169 218 54 -19 7 -28 15 -288 -316 -27 -43 -106 -69 -135 -60 20 13 31 -47 -25 200 187 -138
4963 -138 122 -43 -90 -82 246 18 34 214 -43 -159 -37 -57 63 10 46 -225 -143 -275 122 -15 52 58 54 195
4987 195 117 208 47 -256 24 18 -271 356 183 -175 -196 181 58 -117 95 -46 74 111 130 -124 -141 -114 12
5010 12 89 -79 -131 -196 120 284 -86 -145 194 183 156 180 256 289 14 -91 -255 80 136 73 285 199 337 -73
5034 -73 -84 25 -142 226 11 -81 15 103 69 -112 -288 -136 -30 -10 -34 140 86 375 -179 135 218 -47 47 72
5058 72 386 -80 -64 57 36 95 -141 -208 38 15 95 -21 117 -32 227 -38 -143 476 84 -2 -216 -136 -308
5081c08O63k64k8m7m1N4k63J30J60j85J15k47L46Lk3J3m6j64J40K08j43j81o7
5104a75K07l8k1Nq1J66P0j7j77J92j44Q4m74L37K43l46l1K30N2m05L63k52j03
5127c15L27O0k85K14j32J38j9O5j9RJ56l74J92m47M34K90m47L62l70K95l42K22
5149A4j17J35j00J64p4j16K4pL70j51L4j01O7j02k04L93j18k11k30L49k37K19
5171AL0J26pj66k69L23m4J8J49l50K04L4j06O5j31K54N8k58o9J7J60j64O4j52
5195b13N9Q3J7n0J25R4j72j67K23J4J60j53j51L5K25J14k73L0j95mj1K79J90r2
5219A67k73J41k6j08J19r4P0J74k76j22M01r3k62J65n0P9rj64J64n1K6J07k11
5242a26p5J26J21N4J04o3l23J77j19P0K35j15q2k1m6l9K4r2o8L92r3J72k79K81
$$ plain form
5081 -308 355 91 63 16 -25 29 -234 -104 56 -129 -14 -261 85 88 65 78 32 -132 8 216 73 -108 -175
5104 -175 32 -6 -27 -22 -103 63 133 116 -61 131 -13 71 -403 -66 177 -169 -200 30 82 -323 40 -212 -315
5127 -315 12 72 -213 1 -131 7 -12 53 34 43 199 -175 17 -430 4 294 -153 209 -161 134 -208 14
5149 14 -103 32 -68 96 22 -94 -70 -77 293 142 176 75 142 40 -164 229 111 -100 -330 19 -218 1
5171 1 31 157 150 -16 -285 38 -6 12 161 -189 15 49 -57 8 -123 131 189 -69 -138 -121 39 -125 -61 -213
5195 -213 -154 -71 -54 -104 21 115 -57 -224 -1 13 173 20 -131 -96 129 243 -30 0 -195 -199 -210 69 259 167
5219 167 -106 35 9 -99 20 -74 -4 170 -106 -228 173 80 -182 -17 -67 12 3 -161 3 -48 -22 85 -126
5242 -126 -201 -75 46 100 204 141 -182 -5 -124 -54 181 66 -16 -37 -83 -122 -98 -190 -258 134 41 213 -66 215
5266B15k84J68QJ26j67j99r9K95J37j10R5%l66lJ42R5K80l59P6l23L46j47P1l4
5290c7k29K91K4J25l69J02O2n1NmpK33n6j27J03j58k02L21q4J62k09Q9j27n5P9
5315a19j3L78k18k49K29r3qJ13l35L04J43n2K23l44j34M5J40J23j82j43n3N3K82
5338I0j04j63L72n1j3M0q6j24J12k19J86J78j50m7J3M7j53r3O8N0L31n68L13j9
5362A0J00m9J94k57M0j96L91j70k00K6k6n2K90k3k49J94rJ3J43k29L70l40M2P2
5386H5j08J42L35o15K89O4m94L56j90k6K80k37k51L86L2K4j28K01R3k27O9K23
5408C03m67p4J86m4K34J52j57L9k26q9r5J39L1m6J21k40n0K39L57k92J7k3n6j33
5432a74K63p4N3O0j27k30L65j46K40J27k80Npq1M4k30Q0O4k2J27K3Lj72j31J07
$$ plain form
5266 215 -69 99 107 233 66 -133 -232 63 200 90 185 185 -181 -184 -42 53 333 -26 50 -273 73 -74 -3 -37
5290 -37 -266 25 49 174 -195 -93 -31 -82 -77 -81 -88 145 89 -38 65 -93 -295 26 -58 104 -105 -16 -143 -198 -119
5315 -119 -132 246 28 -221 8 -85 -93 20 -315 -11 132 80 303 -41 -175 -130 10 133 -49 -192 -245 -192 90
5338 90 -14 -177 195 144 131 171 85 -39 73 -146 40 218 68 21 34 81 -72 -165 -97 -47 284 -284 29 10
5362 10 110 61 255 -2 38 -158 233 63 -137 -111 -137 -189 101 78 -171 23 14 27 170 -59 311 -29 13 85
5386 85 -23 119 454 -161 128 192 -302 54 -136 -162 118 -119 -370 16 48 72 -56 145 238 11 80 303
5408 303 -164 -238 -52 -96 138 290 133 172 -54 -143 -238 -99 -68 -114 7 -233 -283 -44 313 21 38 15 -41 -174
5432 -174 89 15 68 128 1 -229 136 -10 230 357 77 82 75 -6 38 -192 -112 -48 -70 57 80 83 -89 -220 -113
5457a13J34K34j54p8O6k38J73j40l1L45r6J60k81j8K12r4j68K92j99k96K39M42
5479C91n64J74q3j26J42J84j30o5p9K87l32K57L88n67J18j79L4J61K63l92j7M5
5501i0L8l9K2k95M97k83k48P84k96l2r2J97l0k04o3j4P4K17j93J31j82J99j49
5524e1L45m18J65J48l22J1K70k49P9j6j1k12L78L8k07j89rJ86k1j06K92j09j09
5547a17pM1K89l17j11j02P9L38j92j53K14J39q7o9M6J66k08p5M13j65k29j39M14
5570A68m1j63K87k02q5j3m9JJ41j49j32L32K5J42k50j0J28o7n2K56k9m16J10K48
5594A80j68k36j05M37k94O7O6J75o7l43j1J98k4j86J91QM11q69M75mJ10K19j67
5617F3m7J7Q3j85J61J1L2m65L97J30j74J42n0j06l1J15n4Q2l3j8l02K61j1j44
$$ plain form
5457 -113 21 255 101 23 89 -149 24 -116 -147 198 102 262 -19 -37 175 81 -87 205 6 -290 -51 391
5479 391 -173 1 -82 -208 -66 118 -12 -77 -156 131 -201 56 444 -123 -5 -184 -150 11 274 -118 -135 -90
5501 -90 -52 -91 -69 -364 133 -150 -398 386 90 58 -34 163 133 -71 -134 -148 -74 143 -50 81 -101 98 -51
5524 -51 294 -124 41 189 -133 -122 148 -101 -22 -38 -49 -261 117 155 -52 -241 -250 -64 -85 -191 101 -8 -117
5547 -117 -124 -83 206 -111 -222 -324 -245 93 -99 -252 -38 101 14 -55 -9 157 -51 -126 287 122 -107 -246 168
5570 168 127 -36 251 49 -36 -49 -98 -97 44 -105 -237 95 120 262 12 2 130 63 11 267 238 -178 -68 180
5594 180 12 -224 -329 108 -186 -119 -53 122 55 -288 -299 -101 -125 -311 -120 -112 299 -570 -95 -99 11 230 63
5617 63 16 33 116 -69 92 103 135 -330 67 197 23 165 115 9 -22 93 39 121 88 70 -232 29 18 -126
5641a26j9J17K3L3J49j20L10k87l3n0J77l03Pl1L43j50k82K80n6L0M4k88M75k70
5665b7o8J71m07L69M4k70M3K54j49J75l95N02k1l88K18J21K4mj98j8L48m45j22
5688b43J64m4J00j20K06R4k91j20L97k42J76k63K83m0j49j47K72Ln1L2j5j80L39
5711A61j01O3Q3k16j3J7j51nK15R7l85J89J33j59K69l38P2M5J45k67J98k78J20
5734a06J15j4J66m06L26k51K54l02K49K4KJ39j69Q6L7j04J09j2k66O0j6K4L83
5757C28m71P5J57p5K43n28K06M8J05j6K3L1J33l55j09J73Q4k52K01P3k44K04j96
5780a62K7%J96k46J78J1K31p7n4k05J75L09m81o4J06P8J48l50R6o1K40l7p7j9
5804c8R8O2k19L41k14n6j4j3J69p2P8j48l3L38l63r0N3QK73j24P3j1k28p0K59
$$ plain form
5641 -126 -145 -28 -5 28 177 57 367 80 47 -3 174 -129 -122 -153 190 40 -242 38 -18 12 56 -232 243 -27
5665 -27 -95 76 -331 38 82 -188 -145 109 -40 135 -260 242 221 -167 51 172 196 192 -6 -24 324 -121 -243
5688 -243 -79 -123 -23 -143 63 157 -134 -254 143 -99 77 -186 97 57 -92 -239 33 36 -15 17 2 -178 161
5711 161 60 123 206 -10 -23 -6 -157 -162 53 150 -235 -46 87 -72 197 -141 -69 -24 121 -146 52 -226 -106
5734 -106 9 -5 161 -245 81 -170 84 -218 31 55 57 196 27 113 150 46 155 143 -123 -63 -79 -55 328
5757 328 -143 -68 89 14 257 -271 -65 -17 88 72 95 126 259 -96 -205 -32 52 -200 1 74 -170 34 -162
5780 -162 -135 -135 61 -185 -7 4 235 158 104 -101 74 383 -98 -162 -56 22 170 -180 -84 -145 95 58 -19 -38
5804 -38 60 122 -97 244 30 -26 -40 -53 116 44 122 -26 -59 279 -84 -174 -121 -113 160 36 109 98 -130 -200 59
5829E9J56j42Mj08K56j32k40K78%j56J35r6n0J30k14J06j49K25j73lJ99o1K60
5852B84o00K02PM0J28j94L32j28lk48K16j22M4L58k06n8N6k64N1K76k69K11K02
5875C15m33J03j13J67j64M12n06M8j72J04L96k67L12r3j17J09l34K94L7k05N6
5896e1K8N1k03J22j73K42J23o1N4j01n7j02J71J5K69l11M0n5P0j89k6NJ02M4k57
5921b50L44k30J21k73M01Lk88M57l16P8K76l54M2q9O1J64k31K01%k89L12j67P1
5944D4l1L16l30j34n3L44r5j76j7O6rJ0R0R9j06k5J24l25K29r2K73j77o9L62l16
5969BM4J70k22j59K05n1K1j60j1L25j19Q4qk30r9N6M01k78J97j55K0J42k25O2
5993A2J71k62O8J85j63L4J72j18j45L10m74P8L50j92Q5Q2j05j56p1L45k81j21
$$ plain form
5829 59 215 73 77 -31 225 93 -147 131 131 -25 110 14 -36 94 -120 -14 -163 62 -111 -114 85 24 284
5852 284 -316 -114 -107 -67 61 -133 199 71 68 -180 36 -86 -42 316 110 52 108 -156 -105 171 -98 113 315
5875 315 -118 -15 -128 39 -125 287 -219 -171 -343 -239 157 -110 202 109 -8 101 -233 61 98 -107 -51
5896 -51 -23 28 -175 -53 -226 16 139 78 132 31 -26 -128 43 58 327 16 56 1 71 -118 -144 -139 -37 7 -250
5921 -250 94 -136 -15 -288 113 116 -172 285 -31 47 323 -31 11 -78 -17 147 -84 117 117 -172 140 -27 44
5944 44 13 329 -1 -135 -188 156 61 -115 -132 -66 -75 -65 25 124 18 -7 117 -208 21 -71 202 25 -44 318 2
5969 2 46 216 -6 -165 40 -11 10 -150 -161 164 45 129 121 -109 -208 -152 249 -29 168 13 33 175 -50 12
5993 12 183 -79 -11 174 11 45 217 99 -46 264 -210 -132 218 26 111 193 88 -68 -139 206 -75 -196
6015a96L08L5M9j79k36K38K9R6j46jj54J84l4j05K38j14Q6N2Q5l38K26j71R1j4
6039B9j53N8K5n5k1r9J44j3N0J56q4J01n23M81j41j28L27l07L58l05J55k13P8
6062h0R8j39K71k97j07N36j24o2k37m1J13J0J88M8l19J54j9m2J11r7N1l34L70
6085E2Lo0j6N3j66J12r1J15M45m86p2L93k65j56K40M1j38j66J93N1o1J84l09J96
6109I2j26o7J00j35j12J90r2j89N67j58L7j73L21j82l9O0J09j85P8l24L8K72k30
6132a48J98R0k27%l9l9p3L24r1J37J0j63l11L28j79J34O2j46K48j62J90K1j27
6155C7K72l59o6K8J65j11k47L61j5o8j48L91k38q8K97k92J72j3l09K13J50l39
6177b07K32j4Mq7JM2nJ9l5j27M1n2K69j08J00j24K91j12k26L82l11k2Jj09J82
$$ plain form
6015 -196 112 147 196 17 -219 19 48 144 -2 -3 -157 27 -7 -112 126 12 98 150 235 -103 123 -48 43 29
6039 29 -124 -66 -41 -96 -117 -216 -72 -85 -35 121 37 138 -385 96 -45 -173 154 -153 205 -100 55 -158 -80
6062 -80 18 -121 150 -147 -254 282 158 96 -141 -182 -69 -59 129 177 -142 12 -7 -49 62 -35 16 -318 52
6085 52 55 -5 -21 32 -134 -22 -113 2 447 -39 -111 282 17 -139 101 142 4 -162 31 82 21 205 -104 92
6109 92 -34 -101 -1 -136 -248 -58 -150 -339 228 70 107 -66 255 73 34 94 203 18 96 -228 -190 82 -148
6132 -148 50 140 -87 -87 -126 -165 -238 86 -5 132 142 -21 -332 -4 -183 -49 13 -133 115 -47 143 164 37
6155 37 309 -50 -116 -88 77 -34 -281 80 65 -3 -151 240 2 -86 211 -81 91 78 -231 -18 132 -207
6177 -207 25 11 15 -72 -71 -29 -34 -15 -50 -177 -136 -188 81 -27 73 -51 240 128 -98 284 -27 -49 -48 -157 25
6202B5q3j84J90r5L94k60J05n0k6J13m5k89K06j84K22N8k37J68r6K7J27M2K71
6225C99l88j71Q0K32J28J18j77j54j16J42j38K57j74P4j83l7m5J38R3k43J58J44
6247A37l68J38r3K93k55o7L58m0L3j53l3P0k5O8j12j8L90l73M6lN7j67M25k81
6271B7K7o5r2L35l53j3L98k56J19M7k13k2L9J9J97l07J04J99m43K65j7K2M5p9
6295a7J7j59P1QK3k76M98k38Q8j39J78R4m07M13j34l29N7L18L8l8k60L44j8n2
6319H0r2J5O1m1K0J09l16M37j12l06l7J10j03M29j16j45J16k4K02k65j23L8R2
6342B9J63l55q0K37L0j55M7K18J6j59J45J80m50J36k6l64N50j70R5Ro2j01l2K3
6366g6M4J25j19j96K55j34J75l3L2m9Ko0l24M06n4Q4j38J81K14j87l4j67Q0K40
$$ plain form
6202 25 -58 -242 -52 -147 247 -13 92 42 16 129 84 -205 1 -183 39 97 -140 28 -68 -41 86 128 399
6225 399 11 -160 -80 152 280 398 221 67 -49 93 -45 212 38 112 -71 -108 -153 -15 78 -165 -7 137
6247 137 -231 -93 -186 107 -148 -215 143 103 136 -17 -50 20 -5 63 -49 -67 323 -50 -4 -7 50 -117 308 27
6271 27 54 -11 -103 232 -121 -134 264 8 127 174 -39 -61 -22 -3 194 -113 -9 190 -253 12 -5 17 62 -17
6295 -17 0 -159 -88 -80 -57 -333 165 -73 15 -124 54 148 -259 154 20 -309 -252 66 104 66 -194 150 132 80
6319 80 -12 3 64 23 43 152 -164 273 161 -145 -182 -72 -175 254 138 -7 109 85 287 22 -101 -63 29
6342 29 192 -163 -243 -6 24 -131 -84 134 150 -9 136 316 -134 2 -24 -388 162 -8 87 96 34 -67 -99 -76
6366 -76 -32 93 -26 -222 33 -101 74 41 73 24 26 -34 -358 48 -6 78 -60 121 335 148 114 -53 27 267
6390B67l50o5K87n4j15J41J35n2k92N0N4l12J63J48R7k29R1k12L73o2j4j86q8
6413b25K37J3J90p2k28q3K10m08L28O8rp5K1j01j68J47P0L8N1K51J10l91q0J17
6437A1j83L42N8j17k5j99J93p9J57j75K29l48K90l92K50K49j53j58pM9k06K76
6459F2j00m8K41n4j70K2l7J43N9j52K08l23K76j33R4K6Q1J33l00j11J92N3j54
6482HK43j62l7R3q4k3j19K08k5J34n1J9k19K9O0j78K19k30R3K13k05R1M0K1j76
6507c8k8P6l1l04L53q9K12l59Q5J16j1K38k72J98k69J60p0j39L76o4l16L11q0
6530E5n5K5j43oj50L39J36k34m0j72L72l78jL51R5J24m43J70j56M38l90K14j35
6553A6P9j61K53k01p9K49l29J97o7L69l40O5k24K77j12q5R8J38j85P2J65j55k3
$$ plain form
6390 267 -83 -148 139 85 -30 111 246 194 -98 -48 6 -306 -143 5 102 -127 -36 -248 125 63 49 -137 -225
6413 -225 12 25 215 143 -85 -168 42 -366 -38 30 21 -54 -33 -134 -302 -155 -85 -47 4 255 365 -26 -106 11
6437 11 -172 170 228 111 86 -113 80 1 158 -17 212 -136 154 -238 12 261 108 -50 -57 -8 -214 62
6459 62 -38 -86 155 101 -69 -47 -84 59 118 -34 174 -149 127 -6 88 114 195 328 28 -83 109 162 8
6482 8 251 89 52 145 61 38 -81 127 102 236 185 204 -15 14 74 -104 115 -115 -22 191 -14 77 117 138 -38
6507 -38 -66 10 -21 -325 28 -61 151 -208 -123 -7 -18 220 -52 146 -123 37 -33 -172 204 140 -176 135 55
6530 55 0 25 -118 -124 -274 65 201 -33 -73 -245 127 -251 -252 99 194 318 -125 45 -111 327 -63 151 16
6553 16 95 -66 187 -14 -93 156 -173 24 -43 326 -14 51 -173 104 -8 -93 5 143 -42 30 195 40 17
6576A7k10m1L1K98j24j4j88K5J0K66J5l0k26M23o1j79J26j02J20j64L77l45J35
6599A59M1l86N2J41J14o1k82K18mL7jK02l54K90K1l04K34j42J38k36K58O3j49
6622D9m8M4Q5j37j05j1j12J83L8k1Pj7m4K6j00K16J5R9j02m9k04K74k8j85J14
6647a3K27k76n1rj36M72l15o9K27pj31P9j1J87k17N6L3N4j2j15op2J47O1r2j59
6673a48J03J37j66k13K48K9o4R3j40J07p3J46l33K85L14m36J1K37j45L65m03L2
6695a4j43K9K09L4J37l79K55l09L01L1j55k09J98J0Q7J82m93M45k97L34p9K05
6717C79m74L4K81l6k31j73K53n3K08k48K20m1j43M5J83j92l46K83l7J12K4p2m4
6740f8j11J70l0j74K21j51K00N4J00j36M7k8j63P1J61N4j95J77k74K40m33M5K05
$$ plain form
6576 17 -193 -234 -203 95 -29 -43 -231 -206 -196 70 85 55 -171 252 191 12 138 36 156 -8 369 24 159
6599 159 200 -186 -134 7 121 60 -222 -4 -8 29 28 230 -124 166 187 -117 117 -25 113 -123 135 198 49
6622 49 1 45 130 -7 -112 -123 -235 -52 -14 -35 -28 -45 -89 -63 -163 53 68 167 65 16 -188 86 58 -127 -13
6647 -13 214 -62 -113 -122 -258 214 -101 -170 57 50 -81 -2 -13 174 -43 13 46 100 88 -27 -33 -105 42 103 11 -148
6673 -148 -45 92 -74 -287 -39 -10 -74 19 -121 -14 -87 59 -274 11 325 -111 -100 137 -8 357 -46 -14
6695 -14 -157 -128 81 115 252 -127 128 -181 120 151 -4 -213 -15 -5 82 264 -229 216 -81 253 174 379
6717 379 -95 -61 220 184 -47 -220 33 -20 188 -60 160 119 -24 21 204 12 -334 -51 -88 24 48 -24 -68
6740 -68 -179 -9 -39 -213 8 -143 57 111 211 75 122 94 -69 2 163 217 22 199 -75 165 -268 -223 -18
6763a8K03k74j9P3J30j04q7Q2J2Q3j75M05o28N35m14JlK60j80J69p7J85j90J17
6787H6r7K45l12K48p2m15L59O8j08M2J46k37l14L83K03k99M77m62j21L49Kk1k64
6810a14J76K0j00j97K11j63L58j67j29j4q6M10o05M89k06R0j0L17k41k6k14J59
6832d2KJ24k31R8P2k63K51j34R7J21j09j8J66m38M85l30K81l15pj5K55K20k06
6855F4M0k19J62j59J14K3m1J07j75J02Q5p0lm54P7J47M89l75o2L01n4Jq2J10K44
6880C72l31j83J60j79K48p8PK7q6J20kM9j54J61L3j83j1O3j6J36n2k39q6K36l
6905IjJ3j00k1l2O4K07j64j01J77k6m6K8K02k79Q1j08J43J51k65L49j28j72%O8
6930D9r4k5K3j11K65j91J17O4r2N0J5j9l3j63K47n7j91m0L60j83J46k94O0q5p7
$$ plain form
6763 -18 185 -89 -108 -35 95 -9 -96 -14 -2 81 -94 311 -317 218 -196 -195 -198 62 -118 51 -26 159 -31 86
6787 86 -11 234 -78 170 98 -317 42 110 2 44 190 -47 -361 22 225 -74 403 -59 -180 169 171 150 -114
6810 -114 62 82 -18 -215 -4 -167 191 24 -105 -119 -205 205 -400 89 -117 -27 -37 280 39 13 -201 -42
6832 -42 -40 84 -147 -49 23 -240 11 -123 -26 95 -14 -32 134 -304 181 -149 132 -183 -190 -205 50 270 64
6855 64 104 -115 47 -112 2 25 -16 91 -84 18 103 33 30 -424 -347 -200 289 -86 -148 153 99 100 18 128 372
6880 372 41 -142 18 -161 87 9 16 43 -43 77 75 124 -30 131 164 -19 -30 33 17 153 101 -138 -224 12 9
6905 9 8 21 -79 -100 -132 -68 139 -25 -126 51 25 -21 7 209 -70 11 -97 46 197 -68 281 153 -19 -19 49
6930 49 -45 -70 -47 -158 107 -84 33 97 5 55 70 51 18 -145 102 45 -146 -186 174 -9 137 -157 -97 -182 -259
6955b59K27J12Nn5m3L4j55j16K6M09j45o5l7K7J71l48K41j50K13l6p1k71J99L2
6979e5L0K47l13K17k43L01l83R5O3j22K47k1k50M23k41j20k6O0Q3Q1k38K80J9
7002A34n5k13m0n5K34k99L1L62o4J84k40j13J18K85k22j37O8J88n4j79J54j31
7024d4L3l3j47qJ51kJ71P4k81J61j75J03l0P4k6J55j73o3K53l16M32k53%j16k77
7049c37L57l34L43m2K1J86o5k43KJ91j34nM30k59k73LK15j66J3n6L06p3j78P1
7073b7j95N34m71J69J00j38p8J72j48L56ln8l41L35l39Q6J5k07M54k46N1J89k71
7096f1j03L03l94O7M39j03m08M08jm02K53Q8J24j19j49J1J25m02M83k71J27K27
7118B42k04j70K46R2l34K22j86K4j0J80K5m44L38m6n4O6j66M53k88J45l68M70
$$ plain form
6955 -259 -32 80 85 30 -13 21 -134 -250 -224 185 40 -25 -62 -35 136 -212 29 -121 92 56 -15 -286 -87 -55
6979 -55 -25 222 -91 126 -117 184 -199 -104 -41 -163 84 63 -187 236 -5 -125 -151 -91 -8 73 -165 115 134
7002 134 79 -134 -174 -229 5 -294 -263 99 35 219 -21 -134 -16 269 47 -90 -22 166 112 -67 87 -44
7024 -44 -11 -44 -191 -199 -48 -50 121 195 -86 75 -100 3 -27 47 21 176 3 -60 193 -123 309 56 56 -60 -337
7049 -337 20 -314 29 -13 8 194 129 -114 -112 79 -55 -60 370 111 -162 -159 56 -110 -97 -153 153 80 -98 -27
7073 -27 -222 312 -159 10 110 -28 -106 66 -82 274 271 213 -128 207 -132 -46 -31 -238 216 -30 21 210 -61
7096 -61 -164 139 -255 -188 251 148 -260 148 147 -255 -2 86 210 91 -58 -47 78 -324 159 -112 15 242
7118 242 38 -132 114 206 -128 94 -92 -68 -78 102 127 -317 21 -25 -79 -13 -179 274 -14 131 -237 233
7140B33j18l15L17l00J21R5O6j43R8k58K12J38j0j81N5j20J48j79J85j59J49k5
7162Ik5k1k73L14n0J05j36M4p4K97n4o7p6k12K01p0j81Q5J94j35J74Pk88N3L75
7187A96k42j1J04j13Q2ro5P4j06k31L10k49M96j49l29J67k16L21l37K47j96M65
7209B09j67q2J18k13p4J89J79R4l84L34LKk78J74p4j53J48K77j56m02J1N37k98
7232fk9J40j21l4N1O9J69j46k81K50J1j01NJ34k04J28n0J58J68k35k15K94l48
7255a93J02r7K84j9l4J82l63PL99k71p4L77k36o8P2k94M47l59j2J90r5R5N2l85
7279b93K65J03k9L24l11N7o8j09J72o4J19n23L87R7m68M78q1j22q8J95J8q8K5
7302dK6j04K97j87K15r9l4N9j41L0j38J79k37M52k29j29P1j83P3J70rK2j74J17
$$ plain form
7140 233 115 -200 117 -183 -62 33 99 -44 54 -204 8 146 136 -45 10 -110 38 -141 44 -115 34 9
7162 9 -16 -37 -310 4 -46 59 -77 -33 -107 190 136 69 -7 -219 -18 -88 -269 -184 10 -125 49 56 -232 -179 196
7187 196 -46 -57 47 -66 16 7 -58 16 -90 -321 -11 -260 236 87 -242 -75 -291 30 -307 -60 -256 209
7209 209 42 -40 78 -135 -209 -20 159 253 -131 203 206 208 -70 104 30 -123 25 302 146 -256 -245 292 -6
7232 -6 -35 105 -16 -50 1 70 239 93 -188 62 73 -28 -23 111 -93 35 -15 143 311 76 -139 155 -193
7255 -193 -91 -188 96 77 43 225 -138 -131 268 -3 -77 300 64 -4 68 -226 221 -138 -150 40 -55 40 92 -293
7279 -293 -28 75 46 370 59 116 48 -61 111 47 166 -357 30 127 -341 137 56 -66 -154 41 59 -29 -4
7302 -4 22 -82 215 28 243 144 110 169 28 58 -80 99 -138 314 85 -44 27 -156 -83 87 78 100 -74 43
7326D3m43K44J97j57j09K41j97j49L35oj34J21P7k47L65k34K37l20M40j67%J67
7348C04j78mm44M8J69K08j80J17mk13J60J79k63K85j16P5j02n8j52lM99n17J4
7371a76K8J97j22L41l03K61n72L82j93K99l34J68j97J96L1p9M5J25mk74K69k9
7393E9j44J15N4n9j76N6J66J63k06J09L8k27K49q6J80k31j20j23K76j32L08m92
7415b23K55Nj50K8j28L69j47J29k92K34j93K27k32R3K07l9p1j05p8N0J03n2K59
7438B49m2j26k84K74Q7m04K81MQK93m21J48p4J35j24Po4KK20k57R2j4K4qj3j03
7464a10p6J07J51k40J28J82k99R1J71j4q4J45k58M9j7J81q8k33L53j00J62r9j52
7487e0mj75M47k57O8K14l72N5j18o3L30r3J51j57j57K99k22J06K29m23q2L97j0
$$ plain form
7326 43 -400 -156 41 -116 -225 16 -181 -330 5 -1 -135 -14 63 -184 181 -53 184 -136 304 137 137 304
7348 304 126 122 -322 -274 -105 103 -77 40 36 -177 -17 162 -101 184 68 143 41 -17 -169 -172 327 -190 -176
7371 -176 -148 49 -73 268 -35 226 -346 36 -157 142 -192 -24 -221 -25 6 -73 -28 97 93 -181 88 59
7393 59 -85 30 84 25 -151 -95 71 234 28 137 175 -52 197 111 291 60 -60 -183 93 -39 269 -223
7415 -223 32 37 -113 -85 -213 156 9 138 -154 80 -113 114 -118 -25 182 143 72 -33 -111 -61 42 -10 249
7438 249 207 81 -203 71 158 -246 35 39 47 340 -81 67 -7 128 4 11 -53 -51 169 -88 4 -10 14 6 -7 -110
7464 -110 -186 -79 72 -168 -40 142 -157 -66 105 91 7 152 -106 -57 -74 107 19 -214 139 39 201 102 -50
7487 -50 -54 -229 218 -39 29 243 -129 -74 -192 -255 75 -18 133 -24 -181 118 -104 2 231 -192 -274 123 113
7510A13J16l71L12n78L93j30J99q7J02p0j89L18j54n1K7K00o6j84m8K03n5k6P9
7533E3K7j01p1k28J33R0Q0k20L5J92j4J91r6L1K8j33N5j6Nj43k07M91m74J35j43
7558c00J04K47J21k12Q4j50J26P4M8J1n2j72r1L07j17%M5J47k26M0K24j05K4n4
7582A23R7l22K20j11qp9K02r5N6o5j9j4K23j38Q8m07L47L7j27j38K9L13j01j10
7606AN5j46n4L33k39K75l45L68J10l53LJ58o9k32q2J37O6j28M74l34k43K86q2
7629d1K2j30K8o2J41Qm6K6o7Q6K18j06n7k8j36J14jl2J01K27l14J77o9k32p7K22
7655b8l7P4N8k34j0K64J00l08l8K67n4j24j36L05J89k78k46K57j38L69m24J55
7677a7j05L43l20j2L70l08J89l93K73j98K20p4M2J71p5O3k53K23j73K4N2j18n9
$$ plain form
7510 113 229 -142 170 -408 -15 -145 54 -33 69 -1 -190 128 -26 -77 -50 150 84 -100 -148 55 0 -26 53
7533 53 80 -21 -92 -320 -187 -97 -17 -237 -202 -10 -24 167 71 102 130 -3 52 36 41 -102 -309 182 -292 -157 -300
7558 -300 -196 51 172 -40 44 -106 20 94 142 153 101 -71 -162 145 28 28 73 220 -6 34 258 153 177 123
7582 123 220 -102 118 7 -1 -80 122 27 83 18 -1 -15 208 70 158 -249 98 135 8 -130 -101 212 111 1
7606 1 56 -90 -144 189 -50 225 -120 248 358 5 8 166 97 -135 -217 -80 -14 -142 332 -2 -245 41 -41
7629 -41 -19 -149 -121 -183 -42 -34 -80 -54 -121 -35 183 77 20 -8 -144 -30 -31 -63 38 265 -49 128 59 -173 -250 -28
7655 -28 -65 9 67 -167 -177 87 187 -121 -159 108 54 -70 -206 99 288 10 -236 21 -117 252 -172 -17
7677 -17 -122 221 -99 -111 259 -49 140 -253 20 -178 42 -32 10 181 106 169 -84 139 -34 -10 42 -76 -135
7700a35J03O3o3j31q3K58J84l35J31Kj03L20m82N6J23L4K16J83k64k59J98r5J07
7723B8j10K9R1j67J85n6J1mK24l25k59K31N4J80j61k08K95o4o8j96M38j38p4K04
7747A40k69L21r3k40K73l31K46J08j66n6q0K82l32J67O1q0k11P8J29j72J59n7
7769a23NL51l40j31K11OJ68l34R2N7j0L02k19q3J17j30J85j59k1J53o9O9j9j90
7793a12K68j87N5J67j75r8j35L10l3j22K65r2l62L77m10K31N6Ml5m6j05K15j43
7816a07L02Q2k52j17O9%k08L27r6j03N5m6P0o4K00J60K6m81J67l8O3J27j89q1
7840a34j89K14J10j28K58j38q1J07L2j06Q6N4k15j15L22L7k0j31N3J07j19J1J48
7863A63l13K15m0Mn8K10k21O6k16K9K2L8J91P9j17k24K64O9j7r3m99M66r0q1J17
$$ plain form
7700 -135 -32 31 -32 -163 -246 12 196 -139 -8 -6 -109 211 -271 -215 -92 -58 158 341 77 -182 16 -79 28
7723 28 -82 -53 38 -129 56 0 11 7 231 -94 -353 -122 -68 112 -49 -257 38 -26 -94 -290 148 10 -64 140
7747 140 -129 192 99 -141 132 -199 47 155 -11 -67 -147 135 -197 -30 31 -49 -260 -182 -53 -225 -66 -123
7769 -123 -118 233 -107 -238 -27 -21 147 -187 -95 -38 -48 254 35 -48 69 -61 124 -35 -56 97 28 97 78 -112
7793 -112 156 -31 24 191 16 -82 -217 93 60 -62 203 111 -251 126 -284 -53 3 7 -28 -74 -179 36 -107
7816 -107 195 277 25 -92 -23 -23 -231 96 0 -103 -48 -94 -24 -88 112 272 298 -183 -16 -54 9 136 -53 -134
7840 -134 -323 -109 1 -127 131 -7 -88 19 51 -55 31 85 -130 -245 77 114 94 -37 16 123 4 15 163
7863 163 -150 65 25 29 -29 181 -40 26 -190 -161 -139 -101 90 169 52 -172 92 161 144 51 -448 18 -72 -153 -36
7888c6n0J39j70j07L34J63k97P3k31K20k38J2K29n8k6kL05n05J56K01q8j2j24
7911a12j2P9k37K27l6J03j17nj35N79m39j01N7l5M06m19k42L96j40q6K64j02R7
7934a0J14j42L10j06j30p2J41l2j09Q0j85J07K1J6J56J73m18K31j00Q7o2J54j
7957B23m91J32n5K21j49q0K08j76K33j99K20l60K77Q1j22J61j06p7j14K10k06
7978a69J98M1j6J47lk78Q4q9J05l40M16l27L58r1k22K02q1O1J56k12J30M9j96
8001g7kj3K38m0j28K78k44NKk11J08N2j1K9RK3P8k70N4L50k61k57n1Q9M28K33
8027D11n02O9J65l32L48J37m67l4L68l28M42j12j83l4J06k47J61J00k1j95L13
8048A65l67K14L14Pn13J11M11n57L22P7k15J69j82k9O6R3j22J93j15J7k45K22
$$ plain form
7888 -36 -86 53 -117 -224 110 273 -24 49 -182 38 -200 -188 41 -17 -43 -45 260 -245 -89 112 24 12 -112
7911 -112 -124 -45 -282 -55 -91 12 -105 -110 -245 334 -105 -206 -149 -184 222 -197 -439 -43 -183 -269 -5 -107 -10
7934 -10 104 -38 272 166 36 -36 105 73 -36 44 -141 -34 -13 3 159 332 -86 145 45 132 70 224 223
7957 223 -268 -136 -191 30 -119 -199 9 -167 66 -133 87 -273 4 85 -37 124 18 -59 -173 37 -169
7978 -169 29 70 54 201 198 -80 4 -85 20 -320 96 -231 127 36 -186 16 -65 -4 152 -60 70 119 -77
8001 -77 -79 -92 146 106 -22 256 12 17 19 -192 -84 -32 -43 -14 -5 18 96 -174 -120 230 -31 -288 -339 -250 178 411
8027 411 -91 -22 143 -189 159 296 -171 -205 163 -165 277 165 -18 -52 54 -193 -32 68 47 -148 165
8048 165 -202 12 326 333 -180 -69 342 -215 107 184 -31 138 -44 -73 -7 86 -36 157 42 59 -186 36
8070C6l23J54j20L80r6j05J66k06K5J18J3LJ52m37J89M8m3Kj69K07m6n8K11M7
8094A48j60k00L79n6l79L76k23J16j04r0K60K17j14L5k16j00l6J28K02l21L14
8115A76r8l3O4P8k93K95p2k64K50J39l32M8p1L22k20k07K42l60L43k11J99j7j03
8138a25L03j51J13j83J49J25lj30j21j40r9L99p9j1J51j96m2K2l05M18k80J41
8160d4m3on5K60m5j91N5j2R7m5Q0j27K7M05m92L21k08O6k29j3M06l70O9K09K51
8185C66l59j05N13n02J94M3
$$ plain form
8070 36 -287 -133 -253 127 31 -74 92 -114 -89 29 42 45 197 -240 -51 -3 -46 -44 -213 -6 -52 -110 101 148
8094 148 -12 -212 167 111 -268 108 -115 1 -103 -193 67 284 170 205 -11 -111 -147 -19 183 -138 176
8115 176 78 45 109 187 -106 189 117 -147 103 242 -90 -42 -113 209 -11 -218 24 -336 7 -204 -5 -22 -125
8138 -125 178 27 140 -43 106 231 228 98 -23 -163 -262 137 58 47 198 2 -40 -18 -323 95 -185 -44
8160 -44 -87 -93 -148 112 67 -124 -69 -81 16 -29 51 -76 -49 356 -136 185 -23 43 -186 -199 207 -163 -94 115 366
8185 366 7 -98 415 -87 107 150
8191A50
$$ Imaginary data points
##PAGE= N=2
##DATA TABLE= (X++(I..I)), XYDATA
0@%%%%%%%%%%%%Qj6J6j6J6k4L2m0M8n6O5p3Q8j04J21j42J66j91K17k46K82l22
34a71L64m10M61n17N79o46P19q00Q89r85J090j207J333j470J621j785J966k167
52a136K388k633K907l215L563l959M417m953N591o362P317q540J0167j2453J5918
67I017k1871L4887j18106R3739J64981j73976p1522M0134N9258n916K4074k6044
79H655l3215J658M2509K1651q771m1594l5464N1706N6363n8679l2787K2096J4620
92H748r304P417K830j2976j9338J6540M7203k8318n0725L5027M0602l6919l7116
105c6329N7034J2999p6589O659P7822l0851o1487M0459K1924k1246L134k675j449
118a0595J6924k502k1867K4990K6363m6861k1976P1250J4601q8163N863P7839
$$ plain form
0 0 0 0 0 0 0 0 0 0 0 0 0 0 8 -8 8 -8 8 -16 16 -24 24 -32 33 -40 48 -56 65 -77 89 -102 115 -131 151 -171
34 -171 193 -217 244 -273 306 -340 379 -421 468 -517 573 -634 699 -771 850 -935 1031 -1136
52 -1136 1252 -1381 1526 -1689 1874 -2085 2332 -2621 2970 -3392 3925 -4615 5552 -6901 9017
67 9017 -12854 22033 -96073 -2334 162647 -11329 -82851 -42717 16541 10625 34699 8655
79 8655 -24560 -22902 19607 41258 32487 -9107 -44571 7135 63498 4819 -27968 -5872 8748
92 8748 -556 6861 9691 -3285 -22623 -6083 41120 12802 -37923 -2896 37706 787 -36329
105 -36329 20705 33704 -42885 -36226 41596 10745 -50742 -10283 11641 -9605 -6471 -9146 -10595
118 -10595 6329 3827 -18040 6950 33313 -13548 -35524 35726 50327 -37836 -31973 45866
130D5866j7840n2799O111L3665M898k2608r608J4763J995l301J1698j0702j7617
143a5479J0458K5129k830l3974o76K4410N8m115m754j9442J1241K2502j9652J926
157e198J4368l2995l760N5639M301o4886o012O2253M135m2590R436J4040k2537
170a3806J5467K2665k1177j3361M490P771J5896k688k5475l778K2268J0012j6790
183A494r940J3775m806j0480J6966O637j8161j3118J0722K3863o709k9160R967
196h950J8970j4568M004J1330j9969q181K2518R372k0569j0085J5401L151n610
209c186O148q664o504K1711l541j7405J8019N414k0855O682K0748r501j9030Q839
223a125J7780j2290j3005J3004j563q613P248M15n674j51M58O741J27r301M768
$$ plain form
130 45866 28026 -24773 -18662 15003 19901 -2707 -12315 2448 4443 1142 12840 2138 -15479
143 -15479 -5021 20108 17278 -16696 -17372 7038 7096 2981 -1773 -21215 -9974 12528 -7124 -5198
157 -5198 9170 -23825 -27585 28054 32355 -32531 -38543 23710 27845 -14745 -5309 8731 -13806
170 -13806 1661 24326 3149 -10212 -5722 2049 17945 15257 -10218 -13996 8272 18284 1494
183 1494 -8446 5329 523 -9957 7009 13646 -4515 -17633 -6911 16952 10243 -18917 -8950
196 -8950 10020 -4548 -544 10786 -9183 -17364 5154 14526 -6043 -16128 -727 2424 -3186
209 -3186 2962 -5702 -12206 9505 5964 -11441 6578 11992 -8863 -2181 18567 9066 -9964 -1125
223 -1125 16655 4365 -8640 4364 2801 -5812 1436 1851 -3823 -3974 -3516 3225 3352 -5949 -1181
238a181N888l749J809k875l092P736k438p809L013M049l869q313O817J1078j5200
253h136o321K1513l065j3592J2410L838r937N144Q559m885q839M753Q660p589
267B513m163M321o670K126Q848j1323m506J1351j030m719K345L106l65m537N295
282B592O938j0920k892J0654l308o358J653J357j637l982K505M436q182n89J0260
297B527m384l139P050k400m34O010k248k898J945L832k347o936O376L669j1604
312d981K279Q674r568k198Q500k732l591K841L663j131m227M606L759p239J973
327F28L854n869J733K063m771P4J217n09o98k429L206J664n777M215M471o982
343c910K037O084l478j814K119K649k298m229N364J298p887M184L725o962J885
$$ plain form
238 -1181 4707 958 2767 -108 -3200 4536 2098 -5711 -2698 1351 -2518 -10831 -4014 7064 -8136
253 -8136 -14457 7056 3991 -9601 2809 6647 -3290 1854 10413 5528 -3311 1442 10102 2513
267 2513 -1650 2671 -3999 -1873 6975 -4348 -8854 2497 1467 -3252 -907 2199 1834 -2703 2592
282 2592 9530 -1390 -4282 6372 3064 -3294 -1641 -284 -1921 -5903 -3398 1038 -7144 -7733 2527
297 2527 -1857 -4996 2054 -346 -780 5230 2982 84 2029 5861 3514 -3422 2954 6623 -4981
312 -4981 -2702 5972 -3596 -5794 2706 -26 -3617 -776 2887 1756 -2471 2135 5894 -1345 628
327 628 4482 -1387 346 2409 -2362 -2288 -1071 -1580 -2278 -4707 -1501 163 -5614 -1399 3072 -3910
343 -3910 -1873 4211 733 -1081 1038 3687 1389 -2840 2524 3822 -4065 119 3844 -3118 -1233
358a233M258m441L63K564m85j492K22L521k217m522O835l5o900N110J085n557
374b924K400J667j650j375j78L138q46l974M209M80m808M069J300l456Q74J134
390F0k46K46j099L139k095l387O853n63n652M463P69m399L388J729l267j478J442
407i7K602k880j737M145l402k308O916j434n043L112R02j4J304j961m00l70P84
424A19L245l228l854L869n11j390J809k416p11J064J736K662l758k531O118j56
440B067k898M237k435k081M167R4l398o65J828J10l233J307L001n397R9N638l228
457g87j597L932j629L75K568k132k77J269K92k1l548Q98K907l675j436J753l43
474a451N57j440o40L511j305j535M039j723K73L531l358p76M088j547k828L96
$$ plain form
358 -1233 3025 -1416 -1053 1511 1026 -466 -244 3277 1060 -3462 3373 3338 -3562 1548 2633 -2924
374 -2924 -524 1143 -507 -1882 -2060 1078 232 -3742 467 947 -3861 208 1508 -1948 -1074 60
390 60 -186 60 -1039 2100 5 -3382 3471 2908 -2744 1719 2488 -1911 1477 3206 -61 -1539 -97
407 -97 2505 -375 -2112 2033 -1369 -3677 3239 1805 -3238 -126 776 762 2066 105 -295 -665 119
424 119 3364 136 -3718 151 -360 -1750 59 -2357 -3068 -2004 -268 2394 -1364 -3895 2223 2067
440 2067 -831 3406 971 -1110 3057 3151 -247 -912 916 1026 -2207 -900 2101 -3296 -3197 2441 -787
457 -787 -2384 1548 -81 294 2862 730 453 1722 2014 1993 -1555 -657 2250 -1425 -2861 -1108 -1451
474 -1451 -894 -2334 -2974 537 -768 -2303 1736 13 286 3817 459 -317 3771 2224 -604 -208
490b08J756p31l225J864J601m761J851L668m056J155K632l847K455M255l495j938
506a024J959K261q9l775N8Q88j369J932j405l048J958O4l33K799k642j530L858
523E62J26J205K55m629J776N824j748m703r02L326J099k941K03l73k177L930O61
540A494m623K682J712l687L349K932m304j348K885K099j689k609J315R8k12J799
556A893l472k148M917j060k187K035j355M01J825j916J015J955k368QJ725l92
572H76l25j115P31Q39j457J300j328j914L752o78l210M633j015m686M122K434
588B959l113j788J899J531n53m69J26k409J454L496l186j785L040j837k2K828
604B171k576j525J751M21M10m51j914L52J438P12Q9k483O36J505O27K00k562r75
$$ plain form
490 -208 1548 817 -2408 -544 1057 -3704 -1853 1815 -2241 -1086 1546 -2301 154 4409 914 -1024
506 -1024 935 3196 3107 -668 -610 278 -1091 841 -564 -3612 -1654 -1590 -1923 876 -1766 -3296 562
523 562 688 1893 2148 -2481 -705 5119 3371 -1332 -2234 1092 2191 -750 -547 -920 -3097 833 1494
540 1494 -3129 -447 1265 -2422 927 3859 -445 -1793 1092 3191 1502 -1107 208 306 94 1893
556 1893 -1579 -3727 1190 130 -2057 -22 -1377 -976 849 -1067 -52 1903 -465 -457 1268 876
572 876 551 -564 167 1006 -451 849 -479 -2393 1359 681 -2529 2104 1089 -3597 525 2959
588 2959 -154 -1942 -43 1488 935 466 592 -1817 -363 3133 -53 -1838 1202 -635 -657 2171
604 2171 -405 -1930 -179 242 652 201 -1713 -1361 77 789 878 -1605 -969 536 1163 1363 -1199 -2174
622b174N418j183m071L061j58k070K240j65k063L71P65j1j063P82Q57k206J896
639B26J942l728P44L782k954n41K389j613o68J164o90m66l93k54R95r83J19K37
657f92m37J017K6j028K231o94j007L038j775j385K655j173j393J741o52j513O03
674d38k98l48O0J290k15l021L119K451l648L37K935j946O66J366k332k41J034
691G71l04n20o11j89p7m61J127p42j273K351m9j017K020p43o40J535l66j21J352
710B043k277n1J738j475j039K11J005m47j466J326O79k445K320J067k401J515
726C03J628k302R79R18j293L59K53n80m79K6M95j240j041K438p80j725J724q3
744d00n61J311l70m3J416r63J41L79j113N89L87r72J18m08L80k63o05Q58M9j100
$$ plain form
622 -2174 3244 2061 -2010 1051 893 -1177 1063 898 -1165 -794 -29 -40 -1103 -321 536 -1670 226
639 226 2168 -1560 -816 2966 12 -529 1860 247 -421 743 53 -413 -806 -1060 -65 -1048 -929 -692
657 -692 -1129 -112 -86 -1114 1117 423 -584 2454 679 -706 1949 776 -617 1124 472 -1041 -438
674 -438 -736 -1084 -1024 266 51 -2970 149 2600 -1048 -711 2224 278 944 2310 -22 -263 771
691 771 467 -53 -664 -853 -930 -1391 -264 -1006 -2279 72 23 -994 1026 283 -357 1178 812 691 2043
710 2043 -234 -285 1453 -22 -1061 -850 155 -292 -1758 -432 247 -2198 122 1189 -1212 303
726 303 1931 -371 608 1526 233 592 845 265 -214 -188 307 -933 -1974 464 -316 -2041 -317 -400
744 -400 -961 350 -20 -63 1353 390 531 910 -203 386 773 -199 -81 -489 -109 -372 -977 -119 -70 -1170
764a170J596N3j352J983j34j915J714P61j947M67R48n20o68m20R96p10q80J601
782D03p16j006J900r01l78J258q69P2Q95p56J92K27j19L02o46k75J039n84n42
801e04O46p53J371p50r30J680o86j019J978p63j425J788o2j041L15Q7n1K3J20
820B4N31n93k29J630j847M5J520j610k2J363j006k30J86j21L51m39j98P44n73
839d74L02Q26r56K72P05q29Q55j92p82J026q29l23J098j054m5O01r02J43N90l02
859b70oj59M25P69j108M55J340k033R01J359j923k2J156r17j51l4o00K74j19K03
879d60K90n91O58L67j069J150O48j091P33K12o53O48p68J80J78q28J08N96j164
898h56O4J76K40L63p20N13N67n85Q02Q92j639L94R36r89L27N26j628M18J76l09
$$ plain form
764 -1170 426 479 -873 1110 976 -939 775 1536 -411 56 1004 484 -184 -604 392 -318 -1198 403
782 403 -313 -1319 581 -320 -698 560 -309 -237 658 -98 94 321 202 504 -142 -417 622 38 -504
801 -504 142 -611 760 10 -920 760 74 -945 1033 270 -1155 633 571 -470 -155 -68 -119 -96 24
820 24 555 -38 -267 1363 -484 -439 1081 -529 -551 812 -194 -424 -238 -359 -8 -447 -645 99 -474
839 -474 -172 654 -302 -30 675 -154 701 509 -273 753 -76 -399 699 -355 -400 201 -701 -558 32 -270
859 -270 -276 -435 -10 759 -349 106 1446 -587 314 1673 -250 -272 884 -33 -184 -218 -818 -544 -663 -460
879 -460 -170 -761 -103 264 -805 345 993 -98 635 847 194 842 74 254 432 -396 -288 308 -856
898 -856 -792 -616 -376 -13 -733 -220 347 -238 564 1456 -183 211 1147 158 485 1011 -617 -199 -23 -332
918c32j43o73P55P6o12J228J17j292J000K53j90Q99r72J80O48m11m83N12r72p6
938d88N24m65L93n69o15R35k04L60M40r94J299L88q43M23L00j535J244N16j517
957d08K46j49p8K7n1N84r57o07J741o6o52O51q24L06J407o57o89N62K1k73q8l24
979b78O55o35q07J275j98n20O66o54M48M12q40R54j76q32R09K70r87Q08k48o85
999d63M41J21O8l41l46P19m48L9P62j257L56J011q38k35J279r06l33P45l61K98
1019C11o56j49Q02k09r0n2k39N88K89j377J102k8q54N24N23q43M29m08J12Q67
1039F42o18l95M06Q9o6J28k12M08r78M01J157j018m29R62j232M14J066r14j14
1058c03L2k5O01l23k33pK01N40m1o98P48J95j126R42J26j131J93L2j5N22p19m77
$$ plain form
918 -332 -475 -1148 -393 -317 -929 299 416 -876 124 377 187 1086 114 294 942 531 48 560 -412 -488
938 -488 36 -429 -36 -605 -1220 -285 -489 -129 311 -683 616 1004 161 584 884 -651 593 1109 -408
957 -408 -162 -311 -389 -362 -413 171 -786 -1393 348 282 -370 281 -543 -237 1170 513 -176 386 407 134 46 -278
979 -278 377 -258 -1065 210 12 -508 158 -496 -48 364 -476 478 302 -530 379 649 -338 470 222 -463
999 -463 -22 99 167 -174 -520 199 -249 -210 552 -705 -349 662 -176 -411 868 -38 -371 374 13 311
1019 311 -345 -494 308 99 9 -43 -282 306 595 -782 320 292 -562 -38 485 -358 71 -337 -225 642
1039 642 24 -371 35 124 58 186 -26 382 -596 -195 962 -56 -485 477 -755 -341 725 -189 -303
1058 -303 -271 -296 305 -18 -251 -258 -57 483 442 -256 492 687 -439 503 629 -502 -309 -277 -292 230 -489 -966
1080i66J061l19k25M10R2J47m51P63L61q92L71O15r93l9N80j117L67L70o41K17
1100b89L22p31J83L25M12Lo93R34K44q76Q54J51j051P83l41n23M76k20n48M60
1120a25n3m23P2L53L51m36O6O48n76K00P13j98l40L06o39L95J22j115N69N09j057
1141f58K48M5J10n00N9Q09m0l57P38l41k16P54m59l95J140o69p91P72l06l92N3
1162c96jJ26J24k56N44n51K37M67j65QJ48m07L76K45n87N13j24q82L75K98m83
1183c91K53q6K30J62O3k68R2q4N64m29j71Q93p11k38J012p84n28L61r0q5L54m50
1205c31L55k12n0L90j64J56O0p25P38L0n88L07Q11p46Q8Rr4J73l50J47K64l22
1227e4j60K57k23M36n97j61P80m79n48J092n24o0L54o6j72N00l90J14J77m04P2
$$ plain form
1080 -966 95 -224 -449 -39 53 200 -251 512 873 -19 352 967 -26 -65 515 -602 -235 135 -506 -289
1100 -289 33 -698 -515 -190 222 225 -468 466 710 -166 688 839 -212 571 230 -293 183 -37 -585 -125
1120 -125 -178 -601 -529 -176 175 -261 -195 453 -123 77 790 592 252 558 -81 314 436 -679 -110 399 -658
1141 -658 -410 -365 -255 -755 -696 113 73 -284 454 113 -103 651 192 -203 937 268 -523 249 -57 -449 -396
1162 -396 -397 -271 -147 -403 141 -410 -173 294 129 137 285 -122 254 499 -88 425 301 -581 -206 92 -391
1183 -391 -138 -224 6 168 231 -37 55 -29 535 106 -65 828 117 -121 891 107 -421 -60 -150 -235 119 -331
1205 -331 24 -188 -238 152 -12 144 204 -521 217 247 -341 -34 777 31 119 128 34 207 -143 4 268 -54
1227 -54 -214 43 -180 256 -341 -502 278 -201 -749 343 -181 -241 113 47 -125 375 -15 99 276 -128 -56
1248e6L8J99O3o12N94Q9p77M13L51n15K11J03l02J35j57K13K8q3k9K42J9K05l84
1271a2j3M74m93j92L36k32j23K21l49j69M81j53J01L46j73K00j26K90k45k80L53
1292B42K07n96J26K56m89K64j76l24L87J88l38K06J15j95r8L58j27o7j69N25r8
1313A97j36K64l88k9M7k47K52Q8o86M18J62l29Q9N62l58J08K46k15N71o81L64
1334B99j5k68J91k08k57L64l99l02M16Q0m13M53J95j79O2P8J35j2l0K92l37j02
1356D3N05p01O5O9m58K16M37n58J55K25k40L32l68q7M80l41M15L4o9L62k50m37
1378a71L37j02j34N9k6j74K40r2l17j14J93L44M5nN08o09M3L82n51L89m4m40J48
1401i1L73n95J86J47j70N1o7k39M53k91L04L4j75M8k7l99P25j86k30M82k55l82
$$ plain form
1248 -56 -18 181 244 -368 226 315 -462 -49 302 -213 -2 101 -201 -66 -223 -10 18 -65 -94 148 167 372 -12
1271 -12 -25 449 -44 -236 100 -132 -255 -34 -383 -552 -71 -224 -123 223 50 250 124 414 169 -111 242
1292 242 449 -147 -21 235 -254 10 -166 -490 -103 85 -253 -47 68 -127 -225 133 6 -61 -230 295 197
1313 197 61 325 -63 -92 -45 -292 -40 48 -638 -220 -58 -387 -298 264 -94 14 260 45 616 -65 299
1334 299 284 16 207 -1 -258 106 -293 -595 -179 -99 -512 -59 136 -43 19 97 232 220 190 482 145 43
1356 43 548 -153 -88 -19 -477 -261 176 -382 -227 -2 -242 90 -278 -365 115 -226 189 223 154 516 266 -171
1378 -171 166 64 -70 -11 -37 -211 29 -63 -380 -494 -301 43 88 83 591 -18 25 407 -144 245 201 -239 -91
1401 -91 282 -313 -127 20 -150 -99 -166 -405 48 -243 61 95 -80 -32 -59 -458 267 81 -149 333 78 -304
1423c04L16j30J59p8o1M5J98j73k33Q5L86j65k94L35J85m19o2L22l75J32J31n1
1445e1J73L16o79N15j12J40k70p2J82k86J34J49l20Q4K94l83J64K24l58P1L42
1466B57k42J68j18k8j08J07p5R2r1J1L40l52k4K74m12Q0N8P3j28M30l42K27j96
1489AJ48j14q3K0K0L5J57j21j38J55k44k28L94j40m21N11J8m1k53J50K24K37j59
1512A28M6Jk30J67q0Q5M7n62L40k58K57j52L04n13L76K99l96K24l6K00j5r9K13
1535C46k48lj51Q8rk36J35k13M12j07k61Q3J31Q7q3R0l0J74j43K97l89J07o2j73
1559a58J72R7m33L72J76n65L45k16O2J86N4j44K75k58n1j8J48Q7Q1j98j3K27m33
1582b05L23l55j02L68l77K36P6R4l24J72M4J39p4L72k31J9N1k01O4K22l03J73
$$ plain form
1423 -304 12 -118 41 -37 -98 -53 145 -28 -261 -176 210 45 -249 86 271 -148 -210 112 -263 -131 0 -51
1445 -51 122 438 -241 274 162 302 32 -40 142 -144 -10 139 -181 -97 197 -186 -22 202 -156 -85 257
1466 257 15 183 65 37 -71 36 -39 53 -38 -27 313 -39 -63 211 -201 -121 -63 10 -118 312 -30 197 1
1489 1 149 35 -48 -28 -8 27 184 63 -75 80 -164 -392 2 -138 -559 -48 -30 -71 -324 -174 50 287 128
1512 128 174 175 -55 112 32 117 164 -398 -58 -316 -59 -211 93 -420 -44 255 -141 83 47 247 232 133 346
1535 346 98 95 -56 32 23 -213 -78 -291 121 14 -247 -164 -33 54 -29 61 31 205 62 359 -30 77 15 -158
1559 -158 14 111 -322 50 226 -339 6 -210 -148 38 92 -52 223 -35 -86 -104 44 131 212 14 1 228 -205
1582 -205 118 -237 -339 29 -348 -112 -36 58 -266 -94 -50 89 15 387 156 175 226 25 89 311 8 181
1604A81o3m1k5N0m83N9P0N60n63M03k31R8J96nP1m20K25J40j83j59K73k36J25
1627D2J27n30K86J12o1R2j0q8K30j41j72L62k81K12P9l07p4K20m25L54k01J4J26
1650c4K16j19o4j19K74L2k80j6L28j74R0m40K53L13l43K31J46m56Q3M28m32J85
1672A02K16k89o6o3j8O5k42K89q0j37L53Q6m81M86k26l4J17O0k57K97Q2m05N17
1695C72o31N61l01j65J69j10RR4l18K23J01Pr7K32l65K01K92m2j22L31l25j99
1717h3jq6L34k30j08QO2J67j4j83J10J1k19L39P2m08O99l07k8K%q9k55j45M45
1742I3j80kQ1k37L84K5k26K51R6l92p2K56j47K9l2n0L44l3r3k44Q3J44k19l02
1766d43M59o1j62J14m6p5L56p1P4j38R9k73J39j09L12Rm07M76n27N5L89l57K48
$$ plain form
1604 181 118 77 52 102 -381 -322 -252 308 -255 148 -83 15 211 206 277 -143 82 222 39 -120 153 -83 42
1627 42 169 -361 -75 37 -24 68 58 -30 200 59 -113 249 -32 180 259 -48 -122 98 -327 27 -174 -160 -34
1650 -34 182 63 -1 -120 154 186 -94 -110 218 44 134 -306 -53 260 -83 148 294 -162 -79 349 -83 102
1672 102 318 29 -37 -100 -118 -53 -295 -6 -86 -223 130 216 -265 221 -5 -39 78 138 -119 178 260 -145 372
1695 372 -259 302 1 -164 5 -105 -96 -2 -320 -97 4 11 -86 146 -219 -18 274 232 110 441 116 -83
1717 -83 -84 -170 164 -66 -174 -166 -104 63 49 -134 -24 -13 -232 107 179 -229 470 163 135 137 137 48 -207 -352 93
1742 93 -87 -89 -8 -245 139 164 -62 189 285 -107 -179 77 -70 -41 -73 -123 221 188 95 -149 -66 78 -141 -443
1766 -443 16 -45 -207 -93 -139 -214 142 71 145 7 106 -167 -28 -137 175 184 -223 253 -274 -219 170 -187 61
1789F1n5p6p4L57l82N55q5l43L24l77n7M9j5Q5J39l99L13M0j52L90m82J0L43l71
1813b02J44J87N2k62J17J29kk40o2L06l74K84K23l20K78n27j05M20j95k15M54
1834I0j88q5N28l47L8K65r7k66L4J81j38pR5j0r8k16L02j70J90Q9k49K31K29o78
1858b77L59q0k05J47J1K88k86J67k31J23q8J99j63Q0k1M8n7K89l55m6M5j7j55
1881b25K34K38o7k95M7K26o5k86L27j24k75L09n9nJ68j77M5J8k30N7M05m48r8
1904b80Q5K35J4l68M16J3k7j43J67k88M49K00n22K68l03j02L51m22L56k30q2K85
1926G2p0j86M47j56ML76m94K32k65l1Q3q8k7j30K62n3J42l25J54p0J94K11l70
1949h8q6P7M13l60P3K1m5K03l04Q8J34k89q8N41k90j83J20j70K09J01l48K77r6
$$ plain form
1789 61 6 -70 -144 213 -169 386 301 -42 282 -95 -152 -103 -118 -33 106 -293 20 60 -92 298 -184 -174 169 -202
1813 -202 -58 129 181 -81 36 165 163 -77 -139 167 -207 77 300 -20 258 -269 -374 46 -149 -364 90
1834 90 -98 -183 345 -2 36 301 204 -62 -28 153 15 8 103 93 -5 -221 81 -89 101 190 -59 172 401 -277
1858 -277 82 2 -203 -56 -45 243 -43 124 -107 16 -72 127 -36 44 23 71 14 303 -52 -98 -53 -70 -225
1881 -225 9 247 180 -115 -68 158 93 -193 134 10 -265 44 -15 -20 148 -29 16 34 -196 -139 266 -182 -280
1904 -280 -195 40 54 -314 102 115 88 -55 112 -176 273 473 -49 219 -84 -186 165 -257 99 -131 -213 72
1926 72 2 -184 263 107 111 487 -7 225 -40 -71 12 -76 -103 -233 29 -24 118 -207 -53 -123 71 282 -88
1949 -88 -174 -97 316 -44 29 50 5 208 -96 -8 126 -163 -251 290 0 -183 -63 -233 -24 77 -271 6 -90
1972i0O5J70n1j5J25P9j38j56M0J14j95J04p6p9k3J7j97N88l04j13M38l26jL49
1996C25k10j46K91kk70J85j52r5J03l23L04o4n6J19l02K05Q7j53K20k2j8J07j5
2019A18o0K05p4l43J63j28K95j87j38L09j26j71J94j47j73J94J74j59qK57j97
2040bQ6o6J08K6l14J77R1j55J76j57l2m0j57R0J56N1J5m9j56J03J98K16l9j40
2064A86m42K10Q6n3Q2k82K68Qk81J55l0L7J76M0k18K6K36j48J08j43N2l33L64
2087A04j08J46lj37K8NL1j60K62k25j78P7J30m02M22j20j0L47k08K3Q6m6nO1j28
2112hR7L2j91K20j08j0J26n1k03J32k01K2J91l72L03R0k74J94r7J19K32n23J94
2135h6M04k72p2J28l98K88j49K06Q4l69J59J12k91L69j57j95L21J09k34q0L17
$$ plain form
1972 -90 -25 145 94 79 204 283 145 -11 29 143 -52 52 -24 -103 -126 -109 -306 282 -22 -135 303 -23 -24 325
1996 325 115 -31 260 258 -12 173 21 -74 29 -294 10 -54 -110 9 -293 -88 -1 -154 66 44 26 133 118
2019 118 58 263 189 -154 9 -119 176 -11 -149 160 34 -137 57 -90 -263 -69 105 -54 -62 195 -2
2040 -2 84 18 126 152 -162 15 106 -49 127 -30 -62 -102 -259 -169 -13 38 53 4 -152 -49 149 365 326 186
2064 186 -256 -46 40 -13 69 -213 55 63 -218 -63 -93 -56 120 160 -58 -32 204 56 164 21 73 -260 104
2087 104 -4 142 139 2 30 35 66 -94 168 -57 -235 -158 -28 -430 -8 -128 -138 209 1 24 110 64 59 120 -8
2112 -8 89 121 -70 150 42 32 158 107 -96 36 -165 -143 48 -324 -21 69 -205 -11 -108 11 243 -280 -86
2135 -86 318 46 -26 102 -296 -8 -157 49 133 -236 -77 35 -256 113 -44 -239 82 191 -43 -123 194
2156A94k29J42ok01K55m9r9Q7n7j39K47k16l8q2J95r1J2J59K00k92L80J84o15
2179e9J72m46M02p9j63j27M19l80M4J20l3L1J83k56J44K5r3K17j53L9L09p9j52
2202H5O2k75K98l22O5K04k67J59j51PQ6l3P9p0K61k75L12j88k1j36L37r1k58L99
2226B67l93J61l17K92l17J47J88q3r3L14k19K70j29j62N09l55j26J59J86l50Q3
2247C2m5m2r2j3L3K19k3k91L93j51j67K74l35M24k0k66J68pj16J33Ll68K65N2
2271F0Q6P6k91J35j34M2J69l93J88K18k9k73J37lr0K08lk16k0K05n0k7j8OK0J54
2297A57j53j04L81k27R5o5N6m40P04m28M4j4k2J85K2q0j3k02J99L12m28k69O5
2320b25K42l21J70k4L8J61k75J29J50Qj94N1L49k70j9J69K2l55M27j77N9n0L8
$$ plain form
2156 194 -35 107 101 -100 155 106 7 94 37 -102 145 -71 -109 -191 4 -87 -75 84 284 -8 372 556 -59
2179 -59 113 -333 69 -10 -173 -300 119 -261 -217 -97 -130 -99 84 -172 -28 -3 -96 121 -32 7 316 237 85
2202 85 147 -128 170 -152 -87 117 -150 9 -142 -135 -49 -82 -3 -73 188 -87 225 37 16 -120 217 126 -132 267
2226 267 -126 35 -282 10 -307 -160 28 -55 -148 166 -53 217 88 -74 435 80 -46 113 299 -51 32
2247 32 -13 -55 -147 -160 -127 92 69 -222 171 20 -147 127 -208 216 196 -70 98 91 -25 108 111 -257 8 60
2271 60 146 222 -69 66 -68 -26 143 -250 -62 156 127 -146 -9 -12 -102 106 103 -113 -133 72 22 -5 -23 -17 3 157
2297 157 4 -100 281 54 149 84 140 -300 404 -24 20 6 -16 169 191 111 98 -104 95 407 -21 -290 -225
2320 -225 17 -304 -134 -158 -120 41 -234 -105 45 53 -141 -90 259 -11 -30 139 161 -194 233 56 115 65 103
2343A03q7jj73J09K38m38J90O2k78L49l66O19k65L25l96J79l56M34kl99m9j7j64
2366c83L61J36j57l7J06m87L75mJ45P0j5L12k22k45P94n55j87L00m85L95m12j57
2388c52L40p6l08M93m28K86N0l1J68q8k24K82K13m33K82Jk54K22j43j09J57k40
2410a92m7K05K06k56j44J19K98j27l71O51l02o2J99j91p1K24l24K10r8j87J74
2431h6O5m7K21m70j0R2L36j67J94R7l58M63j63Ro6k29J89m6J10k86n7P6J57M1
2455F5K3r8N5K57m40J89l13PJ01L74l29Q8K12m12J93n7m1Q0J87k7J53k5mj46k57
2480a65j3M47k44J03P7l78M32l24L1L21l42J57Q3n66K21J7K93Q6j41l0J82m39
2502a92J90R3k75J78K0m1J7m9j80M61j74l27J73K49J44j81j02j20J73k38L54J6
$$ plain form
2343 103 16 15 -158 -49 189 -249 -59 3 -275 74 -292 327 62 387 -9 170 -186 248 246 -153 -202 -219 -383
2366 -383 -22 114 -43 -80 26 -461 -86 -90 55 125 110 422 200 -45 749 194 7 307 -178 217 -195 -352
2388 -352 -12 -88 -396 97 -331 -45 5 -26 142 54 -170 112 325 -108 174 175 -79 143 0 -109 48 -192
2410 -192 -239 -34 172 -84 -228 -109 189 62 -309 342 40 -22 177 -14 -85 139 -185 25 -73 -260 -86
2431 -86 -21 -68 153 -317 -327 -235 101 -66 128 225 -133 330 167 176 110 -119 70 24 134 -152 -209 -133 24 65
2455 65 88 -10 45 302 -138 51 -262 -255 -154 220 -109 -21 191 -221 -28 -85 -126 -46 141 114 267 242 238 92 -165
2480 -165 -178 269 25 128 205 -173 259 -65 -34 287 -55 102 185 -381 -160 -143 150 236 95 65 247 -192
2502 -192 -2 91 -184 -6 14 -27 -10 -59 -239 222 48 -279 -106 143 287 106 4 -116 57 -181 173 189
2524A89m41J72L9j7R8l33M37R4j88n5j77K58L1J02k95N3r0Q1J3J83mj35m54K57
2548a82J80N9j02j80M9K39L4k1K45k50O6j80J53m1N1l81N41m51Q3Jj45K15J6j79
2572a80K36j13K9K81k25j67J89K26k87O2J03R1jl64L92o4q2p8l94P5J72j6j24
2595b39J17K80l10J07j67L92j69j44M42m8k59j42Q4j74K95o8K55m61rK7K68p1
2617FL93n01J99J52m01L05j11J81l18J76k25j33L42j90K77m61K40L5ll12L23j02
2639a28K72m22M27k91J4L06Kk55J95J07j70k22L5k72L72K0o4q5Q6Lq4J76N8P5
2663A55l64M23J14l30L7k64K89N0P3m66K11q1l9K64n79M86m5p0M49n6lJ19m23
2686e0J69Q2j44K7N6j73L64j46m26L00k75J33J8l1Q4N8j08j19N25o83M20j28P7
$$ plain form
2524 189 -252 -80 -41 -58 40 -293 144 238 50 -5 -182 76 107 209 -86 -33 -123 -42 -29 154 150 15 -439 -182
2548 -182 -2 57 -45 -225 -176 63 97 76 321 71 137 -43 110 69 120 -261 280 -171 -88 -87 -232 -17 -1 -180
2572 -180 56 -57 -28 253 28 -139 50 276 -11 51 154 245 244 -120 272 208 126 48 -346 -271 -99 -115 -239
2595 -239 -122 158 -152 -45 -212 180 11 -133 309 261 2 -140 -56 -230 65 -3 252 -209 -218 -191 77 6
2617 6 399 -102 97 249 -152 153 42 223 -95 81 -144 -277 65 -125 152 -309 -69 -34 -37 -349 -26 -128
2639 -128 144 -278 149 -142 -128 178 180 -75 120 227 57 -165 -130 -402 -30 -10 -74 -159 -73 -70 -154 22 80 155
2663 155 -209 214 328 -2 35 -229 60 110 183 -283 -72 -153 -192 72 -507 -21 -66 -136 313 257 254 373 -50
2686 -50 119 201 57 84 140 -33 331 185 -241 59 -216 -83 -65 -96 -12 46 -62 -181 344 -339 81 -47 30
2709C0K12l77J74Q6j16j9n6mP3J48j19Oj90K15j34J59N8k36k7K40r9j95L61j47
2733D3q9p5K94k88K49n0k50L20k75O3J25Rk18J02P8o5O3k09M31l34R8K6r3j54
2757a99r0M99m79L89k11K50J09l08J40m30M18j27r1R4N6k74L46j24j86L07l4j59
2779a04K15O9k08K63k58O7j79L28k03j56J30K23k31j37K86k54J10Q7j9n4K48j75
2801D8L63l23J59K5j98K34l11P2l08M17k47L1Lm9j09K95m6j8K0j55K64m02L17
2824H2N3k09J71J32k32K00k92J53K5j31m58L56k80J32L09O5J42j80Q6n0J66k06
2846C4J49l85Q0K46O7l09K92k64L1p1q8K96j55k21M42N2l99L32M3j18j0P7J11
2869B32l61K2K14k02l52M00p0m3L05k19M6K61o9R2j03o1j06O3K21l22k5K15l04
$$ plain form
2709 30 242 -135 39 125 9 -10 -66 -70 3 151 32 38 -152 63 -71 88 146 -90 -117 123 24 -171 190 43
2733 43 -46 -121 173 -115 134 84 -166 154 -121 -58 67 76 -142 -40 38 -27 36 -173 258 -76 22 48 -45 -199
2757 -199 -289 210 -269 120 -91 159 268 -40 100 -330 88 -39 -130 -36 20 -254 92 -32 -218 89 55 -104
2779 -104 111 180 -28 235 -23 44 -135 193 -10 -166 -36 187 -44 -181 105 -149 -39 48 29 -25 223 48
2801 48 411 88 247 272 74 308 -3 69 -239 178 -69 -38 -35 -84 -193 102 56 38 58 -97 167 -235 82
2824 82 135 -74 97 229 -3 197 -95 58 83 -48 -506 -150 -430 -298 11 76 218 38 124 74 240 34
2846 34 183 -202 -122 124 191 -118 174 -90 -59 -130 -218 78 -77 -298 144 196 -203 129 172 54 44 121 232
2869 232 -129 -107 107 -95 -447 -47 -117 -160 145 -74 -28 233 164 256 153 92 -14 49 270 -52 -77 138 -166
2892a66L49l38J14L03j78k02J1J14O0k32L72k06j6O4j91J43m6m3K16l55M78k88
2914c7j62k7L72P4j15j61%K22l26K69J46l64J84N9k42k3J50l60M73m88J33M96
2936B73l45N4J88k45n2K93j19q8L2L9J17j55j0k9Po8K33j68J63l24n7L84l28J55
2960e0m6K50J14q0l47L5J04N4o9J20n01N90k18k66M59j32k12L17j51J39j35M8
2982B3K22j87K69m39J65j6J88n79J47K72j08J1P4j34J91k45K99j65M9k72M98k61
3004Bk5lj76M21m97N3K34L63m70J05J10k41L40l07N7K08k35JL9J93l25K85Q1%
3028B13o3j1j10j01jJ76l33M80o58M04j00L1r3L22j39J78M6k31K2O5n3j12J24
3051E6k83K80l51K00M4K97j74K12m60J24j11R7M1K48j62k7J37j87l05L79J23m23
$$ plain form
2892 -166 183 -155 -41 262 84 -118 -107 7 67 -165 207 1 -15 49 -142 1 -45 -88 128 -227 251 -37
2914 -37 -199 -226 146 220 105 -56 -56 166 -160 109 255 -109 75 134 -108 -131 19 -341 132 -356 -223 273
2936 273 -72 -18 170 -75 -127 166 47 -41 -9 30 147 -8 -18 -47 -40 -108 125 -43 120 -204 -261 123 -205 -50
2960 -50 -96 154 268 188 -159 -124 -20 34 -35 85 -416 174 -44 -310 149 17 -195 122 -29 110 -25 23
2982 23 245 58 327 -112 53 37 225 -354 -207 65 -43 -32 42 -92 99 -146 153 -12 37 -235 263 2
3004 2 -23 -26 -202 219 -278 -225 9 372 -98 7 117 -124 216 -91 -34 174 -61 -60 -21 172 -153 132 213 213
3028 213 150 139 29 -72 -73 103 -230 250 -408 -4 -104 -73 -166 156 17 195 241 10 32 97 44 -68 56
3051 56 -227 53 -298 -98 -54 243 69 281 -179 -55 -166 -69 -28 220 58 31 168 -19 -324 55 178 -245
3073b45L80l23L42j09Nk24K90L0l93J27J49qK18m5k23J72j25R8j0k56K3K01k04
3096a30J52P4k22k16J47P3P1J85k50K11j8k66K99k76K81P5k59J35j74P6J7K0K3
3119B8M08o64J66J89j44j18J84j36J29r4J32k4k58J61m1mj59L97l08J04L87j02
3141B33k14L7j28J21J65L8l63J83nk16J68J74j88j12J98q7j0q6J12l66K14RJ37
3164A4K91j72N6M2m52N07k91j13O9k99L79q0k89L24J23k44K33J8l00L67j42J16
3186A57J6m2J97l28R6j61J17k39m0K38j02O7J75m57M76n5k22L06j92K76j18m04
3208b39K08J84j72k00M3K38j16j15Q6J58l47K88K5j33J47k42K16n8M2L56k3l02
3230D4Q1j37j64L0M54m27L9O6j57M59m23r3J38Q9QK54k59R9o8K50j55J7J35k10
$$ plain form
3073 -245 135 -188 154 45 50 -174 116 146 -247 -120 29 21 239 194 -29 143 18 116 106 -150 -127 74 -130
3096 -130 22 96 -126 -342 -195 -122 -51 134 -116 95 77 -189 110 -166 115 190 -69 66 -108 -32 -15 5 28
3119 28 436 -228 -62 127 -17 -135 49 -87 42 -52 80 56 -202 -41 -82 -86 -245 152 -156 -52 335 233
3141 233 19 56 -72 49 214 252 -111 72 67 -149 19 193 5 -107 91 4 -6 -92 20 -346 -132 -123 14
3164 14 305 133 189 231 -221 286 -5 -118 -49 -348 31 -49 -338 -14 109 -135 98 116 -184 183 41 157
3186 157 173 131 328 0 96 -65 52 -187 -227 11 -91 -24 151 -306 170 115 -107 199 7 283 165 -239
3208 -239 -31 153 -19 -219 -176 62 -54 -169 -83 75 -272 16 41 -92 55 -187 29 -29 13 369 346 44
3230 44 125 -12 -176 -146 308 -119 -80 -14 -171 288 -135 -228 -90 -1 7 261 2 101 33 283 128 145 280 70
3254G0j11J16K5m29Q6J52l42M04J81k38K9J99n2k74J01j00L17OK9j31l62N18j28
3277F6k28L04k36L7J28k60K08j98j05K44J61k5j81j87K70j2m4j50M38l98J91k28
3299b05P1L25k22J17J10j98J08Pp1K1m3j06M4K19k70M5L00k14L02l94K00M0l23
3322a37J72j32J36q5k8j11L17l16J1L72m44L12M3k97J3J01Nj37J70K5M2k2j00
3345i0L77P8l03l5Kn4j7J29l2m36M60q0j1K36l7l54M70l03n1J93q1m4m9L42l96
3370h6J65O3l71m4K43P0j15m9M01l71j1K02q9j41J51J6m0J68k40K40r9K03l13
3393d7J54j84o6K01J9M3j23M5q7lk51N86m46N28l43j58J72J5p4J57r9o8L7l9J65
3418A34m15O0J42j46K53K07m1m32L15j97K72Q6j86Jj06l9J39J0Q2K68o02J85j04
$$ plain form
3254 70 -41 75 100 -329 -243 -91 -433 -29 152 -86 -57 142 90 -184 -83 -183 134 140 169 38 -324 194 66
3277 66 -162 142 -94 -57 71 -189 19 -179 -284 -40 121 96 -85 -272 -2 -14 -58 -208 230 -168 23 -205
3299 -205 -134 191 -31 86 196 -2 106 113 42 63 20 -86 -42 177 -93 -48 252 38 340 -54 146 186 -137
3322 -137 35 -97 39 -46 -74 -185 132 -184 -173 199 -245 67 110 -187 -174 -73 -68 -205 -35 -10 32 10 -90
3345 -90 287 365 62 27 29 -25 -42 87 55 -381 79 -1 -12 224 187 -167 303 0 -51 142 61 17 -32 310 -86
3370 -86 79 142 -229 -273 -30 40 -75 -124 277 -94 -105 97 8 -133 18 34 -6 162 -78 162 63 266 -47
3393 -47 107 -77 -143 58 77 120 -3 42 -45 -48 -299 287 -159 369 26 -132 40 55 -19 138 39 -29 8 -31 134
3418 134 -281 -221 -79 -225 28 235 194 -238 77 -120 152 238 52 53 -53 -92 47 57 139 407 -195 -10 -114
3441a14k62L43J57m31O88k35j7r0j42J17k84Q4K08l7mJ9l9P1K38l15j51J52m7
3464i1M44k63k50J25L47q5k35rj65L24j69K92k58J68k41J83j01rL9l00L67j78
3486f5j61J03K13J9j13J16Ll14KJ39K8NLk4j9J78l30J48J14l77M07K1p1J31k08
3511e2j06J97K59l56p5N9k73L38J45k91L43j99j17j46N2L04k90K73qj16J12kk41
3534a90L04l1j95K40k0k0K24l36o8L64l79J13o9Q2Q4R0j75j70K16k06K42k3j27
3557e0J44k00Q2J57l24K9k88L56L54k38j88M24m13m8L24j31J60j9j66J78q1ro3
3580a0J16j08j48J56r8K72k39R9R9l9J59m14P5J78q9J10k28J04j90l1K94k39R1
3603h0J6L40j41lJ34k59qm5J61J53m44J57j63L48j19p8J70l13J12J02l31L54j55
$$ plain form
3441 -114 -376 -33 124 -307 381 146 129 39 -103 14 -270 -186 22 -15 -19 0 -39 32 270 -45 -196 -44 -91
3464 -91 353 90 -160 -35 312 227 -8 -17 -182 142 -27 265 7 175 -66 117 16 7 46 -254 113 -65
3486 -65 -226 -123 90 109 -4 112 115 -199 -197 -58 -30 -25 -22 -46 -65 113 -217 -69 45 -332 75 96 25 156 -52
3511 -52 -158 39 298 -58 -133 -74 -347 -9 136 -155 188 -11 -128 -274 -222 82 -208 65 57 -59 53 51 -190
3534 -190 114 83 -112 128 108 88 312 -24 -92 272 -107 6 -63 19 103 193 18 -152 64 -142 100 77 -50
3557 -50 94 -106 -24 133 -191 -162 -450 -94 260 22 -166 258 -155 -203 121 -10 150 131 -35 143 62 53 -10
3580 -10 106 -2 -150 6 -92 180 -59 40 139 100 259 -155 -80 98 9 119 -109 -5 -195 -226 68 -171 -80
3603 -80 -64 276 135 132 266 7 -1 -46 115 268 -176 -19 -182 166 47 -31 139 -174 -62 40 -291 63 -92
3626i2K97j78J55k9q5r9p1J13J06Q3j63l8j79J01N3J96k40J9n1m7J60j58p3J01
3650a19K53l67L66k21J63q4R8K58j85j24r3K05l8J2k36L85k73k36L46J0l24J7
3672a87J47J0J08J22j62L6n7J44j67O7k24k60N63r8l08L11J82l96K54l51K02J6
3694d8M0l3N6j54R4M4J38k34J83k61K9L28k94J80k92J47K05J04k47j1k10J43K1
3717g2O7K25l49Q1J88m5j00j25R9q7P1O2j35o3K30R4r1M4J6J73m13J69P2J6J11
3742B38n10K56J54k64J7K16j54J51l07N4j8m4k8L12j81K75o0j77q9M37l08k21
3764b51M1mJ53J80q4l4p9M5J34m4k01J67R7j20n6R2k14J27J25m36L49j87J00K16
3788A16k17J1j81J40J37l0m7O8j72L49k79R5K18m14L05O0l73J84R8Qn6l83M17
$$ plain form
3626 -92 205 27 182 153 68 -31 -102 11 117 200 37 -1 -180 -79 -26 170 -70 -51 -102 -149 11 -147 -220 -119
3650 -119 134 -233 133 -88 75 -9 89 347 162 38 -55 150 112 124 -112 273 0 -236 110 120 -204 -187
3672 -187 -40 -30 78 200 38 74 17 161 -6 61 -163 -423 140 42 -266 45 227 -169 85 -266 -64 -48
3694 -48 -8 -41 15 -139 -45 -1 137 -97 86 -175 -146 182 -112 68 -224 -77 128 232 -15 -26 -236 -93 -72
3717 -72 -5 220 -129 -48 140 95 -5 -130 -31 -118 -47 15 -120 -183 47 141 50 94 110 283 -130 39 111 127 238
3742 238 -272 -16 138 -126 -109 107 -47 104 -203 -149 -167 -211 -239 73 -108 167 107 -70 -159 278 -30 -251
3764 -251 -210 -214 -61 119 35 1 -78 -33 101 57 -144 23 120 0 -56 36 -178 -51 74 -362 -13 -200 -100 116
3788 116 -101 -90 -271 -131 6 -24 -71 -3 -175 174 -105 -10 208 -206 99 159 -214 -30 68 76 20 -363 54
3811E4P8K4n9j84m0K23j67J12j44J67j66k50M50K8m29J08M11l30k29L04J5j89
3833b13K73l31J68L22l29M5j6Rnj90j04L48K4J06k05J15O6n5N6n6j62L86l36j01
3857a85J98K00k87K22k39K27j3j21K10j26k13N4J29o7PM1P0k05L4L9K22k15o0
3880g8l6K63k89J39N7j95J8N5n6N3J83j85L4q6j2J47J47p3J74j47m3M3j4k22j
3905a24L13k30j20L26k32LK6J55k96K44j32J06M4J25j12k0j73q0J68M8r9k78L63
3928B5J3j87P7P3O9k05R6O2l35J10K03oK61m15K0r6K46K70K1j13j33n2j09L26
3952B21m50K37J2J61m13K4J90J71j03j42K18P1k45J39j72r5o8L48K4J38m69K02
3974ak07J40j02j2K30l04K04K18j38j85J74J18l44K78j59L34l58K93k9j92q7O4
$$ plain form
3811 54 132 156 97 -87 -127 96 -71 41 -103 64 -102 -352 98 126 -303 -195 216 -114 -343 -39 -24 -213
3833 -213 60 -271 -103 219 -110 -65 -81 -72 -77 -267 -371 -23 1 107 -98 17 83 28 84 28 -134 252 -84 -185
3857 -185 13 213 -74 148 -91 136 123 2 212 86 -127 -73 56 -11 -4 37 107 -98 -64 -25 197 -18 -78
3880 -78 -114 149 -140 -1 56 -139 -121 -66 -122 -69 114 -71 -37 -123 -135 12 159 86 260 113 70 113 99 -123 -124
3905 -124 189 -41 -161 165 -67 -64 -38 117 -179 65 -67 39 83 208 96 76 -97 -177 -9 39 -60 -338 25
3928 25 38 -149 -72 1 70 -135 -39 23 -312 -202 1 -5 256 -159 -139 -235 11 281 302 189 56 4 -105 221
3952 221 -229 8 20 181 -232 -208 -18 153 50 -92 126 197 -48 91 -81 -176 -244 104 128 266 -203 -1
3974 -1 -208 -68 -170 -182 48 -256 -52 166 28 -157 17 135 -209 69 -90 244 -114 179 150 -42 -129 -65
3996f5J25P5J18l12K33j51j59J50k72J54K00k47Q4K28l5j97j52J01L67j21j59
4017c5J2L0j30l1L16j24O9j47n2j25K96j13O1J75k36O0oK1j9r0k81K27L46m19
4041a95Q4l2J44Mj73j0J67J55j88l4K19l74M52l15j94L44J09l70K95l2J22%k21
4064d3k38L40jl54J83P6O9j75o7K62J97k69r5K7K09k33K09k50J91n3j97L88l12
4087a36K04J01j6j47Q6K5k24K83k83J13K09jl11k4J26J00j47J14k72K52J33j48
4109C7P5k28J51J51p7k07L12k88J40l0M6j89j40K57L62m32J64j16J57k25K16j82
4131d6O1Q9j62J77j45Q2OK06j64N0j91N8J0Q7k06J42l01K72N6k16n3M4LJ19J3
4156ij44J75j57ON20k70j92Q1K5k31L37m13L60j12l9J97m88K34J6K02j50j59J92
$$ plain form
3996 -65 60 135 253 -59 174 23 -136 14 -258 -104 96 -151 -67 161 126 -71 -223 -122 245 124 -35
4017 -35 -23 7 -123 -154 162 38 107 -40 -92 -217 79 -34 27 202 -34 26 20 41 22 -68 -349 -122 224 -195
4041 -195 -111 -143 1 5 -168 -178 -11 144 -44 -78 141 -233 219 -96 -290 54 163 -207 88 56 178 178 -43
4064 -43 -281 59 58 -296 -113 -37 32 -143 -210 52 249 -20 -115 -88 121 -112 97 -153 38 -15 -212 176 -136
4087 -136 68 169 153 6 92 117 -107 176 -107 6 215 214 -97 -121 5 105 -42 72 -200 52 185 37
4109 37 112 -116 35 186 109 -98 214 -74 66 36 82 -107 -247 10 372 -60 104 -12 145 -80 136 -46
4131 -46 15 104 -58 119 -26 56 62 268 104 154 -37 21 31 118 -88 54 -247 25 81 -135 -188 -144 -141 -22 -9
4156 -9 -153 22 -135 -129 391 121 -71 10 35 -196 141 -272 88 -24 -63 134 -354 -120 -104 98 -52 -211 -19
4179a9n8j01L13k7K9J76k20j96k4L7O4K0n2j6o6K85r6j98N5J23n8Rj6P2q4L18
4205B70k34j23k6J11N3l9%J41k25R5M6j26n9J82N1m24J88K06k18L50j52P0j11
4228B6PR7j11J4r6L3N9MR4K8J09k76k3J36j56J4j51L19Q6l26o5L9J46m3n3L3N7
4255Aq1J89M8j29j10K99j15L1r8j73k9K65r6j96L06j74K50n65N29J2K43n55J2
4278a36J34P5j6p3R9K9k89K54r7j7n6j87K48j44K06P3R1m9j81k5J53O8j84j03
4302a27J44J1j4j52J85J79o3Q3l24l3L29l67K29k20J00M81j97k15K43j38l68K62
4324B8RQ9j91J61j56J68q0q2K46k70k19M31M6n2j26j03J94q0j26P2L49j51l35
4347a78J63l0jq2M7OJ91R5m21oK63k14J40J31j3J49j55j40K13J39m85K35Q1n2
$$ plain form
4179 -19 -77 -178 135 108 137 313 93 -103 -127 -90 -26 -6 -58 -74 -140 145 49 -149 -94 29 -29 -20 -36 36 -48 270
4205 270 36 -87 -113 -2 51 12 12 153 -72 23 69 -57 -116 66 117 -307 -119 87 -131 219 67 137 26
4228 26 33 130 19 33 -63 -30 29 33 127 155 264 -12 -35 101 -55 -41 -192 127 213 -113 -178 -139 7 -36 -89 -56 1
4255 1 -80 109 157 28 -82 217 102 133 35 -138 -167 98 2 -194 112 -62 188 -377 152 164 407 -148 -136
4278 -136 -2 73 57 -16 83 112 -177 77 -20 -37 -93 -280 -32 -176 30 103 194 145 -36 -61 92 160 -24 -127
4302 -127 17 28 14 -138 47 226 163 246 -78 -111 218 -149 80 -140 -40 441 244 29 272 134 -234 28
4324 28 37 126 -65 96 -60 108 28 -54 192 -78 -297 134 180 128 2 -101 93 13 -113 -41 308 157 -178
4347 -178 -15 -45 -46 -128 -81 -75 116 211 -210 -216 47 -167 -27 104 91 240 85 -55 158 297 -188 47 128 76
4371G6j49L4K21O3k87nP9Q0J15p6k91J22o0P0J33j23p3J54l12R2L14Q7j53j67
4395e6J26N3k70Q0J88j04J56q7l05J75J29r5q0K73j85J54J01l62J11J05m72M44
4417G9k4k16K57k60K44m9L2rj37J19J63j17J8J72l08k51K38j6K04j25R3k95R0
4440i8J02j97M27k8j30p7r8K81J06k27P0k25J67m0N6J5L6j3k90JP2J14l7n8r5
4465a66J60J5k14J09K00Q8o8P9q7k53R7K36k03L45j57l2m23L50k41j79J40L68
4487A64k11j38M0jL60j45O4J2j28J03R2k75L09r9j43M3J01j37m0O1J28p6j12O0
4511C2K68k57k03K60j50l7L99m84J06Q4n3O6j49j05L55j94l3J83j88J89k91k2
4533b24J50l3l4j55L95p4K42N5l39K04Nj39R5j53J54j31Pr0N2l8L71l48R6P2j29
$$ plain form
4371 76 -73 -39 182 245 -42 -47 32 112 227 151 -140 -18 -78 -8 125 2 -71 83 -229 -137 177 264 111 -56
4395 -56 70 123 -147 -67 121 17 173 86 -219 -44 85 -10 -90 183 -2 152 253 -109 2 107 -365 79
4417 79 55 -161 96 -164 80 31 63 54 -83 36 199 82 100 272 -36 -287 -49 -65 139 14 107 -188 -98
4440 -98 4 -193 234 206 76 -1 -99 182 288 61 131 -94 73 33 89 104 140 127 -163 -162 -90 24 -13 -71 -166
4465 -166 -6 9 -205 -96 104 192 124 203 116 -137 -40 196 -7 338 181 149 -274 76 -165 -344 -204 164
4487 164 -47 -185 -145 -146 214 69 133 145 17 120 212 -63 246 147 4 47 148 11 -29 32 160 84 -28 32
4511 32 300 43 -160 100 -50 -87 312 -172 -66 18 -35 31 -118 -223 132 -62 -95 88 -100 89 -202 -224
4533 -224 -74 -107 -141 -296 99 25 267 322 -17 187 192 53 148 -5 149 18 25 -65 -13 -51 320 -28 68 140 11
4558A1j00P8K0P0j07m4P1Qj62J57J02l2p1k46L49k72K16O9j05M2n9o9J39r0l7
4583f2L59l2l05mn4j07L54K1j83PJ46MP0k92J9J08J1j32l1j1K21l2k28M1J9J93
4609A00r2L04k28O5k82K87l53J33J0j20J13p0K77p8p2k4J11l20K68J05k88J61
4631GO8k50K41k68L69l30J92k05K75N3l61L64k94O7J64k50N4J60j00j5k41K33
4653f7J54l64N3L94j33k5P4j6j51j85L43k30J20n6K13k53l3J09j42m1M01k57L87
4676B95l22J14k2k48L23%N6k14K79m03j63J75Q0K18j22k86L5L29j63J00r8R3l3
4699B3K99k63j61J75J0j57J33O0k84L98k28j53j21Q9M1R9J83p1r8m8J80k3M7k70
4723a40J08L8k21K14j23J03K77j73K1k06j06J56J57q6l0J92P6j40Q7l59L30p2
$$ plain form
4558 11 -89 -11 9 79 -28 -72 -1 7 -155 2 104 72 1 -245 104 -168 48 117 12 54 -5 -74 65 -25 -62
4583 -62 297 265 -40 -44 -98 -205 149 170 -13 -6 140 144 214 -78 -59 49 60 -72 -103 -114 107 75 -153 -112 -93 100
4609 100 8 312 84 149 -133 154 -199 -66 -56 -176 -63 -133 144 66 -6 -30 81 -239 29 134 -154 7
4631 7 75 -175 66 -202 167 -163 29 -176 99 152 -209 155 -139 -72 92 -158 -104 56 -44 -59 -300 -67
4653 -67 87 -277 -224 170 37 12 86 70 -81 -266 77 -153 -33 -89 124 -129 -162 -53 -195 -236 165 -92 295
4676 295 -27 87 65 -183 140 140 196 -18 261 -142 -305 -130 -50 168 46 -240 -205 124 -39 61 -37 56 23
4699 23 322 59 -102 73 83 -74 59 119 -165 233 5 -148 -269 -180 -139 -40 143 72 -26 -74 106 83 130 -140
4723 -140 -32 6 -215 -1 -124 -21 256 83 104 -102 -208 -52 105 19 -11 181 257 117 204 -155 175 103
4745A03j62K40j35l01J6N19k41q0n2J36j49l1j8j30J48J98J04k99J85J15j00L7
4767A03j67M00m58N4L15j34PN2j9j95J72j38j28N0K08j8k57J10p6J06l6J75j22
4790DLo3jk89J45J48L34m01K83p9k12M30k01k33J55j8oO6k05K61k04J18m9O5O1
4815A12j2K0oj44r4K3R0j36N2L8J18J4j34M0J2o4K41j84R7j27J53l96L10j84J20
4840d1K48j64l27M18l9K44l51M4r5r6M21k58j12J17k14M23j00N1j80r3J40j02
4862f6K9j39J00L61j52k26L78j88J41j75k10p3K61R7j06j79J46J91l61O8J11p5
4884f7J78Nl71K0L51j91K55l03K65k93J90L3j55R2o2k63K27OJ85k8O8J85j58j66
4908CK27o8k69K39k73J88m5j49J9N3K27j51o4K15k49k6o0L03k75Q4O9J73l05K42
$$ plain form
4745 103 -59 181 46 -255 -239 280 39 -41 -93 43 -106 -137 -155 -285 -137 61 165 -134 51 166 66 103
4767 103 -64 336 -122 -68 247 113 120 172 153 -42 130 -8 -136 -86 122 104 -153 -43 -119 -13 -49 126 4
4790 4 7 -56 -57 -346 -201 -53 281 -120 163 84 -128 302 101 -132 23 5 -1 65 -140 121 -83 35 -14 51 112
4815 112 100 120 114 -30 -124 -101 -11 -147 -95 -57 61 75 -59 -19 -7 -71 170 -14 83 -44 109 -287 23 -161 -41
4840 -41 207 43 -284 134 95 339 -12 32 -63 -159 262 4 -108 9 -205 218 118 169 -11 -104 36 -66
4862 -66 -37 -176 -76 285 133 -93 285 97 238 63 -147 -220 41 138 32 -147 -1 190 -171 -103 8 -67
4884 -67 111 116 -255 -235 116 -75 180 -123 142 -151 39 72 -83 9 -53 -316 -89 -83 102 74 142 327 169 3
4908 3 230 162 -107 132 -141 47 2 -147 -128 -75 152 1 -63 152 -97 -123 -183 120 -155 -71 -2 171 -134 108
4932A08J32j46j00N8k38J85j23K9J91j28j01l7L55j18j6j20K34k51R0k00K07K61
4954B72l03J54l10K35Lk45k3L22R7k98J96l98N02j27k78R0O5R1j62L6J70j66K46
4977A69Q0l54J39Q5n6n0M8o9j2j66L18j10j35kJ48J67N4m64J27J57j59J2p7J34
5001a6q6Q9L02l67K45Q3l57K18k37K05Q3m02K7K19P2j74J5l3K18j11n7J39j17
5024d2J87k89J84J03p0J04j42n6O7j2j26N8k04J99K22j08l86L75k08J80L1J33
5046B00j39k93L10%k03j73K87J03p0j79R2K01j95k15J93l1J32K3P0k23J13K2%
5069B5j75L7j06p1K06K65j14k14J29Oj42K44j61j48L27n0j75J08J93j3k76L9L46
5092B80n6l69J05n2r0K65k99J52J35r3j43K13k77J68O1o0N7p2Q9j9K31j96J33
$$ plain form
4932 108 240 94 -6 52 -186 -1 -124 -95 96 -32 -133 -170 185 67 51 -69 165 -86 4 -196 11 272
4954 272 -31 123 -187 48 51 -194 -217 105 202 -96 100 -298 204 77 -201 -111 -46 45 -117 -81 89 -77 169
4977 169 249 -105 34 119 63 13 61 -8 -20 -186 132 22 -113 -115 33 200 254 -210 -83 74 -85 -73 -150 -16
5001 -16 -102 -13 289 -78 167 250 -107 111 -126 79 162 -240 -213 6 78 -96 -81 -114 104 -7 -64 75 -42
5024 -42 145 -144 40 143 73 177 35 -21 46 34 -92 -34 -238 -39 183 75 -311 64 -144 36 67 200
5046 200 61 -232 78 78 -125 -298 -11 92 22 -157 -65 136 -59 -274 -81 -112 20 43 113 -110 3 25 25
5069 25 -150 -113 -219 -290 -84 181 67 -147 -18 -12 -154 90 -71 -219 108 58 -117 -9 184 171 -105 -66 280
5092 280 224 -145 -40 -92 -182 83 -216 -64 71 -22 -165 48 -229 -61 0 -60 -3 -75 14 -5 226 30 163
5115A63l60L7N4L65n26J29M66l65N9k05K67k45j4J8O6K53n9P6k68k2m6J49Kk5
5139c1J31j92J62Q4Jl0j50k64K88l4%J52p7J47j62O5k9o91P27k26J02j87M59j98
5163D7j10L34m27L29j95J0l6J46k59J68L3J69M7m79K65m07L13K6k2m43L34J37
5185b0m3Q2K6p5K23j98m1K18j85J59j63l4n1L3n5K59j70o9K81pj51k30j5L28J
5210A03m8P3r2p1K68j04j42m6J6R1n4j4m1K17j52N5j77qL8J34J69j1qk51J30j87
5236a12M8k01L10R9J18l12k91K70L45j99m94M80J02k15J18k6nl4j02o1M97l59
5258b4k07L82p4j69q6K30m8r0L3K11l68K39M1l05J15J61k24K82j93j76L4L12j56
5281h0J79m8O1K37j69l19P5j4o9K55l34K90k76J81k27L94J2m8j70R8k3k74L65
$$ plain form
5115 163 -197 -160 -106 259 -267 -138 328 -37 22 -183 84 -161 -175 -157 -91 162 103 179 -89 -111 -157 -8 -6 -31
5139 -31 100 -92 70 154 155 125 -25 -289 -1 -35 -35 117 40 187 25 90 61 -630 97 -129 -27 -214 245 47
5163 47 -63 271 -156 173 -22 -12 -48 98 -161 7 40 209 256 -223 42 -365 -52 -26 -48 -491 -157 -20
5185 -20 -63 19 45 -30 193 -5 -46 172 -13 146 -17 -51 -102 -69 -124 135 -35 -104 177 170 19 -211 -226 102 103
5210 103 55 128 36 -35 233 129 -13 -59 -43 48 -6 -20 -61 156 4 59 -118 -126 -88 46 215 204 196 -55 75 -112
5236 -112 -64 -265 45 144 262 -50 -341 -71 274 75 -419 61 163 -52 66 40 35 1 -101 -162 335 -24
5258 -24 -231 151 77 -92 -178 52 4 -86 -53 158 -210 29 70 -235 -120 41 -183 99 -94 -270 -236 76 -80
5281 -80 99 51 112 349 180 -139 -64 -78 -147 108 -226 64 -212 -31 -258 136 148 100 -70 28 5 -269 96
5304I6k19L54j99J89m56K91j33m7j44J00K16l9J65k83K67j10k2J80k46p9R3j12
5326a38j10L18K51l41J33k57J02rj53J05L04j35k26K15nj80Q8J51j31r1J13O7
5348G1k17L95J63l35r6j01P2J63j91K39k95K05o0J07J14j99J06J00m13J14K36
5369A78k41K2N0J04J11l11J90j44j88M11j26l21M26l27J96J89k04K4J54k80R6
5390Ipr1PL2O2L4l9j34J37J48j89O8J34r1o2R5q0j15K28j11R6n5n6k7K27j74O1
5417A07Mk05L49j78n2n9O7q1P9o2j2l0N6qk50N60k96J60p3r3RL8MJ29k41k48L60
5444C4j15R1j30j4L94j06k18k34N44m52K91Q9o5k0J36j73P0p3n6j20k34M74j42
5467b9N4J46j03k33J07N2J25q6l00N25k91k76K95j75K39k03J9L78j58j23K28l6
$$ plain form
5304 96 -123 231 32 221 -235 56 -77 -124 -268 -168 48 9 174 -109 158 48 26 206 -40 -119 -26 -138
5326 -138 -248 70 321 -20 113 -144 -42 -51 -204 -99 205 70 -156 59 54 -126 -38 113 -18 -109 4 71
5348 71 -146 249 412 77 -19 -120 -48 115 -76 163 -132 73 13 120 234 35 141 241 -172 -58 178
5369 178 -63 -41 9 113 224 -87 103 -41 -229 182 56 -265 161 -166 30 219 15 39 193 -87 9
5390 9 2 -89 -82 -50 12 46 7 -127 10 158 -31 37 171 80 18 113 33 -82 146 35 131 76 20 -7 220 46 107
5417 107 111 -94 255 77 25 -34 33 -48 31 -31 -43 -73 -17 -25 -275 285 -11 149 76 -17 -8 30 34 163 -78 -326 34
5444 34 -81 10 -120 -134 260 154 -64 -298 246 -206 85 174 109 89 225 52 122 49 -7 -127 -361 113 -29
5467 -29 25 171 68 -165 -58 -6 119 33 -267 258 -33 -309 -14 -189 50 -153 -134 244 86 -37 191 155
5489A55r3j09j73J05K37j16j82K34l88J65R3p6J95n0J32j1m66K78L13k29Q0j45
5511e1L4K8J50k2j13ml3O5J02j15L1j10l9K22J09j54MM1m40J40lJ96j70p9K33
5536B2j2K87l68j01J19n7j16L40r2k33K07Q1k38L01q1O0J2p7j62OJ75k41K70j41
5560c9K42m97J64j9J35q2L53l17K08N8l84N90n73L26k26K9j27M93n47K07Oo1p1
5583a32K43l23L83j56n4J51j68J75j6J48l17K33k72Q9J19k58J2K09q5m7M2lj16
5606a43J58K7j32J15M9K77m62J26K41m66M32n29j1K73L0P2o4K9K9j66J42l4J11
5629A04j89J51J44p3j33n9K10j83J8L67k54j11k1k32M67l10L68l52K89k05P0n2
5651A4n1J68j97pk4p8p3M04j41p2j6M6p1J90kJ05j75r6R1k25j6j2J32R1k17J52
$$ plain form
5489 155 62 -47 -220 -115 122 6 -176 58 -330 -165 -72 -148 47 -3 129 118 -348 -70 243 14 94 -51
5511 -51 -17 11 161 139 26 22 -11 54 156 41 72 -38 -77 145 254 100 104 145 -295 -155 -158 38 -132 -211 22
5536 22 10 297 -71 -172 -53 -110 -226 114 22 -211 -4 77 -161 140 59 119 131 54 -108 -102 73 -168 102 -39
5560 -39 203 -294 -130 -149 -14 -96 257 -60 148 206 -178 412 -161 165 -61 -32 -159 334 -213 -6 0 -61 -132
5583 -132 111 -212 171 15 -39 112 -56 119 103 251 -66 167 -105 -16 103 -155 -143 66 -19 -66 -24 -27 -143
5606 -143 15 42 -90 25 74 351 -111 15 256 -210 222 -307 -318 -45 -15 57 -7 22 51 -115 27 -7 104
5629 104 -85 66 210 137 4 -55 155 -28 -10 357 103 -8 -29 -261 206 -104 264 -88 201 -4 66 14
5651 14 -37 131 -66 -73 -97 -175 -248 156 15 -57 -73 -27 -98 92 90 195 20 -76 15 -210 -226 -238 -106 -15 -232 -80
5677h0L9k6j28L50K0J37m73o8K01O5l36J81J73rO9q2M4M4j48o0J06K2P6l51M9
5702a85K23j23J31N7j76o9K19j82O7J06j07J40k32L13rj11j47j52L09M3j51O1
5724B5M1p3LJ75j58K5k63J25j39L15kj94Q0J78l6k89K23J75r9P6k31J69J51j88
5748H9k67L60j89J63R9k42j82K00k02Q5K38k52M0K8J95o16M42j7J7n9k06M2J34
5771a00J78p2j15J59j17J77O7l07K69j49pK58j17n9j28J12l64N46k38Q8j63K5
5793e7K08l21n6L24K1k37L83k32m2P3j47n0J74n1M4j85PJ87p5K1J6J35k66J69
5817D3J62j23Oj00K49k08k41J1L30Lk51P1K89n10J19R7K98o8r1k16M3L9J0J21
5841H3n7j45K9j51K29R6j65kqK23rl1l0j56J14k29J13J82j57J26j29K16j56j57
$$ plain form
5677 -80 -41 -67 -195 155 175 312 -161 -229 -28 37 -299 -118 55 46 115 33 77 121 -27 -87 19 41 117 -234 -185
5702 -185 38 -85 46 103 -73 -142 77 -105 -38 68 -39 101 -131 182 173 62 -85 -237 72 115 -36 25
5724 25 66 -7 -4 171 13 38 -225 -100 -239 76 74 -120 -40 138 102 -187 36 211 112 188 -43 126 277 89
5748 89 -178 182 -7 156 255 13 -169 31 -171 -86 152 -100 -60 -32 163 -453 -11 -28 -11 -70 -276 -234 -100
5771 -100 78 6 -109 50 -67 110 177 -130 139 -10 -17 241 124 65 -63 49 -315 231 -7 81 -82 -57
5793 -57 151 -170 -226 98 119 -118 265 33 -9 64 -83 -133 41 -10 34 -151 -144 43 -32 -11 5 140 -126 43
5817 43 205 82 88 -12 237 29 -212 -201 129 132 -119 -48 241 -269 -150 -53 245 177 86 -130 -87 -48 -38 83
5841 83 26 -119 -90 -241 -12 84 -81 -83 -91 132 123 92 62 -94 20 -209 -96 86 -71 55 -74 142 -14 -171
5865a71O1K7J57j57K4J10lk77K87J9j91K45j50J65j73p3J64m64L90j39J86Q4k14
5888i3K06k75L65k85M04l67k08M49k38M7L8k5k07J38j2J82o8j77J76J73j89P9
5910A13j07r6k4L02M2k64J52j55J94j57M9l02K64k1L0k0j86K70j39J52j58L74
5932C13j31j31K11l84J28K33k84j7k87M73P4l15N6j18K17r5j60q6N93l7k24r1
5954f2K6K52Mj46k96J65N1O4k42J35N3j27k6K11j28n4K40k65K03k05K99j03k73
5977b24K86O8j56K23k80K25j40J06N0k71Q2n3J54J14l02K35K5J99k24l90J61K53
5999A41k82J35K06j66q5lK44q2l72J82K04k44K06j59J03kJ3l6k2K90k77J95l51
6022a62O0J04k82N75m84J20M60n28K09J01k91N1j55J93J10k17Q4j77M67l16j5
$$ plain form
5865 -171 -110 -83 74 -83 -59 51 48 -229 58 77 -114 131 -19 146 -27 -100 64 -400 -10 -149 37 121 -93
5888 -93 113 -162 203 -82 322 -45 -253 196 -42 5 43 18 -189 -51 -63 119 51 -126 50 223 34 113
5910 113 6 -90 -114 188 230 -34 118 -37 157 0 49 -253 11 -10 20 0 -186 84 -55 97 -61 313
5932 313 182 51 262 -122 6 239 -45 -62 -349 124 198 -117 -61 -179 38 -57 -217 -303 290 253 29 -62
5954 -62 -36 216 220 74 -222 -57 -6 58 -184 -49 4 -123 -149 62 -66 -120 120 -145 58 -147 152 49 -224
5977 -224 62 130 -26 197 -83 142 2 108 158 -113 -31 -84 70 184 -118 117 142 341 117 -273 -112 141
5999 141 -141 -6 200 34 -51 -54 190 108 -264 -82 122 -122 84 -75 28 26 39 3 -19 271 -6 189 -162
6022 -162 -102 2 -280 295 -189 -69 391 -137 72 173 -118 -67 -222 -29 81 -136 -52 -229 238 -78 -93
6043i3j17Q4L93l36j57L27j27j00J33o5J72l29j3M06M3l17P1O0Ok47L29o9m0j65
6067a51k2J95k14J83K8J23j34K12k01oj72J13j4J18j1j12j86K82r3q3J57j81K36
6090F7j28m8J38M4k62J91p1R1N8m8N8n4k37J02J79m0K9O2k60n6L0K99o7o6K0R9
6116A30j92N0R6j28J69n1l28K20J1j24k31M47K1%o3p0K32l34K22LJ49p4j36l9
6140b0p3J79k63k4J10J33o8L55k57R4k04J60k53Q0O5NJ25k58n1l7K91J80l72N4
6164d9j25M44l14Q8j4PK71k62j88J16m1K41j42k38K29j97J24Q2M5q8j40K32j57
6187g6k3M7k76K91j2q9L97j54j99J98L3k23L07k92J05O0l55K22K51l17J67j34
6209g2K16N9k37N8n0k18K78k23J30P6mR5j62l1J20j99L26j31k9j34M29l56JN4
$$ plain form
6043 -93 -210 -126 267 -69 -226 101 -26 -126 7 -58 114 -215 -228 178 221 -96 -25 35 41 -206 123 54 14 -151
6067 -151 -173 22 -192 -9 19 142 8 220 19 13 -159 -46 -60 58 47 -65 -251 31 -62 -145 12 -169 67
6090 67 -61 -109 29 73 -189 2 -69 22 80 32 90 36 -201 -99 80 40 69 131 -129 -185 -155 144 77 11 31 130
6116 130 -62 -12 84 -44 125 74 -254 -34 -23 -147 -378 69 90 90 27 -43 189 -145 77 80 229 155 19 -20
6140 -20 -93 86 -177 -201 -91 42 -26 329 72 166 -38 122 -131 -51 14 19 144 -114 -165 -202 89 269 -103 -49
6164 -49 -174 270 -44 44 30 37 308 46 -142 -26 -67 174 32 -206 23 -174 -50 32 77 -11 -151 81 -76
6187 -76 -99 -52 -328 -37 -49 -138 259 105 -94 104 137 -86 221 -71 34 94 -261 -39 212 -105 62 -72
6209 -72 144 203 -34 24 -26 -244 34 -189 -59 17 13 108 -54 -85 35 -164 162 31 2 -132 297 -59 -58 -4
6233dj7OlK31r3J17l01K90k64O3j65K71J8j34J12M1k18l8r0K05K07j03k65J15
6257a9k1Rk0J68J5j72O0J22l11o5R4L02Q3n7m13L00k32J32j47J20K41J60m42o1
6281a54K32K5k8K3k39j19K75J3k6r3K74k81J21J9j31L76m82J84J05l20Q4J82R8
$$ plain form
6233 -4 -21 -15 -18 213 120 237 -64 226 -38 25 -140 131 149 15 127 168 -50 -88 -178 27 234 131 -134 -19
6257 -19 -40 -31 -51 117 132 -40 20 142 -169 -234 -140 162 245 188 -225 75 -157 -25 -172 -52 189 349 -93 -154
6281 -154 78 103 75 98 -141 -260 15 28 2 -91 183 -98 23 42 -89 287 -195 -11 94 -226 -142 40 138
$$ [...]
8191A37
##END NTUPLES=NMR FID
##END=
