##TITLE=1H_Pr Dep-53
 CDCl3
 8 sc, 
 21.09.2022
##JCAMPDX= 6.0         $$ Bruker NMR JCAMP-DX V2.0
##DATA TYPE= NMR FID
##DATA CLASS= NTUPLES
##ORIGIN= UXNMR, Bruker Analytische Messtechnik GmbH
##OWNER= root
$$ XWIN-NMR		Version 3.5
$$ Wed Sep 21 15:34:29 2022 Russian Standard Time (UT+4h)  she@DPX200
##.OBSERVE FREQUENCY= 200.1313499994
##.OBSERVE NUCLEUS= ^1H
##.DELAY= (6, 6)
##.ACQUISITION MODE= SIMULTANEOUS
##.ACQUISITION SCHEME= undefined
##.AVERAGES= 8
##.DIGITISER RES= 18
##SPECTROMETER/DATA SYSTEM= spect
##.PULSE SEQUENCE= zg30
##.SOLVENT NAME= CDCl3
##.SHIFT REFERENCE= (INTERNAL, CDCl3, 0, 15.7039)
##AUDIT TRAIL= $$ (NUMBER, WHEN, WHO, WHERE, WHAT)
$$ ##TITLE= Audit trail, XWIN-NMR		Version 3.5
$$ ##JCAMPDX= 5.01
$$ ##ORIGIN= Bruker BioSpin GmbH
$$ ##OWNER= she
$$ F:/spectra/data/she/nmr/H-F/1/audita.txt
$$ ##AUDIT TRAIL=  $$ (NUMBER, WHEN, WHO, WHERE, WHAT)
(   1,<2022-09-21 15:33:32.73 +0400>,<she>,<DPX200>,
      <created by zg, POWCHK disabled, PULCHK disabled
       configuration hash MD5:
       00 E9 B6 7A A2 85 ED C7 34 08 36 98 17 FE 4E 26
       data hash MD5: 16K
       18 68 98 5F A0 25 8C 20 DF 6F CA 64 52 9A 50 6F>)
$$ ##END=
$$ 
$$ hash MD5
$$ 97 9B 23 E4 DC 6B F7 4B AB 8C 2C FC 00 31 1D 5C
##$RELAX= 
##$RELAX= 
##$RELAX= 
##$RELAX= 
##$RELAX= 
##$RELAX= 
$$ Bruker specific parameters
$$ --------------------------
##$DU= <F:/spectra>
##$EXPNO= 1
##$NAME= <H-F>
##$PROCNO= 1
##$TYPE= <nmr>
##$USER= <she>
##$AMP= (0..31)
100 100 100 100 100 100 100 100 100 100 100 100 100 100 100 100 100 100 
100 100 100 100 100 100 100 100 100 100 100 100 100 100 
##$AQSEQ= 0
##$AQ_mod= 1
##$AUNM= <au_zg>
##$AUTOPOS= <>
##$BF1= 200.13
##$BF2= 200.13
##$BF3= 200.13
##$BF4= 200.13
##$BF5= 200.13
##$BF6= 200.13
##$BF7= 200.13
##$BF8= 200.13
##$BYTORDA= 1
##$CFDGTYP= 0
##$CFRGTYP= 5
##$CHEMSTR= <none>
##$CNST= (0..31)
1 1 145 1 1 1 1 1 1 1 1 1 1 1 1 1 1 1 1 1 1 1 1 1 1 1 1 1 1 1 1 1 
##$CPDPRG= <>
##$CPDPRG1= <>
##$CPDPRG2= <>
##$CPDPRG3= <>
##$CPDPRG4= <mlev>
##$CPDPRG5= <mlev>
##$CPDPRG6= <mlev>
##$CPDPRG7= <mlev>
##$CPDPRG8= <mlev>
##$CPDPRGB= <>
##$CPDPRGT= <>
##$D= (0..31)
0 1.2 0 0 0 0 0 0 0 0.06 0 0.03 0 0 0 0 0.0002 0 0 0 0 0 0 0 0 0 0 0 0 
0 0 0 
##$DATE= 1663760012
##$DBL= (0..7)
120 120 120 120 120 120 120 120 
##$DBP= (0..7)
150 150 150 150 150 150 150 150 
##$DBP07= 0
##$DBPNAM0= <>
##$DBPNAM1= <>
##$DBPNAM2= <>
##$DBPNAM3= <>
##$DBPNAM4= <>
##$DBPNAM5= <>
##$DBPNAM6= <>
##$DBPNAM7= <>
##$DBPOAL= (0..7)
0.5 0.5 0.5 0.5 0.5 0.5 0.5 0.5 
##$DBPOFFS= (0..7)
0 0 0 0 0 0 0 0 
##$DE= 6
##$DECBNUC= <off>
##$DECIM= 32
##$DECNUC= <off>
##$DECSTAT= 4
##$DIGMOD= 1
##$DIGTYP= 9
##$DL= (0..7)
0 120 120 120 120 120 120 120 
##$DP= (0..7)
150 150 150 150 150 150 150 150 
##$DP07= 0
##$DPNAME0= <>
##$DPNAME1= <>
##$DPNAME2= <>
##$DPNAME3= <>
##$DPNAME4= <>
##$DPNAME5= <>
##$DPNAME6= <>
##$DPNAME7= <>
##$DPOAL= (0..7)
0.5 0.5 0.5 0.5 0.5 0.5 0.5 0.5 
##$DPOFFS= (0..7)
0 0 0 0 0 0 0 0 
##$DQDMODE= 0
##$DR= 18
##$DS= 0
##$DSLIST= <SSSSSSSSSSSSSSS>
$$ [...]
##$SUBNAM2= <"">
##$SUBNAM3= <"">
##$SUBNAM4= <"">
##$SUBNAM5= <"">
##$SUBNAM6= <"">
##$SUBNAM7= <"">
##$SUBNAM8= <"">
##$SUBNAM9= <"">
##$SW= 18.0517283424941
##$SWIBOX= (0..15)
0 0 2 0 0 0 0 0 0 0 0 0 0 0 0 0 
##$SW_h= 3612.71676300578
##$TD= 16384
##$TD0= 1
##$TE= 0
##$TE2= 300
##$TE3= 300
##$TEG= 300
##$TL= (0..7)
0 120 120 120 120 120 120 120 
##$TP= (0..7)
150 150 150 150 150 150 150 150 
##$TP07= 0
##$TPNAME0= <>
##$TPNAME1= <>
##$TPNAME2= <>
##$TPNAME3= <>
##$TPNAME4= <>
##$TPNAME5= <>
##$TPNAME6= <>
##$TPNAME7= <>
##$TPOAL= (0..7)
0.5 0.5 0.5 0.5 0.5 0.5 0.5 0.5 
##$TPOFFS= (0..7)
0 0 0 0 0 0 0 0 
##$TUNHIN= 0
##$TUNHOUT= 0
##$TUNXOUT= 0
##$USERA1= <user>
##$USERA2= <user>
##$USERA3= <user>
##$USERA4= <user>
##$USERA5= <user>
##$V9= 5
##$VALIST= <valist>
##$VCLIST= <CCCCCCCCCCCCCCC>
##$VD= 0
##$VDLIST= <DDDDDDDDDDDDDDD>
##$VPLIST= <PPPPPPPPPPPPPPP>
##$VTLIST= <TTTTTTTTTTTTTTT>
##$WBST= 1024
##$WBSW= 4
##$XGAIN= (0..3)
0 0 0 0 
##$XL= 0
##$YL= 0
##$YMAX_a= 83884
##$YMIN_a= -129710
##$ZGOPTNS= <>
##$ZL1= 120
##$ZL2= 120
##$ZL3= 120
##$ZL4= 120
##$ABSF1= 10
##$ABSF2= 0
##$ABSG= 5
##$ABSL= 3
##$ALPHA= 0
##$AQORDER= 0
##$ASSFAC= 0
##$ASSFACI= 0
##$ASSFACX= 0
##$ASSWID= 0
##$AUNMP= <proc_1d>
##$AZFE= 0.1
##$AZFW= 0.1
##$BCFW= 1
##$BC_mod= 2
##$BYTORDP= 1
##$COROFFS= 0
##$CY= 11.3945322036743
##$DATMOD= 1
##$DC= 2
##$DFILT= <>
##$DTYPP= 0
##$F1P= 2.36226072786647
##$F2P= -0.459571619588291
##$FCOR= 0.5
##$FTSIZE= 0
##$FT_mod= 4
##$GAMMA= 1
##$GB= 0.15
##$INTBC= 1
##$INTSCL= 1
##$ISEN= 128
##$LB= 0.24
##$LEV0= 0
##$LPBIN= 0
##$MAXI= 10000
##$MC2= 0
##$MEAN= 0
##$ME_mod= 0
##$MI= 1.114404
##$NCOEF= 0
##$NC_proc= 0
##$NLEV= 6
##$NOISF1= 3.799351
##$NOISF2= 2.8
##$NSP= 1
##$NTH_PI= 0
##$NZP= 0
##$OFFSET= 15.70392
##$PC= 1
##$PHC0= -18036.5
##$PHC1= 16.20069
##$PH_mod= 1
##$PKNL= yes
##$PPARMOD= 0
##$PSCAL= 0
##$PSIGN= 0
##$REVERSE= no
##$SF= 200.130013532006
##$SI= 16384
##$SIGF1= 3
##$SIGF2= 2
##$SINO= 400
##$SIOLD= 16384
##$SREGLST= <1H.CDCl3>
##$SSB= 0
##$STSI= 0
##$STSR= 0
##$SW_p= 3612.71676300578
##$SYMM= 0
##$S_DEV= 0
##$TDeff= 0
##$TDoff= 0
##$TI= <>
##$TILT= no
##$TM1= 0
##$TM2= 0
##$TOPLEV= 0
##$USERP1= <user>
##$USERP2= <user>
##$USERP3= <user>
##$USERP4= <user>
##$USERP5= <user>
##$WDW= 1
##$XDIM= 8192
##$YMAX_p= 0
##$YMIN_p= 0
$$ End of Bruker specific parameters
$$ ---------------------------------
##NTUPLES= NMR FID
##VAR_NAME=  TIME,          FID/REAL,        FID/IMAG
##SYMBOL=    X,             R,               I
##VAR_TYPE=  INDEPENDENT,   DEPENDENT,       DEPENDENT
##VAR_FORM=  AFFN,          ASDF,            ASDF
##VAR_DIM=   8192,          8192,            8192
##UNITS=     SECONDS,       ARBITRARY UNITS, ARBITRARY UNITS
##FACTOR=    0.0002768,     1,               1
##FIRST=     0,             0,               0
##LAST=      2.2672688,     0,               0
##MIN=       0,             -129710,         0
##MAX=       2.2672688,     83884,           0
$$ Real data points
##PAGE= N=1
##DATA TABLE= (X++(R..R)), XYDATA
$$ [...]
1790C10j77j66j9J05k16k68M34j47j72J0J05Q5Q0N8r7k51K29rM89l18m9J70J63
$$ 310 133 -33 -52 53 -163 -431 3 -144 -316 -306 -201 -116 -36 22 -75 -326 -97 -106 383 65 16 186 349
1813C49M1l19j52K76PL0R1k16j75k9K89k61J37k87L78k86O6j07J49k71r7L33m4
$$ 349 390 71 -81 195 202 232 323 107 -68 -97 192 -69 68 -219 159 -127 -61 -168 -19 -290 -387 -54 -98
1836i8K16l56R7L14j45o1J59o5J38l9J79n70L91k9J96j24k72L35l21J1m1l4N2
$$ -98 118 -238 -141 173 28 -33 126 61 199 160 339 -231 160 131 327 203 -69 266 -55 -44 -85 -119 -67
1859f7J2j43j63J03J75k50M01l22J41J51l68K37M67j69j0j43o4L6K09j75P0K07
$$ -67 -55 -198 -361 -258 -83 -333 68 -254 -113 38 -330 -93 374 205 195 52 -12 24 233 58 128 335
1881C35k62J08L2o9n6j36J11m1j8r6r0L4M1L7m1J17j84n5K71k51P1J57n3J95p5
$$ 335 73 181 213 144 88 -48 63 22 4 -92 -182 -148 -107 -70 -111 6 -178 -233 38 -213 -142 15 -38 157 82
1906H2j15N9J74J85l03L58l26J39l0K60q8l21q9k6L0m8P1j40J98m05K09k55K94
$$ 82 -33 26 200 385 82 440 114 253 223 483 395 74 -15 -41 -11 -59 12 -128 70 -335 -126 -381 -87
1929h7j92L82r4l74L29O7j36J89k81J05K29j32Q2R0m2j8Q3J54k10Pq8P2m3q3p1
$$ -87 -279 103 9 -365 -36 31 -105 84 -197 -92 137 5 87 177 135 117 200 354 144 151 63 135 92 9 -62
1954f2l00M08m79J14M74k38j67N5r0n9K91j31J50j91K98N2J04o8j5J82j17J27
$$ -62 -362 46 -433 -319 155 -83 -250 -195 -285 -344 -53 -184 -34 -225 73 125 229 161 146 328 211 338
1976C38l48K58j30j31J61n9L2k82Q0R5l06L11k32k9J4j56K98KPj33J95O2j02j6
$$ 338 -10 248 118 -13 148 89 121 -161 -81 14 -292 19 -213 -242 -228 -384 -86 -84 -77 -210 -15 47 -55 -71
2000g1J87j17L04l27K94J01l2K4j73l5L0j10l2J19l39J02q7j32J31K16n23M37
$$ -71 116 -1 303 -24 270 371 339 363 190 155 185 75 43 162 -177 -75 -162 -294 -163 53 -470 -33
2022c3k9r0J16r5k26R5J65Q3O5r5K31j63m8j1J63RJ92j26J78j91j14J7p5Jo8J39
$$ -33 -62 -152 -36 -131 -357 -262 -97 -14 51 -44 187 24 -24 -35 128 137 329 203 381 190 76 93 18 19 -49 90
2048I0k00J42m0k49J41r3K78q3j62qJ0N8M5m1K67Qq8Pl10J31m8M56j65q9p9K93
$$ 90 -110 32 -8 -257 -116 -209 69 -14 -176 -184 -174 -116 -71 -112 155 163 75 82 -228 -97 -145 311 146 57 -22 271
2074B71j25k0J32o0j06pQ1k61M1K37l86j15K35M0J26j55K48k40M0j33P8J65K9
$$ 271 146 126 258 198 92 85 166 -95 -54 183 -203 -318 -83 -43 83 -72 176 -64 -24 -157 -79 86 115
2097A15K1j03L03l16j9Q3k0K94k38Q2o1o4j34J4MK00k60K59k98r3J33m1m1K71
$$ 115 136 33 336 20 1 84 64 358 120 202 141 77 -57 -43 -39 161 -99 160 -138 -231 -98 -139 -180 91
2121I1j05j79J61j23lK33L5j9p5Q0n3Q5J33J6k75O7O2L7l49K23J52o9L6%k06j8
$$ 91 -14 -193 -32 -155 -158 75 110 91 16 96 43 128 261 277 2 69 131 168 -181 42 194 125 161 161 -45 -63
2147f3l4k0K13j3j38k85K37J40l62QK73k1j14L04j02j41L25k29M0K4J96l63K52
$$ -63 -97 -117 96 83 -55 -340 -103 37 -325 -317 -44 -65 -179 125 23 -118 207 -22 18 42 238 -125 127
2170A27QR1j41l63K73J38m46M96o9k61J91k58K43k22k6N4j11J65R5j81RJ59J05
$$ 127 135 226 85 -278 -5 133 -313 183 114 -147 44 -214 29 -193 -219 -165 -276 -111 -16 -197 -188 -29 76
2193G6j47P5N3O0k75K57R2L6J2k07k68M09k40K02N9K4l60M0J14l19L17j4k5j8
$$ 76 -71 4 57 117 -158 99 191 227 239 32 -236 173 -67 135 194 218 -142 -102 12 -307 10 -4 -29 -47
2217d7k30L86r1l38K92r0K87k00J23k01J04J23J13J00j84k40L20q2J93j96k26
$$ -47 -277 109 18 -320 -28 -118 169 -31 92 -109 -5 118 231 331 147 -93 227 145 338 142 -84
2238h4J17n2j75L45P0l69j8J02K48m91K65j45K98k12p8J28k9K32m31L17j7rj59
$$ -84 33 -19 -194 151 221 -148 -166 -64 184 -307 -42 -187 111 -101 -179 -51 -80 152 -279 38 21 12 -147
2261a47K20PM1M4J69l88K18K4l30O0J56J27j55k63K03L1j55j24J90rk5N0j65N4
$$ -147 73 80 121 165 334 -54 164 188 -142 -82 74 201 46 -217 -14 17 -138 -262 -72 -81 -106 -56 -221 -167
2285a67M87m37Pm1j0J33O6o3P6N0p8j68L00j1p9O4j97J53q4J82j7j46K6j83J79
$$ -167 320 -117 -110 -151 -161 -28 38 -25 51 101 23 -145 155 144 65 129 -68 85 1 183 166 20 46 -137 42
2310D2k00K61j59k45L45l38K10k43K71pj23P5l9j09M95k74J72L9o6J7P3j68r7
$$ 42 -158 103 -56 -301 44 -294 -84 -327 -56 -63 -186 -111 -150 -259 236 -38 134 173 107 124 197 29 -68
2333f8K04K2j55M5J61k23j47J1j07K56O9k33k02L84j77Q4k09K84q5p0J75J50k02
$$ -68 136 158 3 48 209 -14 -161 -150 -257 -1 68 -165 -367 17 -160 -76 -285 -1 -86 -156 19 169 -33
2356c3K6j24K50j38K88j08j43K30k85P4K91k29J9j93N5j0L10m56p1J11L2Q2j45
$$ -33 -7 -131 119 -19 269 161 18 248 -37 37 328 99 118 -75 -20 -30 280 -176 -247 -136 -104 -22 -167
2379a67K07j77k5Q7k47J00J42qJ01k86J36K47k4J20p2L13l59n8Q3j06O5K7P0k82
$$ -167 40 -137 -162 -75 -322 -222 -80 -88 13 -273 -137 110 86 206 134 447 88 30 113 7 72 99 169 -113
2403a13O0J46j24J67r8j49j27J27M7k44J71k3L76l1l53J43J22j48K04k40k8J05
$$ -113 -53 93 -31 136 38 -111 -238 -111 -64 -308 -137 -160 216 185 -168 -25 97 -51 153 -87 -115 -10
2425a0q5L60l20K75l37K36k62NJ56K36j15l32Q1O6k4o5m9N8J76K7P4k64O0k16
$$ -10 -95 265 -55 220 -117 119 -143 -138 18 254 139 -193 -112 -46 -70 -135 -184 -126 50 77 151 -113 -53 -269
2449b69K32k07L08l07L96l41Q4M48j06o3l00J24j47K73j51m6j25M12j72J10n5
$$ -269 -37 -244 64 -243 153 -188 -104 344 238 175 -125 -1 -148 125 -26 -72 -197 215 43 153 98
2470I8k39L26M8n08J18J73k62K07j1J00j39j56M17m27K06M06q2l56J2m6O6K45
$$ 98 -141 185 233 -275 -157 16 -246 -39 -50 50 -89 -245 172 -255 -49 357 275 -81 -69 -115 -49 196
2492A96M9j14Q2n4j42j84P8MJ63k3k02k19L44j3P0r1N3Q6j41J84k02J11R4k48
$$ 196 245 131 213 159 17 -167 -89 -85 78 55 -147 -366 -22 -35 35 -56 -3 83 -58 126 -76 35 129 -119
2516a19M8o7J67J04J10l2k76J86rPMj98K29n5j95J74Qj94k14K45L16l97K19q4
$$ -119 -71 -138 29 133 243 211 -65 121 112 119 123 -75 154 99 -96 78 86 -108 -322 -77 239 -158 61 -23
2540b3r2K67m17K24p3O3q8O9m9j15J4J05J35k6J5K15l51J20j21J94J6j98K39k68
$$ -23 -115 152 -265 -41 -114 -51 -139 -70 -119 -234 -220 -115 20 -6 9 224 -127 -7 -128 66 82 -116 123 -145
2564a45l7K95J4m30Q6K36k20N1%J29k46J92P5q8m2J81k3o1o6Q7J3K34k08kP1P5
$$ -145 -182 113 127 -303 -217 19 -201 -150 -150 -21 -267 -75 0 -88 -130 51 28 -33 -99 -12 1 235 27 25 96 171
2590A71r1j55K17l1r9o4J03m7K40k63P5J11k32J62j75L8j43j57J99Pk82L53j6
$$ 171 80 -75 142 111 12 -52 51 4 244 -19 56 167 -65 97 -78 -40 -183 -340 -141 -134 -416 -63 -79
2613g9J76j30R0o8J64rj07n6p4J04jj35J06K01p9k5j27J19k21K94j40j66J22j50
$$ -79 97 -33 57 -11 153 144 37 -19 -93 11 10 -125 -19 182 103 78 -49 70 -151 143 3 -163 -41 -191
2637a91j38M88R7r0k7l15L4K00O6k68O4Q9L2q4N8J38j00n6J77r2j27j37M28q4
$$ -191 -329 159 256 166 139 -176 -142 58 124 -144 -80 9 41 -43 15 153 53 -3 174 82 -45 -182 246 162
2661A62l05Ko1Q5p3Q6N3j67q4J21L64j80q6K8K61j85L0j01n2J8j3K80M2n17J76
$$ 162 -143 -141 -202 -117 -190 -104 -51 -218 -302 -181 183 3 -83 -55 206 21 51 -50 -102 -84 -97 183 225 -292 -116
2686a16L79m78L49j73J63m29J94L03j92N8J62m41J57j03NK62k84J99j76L50j69
$$ -116 263 -215 134 -39 124 -305 -111 192 0 58 220 -221 -64 -167 -162 100 -184 15 -161 189 20
2707B0K6l3p6l6J38n3K00j96m6j3K20j29j03N5k86K32J54K52l33m4pJ48R4k17
$$ 20 46 13 -63 -99 39 -14 186 -10 -56 -69 151 22 -81 -26 -312 -80 74 326 -7 -51 -58 90 184 -33
2731c3J04p2J31j47r9j51K49j01J1K59m48L74Mk58L8M13l36L87k44j14L82l59
$$ -33 71 -1 130 -17 -116 -267 -18 -119 -108 151 -297 77 81 -177 -139 274 -62 325 81 -33 349 -10
2753a0M9j26K44J64j88n3J89j37k43J16k17M5J72j64J05J45K26l67R1nN8l48K85
$$ -10 39 -87 157 321 133 80 269 132 -111 5 -212 -167 5 -159 -54 91 317 -50 41 36 94 -254 31
2776C1P8k83L31j42j40n4J52K71j85PRQl06qJ59K6q4J41O8j47J19j06K26l22j19
$$ 31 109 -174 157 15 -125 -179 -27 244 59 66 75 83 -223 -231 -72 -46 -130 11 79 -68 51 -55 171 -151 -270
2801b70N06j50n3R5j67J59m3L3R9j47J75l31Q8J33mk52K52K03l80J19pn5N2n1
$$ -270 236 86 33 128 -39 120 77 110 209 62 237 -94 -6 127 123 -129 123 326 -54 65 58 3 55 4
2825DJ96j97k91L01p9m3j3P7q2J44k74J17K46j96K50l34K69j52L08m51J46N1j3
$$ 4 200 3 -288 13 -66 -109 -122 -45 -127 17 -257 -140 106 -90 160 -174 95 -57 251 -200 -54 -3 -16
2848a6R2j26l1N6K47j64q6J53j9k50J90j73K08j57n2L82m28K31n3j51J27R7k08
$$ -16 76 -50 -81 -25 222 58 -28 125 106 -144 46 -127 81 -76 -128 254 -174 57 4 -147 -20 77 -131
2871a31J83o2k0J91m39L52Q0k77jR2m7L9N9m8O9P5k63p8L02k63J11K85%k34j0
$$ -131 52 -10 -30 161 -278 74 154 -123 -124 -32 -79 -40 19 -29 40 115 -148 -226 76 -187 -76 209 209 -25 -35
2896c5N8r4J74j01k12j08L17J33n2j3j75QL13j79q1K08j36N6l7l4m4n4L2J15k71
$$ -35 23 -71 103 2 -210 -318 -1 132 80 67 -108 -100 213 34 -47 161 25 81 44 10 -34 -88 -56 59 -212
2921b12J47L5k3M5j25j04J81K8K1j22o5L05k60k2K88J06k45J7j43J28rJ87o0j56
$$ -212 -65 -30 -53 -8 -133 -237 -56 -28 -7 -129 -194 111 -149 -171 117 223 -22 -5 -148 -20 -29 158 98 -58
2945e8l0K56j32kn4k5J45L9k26P2L58l82K6K68k55j44J99j3j66K41O5m05n9J08
$$ -58 -88 168 36 34 -20 -45 100 139 -87 -15 343 -39 -13 255 0 -144 55 42 -124 117 182 -223 -282 -174
2969a74J88o0J58q5J3m8K26o5J13j06k05K53m07K34l9J48k87J3J94j42k7J04K34
$$ -174 14 -46 112 27 40 -8 218 153 266 160 -45 208 -199 35 -4 144 -143 -130 64 -78 -105 -1 233
2992B33n49L71j00j3K3N5j38j61J9J59J39J71m83L68L7l04J26J95j28m0L3K56
$$ 233 -316 55 -45 -58 -35 20 -118 -279 -260 -101 38 209 -274 94 131 -173 -47 148 20 -20 13 269
3014B69k92J84p2j71J62o5q6j07M20j73J84k68N0k0K6k1k91J38J7J82j93K18O6
$$ 269 -23 161 89 -82 80 15 -71 -178 242 69 253 -15 35 15 41 20 -271 -133 -116 66 -127 91 157
3037A57k46K1J48j69K25j99q1M91j45l10Q2P5j14J42j21j56J48q3L04j37o1J44
$$ 157 -89 -68 80 -89 136 -63 -144 347 202 -108 -26 49 -65 77 -44 -200 -52 -135 169 32 -29 115
3059A15j1j51j58K81k70K61k02J79l22M52k36J14L19o57N34j93r5O2J6j90J0j21
$$ 115 104 -47 -205 76 -194 67 -135 44 -278 174 -62 52 371 -286 248 55 -40 22 38 -152 -142 -263
3081b63L12Rj05n4J28r6J45o5p4p9K69n3j24j3P9J02j76J53j1k7j24K4n8J55q5
$$ -263 49 58 -47 -101 27 -69 76 11 -63 -142 127 74 -50 -63 16 118 -58 95 84 57 -67 -43 -101 54 -31
3106c1O5n3M8j72J70P2Rl16J02K54L4j69j63k5J00K06j0j54o1J82J27k04r9K17
$$ -31 34 -19 29 -143 27 99 108 -208 -106 148 182 13 -150 -175 -75 131 121 -33 -94 88 215 11 -88 129
3130A29k5j30o0L46j99P9k23Qj10Rj05K36k00J40r4Q9Q7J29L6k49K44J08k43l3
$$ 129 104 -26 -86 260 61 140 -83 -75 -185 -176 -281 -45 -245 -105 -199 -110 -23 106 142 -107 137 245 2 -31
3154c1N2J8lj59j0L96l32K17j68j03K35j91J45k10J59k18L56l35J04J15L7K46
$$ -31 21 39 36 -123 -133 263 -69 148 -20 -123 112 -79 66 -144 15 -203 153 -182 -78 37 74 320
3176C20n17K14p3L19k52j77J8J7j7J59J30p1k50Jj3M41n25M24j2l31K88j05j32
$$ 320 -197 17 -56 263 11 -166 -148 -131 -148 11 141 70 -180 -179 -192 249 -276 148 136 -195 93 -12 -144
3199a44J41n6j85J08j40R4J51K05k13k6J85J07j84o5P0k10K78o7n1m7m4J40j07
$$ -144 -3 -59 -244 -136 -276 -182 -31 174 -39 -65 120 227 43 -22 48 -162 116 49 -2 -49 -93 47 -60
3222f0K43j87k48J45Kk40P4L54L9j84L9j3K60l27J96m1j05M1J88l35P9J91j42
$$ -60 183 -4 -252 -107 -105 -345 -271 83 122 -62 -23 -36 224 -103 93 52 -53 -12 176 -159 -80 111 -31
3245c1K76o0k24J14j80M5j00l6L16j85J24L7r8k9j45R7K0M9n6o8K7L17J78l60
$$ -31 245 185 -39 75 -105 -60 -160 -196 120 -65 59 96 -2 -31 -176 -79 -59 -10 -66 -134 -107 210 388 28
3269B8j9J86l94L49J2o3k50J09J41k22J02NMk06J1J2M4L9J63J43q8j29J66o8j0
$$ 28 9 195 -199 150 162 99 -151 -42 99 -123 -21 -16 -12 -218 -207 -195 -151 -112 51 194 106 -23 143 75 65
3294F5j96M2M35j94R7l41k0P1K05N1l2j62j65j38L90j2K07j88k30J53k35J69k65
$$ 65 -131 -89 346 152 249 -92 -112 -41 164 215 183 21 -144 -282 108 96 303 115 -115 38 -197 -28 -293
3317b93L52j00J22j4J53j24j35J40k44K41r2j95K27L4l54N07p9Rk9j37J20K26
$$ -293 59 -41 81 67 220 96 -39 101 -143 98 6 -189 38 72 -282 225 146 155 126 -11 109 335
3339C35l26k02K99k16k01L23J3j1o1J07J9j84J65R6j19Oo6K0r1L45j53R6k80k68
$$ 335 9 -193 106 -110 -311 12 25 14 -47 60 79 -105 60 156 37 43 -23 -3 -94 251 98 194 -86 -354
3363c54L47j59J53n0j46J26R0J52j01k04j87K44J86o6j43K84j7k66K22p0j81r2
$$ -354 -7 -166 -13 -63 -209 -83 7 159 58 -146 -333 -89 97 31 -112 172 155 -111 111 41 -140 -232
3385b32K49J97k52L8M7q4j69J59J63l56K30K86J30m37L2j06j34L10j11k12M25
$$ -232 17 214 -38 0 47 -37 -206 -47 116 -240 -10 276 406 -31 1 -105 -239 71 -40 -252 173
3406A73k14K18j70n1Q9R4l2l06K73k28j9P4MR8j33m2J37j8J38n6j2m9J06j09L5
$$ 173 -41 177 7 -44 45 139 107 -199 74 -154 -173 -99 -95 3 -130 -172 -35 -53 85 29 17 -32 74 -35 0
3431@L7J16l3j26n1K3O6L4m23M05L6Kk55K27l04M06j99j78K26J1R1%p7L5n1J9
$$ 0 37 153 120 -6 -57 -34 32 66 -357 48 84 86 -169 58 -246 160 -39 -217 9 20 111 111 34 69 18 37
3457C7K39k57o1r4K37K6l61K75J28k78P1Kj36K23M2j07O6P8r3R2m67L33K9qm0
$$ 37 276 19 -42 -136 101 127 -234 41 169 -109 -38 -36 -172 51 93 -14 52 130 37 129 -338 -5 24 16 -24
3482b4J09l53J26J47J88j37j65j8R9J30P7j57N3N3o6J05o4l8R3p7K46j65k7j30
$$ -24 85 -268 -142 5 193 56 -109 -127 -28 102 179 22 75 128 62 167 103 65 158 81 327 162 135 5
3506EP4l02K10N3k00j87O89n12P6K98k74M9p2n1p1K80j63n1NJ44j06J29l3K64
$$ 5 79 -223 -13 40 -160 -347 342 -170 -94 204 -70 -21 -93 -144 -215 65 -98 -149 -144 0 -106 23 -10 254
3530B54k69L1K24j64j96K0Q7K10k60o1L2Q4j82M2p1R2J08kJ01k46L6KL23n6j24
$$ 254 -15 16 240 76 -120 -100 -13 197 -63 -124 -92 -8 -190 -148 -219 -127 -19 -21 80 -166 -130 -128 195 139 15
3555A5L24m30j50K52n2j50K84k65J04K31J56k43l12J26J81j00k46P0L30k30J40
$$ 15 339 -91 -241 11 -41 -191 93 -172 -68 163 319 76 -236 -110 71 -29 -275 -205 125 -105 35
3576C5L0j31O2J03o0R8M0k37K30l21l8J19K11k90J77L11l04k0k93J87k5M4o5K67
$$ 35 65 -66 -4 99 39 137 177 -60 170 -151 -189 -70 141 -149 28 339 35 15 -278 -91 -116 -72 -137 130
3600A30j33J71k12k10N09k95J27j75J96p1q5N2J64o3k24Q7J2k5P6K86k93R7R6
$$ 130 -3 168 -44 -254 255 -40 87 -88 108 37 -48 4 168 105 -119 -32 -20 -45 31 317 24 121 217
3623B17j89J65k33m0J21j3N5M9j10j02J00K24k47r7j29j52L76j58J10J0j7N3J51
$$ 217 28 193 -40 -80 41 28 83 132 22 -80 20 244 -3 -100 -229 -381 -5 -163 -53 -43 -60 -7 144
3646A44l78J58O%O8kJ37k69M3ML88j37M3j62K9q1o3K44j42J71p5l59J57j45J19
$$ 144 -234 -76 -70 -70 -2 -4 133 -136 -93 -89 299 162 205 43 72 -9 -72 172 30 201 126 -233 -76 -221 -102
3671a02P7k22O2J82J88k64M10k1l57J0O8Mk53M12k22j04K20N3l87J68J91r9L03
$$ -102 -25 -247 -185 -3 185 -79 331 310 -47 -37 31 35 -218 194 -28 -132 88 141 -246 -78 113 14 317
3694C17l51J7j18JR7J00k58K33k60K98j59J15j66J73j73J4K71j03m5Q6J0j51L00
$$ 317 -34 -17 -135 -134 -37 63 -195 38 -222 76 -83 32 -134 39 -134 -120 151 48 3 89 99 -52 248
3717B48j54j96L26k44Ro5P6L2O2j05m5lj66K45q6K22pk02j86L33j58R6l63K90
$$ 248 94 -102 224 -20 -11 -76 0 32 94 -11 -56 -59 -225 20 -66 156 149 -53 -239 94 -64 32 -331 -41
3741d1M11l17k39J72K18Ok61J03q7k13L64MM6Jm73K45K49k76J98j33L7J67j77
$$ -41 370 53 -186 -14 204 210 -51 52 -35 -248 116 120 166 167 -306 -61 188 -88 110 -23 14 181 4
3764Dr7r1p2J03P0l7QM7l01J72K47M7JO6l13j5k7J69L19l35N0o8j28q4L19j99
$$ 4 -93 -184 -256 -153 -83 -120 -112 -65 -366 -194 53 100 101 167 -146 -161 -188 -19 300 -35 15 -53 -181 -265 54 -145
3790a45pL16q5j0K9j20L6O8j42K45m80K19J40j33nJ60l6k7j2m11O18k58j12K68
$$ -145 -152 164 79 69 98 -22 14 82 -60 185 -295 -76 64 -69 -74 86 50 23 11 -400 218 -40 -152 116
3814A16o4O9j54K98l42L83n55K48nj48K15j47K5MRJ91j20O0j39J98k95J92j23
$$ 116 52 121 -33 265 -77 306 -249 -1 -6 -154 61 -86 -61 -57 -48 143 23 83 -56 142 -153 39 -84
3837h4K28j4l14M55j14k66K30l41r8J42L39q4j0j24j24J62j38L53k2j70j00K36
$$ -84 144 130 -184 271 157 -109 121 -220 -318 -176 163 79 69 -55 -179 -17 -155 198 176 6 -94 142
3859A42k84J91J09j83K44k88J03l21L32k54L95j15j25j4L03k00q0J03k23O1k8
$$ 142 -142 49 158 -25 219 -69 34 -287 45 -209 186 71 -54 -68 235 35 -45 58 -165 -104 -132
3880a32L18p2Q4j44K06l58K31j22j79l9K44J84k76r5M0K18k55K38L3r5J97k15
$$ -132 186 114 198 54 260 -98 133 11 -168 -207 37 221 -55 -150 -110 108 -147 91 124 29 226 11
3902A1k08L48k01Q7J57k00M4m1J0k15K82o3j45R9J08j47J0O1j00K72n9R6j57k4
$$ 11 -197 151 -50 37 194 -6 38 -3 7 -208 74 11 -134 -35 73 -74 -64 -3 -103 169 110 206 49 25
3926B5j59q1L70j74k5N6n4n0J68lj82J50j64M6J00r2n9L2J26J30n1J5q3j62q8
$$ 25 -134 -215 155 -19 -44 12 -42 -92 76 73 -109 41 -123 -77 23 -69 -128 -96 30 160 109 124 41 -121 -209
3951b09J95R2j33M6o7q5J53j81J34p5L5Q4K6P2j33N9P2j52J02q5njJ61J41o5j20
$$ -209 -14 78 -55 -9 -76 -161 -8 -189 -55 -130 -95 -11 15 87 -46 13 85 -67 35 -50 -55 -56 105 246 181 61
3977F1j47m3M48m44L52k65J04J37k63j11L7J40o4ml04M2L56J08j92%j05J09J14
$$ 61 -86 -129 319 -125 227 -38 66 203 -60 -171 -134 6 -58 -62 -366 -324 32 140 -52 -52 -157 -48 66
4000F6j32Q4r8K48k45P0J89l0m27K00K53k00j58R2N4k1k06J63K3N9j1L4K5j46
$$ 66 -66 18 -80 168 -77 -7 182 152 -275 -75 178 -22 -180 -88 -34 -55 -261 -98 -75 -16 -27 7 32 -114
4024a14p1J01J00N7k9L6j21k31K25j09L5K23j89QL71k72k76K98m1j29M27j66N7
$$ -114 -185 -84 16 73 44 80 -41 -272 -47 -156 -121 102 -87 -79 292 20 -256 42 1 -128 299 133 190
4047A90j83K04j59R6k00J27l78N47l17K57j24J33k76J08M9j32K99l38Q3nm4K52
$$ 190 7 211 52 148 -52 75 -303 244 -73 184 60 193 -83 25 74 -58 241 -97 -14 -19 -63 189
4069A89l09M1J22k30J43k15J32J02KM9o1L08p7l53q1M9Q2R6Q0M7j27k72L08k11
$$ 189 -120 -79 43 -187 -44 -259 -127 -25 -23 26 -35 273 196 -157 -238 -189 -107 -11 69 116 -11 -283 25 -186
4093a86j45L38K1k01n2K69q4j78M1M90m10R7n0L56l42j32J67R4L7l49L52K19l58
$$ -186 -331 7 28 -173 -225 44 -40 -218 -177 313 -97 0 -50 306 -36 -168 -1 93 130 -219 133 352 -6
4116fMm01K90J87n1j00Q4J2j00n2J13L1MlQ9k07j65OK72J86l43J93J41j83K02
$$ -6 -2 -403 -113 74 23 -77 7 19 -81 -133 -20 11 15 12 101 -106 -271 -265 7 193 -150 43 184 1 203
4141B03m84QL32l6L0J76r3j39M0J38k68K26k22N1K07k74k60L79J12j79K99k25
$$ 203 -281 -273 59 23 53 229 136 -3 37 175 -93 133 -89 -38 169 -105 -365 14 126 -53 246 21
4163B1Q3j63J94k6j38o2K60Ok98KK76k04l1jL98l45P9k44J26O6J53J8k00O3L3
$$ 21 104 -59 135 109 -29 -91 169 175 -123 -121 155 -49 -80 -81 317 -28 51 -193 -67 -1 152 170 -30 33 66
4188F6j13oL56l53j82J89P3j05O2o0k89L98l3L3j19L9k00M16n3K6j38j07K6RJ00
$$ 66 -47 -53 303 -50 -232 -43 30 -75 -13 -73 -362 36 3 36 -83 -44 -244 172 119 145 7 -100 -74 -65 35
4213C5k6J91p1j66L51k05l39J89j82P3J76J31k37K10k67K21Nl57K32J52j41K9
$$ 35 9 200 129 -37 314 109 -230 -41 -223 -150 26 157 -80 130 -137 84 89 -268 -36 116 -25 4
4235DNj48L5L02q7j50M5m5l6J83j60j49J71p5J51j94N7j99L60q0j39M17k52k6
$$ 4 9 -139 -104 198 111 -39 6 -39 -75 108 -52 -201 -30 -105 46 -148 -91 -290 70 -10 -149 268 16 -10
4259a0q7l3K68q6J41m48L41j56K3L64k46O1K5k11J30p9L70l12N6j13K0m2r8J22
$$ -10 -97 -130 138 52 193 -255 86 -70 -47 317 71 132 157 -54 76 -3 367 55 111 -2 18 -24 -122 0
4283@m4J13p3K8M1j01m1q4J12Kj65RK45M6k19j7L36m0k88M4K59r8j14K43m55L64
$$ 0 -44 69 -4 24 65 -36 -77 -161 -49 -47 -212 -203 42 88 -131 -148 188 148 -140 -96 163 65 -49 194 -261 103
4309A03j82j60N23l53J17NQ5oj62k6J16J3J7l45K89j4J26O5o9j90j40J38j83J05
$$ 103 -79 -239 284 -69 48 53 138 132 -30 -56 60 73 90 -255 34 20 146 211 142 -48 -188 -50 -233 -128
4333a28L6jJ87j31L0J44j26P2pj32j51K69p1J58J47k02n9m4J1K13k0k54J22J06
$$ -128 -92 -93 94 -37 -7 137 11 83 76 -56 -207 62 -9 149 296 94 35 -9 2 215 195 -59 63 169
4357A69l12K72j58P4n6K06k13PQk3O3l9p9J11j77J49j21K72J9n58K87J58J36l29
$$ 169 -143 129 -29 45 -11 195 -18 -11 -3 -26 37 -2 -81 30 -147 2 -119 153 172 -386 -99 59 195 -134
4381a34J17k17K21k04K83o8m2r2J98m6n2m4q6J80K20k99K94l53J2K37k64J51N2
$$ -134 -17 -234 -13 -217 66 -2 -44 -136 62 16 -36 -80 -166 14 234 -65 229 -124 -112 125 -139 12 64
4404F4j51J4P9p0l22K57J90J19j30J3k62K34n9J53k75K63k65K93J26l37P8J04
$$ 64 -87 -73 6 -64 -386 -129 61 180 50 63 -199 35 -24 129 -146 117 -148 145 271 -66 12 116
4426A16m1j10l0j38L14j57m4j45K92j43lR3j39K91j9j15O9Om9j71rq2J29J44j18
$$ 116 75 -35 -65 -203 111 -46 -90 -235 57 -86 -89 4 -135 156 137 22 91 97 48 -123 -132 -214 -85 59 -59
4451e9K03k73K01j6p5P8k14k4J27j78M12k47J8J24pK2K9l58K42Q1K7J84l07j25
$$ -59 144 -129 72 56 -19 59 -155 -179 -52 -230 182 -65 -47 77 70 92 121 -237 5 86 113 297 -10 -135
4475a35N8J20j49j5O6j60j38K59J02J60k73Q6j06K49o0m8J5K5OJ0L9n5j59L22
$$ -135 -77 43 -106 -121 -55 -215 -353 -94 8 168 -105 -19 -125 124 64 16 31 56 62 72 111 56 -103 219
4499B19l57J16j15J38p2J17j39J48r0j93J42J96k21P4r8J58J55N1k00n3J55L6
$$ 219 -138 -22 -137 1 -71 46 -93 55 -35 -228 -86 110 -111 -37 -135 23 178 229 29 -24 131 167
4521A67l28K92Q7l52P6m5O7r6J54K38l48J03J61N3J9l41J13J02j7l46R4K47J32
$$ 167 -161 131 218 -134 -58 -103 -36 -132 22 260 -88 15 176 229 248 -93 20 122 105 -241 -147 100 232
4544B32kl27j01O2lJ68J52j82k5J68n7j27J36R4j28J11j56J83l08j40K71k5j58
$$ 232 230 -97 -198 -136 -139 29 181 -1 -26 142 85 -42 94 188 60 171 15 198 -110 -250 21 -4 -162
4567a62o1R7M2K08j20O3J9j02l8o4K54lk62R0JJ32j22o8O8j46L67J85k11k13q1
$$ -162 -223 -126 -84 124 4 67 86 -16 -54 -118 136 133 -129 -39 -38 94 -28 -96 -28 -174 193 378 167 -46 -127
4592a27K26q6k00K93M4o8l20J82J69k13K58j06J19k25K13k01j50j7M66n0m65J94
$$ -127 99 13 -187 106 150 82 -238 -56 113 -100 158 52 171 -54 159 -42 -192 -209 257 207 -258 -64
4614f4O2j77M12k97R3J21l00J14q7n4K46q4K4J65l53K26k33m%J28N4n8k8l07N47
$$ -64 -2 -179 233 -64 29 150 -150 -36 -123 -177 69 -15 9 174 -179 47 -186 -190 -190 -62 -8 -66 -94 -401 146
4639A46k57j36L32J9j05Lj35J03K7J96k84N1O7J19k11m9K56k50k6K50j04n8N9
$$ 146 -111 -247 85 104 -1 2 -133 -30 -3 193 -91 -40 27 146 -65 -114 142 -108 -134 116 12 -46 13
4662A3K3o5j9N4J80n4j35m5M6K4Pk32J99p7J43q0j06Q8QQ3P4j08M1r3k01K20l1
$$ 13 36 -29 -48 6 186 132 -3 -48 -2 22 29 -203 -4 -81 62 -18 -124 -36 -28 55 129 21 62 -31 -232 -12 -43
4689d3J40r8m0n1K48j65J11j78K81l05K6k12K87lJ22n8k03o7M8O4p1K55r0m0J44
$$ -43 97 -1 -41 -92 156 -9 102 -76 205 -100 -74 -286 1 -2 120 62 -141 -208 -160 -96 -167 88 -2 -42 102
4714A02j73J50Ll00K42j28K56rk1m76N07j09J8p2M4n9nP0p4k14J94J25l40M73
$$ 102 -71 79 82 -218 24 -104 152 143 122 -354 153 44 62 -10 34 -25 -30 40 -34 -248 -54 71 -269 204
4738B04j50r6L33j90K6r7m9R2l3j20p4P4K35j51k9j7O9J57k25J36q5j23L37k26
$$ 204 54 -42 291 101 127 30 -19 73 40 -80 -154 -80 155 4 -25 -42 27 184 -41 95 10 -113 224 -2
4762bO9j34K07l84LK84j79K24m2K55l62J25k42K81m07M11k52J45k22L04j40R2
$$ -2 67 -67 140 -244 -241 43 -136 88 46 301 -61 64 -178 103 -304 107 -145 0 -222 82 -58 34
4784C4k64J28K16J90k77N5m1M8r0P4j17J08m6j68P9PK01j56Nl3K01j44o1p3K14
$$ 34 -230 -102 114 304 27 82 41 89 -1 73 -44 64 18 -150 -71 -64 137 -19 -14 -47 154 10 -51 -124 90
4809I0k36o5J32j4j30L20j10K30o0l63L08k84M14k15j12J16J18r6M8J69k0l05
$$ 90 -146 -211 -79 -93 -223 97 -13 217 157 -206 102 -182 232 17 -95 21 139 43 91 260 240 -65
4831f5j40J07L8K6j19K28Kr8k78M02R1o1n3j15q1O2qr0J43l7k16K32m2J02L9o1
$$ -65 -205 -98 -60 -34 -153 75 77 -21 -299 103 194 133 80 -35 -116 -54 -62 -152 -9 -46 -262 -30 -72 30 69 8
4857HK44k37l7k45L21k64K23L5l5j85j46L81k24R7m7N1N7q4J41K22l08p8K97j6
$$ 8 252 15 -22 -267 54 -210 13 48 13 -172 -318 63 -161 -64 -111 -60 -3 -87 54 276 -32 -110 187 171
4881A71k58K81l88J17N1j14J30L2j37K13k87M08l44J88q6j19L24k54K5J97J5r5
$$ 171 -87 194 -194 -77 -26 -140 -10 22 -115 98 -189 219 -125 63 -23 -142 182 -72 -47 150 165 70
4903G0l3%j09N3j29JK49q5l45J65L06j97R8K8k11J07K06k61J1J08k34K50K88l24
$$ 70 37 37 -72 -19 -148 -147 102 17 -328 -163 143 -54 44 72 -139 -32 174 -87 -76 32 -202 48 336 12
4927A2j96K83j85k93K69J20O8l2r0O2M2m2J0j91J96oK5mK7K4j70JJ14%J14l47
$$ 12 -184 99 -86 -379 -110 10 78 46 -44 18 60 18 28 -163 33 27 52 48 75 99 -71 -70 44 44 158 -189
4953a89J61k84J82L1m0j35K00P7K44p4J20l31p1J25QQ8j31m5k77L43J79k02J83
$$ -189 -28 -312 -130 -99 -139 -274 -74 3 247 173 293 -38 -109 16 24 112 -19 -64 -341 2 181 -21 162
4976A62k83J40J61m26K49K6p9k28M16k84L82j38j83NK7k03J36O7J72J48l82J20
$$ 162 -121 19 180 -246 3 29 -50 -278 138 -146 236 98 -85 -80 -53 -256 -120 -53 119 267 -115 5
4998Ep7J56j24N2J3K71l46K31j71j5m9L05k48k46L52j72o8l6J77k20K99q5J16
$$ 5 -72 84 -40 12 25 296 -50 181 10 -5 -54 251 3 -243 109 -63 -131 -167 10 -210 89 4 120
5021A20J09k99M3O9p3J56n0j35qm0K73J36l66m4J2r5J28j33L52j37j2N5K4j34
$$ 120 229 -70 -27 42 -31 125 75 -60 -68 -108 165 301 -65 -109 -97 -192 -64 -197 155 18 6 61 85 -49
5045d9k43L16qr0J75j81r8K90k11N9J7J64k30J63j35J45r7R2l54N07m49R8J30
$$ -49 -292 24 16 -74 101 -80 -178 112 -99 -40 -23 141 -89 74 -61 84 -13 79 -275 232 -217 -119 11
5068A1j25J27J13l1k40L50l0m27M35k92K62j8N6j71N0k43m1O4O0o8J57ml5L9r9
$$ 11 -114 13 126 95 -145 205 175 -252 183 -109 153 135 191 20 70 -173 -214 -150 -90 -158 -1 -5 -40 -1 -100
5093a00L01k34l8j45L13J07l71K9J33r9J31q9R3K0n3j66K86Rl8MJ16n2j64J8j05
$$ -100 201 -33 -71 -216 97 204 -167 -138 -5 -104 27 -62 31 51 -2 -168 118 127 89 93 209 157 -7 11 -94
5118i4J06M9k57L49j42J8Jm3J02j46Ko3r8L08k29k0J23L8P0J01k13Q0O9j90J88
$$ -94 12 61 -196 153 11 29 30 -13 89 -57 -55 -118 -216 92 -137 -157 -34 4 74 175 -38 42 111 -79 109
5143A09J33o7P8m18L69n91J26J83J09J42j99k44K62OJ25j11R8m7k11L08n0J49
$$ 109 242 175 253 -165 204 -387 -261 -78 31 173 -26 -270 -8 -2 123 12 110 63 -148 160 110 259
5165B59j19RJ16m28K81K78l44M2l1O2j83j28L42l86K17J69n7j47mq4O7L23m82
$$ 259 140 149 265 -163 118 396 52 94 63 125 -58 -186 156 -230 -13 156 99 -48 -52 -136 -69 254 -228
5188b28L63r5P0P4l60K31l08O3L85j24J05l46R1K31p1q6O0l8M5l81M79Ok37O7
$$ -228 135 40 110 184 -176 55 -253 -190 195 71 176 -170 -79 152 81 -5 55 17 62 -319 160 166 -71 -4
5212dL90m43J81p9L53n49K69k83L39m58J97K26l70J96pJ57j37j99J77J27p7k23
$$ -4 386 -57 124 45 398 -151 118 -165 174 -284 -87 139 -231 -35 -42 115 -22 -221 -44 83 6 -217
5234b17J15m8J74J6k1K34j42k49K42j89J30N3J81l24R9P3k63K84j84J44j87n8
$$ -217 -102 -150 24 40 19 253 111 -138 104 -85 45 98 279 -45 54 127 -136 148 -36 108 -79 -137
5256a37L02j06j18P9q4J57j20K25l4O9l27K68k18m6o8K78j39m6k3J78o7OJ15k09
$$ -137 165 59 -59 20 -64 93 -27 198 164 233 -94 174 -44 -90 -158 120 -19 -65 -88 90 23 29 144 -65
5280f5J75p7K9j06j5Q2k81L44J73o0k29Q6k0o3K8Q8j08O3l33K16J80j40k04M17
$$ -65 110 33 62 -44 -59 23 -258 86 259 199 -30 56 36 -27 1 89 -19 44 -289 -73 107 -33 -237 180
5304A80j96k06K70O2j2j30P0J10j69k36K65J91l16K91k43J8O6J66l9j18j74K34
$$ 180 -16 -222 48 110 98 -32 38 148 -21 -257 8 199 -117 174 -69 -51 15 181 142 24 -150 84
5326H4ok23L15q7r1k12K8L34j6k98p5K85o6pq5K58j69O6j23J02j37K24J03l12
$$ 84 78 -145 170 83 -8 -220 -192 142 126 -172 -247 38 -28 -35 -120 138 -31 35 -88 14 -123 101 204 -108
5350a08n6K07r0Q5Q1k27k0J06r8J17j99L23k36K66J09k08Q8j08j1k62J30n3K80
$$ -108 -164 43 -47 38 119 -108 -128 -22 -120 -3 -202 121 -115 151 260 52 140 32 21 -241 -111 -164 116
5373A16l13J06J67j83J1K29m73M94k83J46nqk18L7K50J5j36R3p8n2K87k30j89
$$ 116 -197 -91 76 -107 -96 133 -340 154 -129 17 12 4 -214 -177 73 88 -48 45 -33 -85 202 -28 -217
5396b17R1J22J93L9k16k5l7J55o9k06K43j17j77L05l53OJ23J07Q5j84J93O4j88
$$ -217 -126 -4 189 228 12 -13 -50 105 36 -170 73 -44 -221 84 -269 -263 -140 -33 52 -132 61 125 -63
5419f3L36k52j82j41K04L87l70J04k1l37N12n14L56j88O3L41l89J68Jj84K87j83
$$ -63 273 21 -161 -302 -98 289 -81 23 2 -335 177 -337 19 -169 -106 235 -154 14 15 -169 118 -65
5441f5J08L7r3jk16L75k48m5N8J79K9j11J41j44K25j60j92R9j09K64j0l25J02
$$ -65 43 80 -13 -14 -230 145 -103 -148 -90 89 118 7 148 4 229 69 -123 -24 -133 131 121 -204 -102
5464a02J01j13K94j90l1j45L39k54K54k54K74P8l51L37l34L3O0J19K28l14j62
$$ -102 -1 -114 180 -10 -41 -186 153 -101 153 -101 173 251 -100 237 -97 -64 -4 115 343 29 -133
5485a33N5L4O1j08M1j88J84m9j74J69K73p7N8k1k90j4K78j6k67L12m47L11%J73
$$ -133 -78 -44 17 -91 -50 -238 -54 -103 -277 -108 165 88 146 125 -165 -179 99 83 -184 128 -319 -8 -8 165
5509A65j07j32j5K6L60n30K77m9l2J23o2N1K01k06j28J73k99J85N0K7j96r3K92
$$ 165 58 -74 -89 -63 297 -233 44 -5 -37 86 24 75 276 70 -58 115 -184 1 51 78 -118 -211 81
5532H1k0p6J08o8m3J56r5oO5l65M20p8O5n1j66K68k04O1qq9j16K12j51K28k59
$$ 81 61 -15 93 25 -18 138 43 37 102 -263 157 79 144 93 -73 195 -9 52 44 -45 -161 51 -100 128 -131
5557a31r5R6K7j21O9j81K78M6L5j06J82l87K89m8K92J2j13m75K54K20m1J3J55
$$ -131 -226 -130 -103 -224 -155 -336 -58 -12 23 -83 99 -288 1 -47 245 257 144 -331 -77 143 102 115 270
5580B70l85N8Q1n5J54m4l2j26J2J74p3R1p7j49M1l2j00J99R3j54n1k72K45k1L2
$$ 270 -115 -57 24 -31 123 79 47 -79 -67 107 34 125 48 -101 -60 -92 -192 7 100 -54 -105 -377 -132 -153 -121
5605a21N1N8k04P3qL51p9R9k12J54j82l2J09q1m5J3k39J41J32o4R2j25L42k7k88
$$ -121 -70 -12 -216 -143 -151 200 121 220 8 162 -20 -52 57 -24 -69 -56 -295 -154 -22 -86 6 -119 223 196 -92
5630i2j46L9O3J95j48o0J14O8J16Lj76J31O5k71M5Q0R6m1L1O0j88J27K9k21J98
$$ -92 -238 -199 -136 59 -89 -149 -35 33 149 152 -24 107 172 -99 -54 26 122 81 112 172 -16 111 140 -81 117
5655A17n51O67k59J51k29J09l11L25M3k08L10k61K32N6o9j61J01l4Q2N2l35K10
$$ 117 -434 233 -26 125 -104 5 -306 19 62 -146 164 -97 135 191 122 -39 62 28 110 162 -173 37
5677C7q7J00o3q4J18j4j03K73k55l2L22l08K49j18K9j2k16K02p4K32k31l9M3m3
$$ 37 -50 50 -13 -97 21 7 -96 177 -78 -110 212 -96 153 35 64 52 -164 38 -36 196 -35 -74 -31 -74
5701g4J32N4Mk85J82O5Q7j31j70J97M5j45k10M28k19r4J08P5M2k93J49k38L42
$$ -74 58 112 116 -169 13 78 165 34 -136 61 106 -39 -249 179 -40 -134 -26 49 91 -202 -53 -291 51
5724E1J0j31j02K29q6n1Q2M7n1j81L10j27q4M0K2Oo2N8P5J7M0l51K53p5pP7j62
$$ 51 61 -70 -172 57 -29 -80 2 49 -2 -183 127 0 -84 -44 -22 -16 -78 -20 55 72 112 -239 14 -61 -68 9 -153
5751a53K74l6l46M64l10J82o7J09%j20L4J20l27M6K61k60J99Oj6j21j7J6j93K63
$$ -153 121 85 -261 203 -107 75 8 117 117 -3 31 151 -176 -130 131 -129 70 76 60 -61 -78 -62 -255 8
5775HJ69k52o7J53k69J43P8K18j88P8l68L47M5l0M6m1j91K82j78r8Q7j17K89k03
$$ 8 177 -75 -142 11 -258 -115 -37 181 -7 71 -297 50 95 65 111 70 -121 161 -17 -115 -28 -145 144 -59
5799e9J38q8J02j02r6J85l4R4j25M1k18J48J07R1j35j85J92L8j71Q9k55L76j28
$$ -59 79 -9 93 -9 -105 80 46 140 15 56 -162 -14 93 184 49 -136 56 94 -77 12 -243 133 5
5822Ej41K90j17J17l98L22l14L61p1j70J17k0j81J86M1k23K06j54M07l87j55M15
$$ 5 -136 154 37 154 -244 78 -236 125 54 -116 1 -19 -200 -14 27 -196 10 -144 263 -124 -279 136
5844A36J3k59J98k29q6J98j33K1J57m1K36k07j6Lq9J34l62N62l35L98j05P4m00
$$ 136 149 -110 88 -141 -227 -29 -162 -141 16 -25 211 4 -12 -9 -98 36 -326 236 -99 299 194 268 -132
5867a32o7L19l05M55j9k12k4J38k17L8O5J11J13kn30J36J22Q8k69J55j38p0L84
$$ -132 -199 120 -185 270 251 39 15 153 -64 -26 39 150 263 261 -269 -133 -11 77 -192 -37 -175 -245 139
5890A39j35L17j25k11J27j41K6o0J1K67k13q7L50q1q4o2o6Q2l83L6M35j36K0j49
$$ 139 4 321 196 -15 112 -29 -3 -63 -52 215 2 -85 265 184 100 38 -28 54 -329 -293 142 6 26 -123
5914a23K71j05k62K53J14l4j22k3R3N5j33j08n2J07j45K33l43K42K77p7l25J89
$$ -123 148 43 -219 34 148 114 -8 -31 62 117 -16 -124 -176 -69 -214 19 -324 -82 195 118 -207 -18
5936a8lQ0j09J80K0m01K40J26J6Q0j14k42O9J36Q6k22J2J23l8k1K60m07O1m3o1
$$ -18 -21 59 -50 130 150 -251 -11 115 131 211 97 -145 -76 60 146 -76 -64 59 21 0 260 -147 -86 -129 -190
5961a90L28j83Q3J26k35j6J80N1j64K4J9Jj04J05P3k09J10J57j71m8j76L88N6
$$ -190 138 -45 38 164 -71 -87 93 144 -20 4 23 24 -80 25 98 -111 -1 156 -15 -63 -239 149 205
5984B05k6l01R9Q4J50k73K16%kk37K08r5q2j4L7Q2O5k77L53k23M1J18n53L40P
$$ 205 179 -122 -23 61 211 -62 154 154 152 -85 123 28 -54 -68 -31 51 116 -161 192 -31 10 128 -425 -85 -78
6009g8p1K26R5k87j10R9J21J62q6P3l5j03r6l1Q0J33l8r6J83j64jl2L81o25K48
$$ -78 -149 77 172 -115 -225 -126 -5 157 71 144 109 6 -90 -121 -41 92 54 -42 141 -23 -24 -56 325 -300 -52
6034e2K22k62k7o8J02m6J59P5J25j61J01k51j58L58k99K93J67l15K00K9k39kR
$$ -52 170 -92 -119 -187 -85 -131 28 103 228 67 168 -83 -241 117 -182 111 278 -37 163 192 -47 -49 -40
6057d0j2m3J83l84K81O4O9n6N0k08L6M2j4l5J48j94L59j52j48no7J66L4ml7L9
$$ -40 -52 -95 88 -296 -15 49 118 62 112 -96 -60 -18 -32 -67 81 -113 246 94 -54 -59 -126 40 74 70 33 72
6083G2j43k8Q4M2k60J44J72j85Q3k09N7K33j3k3Q8j64O1K17k25J29j36K8L5J2
$$ 72 -71 -99 -15 27 -233 -89 83 -102 -19 -228 -171 62 49 26 114 -50 11 228 3 132 -4 24 59 71
6107G1m0J42l32Q1K30p7K1k08n1P4K08j44J07j46o1J1J38kj97M20m02P4j46J62
$$ 71 31 173 -159 -78 152 75 96 -112 -163 -89 119 -25 82 -64 -125 -114 24 22 -175 245 -157 -83 -229 -67
6131f7N0Q5j22K12k74R8N9Q6nq0j7j75J29j64K25K9N6k69J42N7K36o3m64L86j43
$$ -67 -17 68 -54 158 -116 -18 41 127 122 42 25 -150 -21 -185 40 69 125 -144 -2 55 291 228 -236 150 7
6156GJ50j04J31j73rK94l99J67M7n7r5L34k10j1J3k0k3j56J95l48K09J4K35k47
$$ 7 157 53 184 11 2 296 -103 64 111 54 -41 293 83 72 85 65 42 -114 81 -267 -58 -44 191 -56
6180e6J31k5J90j77J70m5k79K64j75k57K82J6J34k74L42j83j35N9J81p6k0k61
$$ -56 75 50 240 63 233 188 -91 173 -2 -259 23 39 173 -101 241 58 -77 -18 163 87 67 -194
6202a94R7N8P7J11j09J01k56N6P5K11l17j19R8K15k42m4Q7J5Q8j24Q2J23o5m11
$$ -194 -97 -39 38 149 40 141 -115 -59 16 227 -90 -209 -111 104 -138 -182 -95 -80 8 -116 -34 89 24 -387
6226c87L11J94j02or9K14k25jQ7k09L25k50L18r9j32J27Pj49Q7J96k74J47j22
$$ -387 -76 118 16 10 -89 125 -100 -101 -14 -223 102 -148 170 71 -61 66 73 -76 11 207 -67 80 -42
6249d2qQ7r7J21j59m9K88m9j24O7m4M36o46J90l2q7J81RK1J94o3j93k05K66j74
$$ -42 -50 37 -60 61 -98 -147 141 92 -32 35 -9 427 -219 -29 -61 -148 33 42 63 257 194 1 -204 62 -112
6274a12J11J55k84L63m16M15k24j4J20k9j98J01J30mk12N2J23L4K5k50J31M0J7
$$ -112 -1 154 -130 233 -183 232 8 -6 114 85 -113 -12 118 114 -98 -46 77 111 136 -114 17 57 74
6297G4p0M0j63J81k27L76r3l04K04J6J81m51M16l17P7J17j69K18n1J8K3P5j55
$$ 74 4 44 -119 62 -165 211 118 -186 18 34 215 -236 180 -137 -60 57 -112 106 55 73 96 171 16
6320A6J89q7M1r6J47j18j22j08K39LQ7j73j10P8j4Pq5M05m96O1j43L39k15K46
$$ 16 205 118 159 63 210 92 -30 -138 101 104 191 18 -92 -14 -28 -21 -106 299 -197 -136 -279 60 -155 91
6344I1l59L81r0l5m2J35n9j09n3K02J11k05K9k05M25j61rr2l8r8j0J87j63L39
$$ 91 -268 113 23 -12 -54 81 22 -87 -140 62 173 -32 -3 -208 217 56 47 -45 -83 -181 -191 -4 -167 172
6368A72j51N3J37j31m9j1R1J8k04Q6m8J25n8J48k50L0q2q3K47j21J84j67j6J63
$$ 172 21 74 211 80 31 20 111 129 -75 11 -37 88 30 178 -72 -42 -124 -207 40 -81 103 -64 -80 83
6392H3k2J20q7pm4j2j31J17J62j4K69l66l7J72L9m27Q0J18J36j81J7J27k4o2j49
$$ 83 61 181 94 87 43 31 -100 17 179 165 434 68 31 203 242 -185 -105 13 149 -32 -15 112 88 26 -123
6417a23J86l4j34J97o2k52K86j39L03o3n0rj7k20K0P9l2L1j13j22K00K76j20R7
$$ -123 63 29 -105 92 30 -222 64 -75 228 165 115 106 89 -131 -111 -32 -64 -33 -146 -268 -68 208 88 185
6441A85p5p0K19n01K90l11o1L35j5k88K62k61J08L25j58LJ62q3k91K13l24K55
$$ 185 110 40 259 -242 48 -263 -324 11 -4 -292 -30 -291 -183 142 -16 -13 149 66 -225 -12 -336 -81
6463h1Q5k68N31j43l26J95k36M93l52p7L72k60n0Q6M5l00L52p7j64K84j81n3K7
$$ -81 4 -264 267 124 -202 -7 -243 250 -102 -179 193 -67 -117 -31 14 -286 66 -11 -175 109 -72 -125 -98
6486i8J46Q2j98N7j83L12oj35P0J17j29J08j81k6M9p5K95l10J48k17K27q0j30
$$ -98 48 130 -68 -11 -194 118 112 -23 47 164 35 143 -38 -64 -15 -90 205 -105 43 -174 53 -27 -157
6509a57K17j77K27Kj23j80K74J11J2k17j75K47j39l7l5j67L99J63l06J60k30J14
$$ -157 60 -117 110 112 -11 -191 83 194 206 -11 -186 61 -78 -115 -150 -317 82 245 -61 99 -131 -17
6531a7j7K55k43RL6J57j42Mk20K56r8K53m86L11k90K86j06J92j95N0Q2q9p6J88
$$ -17 -34 221 -22 -13 23 180 38 42 -178 78 -20 233 -253 58 -232 54 -52 140 -55 -5 77 -12 -88 100
6555A00l5k8k13K12k12K30J9o4k34L31l11Q0K39k64K34j19j56L48l04J83Q0op1
$$ 100 65 37 -176 36 -176 54 73 9 -225 106 -205 -125 114 -150 84 -35 -191 157 -147 36 116 110 39
6578C9r4k46O04k66Q3Q8k40J4J6K16l50M55j29j12N2l19P2K51R9j73j69L9Q8K
$$ 39 -55 -301 303 37 120 208 -32 -18 -2 214 -136 319 190 78 130 -189 -117 134 233 60 -109 -70 18 20
6602B0K8k63K37N3o9o0n9QQ0J85J43l92K40j19NO6k52K38J69j97j31J33J11j40
$$ 20 48 -215 22 75 6 -54 -113 -105 -25 160 303 -89 151 32 37 103 -149 89 258 61 -70 63 174 34
6626C4j15J60m6K39n68M35N2l07p4K40l6k6K37j43R3k24N4K74m26J22Q3q1K06
$$ 34 -81 79 33 272 -296 139 191 -116 -190 50 14 -12 225 82 175 -49 5 279 -147 -25 58 -23 183
6649A83l31J65K15k78J60k03K35j33J59l85L33j39R2l2k18O2J75k13K04j56J22
$$ 183 -148 17 232 -46 114 -89 146 13 172 -213 120 -19 73 41 -177 -115 60 -153 51 -105 17
6670A7J30k17l28L24k1J68j77r8K73l5J9j44J77j37L8J52j59K23o1M6l9l39M48
$$ 17 147 -70 -398 -74 -95 73 -104 -202 71 36 55 -89 88 -49 -11 141 -18 205 144 190 151 -188 260
6693B60k48RK30k93J30k69J61mj4J74j13m2o0R4n5J46m9o9J03P1k28K08k15J4
$$ 260 12 21 251 -42 88 -181 -20 -24 -38 136 23 -19 -79 15 -40 106 57 -12 91 162 -66 142 -73 -59
6717e9N8j40P6j28K63k5r7j3p0J52J14l34R2K20m15J86j0J09j05K85k09p1K19
$$ -59 -1 -141 -65 -193 70 45 -52 -65 -135 17 131 -203 -111 109 -306 -120 -130 -21 -126 159 -50 -121 98
6740I8J0kJ54j34k24J7j10M08k17K31l05k12K72J6k61J59J61jj68K83l24K1k5
$$ 98 108 106 260 126 -98 -81 -191 217 0 231 -74 -286 -14 2 -259 -100 61 60 -108 175 -149 -128 -153
6763a53L69k76O2O7j79J47j69L01l24M14om39J83J63R0m87L64j67K68l00K97r4
$$ -153 216 -60 2 69 -110 37 -132 169 -155 259 253 -186 -3 160 250 -237 127 -40 228 -72 225 131
6785A31k67k3L08j76J06o7q5M42n65K05J9J43K9k84r5L67j56j45o1O6K11k81N8
$$ 131 -136 -159 149 -27 79 12 -73 369 -196 9 28 171 200 -84 -179 188 32 -113 -174 -108 103 -178 -120
6808a20J11j73J26on5M6JO7L04k37J41n16J88J58j41J66j47M8L4j75J64L1k19
$$ -120 -9 -182 -56 -62 -117 -71 -70 -3 301 64 205 -311 -123 35 -106 60 -87 -39 -5 -180 -16 15 -204
6831b04L76r7j07p8J01j02N7m6N6j88J74O4O4K0o1j63K93m9j76q2L62l08j12K90
$$ -204 172 75 -32 -110 -9 -111 -54 -100 -44 -232 -58 6 70 90 29 -134 159 110 -66 -148 214 -94 -206 84
6855H4r9r0J9L05k88K17K6m42L50j56J46N9L21l92P5j60L7Lj43J81K3J81j79n2
$$ 84 -15 -105 -86 219 -69 148 174 -268 82 -74 72 131 452 60 135 -25 12 15 -128 53 76 257 78 26
6879B6N0k31J44j8M3j6l10K59q8m7K46J55q8q3J43k3j00n9r1m7L60j22L9k87p
$$ 26 76 -155 -11 -29 14 -2 -312 -53 -141 -188 58 213 125 42 185 162 62 3 -88 -135 225 103 142 -145 -152
6904a52K08j37J52j88J75n2j06L87J27l47J6O5j38J07J23q3j48j15N3L1J70j91
$$ -152 56 -81 71 -117 58 6 -100 287 414 67 83 148 10 117 240 157 9 -106 -53 -22 148 -43
6926d3j29Q0J17J39o9kj29J30j7j37J49j48j3K15j05j39J27R0k55J90p5j1j17
$$ -43 -172 -92 25 164 95 93 -36 94 77 -60 89 -59 -72 143 38 -101 26 116 -139 51 -24 -35 -152
6949a52j21K24J75L36n24P1Op9K9N5j86m4J64j70J64L6J23Q9O9k07o2j45R1L40
$$ -152 -273 -49 126 462 -62 9 15 -64 -35 20 -166 -210 -46 -216 -52 -16 107 196 265 58 -4 -149 -58 282
6973B82k32j0O7m2l4k02L3K68j78j40L68p2Rj61J51j46j94L49k80K16k2j86K31
$$ 282 50 40 107 65 31 -171 -138 130 -48 -188 180 108 117 -44 107 -39 -233 116 -164 52 30 -156 75
6996G5r1o7J30j13J05P6j24L2j00NK59j57q5R9J27j28q1jO3J92p2m5O1n9o0k31
$$ 75 -16 -83 47 -66 39 115 -9 23 -77 -72 187 30 -55 44 171 43 -38 -39 24 216 144 99 160 101 41 -190
7022a90J70k88K38J31k39K24r6M0q2K31j01J8j60l1Q6R1p9q4K09j27K44l71j2
$$ -190 -20 -308 -70 61 -178 46 -50 -10 -92 139 38 56 -104 -135 -49 42 -37 -121 88 -39 205 -166 -178
7045a78K18J21nj18j19L07j78k36k0L01p9nK39j43j27j6J1K63j34J9j77kQ5n1
$$ -178 40 161 156 38 -81 226 48 -188 -208 93 14 9 248 105 -22 -38 -27 236 102 121 -56 -58 27 -24
7069b4J47Llm1l20J96J75l14K17k28J23j28JK24p9K13k75k0N0L17k66L15j6l09
$$ -24 123 126 123 82 -238 -42 133 -181 36 -192 -69 -197 -196 28 -51 162 -113 -133 -83 234 -32 283 267 -42
7093d2n0p5J19m1L77k10M6m22M44j23j00M4M7j15J64N1m30J03r3J87k8J36J45
$$ -42 -92 -167 -48 -89 288 78 124 -298 146 23 -77 -33 14 -101 63 114 -316 -213 -306 -119 -147 -11 134
7116A34j47k3J0k27J49NK11jj68J78j59J16j25M3K98k57p6o2k0K73l7K8l11J48
$$ 134 -13 -36 -26 -253 -104 -99 112 111 -57 121 -38 78 -47 -4 294 37 -39 -101 -121 152 115 143 -168 -20
7140b0J74m7j99k2J15R5j91L3J66Ll9n0J38k5j69j8J72k25k27M15Q8l43K03o4
$$ -20 154 107 -92 -114 1 96 -95 -62 104 107 68 18 156 131 -38 -56 116 -109 -336 79 167 -176 27 -37
7164c7K3J99j67q4J51Q0j06L1l56K62J31l38M10l28K28j32K1J82j23nL5k57K65
$$ -37 -14 185 18 -66 85 165 59 90 -266 -4 127 -211 199 -129 99 -33 -12 170 47 42 77 -180 85
7187H5K0j91J05J80k67L86m58J38Q5j20j00J48K35k70L7P3r5M5K4j98L80l69J33
$$ 85 105 -86 19 199 -68 318 -140 -2 83 -37 -137 11 246 -24 13 86 -9 36 60 -138 242 -127 6
7210FM1O2j81J89k74j5RL57k60m7L8O1Q2j97J51l52J78l3M5J13N6p3Q0j51QP4
$$ 6 47 109 -72 117 -157 -172 -163 194 -66 -113 -75 -14 68 -129 22 -330 -152 -185 -140 -27 29 -44 36 -115 -107 -33
7236c3P7J51k44j18k28M55k23J66J12k87L65j54o00O05k06L50k85M7J36k86j9
$$ -33 44 195 -49 -167 -395 60 -163 3 115 -172 193 39 -561 44 -162 188 -97 -50 86 -200 -219
7257b19K96Jk1J3j5m4J68k53J45l20L33k98J7J78N4j37K95k00p4J4O2L2k18J41
$$ -219 77 78 57 70 55 11 179 -74 71 -249 84 -214 -197 -19 35 -102 193 -7 -81 -67 -5 27 -191 -50
7281e0N6j10J44j28K21k0n17O02l35J43j16L16j58k51n1J57J52j04R3j56K46q3
$$ -50 6 -104 40 -88 133 113 -404 198 -137 6 -110 206 48 -203 -254 -97 55 -49 44 -112 134 51
7303E1Q7n4Nk00OJ11L5m2N2k40K8L29o3k29J91rj1j80J00J20l2k11M52l51Q1P4
$$ 51 138 84 89 -111 -105 6 41 -1 51 -189 -161 168 105 -124 67 58 47 -133 -33 87 55 -156 296 -55 26 100
7329A00j1m4jN0j04J01k5J65l04K9J43k63K18j88P7K16k91K83n7l4j6r7j90K11
$$ 100 89 45 44 94 -10 91 66 231 -73 -44 99 -164 54 -134 -57 159 -132 151 94 60 44 -53 -243 -32
7353c2k9m7N4K51M4k04J34l18K77j90J64l6N7j74J10j62l1K75j26R6N4j82O5L14
$$ -32 -61 -108 -54 197 241 37 171 -147 130 -60 104 68 125 -49 61 -101 -132 143 17 113 167 -15 50 364
7377C64l05N7R5k97P8o7j40K78q8O2K38j86L5j47J27j84O9m29N15O9j08OJ1r9
$$ 364 59 116 211 -86 -8 -75 -215 63 -25 37 275 89 124 -23 104 -80 -11 -440 75 144 36 42 53 -46
7401d6p2m6L7J43n0J32J30k10q1J54p6j94M5M84j55q7k87K37L6Kj79N4R5l5j58
$$ -46 -118 -164 -127 16 -34 98 228 18 -63 91 15 -179 -134 350 195 108 -179 58 94 96 -83 -29 66 31 -127
7426a27L9J80Pj90P6j96k3L95j79k7K73k79K3Jm7P5q2j84J44J63j84K87j2%j74
$$ -127 -88 92 99 -91 -15 -211 -234 161 -18 -45 228 -51 -28 -27 -74 1 -81 -265 -121 42 -142 145 133 133 -41
7451d1m9K36r6O6jj69o7K33j49J46l23J88J38l14K18L16j24m63L53J15l79n0O99
$$ -41 -90 146 50 116 115 -54 -121 112 -37 109 -214 -26 112 -202 16 332 208 -255 98 213 -166 -216 483
7474D83p20J25K56k02j16K00L0M6m4P2O3j12l1J89o0n5K23j66j15j77R6L0k0r0
$$ 483 -237 -112 144 -58 -174 26 56 102 58 130 193 81 50 239 179 124 347 181 66 -111 -15 15 -5 -95
7498i5K76k70K98l89K65k34J26N8K07m24J77P8J51m4k2l11P8K01j11O9l59N29
$$ -95 181 -89 209 -180 85 -149 -23 35 242 -182 -5 73 224 180 158 -153 -75 126 15 84 -275 254
7520B54j60j09J40k87K17j3j30L7J99l26J40QJ26k27J20k01K38N5j08j5J25k8
$$ 254 94 -15 125 -162 55 42 -88 -51 148 -178 -38 -30 96 -131 -11 -212 26 81 -27 -42 83 55
7542E5R7j18j31K08r3P1M9l86M27k76O1q2J27N6K2q3J49j27r3J43j92K78k3j78
$$ 55 152 34 -97 111 18 89 138 -248 179 -97 -36 -118 9 65 87 4 153 26 -67 76 -116 162 139 -39
7566c9j5K02m2J85n41K97K5k21K67k76K35k50K15r4k59N30k68K75k75q0O4O4k95
$$ -39 -54 148 106 291 -250 47 72 -149 118 -158 77 -173 42 -52 -311 219 -49 226 -49 -129 -65 -1 -296
7589b96K23K88k62PJ69j99J77M3k09L25j70j43J28l9l9J37l69M62q9j79Q0O7j71
$$ -296 -73 215 -47 -40 129 -70 107 150 -59 266 96 -47 81 42 3 140 -229 233 144 -35 45 112 -59
7612e9Lk64J56L17p3j24j68L22o4M0j29q7M9J20o6K13n6l87M12k02L2j17k4j10
$$ -59 -56 -320 -164 153 80 -44 -212 110 46 86 -43 -130 -81 39 -27 186 130 -257 155 -47 -15 -132 -156 -266
7636b66N8L37J29n06P9K55k10O5o3J8P4J39o4k38L02k86K69j27N5q7M83m90J39
$$ -266 -208 129 258 -248 -169 86 -124 -59 -122 -104 -30 109 45 -193 109 -177 92 -35 20 -67 416 -74 65
7659F5p9j54K50p6n3K10K14o06M22j48J49k75K0K16q9k7p8k8M41k58j24N7q1J67
$$ 65 -14 -168 82 6 -47 163 377 -229 193 45 194 -81 -61 155 66 39 -39 -67 374 116 -8 49 -32 135
7683A35l0k3j51L25l53K51k67J58J57j6q3k00J15j83N4L9M9P7J73k91K41k6L6
$$ 135 105 82 -69 256 -97 154 -113 45 202 186 103 -97 18 -165 -111 -72 -23 54 227 -64 177 151 187
7706A87j32j94L17l54R8L16k80J8o9P8m4J00J49j81j9j00j3K72k49L9J6J53k22
$$ 187 55 -139 178 -176 -78 238 -42 -24 -93 -15 -59 41 190 9 -10 -110 -123 149 -100 -61 -45 108 -114
7729a14J23j19j92K36K06l9r5R2j78J85k21K99pj91P4j02N5k5Q0k73L25j53M7
$$ -114 9 -110 -302 -66 140 101 6 98 -80 105 -116 183 176 -15 59 -43 12 -13 67 -206 119 -34 13
7752A3R2mr7L1J69j96MJ11l20J75J09j77p9J65R0j90PL70k45k19L10j5N6k07J89
$$ 13 105 101 4 35 204 8 12 123 -197 -22 87 -90 -169 -4 86 -104 -97 273 28 -191 119 104 160 -47 142
7777A42j29n4R8l0k03Q9k5J79j79r4L36k04oJ15K0q5J7ON5J76j76J03j41J55O7
$$ 142 13 -41 57 27 -176 -87 -112 67 -112 -206 130 -74 -80 35 55 -30 -13 -7 48 224 48 151 10 165 232
7802B32k21R0k61J77J78q0k0J05k57L69l76J30j09K04j70j7K32k29q3J38L8j33
$$ 232 11 101 -160 17 195 115 95 200 -57 312 -64 66 -43 161 -9 -26 206 -23 -106 32 70 -63
7824f3Nk06J43N17o52K54J50j30n6PJ88k30R4pk23L71j45J0j54K25j70M2J34n
$$ -63 -58 -264 -121 396 -256 -2 148 18 -38 -31 157 -73 21 14 -209 162 17 27 -127 98 -72 -30 104 99
7848I9j00P3J09k83J41j54p8Q6L1R8j93L51l29J60K4k22L26p5J87m28R4J12q6
$$ 99 -1 72 181 -102 39 -115 -193 -107 -76 22 -171 180 -149 11 35 -187 139 64 251 -177 -83 29 -57
7871e7K14r5N7p6j39L33m19K99j28J57j41k37N42l33K8P1J29j44l01K65m1j08
$$ -57 157 62 119 43 -96 237 -182 117 -11 146 5 -232 310 -23 5 76 205 61 -240 25 -16 -124
7893a24P9j21n3K55j78J55l00K39K86l38j0K63k17N6K5j02K84r2j6M4k34P1j17
$$ -124 -45 -166 -219 36 -142 13 -287 -48 238 -100 -110 153 -64 -8 17 -85 199 107 91 135 -99 -28 -145
7916a45L53k83j49L40j70J37j07j9J08J7k16K64q3k1p5j34P3r4M24j87j71N7j67
$$ -145 208 -75 -224 116 -54 83 -24 -43 65 82 -134 130 47 26 -49 -183 -110 -204 220 33 -138 -81 -248
7939b48M19n2k42K54l2j31%J7N7k48L29K8k23nR5o2M22m66J41q8jP4k28pK83l27
$$ -248 171 119 -123 131 99 -32 -32 -15 42 -206 123 151 -72 -77 18 -44 378 -88 53 -35 -36 38 -190 -197 86 -241
7965b41M09j06j43j01K46q0L2j59N2j10L40l69J83L25j13n3J37l61K03j39Q5r5
$$ -241 168 62 -81 -182 64 -16 16 -143 -91 -201 139 -230 -47 278 165 112 249 -112 91 -48 37 -58
7987e8N5R9r8m4O3q1J01j31O9P8j89K7N6R5k09J92q2J5J11J56k63M9k13J06R5
$$ -58 -3 96 -2 -46 17 -64 37 -94 -25 53 -136 -109 -53 42 -167 25 -57 -42 69 225 -38 11 -202 -96 -1
8012aK60j15l00J68j07L1M7J55L2l55J96l9L14k79L0R1j10l7R1L2m1R4l5J29k80
$$ -1 259 144 -156 12 -95 -64 -17 138 170 -185 11 -28 286 7 37 128 18 -19 72 104 63 157 122 251 -29
8037b9J63o8p2J14n9L6L5j8j00K5p5j32j11L38J9K17k44J64j36l46J69M90j68
$$ -29 134 66 -6 108 49 85 120 102 2 27 -48 -180 -291 47 66 283 39 203 67 -279 -110 380 212
8060B12k52K64j85J02k74K47n5j07K42j22l57K85J13o4n5k32N48k47m0J74p8j39
$$ 212 -40 224 39 141 -133 114 59 -48 194 72 -285 0 113 49 -6 -238 310 63 23 197 119 -20
8082b0J47o0k9k37P3J66j82L90k70o3J3J0O0o4J01j33P9m2K82l38J37N2k83M14
$$ -20 127 67 38 -199 -126 40 -142 248 -22 -85 -72 -62 -2 -66 35 -98 -19 -61 221 -117 20 72 -211 203
8106B03k01k00Q4j25K08oM4q2l3J34Pk32lL58m34L92l3j47K12j50r5l8J09Q0j07
$$ 203 2 -198 -114 -239 -31 -37 7 -75 -108 26 33 -199 -202 156 -278 114 81 -66 146 -4 -99 -137 -28 52 -55
8131e5K12l73K58k7p9J77J45N7l30K80j83j42n2J03j17M2J44j12k87J19L14j85
$$ -55 157 -216 42 15 -64 113 258 315 -15 265 82 -60 -112 -9 -126 -84 60 -52 -339 -220 94 -91
8153i1K45M7l60O1K6J17o6o2K9K08j92J30q1O9k65L07J5j56R9j50J33k1L3k60
$$ -91 154 201 -159 -98 -72 45 -21 -83 -54 154 -38 92 11 80 -185 122 137 -19 80 -70 63 42 75 -185
8177a85L40M0j77m7j34J10K03j68k13J40L70k26k43J08
$$ -185 155 195 18 -29 -163 -53 150 -18 -231 -91 279 53 -190 -82
8191h2
$$ Imaginary data points
##PAGE= N=2
##DATA TABLE= (X++(I..I)), XYDATA
0@%%%%%%%%%%%%%%%%%qJ6j6J6j6J6k4L2l2L7m5M9n7O7p5Q7r8J08j22J38j55J74
$$ 0 0 0 0 0 0 0 0 0 0 0 0 0 0 0 0 0 0 -8 8 -8 8 -8 8 -16 16 -16 21 -24 25 -32 35 -40 47 -51 57 -65 73 -82 92
39I2j94K16k40K67k96L27l60L98m39M81n31N86o46P12p87Q71r63J069j192J335
$$ 92 -102 114 -126 141 -155 172 -188 210 -229 252 -279 307 -339 373 -414 457 -506 563 -629 706
59G06j502J703j954K269k680L246m075N410p893J4023n6015q2948J41151P2443
$$ 706 -796 907 -1047 1222 -1458 1788 -2287 3123 -4770 9253 -46762 -129710 11441 83884
73H3884p8473m8744L9164J3216r82O821m367l2074P708L9692P424l5077k2056
$$ 83884 5411 -43333 -4169 9047 8065 14886 10519 -21555 -13847 25845 33269 -1808 -23864
86b3864K2630K0170j1438j1082K084J935r940Q043Q721j4045j1464J4617J0409
$$ -23864 -1234 18936 7498 -3584 -1500 435 -9505 -1462 7259 -6786 -18250 -3633 6776
99F776j9299J084K2967j3226j9922K5326K3462l4069j5518L8729J0665l2417o436
$$ 6776 -12523 -11439 11528 -1698 -21620 3706 27168 -6901 -22419 16310 26975 -5442 -11878
112a1878K8457j426k4076M083J7316n527j6440Q124Q021j6227m287K0269L900
$$ -11878 16579 15153 -8923 -4840 12476 6949 -9491 -1367 6654 -9573 -13860 6409 10309
125A0309k6987j803K9271K130k7298l910K6552L370j8527J804J1590m336n775
$$ 10309 -16678 -18481 10790 12920 -14378 -18288 8264 11634 -6893 -5089 6501 2165 -3610
138c610J0046j04j0798P283Q605j1040q964J4284O600j7011p182J4744R136j3511
$$ -3610 6436 6332 -4466 2817 11422 382 -8582 5702 12302 -4709 -11891 2853 11989 -1522
152a522r256Q066M860k272J512R58j0327j505J7242M355j9582r956J8964J3342
$$ -1522 -10778 -2712 2148 -124 1388 2346 -7981 -9486 7756 12111 -7471 -17427 1537 14879
166A4879j4369j2621Q691Q640m774m55M440o721l281R721O437r893m128O855J076
$$ 14879 510 -12111 -3420 5220 446 -9 4431 -2290 -5571 4150 10587 694 -3434 3421 4497
181D497m276K585L044p736n445R658N828j0013r988P380R497m186o922J154K740
$$ 4497 221 2806 5850 -1886 -7331 2327 8155 -1858 -11846 -4466 5031 845 -6077 -4923 -2183
196b183q59J298K959l029l549M780O864m229n678M793N609k741k650L006r42k834
$$ -2183 -3042 -1744 1215 -1814 -5363 -583 6281 2052 -3626 1167 6776 4035 1385 4391 3449 615
212F15J956J831l961k484L147L20n175m34L834n97m519P49N010j354m067J714
$$ 615 2571 4402 441 -2043 1104 1424 -3751 -4185 -351 -948 -5467 -4718 292 -1062 -5129 -3415
228c415N116o15l747J598L347o7k191J634R33j687Q92K108k660k896L747K994
$$ -3415 1701 1086 -2661 -1063 2284 2217 26 1660 2593 906 1798 3906 1246 -1650 2097 5091
244E091m689l625L430K405l080k232K148K41j650kJ662j152j666J613K809j390
$$ 5091 402 -3223 207 2612 -468 -2700 -552 -311 -1961 -1963 -301 -1453 -3119 -1506 1303 -87
260h7k561J159K702j061j131J074J247j639L6K793j123j893J133J973j149r96
$$ -87 -2648 -1489 1213 152 -979 95 1342 -297 -261 2532 1409 -484 649 2622 1473 477
276D77J127or50N77Q12j357k048J013J144r65k517J08J838k54j829k92K082k9
$$ 477 1604 1598 648 1225 2037 680 -1368 -355 789 -176 -2693 -2585 -747 -1001 -2830 -3122 -1040 -1069
294a069q65N74J022k92Q79J362n99n78J422R85j282L0P76J28j019k79M99l80j300
$$ -1069 -1934 -1360 -338 -630 249 1611 1012 434 1856 2841 1559 1589 2365 2493 1474 1195 1694 1314 14
313A4k75L34p46j014LJ82q99m54J013L28p57N5J612M10p67Q07J429J4o22J075
$$ 14 -261 73 -673 -1687 -1684 -1502 -2401 -2855 -1842 -1514 -2271 -2216 -604 -194 -961 -154 1275 1289 667 1742
333A742K63l94j28R25n18j153n0Q25o41j446L01N92m61q69j10Q32q23o96J011
$$ 1742 2005 1611 1483 2408 1890 737 687 1512 871 -575 -274 318 -143 -1012 -1122 -290 -1113 -1809 -798
352g98J49j187j17J407L46r17J02J142j94J55M71L7m79L01J257P3q62p99J082
$$ -798 -649 -1836 -1953 -546 -200 -1117 -1015 127 -67 88 559 596 117 418 1675 1748 886 87 1169
371A169N54j29q37m17lK18J04l24r75o36J161O01j482j180N51M76j31k38j43k48
$$ 1169 1723 1594 757 340 337 555 659 335 -640 -1276 -115 486 -996 -2176 -1625 -1149 -1280 -1518 -1661 -1909
391a909P55R27o5k63L09P32M91K66K66j5l4N15p7m2m72j02m2n13o28j24k66m15
$$ -1909 -1154 -227 -292 -555 -246 486 977 1243 1509 1494 1460 1975 1898 1856 1384 1282 1240 727 99 -25 -291 -706
413g06j014M37L31n48o65L58J36K33N11L34n21j83J122J229k35q13M63J094O93
$$ -706 -1720 -1283 -952 -1500 -2165 -1807 -1671 -1438 -927 -593 -1114 -1297 -175 1054 819 6 469 1563 2256
432B256l74p42k74M78M60m37m11p03p67K61O78m44j683l76J171J086p45j150l30
$$ 2256 1882 1140 866 1344 1804 1367 956 253 -514 -253 425 -19 -1702 -2078 -907 179 -566 -1716 -2046
451b046J041R69m05j66K73R5n68K35J177K08r11k72J820M51j429j64P47K5j74
$$ -2046 -1005 -36 -441 -607 -334 -239 -807 -572 605 813 -98 -370 1450 1901 472 308 1055 1080 906
470I06P67n21j441p23J064J278q48k343r91K325J935k340k578J093K573l67p37
$$ 906 1673 1152 -289 -1012 52 1330 482 -1861 -2852 -527 1408 -932 -3510 -2417 156 -211 -948
487i48k55M0K10J872K76j344j238R36K207J453j653k310J044K611n54k464K00
$$ -948 -1203 -1163 -953 919 1195 -149 -1387 -451 1756 3209 1556 -754 290 2901 2347 -117 83
504H3J307l41p33p2j001j021N01J123j61j108q38M6J662R9j279K31J554Q26j573
$$ 83 1390 1049 316 244 -757 -1778 -1277 -154 -315 -1423 -2261 -2215 -553 -454 -1733 -1502 52 878 -695
523f95n4J508L03j99K43j45M3Q45k22j141J34O30q2m10q11j055K36K045l43k444
$$ -695 -749 759 1062 863 1106 961 1004 1849 1627 486 620 1250 1168 758 -53 -1108 -872 1173 830 -1614
543a614j430J752J752o71j448o69J325J524p91j021J15J402N52N92k81r32j271
$$ -1614 -3044 -1292 460 -211 -1659 -2328 -1003 521 -270 -1291 -1176 226 778 1370 1089 157 -1114
560a114J830J876n99j953r5J192J66o14r50K1P39M2l97m68k58r19J92J442r9j449
$$ -1114 716 2592 1993 40 -55 1137 1303 689 -261 -240 499 541 144 -324 -582 -1501 -1309 133 34 -1415
580a415j031J796Q94j000m67O13Q48j27K0Q0O09Q8q69K89J565M9j829k11J751
$$ -1415 -2446 -650 244 -756 -1223 -610 238 111 131 211 820 908 39 328 1893 1942 113 -98 1653
599A653l34j165K68O2p02j79P91l12j263k44N01L90j36r37l51J538J029j289j167
$$ 1653 1319 154 422 484 -218 -397 394 82 -1181 -1425 -924 -534 -670 -1607 -1958 -420 609 -680 -1847
618a847J109J084K19k2K36L0N11J38o53k1M15k60k23P54p12j508K64J377q35j199
$$ -1847 -738 346 565 543 779 809 1320 1458 805 784 1199 939 716 1470 758 -750 -486 891 56 -1143
638a143P98O75j428n62P34O2q6N33r7m07J09M11J60M56O7j25Q54K65o27p08J193
$$ -1143 -345 330 -1098 -1660 -926 -864 -950 -417 -514 -921 -812 -401 -241 215 282 157 1011 1276 649 -59 1134
659A134Q2m08J01m16n53M45P70p00p26%L39r33O06k8j007M93O18p2j338K06J460
$$ 1134 1216 808 909 493 -60 385 1155 455 -271 -271 68 -865 -259 -287 -1294 -801 -183 -255 -1593 -1387 73
680G3K0m99k13J51K80L80K05J44J44J94L8Q3j3m05J54P29k55r38j69L77p05n3
$$ 73 93 -406 -619 -468 -188 192 397 541 685 879 917 1000 987 582 736 1465 1210 272 103 480 -225 -278
702b78K51q23k49O74o4r04J99O53k09n59N97M61l14K72J82J21p7M86K51P9O3P3
$$ -278 -27 -850 -1099 -425 -489 -1393 -1194 -541 -750 -1309 -712 -251 -565 -293 -111 10 -67 419 670 749 812 885
724H85M1M7J33n49R1Q5m44k33j4p6l72rj11k97k00N35j04m21J26M25l61K10J86
$$ 885 926 973 1106 557 648 733 289 56 42 -34 -406 -415 -526 -823 -1023 -488 -592 -1013 -887 -462 -823 -613 -427
747d27J70K45L18J42p4J49J38j14J35K36m32K8K15o0j20m32p9J01j39m25m9j78
$$ -427 -257 -12 306 448 374 523 661 547 682 918 486 514 729 669 549 117 38 139 0 -425 -474 -652
769f52J97j70k55L71M9l11k28O62j05K72K96o9j13K78L27J58m40J14M82j9o1j8
$$ -652 -455 -625 -880 -509 -460 -771 -999 -337 -442 -170 126 57 -56 222 549 707 267 381 863 844 783 765
791G65n6j54j20J67j44m58O8l34J49n31L8o1l0j29J07L0K21j51J05K46J99j33
$$ 765 709 555 435 602 458 0 68 -266 -117 -648 -610 -671 -701 -830 -723 -693 -472 -623 -518 -272 -73 -206
813b06j32N33L27j63N7L79j49J04K25l27O9l39J51q9l57L72p59J16r6k59j98L71
$$ -206 -338 195 522 359 416 795 646 750 975 648 717 378 529 440 83 455 -304 -188 -284 -543 -741 -370
835c70l29j95L67k64J04K55L39j90j74L31L04%KK80K02k62K31j0L21j54k54J07
$$ -370 -699 -894 -527 -791 -687 -432 -93 -283 -457 -126 178 178 180 460 662 400 631 621 942 788 534 641
857F41j89P2k40j80j02r2k47J5k00j16J23j92p1K01k5j66R8L94J67J07j19J45
$$ 641 452 524 284 104 2 -90 -337 -322 -522 -638 -515 -707 -778 -577 -602 -768 -670 -276 -109 -2 -121 24
879B4rP6M21q0K8K38o2j6j62J27ll89j20L73k71j41l16L15k78m30j14J92J2j32
$$ 24 15 91 512 432 460 698 636 620 458 585 582 193 73 446 175 34 -282 33 -245 -675 -789 -597 -585 -717
903g17L30l19K31l87R10J5k18J25kO85j79J4rK64K6k23K67j13k79j16Nj23l03
$$ -717 -387 -706 -475 -862 48 63 -155 -30 -32 653 474 488 479 743 769 546 813 700 421 305 310 187 -116
926a16m6P1m44M20j50m62n66N94K86m44J15L35j26p5M59K82j82K16J55nJ5j31
$$ -116 -162 -91 -535 -115 -265 -727 -1293 -699 -413 -857 -742 -407 -533 -608 -149 133 -49 167 322 317 332 201
948B01M28M14q6p84M93K70l56p75K86L45l03o26J73J72m09J33j66j44r3M45o3
$$ 201 629 1043 957 173 666 936 580 -195 91 436 133 -493 -320 -148 -557 -424 -590 -734 -827 -382 -445
969d45L3O2j42r2O08O77p19k57P24O57n34l20L33J73N3n46M09J15o93l17P21J4
$$ -445 -412 -350 -492 -584 24 701 -18 -275 449 1106 572 252 585 758 811 265 674 789 96 -221 500 514
991E14q52o28R57M72j039o19M33P31m43m10M64K10l84J0N90j90O6J93L67L43m06
$$ 514 -338 -966 -9 463 -576 -1195 -762 -31 -474 -884 -420 -210 -594 -584 6 -184 -118 75 442 785 379
1012C79k10M74J19j35k58L34j86j03m32K91J16j29n82m77O30J93p46k20L25M97
$$ 379 169 643 762 627 369 703 517 414 -18 273 389 260 -322 -799 -169 24 -722 -942 -617 -120
1032a20p48K38O11q9n23O88K78m2n53J23Q96j83J83n89K63J49l50K2M73k59m77
$$ -120 -868 -630 -19 -108 -631 57 335 293 -260 -137 759 576 759 170 433 582 232 254 727 468 -9
1053iJ08L94m96m55M12K2p5q1l14n10J42J98K58k88P34r4l72P2N81p6j62J88J98
$$ -9 99 493 -3 -458 -46 -24 -99 -180 -494 -1004 -862 -664 -406 -694 40 -54 -426 -354 227 151 -11 177 375
1076C75M14l65K8J6j37J01K41J41k35p15j14P21l58o59N43M6o86J30K57j09o50
$$ 375 789 424 452 468 331 432 673 814 579 -136 -250 471 113 -546 -3 43 -643 -513 -256 -365 -1015
1097a015O17M10l41k59N00K65l84L17K14j68j53J96M95j60k09qK62k29k58l2L79
$$ -1015 -398 12 -329 -588 -88 177 -207 110 324 156 3 199 694 534 325 317 579 350 92 60 439
1118D39n9m91J97j50m97J8O89l43n50J78L75m68j30N28J62j81J24K69j95l3L23
$$ 439 380 -111 86 -64 -561 -543 146 -197 -747 -569 -194 -662 -792 -264 -102 -283 -159 110 -85 -118 205
1139B05O9O0R6J95k04q7J45j44J70k51k2J43l0o74J51n0J1m82J98M43l17l42O85
$$ 205 274 334 430 625 421 334 479 335 505 254 232 375 345 -329 -178 -228 -217 -699 -501 -58 -375 -717 -32
1162c2q3m58J61M40k06m50R42J50l03K1j19M14j53J00J72J69j94m31J72j11Kq7
$$ -32 -115 -573 -412 28 -178 -628 314 464 161 182 63 477 324 424 596 765 571 140 312 201 203 116
1184A16J17r4n14O6K19j35m64M10J76l86J54K80j82k35N03Q8j30J27K01O6l29
$$ 116 233 139 -375 -309 -90 -225 -689 -279 -103 -489 -335 -55 -237 -472 31 119 -11 116 317 383 54
1205E4K51Q7Qk06J21Q3j26j74N4J29P5n05j04J99q1k91K74j19l80J69J00j71j71
$$ 54 305 392 400 194 315 398 272 98 152 281 356 -149 -253 -54 -135 -426 -152 -271 -651 -482 -382 -553 -724
1228g24L03L14l48J18M32kj05QN44k79L1J50m9k39J95J9P8j9l93J02p5j89nR0
$$ -724 -421 -107 -455 -337 95 93 -12 -4 540 261 292 442 393 154 349 368 446 427 34 136 61 -128 -133 -43
1252d3Lj69k67L01j78j3J34O3r9J84Q6j56l99O76K77l53j29M42K86m48J3M03j6
$$ -43 -40 -209 -476 -175 -353 -366 -232 -169 -268 -84 2 -154 -553 123 400 47 -82 360 646 198 211 614 598
1275E98m40J10K20j24p47K58J82j87p1L98k94j66j31K2L89k39p3lJ2M9K45j7j14
$$ 598 158 268 488 364 -383 -125 57 -130 -201 197 -97 -263 -394 -372 17 -222 -295 -298 -286 -237 8 -9 -123
1298a23K5J06J60j30K9L17O9KJ9k05j0j41L38j28k10k13K00q9m58L00O7q9k61
$$ -123 -98 8 168 38 67 384 453 455 474 269 259 118 456 328 118 -95 105 16 -442 -142 -75 -164 -425
1321d25n2K73j01LK78k12k9j53N06Q6p8N8j04K77R7n3j45K00k16O2L89m12r3J56
$$ -425 -477 -204 -305 -302 -24 -236 -265 -418 88 174 96 154 50 327 424 371 226 426 210 272 661 249 156 312
1345C12n63K91n1j25k4L1Q6k10kl83Q1L43r6J82j17P7M5O3M22m41L11J06l1M8
$$ 312 -251 40 -11 -136 -160 -129 -43 -253 -255 -638 -557 -214 -310 -128 -245 -168 -123 -60 362 -79 232 338 307 355
1369C55r8K41j02j00j00l8Pj67J84q4k54J56j98r5J03k23J40J50k64J28j00K39
$$ 355 257 498 396 296 196 158 165 -2 182 98 -156 0 -198 -293 -190 -413 -273 -123 -387 -259 -359 -120
1391a20lj47M21J5l04K7M71l10O7K86k23J29k35J53N7l09K93Ml17J16N4k4n1j63
$$ -120 -123 -270 151 166 -138 -111 360 50 117 403 180 309 74 227 284 -25 268 272 -45 71 125 101 50 -113
1415a13o6m2j04L86l52J0j2j01K95j12K86j42K92j14M2J46po8n6K25j4k81L79
$$ -113 -179 -221 -325 61 -291 -281 -293 -394 -99 -211 75 -67 225 111 153 299 292 224 168 393 379 98 477
1438D77l35M1K2l48K38l87K55k22J72J11k95P5r4M2oj02k4oP1K37NJ14j71L48
$$ 477 142 183 205 -143 95 -292 -37 -259 -87 24 -271 -196 -290 -248 -254 -356 -380 -386 -315 -78 -73 41 -130 218
1462B18k33J85k7J32m09P03l67n5J95N5J6l54JNJ0l80K75k76k14J99K9P6K48m08
$$ 218 -15 170 143 275 -134 569 202 147 342 397 413 59 60 65 75 -305 -30 -306 -520 -321 -292 -216 32 -376
1486c76q2J97n6J61j50M52j36R9P0K17k22r9L49j97P6m0q0m8OQ3l0j4R5l29p3
$$ -376 -458 -261 -317 -156 -306 146 10 109 179 396 174 75 424 227 303 263 183 135 141 224 194 180 275 -54 -127
1511a27p3J95l84N0K12j75k97j3L07J59o0J71J38o5J72k27J71k1m9K13L7j40r
$$ -127 -200 -5 -389 -339 -127 -302 -599 -612 -305 -146 -206 -35 103 38 210 -17 154 133 84 297 334 194 185
1534A85J26N4l04q1J33j24m7P3m08M70l77N8K7k80L46J64k69N6j3O7M8K47p5K26
$$ 185 311 365 61 -20 113 -11 -58 15 -393 77 -300 -242 -215 -495 -149 15 -254 -198 -211 -144 -96 151 76 302
1558C02k56k5M36k96KJ79j39K05l86L6j3L41n45jL99j36j78J79k71q3K13l07j04
$$ 302 46 21 457 161 163 342 203 408 22 58 45 386 -159 -160 239 103 -75 104 -167 -250 -37 -344 -448
1581d48K15j56K6J90N9L3K50k01K67k47K66l2k36J81j7Q2j55L50m85L66o2o6l13
$$ -448 -233 -389 -363 -173 -114 -81 169 -32 235 -12 254 222 -14 167 150 232 77 427 -58 308 246 180 -133
1604a33Q1M4m5p7M0P5j84r2r7K92k29K75l9j26k0L62k04K19j35Q1K04%j46o3L20
$$ -133 -52 -8 -53 -130 -90 -15 -199 -291 -388 -96 -325 -50 -89 -215 -235 127 -77 142 7 88 292 292 146 83 403
1629D03j29k99J32K67m88L3O05p28J7K65m57jJ01K43k1l40J3K30K50k24n6p2K79
$$ 403 274 -25 107 374 -114 -81 524 -204 -187 78 -379 -380 -279 -36 -57 -397 -384 -154 96 -128 -184 -256 23
1652B3R8j21L67k58r2J05J52j09J56j7n2k38K28J87j69j79j87K26m50m0L48Q4
$$ 23 121 0 367 109 17 122 274 165 321 304 252 14 242 429 260 81 -106 120 -330 -370 -22 62
1674F2m20K86j67P7j55Q8K15J32j55j04J28L61m49K56Jj4k1J12J13o8P2lj4k4
$$ 62 -358 -72 -239 -162 -317 -229 -14 118 -37 -141 -13 348 -101 155 156 142 121 233 346 278 350 347 333 309
1698C09k75R5l77K24n7J8k62L68j5l19J12K0J1J06oj15Q8j07J19n3M70k56j71
$$ 309 34 129 -248 -24 -81 -63 -325 43 28 -291 -179 -159 -148 -42 -48 -163 -75 -182 -63 -116 354 98 -73
1721g3M8R5J77L4J90l06k58K99N0l9j20J90l13j60L8P5J24k93L66o8k91J42L9
$$ -73 -25 70 247 281 471 165 -93 206 256 217 97 287 -26 -186 -148 -73 51 -242 124 56 -235 -93 -54
1744e4j20P9l3O1Q3J06p3n5N6mK2K14N5j81j45K59k64M3L01l06L2j21J70l61L97
$$ -54 -174 -95 -128 -67 16 122 49 -6 50 46 68 282 337 156 11 270 6 49 350 44 76 -45 125 -236 161
1769A61j85j18J08j23r1J79k14K93q5j1l42N38k15M4J38L5J32k07J8L20k25O5
$$ 161 -24 -142 -34 -157 -248 -69 -283 10 -75 -86 -428 110 -105 -61 77 112 244 37 55 375 150 215
1791B15l6J31j28l20K64o2rj2j5j00k0k58J3NJ10R8J2l4k8Np5P2K90k65R5J93
$$ 215 179 310 182 -138 126 64 55 43 28 -72 -92 -350 -337 -332 -222 -124 -112 -146 -174 -169 -244 -172 118 -147 -52 141
1817A41j09m6J34m9L11o9k07k19J92J25%j05J24j72K1o1j6p9nq0J75j48J2o3J16
$$ 141 32 -14 120 71 382 313 106 -113 79 204 204 99 223 51 72 11 -5 -84 -89 -169 6 -142 -130 -193 -77
1842g7J4j47J60N8O6k65K26N6j92K88j34L1J39J62j79K06l38M2J41k63l9J20j20
$$ -77 -63 -210 -50 8 74 -191 35 91 -101 187 53 84 223 385 206 412 74 116 257 -6 -45 75 -45
1865d5J65q7r9j52M35n72m0J43N5K10j14n3l7L58j79K47k51j62K34R6l78N90l01
$$ -45 120 33 -66 -218 217 -355 -395 -252 -197 13 -101 -154 -191 167 -12 235 -16 -178 56 152 -226 364 63
1888F3J90j19K9N6k77K9r8J31J77l45N2j77L92k84j03m4O81l93m7k53M57j64P0
$$ 63 253 134 163 219 -58 -29 -127 4 181 -164 -112 -289 103 -181 -284 -328 353 -40 -87 -340 117 -47 23
1911B3Pm5J24k04J87k70J45J59k50L18r8K66k49j41M5q8K29l03j6o5j2J43k8J01
$$ 23 30 -15 109 -95 92 -178 -33 126 -124 194 96 362 113 -28 17 -71 158 -145 -161 -226 -238 -95 -123 -22
1935b2l66M3J11J03Q5m0P1k26K36lJ18n3j11J12L11L4j45j83K12j16j71L28j98
$$ -22 -388 -345 -234 -131 -46 -86 -15 -241 -5 -8 110 57 -54 58 369 403 258 75 287 171 0 328 130
1958A30l37K57r4m0L9O1j66j08J64Jo7j18L12q9j35N1L7J01r9L83k02J93j86o3
$$ 130 -207 50 -44 -84 -45 16 -150 -258 -94 -93 -160 -278 34 -55 -190 -139 -102 -1 -100 283 81 274 88 25
1982B5Q1J44o6J5k03J70l05J70J51j69j94K19K1j42o7L74l94j8P6QJ06j86K43
$$ 25 106 250 184 199 -4 166 -139 31 182 13 -181 38 59 -83 -150 224 -170 -188 -112 -104 2 -184 59
2005E9n8j81J13l5K20j50J04J72j40j40J55j32J18j61N6J65r5j47Q8M1K9q6J03
$$ 59 1 -180 -67 -102 118 -32 72 244 104 -36 119 -13 105 -56 0 165 70 -77 11 52 81 -5 98
2028I8k01N9k57J04J12j95K45r8k9k53M79l91L66O3m9j7J56j27J70k42J75r6j69
$$ 98 -103 -44 -301 -197 -85 -280 -35 -133 -162 -415 64 -327 39 102 53 36 192 65 235 -7 168 72 -97
2051i7Q9J7l5L23l27k10K05j4k55P1K59k57J65l2J8k9Rlj35L04r0J81j96M3J73
$$ -97 -8 9 -26 297 -30 -240 -35 -49 -304 -233 26 -231 -66 -98 -80 -109 -100 -103 -238 66 -24 157 -39 4 177
2076A77o5K97n05L79k48K5Q7n5n6Q3J6q0j46J12j3J23m16J25K28j93n4j04L24
$$ 177 112 409 -96 283 35 60 147 92 36 119 135 55 -91 21 8 131 -285 -160 68 -125 -179 -283 41
2099D1k93J49J97j3j81M0M4K33j93J60K39k13J10l08K3L5k7K6j38K77j32K1L3
$$ 41 -252 -103 94 81 -100 -60 -16 217 24 184 423 210 320 12 35 70 43 69 -69 208 76 97 130
2122A30m05L30j61J40l21K71l28K94L9k49J64R1l83M17j8l0R0j67j8j0J85j38
$$ 130 -275 55 -106 34 -287 -16 -344 -50 -11 -260 -96 -5 -388 29 11 -19 71 -96 -114 -124 61 -77
2144g7r8J39j10L23J53k43j19p1K15k35J60r2k18L60O6k68P8pl12L4K90Kj26P3
$$ -77 -175 -36 -146 177 330 87 -32 -103 112 -123 37 -55 -273 87 153 -115 -37 -44 -356 -322 -32 -30 -156 -83
2168h3K88k70L9o7Q7J26oK17l89l5J77K8o9m1J09OJ05l04RN0m59L37j8qJ47p8
$$ -83 205 -65 -26 -93 -6 120 114 331 -58 -93 84 112 43 2 111 117 222 -82 -73 -23 -482 -145 -163 -171 -24 -102
2194a02R4r0n0k13J30K88r4j15L24k31K89j48j46L45j17L1k64J46l2M5j04J61
$$ -102 -8 -98 -148 -361 -231 57 -37 -152 172 -59 230 82 -64 281 164 195 -69 77 45 90 -14 147
2216A47q6o9k50K00k01J66j40L2K31J3M5k84K7Q4J98l37L52p8j27J4m9J77O9j58
$$ 147 61 -8 -258 -58 -259 -93 -233 -201 30 43 88 -196 -169 -85 113 -224 128 50 -77 -63 -112 65 134 -24
2240b4Q8J02p3K29n8l11K0rJ42j8m68K80J19j52K14k23K26k31J37j08O7j06K9
$$ -24 64 166 93 322 264 -47 -27 -36 106 88 -380 -100 19 -133 81 -142 84 -147 -10 -118 -51 -157 -128
2263a28j69K91PJ68n4J07j86J3K28j29K0J57k98o4J15m9R9R1k48O9p5J48j29J90
$$ -128 -297 -6 1 169 115 222 36 49 277 148 168 325 27 -37 78 29 128 219 -29 40 -35 113 -16 174
2287A74j32j57%m3q8J47o6J18K35k53J45m98M90j86K16n9j60R2M9J15k1L4k21
$$ 174 42 -115 -115 -158 -246 -99 -165 -47 188 -65 80 -418 72 -114 102 43 -117 -25 24 139 118 152 -69
2310f9J35J63l89K33L9Q3k28J19j96Jn8L9P1l12K41J74J04l1K01m47L3K49k75
$$ -69 66 229 -160 73 112 195 -33 86 -110 -109 -167 -128 -57 -369 -128 46 150 119 320 -127 -94 155 -120
2333a20K74j97R2N3J45k55K25q5j78k01K20O0M0j59K39pj64l4K3K6k87K49Q5o4
$$ -120 154 -43 49 102 247 -8 217 132 -46 -247 -27 33 73 -86 153 146 -18 -52 -29 -3 -290 -41 44 -20
2357b0k10l8K6J33oJ97j65M2Q9m8N4k8M39l90o6K28l73RJ01J07k1j43J9J42p1
$$ -20 -230 -268 -242 -109 -115 82 -83 -41 48 0 54 26 465 75 9 237 -136 -127 -26 81 60 -83 -64 78 7
2382GJ75j47k18P7j16L55j61k07K2J56M1j50R8m1M04m41J01L93k32j82J62j52
$$ 7 182 35 -183 -106 -222 133 -28 -235 -213 -57 -16 -166 -68 -109 295 -146 -45 348 116 -66 96 -56
2404e6J63J51j70Pj95J0J8Q0l8j40R9j12K3J50o0O6J39n7L0j06N4J60j77K3k1
$$ -56 107 258 88 95 -100 -90 -72 8 -30 -170 -71 -183 -160 -10 -70 -4 135 78 108 2 56 216 39 62 41
2429D1J10j85J30n1j55J01j6M4j0k2M6K92l02l1j17K60j87k01K98j51K27j39m2
$$ 41 151 -34 96 45 -110 -9 -25 19 9 -13 33 325 23 -8 -125 135 -52 -253 45 -106 121 -18 -60
2452f0j31qR0j30K2K79j42O3J48q6k77L50j74n9J16J05m3m17M37M6k90J32M1J7
$$ -60 -191 -199 -109 -239 -217 62 -80 -17 131 45 -232 118 -56 -115 1 106 63 -354 83 129 -161 -29 12 29
2476B9j32M1Qm6Oj15K33j30o3J99L2N3J34j22n0l6l9p3J58k16L93m54L37j42Q0
$$ 29 -103 -62 -54 -100 -94 -209 24 -106 -169 30 62 115 249 127 77 41 2 -71 87 -129 264 -190 147 5 85
2501H5K18j83p7K00n76J90K83l78L80j43M2j14k24J07K09j64K74j97J7j90K41
$$ 85 303 120 43 243 -333 -143 140 -238 142 -1 41 -73 -297 -190 19 -145 129 -68 -51 -241 0
2522@k8nk8j77K48k5oj85K94n9J62Oj3n00K69L7j49L18p6j24Q9p9j06j77L93k19
$$ 0 -28 -33 -61 -238 10 -15 -21 -206 88 29 191 197 184 -316 -47 -10 -159 159 83 -41 48 -31 -137 -314 79 -140
2548a40J76j2l7j49j02O8m9N90k88m9q2J22k41M85j70O9p9J0p5J10J47k85K1J32
$$ -140 36 24 -13 -162 -264 -196 -245 345 57 8 -74 48 -193 292 122 191 112 122 47 157 304 19 40 172
2572A72j86J12R6j07L0j90j19R0j37K08n3j08l9J89j31M8Q8M3q4J18O9j08j40
$$ 172 -14 98 194 87 117 -73 -192 -102 -239 -31 -84 -192 -231 -42 -173 -125 -37 6 -78 40 109 1 -139
2595a39M06k33J89j06j89j03K03M3q7j49K16J19k95J83p6k07K21J82k17l3Q5l14
$$ -139 267 34 223 117 -72 -175 28 71 -16 -165 51 170 -125 58 -18 -225 -4 178 -39 -72 13 -301
2617c01K97Q9j34r6j8K51k03o7J42J07p4K86k55K17r5j19j99J77N9j60j33J30
$$ -301 -4 85 -49 -145 -163 88 -115 -182 -40 67 -7 279 24 241 146 27 -172 5 64 -96 -229 -99
2639i9K38q5J95k81q4j12K79j75Q1P8K4j35j03QJ97J79j3m63M23k9l50O67l93
$$ -99 139 54 249 -32 -116 -228 51 -124 -43 35 59 -76 -179 -171 26 205 192 -271 152 123 -227 440 47
2662D7N2j20o7%k2J68J03j3l41J60j94J21j21L57p8j84M3J51j37q0J22J61j60
$$ 47 99 -21 -88 -88 -110 58 161 148 -193 -33 -227 -106 -227 130 52 -132 -89 62 -75 -155 -33 128 -32
2685c2JJ25r1j74Q1L28q5j63j07K09l2L2j88j17J02J14P8r5r4L25j43k64J54Q2
$$ -32 -31 94 3 -171 -90 238 153 -10 -117 92 60 92 -96 -213 -111 3 81 -14 -108 217 74 -190 -36 46
2709D6j73J54j85J00L2p5R3R6lj21n1k1N0K24J79j38k92J77k95K82Q7Q3k26K2
$$ 46 -127 27 -158 -58 -26 -101 -8 88 85 -36 -87 -108 -58 166 345 207 -85 92 -203 79 166 249 23 45
2733D5k49J03L20k62J21M2J9m95L20o7K42j75j45R4J52m7l97M76Q7k56N2J39K1
$$ 45 -204 -101 219 -43 78 120 139 -356 -36 -103 139 -36 -181 -87 65 18 -379 97 184 -72 -20 119 140
2756A40q3j68K46k4k74M4L48m0q8k58J15O5k3k5J23k38J31r8M2k05K31j54K78
$$ 140 57 -111 135 111 -163 -119 229 189 101 -157 -42 23 0 -25 98 -140 -9 -107 -65 -270 -39 -193 85
2779H5j22m0k8O2J51j72M2k20L08J25k94K14j45N9l6J26K2L9k40%K89K4m24k22
$$ 85 -37 -77 -105 -43 108 -64 -22 -242 66 191 -103 111 -34 25 -11 115 137 176 -64 -64 225 249 -175 -397
2803c97K56L68l01K11p5k23O2K60r8k47J13K69j40j19k1O2J93k15J16j82L58k46
$$ -397 -141 227 -74 137 62 -161 -99 161 63 -184 -71 198 58 -61 -82 -20 173 -42 74 -108 250 4
2825DJ5J2p1J8N2k20J83j79L38N5l15J05p5L0J91k18j9L5k5J15j78J31P3n2O7
$$ 4 19 31 -40 -22 30 -190 -7 -186 152 207 -108 -3 -78 -48 143 -75 -94 -59 -84 31 -147 -16 57 5 72
2850G2J0j52K68k59J04pK7l4p1K91j08lO3p5j64K88k26m9j44K4K12L4j93o5j17
$$ 72 82 -70 198 -61 43 36 63 29 -42 249 141 138 201 126 -38 250 24 -25 -169 -145 67 101 -92 -157 -274
2875b74J15L06J42j19l05M6M2J07J78q4l5j81K90m13N12k00k47J20K75l34K77
$$ -274 -159 147 289 170 -135 -89 -47 60 238 154 119 -62 228 -185 327 127 -120 0 275 -59 218
2896B18l10J05J43l79K31k08J59K57j25k97R2R4m1j4M7R1nj06N7r1K23j19J82
$$ 218 -92 13 156 -223 8 -200 -41 216 91 -206 -114 -20 -61 -75 -28 63 58 -48 9 -82 141 22 204
2919B04j47j07K9QK1q4M2K26J37m79kK32O2j77j01J36R7o9J6j13J21j12J38j04
$$ 204 57 -50 -21 -13 8 -76 -34 192 329 -150 -152 80 142 -35 -136 0 97 28 44 -69 52 -60 78 -26
2943b6p1P7l6K08q3j52QK76ro7n6j45J57p0M8l81K82J90k10K71o3P0j41j3k88
$$ -26 -97 -20 -56 152 69 -83 -75 201 192 125 69 -76 81 11 59 -322 -40 150 -60 211 148 218 77 64 -224
2968b24P7J91K8j52J30L7P4l49J68n0K8J81k31J20j3M9N5k64O7K97l72K49L5q4
$$ -224 -147 44 72 -80 50 87 161 -188 -20 -70 -42 139 -92 28 15 64 119 -145 -78 219 -153 96 131 47
2992D7j8J3R2k28l1M9k01J10rL27k51J27Q1j02L7l66K09K47k43K0M47m57PM8Q9
$$ 47 29 42 134 -94 -125 -76 -277 -167 -176 151 -100 27 108 6 43 -323 -114 133 -110 -90 357 -100 -93 -45 44
3017D4O7j92J11J6n6o6J72n1j68K9J44Q1k33J85k8j81L50k30N3K0l70J45n3K22
$$ 44 111 -81 30 46 -10 -76 96 45 -123 -94 50 131 -102 83 55 -126 224 -6 47 67 -303 -158 -211 11
3041A1J1Q6j61j71M02O2j6l37J04k5J03r9P6L7P0l13N8j7j19K51M0j00J32k17
$$ 11 22 108 -53 -224 178 240 224 -113 -9 -34 69 -30 46 83 153 -160 -102 -119 -238 13 53 -47 85 -132
3065a32j0L49k69p5K04l13J48L13j37k71L8L33k30j10J87L5j03o3L41k02j18J10
$$ -132 -142 207 -62 -137 67 -246 -98 215 78 -193 -155 178 -52 -162 25 60 -43 -106 235 33 -85 25
3087B5l74M45n3M0j40OR8o7m6J39j00R2J49k86l7l3o7J81O1j50J46o1K39j38j02
$$ 25 -349 96 43 83 -57 -51 47 -20 -66 73 -27 65 214 -72 -109 -142 -209 -28 33 -117 29 -32 207 69 -33
3112c3J33j37kj60K51j64L07k62J10k7J91j46j62Q5j96J42K35j35j44j3K45j19
$$ -33 100 -37 -39 -199 52 -112 195 -67 43 16 207 61 -101 -16 -212 -70 165 30 -114 -127 118 -1
3134aL7pr1q6M27l09p4P0K27j85n4j08L60R8p2m51K57J49j23r9k3l01J76j25K53
$$ -1 36 29 -62 -148 279 -30 -104 -34 193 8 -46 -154 206 304 232 -219 38 187 64 -35 -58 -359 -183 -308 -55
3159e5p7K62M3k19J66l30J14K83p7J56Q1o04K08Q2Rk9J6N1q0L4J57j87n9N5l5
$$ -55 -132 130 173 -46 120 -210 -96 187 110 266 347 -257 -49 33 42 13 29 80 0 34 191 4 -55 0 -35
3184c5J22p1j17j2J31j60O2J93k5j40J7J20j47k11L93j97K81k08k0L7J73j78K3
$$ -35 87 16 -101 -113 18 -142 -80 113 88 -52 -35 85 -62 -273 120 -77 204 -4 -24 13 186 8 31
3207C1j12n0J10K73k31M5J10p1j20M1J35l8j95L5R3j23R3N0l52J16P5L05p1j23
$$ 31 -81 -131 -21 252 21 66 176 105 -15 26 161 123 -72 -37 56 -67 26 76 -276 -160 -85 220 149 26
3231B6o9m7J84j12o2kK13k62J2J53O4M04m10r5QJ30j19j8nj28L79m03q8M29l56
$$ 26 -43 -90 94 -18 -80 -82 131 -131 -119 34 98 502 92 -3 5 135 16 -2 -7 -135 244 -159 -247 182 -174
3256a74J10j05L0K99j20l53L78k1N0j8M5k51K86k3j02J28k14N3l4N0N2k24j2K40
$$ -174 -64 -169 -139 160 40 -313 65 44 94 76 121 -130 156 133 31 159 -55 -2 -36 14 66 -158 -170 70
3280G0j65j6K49j23J80L2k70n5k17K43l1O4J96l10Q7J62m6nj93J8n6L10j02k86
$$ 70 -95 -111 138 15 195 227 -43 -98 -315 -72 -103 -39 157 -153 -66 96 50 45 -148 -130 -186 124 22 -264
3304b64L28M8J86p6k30J38j72K20P9j50Q0m2q9l9r4L1J30j79R0j72K77k20L96
$$ -264 64 112 298 222 -8 130 -42 178 257 107 187 145 56 17 -77 -46 84 -95 -5 -177 100 -120 276
3327B76j54j24rm8K65k29K27j18R1j39k02K15oJ22l15J88m39L76L1J89m02J36
$$ 276 122 -2 -11 -59 206 -23 204 86 177 38 -164 51 45 167 -148 40 -399 -23 8 197 -205 -69
3349f9j60M82m5J48m28r3k0n1j4rM98m73J92j03J42j33J98k26J1K50P4k10%j08
$$ -69 -229 253 208 356 -72 -165 -185 -236 -250 -259 239 -234 -42 -145 -3 -136 62 -164 -153 97 171 -39 -39 -147
3373a47J52J48K3j48L7R1j62Q7k76j32L70l9j01J51j40j55K17P9k5p0o1J72j95
$$ -147 5 153 176 28 65 156 -6 81 -195 -327 43 4 -97 54 -86 -241 -24 55 30 -40 -101 71 -124
3396a24P0N6r1M9J43J05j72q3k32J34J78J09r6j17P5j73L5M60m89J66j67R0j73
$$ -124 -54 2 -89 -40 103 208 36 -47 -279 -145 33 142 46 -71 4 -169 -134 326 -163 3 -164 -74 -247
3419b47N02j44j84J39j5P2l60K48o8J09L0k4q9n3Jm5J93R5j13l1Q8R1k7J19n7
$$ -247 255 111 -73 66 51 123 -237 11 -57 52 82 58 -31 -84 -83 -128 65 160 47 16 104 195 168 287 230
3444B30j33j69p0K01J37l55K61l99L44j76K56l23J53n3rm7J16J23k87J64pQ5j19
$$ 230 97 -72 -142 59 196 -159 102 -297 47 -129 127 -196 -43 -96 -105 -152 -36 87 -200 -36 -43 42 -77
3467g7J62r2p7J04j34K92j54K15j11j65J10J54l35N7JM3J31k74K76k68L95m18
$$ -77 85 -7 -84 20 -114 178 24 239 128 -37 73 227 -108 -51 -50 -7 124 -150 126 -142 253 -165
3489a65L84k28j98JK78j14L15l35R2j81n2N77m00o2K41o7j28J35O4l28K3J2J89
$$ -165 219 -9 -207 -206 72 -42 273 -62 30 -151 -203 374 -26 -88 153 86 -42 93 157 -171 -148 -136 53
3512E3L1j50k71L27M6o3k24R2L43k02R5j83l5J61K1k79K75K74l37p5L65k78n6
$$ 53 84 -66 -337 -10 36 -27 -251 -159 184 -18 77 -106 -141 20 41 -238 37 311 -26 -101 264 -14 -70
3535g0Q4J29k46L4J31lJ7j99J96l52j68M41j59l4K52k57L29k16O1n1J4k4j1M68
$$ -70 14 143 -103 -69 62 59 76 -123 73 -279 -447 -6 -165 -199 53 -204 125 -91 -30 -81 -67 -91 -102 366
3559C66n69J73k3L34m66L86j91k70N47k80R0M1j22R4r8p2O7N9j05lj11R9p2qK12
$$ 366 -203 -30 -53 281 -185 201 10 -260 287 7 97 138 16 110 12 -60 7 66 -39 -42 -153 -54 -126 -134 78
3584G8N6l25J8J95l61N06k85K39k74k2K64k24J29j19J50J66k16j97N52k30j45
$$ 78 134 -191 -173 22 -339 167 -118 121 -153 -175 89 -135 -6 -125 25 191 -25 -222 330 100 -45
3605d5J30P4k67J20QM0j17K70k20r0K89j05j23L54k72l4p0j52K4K51j08J47j03
$$ -45 85 159 -108 12 20 60 -57 213 -7 -97 192 87 -36 318 46 12 -58 -210 -186 65 -43 104 1
3628Ak59K39k90N12k91K62k46K50j56K35k55m2j26K55k4j47j47K44Kn3K48k72
$$ 1 -258 -19 -309 203 -88 174 -72 178 22 257 2 -40 -166 89 65 -82 -229 15 17 -36 212 -60
3650f0R3J38l55r4L96k70L4K73j19r8J20r3R7P5j86J8m1R3J7j84J35k25J35L43
$$ -60 33 171 -184 -278 118 -152 -118 155 36 -62 58 -35 62 137 -49 -31 -72 21 38 -146 -11 -236 -101 242
3674B42l49K68k35K46m29K55k20J74K32k59M5j49J15K2J06JJ82l15P9j28J82j09
$$ 242 -107 161 -74 172 -257 -2 -222 -48 184 -75 -30 -179 -64 -42 64 65 247 -68 11 -117 65 -44
3696d4L24m04J49oJ66r7Qo4q2O3J32j81o4K90k0j46k27L96k16j41L49j18l0k7
$$ -44 280 -124 25 19 185 88 96 32 -50 13 145 -36 -100 190 170 24 -203 193 -23 -164 185 67 37 10
3720A0l30N55k76J74J5l38P2J56J72l22J83M0k34J34l0qJ70k13m1q8K82m5kj0
$$ 10 -320 235 -41 133 148 -190 -118 38 210 -112 71 111 -123 11 -19 -27 143 -70 -111 -199 83 38 36 26
3744B6k3p2P0n0j73J37M5K90l44L09j97j39R4j03J41J31k79k1J17J39R6k0p8q6
$$ 26 3 -69 1 -49 -222 -85 -40 250 -94 215 18 -121 -27 -130 11 142 -137 -158 -41 98 194 174 96 10
3768A0N7j2r4O7K8o8O7n0j18k2r9N6J79J33j44K05j62k29K73k56k4J48l1J12J73
$$ 10 67 55 -39 28 56 -12 55 5 -113 -135 -234 -178 1 134 -10 195 33 -196 77 -179 -203 -55 -86 26 199
3793A99m0j92o2j31L13j09rj40J78J41l69K84p4O7l40Q2K37q8o2K75j08j16j7
$$ 199 159 -33 -95 -226 87 -22 -31 -171 7 148 -221 63 -11 56 -284 -202 35 -53 -115 160 52 -64 -81
3816h1R2r4M8nk6R1P4J42j88M5j97M10k80k3J21j57J97k06k0j3N6K8j2L44m72
$$ -81 11 -83 -35 -40 -66 25 99 241 53 98 -99 311 31 8 129 -28 169 -37 -57 -70 -14 14 2 346 -126
3841a26k3J08J94l48J87K6j14j64J62K84k14J74l73l4J01J63o9R8j0j7k3N1Q7
$$ -126 -149 -41 153 -195 -8 18 -96 -260 -98 186 -28 146 -227 -261 -160 3 -66 32 22 5 -18 33 120
3864A20R1m92K68J37P2r4k3J20j03j05Kn6KJ07j38K45p3q6J41kMl13K3K16M7J22
$$ 120 211 -281 -13 124 196 102 79 199 96 -9 -7 -63 -61 46 -92 153 80 -6 135 133 137 -176 -153 63 110 232
3890B32j74k13o7K48j13P9M3J39k34LL05j52j16N1K3j22J10n2k86K36K5J29J71
$$ 232 58 -155 -222 26 -87 -8 35 174 -60 -57 248 96 -20 31 54 -68 42 -10 -296 -60 -35 94 265
3913B65q0R1m12K87j16J07l81L62j7L1k77J32K74k44L8k65J85J74L3j80j02J60
$$ 265 185 276 -136 151 35 142 -239 123 106 137 -140 -8 266 22 60 -205 -20 154 187 7 -95 65
3935F5j16o3N8l8K17l99J79K48po3j17K64m23K93k04J9N7J47o4Q1o8k13J91j23
$$ 65 -51 -114 -56 -94 123 -276 -97 151 144 81 -36 228 -195 98 -106 -87 -30 117 53 134 66 -147 44 -79
3959g9pJ77l96K60K6k05K10J49p2k4O7l53M02j93l19K58KM2J69m56K02O1j26J3
$$ -79 -86 91 -305 -45 -19 -224 -14 135 63 39 106 -247 155 -38 -357 -99 -97 -55 114 -342 -140 -79 -205 -192
3983a92K7L74j43q5N7k9j18J88m8j05J37r1K96l65K65k60K11k8o3j24J33p6N9
$$ -192 -165 209 66 -19 38 9 -109 79 31 -74 63 -28 268 -97 168 -92 119 91 28 -96 37 -39 20
4006B0r4o4N2j07K71k16M08l27LK38k01m4K61k07j26R4o7L75j26k39K33l1M6K09
$$ 20 -74 -138 -86 -193 78 -138 270 -57 -54 184 -17 -61 200 -7 -133 -39 -106 269 143 -96 137 106 152 361
4030C61l16J29j98O4k44R5O0J49l80L25k18K07J07o4R5j72K7k02J61J04M9j11
$$ 361 45 174 -24 40 -204 -109 -49 100 -280 45 -173 34 141 77 172 0 27 -175 -14 90 139 28
4052B8nm0l9n9J76o2P3l40J87J02N1k9k2Pk21J36J40K7p5j99Q3PJ72j69J92k37
$$ 28 23 -17 -56 -115 61 -1 72 -268 -81 21 72 43 21 28 -193 -57 83 110 35 -164 -81 -74 98 -71 121 -116
4078a16P0qK38K9q7K49l90J64q8P6l14L75k10O9O9j60J38n1l4L3j94K71l07J98
$$ -116 -46 -54 184 213 126 375 -15 149 61 137 -177 198 -12 57 126 -34 104 53 19 52 -142 129 -178 20
4102B0J10l29K96j40j70K58r8l1K01l43K93j98J88k11J11J7K07l02J48J12j9K0
$$ 20 130 -199 97 -43 -213 45 -53 -84 117 -226 67 -131 57 -154 -43 -26 181 -121 27 139 120 140
4124A40r9j91J63p2J00j69J58j63J83J14M9k72k8J59j56L16k40K48j28j68p5J44
$$ 140 41 -150 13 -59 41 -128 30 -133 50 164 213 -59 -87 72 -84 232 -8 240 112 -56 -131 13
4146A3k40L45k54J37J17j99p0M4Q0K62k22pj29K43k76K34j7r2K28l64J46O8L1
$$ 13 -227 118 -136 1 118 -81 -151 -107 -27 235 13 6 -123 120 -156 78 61 -31 197 -167 -21 47 78
4169G8R7j41J8J74m00J90j7J32j82P0m9R1Ol1j20J72j65m6K63J0R5j02o3k45J02
$$ 78 175 34 52 226 -174 16 -1 131 -51 19 -30 61 67 36 -84 88 -77 -123 140 150 245 143 80 -165 -63
4194f3J53J6J09k74N4N4j67J57J83l96L29n49K70Q4J14P3Q4j57L8l02K71l25L43
$$ -63 90 106 215 -59 -5 49 -118 39 222 -174 155 -394 -124 -40 74 147 231 74 112 -190 81 -244 99
4217I9O1l62N23o28M52O9l54M9L7K66j76l1r0k77L53R6k26R4k0K3N9j39K62l00
$$ 99 160 -202 321 -307 145 214 -140 -91 -54 212 36 5 -85 -362 -9 87 -139 -45 -65 -42 17 -122 140 -160
4241a60M5R1K60j78j09nK83l04Q7j6J96p6l2j08Q7o2k70L82j11PK19n21N49m20
$$ -160 -115 -24 236 58 -51 -56 227 -77 10 -6 190 114 82 -26 61 -1 -271 111 0 7 226 -295 254 -166
4265a66R8o0L07j43k30J75m4O1k51J42M4J85j98K04j68J20q8Q1J99m42L58m8k12
$$ -166 -68 -128 179 36 -194 -19 -63 -2 -253 -111 -67 118 -80 124 -44 76 -12 69 268 -174 184 136 -76
4288g6M02n51K89J71k33p4K0j02M1J60j46J48Pl06K73k64J31K8P0o6p0J70J24
$$ -76 326 -225 64 235 2 -72 -52 -154 -113 47 -99 49 56 -250 23 -241 -110 -82 -12 -78 -148 22 146
4311A46m9o4J08p0n7K09k45J01j80O1J49j56n1J09q9J84j58J82k04o2R7K1M4o3
$$ 146 97 33 141 71 14 223 -22 79 -101 -40 109 -47 -98 11 -78 106 -52 130 -74 -136 -39 -18 26 -37
4335c7K08j12P3j33Q1p0j81J35k3p5J74L0J5j27j70P2J31K07oj38j0j17p0L60
$$ -37 171 59 132 -1 80 10 -171 -36 -59 -134 40 70 85 -42 -212 -140 -9 198 192 54 44 -73 -143 217
4359B17j57j84PJ02qJ28k3r6mm2K0K28k30o3o1J42J8q9q5K38O0l49K75j6J02o2
$$ 217 60 -124 -117 -15 -23 105 82 -14 -18 -60 -40 188 -42 -105 -166 -24 -6 -95 -180 58 118 -231 44 28 130 68
4385F8j21R9j00p3J73j47K68k67n7J13k26K70L2N1j65M5J13J8j29P4j15K1J45
$$ 68 -53 46 -54 -127 46 -101 167 -100 -157 -44 -270 0 32 83 -82 -37 76 94 -35 39 -76 -55 90
4408I0M8J6k73L23k53k98K17J85j12j28M27m12M43l79K04j11K40n0m47K65k60
$$ 90 138 154 -119 204 -49 -347 -130 55 -57 -185 242 -170 273 -106 98 -13 227 177 -270 -5 -265
4429b65L51m4k44O4K7J82n9q8J61M1p7j88K18k05L7M6k99L30P6J07m6j21K00j85
$$ -265 86 42 -202 -138 -111 71 12 -76 85 126 49 -139 79 -126 -89 -43 -342 -12 64 171 125 4 204 19
4453A9J22j21l2k3P7j50O0J83j65N4L6n9J44M0j68k07Q8J85j14M1J57n1r4l57
$$ 19 141 20 -12 -35 42 -108 -48 135 -30 24 60 1 145 185 17 -190 -102 83 -31 10 167 116 22 -335
4477c35L05Oj51J63K7K19k26j98J41J08l03K5K9J06R4P3r9q3K42n0j17R7j46L80
$$ -335 -30 -24 -175 -12 15 234 8 -190 -49 59 -244 -219 -190 -84 10 83 -16 -99 143 93 -24 73 -73 307
4501C07m48J42N3j95J10J90k20j02Q0k58L70k9J43k37m4L58j31kL4q4k7K4k2J29
$$ 307 -141 1 54 -141 -31 159 -61 -163 -83 -341 29 0 143 -94 -138 220 89 87 121 37 10 34 12 141
4525A41n9r2k30r1K25j19J6J36P7j50J97j79M17l75K25j35J2J58q4j25m2K94j47
$$ 141 82 -10 -240 -331 -106 -225 -209 -73 4 -146 51 -128 289 -86 139 4 16 174 90 -35 -77 217 70
4548G0K7j21n4k24K46n5L87j78m8L8o9k67J30J83k74L33j39r3P5j08j1J28J95
$$ 70 97 -24 -78 -302 -56 -111 276 98 50 88 19 -248 -118 65 -209 124 -15 -108 -33 -141 -152 -24 171
4571A71k87K23k0l5Q5l67L21J5l64K72n9K0J8J7J23j98n6J38J20p2q1k8q3N6J93
$$ 171 -116 107 87 52 137 -230 91 106 -258 14 -45 -25 -7 10 133 -65 -121 17 137 65 -16 -44 -127 -71 122
4596A22k67n6K29K53l82J66J06j98k2j97L87j86K86k30N4j83J80nQ1j81j65J61
$$ 122 -145 -201 28 281 -101 65 171 -27 -49 -246 141 -45 241 11 65 -118 62 57 138 -43 -208 -47
4618d7J66j69J58j59RR2j04k36L40j18P1k20Q5l6J09k5r5L15m33N01k31k42L00
$$ -47 119 -50 108 -51 -42 50 -54 -290 50 -68 3 -217 -132 -168 -59 -84 -179 136 -297 204 -27 -269 31
4641C1l7O4J66j0k42J0R9j78J62j59J87l2j27N0R2P1j53N5J32l51K05J34j94J37
$$ 31 -6 58 224 214 -28 -18 81 -97 65 -94 93 61 -66 -16 76 147 -6 49 181 -170 35 169 -25 112
4665A12nkOp5Pk1m6K91m82K74J64k20J08o8N2R2j89O6j24%Q4Q3M1q6L5l7J72j08
$$ 112 107 105 111 36 43 22 -24 267 -215 59 223 3 111 43 95 187 -2 64 -60 -60 24 107 148 62 97 60 232 124
4693A24m23J29J03P8j9J58j29l69L90r1M4j72L63M9l17M37j91j53J40k00K8o3
$$ 124 -299 -170 -67 11 -8 150 21 -348 42 -49 -5 -177 186 235 -82 355 164 11 151 -49 -21 -84
4715h4K76k16j95L21j1k1q6J0L5K30l67nJ22L23k51j67l0m1K02j56RQ8J37k12
$$ -84 192 -24 -219 102 91 70 -16 -6 29 259 -108 -113 9 332 81 -86 -116 -157 45 -111 -102 -14 123 -89
4739h9R9n6o0P6k19K49N8K31l05j40M25k93L01l67KP2J88k02J2lr8L32n10K60
$$ -89 10 -46 -106 -30 -249 0 58 289 -16 -156 269 -24 277 -90 -88 -16 172 -30 -18 -21 -119 213 -297 -37
4763c7J70j92M9j5k81M98j11l6l0J66l65L31k75K51k2j16k4J56J87q1k99L58k42
$$ -37 133 -59 -10 -25 -306 192 81 45 15 181 -184 147 -128 123 101 -15 -39 117 304 223 -76 282 40
4786D0j41M6n2J50J09j48J46k03J87m6l90L58k05K40p7J79k36M2p1J00K9j18J68
$$ 40 -101 -55 -107 43 152 4 150 -53 134 88 -302 56 -149 91 14 193 -43 -1 -72 28 57 -61 107
4809A07P0k44K00p1j85J0J71J38j90n6J13lp7r9J05J86j84M3o6lq5N3J64k17J63
$$ 107 177 -67 133 62 -123 -113 58 196 6 -50 63 60 -17 -116 -11 175 -9 34 -32 -35 -120 -67 97 -120 43
4834D3J71l06R1Q8j53J45k12P5K17l2j0J16l55J95j54OJj47J03J1M1j07L1L25
$$ 43 214 -92 -1 87 -66 79 -133 -58 159 127 117 233 -122 73 -81 -75 -74 -221 -118 -107 -66 -173 -142 183
4858A83j92J16m1P9j65J35M6r5k89L34O7k02n7J47l18L24l6j3R6Q8k02J21j31
$$ 183 -9 107 66 145 -20 115 161 66 -223 111 178 -24 -81 66 -252 72 36 23 119 207 5 126 -5
4881eo1J7J72l2j45K84j31n7Q4l23J52K74k03J36j56J5L1j74J80n5j61j28K84
$$ -5 -66 -49 123 91 -54 230 99 42 126 -197 -45 229 26 162 6 21 52 -122 58 3 -158 -286 -2
4904bK59l29J54N9Pl10Q9Q1j34R6j4J10M9k58N3%R1j8K53k61l1MJ15l8j46J13
$$ -2 257 -72 82 141 148 -162 -73 8 -126 -30 -44 66 115 -143 -90 -90 1 -17 236 -25 -56 -52 63 25 -121 -8
4930hj18J16j04L47l14J81k6j69L41o9l20J87j35j89K71r4m6KL54n3o1L4k73N8
$$ -8 -126 -10 -114 233 -81 100 74 -95 246 177 -143 44 -91 -280 -9 -103 -149 -147 207 154 93 127 -146 -88
4954h8o5K12J55k41j96K03J42j59kJ04l28J85J74Q5j77Q1k26O5J52n8R5k79J94
$$ -88 -153 59 214 -27 -223 -20 122 -37 -39 65 -263 -78 96 181 4 85 -141 -76 76 18 113 -166 28
4977B8k37J71j35L12k68N1K54j03r7r1K41p0j80j1K26l7j2k0q0qN5M7j6J67nl35
$$ 28 -209 -38 -173 139 -129 -78 176 73 -24 -115 126 56 -124 -135 91 54 42 22 -58 -66 -11 36 20 187 182 -153
5003a53K6o9K8J22m7J26P1R0k45%j3M12l39P0Nj17K1l0J00Q0j77m7N4J69m5l6
$$ -153 -127 -196 -168 -46 -93 33 104 194 -51 -51 -64 348 9 79 84 -33 -12 -42 58 138 -39 -86 -32 137 92 56
5029E6j03N6j92L06k74OJ90k64J28M4r5J43o8O2j69K6K41j09J5J73q5pq3J4N2
$$ 56 -47 9 -183 123 -151 -145 45 -219 -91 -47 -142 1 -67 -5 -174 -148 93 -16 -1 172 87 80 -3 11 63
5054F3j40K8k1OM4Q3j41K3P8k17J11O1n9J66k03K7k3J85p4j26p6M10k89K33j67
$$ 63 -77 -49 -70 -64 -20 63 -78 -55 23 -194 -83 -22 -81 85 -118 -91 -114 71 -3 -129 -205 205 -84 149 -18
5079a8N3P6k54n5L79k50N3J23n5j49r4Q2M5L65m22L30k52j40J33J51j13p7l2K40
$$ -18 35 111 -143 -198 181 -69 -16 107 52 -97 -191 -109 -64 301 -121 209 -43 -183 -50 101 -12 -89 -121 119
5103A19j40j89K86Mo3m1K39l3j61k42L15j02k66P7J05J87J70m48J95j25L9j42
$$ 119 -21 -210 76 80 17 -24 215 182 21 -221 94 -8 -274 -197 -92 95 265 -183 12 -113 -74 -216
5125b16J00O9r8J47K02J35m96j56N46l18q5J12pM9o6O3K8k8J5l3%n7K26Qk90J34
$$ -216 -116 -47 -145 2 204 339 -157 -313 233 -85 -170 -58 -65 -16 -82 -19 9 -19 -4 -37 -37 -94 132 140 -150 -16
5151a6j51L84k62l7O7K33k38l6q1K07O6q2n8O8k16m6O2J27j78M01o3j93pJ40n0
$$ -16 -167 217 -45 -82 -15 218 -20 -56 -137 70 136 54 -4 64 -152 -198 -136 -9 -187 214 151 -42 -49 91 41
5176D1j24K6K9J17j36n2N7m1J08K7j24P9r4p2L22p4m43M53r2j5J59j18J39o4O
$$ 41 -83 -57 -28 89 -47 -99 -42 -83 25 52 -72 7 -87 -159 163 89 -354 99 7 -8 151 33 172 108 114
5201A14k67l8Q3M3J08M3o4p9J78on1j46J9L0J57L1l5j97j41J51J70j18k4J03j27
$$ 114 -153 -191 -108 -65 43 86 22 -57 121 115 64 -82 -63 -33 124 155 120 -77 -218 -67 103 -15 -39 64 -63
5226f3M6j8j6J24q2J74l74L62k36J04m9q8J49P3j35j15K97J38j64l91L00j16K17
$$ -63 -17 -35 -51 73 -9 165 -209 153 -83 21 -28 -116 33 106 -29 -144 153 291 127 -264 36 -80 137
5249A37k86M17l73K63k22J88l76N60k40m0k55J13L84l65p2K54j38J64k09M9J54
$$ 137 -149 268 -105 158 -64 124 -252 308 68 28 -227 -114 270 -95 -167 87 -51 113 -96 -47 107
5270A07lm3O8n7j66K14l7j29K8J40q3Q8k09J23j59K49k61K24q6j52R3j13L74O6
$$ 107 104 61 129 72 -94 120 83 -46 -18 122 39 127 -82 41 -118 131 -130 94 8 -144 -51 -164 210 276
5294B76k69J1p3l7m9K14L60m47K13p2k94J09N2r6Q6n5j93K15j17K72ok33J61M6
$$ 276 7 18 -55 -92 -141 73 433 -14 199 127 -167 -58 -6 -102 -16 -71 -264 -49 -166 106 100 -133 28 74
5318G4k12L12J30j89o3j18K33l0j71J04N5k8j47Q2NK52j89j44j18o2L32q0n3k8
$$ 74 -138 174 304 115 52 -66 167 137 -34 70 125 97 -50 32 37 289 100 -44 -162 -224 108 28 -25 -53
5342e3J14j01P9j64K82j25j29Q9l61L48K08k77L8J76L7l46J66j71J81j22q1K70
$$ -53 61 -40 39 -125 157 32 -97 -8 -369 -21 187 -90 -52 124 161 -185 -19 -190 -9 -131 -212 58
5364E8k71J69Q8k05K79j29J42j95L00j49jk60K60j5M5k32J22J15nk17j71M11k41
$$ 58 -213 -44 44 -161 118 -11 131 -64 236 87 86 -174 86 71 116 -116 6 121 116 -101 -272 139 -102
5387a02L27k89M5K16k57kk7P2Np1j56L22J5k69J68j8K51k45j04K35k44K78j51
$$ -102 225 -64 -19 197 -60 -62 -89 -17 -12 -83 -239 83 98 -171 -3 -21 230 -15 -119 116 -128 150 -1
5410ar5L7J12K05l24r2J01K01j09m4j3J27o1O6j86O6M4n7n4J05q5J32p5L84k82
$$ -1 -96 -59 53 258 -66 -158 -57 144 35 -9 -22 105 44 110 -76 -10 34 -23 -77 28 -57 75 0 384 102
5435A02j20J44m04K72Q6j91Q4M7N1j37M4k26J29L45k37J16k9k50K10L03m32L8
$$ 102 -18 126 -278 -6 80 -111 -27 20 71 -66 -22 -248 -119 226 -11 105 76 -174 36 339 -93 -55
5457e5M93m30j07J21PN4%J29k45j10K35j39j35L63k16k26K81J66j00j5K11k08
$$ -55 438 8 -99 22 29 83 83 212 -33 -143 92 -47 -182 181 -35 -261 20 186 86 71 282 74
5479G4l51J57R4J19l5R1j58j49K92j74J01j71K3R8Q3k39L06n03L20k10J35J11
$$ 74 -277 -120 -26 93 58 149 -9 -158 134 -40 61 -110 -87 11 94 -145 161 -342 -22 -232 -97 14
5501A4m3j87J98m6j86J56K24N0K2k8j65j61J76o6j92J44J39R6j76K61l25J94k60
$$ 14 -29 -216 -18 -64 -250 -94 130 180 202 174 9 -152 24 -42 -234 -90 49 145 -31 230 -95 99 -161
5524a61K40r5j56J43j05J21J1J96j50j77k8qP4QK46m2k4jO2n2j69K01q8o7m6J73
$$ -161 79 -16 -172 -29 -134 -13 -2 194 44 -133 -161 -169 -95 -87 159 117 93 92 154 102 -67 134 46 -21 -67 106
5550A06j04j67J69Q7n2L5k41K66j06R4p1j07p0K36j29J65p9l3n0J95m33K33j17
$$ 106 2 -165 4 91 39 74 -167 99 -7 87 16 -91 -161 75 -54 111 32 -1 -51 144 -289 -56 -173
5573a73K54Q1J15k36K29l15j06L1P3L24j58J7l07M10l47r0L09o0j67J43j32K8
$$ -173 81 162 277 41 270 -45 -151 -120 -47 277 119 136 -171 239 -108 -198 111 51 -116 27 -105 -77
5595g7J20j79P2j27K21k56L71J1r4o3k41K78j06j7N3M8P8k3k77K43r0j17m4K58
$$ -77 43 -136 -64 -191 30 -226 145 156 62 -1 -242 36 -70 -87 -34 14 92 69 -208 35 -55 -172 -216 42
5619D2j24K46l32J57l3J57J3j38M2L3q8K07j07j64R9n3J74l02K14j00J29J14K3
$$ 42 -82 164 -168 -11 -44 113 126 -12 30 63 -25 182 75 -89 10 -43 131 -171 43 -57 72 186 209
5642B09m57K04K46j78j22l8Q8ok3L38l14R4jk8k8l55N45j02J81r6l12K11L7n0
$$ 209 -248 -44 202 24 -98 -136 -48 -54 -77 261 -53 41 40 12 -16 -371 174 72 253 157 -155 56 93 43
5666D3k16K11j6k9J47J02l49K14P1o21K51J41P5J7M2j03m7l3J66m1L9j56J0R9
$$ 43 -173 38 22 -7 140 242 -107 107 178 -443 -192 -51 24 41 83 -20 -67 -100 66 25 64 -92 -82 17
5690A7J70o0qn6k78J73J44j57j74K7L60j96k01J90j0L03k53j07J13k7l4o3J24
$$ 17 187 127 119 63 -215 -42 102 -55 -229 -202 158 -38 -239 -49 -59 244 -9 -116 -3 -30 -64 -127 -3
5713cj0J65l09J07p9L04l25J32k18K13Lj51K73k12J31r0J58P7P8m10M0k7J65j53
$$ -3 -13 152 -157 -50 -129 175 -150 -18 -236 -23 -20 -171 102 -110 21 -69 89 166 244 -166 -126 -153 12 -141
5737a41J98j83L37k19j94R0o6L60k46L12k16k7n7l6J17P1L9l36K72j60M1N7j23
$$ -141 57 -126 211 -8 -202 -112 -178 182 -64 248 32 5 -52 -88 29 100 139 -197 75 -85 -44 13 -110
5760a10J24J11r1j00K46Q3j72N1j34J33K1k7k89K85j60n7K33j1l0mj30R9m3K0
$$ -110 14 125 34 -66 180 263 91 142 8 141 162 135 -154 131 -29 -86 147 136 106 102 -28 71 28 48
5784D8J58n4j65j55R7J22j35R5L3l6n5r7l1K31k75J62RJ1K2j0O1Q2O2j26J1j1
$$ 48 206 152 -13 -168 -71 51 -84 11 44 8 -47 -144 -175 56 -219 -57 -48 -37 -15 -25 36 118 180 54 65 54
5810E4R3J0l34K86j18q1J87j67L1L4J54m1k98j27L54Jj85J33J72k07j28P3K04
$$ 54 147 157 -177 109 -9 -90 97 -70 -39 -5 149 108 -190 -317 37 38 -147 -14 158 -49 -177 -104 100
5833A00J4q0j30L20r9j5k44J38j4k08P9R3J11j77K4K43J03l75J92j23Q4j70K60
$$ 100 114 34 -96 224 125 110 -134 4 -10 -218 -139 -46 65 -112 -88 155 258 -117 75 -48 36 -134 126
5856A26j49l8j0R8m1p8J42k05J80k63K60j7O0Oj17l2J45J02l02J69j36K0N08l99
$$ 126 -23 -61 -71 27 -14 -92 50 -155 25 -238 22 5 65 71 -46 -78 67 169 -133 36 -100 -80 428 29
5880B9j44O0KJ13p9R1j09k85K15J50r9l4M7rJ48j1q4K28m97K86K05k09%N0l8K41
$$ 29 -115 -55 -53 60 -19 72 -37 -322 -107 43 -56 -90 -43 -52 96 85 1 229 -268 18 223 14 14 64 26 267
5906B67j80n9n3j2J20J33l15J12P8j89O0J57o7k42L28j73O9l4J12k79KK51j19
$$ 267 87 28 -25 -37 83 216 -99 13 91 -98 -38 119 52 -190 138 -35 34 0 112 -167 -165 86 -33
5929c3o0R0l7J55k50K50J23l12J07j34L93r3k44J00K76k11J21j48q3j41J25l06
$$ -33 -93 -3 -40 115 -135 115 238 -74 33 -101 292 199 -45 55 331 120 241 93 10 -131 -6 -312
5951c12K99oj03l0K81l2l2k27M50k71p4L2O7J6j04Q7j35o1J54m7j4J65k2Jj49
$$ -312 -13 -19 -122 -152 129 97 65 -162 288 17 -57 -25 42 58 -46 41 -94 -155 -1 -48 -62 103 81 82 -67
5976f7O9j35J40L53l45j50K68l68J96J3J1j45L09j14J75l79J47P5K31k65P3J13
$$ -67 2 -133 7 360 15 -135 133 -235 -39 -26 -15 -160 149 35 210 -169 -22 53 284 19 92 205
5998B05j65j26l4J02j84K14qq9K14m65O7N04m49K93k91K1L5J25O0j58n8K33j02
$$ 205 40 -86 -120 -18 -202 12 4 -85 129 -336 -269 235 -214 79 -212 -191 -156 -31 29 -129 -187 46 -56
6021e6p9M7J36j25j96N34j65r2l1o8%K79k62J70o2j24J25j7n0l4J31Q2j33O3N3
$$ -56 -135 -88 48 -77 -273 261 96 4 -27 -95 -95 184 -78 92 30 -94 31 14 -36 -70 61 143 10 73 126
6046A26K9j03l1j13J96j63L54l76O3J4j11K56j22k63J71J6l2J22R7k29l13L67
$$ 126 155 52 21 -92 104 -59 295 -81 -18 -4 -115 141 19 -244 -73 -57 -89 33 130 -99 -412 -45
6068d5L2J88o4p3J2k00L02pJ0j28M6J0j84L25l18J03J47k34J12nJ43j48l21L36
$$ -45 -13 175 111 38 50 -150 152 145 155 27 73 83 -101 224 -94 9 156 -78 34 29 172 24 -297 39
6092C9m8J4j24n7L41j19j16K40k80K90j27j84K35j75m8J20j34J7L52l52Q7R5p8
$$ 39 -9 5 -119 -176 165 46 -70 170 -110 180 53 -131 104 -71 -119 1 -133 -116 236 -116 -29 66 -12
6115a2j26m5K47k76K31j01J20r4k3j6L55k13l1r4L52k46J5r1q4K04n5o0QJ32m31
$$ -12 -138 -183 64 -212 19 -82 38 -56 -79 -95 260 47 16 -78 274 28 43 -48 -132 72 17 -43 -35 97 -334
6140c34M03j80J64l4o0j95L30p3Lj35jL42j92Nn6k29K53K37l15K92o5l42J69J13
$$ -334 69 -111 53 19 -41 -236 94 21 24 -111 -112 230 38 43 -13 -242 11 248 -67 225 160 -182 -13 100
6164A00o2K9l39K06r3J86L2M6k41L1K81k72P9j68L4K03J43k69J25j12K4J88m9
$$ 100 38 67 -272 -66 -159 27 59 105 -136 -105 176 -96 -17 -185 -151 52 195 -74 51 -61 -37 151 102
6187A02J3m1j34N6mj27K33K1K0j36j1kj26J64k8K6q8q3O2M41l23m7J11r7L6J55
$$ 102 115 74 -60 -4 -8 -135 98 119 139 3 -8 -10 -136 28 0 26 -62 -145 -83 358 35 -12 99 2 38 193
6213A93j05j84j19L78l2j14Q2k02K8k46M94l23j24O8P6K64k57J46L2JM2L3q2R8
$$ 193 88 -96 -215 163 131 17 99 -103 -75 -321 173 -150 -274 -206 -130 134 -123 23 55 56 98 131 49 147
6237A47j30j57K71k3j00k55K94o3p2j77L27J54j94j55K9N7O4j4l26K42P6o9K58
$$ 147 17 -140 131 108 8 -247 47 -16 -88 -265 62 216 22 -133 -104 -47 17 3 -323 -81 -5 -74 184
6260A84n1Rk47l8K54j85J58k63J47P2k28K37N9j41R9J40m74K37k09L69j47L3o4
$$ 184 133 142 -105 -143 111 -74 84 -179 -32 40 -188 49 108 -33 66 206 -268 -31 -240 129 -18 15 -49
6283d9M7K75n80K64R5N2K85n25L3n9L67o3k87L34k60K84j73J7kk41K00K4K39k12
$$ -49 -2 273 -307 -43 52 104 389 -136 -103 -162 205 142 -145 189 -71 213 40 57 55 -186 14 38 277 65
6307F5Q8Nj55j48J50M8o5p1M8k5jk9J70l74J62N2M7j2r2j9Q7Rp5M09l24j44K49
$$ 65 153 158 3 -145 5 53 -12 -83 -35 -60 -61 -90 80 -294 -132 -80 -33 -45 -137 -156 -69 -60 -135 274 -50 -194 55
6334E5j38k0J77m1J35l01l9J59r1Lo0J25J54k11L06j73K03l5n04M56k75K49j98
$$ 55 -83 -103 74 33 168 -133 -172 -13 -104 -101 -161 -36 118 -93 213 40 243 208 -296 160 -115 134 -64
6357f4j75K18o1Nk49K03R9l1J36J48k34Q4j23K00j81K5j32J04K92k82Q8m0Q0R
$$ -64 -239 -21 -82 -77 -326 -123 -24 -55 81 229 -5 79 -44 156 -25 0 -132 -28 264 -18 70 30 110 119
6381A19j04J09k50J84o9k3j4J62Q9k70L45l94O7M3j40J92j7k54L07O9l56LL86
$$ 119 15 124 -126 58 -11 -34 -48 114 203 -67 278 -116 -49 -6 -146 46 29 -225 82 151 -205 -202 184
6404A84p4k6q5J1j14K40k72J24J34j12R6j60on9K37PP1j61k4J03j94q4rJ29K51
$$ 184 110 84 -1 10 -104 136 -136 -12 122 10 106 -54 -60 -119 118 125 196 35 11 114 -80 -164 -173 -44 207
$$ [...]
8191a22
##END NTUPLES=NMR FID
##END=
