##TITLE=1H_Pr Dep-500
 200.13MHz,CDCl3,
 8 sc
 
 8.7.2025
##JCAMPDX= 6.0         $$ Bruker NMR JCAMP-DX V2.0
##DATA TYPE= NMR FID
##DATA CLASS= NTUPLES
##ORIGIN= UXNMR, Bruker Analytische Messtechnik GmbH
##OWNER= pz
$$ XWIN-NMR		Version 3.5
$$ Tue Jul  8 16:23:30 2025 Russian Standard Time (UT+4h)  she@DPX200
##.OBSERVE FREQUENCY= 200.1313
##.OBSERVE NUCLEUS= ^1H
##.DELAY= (6, 6)
##.ACQUISITION MODE= SIMULTANEOUS
##.ACQUISITION SCHEME= undefined
##.AVERAGES= 8
##.DIGITISER RES= 18
##SPECTROMETER/DATA SYSTEM= spect
##.PULSE SEQUENCE= zg30
##.SOLVENT NAME= CDCl3
##.SHIFT REFERENCE= (INTERNAL, CDCl3, 0, 14.3821)
##AUDIT TRAIL= $$ (NUMBER, WHEN, WHO, WHERE, WHAT)
$$ ##TITLE= Audit trail, XWIN-NMR		Version 3.5
$$ ##JCAMPDX= 5.01
$$ ##ORIGIN= Bruker BioSpin GmbH
$$ ##OWNER= she
$$ F:/spectra/data/she/nmr/H-C/1/audita.txt
$$ ##AUDIT TRAIL=  $$ (NUMBER, WHEN, WHO, WHERE, WHAT)
(   1,<2025-07-08 16:22:36.35 +0400>,<she>,<DPX200>,
      <created by zg, POWCHK disabled, PULCHK disabled
       configuration hash MD5:
       00 E9 B6 7A A2 85 ED C7 34 08 36 98 17 FE 4E 26
       data hash MD5: 16K
       91 A1 DF 24 7C 95 33 F9 10 DC 30 84 A3 E9 62 FB>)
$$ ##END=
$$ 
$$ hash MD5
$$ 4C E3 6F 3D E5 02 10 94 5A CF 61 4E CE 88 65 98
##$RELAX= 
##$RELAX= 
##$RELAX= 
##$RELAX= 
##$RELAX= 
##$RELAX= 
$$ Bruker specific parameters
$$ --------------------------
##$DU= <F:/spectra>
##$EXPNO= 1
##$NAME= <H-C>
##$PROCNO= 1
##$TYPE= <nmr>
##$USER= <she>
##$AMP= (0..31)
100 100 100 100 100 100 100 100 100 100 100 100 100 100 100 100 100 100 
100 100 100 100 100 100 100 100 100 100 100 100 100 100 
##$AQSEQ= 0
##$AQ_mod= 1
##$AUNM= <au_zg>
##$AUTOPOS= <>
##$BF1= 200.13
##$BF2= 200.13
##$BF3= 200.13
##$BF4= 200.13
##$BF5= 200.13
##$BF6= 200.13
##$BF7= 200.13
##$BF8= 200.13
##$BYTORDA= 1
##$CFDGTYP= 0
##$CFRGTYP= 5
##$CHEMSTR= <none>
##$CNST= (0..31)
1 1 145 1 1 1 1 1 1 1 1 1 1 1 1 1 1 1 1 1 1 1 1 1 1 1 1 1 1 1 1 1 
##$CPDPRG= <>
##$CPDPRG1= <>
##$CPDPRG2= <>
##$CPDPRG3= <>
##$CPDPRG4= <mlev>
##$CPDPRG5= <mlev>
##$CPDPRG6= <mlev>
##$CPDPRG7= <mlev>
##$CPDPRG8= <mlev>
##$CPDPRGB= <>
##$CPDPRGT= <>
##$D= (0..31)
0 0.7 0 0 0 0 0 0 0 0 0 0.03 0 0 0 0 0 0 0 0 0 0 0 0 0 0 0 0 0 0 0 0 
##$DATE= 1751977355
##$DBL= (0..7)
120 120 120 120 120 120 120 120 
##$DBP= (0..7)
150 150 150 150 150 150 150 150 
##$DBP07= 0
##$DBPNAM0= <>
##$DBPNAM1= <>
##$DBPNAM2= <>
##$DBPNAM3= <>
##$DBPNAM4= <>
##$DBPNAM5= <>
##$DBPNAM6= <>
##$DBPNAM7= <>
##$DBPOAL= (0..7)
0.5 0.5 0.5 0.5 0.5 0.5 0.5 0.5 
##$DBPOFFS= (0..7)
0 0 0 0 0 0 0 0 
##$DE= 6
##$DECBNUC= <off>
##$DECIM= 32
##$DECNUC= <off>
##$DECSTAT= 4
##$DIGMOD= 1
##$DIGTYP= 9
##$DL= (0..7)
0 120 120 120 120 120 120 120 
##$DP= (0..7)
150 150 150 150 150 150 150 150 
##$DP07= 0
##$DPNAME0= <>
##$DPNAME1= <>
##$DPNAME2= <>
##$DPNAME3= <>
##$DPNAME4= <>
##$DPNAME5= <>
##$DPNAME6= <>
##$DPNAME7= <>
##$DPOAL= (0..7)
0.5 0.5 0.5 0.5 0.5 0.5 0.5 0.5 
##$DPOFFS= (0..7)
0 0 0 0 0 0 0 0 
##$DQDMODE= 0
##$DR= 18
##$DS= 0
##$DSLIST= <SSSSSSSSSSSSSSS>
$$ [...]
##$SUBNAM0= <"">
##$SUBNAM1= <"">
##$SUBNAM2= <"">
##$SUBNAM3= <"">
##$SUBNAM4= <"">
##$SUBNAM5= <"">
##$SUBNAM6= <"">
##$SUBNAM7= <"">
##$SUBNAM8= <"">
##$SUBNAM9= <"">
##$SW= 18.0517328524113
##$SWIBOX= (0..15)
0 0 2 0 0 0 0 0 0 0 0 0 0 0 0 0 
##$SW_h= 3612.71676300578
##$TD= 16384
##$TD0= 1
##$TE= 0
##$TE2= 300
##$TE3= 300
##$TEG= 300
##$TL= (0..7)
0 120 120 120 120 120 120 120 
##$TP= (0..7)
150 150 150 150 150 150 150 150 
##$TP07= 0
##$TPNAME0= <>
##$TPNAME1= <>
##$TPNAME2= <>
##$TPNAME3= <>
##$TPNAME4= <>
##$TPNAME5= <>
##$TPNAME6= <>
##$TPNAME7= <>
##$TPOAL= (0..7)
0.5 0.5 0.5 0.5 0.5 0.5 0.5 0.5 
##$TPOFFS= (0..7)
0 0 0 0 0 0 0 0 
##$TUNHIN= 0
##$TUNHOUT= 0
##$TUNXOUT= 0
##$USERA1= <user>
##$USERA2= <user>
##$USERA3= <user>
##$USERA4= <user>
##$USERA5= <user>
##$V9= 5
##$VALIST= <valist>
##$VCLIST= <CCCCCCCCCCCCCCC>
##$VD= 0
##$VDLIST= <DDDDDDDDDDDDDDD>
##$VPLIST= <PPPPPPPPPPPPPPP>
##$VTLIST= <TTTTTTTTTTTTTTT>
##$WBST= 1024
##$WBSW= 4
##$XGAIN= (0..3)
0 0 0 0 
##$XL= 0
##$YL= 0
##$YMAX_a= 84924
##$YMIN_a= -117411
##$ZGOPTNS= <>
##$ZL1= 120
##$ZL2= 120
##$ZL3= 120
##$ZL4= 120
##$ABSF1= 10
##$ABSF2= 0
##$ABSG= 5
##$ABSL= 3
##$ALPHA= 0
##$AQORDER= 0
##$ASSFAC= 0
##$ASSFACI= 0
##$ASSFACX= 0
##$ASSWID= 0
##$AUNMP= <proc_1d>
##$AZFE= 0.1
##$AZFW= 0.1
##$BCFW= 1
##$BC_mod= 2
##$BYTORDP= 1
##$COROFFS= 0
##$CY= -3
##$DATMOD= 1
##$DC= 2
##$DFILT= <>
##$DTYPP= 0
##$F1P= 0
##$F2P= 0
##$FCOR= 0.5
##$FTSIZE= 0
##$FT_mod= 4
##$GAMMA= 1
##$GB= 0.15
##$INTBC= 1
##$INTSCL= 1
##$ISEN= 128
##$LB= 0.25
##$LEV0= 0
##$LPBIN= 0
##$MAXI= 10000
##$MC2= 0
##$MEAN= 0
##$ME_mod= 0
##$MI= 1.114404
##$NCOEF= 0
##$NC_proc= 0
##$NLEV= 6
##$NOISF1= 3.799351
##$NOISF2= 2.8
##$NSP= 1
##$NTH_PI= 0
##$NZP= 0
##$OFFSET= 14.38212
##$PC= 1
##$PHC0= -1205.438
##$PHC1= 20.19247
##$PH_mod= 1
##$PKNL= yes
##$PPARMOD= 0
##$PSCAL= 0
##$PSIGN= 0
##$REVERSE= no
##$SF= 200.129724274929
##$SI= 16384
##$SIGF1= 3
##$SIGF2= 2
##$SINO= 400
##$SIOLD= 16384
##$SREGLST= <1H.CDCl3>
##$SSB= 0
##$STSI= 0
##$STSR= 0
##$SW_p= 3205.1282051282
##$SYMM= 0
##$S_DEV= 0
##$TDeff= 0
##$TDoff= 0
##$TI= <>
##$TILT= no
##$TM1= 0
##$TM2= 0
##$TOPLEV= 0
##$USERP1= <user>
##$USERP2= <user>
##$USERP3= <user>
##$USERP4= <user>
##$USERP5= <user>
##$WDW= 1
##$XDIM= 8192
##$YMAX_p= 0
##$YMIN_p= 0
$$ End of Bruker specific parameters
$$ ---------------------------------
##NTUPLES= NMR FID
##VAR_NAME=  TIME,          FID/REAL,        FID/IMAG
##SYMBOL=    X,             R,               I
##VAR_TYPE=  INDEPENDENT,   DEPENDENT,       DEPENDENT
##VAR_FORM=  AFFN,          ASDF,            ASDF
##VAR_DIM=   8192,          8192,            8192
##UNITS=     SECONDS,       ARBITRARY UNITS, ARBITRARY UNITS
##FACTOR=    0.0002768,     1,               1
##FIRST=     0,             0,               0
##LAST=      2.2672688,     0,               0
##MIN=       0,             -117411,         0
##MAX=       2.2672688,     84924,           0
$$ Real data points
##PAGE= N=1
##DATA TABLE= (X++(R..R)), XYDATA
$$ [...]
1814bL1n6M7K5K2P8k72J90K51l73j8K94J2l59K62m6l11J99k0M1J0m8K33k08J02
$$ -2 29 -27 20 45 67 145 -127 63 314 -59 -77 217 229 -130 132 86 -225 -26 -46 -5 5 -43 190 -18 84
1839H4r5O3r0N6j5M8J46k04k64Q9R1o2L4K26j62N1K19q2n8Q3k92K4j47L36m5l03
$$ 84 -11 52 -38 18 3 51 197 -7 -271 -182 -91 -153 -119 107 -55 -4 215 133 75 158 -134 -110 -257 79 34 -269
1865b69K75r1K32k26K74j12J56l31J79J38j11l48J83Q9r6L40l04J34J35l82K8
$$ -269 6 -85 147 -79 195 83 239 -92 87 225 114 -234 -51 38 -58 282 -22 112 247 -135 -107
1886a07J83j2k30R5kJ29O9J1o2J66p8k08j28K43k08K10J64l85J2M21k1r3j47R1
$$ -107 76 64 -166 -71 -73 56 125 136 74 240 162 -46 -174 69 -139 71 235 -150 -138 283 262 169 22 113
1910A13j37K93l75J72q6M3o3J19k27m1K72N6j21j41p4K84J65m07j16L67r0J70
$$ 113 -24 269 -106 66 -20 23 -40 79 -148 -189 83 139 18 -123 -197 87 252 -155 -271 96 6 176
1932A76l50P2j49J97O0PN7j97j33M60k57k50M00k97K64l3L7n7k09lK44j98J75
$$ 176 -174 -102 -251 -54 6 13 70 -127 -260 200 -57 -307 93 -204 60 27 64 7 -202 -205 39 -159 16
1955A6o0O2Q6K12l92j39L80o8n0K8j52N5m5K05k34NK46k46J62o8k32J97K27j15
$$ 16 -44 18 104 316 -76 -215 165 97 47 75 -77 -22 -67 138 -96 -91 155 -91 71 3 -229 -32 195 80
1979H0L6J8l16Q5J69k76J03J45l27K24L08k29R1M0p1k91N3O1J80j88K97j57Q4
$$ 80 116 134 -182 -97 72 -204 -101 44 -283 -59 249 20 111 151 80 -211 -158 -97 83 -105 192 35 119
2002A19n7q0q1K32k38K24j70p2k36M01K01l15Q3l3J75k93K2P6N8j28J48k03q4
$$ 119 62 -18 -99 133 -105 119 -51 -123 -359 42 243 -72 11 -22 153 -140 -118 -42 16 -112 36 -167 -251
2025b51J63q6J9NK7J06J70o9K5O7j56j5K9J27o1l88L9M00l16J58jq7KL93l84J89
$$ -251 -88 -174 -155 -150 -123 -17 153 84 109 176 20 5 34 161 100 -288 -249 151 -165 -7 -8 -95 -93 300 -84 105
2051A05k17k7K24l8j48J26m8J8J65n3l04Q1K76m11M56n6k74j24K45L52l46o7R7
$$ 105 -112 -139 85 47 -101 25 -23 -5 160 107 -197 -116 160 -251 205 149 -125 -249 -4 348 2 -65 32
2074C2J07K4m9J84j91j76K4J84K91l05k5k79J10K08j68K23K2j58o9O3j97K46j31
$$ 32 139 163 114 298 107 -69 -45 139 430 125 100 -179 -69 139 -29 194 216 58 -11 52 -145 101 -30
2097c0j09K12k32M98m16p1L62j08q9k10K55n2LK45l17N1J28k73O2J99k71J10P1
$$ -30 -139 73 -159 339 -77 -148 214 106 17 -193 62 10 13 258 -59 -8 120 -153 -91 108 -163 -53 18
2120A8Q7j27j25p1N4p4M28J9k02J68k62J09J73j81N3j22j1K74j36m50M28O0n0
$$ 18 105 -22 -147 -218 -164 -238 190 209 7 175 -87 22 195 14 67 -55 -66 208 72 -378 50 110 60
2143F0R1j87K17n5j78k4N8O8j30N1r8K22n8k9o8L62l10RJ48n1j05J21k25q2K20
$$ 60 151 -36 181 126 -52 -76 -18 50 -80 -29 -127 95 37 8 -60 302 -8 1 149 98 -7 114 -111 -193 27
2168B7j74N70m12n9L5j76L64m09O3M3J97j70J31J1P1J12j06K0k28J94L4p0k15
$$ 27 -147 423 11 -48 -13 -189 175 -234 -171 -128 69 -101 30 41 112 224 118 138 -90 104 138 68 -147
2191a47K43j04k0q0J70k3r7R0Q9k80K82j17p6j64M61j83Nk9k19K36M9J4j44j8
$$ -147 96 -8 -28 -108 62 39 -58 32 121 -159 123 6 -70 -234 227 44 49 20 -199 37 86 100 -44 -62
2215f2jo3m4K66n7p6j0K80l19N5K02j67k89J26J57J90j97J19k0O2J37j53p9j86
$$ -62 -63 -126 -170 96 39 -37 -47 233 -86 -31 171 4 -285 -159 -2 188 -9 110 90 152 289 136 57 -129
2239a29K0J66Km52K72K80l77P8j12L35o2k60L74K02m63L25k46J50l10L03k79J98
$$ -129 -109 57 59 -393 -121 159 -218 -140 -252 83 21 -239 135 337 -126 199 -47 103 -207 96 -183 15
2261A5K24j60Ql55L89j32o5L7j05K1R4m9K20k21J45n5L7R3k24J22n7N1j96J07
$$ 15 239 79 87 -268 121 -11 -76 -39 -144 -123 -29 -78 142 -79 66 11 48 141 -83 39 -18 33 -163 -56
2285e6J16j31O3j0J37k06N0K37m73L29m8Q1j29M8j13J08j05LR8k23J51K2qJ02
$$ -56 60 -71 -8 -18 119 -87 -37 200 -273 56 8 89 -40 8 -105 3 -102 -99 -1 -224 -73 -51 -59 43
2309D3JJ8M3j11o1N2q0M1j30J06Q5j01R5J9J28m7j52k43K64K04k35q0j36J84K91
$$ 43 44 62 105 -6 -67 -15 -95 -54 -184 -78 7 -94 1 20 148 101 -51 -294 -30 174 -61 -141 -277 -93 198
2334A98p6k05L5J10k53M1J41j39q5K73j72L64j24j82M0l29K53R5j49j05L70n9
$$ 198 122 -83 -48 62 -191 -150 -9 -148 -233 40 -132 232 108 -74 -34 -363 -110 -15 -164 -269 101 42
2356D2j68J27J54k46o8j04L18l85J73J99j98J67P3j11J2j55pM5M15l54J86l36
$$ 42 -126 1 155 -91 -159 -263 55 -330 -157 42 -156 11 84 -27 -15 -170 -177 -132 283 -71 115 -221
2378b21K64l5Nr0Q4%L7J34l47J09K33r5j26l83L29J87m7j9j70K40q3J07J8k8n12
$$ -221 43 8 13 -77 7 7 44 178 -169 -60 173 78 -48 -431 -102 85 38 19 -151 89 6 113 131 103 -409
2403d09L31P9k43J42J9n2J57J1RM6j00j49N4M93l16Q7l54J82k04J90K41j55O7
$$ -409 -78 1 -242 -100 -81 -133 24 35 44 90 -10 -159 -105 388 72 159 -195 -13 -217 -27 214 59 126
2426A26p8O7j95r5L15k02J09O4j34J21q7J1q1j38J21M3l27L53rr1K00k33qN3M9
$$ 126 48 115 -80 -175 140 -62 47 111 -23 98 11 22 -59 -197 -76 -33 -360 -7 -16 -107 93 -140 -148 -95 -46
2451d6K6N3p5J53J6j73oM9r0n4N4l1NJ35R0k24L00j02l01K15L47l61p5N8J08j81
$$ -46 -20 33 -42 111 127 -46 -52 -3 -93 -147 -93 -124 -119 16 106 -118 182 80 -221 -6 341 -20 -95 -37 71 -110
2477a10K25j53QJ17L9j5o1j36K23m47N29k80J91m3k45J57m0j55L3K59k67O5J31
$$ -110 115 -38 -30 87 126 111 50 -86 137 -310 219 -61 130 87 -158 -1 -41 -196 -163 96 -171 -106 25
2500B5NL8j3j10q1J39q2N8M8J58%m12J28K7j05J67J90j23J39p3Mj80j48L39J76
$$ 25 30 68 55 -55 -136 3 -79 -21 27 185 185 -227 -99 -72 -177 -10 180 57 196 123 127 -53 -201 138 314
2525C14l79K30j81Q1k61J85l34K92K30j25p5j16K76l5q1j93K52j06R6j26J8m9
$$ 314 -65 165 -16 65 -196 -11 -345 -53 177 52 -23 -139 137 102 21 -172 80 -26 70 -56 -38 -87
2547h7J01j6L2N6J02o2p1R9l34J73q2j6L59k82J03J81l62R4q2Q4J10Ppl50J90
$$ -87 14 -2 30 86 188 126 55 154 -180 -7 -89 -105 254 -28 75 256 -106 -12 -94 -10 100 107 100 -250 -60
2572f0K13m5pm02J78o0L8J36k8j38K48j12j83J38O2M2N9j3j38O2ok86J06K38j70
$$ -60 153 108 101 -301 -123 -183 -145 -9 -37 -175 73 -39 -222 -84 -22 20 79 66 -72 -10 -16 -302 -196 42 -128
2597a28j01J58K79l90J26j49M29J25l19l0k54o4L04j06N9K2J07l8l40N63j79j97
$$ -128 -229 -71 208 -182 -56 -205 224 349 30 0 -254 -318 -14 -120 -61 -39 68 30 -310 253 74 -123
2619a23J41O7j60n0L17l42M4L83n16L86j0k40R4J1j34L86k75l7o3Q1Kl0p9k47
$$ -123 18 85 -75 -125 192 -150 -106 277 -239 147 137 -103 -9 2 -132 254 -21 -58 -121 -40 -38 -68 -147 -394
2643c94M16J86l26o5K39N6m69K63J24o0PK48l35K81k10K9j29L95l01n8J12R8j92
$$ -394 22 208 -118 -183 56 112 -357 -94 30 -30 -23 225 -110 171 -39 -10 -139 256 -45 -103 9 107 -85
2666h5K70j62k6J29J04j77k41K99j66L15m10l6J20K63m63L64j21J9j11k4K9j44
$$ -85 185 23 -3 126 230 53 -188 111 -55 260 -150 -186 -66 197 -266 98 -23 -4 -115 -139 -110 -254
2688b54J31K08j75J64j53o1R1K13j51o8M53l66kq2N1OL18n46K74K4l4P1k80j76
$$ -254 -123 85 -90 74 -79 -140 -49 164 13 -55 398 32 30 -52 -1 5 323 -223 51 75 41 112 -168 -344
2712c44L89K73k91KN4j49J07J5Q2k63j9Q4O9J38l41J28K27k07l6j47K04J94k91
$$ -344 45 318 27 29 83 -66 41 56 138 -125 -144 -60 9 147 -194 -66 161 -46 -82 -229 -25 169 -122
2735a22J51KJ28j95J75K9j90N7L8n3LL78n52l92O42J80j01J01m29K85k29J36k90
$$ -122 29 31 159 -36 139 168 -22 35 73 20 23 401 -151 -543 99 279 178 279 -150 135 -94 42 -248
2758b48K72R4k99K83k12J80K2O5j97K43k93r6K61j05k2R3p8j44Q1oJ18J22l52
$$ -248 24 118 -181 102 -110 70 92 157 -40 203 -90 -186 75 -30 -52 41 -37 -181 -100 -106 12 134 -218
2781b18J60P1k6o2M4j32L4J47N1j59k22L82J17j40L1l6k23K13J31j78K61k09r8
$$ -218 -58 13 -13 -75 -31 -163 -129 18 69 -90 -312 70 187 47 78 42 -181 32 163 -15 246 37 -61
2804f1j15N2j08J49PJ25Q3l70K08n4J70J72k51j26M50k69j70K4l1Q4K8N1j27R8
$$ -61 -176 -124 -232 -83 -76 49 132 -238 -30 -84 86 258 7 -119 331 62 -108 -84 -115 -31 -3 48 -79 19
2828A9P0q4o2k1J35m1Q6L3J1j67J60j88Rl0k0J69j9l25M81k64L2J47Nk45j9n8
$$ 19 89 5 -57 -78 57 16 102 135 146 -21 139 -49 -40 -70 -90 79 60 -265 216 -48 -16 131 136 -109 -128 -186
2854a86M37l94o9J79K14j89j28J99l9j94Q3L00n7m9Lm60K23k5O0M6K04j07k2J14
$$ -186 251 -143 -212 -33 181 -8 -136 63 24 -170 -87 213 156 107 110 -350 -127 -152 -92 -46 158 51 29 143
2878A43k45K08j36L5n2O8J1lN4k8p9r6J0K33MP3k34j07J01j72M16l23K18J06k1
$$ 143 -102 106 -30 5 -47 21 32 29 83 55 -24 -120 -110 123 127 200 -34 -141 -40 -212 204 -119 99 205 184
2903A84k75m2j31J35P6M2R9j26M2L00l14R6Nk38K71k14j68K74K72l19K93m5k10
$$ 184 -91 -133 -264 -129 -53 -11 88 -38 4 304 -10 86 91 -147 124 -90 -258 16 288 -31 262 217 7
2926Gl5P5j45j08L48rj36m5k71L50j06J57j72r4M2J08J54k97L10O1q4o9j47N1
$$ 7 -28 47 -98 -206 142 133 -3 -48 -319 31 -75 82 -90 -184 -142 -34 120 -177 133 194 110 41 -106 -55
2950e5J65j38j19J61R8k09r6J44R0k66L06q1j62Q5K65l91J90R3q1r4l5R7K00l65
$$ -55 110 -28 -147 14 112 -97 -193 -49 41 -225 81 0 -162 -77 188 -203 -13 80 -1 -95 -130 -33 167 -198
2974a98K50j66K44k84P0K7o7K60M5m1k76J35k68L56j71Q6J41q1J11r4o6j89Q5
$$ -198 52 -114 130 -154 -84 -57 -124 136 181 140 -136 -1 -269 87 -84 2 143 62 173 79 13 -176 -91
2997i1J25K2O9k96L77j11k3q6K6N1J85j98j84K46j18N0j36J29l6l42M6J56M1K63
$$ -91 34 56 125 -171 206 95 72 -14 12 63 248 50 -134 112 -6 44 -92 37 1 -341 -295 -139 -98 165
3021A65m56J48M14m00K68Q6p1k01Q0L42l60q4N4q2q2%J44J67j32P1j94N38m02
$$ 165 -291 -143 271 -129 139 225 154 -47 33 375 15 -69 -15 -97 -179 -179 -35 132 0 71 -123 415 13
3044A3p2J30k80J19N2n8N5K32j8l35J37K9J07K05m92N5j33K53j61J9L35J02m10
$$ 13 -59 71 -209 -90 -38 -96 -41 191 173 -162 -25 4 111 316 -176 -121 -254 -1 -162 -143 192 294 -116
3067a16RM4j9j45K88K18k13j30K85l35L34k89J69k40l9N3K64j70q6M32k48k03
$$ -116 -107 -63 -82 -227 61 279 66 -64 221 -114 220 -69 100 -140 -179 -126 138 -32 -118 314 66 -137
3089a37J16n9K20j8r2j38J08k13P3J78O3k08r0L26k5J78J36p54M67m49K12L40
$$ -137 -21 -80 140 122 30 -108 0 -213 -140 38 101 -107 -197 129 104 282 418 -336 131 -318 -106 234
3111B34j05P5l4l62K86l0k2n6o3J56qJ80k41m2K40k04r8O4L5J18j56l7P4J87l73
$$ 234 129 204 170 -192 94 64 42 -14 -77 79 71 251 10 -32 208 4 -94 -30 5 123 -33 -70 4 191 -182
3136a82O9o6J63k94O64l25j49M16l20q4n0K27j49q5K05P7j43K55l66L39j82m7
$$ -182 -113 -179 -16 -310 354 29 -120 296 -24 -108 -158 69 -80 -165 40 117 -26 229 -137 202 20 -27
3158b7K48m1m1K3j54j51K50J18j56k48K76j58R9m9Q5k54K3J76k4J69k82j66K99
$$ -27 221 180 139 162 8 -143 107 225 69 -179 97 -61 38 -11 74 -180 -157 19 -5 164 -118 -284 15
3181A5q7J92k82P3K53k19K70j34j24N2j2K7j15K48r9k58J08k4L53k84J64j24K80
$$ 15 -72 120 -162 -89 164 -55 215 81 -43 9 -3 24 -91 157 58 -200 -92 -116 237 -47 117 -7 273
3204B73k51q5P2O4j74K8k0J99p2m5J25l57P1j3L01j04J14j15L34k07o9r8J49J21
$$ 273 22 -63 9 73 -101 -73 -93 106 34 -11 114 -243 -172 -185 116 12 126 11 345 138 69 -29 120 241
3228B41m3n03M71k74j07J53J88j06q3j37K84k86L8P8K02j40J37l54J67p7M22k86
$$ 241 198 -305 166 -108 -215 -62 126 20 -63 -200 84 -202 -164 -86 116 -24 113 -241 -74 -151 271 -15
3250a5J01o5j81J06O4j53K99k45L98o6k73J9j03L0k3J35l6R9QO0l91K52m9m8j11
$$ -15 86 21 -160 -54 10 -143 156 -89 309 243 -30 -11 -114 -84 -107 28 -8 91 99 159 -232 20 -29 -77 -188
3275a88oK23k88R0P3J7K7J07L3n7k8l0k11o8N11k95J10j21m2O4J46j40Q4R9J72
$$ -188 -194 29 -259 -169 -96 -79 -52 55 88 31 3 -27 -238 -306 205 -90 20 -101 -143 -79 67 -73 11 110 282
3300B82m13j03J37k7J82j36j35K65l1M4nk64N4J76k14K10k02K3K24o6K50k53R2
$$ 282 -131 -234 -97 -124 58 -78 -213 52 21 65 60 -204 -150 26 -188 22 -180 -157 67 1 251 -2 90
3323I0j63J10jk09M05n8m1o6j3N7pj09N2j55K48n8j60J59p3j70M3J03J28J46q1
$$ 90 -73 37 36 -173 232 174 133 67 54 111 104 -5 47 -108 140 82 -78 81 8 -162 -119 -16 112 258 177
3348A77j21k88J05J11J87l26J47N1J28j84o1J10j34K09j91j9K7o4j5M5K99j50
$$ 177 56 -232 -127 -16 171 -155 -8 43 171 -13 -74 36 -98 111 -80 -99 -72 -136 -151 -106 193 43
3370D3N9p2l37L21J59l58K67j07O2J19l87J74K56l18J83J8l62L24O1k02J92j82
$$ 43 102 30 -307 14 173 -185 82 -25 37 156 -231 -57 199 -119 64 82 -280 44 105 -97 95 -87
3392h7J30l43L43o7r3p8K56M7p3O5l9O3K0j89j3j63L17j42J99j62P4Lj83l0kJ86
$$ -87 43 -300 43 -24 -117 -195 61 108 35 100 61 124 144 -45 -58 -221 96 -46 153 -9 65 68 -115 -145 -147 39
3418C9r9J47j83j3L13j86Pj90K02j47L3O5j20M63l03m4J18j79oM8m2L71j45j43
$$ 39 -60 87 -96 -109 204 18 25 -165 37 -110 -77 -12 -132 331 28 -16 102 -77 -83 -35 -77 294 149 6
3442FO8J69l83J37j33K10k27L10M8m24K65J37k52k3L45l24l7Q5J04j58J1j74k2
$$ 6 74 243 -140 -3 -136 74 -153 157 205 -219 46 183 -69 -92 253 -71 -108 -23 81 -77 -66 -240 -262
3465b62P5L85j35j34Kn4j49K65N4J72l28J07J97m5n51N10Ojo8n9J09j73J14k02
$$ -262 -187 198 63 -71 -69 -123 -272 -7 47 219 -109 -2 195 150 -401 109 115 114 46 -13 96 -77 37 -165
3489a65K24j38q5J43K5J16q1l2j9j9Q5J45j20q6Q7k69K74K01m07N1L26q3k13M45
$$ -165 59 -79 -164 -21 4 120 39 7 -12 -31 54 199 79 -7 80 -189 85 286 -121 -70 256 173 -40 405
3513D05n12L9N9J07M2p2L2j34Q5qP7k18p2K54P0k57J29M2N7j53p9M45j90j42Q
$$ 405 -107 -68 -9 98 140 68 100 -34 51 43 120 -98 -170 84 154 -103 26 68 125 -28 -107 338 148 6 14
3538A4K35l07j34L94m15L41K04k86J53k32K8Q9j6J09j34j77K04k63J22Q3k07L15
$$ 14 249 -58 -192 202 -213 128 332 46 199 -33 -5 84 68 177 43 -134 70 -193 -71 12 -195 120
3560A20j6j26K04k88jL0K57l18L42j20k35K53p5o3p2P7K62l7rJ55k35J47m7l10
$$ 120 104 -22 182 -106 -107 -77 180 -138 204 84 -151 102 27 -36 -108 -31 231 194 185 340 105 252 205 -105
3584a05K11k03K03r7J5k71K82P3k1P6q8k16L62j38J9L4m9m03M30m9k10L35Q7n57
$$ -105 106 -97 106 9 24 -247 35 108 87 163 75 -141 221 83 102 136 87 -316 114 65 -145 190 277 -280
3608b80K94j12K47K1nk96Q4K33Qm10K14k75l8M68k35K2l5j3M7nk02L81Q0m83K39
$$ -280 14 -98 149 170 165 -131 -47 186 194 -216 -2 -277 -315 153 -82 -60 -95 -108 -61 -66 -268 113 193 -290 -51
3633e1J40j20r7P3p7o7p0J85k13R1q8K70j13k06L62R5n2k47R5J70k4M3j73RR9
$$ -51 89 -31 -128 -55 -132 -199 -269 -84 -297 -206 -294 -24 -137 -343 19 114 62 -185 -90 80 56 99 -74 -65 34
3658C4j53J8K78r6J41k36J93l8m29M14k63J0L57l95K80j10j38K14K61n09J55j68
$$ 34 -119 -101 177 81 222 -14 179 141 -288 126 -137 -127 230 -165 115 5 -133 81 342 -167 -12 -180
3680a80J34O0k33L86j20Rk70L41q0N2j49R7m7L6j1J75k93J89j99L9N5j87K49k93
$$ -180 -46 14 -219 167 47 56 -214 127 47 99 -50 47 0 36 25 200 -93 96 -103 -64 -9 -196 53 -240
3704b40J75l6K08j39J8K09j27N6k46n8L45k18P8j60l2M31m69J61J59j84L7O2m6
$$ -240 -65 -101 107 -32 -14 195 68 124 -122 -180 165 -53 25 -135 -167 264 -205 -44 115 -69 -32 30 -16
3727a6J35K17m27J52J7j40K05j1j41k1J54K9j16L4o9L02l03R2j34Q6R6l07J77
$$ -16 119 336 -91 61 78 -62 143 132 -9 -30 124 153 37 71 2 304 1 93 -41 45 141 -166 11
3750A1k4O4JO5j97j39JK38qq8J02j25J26j05k53L55N4L8J2j29K2n4J35q1K51l71
$$ 11 -13 51 52 117 -80 -219 -218 20 12 -76 26 -99 27 -78 -331 24 78 116 128 -1 21 -33 102 21 272 -99
3776i9J26N2j10p0J91p5j85J63k4j60m9J07K20j94J49j6P6j09j38K34k0J5J62
$$ -99 27 79 -31 -101 90 15 -170 -7 -31 -191 -240 -133 87 -107 42 26 102 -7 -145 89 69 84 246
3799B46n9j24k69M27k04l3j49L32j11n7%K2j36J55j16M16l68k09M50m30J41J66
$$ 246 187 63 -206 221 17 -16 -165 167 56 -1 -1 21 -115 40 -76 340 -28 -237 213 -217 -76 90
3821I0l08L06j83J98Qn%J36j92Q6m13K45J25j51m1L00k6k94J2l0J15Q6k30J55
$$ 90 -218 88 -95 103 111 106 106 242 50 136 -277 -32 93 -58 -99 201 175 -119 -107 -137 -22 64 -166 -11
3845a1M6l38O4N17j80k04j23J95J70j56K22N5k29o2pL31m24R5J6K6J1J89j39J67
$$ -11 35 -303 -239 278 98 -106 -229 -34 136 -20 202 257 28 -34 -41 290 -134 -39 -23 3 14 203 64 231
3869B31k54p7j18L58n07M45j76L5p4J30K45j68l5R9k95K04j48l8L44j6j6pj25
$$ 231 -23 -100 -218 140 -367 78 -98 -63 -137 -7 238 70 35 134 -161 43 -105 -143 201 185 169 162 37
3892C7k06r2L9L39o4o2l2K7O6J9q3Q0K27o01L14j58L22r2j43k7N4j24R0k77M15
$$ 37 -169 -261 -222 117 53 -9 -41 -14 52 71 -12 68 295 -306 8 -150 172 80 -63 -90 -36 -160 -70 -347 68
3917F8k28L49r1k10l1J25l5P8J85m1j56k3j53L15j69J01R5m85N19j48j3n9k2k32
$$ 68 -160 189 98 -112 -143 -18 -53 25 210 169 13 -10 -163 152 -17 84 179 -306 213 65 52 -7 -29 -261
3941b61K79r3o8J29L17k65J11k50j18K80K4j95J79P2j64k98M01K0j2j8K11l96
$$ -261 18 -75 -143 -14 303 38 149 -101 -219 61 85 -110 69 141 -23 -321 80 100 88 70 281 -115
3963a15R9L4R8q4k74N48k3j81J1M8m46J87JQ8o3j10J67M3K3K0l44M02k65QJ24
$$ -115 -16 18 116 32 -242 306 283 102 113 161 -285 -98 -97 -9 -72 -182 -15 28 51 71 -273 129 -136 -128 -4
3988dK30k40r5J17J83l22Q0L69l60n4J70k17Q8J37j99K26j11j23M5o7p7J46j43
$$ -4 226 -14 -109 8 191 -131 -51 318 -42 -96 74 -143 -55 82 -117 109 -2 -125 -80 -147 -224 -78 -221
4011b21O6J66J35j24J26k07P3K2j38J40K06k05j37JL1m7K73k77J74j79K58J04
$$ -221 -155 11 146 22 148 -59 14 36 -102 38 244 39 -98 -97 -66 -113 160 -117 57 -122 136 240
4033B40j82M5l90K62k93M90k05j00L5K02j31P7l9j43j9N73n27LO5J25Q1j11k31
$$ 240 58 103 -287 -25 -318 172 -33 -133 -98 104 -27 50 11 -132 -151 422 -105 -102 -37 88 169 58 -173
4056a73J03K19o1l86N15m54K46l9J05n5j61J75o8J24P8j92n9J04j28Q3j0K70j58
$$ -173 -70 149 88 -298 217 -237 9 -30 75 20 -141 34 -34 90 168 -24 -83 21 -107 -24 -34 236 78
4079G8R8j62p0Q8K7krj6N6N7k18PM2j10K18k37R5k4K96k21mj38J60R3j65O9O7
$$ 78 176 14 -56 32 59 57 48 32 88 145 -73 -66 -24 -134 84 -153 -58 -82 214 -7 -11 -149 11 104 -61 8 75
4106G5j80j75L91l75K25K21j50n5r8J21J19l15K33k5LJ60j73K3k52J37M11k94
$$ 75 -105 -280 111 -264 -39 182 32 -23 -121 0 119 -196 37 12 15 175 2 25 -227 -90 321 27
4128B7j12J82J5j87Q9j24O4O6p2%j62K93j98M2N0j29J16J82k79P4P9p8J7N5j0
$$ 27 -85 97 112 -75 14 -110 -46 20 -52 -52 -214 79 -119 -77 -27 -156 -40 142 -137 -63 16 -62 -45 10 0
4153@j4J87k53N3q0J0L45m48J92q1OJ39Lj53l1Q3K12Oj37j61L07J05l33j10L79
$$ 0 -14 173 -80 -27 -107 -97 248 -200 -8 -89 -83 56 59 -94 -125 -42 170 176 39 -122 185 290 -43 -153 226
4178B26m54K52j15OJ08j40K9L10p9k01p3OR9q2P2J2K8k33J57K91j27j96k3O1J65
$$ 226 -228 24 -91 -85 23 -117 -88 222 143 -58 -131 -125 -26 -108 -36 -24 4 -229 -72 219 92 -104 -127 -66 99
4203I9j91K30m6r1n9L10l31k19K26J35l13K17j46J68l1L2J80l50O47o69L08j79
$$ 99 -92 138 92 1 -58 252 -79 -298 -72 63 -250 -33 -179 -11 -42 -10 170 -180 467 -202 106 -73
4225g3L24j83O1k45L44j55o4J64k36j04J69k21P2L47L7k75MJ79j86L6O6J43j24
$$ -73 251 68 129 -116 228 73 9 173 -63 -167 2 -219 -147 200 237 -38 -34 145 -41 -5 61 204 80
4248H0o5r4po0J39O0k09R8M35m82K39r5m7l24L71J97n5l03J5J18q8Lj28R5l8K22
$$ 80 15 -79 -86 -146 -7 53 -156 -58 377 -105 134 39 -8 -332 39 236 181 -122 -107 11 -77 -74 -202 -107 -145 77
4274G7Ok91M97l19N4K14k37J18%j05k08K0M89j52l7K6m5J23k59j28M51l10K70
$$ 77 83 -208 289 -30 24 238 1 119 119 14 -194 -174 315 163 126 152 107 230 -29 -157 294 -16 254
4297B54k37q4j55L87J10k20j72K43k29J37k3J30j48k48K14p2R7J02k62J66O3j5
$$ 254 17 -67 -222 165 275 55 -117 126 -103 34 11 141 -7 -255 -41 -113 -16 86 -176 -10 53 38
4319C8k16L3J12k77K94p0J35j68M07l93j54L98j22Q8j05n5K7J15k94J86J4j36
$$ 38 -178 -145 -33 -310 -16 -86 49 -119 288 -105 -259 139 17 105 0 -55 -28 87 -207 -21 -7 -143
4341a43L42l48K17j20QJ30mo1J72k95J37r6N03l53j71J83kM6l53J91m6M7m4j35
$$ -143 199 -149 68 -52 -44 86 82 21 193 -102 35 -61 442 89 -82 101 99 145 -208 -17 -63 -16 -60 -195
4365a95K90qj87K04j97Q1p6P6J05k48J01J52kM3m6N2J76j85q4J93m81J08R5M13
$$ -195 95 87 -100 104 -93 -12 -88 -12 93 -155 -54 98 96 139 93 145 321 136 52 245 -236 -128 -33 380
4389C80m18j01K25j21j60K03j32j62L28q9Rl7l3n0J30L07m55k11R0L39j8j08o1
$$ 380 -38 -139 86 -35 -195 8 -124 -286 42 -47 -38 -75 -108 -158 -28 279 -176 -387 -297 42 24 -84 -145
4412a45J94q9j07K22o1k92R1K12J36R0l43J26K14l06K07j4q5l12O66n07L42j77
$$ -145 49 -40 -147 75 14 -278 -187 25 161 251 -92 34 248 -58 149 135 50 -262 404 -103 239 62
4434F2j86J7J61O1m74K53L15m01RJ77L3j66N17j34j55P3j77J02j28J02J71om18
$$ 62 -124 -107 54 115 -359 -106 209 -192 -183 -6 27 -139 378 244 89 162 -15 87 -41 61 232 226 -192
4457a92M91j28l73J28K0O6r0K85j77l4K6j33J49jJ37k45J34R6l02J59q9j29K56
$$ -192 299 171 -202 -74 -54 12 -78 207 30 -4 22 -111 38 37 174 -71 63 159 -143 16 -73 -202 54
4480E4J08K5j55J49NJ6k4j99m5l1J74j32M5j56J08N1j34J15J52J97o73K82J10
$$ 54 162 187 32 181 186 202 178 -21 -66 -97 77 -55 -10 -166 -58 -7 -141 -26 126 323 -350 -68 42
4503D2l13J44J56K37j86j01Q7j07P2K27j16l60M65j72K7k26J66j48L52j30k3j98
$$ 42 -271 -127 29 266 80 -21 66 -41 31 258 142 -218 247 75 102 -124 42 -106 246 116 93 -105
4525a05j06N37m74J76n9J79k96J35k50M30k28o1K03p6J24j17L9J40l62L17k95
$$ -105 -211 326 -148 28 -31 148 -148 -13 -263 167 -61 -122 81 5 129 12 51 191 -171 146 -149
4546a49M86m66j40L55p5N2P1j50K8j34j2J74j65R8K01k97L30l00M1k17K25J30
$$ -149 337 -129 -269 86 11 63 134 -16 12 -122 -134 40 -125 -27 174 -123 207 -93 -52 -269 -44 86
4568H6j97j9K15Nj95M35o13L53J9q6l6j14L33q0l18m3K94j80J20K05l1k67j40
$$ 86 -111 -130 85 90 -105 330 -283 70 89 3 -33 -147 186 106 -212 -255 39 -141 -21 184 153 -114 -254
4591b54M55Q9n02M1J40j5N8l4m5K47k8k0q4M0J4j40L4K3R1j09K9J7j58N2J35q3
$$ -254 201 290 -212 -171 -31 -46 12 -22 -67 180 152 132 48 88 102 -38 -4 19 110 1 30 47 -111 -59 76 -7
4617gJ05J32j31l86O83q12L05L23j59Q5k23j32Q9K43J90l79J06q1k0M6J60l15
$$ -7 98 230 99 -287 396 -416 -111 212 53 138 -85 -217 -128 115 305 -74 32 -49 -69 -23 137 -178
4639a78J04N0m2M0m9K7K31k68P3r1J0N0L4k06K27o1o0N2P5J65l45J72k71L76K9
$$ -178 -74 -24 -66 -26 -75 -48 183 -85 -12 -103 -93 -43 -9 -215 12 -49 -109 -57 18 183 -162 10 -261 115 144
4664A44j33j04M9j96N26l51K19l61L33l5k10m4J79p7NK94k99P7j70k1J94L27o05
$$ 144 11 -93 -44 -240 286 -65 154 -207 126 91 -119 -163 16 -61 -56 238 -61 16 -154 -175 19 346 -259
4687b59K88n6o9M25j78q8j44J08j71K42j39j46R5K36j89p0q7K90j30Rm2J61j51
$$ -259 29 -27 -96 329 151 63 -81 27 -144 98 -41 -187 -92 144 -45 -115 -202 88 -42 -33 -75 86 -65
4710f5r9J36R7k14M4J24j78M85q5m22L95k55m4L10j69j61l4J60j07P5P6N0j47
$$ -65 -164 -28 69 -145 -101 23 -155 330 245 -177 218 -37 -81 229 60 -101 -135 25 -82 -7 69 119 -28
4733b8M5J22k76K58m64L52K2L1q4j12L10k49J18q7O1N9j35q3m8j72L35k11M13
$$ -28 17 139 -137 121 -343 9 31 62 -22 -134 176 -73 45 -42 19 78 -57 -140 -188 -360 -25 -236 177
4756A77j32l71J81K17j90M31k64K87m38kK54j01j99L25l99L84J43l91pK64%l48
$$ 177 45 -326 -145 72 -118 313 49 336 -102 -104 150 49 -150 175 -224 160 303 -88 -95 169 169 -179
4778a79O9J80rl15J96K60m23L56j30N2j77K33k20K10p1J26k57J63N0p7j35J04
$$ -179 -110 70 61 -254 -58 202 -221 135 5 57 -120 113 -107 103 32 158 -99 64 114 37 -98 6
4800Fj98KK47r9J35j03M3J58j12j0J4L3Oj52j00J07J48K07k7k09Q9j34j58J93
$$ 6 -192 -190 57 -42 93 -10 33 191 79 69 83 116 122 -30 -130 -23 125 332 305 96 185 51 -107 86
4824H6J39n57L98r5J18J4j82M9r9L53k82O0N5j72Q4q0L00j71k36J28q7M53m54
$$ 86 225 -332 66 -29 89 103 -79 -30 -129 224 -58 2 57 -115 -31 -111 189 18 -218 -90 -177 276 -178
4847a78N00n5k67K54j60Jr6n1L25j94j79p2K8K60k01K22j51J87j26L7l0K09l68
$$ -178 322 267 0 254 94 95 -1 -52 273 79 -100 -172 -144 116 -85 137 -14 173 47 84 54 263 -105
4870a05L5k25M14j52O0k0L7J37q3o9j07j02m9J66j76M5N6l2K12n2P3J78rl28K30
$$ -105 -70 -295 119 -33 27 7 44 181 98 29 -78 -180 -229 -63 -239 -194 -138 -170 42 -10 63 241 232 -96 134
4895A34j08j08K4J06l23K04O2K7q4n6M9j4j9K02j78m5j0K2J54K1L8j26P4J40j02
$$ 134 26 -82 -58 48 -275 -71 -9 18 -66 -122 -73 -87 -106 96 -82 -127 -137 -115 39 60 98 -28 46 186 84
4920H4J8q4j18k44L49j09k1L9J71k40J02j64K50J73Ml28P5n1J18J50j30k02K55
$$ 84 102 18 -100 -344 5 -104 -125 -86 85 -155 -53 -217 33 206 210 -118 -43 -94 24 174 44 -158 97
4943I7k38P8q9R2j6k3L58j00p8j41J11p7K4m4K81o2j09O7k27J53j53J36k71P0
$$ 97 -141 -63 -152 -60 -76 -99 259 159 81 -60 51 -26 -2 -46 235 173 64 131 -96 57 -96 40 -231 -161
4967a61J76n8k25L37J48l95K62j27J49p4j99r4L69k65L08l71M67j54P8n02O03
$$ -161 15 -43 -268 69 217 -178 84 -43 106 32 -167 -261 108 -157 151 -220 247 93 171 -331 272
4988B72j70L4k68L28j09l37N9k3K03n1P9Rk13K68J82k07j44Q7j33J57j53K29j07
$$ 272 102 136 -132 196 87 -250 -191 -214 -11 -62 17 26 -187 81 263 56 -88 -1 -134 23 -130 99 -8
5011hk6j85L85j92j41J67p0N3o5K02J06l44L17o04O09k47J34k76Q1J38j92K35
$$ -8 -34 -219 166 -26 -167 0 -70 -17 -82 120 226 -118 199 -405 204 -43 91 -185 -104 34 -158 77
5033G7j40N5k79N39m41K08n35O58j68j03L05j46K03j20j77pj79L91k5k51M09k99
$$ 77 -63 -8 -287 252 -189 19 -516 142 -26 -129 176 30 233 113 -64 -71 -250 141 116 -135 274 -25
5055b5k61M55k23J98j95N7J4K2q9K62k28K13l17j14K30j23K13j99Q1J87j78j36
$$ -25 -286 169 -54 144 -51 6 20 42 -47 215 -13 200 -117 -231 -1 -124 89 -110 -29 158 -20 -156
5077a56O5j5q9N6K99m64L23J12j02O5k53K47Qj73L7J03k07K02K0k21M51l40K02
$$ -156 -91 -106 -195 -139 160 -304 19 131 29 94 -159 88 96 -77 -40 63 -144 58 78 -143 308 -32 170
5100A70j65k65K30M9j2j77J35J43l7j79O9J7q6q4P7K79k24M78m65j58J82K45k11
$$ 170 5 -260 -30 19 7 -170 -35 108 71 -108 -39 -22 -108 -192 -115 164 -60 418 -47 -205 -23 222 11
5123A1K02j13k51J88l31J91J37k73L66j22Pj8n3O7J19p5l02M04k62J99j06J49
$$ 11 213 100 -151 37 -294 -103 34 -239 127 5 12 -6 -59 8 127 52 -250 154 -108 91 -15 134
5145A34j66J16j94O5j87J2L12j17l9J30L5j9k92L16k50L0J54j32J64K10m82M0
$$ 134 -32 84 -110 -45 -232 -220 92 -25 -64 66 101 82 -210 106 -144 -114 40 -92 72 282 -200 -160
5167a60O2K13J02k03R0J29j04l68J40P7j1J4M3j07Q7m1M5J99r0q4j50J48J3j50
$$ -160 -98 115 217 14 104 233 129 -239 -99 -22 -33 -19 24 -83 4 -37 8 207 117 33 -117 31 44 -106
5191a06m2j8K15N1L6l57K97J48j37kK5j74j8j74L29j50J34kJ0J68l92r8J71K66
$$ -106 -148 -166 49 100 136 -221 76 224 87 85 110 -64 -82 -256 73 -77 57 55 65 233 -159 -257 -86 180
5215A80j10p3k21L11n1o3Q3p5p4R1n1J39l4k77M70O3m20j58L09n5j16J54Oj79
$$ 180 70 -3 -224 87 36 -27 56 -19 -93 -2 -53 86 52 -225 245 308 -112 -270 39 -16 -132 22 28 -151
5239a51J09RO7K81j25n00K32rj24j2nK69q5O7j17K3K01M1k55L98j94M3j46q3K38
$$ -151 -42 -33 34 315 190 -310 -78 -87 -211 -223 -228 41 -44 23 -94 -71 130 171 -84 314 120 163 17 -66 172
5264A72j83O2n1O2Q1m9Kk43J67j78J06J8L4j86J4J18R6J25j69O7l43J89k48K87
$$ 172 -11 51 0 62 143 94 96 -147 20 -158 -52 -34 0 -186 -172 -54 42 167 -2 65 -278 -89 -337 -50
5288e0j13J45n2l5J78j21J99n6q2k02N8j16K30Q3J4k18n0J11J31Kk58L21j2K6
$$ -50 -163 -18 -70 -105 73 -48 151 95 13 -189 -131 -247 -17 66 80 -138 -188 -77 54 56 -202 119 107 133
5312A33j84J30M8N4k92N1j82L50k52J31L3K6l0l44L45p8J54J44o7j95J49o8j63
$$ 133 -51 79 127 181 -111 -60 -242 108 -144 -13 20 46 16 -328 17 -61 93 237 170 -25 124 56 -107
5335a07l9J25M1K48l30L3J92l91R0j92K23K88l28K67j7j95j52K80j02L66j32l21
$$ -107 -146 -21 20 268 -62 -29 163 -228 -138 -330 -107 181 -147 120 103 -92 -244 36 -66 300 168 -153
5357a53L04k67J45L4J67l16J38J3J79l40j89K00J64K68m16J03oK40n6q6O6J7q5
$$ -153 151 -116 29 63 230 -86 52 65 244 -96 -285 -85 79 347 -69 34 28 268 212 126 192 209 124
5380A24k11K10nrj22m8N9L08l06N5o9j51J60j9M4K4J39J12j49k97R7R4J10j98
$$ 124 -87 123 118 109 -13 -61 -2 306 0 55 -14 -165 -5 -24 20 44 183 295 146 -151 -54 40 150 -48
5404d8l09J27Q5J02Q0O5j65P8j60N0O8m4J63l8q2K38p3j10k15L21j65R3n9j2K7
$$ -48 -357 -230 -145 -43 37 102 -63 15 -145 -95 -27 -71 92 54 -28 210 137 27 -188 133 -32 61 2 -10 17
5429A7J98k22N4j35K75k28l9L09j06N8k41L03m55J91J15j18L08k03R4j42J14k39
$$ 17 215 -7 47 -88 187 -41 -80 229 123 181 -60 243 -212 -21 94 -24 284 81 175 33 147 -92
5451i2J2J69k2j45J24nj81J58j70K31j12j92R7Q0j17K07l08J80j07K06j98L64
$$ -92 -80 89 67 -78 46 41 -140 18 -152 79 -33 -225 -128 -48 -165 42 -266 -86 -193 13 -185 179
5473A79k59J95n1K27l63j28N12l85k2o5O6J4J16k00J82j28K30j16L09k57R8l5
$$ 179 -80 115 64 291 -72 -200 312 -73 -95 -160 -94 -80 36 -164 18 -110 120 4 313 56 154 119
5495A19J80p47M21R0j04K76k2j13j60O3J33k5k21k9o9K90j56K41k16j57J72n8
$$ 119 299 -448 -27 63 -41 235 213 100 -60 3 136 111 -110 -139 -208 82 -74 167 -49 -206 -34 -92
5517i2O8j06K90k59K93l05j40L81k59P5J98l9k13J70k54K50k79n3J39J20K01k22
$$ -92 -24 -130 160 -99 194 -111 -251 130 -129 -54 144 105 -108 62 -192 58 -221 -274 -135 -15 186 -36
5539c6J90j13J45j26o3j85J12J36k34J85j50m7ML21j09j40P2j15J53j30O2l2J62
$$ -36 154 41 186 60 -3 -188 -76 60 -174 11 -139 -186 -182 139 30 -110 -38 -153 0 -130 -68 -100 62
5562F2j06j92J96J00L7K5k7l4j30M03l71K3L1j86J34J97j75J48l59J51O9j28J84
$$ 62 -44 -236 -40 60 97 122 95 61 -69 334 -37 -14 17 -169 -35 162 -13 135 -224 -73 -4 -132 52
5585E2j72J94j22J71j91rK65j95n3j49J62M7K5J49k72j0J30K2K2k47J60J55j3
$$ 52 -120 74 -48 123 -68 -77 188 -7 -60 -209 -47 0 25 174 -98 -108 22 44 66 -181 -21 134 121
5608A21j21J18m1l9j14k7Pk54O0J73K29k75M33l26K29k03r2J59k4O3j41lP5j51
$$ 121 0 118 77 38 -76 -103 -96 -350 -290 -117 112 -163 270 -56 173 -30 -122 37 13 76 -65 -68 7 -144
5632a44J7J87K9j63k5l7O5n2M14j29r1j66j34J56r3J54k4j63K56n6r%q9L3J87
$$ -144 -127 60 89 -74 -99 -136 -71 -123 291 162 71 -95 -229 -73 -166 -12 -36 -199 57 1 -8 -8 -97 -64 123
5657A23o6k85M42P3m87K66J16l33J62k42K63j46L4O7J06p6K31k60K30k33P5l16
$$ 123 57 -228 214 287 -200 66 182 -151 11 -231 32 -114 -80 -13 93 17 248 -12 218 -15 60 -256
5679b56R7N5N8Jr6J46J1l7N4J28r1j74o6j9Q8K30k66K24P2k65j04L81k64r4K10
$$ -256 -159 -104 -46 -45 -141 5 16 -21 33 161 70 -104 -170 -189 -101 129 -137 87 159 -106 -210 171 -93 -187 23
5704B3j61R3J72K68m66J01J31k01n0j77J04r1J90k1L1p9M1o9K4J06J45r7J7j01
$$ 23 -138 -45 127 395 -71 30 161 -40 -90 -267 -163 -254 -64 -85 -54 -133 -92 -161 -137 -31 114 17 34 -67
5728f7J25k81K21J25k62L97l06J99k43P3J81j14N9j73J42Nj62K54l35L79l41J05
$$ -67 58 -223 -2 123 -139 258 -48 151 -92 -19 162 48 107 -66 76 81 -81 173 -162 217 -124 -19
5750a9P3j83j9j5K30Q4j56J99o5j80j9k9k7j12K57Q4qP2o6j23Qq2J69J56q3mn7
$$ -19 54 -129 -148 -163 67 151 -5 194 129 -51 -70 -99 -126 -238 19 103 95 167 101 -22 -14 -96 73 229 146 142 85
5777H5J50p6k63n3K79l3l27L85j94P1%P9qj1k66K51NJ5m9n9K42j59J86l79Q4K08
$$ 85 235 159 -104 -157 122 89 -238 147 -47 24 24 103 95 84 -182 69 74 89 40 -19 223 64 250 -129 -45 163
5803A63j92ln3J07l39L36L7j28oj53N64o37K63q9J74j22K75q7p0j52j4p5M53k66
$$ 163 -29 -32 -85 22 -317 19 56 -72 -78 -231 333 -304 -41 -130 44 -78 197 110 40 -112 -126 -201 252 -14
5827a4K01q4j71n5J76m8k9n1o2m3L53q8k12L0J06j6o8K00o5Nl46K6Kj42J21J64
$$ -14 187 103 -68 -123 53 5 -24 -75 -137 -180 173 85 -127 -97 9 -7 -75 125 60 65 -281 -255 -253 -395 -274 -110
5853a10J37j44o4J0K32P3j65L13l92K31j01r5l1J10K62j71k67k72N49l71L40j15
$$ -110 27 -117 -181 -171 61 134 -31 282 -110 121 20 -75 -106 4 266 95 -172 -444 105 -266 74 -41
5875d1N04k98j99j63J61Q0m3M4o4j13o5N9N12m38j56L76k68L03j90k20K74j67
$$ -41 463 165 -34 -197 -36 44 1 45 -19 -132 -197 -138 374 -64 -220 156 -112 191 1 -219 55 -112
5897a12L41n09K79N2P4j06j99O1J64J5j55K40l6j03j94M71k24l92L61j96M18j82
$$ -112 229 -280 -1 51 125 19 -180 -119 45 60 -95 145 109 6 -188 283 59 -333 28 -168 250 68
5919F8j03k6J94l17J62J63k24j94R9N2R4o5J29k49K2L66l18J99O2n8r3O2j44K60
$$ 68 -35 -61 133 -184 -22 141 -83 -277 -178 -126 -32 -97 32 -217 -195 171 -147 52 114 56 -37 25 -119 141
5943A41p7J6j13J21j28p5K86m36J58J89k41Q0R4l15K00K9M1j7K7n4J61k41L23
$$ 141 64 80 -33 88 -40 -115 171 -265 -107 82 -159 -79 15 -300 -100 -71 -30 -47 -20 -74 87 -154 169
5966A69j79L8J11l37K02j13Q1j3l8N6r1J54K09m3j55j21R8J06Pj91j02N8N0J48
$$ 169 -10 28 139 -198 4 -109 -28 -41 -79 -23 -114 40 249 206 51 -70 28 134 141 -50 -152 -94 -44 104
5990A04k41j70J85Jj08R0l7K25J73l62k9J10K29k33K73k70m0J51k5R0k55L3J66
$$ 104 -137 -307 -122 -121 -229 -139 -176 49 222 -140 -169 -59 170 -63 210 -60 -100 51 26 116 -139 -106 60
6013F0k61M25k91N7j26J02Q5K19k59M4p1J08l50R0L41kP2Oj60n6k7n3P0j55J15
$$ 60 -201 224 -67 -10 -136 -34 51 270 11 55 -16 92 -258 -168 173 171 243 249 89 33 6 -47 23 -132 -17
6038a7K57k41R0j57q8J19J21O9k52K3R9O2r7k9N1J18j64L4L35k35m5k9n40L97
$$ -17 240 -1 89 -68 -156 -37 84 153 -99 -76 23 85 -12 -41 10 128 -36 -2 333 98 53 24 -516 -119
6062a19J39L1rk42L85q9k1m7j05R9j32J93k32OK30k63L78q9K4k87J91K3k03L69
$$ -119 20 51 42 -200 185 96 75 28 -77 22 -110 83 -149 -143 87 -176 202 113 137 -150 41 64 -139 230
6086B30l50j32J87j32J18j84J51m2O1J74q3j30J59J72Nl58O9j86K63P7m5j86P2
$$ 230 -120 -252 -65 -197 -79 -263 -112 -154 -93 81 -2 -132 27 199 204 -154 -85 -271 -8 69 24 -162 -90
6109i0R8J61o2n19J74J14K7J55n6j35K02K18l53J26%J11p9j2k25K28j6k78L78
$$ -90 8 169 107 -412 -238 -124 -97 58 2 -133 69 287 -66 60 60 171 92 80 -145 83 67 -211 167
6132A67j12k66K59J6q5Ko2N5J20q7j36O0p6J85l0l00O2K65M2R5k62L28j67j88
$$ 167 55 -211 48 64 -21 -19 -81 -26 94 7 -129 -69 -145 40 10 -290 -228 37 79 174 -88 240 73 -115
6156a15K39m01M63m61K88k85L93M2m36J64J00P0m2p0j45K63j29L50j41k6l02L09
$$ -115 124 -277 186 -275 13 -272 121 163 -273 -109 -9 61 19 -51 -196 67 -62 288 147 121 -181 128
6178A28j44k59J86j46M88j48Jj80K29l44K73p8p4R9J05j25j08o0P6K37j94J25
$$ 128 -16 -275 -89 -235 253 105 106 -74 155 -189 84 6 -68 31 136 11 -97 -157 -81 156 -38 87
6200H7j05j11J81O8j66k2J20P7j43J00j70K35l13p8L50j55P7J18j04J6J07j46
$$ 87 -18 -129 52 120 -46 -68 52 129 -14 86 -84 151 -162 -240 110 -45 32 150 46 62 169 23
6222B3r1P4p9j13O3J11Q4L9m50M27r6j48N3K8J92j74O2k23P6R2K51l56J28M3J09
$$ 23 -68 6 -73 -186 -123 -12 72 111 -339 88 -8 -156 -103 -75 117 -57 5 -218 -142 -50 201 -155 -27 16 125
6247A25Qn9K00l66k7J26j63Q4j7J43j48J77O5k08J07p9J44m20J93m0n2K00k02
$$ 125 133 74 274 -92 -119 7 -156 -72 -89 54 -94 83 148 -60 47 -32 112 -308 -115 -155 -207 -7 -209
6270b09O5J12O5l3j16J68j0P0j99N1nR4j72r1J28k2J07J05m6j16J17l7j33K49
$$ -209 -144 -32 33 0 -116 52 42 112 -87 -36 -41 53 -119 -210 -82 -104 3 108 62 -54 63 26 -107 142
6294A42J61l81l21K12K9j03L75l1j61J54j86J95j31L9J85k85J07J58k71J55l94
$$ 142 303 -78 -399 -187 -158 -261 114 83 -78 76 -110 85 -46 -7 178 -107 0 158 -113 42 -352
6315c52K86J02q9M9k54L76n6j52K05k75j18M85k67NJ47l22K55L9O5k12J5P3j22
$$ -352 -66 36 -53 -4 -258 118 62 -90 115 -160 -278 207 -60 -55 92 -230 25 64 129 -83 -68 5 -117
6338a17J28n9j0o9K48j46K7n6k9k68K08OJ06Lj4r8J85k42O1K4Q6J11k42K22L2
$$ -117 11 -48 -58 -127 121 -25 2 -54 -83 -351 -143 -137 -31 -28 -42 -140 45 -197 -136 -112 -26 85 -157 65 97
6363I7J00o1k93O1J36K16r1m1J45l84J93N1o8m4P1k24p9P0M0M20k43j34J47L8
$$ 97 197 136 -157 -96 40 256 165 124 269 -115 78 129 61 17 88 -136 -215 -145 -105 315 72 -62 85 123
6387A23k89q5J69Q2K8j4j01L42l65N7J16p7K39K1n2j14j89K80k92L6j54Q1k0q0
$$ 123 -166 -251 -82 0 28 14 -87 255 -110 -53 63 -14 225 246 194 80 -109 171 -121 -85 -239 -158 -178 -258
6411b58J26J03r5QJ49J0K9j96M10n56R6j1K02N7k0J26k00l4R4nj8P2q2K22l16
$$ -258 -132 -29 -124 -116 33 43 72 -124 286 -270 -174 -185 17 74 54 180 -20 -54 40 35 17 89 7 229 -87
6436h7N19m69Q8l5j83K15M9J29o0j50J63k2k42J37j63M7M46k20J7j23k33L50j34
$$ -87 432 -37 51 16 -167 48 97 226 166 16 179 157 -85 52 -111 -64 382 162 179 56 -177 173 39
6459C9j7o3P5J23l24p8K75k3j62K76l36N6J79K73k29k62P0M20n22K53O6j2j75
$$ 39 22 -41 34 157 -167 -245 30 7 -155 121 -215 -159 20 293 64 -198 -128 292 -230 23 89 77 -98
6482i8L9k32L37K3P3j11j10p3L23r0L2j78j90OJ48M14l30L38m56P5K56k35n6J77
$$ -98 -59 -291 46 69 142 31 -79 -152 171 81 113 -65 -255 -249 -101 313 -17 321 -135 -60 196 -39 -95 82
6506H2k75J3M2K1K06l52L05k03M18l15M5K41m38J24M05l05j19L55m84l1J37L67
$$ 82 -193 -180 -138 -117 89 -263 42 -161 257 -58 -13 228 -210 -86 319 14 -105 250 -234 -265 -128 239
6528B39n9m4j57r7J79j4j2J74qk57J84j68j24L95j38J17j01r0k12J62n4J81J5
$$ 239 180 136 -21 -118 61 47 35 209 201 -56 128 -40 -164 231 93 210 109 19 -193 -31 -85 96 111
6551A11K05j84k12m0J8J56pr6J39p0j86P7L83l05R0j15J17L2l2J20n6l63J19P2
$$ 111 316 132 -80 -120 -102 54 47 -49 90 20 -166 -89 294 -11 79 -36 81 113 81 201 145 -218 -99 -27
6575b7J26K9k94Q9J20Q2j66k3JK91j94j42K48l14K48qj3k67N76k18n5j25Q0J59
$$ -27 99 128 -166 -77 43 125 -41 -64 -63 228 34 -108 140 -174 74 66 53 -214 362 144 89 -36 44 203
6599B03k72Q9l9p2L83k68m9J57O6k48J56J5m5J36m33j7M6K11k37L10m44M33j9
$$ 203 -69 20 -19 -91 292 24 -25 132 198 -50 106 121 76 212 -221 -238 -192 19 -218 92 -352 81 62
6622F2j8k73L35j32JQ0j70L0j94L45j97J37j7K18k83K13k33J60M5k6j27J48j37
$$ 62 44 -229 106 -26 -25 55 -115 -85 -279 66 -131 6 -11 207 -76 137 -96 64 109 83 -44 104 -33
6645c3r7K1J18k00J94L55k68j5k22K76k72L05j9j27J01l74L15j54O0L7N1O4j91
$$ -33 -130 -109 9 -191 3 358 90 75 -147 129 -143 162 143 16 117 -257 58 -96 -36 1 52 116 -75
6668g5L55l05M55n41J60q7J48j27J10K2k06J98K7k80N4J8J39j98nJ64K7n2j61
$$ -75 280 -25 430 -111 49 -38 110 -17 93 115 -91 107 134 -146 -92 -74 65 -133 -138 26 53 1 -160
6691a60K92k17p0J77l1j29PN09m98L14k67R7j39K59j24j6Qj22L44k67j32J48j94
$$ -160 132 -85 -155 22 -9 -138 -131 378 -120 194 -73 24 -115 144 20 4 12 -110 234 -33 -165 -17 -211
6714b11K07O5N4j09q1j9J55L8q0M3k9R5l23K79k21J64J16r7j58J92o4k07L26R2
$$ -211 -4 61 115 6 -75 -94 61 99 19 62 33 128 -195 84 -137 27 143 46 -112 80 16 -191 135 227
6738B27j89m2j31K39k22J65j64J93K23n02M78l82K50k42M4O8p9rL25j36j54K9
$$ 227 38 -4 -135 104 -118 47 -117 76 299 -203 275 -107 143 -99 -55 13 -66 -75 250 114 -40 -11
6760a1k59K06K46J14m02J44j31M40m39j89J85J73m42K50Q1N1M8n7K53k07L07m40
$$ -11 -270 -64 182 296 -106 38 -93 347 -92 -281 -96 77 -365 -115 -34 17 65 8 261 54 361 -79
6782g9M0J94k71J26j15J55m5O9j76pL82k77j46J84j16j3P1p0J96J22j84k27P1
$$ -79 -39 155 -116 10 -105 50 5 74 -102 -109 273 -4 -150 34 -82 -95 -24 -94 102 224 40 -187 -116
6805a16K86n3k51J33m5m6J43N1k11K01k73J69q7L2K59j36m0oK92k03j55PN0q1
$$ -116 170 117 -134 -1 -46 -92 51 102 -109 92 -181 -12 -99 -67 192 56 16 10 302 99 -56 -49 1 -80
6829h0L21j91pK2M2M5P7m17J25M3J56l9j17n9K36j50q6P8K41j65J95j43q8j85
$$ -80 241 50 43 65 107 152 229 -188 -63 -20 136 97 -20 -79 157 7 -79 -1 240 75 270 127 39 -146
6853a46R0L9J02K49m12P7j4l7k9Q7J52j05k34J92R3j9P4Qr8R6k66R3J32k84J29
$$ -146 -56 -17 85 334 -78 -1 -15 -52 -81 6 158 53 -181 11 104 85 159 167 69 165 -101 -8 124 -160 -31
6878c1j76J01J43q9k14L21k7l6j42K27L7j70r9rK13J1m4o2L8n4J33l08K51o2j09
$$ -31 -207 -106 37 -52 -266 55 28 -8 -150 77 114 -56 -155 -164 49 60 16 -46 -8 -62 71 -237 14 -48 -157
6903a57K29j94J29O7Jj38J64q1j75K03j23J36k36M16j06j15J05K1j17l0o3J60
$$ -157 72 -122 7 74 75 -63 101 20 -155 48 -75 61 -175 241 135 20 125 146 29 -1 -64 96
6925I6J68k20l29L02O3r6J50k65L87j20k42R6L9k13J82j76K04mj44p2N5O5OQ3
$$ 96 264 44 -285 17 80 -16 134 -131 256 136 -106 -10 29 -184 -2 -178 26 22 -122 -194 -139 -74 -68 15
6949A5ko7r6M1J08K6J59k15j10J43J51k07L4J76l8m9j49QJ27k65L85j76m1J29
$$ 15 13 -54 -150 -109 -1 25 184 -31 -141 2 153 -54 -20 156 118 69 -80 -72 55 -210 175 -1 -42 87
6973H7k50L70m04K25j39J12j87K25k07K83k08L49k66n4J98k58K21j31J54l51K99
$$ 87 -163 207 -197 28 -111 1 -186 39 -168 115 -93 256 -10 -64 134 -124 97 -34 120 -231 68
6994F8j20o0R1qj59o5mK82j63J34J50j65J5j19J32o8L00k28j4k0K44k62K43j36
$$ 68 -52 -112 -21 -29 -188 -253 -257 25 -138 -4 146 -19 -4 -123 9 -59 241 13 -1 -21 223 -39 204 68
7018F8k21j45K83K03R6k79j74K8K41O4k67m2K23j51J38p0K02p7j04j66J49J82
$$ 68 -153 -298 -15 188 284 5 -169 -141 100 164 -103 -145 78 -73 65 -5 197 120 16 -150 -1 181
7040A81j93L9P9j49P6j22R4J28l69K82j48K8J8L5r8J34k58K61p7j09K28m7K64
$$ 181 -12 27 106 -43 33 -89 5 133 -236 46 -102 -74 -56 -21 -119 15 -243 18 -59 -168 60 13 277
7063B77j58l81L83Mj84J56j82K64p9m1l46J38K06r2p9N9M4m2P1j25K53k9j1L1
$$ 277 119 -262 121 125 -59 97 -85 179 100 59 -287 -149 57 -35 -114 -55 -11 -53 18 -107 146 117 106 137
7087A37n18N70n2P7j13j08P6k3N1l5K8j1k05j16M26k07j6Lp6K84j44j20Q2JJ21
$$ 137 -381 189 137 214 101 -7 69 46 97 62 90 79 -126 -242 184 -23 -39 -36 -112 172 28 -92 -10 -9 112
7112A12j01K6N3J62k52K20j63R8q5J61l03J91L7P5k17J21k62n1J48R9J14k4k65
$$ 112 11 37 90 252 0 220 57 155 70 231 -72 119 156 231 14 135 -127 -178 -30 69 183 159 -106
7135a06M7L09k22J8l8oK40l35J52k14J04L2qK00k19l6L4K7l4J34j65P9K7J96k92
$$ -106 -59 250 28 46 8 2 242 -93 59 -155 -51 -19 -27 173 -46 -82 -48 -21 -55 79 -86 -7 20 216 -76
7160g6Q0J12k4j13J36j52K80j06j27j96J19J32o2J45l32m9J8M7J56K8j40o2J10
$$ -76 4 116 92 -21 115 -37 243 137 10 -186 -67 65 3 148 -184 -233 -215 -168 -12 16 -124 -186 -76
7183g6o9L92k17J14N7l15m1M44k87l66K10J77n6j77K88k29K65k63M4l0j1N7K91
$$ -76 -145 247 30 144 201 -114 -155 289 2 -364 -154 23 -33 -210 78 -151 114 -149 -105 -135 -146 -89 202
7206B02k29L2p5lp5k66M67j41P1p3j6j42J56J92Ll1l27K61j11j11J97l55L23k27
$$ 202 -27 5 -70 -73 -148 -414 53 -88 -17 -90 -106 -248 -92 100 103 72 -255 6 -105 -216 -19 -374 -51 -278
7230b78M25K05n82M46k50K2R1n4m8l5J30j58j91L55j89M59k05k96J19L0j16j94
$$ -278 147 352 -230 216 -34 -12 79 25 -23 -58 72 -86 -277 78 -111 348 143 -153 -34 -4 -120 -314
7252c14M70l35J81P3K6k50J71k1j93k0L25j84R1j95N3m2k2P3L71j08j0j17k8p4
$$ -314 156 -179 2 75 101 -149 22 1 -192 -212 113 -71 20 -175 -122 -164 -186 -113 258 150 140 23 -5 -79
7276g9Ok70L3L35j44L04k21N0j37J01J11l1j30L07j56Lm31J77L01j75J11n6j81
$$ -79 -73 -343 -310 25 -119 185 -36 14 -123 -22 89 58 -72 235 79 82 -349 -172 129 -46 65 9 -172
7299a72K40J5O7k99J37MR3j05j41J10J26L0p8qJ45Kk22r4L31k16O7m5k75L22K
$$ -172 68 83 150 -149 -12 -8 85 -20 -161 -51 75 105 27 19 164 166 -56 -150 181 -35 32 -13 -288 34 36
7324C6pK3R2k41J61J08j38R5o0k18J12q1Q8o3k92L31QR8j00J51p1m5J02j15j89
$$ 36 29 52 144 -97 64 172 34 129 69 -149 -37 -118 -30 -93 -385 -54 -46 52 -48 103 32 -13 89 -26 -215
7349b15K78J90P6n02J40L8p3P2j03R3j25K6KK7r9J24j46R5K22j97MM24k70j71
$$ -215 63 253 329 -173 -33 5 -68 4 -99 -6 -131 -105 -103 -76 -175 -51 -197 -102 120 -77 -73 351 81 -90
7373i0P5k26J88j08K50lo3l06K41L20r7j54l56K22K03p5Mk19K74m0m5j46q7L03
$$ -90 -15 -241 -53 -161 89 86 23 -283 -42 278 181 27 -329 -107 96 21 25 -194 80 40 -5 -151 -238 65
7397F5k7O2j63k5J77r7M3j4M8n5J73k98p2J05L8m7j74Q6O0K87l39j09J03J01m1
$$ 65 38 100 -63 -88 89 -8 35 21 69 14 187 -111 -183 -78 -40 -87 -261 -175 -115 172 -167 -276 -173 -72 -113
7422a13Q8J31n2j81J22J30j80J46n2K18j88j40p0K2J60K41n12M25l63P9J3%j5
$$ -113 -25 106 54 -127 -5 125 -55 91 39 257 69 -71 -141 -119 41 282 -230 195 -168 -89 -76 -76 -91
7445i1l1J68O7j78O9o5j26N6J29J15J17j57k54J39J57n1j3j5p7O5M2J93J3o15
$$ -91 -122 46 113 -65 4 -61 -187 -131 -2 113 230 73 -181 -42 115 64 51 36 -41 24 66 259 272 -343
7469c43L55J24k3j8j29m3L10p9l07J62j52O5kJ41M4l0N1k80m4K78j69r6L28m10
$$ -343 12 136 113 95 -34 -77 233 154 -153 9 -143 -78 -80 61 105 75 126 -154 -198 80 -89 -185 143 -267
7493b67K64j49J98Q8l98M28k80L25r2j58P0J70j59L05m57J03L1P3n0Jk91L08J00
$$ -267 -3 -152 46 134 -264 164 -116 209 117 -41 29 199 40 345 -112 -9 22 95 45 46 -245 63 163
7516A63l11J02n2j68mK17j78K35N9J05j76j17R8J72k70R8j40L02m5j92J10p4J11
$$ 163 -148 -46 -98 -266 -270 -53 -231 4 63 168 -8 -125 -27 145 -125 -27 -167 135 90 -102 8 -66 45
7539D5k44M67l92J10J06R6l08N4j12L22j26J21q2k02J41L92m52l5K21n7O0k55
$$ 45 -199 268 -124 -14 92 188 -120 -66 -178 144 18 139 57 -145 -4 388 -64 -99 122 65 125 -130
7561a30P7M6k3J09O7K08l76J76o0m1j5o4O0K18Qk17Q1J11k14j13J45k70K53r9
$$ -130 -53 -7 -30 79 146 354 -22 154 94 53 38 -26 34 252 260 43 124 235 21 -92 53 -217 36 -63
7585f3K2L96k63j46K45k5j36J82L4M5l07m9q7R3P3o5J21j74J53j37R6L5J85j96
$$ -63 -41 355 92 -54 191 166 30 212 246 291 -16 -65 -152 -59 14 -51 70 -104 49 -88 8 43 228 32
7609C2k3j41L38l69J94jp6K99m20L17J8k47K31q1j9L3n2q3J59m0M3k03J1j77K19
$$ 32 9 -132 206 -163 31 30 -46 253 -167 150 168 -79 152 71 52 85 33 -50 109 69 112 -91 -80 -257 -38
7634c8R1k73L1K93q7j00O4J84k58K13l5n3L3j36R7p8K92k81p9q5J55k48K11J7
$$ -38 53 -220 -189 104 17 -83 -19 165 -93 120 85 32 65 -71 26 -52 240 -41 -120 -205 -50 -298 -87 -70
7658g0j23K99j14K3QJ82l33K73r7n5k48J42QL06p8o9r0j70J50M9R4j90q3K10Q
$$ -70 -193 106 -8 15 23 205 -128 145 48 -7 -255 -113 -105 201 123 54 -36 -206 -56 -7 87 -103 -186 24 32
7683C2J33l32L30k68K26N4j31pK9Rn4J38k7l68K08J28o1J38l97M62k31q4J34j0
$$ 32 165 -167 163 -105 121 175 44 37 66 75 21 159 132 -236 -28 100 39 177 -220 242 11 -73 61 51
7707E1j19P5m06M41r5J53M9j52J2M3l12M00%O9lj25pj68K01Kj52J46j73M0K6j40
$$ 51 -68 7 -399 42 -53 100 149 -3 9 52 -260 140 140 209 206 81 74 -94 107 109 -43 103 -70 -30 -4 -144
7733a44Q6n5J02Q1O6k58J89j94L2J86k47K09J4r7j99l7M02l2k35K83r8J46m2J97
$$ -144 -58 -113 -11 70 136 -122 67 -127 -95 91 -156 53 67 -30 -229 -266 136 104 -131 152 54 200 158 355
7757C55m87m4J03N7l6k69L03J12q7J6K0K5j06k93K41j91L71q1Q7j61k44L53OP7
$$ 355 -132 -176 -73 -16 -52 -321 -18 94 7 23 43 68 -38 -331 -90 -281 90 9 96 -65 -309 44 50 127
7781A27r3K35k61n6J60m39J70J53k3j0j47K97J44k08j3l19K00O6r8M2k6K67n39
$$ 127 34 269 8 -48 112 -327 -157 -4 -27 -37 -184 113 257 49 36 -283 -83 -17 -115 -73 -99 168 -371
7804c71L62j1l2M2K13j13n5Q3k44K13K0K1Jk24j24L26J2Qj33J3j85L61j34k58
$$ -371 -9 -20 -52 -10 203 90 35 118 -126 87 107 128 129 -95 -219 107 119 127 -6 7 -178 183 49 -209
7828b09Q1L3M0j12K36n4q0J03q8Q0N8M3J49k76K0L7k37J21p0j59M01j93K58k35
$$ -209 -128 -95 -55 -167 69 15 -65 38 -50 30 88 131 280 4 24 61 -176 -55 -125 -284 117 -76 182 -53
7852e3j5R2J1K68j17j77LL70k18o0Kk3P6j50j16J50Q9L7k90J81j28j3k94L55K1
$$ -53 -68 24 35 303 186 9 12 382 164 104 106 83 159 9 -107 43 132 169 -121 60 -68 -81 -375 -20 1
7877Aq6L8N6Q2J40k09j42K38l53M24l68N7mJ9J20m2o0J29j59Q8j12J55O2n4o3
$$ 1 -85 -47 9 91 231 22 -120 118 -235 189 -179 -122 -126 -107 13 -29 -89 40 -119 -31 -143 12 74 20 -43
7902d3n7O4j46M12k99K70j07n8j12R9K5L9k77J67JJ56j5j91k05L10k9j02L32k60
$$ -43 -100 -36 -182 230 -69 201 94 36 -76 23 48 87 -190 -23 -22 134 119 -72 -277 33 4 -98 234 -26
7926b6K9j24J90J2q9K8q9K63j29mR6j67K7r7k0O9m2J43j55J36j50Lj42J36N2j75
$$ -26 3 -121 69 81 -8 20 -69 194 65 61 157 -10 17 -80 -100 -31 -73 70 -85 51 -99 -96 -238 -102 -50 -225
7952b25M47m69L43q3J7J95l95L21m2N2q1l9J09k62K88n9k88K40q7j18J48o0j1
$$ -225 222 -247 96 13 30 225 -170 151 109 161 80 41 150 -112 176 117 -171 69 -18 -136 12 -48 -59
7975e9k17K89q0jj41O6K3O6j15J83K20j70q0j06r3K18j55P2j32L4J18j44J97o
$$ -59 -276 13 -67 -68 -209 -143 -120 -54 -169 14 234 64 -16 -122 -215 3 -152 -80 -212 -178 -60 -204 -7 -13
7999a3P8J3Q9m07K71p8q9J17J4J37Q5k08qlk39K42r3j9L03l22N7K06j28J42j63
$$ -13 65 78 167 -240 31 -47 -136 -19 -5 132 217 9 1 -2 -241 1 -92 -111 192 -130 -73 133 5 147 -16
8024a6J65n3k92K21j28m0j1J40l7J03j6N2l0j30q4L53j83Q9q3K1j22P8P6K64k79
$$ -16 149 96 -196 25 -103 -143 -154 -14 -51 52 36 88 58 -72 -156 197 14 103 20 41 -81 -3 73 337 58
8049E8L4k42L30J2j08k32K70k83r5R2K46j37J92k37j48M63N5l96J59p8J06J20
$$ 58 92 -150 180 192 84 -148 122 -161 -256 -164 82 -55 137 -100 -248 215 270 -126 33 -45 61 181
8071A81o1j92r0K66j28R0J58o8k39R3j21O0K27j41p7J10l55N57k96M9K41j72j35
$$ 181 120 -72 -162 104 -24 66 224 156 -83 10 -111 -51 176 35 -42 68 -287 270 -26 23 264 92 -43
8094d3m3K33l8K1j49J21j1K6J6j49J7K42l18J96o6l4J00q6J95k36J7p6O5O5L19
$$ -43 -86 147 109 130 -19 102 91 117 133 -16 1 243 -75 121 55 21 121 35 230 -6 11 -65 0 65 384
8119C84m87m2J8L35k46nK95l27J4J51j95M0J32L9q7j24J57krk08L25l90J66L25
$$ 384 -103 -145 -127 208 -38 -43 252 -75 -61 90 -105 -65 67 106 19 -105 52 50 41 -167 158 -232 -66 259
8143B59m55J95J32k46J05Q3m28L96p3M27l70p3k48K34p7Q0J50p2J70l52j62K94
$$ 259 -196 -1 131 -115 -10 73 -355 41 -32 395 25 -48 -296 -62 -139 -59 91 19 189 -163 -325 -31
8165c1K2k5L7j17K9J25L51n85L53m23K95j24j03K03j49N4L2j42R5K50m45K55J13
$$ -31 -9 -34 3 -114 -85 40 391 -194 159 -264 31 -93 -196 7 -142 -88 -56 -198 -103 147 -298 -43 70
8188G0k88L37k67
$$ 70 -218 119 -148
8191a48
$$ Imaginary data points
##PAGE= N=2
##DATA TABLE= (X++(I..I)), XYDATA
0@%%%%%%%%%%%%%%Qj6J6j6J6k4L2l4M2n0N8p2Q4r4J08j25J45j67J89k14K44k76
$$ 0 0 0 0 0 0 0 0 0 0 0 0 0 0 0 8 -8 8 -8 8 -16 16 -18 24 -26 32 -40 44 -50 58 -67 78 -89 100 -114 130 -146
36a46L09l47L88m31M81n36N96o61P31q07Q90r83J084j193J315j448J594j758J942
$$ -146 163 -184 204 -227 254 -282 314 -347 384 -423 467 -516 568 -625 690 -758 836 -922 1020
55A020k148K379k643K950l309L734m246M881n696O781q306J0627j4627K3457q1585
$$ 1020 -1128 1251 -1392 1558 -1751 1983 -2263 2618 -3078 3703 -4603 6024 -8603 14854 -66731
70f6731M5120J06535p6112m8177j8377N2777K9029k0180j5785K0615j7954m042
$$ -66731 -21611 84924 8812 -39365 -57742 -4965 24064 3884 -11901 8714 -9240 -13282
82a3282J2006O346n650k829j891Q596l606n74J594j268P47L167k425N7k782K102
$$ -13282 -1276 5070 -580 -3409 -5300 3296 -310 -884 710 -558 189 3356 931 988 -1794 308
98C08N193k673n010L229P84q07j138o9J205j261j216K320j237j199J130J36l57
$$ 308 5501 2828 -2182 1047 1831 1024 -114 -183 1022 -239 -1455 865 -372 -1571 -441 -305 -662
115f62j73q30K366N13l359L44K841L1j111r48N6J148Qn11L55k10j59M09K58p2
$$ -662 -835 -1665 701 1214 -2145 -1801 1040 1071 -40 -988 -932 216 224 -287 68 -142 -301 108 366 294
135B94m51k29Q96n04l15J213o87q42Q02k4M70J04j622k48J554k60o40O38j58o2
$$ 294 -157 -386 510 6 -309 904 217 -625 177 153 623 727 -895 -1143 411 151 -489 149 -9 -71
155g1J25p10j17J526J6j332j96L83j48J177m17r07J18L47n94R46K33l26r3m31
$$ -71 54 -656 -773 753 769 -563 -759 -376 -524 653 236 -671 -553 -206 -800 146 379 53 -40 -471
175d71R5O84j16m21p4J90j67K39j80R8J93k34J92J63l89OJ53k60N28O9m94p8Q8
$$ -471 -376 308 192 -229 -303 -113 -280 -41 -221 -123 70 -164 28 191 -198 -192 -39 -299 229 298 -196 -274 -186
198a86Q6n0L37l64J68j5k64J88J90Q3n88J84J94Q3R2l24M9M51n00K47J16K2l45
$$ -186 -100 -150 187 -177 -9 -24 -288 -100 90 173 -415 -231 -37 46 138 -186 -137 314 -186 61 177 199 -146
221a46M25J5l95K92r8k54J69J33J7j78L9p3J07K84n44jL79j75p5J25j11nK0J82
$$ -146 279 294 -101 191 93 -161 8 141 158 -20 19 -54 53 337 -207 -208 171 -4 -79 46 -65 -70 -50 132
245A32m15L13j8j47K64J76m93K40PK0m9j1j21j44K73k21J09R1J02J1J01o99N25
$$ 132 -283 30 12 -135 129 305 -188 52 59 79 30 19 -102 -246 27 -194 -85 6 108 119 220 -479 46
268D6J26k36P4j79l44K52j3J42j32K86R9k16q7J92lnm5L54k92p9P2j41k33K51
$$ 46 172 -64 10 -169 -513 -261 -274 -132 -264 22 121 -95 -182 10 7 2 -43 311 19 -60 12 -129 -362 -111
292a11Q9p9K09K51j33m09J96l0J56k57J60J06p6k06M88j29k22r2Kq8K07j30J79
$$ -111 -22 -101 108 359 226 -183 13 -17 139 -118 42 148 72 -134 354 225 3 -89 -87 -175 32 -98 81
315H1P1k67K36jj78m4p4J36N0k9j78k3J15k1J64L1k82l3J60p1J13K4k4K88l48
$$ 81 152 -115 121 120 -58 -102 -176 -40 10 -19 -197 -220 -105 -126 38 69 -213 -246 -86 -157 -44 -20 -44 244 -104
340a04K5J9J71N7J2m45r6M61l13J25J00k28R8J15L7n4K07j35l3J14P2j25j33m
$$ -104 -79 -60 111 168 180 -265 -361 100 -213 -88 12 -216 -118 -3 34 -20 187 52 19 133 205 80 -53 -57
364e7M9j11j66L82q5J39k99J60o5R1n2J86m10L4K02k54J72J67M8l5%J30j06J66
$$ -57 -8 -119 -285 97 12 151 -148 12 -53 38 -14 172 -238 -204 -2 -256 -84 83 131 96 96 226 120 286
388B86k95K19j55j35J80m5j33J42J59l63L12p4k32L6J98n7j6M3m35L28J95K9k24
$$ 286 -9 210 55 -80 100 55 -78 64 223 -140 172 98 -134 -98 100 43 27 70 -365 -37 158 187 -37
411c7j43L52l2n05L24K68m09K88k89j00L02j09J60j35n6O2K2L16l64J96p2kj98
$$ -37 -180 172 140 -365 -41 227 -182 106 -183 -283 19 -90 70 -65 -121 -59 -37 279 -85 111 39 37 -161
434a61J91O2J29k35m3k9p4K91j16j84L96l47k8M23m01L12k44l26J67L70k44Qo0
$$ -161 30 92 221 -14 -57 -86 -160 131 15 -169 227 -120 -148 275 -126 186 -58 -384 -217 153 -91 -83 -143
457a43J03J42j11r0R1J93k98J30q8j3j9M35m72j48K81j84M3j48K63P0j13K44j93
$$ -143 -40 102 -9 -99 -8 185 -113 17 -71 -84 -103 332 -140 -288 -7 -191 -148 -296 -33 37 -76 168 -25
480b5R5J1lN2rO5j23p7R7J74j72J39m71J8J65J31Q5K5N5k40j3m7J91k52k12M7
$$ -25 70 81 78 130 121 186 63 -14 83 257 85 224 -247 -229 -64 67 152 177 232 -8 -21 -68 123 -129 -341 -294
506b94K21J01L53m76K94l29K81q2l37L10K15k28k33M83l15J63j19K06n2j57k4
$$ -294 -73 28 381 -95 199 -130 151 69 -268 42 257 29 -204 279 -36 127 8 214 162 5 -19
527a9k04J61K19k76K7J43J92k39N3n5O1O1lj35K41m33R6J15k61L46j07K54k0j93
$$ -19 -223 -62 157 -119 -92 51 243 4 57 2 63 124 121 -14 227 -206 -110 5 -256 90 -17 237 217 24
551B4p4k73K72j48K15K05q4j68j62l0L66k15J12R7O2l04J04M67k95l12J99O6k28
$$ 24 -50 -323 -51 -199 16 221 137 -31 -193 -223 143 -72 40 137 199 -105 -1 466 171 -141 58 124 -104
574a04k6Q4k31K22q4n6J2j65J90J68j02M8R7O4l18rK9K93l46M45m56K74o2J45
$$ -104 -130 -46 -277 -55 -139 -195 -183 -348 -158 10 -92 -44 53 117 -201 -210 -181 112 -234 211 -245 29 -33 112
598A12k03N3J26J4Q7j04j77o1K23k93N30m59R8J27k61J73L22l41J67j38N3J77
$$ 112 -91 -38 88 102 189 85 -92 -153 70 -223 307 -152 -54 73 -188 -15 307 -34 133 -5 48 225
620B25j88j97j63J80J17KL24m24pJ21j41K7o3K99l66J64J95k54J44K0j66R6L1
$$ 225 37 -160 -323 -143 -26 -24 300 -124 -131 -10 -151 -124 -187 112 -254 -90 105 -149 -5 15 -151 -55 -24
643b4M4m4J65r2j22L4J7K85k07J37j87J17M1q5l90L53n7K37j01j90J28J13k07
$$ -24 20 -24 141 49 -73 -39 -22 263 56 193 6 123 164 79 -311 42 -15 222 121 -69 59 172 -35
666c5K2j62P6J66J78l28Q1J10j91J25k62J24j22L06m52N25m13K48k5K00k69L18
$$ -35 -13 -175 -99 67 245 -83 -2 108 -83 42 -220 -96 -218 88 -364 161 -252 -4 -29 171 -98 220
688B20q6j70j8mk11L33q7j06q7Q3K65k25j94L52n3p0P3l60N24l24M25k88J65k00
$$ 220 134 -36 -54 -58 -269 64 -23 -129 -216 -133 132 -93 -287 65 12 -58 15 -345 179 -145 280 -8 157 -43
712d3k65M01j33L27n03lL53m6j32J63L5j64j15n4J35R2N6k8ok68L75j41p8O5J59
$$ -43 -308 93 -40 287 -216 -219 134 88 -44 119 154 -10 -125 -179 -44 48 104 76 70 -198 177 36 -42 23 182
737A82j93j4N8n8j11KJ58m8J27m1M2j13K38m24M19q5j17j07Kk06M53k8m0l02K53
$$ 182 -11 -25 33 -25 -136 -134 24 -24 103 62 104 -9 229 -195 224 139 22 -85 -83 -289 164 136 96 -206 47
762D7P0j60K75m6l78L22M2N2l76M36l37j9J2n0K73k72J16K08o8k91K51k26J56
$$ 47 117 -43 232 186 -192 130 172 224 -152 284 -53 -72 -60 -110 163 -109 7 215 147 -144 107 -119 37
785C7n1k7j07L22k08l7J97n2q6J64r0J56l43J97j67K42K3k06J10P0l02K39m9K84
$$ 37 -14 -41 -148 174 -34 -71 126 74 -12 152 62 218 -125 72 -95 147 170 -36 74 144 -158 81 32 316
809C16j85j18R6R5o0k91O3p2o7P1J67J04j92P9Rj73O1K12j56K48k62J14j74Q4
$$ 316 131 13 109 204 144 -147 -84 -156 -223 -152 15 119 -73 6 15 -158 -97 115 -41 207 -55 59 -115 -31
833c1O3K9m5m2J02O4r8k85N99m20K36l03j16J80q0J26J10j66P7J45j93J00k19
$$ -31 32 61 16 -26 76 140 42 -243 356 -64 172 -131 -247 -67 -147 -21 89 -77 0 145 -48 52 -167
856a67J57j37J20j89J99k40N5L90l23m0J83J51m51K59K30o9l87K79j17J91j20
$$ -167 -10 -147 -27 -216 -17 -257 -202 188 -135 -175 8 159 -292 -33 197 128 -259 20 -97 94 -26
877b6P5mk40J41j50K73K1r4m8J63k35J23J27j14N3K44j55j32k09M82n39L72J6
$$ -26 49 45 -195 -54 -204 69 90 -4 -52 111 -124 -1 126 12 65 309 154 22 -187 295 -244 128 144
900A44J9M7j13o1j91K63k74J34J75m53J19K09j18K81j67k1R8j6j86m6j19k7L62
$$ 144 163 210 97 36 -155 108 -166 -32 143 -310 -191 18 -100 181 14 -7 91 75 -111 -157 -276 -303 59
923E9J87j97j18Q6j15N7K06k41R2j48L1J96O0k50K98r4j93J49k56K61k48R8o9
$$ 59 246 49 -69 17 -98 -41 165 -76 16 -132 -101 95 155 -95 203 109 -84 65 -191 70 -178 -80 -149
946a49K63J18l10J27q8M3jJ79p6j31L22k61j18j6L17r6j34q1l9Q4j89J04J32J76
$$ -149 114 232 -78 49 -39 4 3 182 106 -25 297 36 -82 -98 219 123 -11 -92 -131 -47 -236 -132 0 176
970A76k25J31Or7j36K70j14K28k97J09j54j44J93K3j58K54k43J25Q3j74M42l11
$$ 176 -49 82 88 -9 -145 125 11 239 -58 51 -103 -247 -54 -31 -189 65 -178 -53 30 -144 298 -13
992a3j12L8K61k40o1M33m05L08J5l63L70l14L9k1p6J92or9j00J22J27Q3l39M31
$$ -13 -125 -87 174 -66 -127 306 -99 209 224 -139 231 -83 -44 -65 -141 51 45 -54 -154 -32 95 178 -161 270
1016B70k23j71J47k8O5j18n2J62K6J3o0k00J26N0J16l1%j65L7l2L01k85l4L7K01
$$ 270 47 -124 23 -5 60 -58 -110 52 78 91 31 -169 -43 7 123 92 92 -73 -36 -68 233 -52 -86 -49 152
1041A52j76m8j53N5K15J41m42K54R5p3K17k75J69J3l23K40P5j72m3K6n6K06j84
$$ 152 -24 -72 -225 -170 45 186 -256 -2 93 20 237 -38 131 144 -179 61 136 -36 -79 -53 -109 97 -87
1064h7J92j67J49M7m70L80j16k21L72j17J11r0J4J56j22j1m1J46k50K27pJ3j15
$$ -87 105 -62 87 134 -336 44 -72 -293 79 -38 73 -17 -3 153 31 20 -21 125 -125 102 95 108 -7
1087gK7j24K20o2J74j69Q3r1J4Nk23M7K02J40n36N20k33K5J06r0K17m26L21j68
$$ -7 20 -104 116 54 228 59 142 51 65 70 -153 -106 96 236 -300 220 -13 12 118 28 245 -181 140 -28
1111b8J11K6j24N2n2pO1j10k59M75J24m3m26L39j72j43Q5L35k54J5j41J98j38
$$ -28 83 109 -15 37 -15 -22 39 -71 -330 145 269 226 -200 139 -33 -176 -91 244 -10 5 -136 62 -76
1134g6K44j57m3l28K74K59l95M36k54k13K09J88k51J51j56J22n2M3q4j22K24J3
$$ -76 168 11 -32 -360 -86 173 -222 214 -40 -253 -44 144 -107 44 -112 10 -42 1 -83 -205 19 32
1156C2J03j58JJ33l19K00Q2q3j16J05p7J66rq4j58J86K18j44P1j39J31k43k4J52
$$ 32 135 -23 -22 111 -208 -8 74 -9 -125 -20 -97 69 60 -24 -182 4 222 78 149 10 141 -102 -126 26
1180B6O5p7Q5k74M76k04J23m67L72j88q7J84m4L9j59o5jM05n38L93J19l50K67
$$ 26 91 14 99 -175 301 97 220 -247 125 -63 -150 34 -10 29 -130 -195 -196 209 -329 64 183 -167 100
1203A00L0n2Ql72L50J0j91n4J92j38k9M15l32N0J06m3j09L47l84L4j31K58r8j4
$$ 100 130 78 86 -286 64 74 -117 -171 21 -117 -146 269 -63 -13 93 50 -59 288 -96 -62 -193 65 -33 -47
1227d7O6K04Lj79l3K11k61j60K72J03j87Jj45J68J42l09K19O5j4j23j3J43j09
$$ -47 19 223 226 47 14 225 -36 -196 76 179 -8 -7 -152 16 158 -151 68 133 119 -4 -17 126 17
1250A7j15J21j46L50m38N9L32l42K93k73K76r2M2jj97K27j78J75k6L8k49J84j33
$$ 17 -98 23 -123 227 -211 -152 180 -162 131 -142 134 42 84 83 -114 113 -65 110 84 122 -127 57 -76
1273g6j9L2K11r7j78j3K97j28n6O5k12R3P5j30P0J10k09J62O1J28o5j60k97M11
$$ -76 -95 -63 148 51 -127 -140 157 29 -27 38 -174 -81 -6 -136 -66 44 -165 -3 58 186 121 -39 -336 75
1297G5o0j36N1R8p2K3J89m58K16J09mj0p6J73j43J4j62L25K45n58L86k12k6o8
$$ 75 15 -121 -70 28 -44 -21 168 -290 -74 35 31 21 -55 118 -25 -11 -173 152 397 -161 225 13 -13 -81
1321h1R4k0NJ88j06p0j11K84j44j92J40L86l57m4j00pK01J32j57k84M02r1j86
$$ -81 13 -7 -2 186 80 10 -101 183 39 -153 -13 373 16 -28 -128 -135 66 198 41 -243 159 68 -118
1344a18j3K1l6K30M6j54M8L8q6j74K28J82l48P4k7R9L9P6k24J52K1%N4j80q2M28
$$ -118 -131 -110 -146 84 130 -24 24 62 -24 -198 30 212 -136 -62 -89 10 49 125 -99 53 74 74 128 -52 -134 294
1370B94l37J46j14Q2K39N0m16j35K39N0j79J8Q0R2k5K0m52O5K72q7q7J38P2J10
$$ 294 -43 103 -11 71 310 360 -56 -191 48 98 -81 -63 17 109 84 104 -348 -283 -11 -98 -185 -47 25 135
1394A35p0k19J35J73j81K73k06L12n0J2k27m2k34N4K08r5O3P8k36Q2L1j86K9J49
$$ 135 65 -154 -19 154 -27 246 40 352 302 314 87 45 -189 -135 73 -22 41 119 -117 -35 -4 -190 -161 -12
1418a2J7J10k42L03k8M2k32q1J17n0K54j06n6j11j32L81l80R7K29n4P4P4J50m42
$$ -12 5 115 -127 176 148 190 -42 -123 -6 -56 198 92 36 -75 -207 174 -206 -109 120 66 140 214 364 -78
1442g8r9K22rj93O2j66J82J1O9K5k82K24K39l02J08k97J48j07K89l06K46k84L25
$$ -78 -177 45 36 -157 -95 -261 -79 -68 1 26 -256 -32 207 -95 13 -284 -136 -243 46 -260 -14 -298 27
1465B7p9l7j12K46N6K75n71J31J4j16J82j51L52l00P9J36j45k2J05O6J87m71J01
$$ 27 -52 -89 -201 45 101 376 -195 -64 -50 -166 16 -135 217 -83 -4 132 -13 -35 70 136 323 -148 -47
1488d7n3P6K25l45K90j96R9k14k6K06J67o8j95N9K23k38r4K49r2J88j07l06L01
$$ -47 -100 -24 201 -144 146 -50 49 -165 -191 15 182 114 -81 -22 201 -37 -131 118 26 214 107 -199 102
1511A02j81K0J43Q6r7k03P3K58k19Q4R9k65K57j25P1k96J28J97j02J14J39l12
$$ 102 -79 -59 84 170 73 -130 -57 201 -18 66 165 -100 157 32 103 -193 -65 132 30 144 283 -29
1533b9L69k40k28K26J3r8Q1k27N0O9J82k80J26j12Q3l26K31Q2J13k91M36k88k
$$ -29 340 100 -128 98 111 13 94 -133 -83 -14 168 -112 14 -98 -15 -341 -110 -28 85 -206 230 -58 -60
1556f0O5r5n1O1J82l30J87p7j5n6K15J31j13k47J87l20K70Q1n0o9j7j9N0M3j73
$$ -60 5 -90 -141 -80 102 -228 -41 -118 -133 -189 26 157 44 -203 -16 -336 -66 15 -35 -104 -121 -140 -90 -47 -220
1581b20L64k02J89l02J20J19j43O5R0j54j59L01J25l31J05P4O6n8l8l45J54K1
$$ -220 144 -58 131 -171 -51 68 -75 -10 80 -74 -233 68 193 -138 -33 41 107 49 11 -334 -180 -159
1603a59J60j44L65j69J03j70L60o17K64P6R6k5L29o29L01r0k73K22J75j21P5m1
$$ -159 1 -143 222 53 156 -14 346 -271 -7 69 165 140 469 -160 141 51 -222 0 175 54 129 88
1625H8Ql11J05L21m78M87j04L9k07n3J61j11n7k02M9M70l77J41J51M2m1Q1j48
$$ 88 96 -215 -110 211 -267 220 116 155 -52 -105 56 -55 -112 -314 -265 205 -172 -31 120 162 121 202 54
1648E4k23N06o74N52k81M6R9j55J00l21K54K56j79j38L10k32K55j71m4k5K4k01
$$ 54 -169 337 -337 215 -66 -20 79 -76 24 -297 -43 213 34 -104 206 -26 229 58 14 -11 13 -188
1670a88J58K79k85k4jP6M8JQ1k70n4K53j95R4j18J81l95L68J98l72J88J28o2j27
$$ -188 -30 249 -36 -60 -61 15 63 64 145 -125 -179 74 -121 -27 -145 36 -359 9 207 -165 23 151 89 -38
1694c8o8J18J9n9K28m14p3L06j28p9K93K9j93K7J24k19j54N09k11j98J87R8l32
$$ -38 -106 12 31 -28 200 -214 -287 19 -109 -188 105 134 -59 -32 92 -127 -281 228 17 -181 6 104 -228
1717b28L12k31J29M0n4Q1r5r6JK93j91j82L52k02M12k07k85J81Q5P2m38J70OK14
$$ -228 84 -147 -18 22 -32 49 -46 -142 -141 152 -39 -221 131 -71 341 134 -151 30 115 187 -251 -81 -75 139
1741A39m53O45o27K04J99J59k79k0K00m37M71j64pJ29l31K12K53k82j76R6kn2
$$ 139 -314 331 -296 -92 107 266 -13 -33 167 -270 201 37 30 159 -172 40 293 11 -165 -69 -71 -123
1763a23K10n0o1l3j02R2r2K85l52L80N3m2q5J88j5m29J8l4J24P1Q4j04j90L20
$$ -123 87 37 -24 -57 -159 -67 -159 126 -226 154 207 165 80 268 253 -176 -158 -192 -68 3 87 -17 -207 113
1787A13l69J64L2j66L64j07K72j60k42J07j43m2J28J56l2m31L53J8J6oO0j82O6
$$ 113 -256 -92 -60 -226 138 31 303 143 -99 8 -135 -177 -49 107 75 -356 -3 15 31 25 85 -97 -31
1810c1P9J17l19J85J1k86K46k42L42j57Q6k47K45k39L70l6j64j53R8O9M04n1k64
$$ -31 48 165 -154 31 42 -244 2 -240 102 -55 31 -216 29 -210 160 124 -40 -193 -95 -26 378 327 63
1833F3qk71p6L38o4P6j95P2j56J1L56j77o5j18J3J29j95L29j81K86l00jK11K51
$$ 63 55 -216 -292 46 -18 58 -137 -65 -221 -210 146 -31 -96 -214 -201 -72 -267 62 -119 167 -133 -134 77 328
1857C28m38K23l66K93M1l63M98r4J25l36N4M10l08n3J20j47Lk19J66K8k9K1R3
$$ 328 -110 113 -253 40 81 -282 216 122 247 -89 -35 375 67 14 134 -13 -10 -229 -63 -35 -64 -43 50
1880E0M4P3j01n4K04m57K74n3J50Ol6Q3l96J34j12K00j23J84rJ08k61K48m8j42
$$ 50 94 167 66 12 216 -241 33 -20 130 136 100 183 -213 -79 -191 9 -114 70 61 169 -92 156 108 -34
1904c4q5K97l11k0K13n8P5m37L91O4r1J60k30J01J94m21L3J01q8q4L07j75l6O4
$$ -34 -119 178 -133 -153 60 2 77 -360 31 95 4 164 -66 35 229 -192 -159 -58 -146 -230 77 -98 -134 -70
1928g0Q1QN7J56m72K55j91L49j93j56J6L79k96q7J45J70k49l7J52l6K48k53K25
$$ -70 11 19 76 232 -240 15 -176 173 -20 -176 -160 219 -77 -164 -19 151 -98 -135 17 -19 229 -24 201
1951B01k24q2J76J85k58l38J67L06m4l5o2J54o0O7k3k8k37o8J09Q3J13n1J50l0
$$ 201 -23 -105 71 256 -2 -340 -173 133 89 54 -8 146 86 153 130 102 -135 -203 -94 -11 102 51 201 171
1975A71r1o4n7K45k18K15n5j21j1l28L97l2l2N1Nj5l77L51P5k62j7N24k60j13
$$ 171 80 16 -41 204 -14 201 146 25 14 -314 83 51 19 70 75 60 -317 34 109 -153 -170 354 94 -19
1999a9l50K60J81j8l2k7L2j96Q0J22J31l40J18J22j11j35J8K7r4K56J01J72n13
$$ -19 -369 -109 72 54 22 -5 27 -169 -89 33 164 -176 -58 64 -47 -182 -164 -137 -231 25 126 298 -215
2022b15J62O1k02J49oq5K09ok02K24m2m1Q0j36K29k45j5K23j41J22l14K00J86
$$ -215 -53 8 -194 -45 -51 -136 73 67 -135 89 47 6 86 -50 179 -66 -81 142 1 123 -191 9 195
2045A95l64J01j8j74R2L97M4k57k4L4J6j78K19J38k35m1J25Q7r3J3j19j17M11
$$ 195 -169 -68 -86 -260 -168 229 273 16 -8 26 42 -136 83 221 -14 -55 70 157 64 77 -42 -159 252
2068B52m19J26R8n4jP3L4l7k68PN31m33J49n0K19j66j88J11r2K91q7J15k41k66
$$ 252 -167 -41 57 3 2 75 109 72 -196 -189 342 -91 58 8 227 61 -127 -16 -108 183 96 211 -30 -296
2092b96L72K9l07J45K03l25K94L9l10J76O0j37J22q5j6K88l01J23K3M6l29k1K26
$$ -296 76 105 -202 -57 146 -179 115 154 -156 20 80 -57 65 -20 -36 252 -49 74 97 143 -186 -207 19
2115A9J35k9j61J46n9k39J63O6QKj13Q3J10k28J03j8J53q2l1mK9j74O2k39L79
$$ 19 154 125 -36 110 51 -188 -25 41 49 51 -62 21 131 -97 6 -12 141 59 28 24 53 -121 -59 -298 81
2140H1l23J16J33l0k4k6pQ9m03O16k53o9Q7J58n4j88L69k87J87j27j37K69q8k53
$$ 81 -242 -126 7 -23 -47 -73 -80 9 -394 222 -31 -100 -13 145 91 -97 272 -15 172 45 -92 177 89 -164
2164a64L35r0o2q2R5R2P9K5p5k20lK88l79J48J07j38k96N10k0k08N3j86J96J38
$$ -164 171 81 19 -63 32 124 203 228 153 -67 -70 218 -161 -13 94 -44 -340 170 150 -58 -5 -191 5 143
2188A43qj75OK7J92l77K30m7r2o3J50l7O8j24K52l39J47K60j48j76j65M23m3j74
$$ 143 135 -40 -34 -7 185 -192 38 -9 -101 -164 -14 -51 17 -107 145 -194 -47 213 65 -111 -276 147 104 -70
2212g0J74o8J25k39L73k09j34K10l81M27k72K27k18J85K4L5k69j47M05l40J52
$$ -70 104 36 161 -78 295 86 -48 162 -219 208 -64 163 -55 130 154 189 -80 -227 178 -162 -10
2233a0j86J0L92o0k19j94L34M6K60m49N7Q8L2l29M70l35K08J25k69k20L14j35
$$ -10 -196 -186 206 146 -73 -267 67 113 373 -76 -19 69 101 -228 242 -93 115 240 -29 -249 65 -70
2255g0J49O5n6o3q4k18L24k42K04j97M20J86l14k3p9j62R3L0r1L05J6j34J59p6
$$ -70 79 144 88 25 -59 -277 47 -195 9 -188 232 418 104 81 2 -160 -67 -37 -128 177 193 59 218 142
2279A42J9j69j98J04O9L40j12l06K00k00J99j63J52k67K37j8j12j2J18j09K04
$$ 142 161 -8 -206 -102 -33 307 195 -111 89 -111 88 -75 77 -190 47 29 -83 -95 23 -86 118
2300A18n5q3P9K56l82J55j70o8J04K8l8J09j4k45K82N1j15j06K64n5l2j33M1k04
$$ 118 63 -20 59 315 -67 88 -82 -150 -46 -18 -56 53 39 -206 76 127 12 -94 170 115 83 -50 -9 -213
2324b13K41p5J00k44K98K24l64J86k81l6J9pK73j0p2j13k5L28m90L59j45K05k60
$$ -213 28 -47 53 -191 107 331 -33 153 -128 -164 -145 -152 121 111 39 -74 -99 229 -261 98 -47 158 -102
2347a02K46k14j8K70l69k9Q4J32L5K7j02j24OQ9J20j22J13k7O2j23n7R8J45l4
$$ -102 144 -70 -88 182 -187 -216 -132 0 35 62 -40 -164 -158 -69 51 -71 42 15 77 -46 -103 -5 140 106
2371A06r2n3O1J30R3m85L54k42K15r8j99L19r0o4N9k41K75j81J65k29J45L1Q6
$$ 106 14 -39 22 152 245 -240 114 -128 87 -11 -210 109 19 -45 14 -227 48 -133 32 -197 -52 -21 65
2394F5L63m72K55l27p9J27K66k54R8j57J90L8k34K27QNL7j53J90j39m14M47r0
$$ 65 428 -44 211 -116 -195 -68 198 -56 42 -115 75 113 -121 106 114 119 156 3 193 54 -360 87 -3
2417cR5k30j32J47M2M3Pk7P7k09L69k42R2L6pj09J06P5k31Q0n5J34j30O3r5M8
$$ -3 92 -138 -270 -123 -81 -38 -31 -58 19 -190 179 -63 29 65 58 -51 55 130 -101 -21 -76 58 -72 -9 -104 -56
2443e6k09M60j85J9o8J70K9j0k5J87p7k57%k61K35n1L7J14k5L3j12m2K19j62j59
$$ -56 -265 195 10 29 -39 131 160 150 125 312 235 -22 -22 -283 -48 -99 -62 52 27 60 -52 -94 125 -37 -196
2468a96M8K68k24l0O3R2M6P2m6k35J73Q7k47L02j54k7J6j24J15l01N0J32Q9L5
$$ -196 -148 120 -104 -134 -71 21 67 139 93 -142 31 118 -129 173 19 -8 8 -116 -1 -302 -252 -120 -31 4
2492Do5p0N4K9J16n3l1P0RK1k11P1J60q8l5l9J64j84R1kp3m8j16K85j50K26l34
$$ 4 -61 -131 -77 -48 68 15 -16 54 63 84 -127 -56 104 16 -19 -58 106 -78 13 11 -62 -110 -226 59 -91 135 -199
2519a99pk46L55j06J48L0k0j0L1j20K9J29k6j06R0J74k43n7L1J68n8p7L1M00m56
$$ -199 -206 -452 -97 -203 -55 -25 -45 -55 -24 -144 -115 14 -12 -118 -28 146 -97 -154 -123 45 -13 -90 -59 341 -115
2544a15K25j21j0Oq7L02j61M5j6J43l37J54j09K18j42o9K81mk46p0L16l69K08
$$ -115 110 -11 -21 -15 -102 200 39 84 68 211 -126 28 -81 137 -5 -74 207 203 -43 -113 203 -166 42
2567D2L1j04J80j9j45j68J16k4J81k81K36q6j67J53rK37j32J65J2m69M63l45K64
$$ 42 73 -31 149 130 -15 -183 -67 -91 90 -191 45 -41 -208 -55 -64 173 41 206 218 -251 212 -133 131
2590A31k52J34J92j63J21pj7l30L53r9j81n6OJ91K18j13M7J69m96O9J87j0J04
$$ 131 -121 13 205 42 163 156 139 -191 162 63 -118 -174 -168 23 241 128 175 344 -152 -83 104 94 198
2613A98q1j74q5J00J1J64K2j70j11Q1J66k28j19M37j37l0M0j48K39k45J67q0j6
$$ 198 117 -57 -142 -42 -31 133 155 -15 -126 -45 121 -107 -226 211 74 44 84 -64 175 -70 97 17 1
2636Ap0q6J68J8L4R1K32l46j18J52J7r4j29l4L4K14K3r7j52J73j04M37l46j67
$$ 1 -69 -155 13 31 65 156 388 42 -76 76 93 -1 -130 -164 -130 84 107 10 -142 31 -73 364 18 -149
2660a49K04j80N9j58L26Kr0J4n39J96L30Q2M2k7j3L3l18K53K05k5k00j98Q2k2
$$ -149 55 -125 -66 -224 102 104 14 28 -511 -315 15 97 139 112 99 132 -186 67 272 247 47 -151 -69 -91
2684i1K24q8L5L8Qo9j55n8j39L48Jk98J03J30p3j00L14L0k95J36L39l33j08m8
$$ -91 133 45 80 118 126 57 -98 -156 -295 53 54 -244 -141 -11 -84 -184 130 160 -135 1 340 7 -101 -149
2708a49M6k4K67l83J71K33O6l22r4k0L3R6Q5j16L17p2j08r1j30N31j50k95L27
$$ -149 -103 -127 140 -243 -72 161 227 -95 -189 -209 -176 -80 5 -111 206 134 26 -65 -195 336 186 -109 218
2731B18j88l14K38j02K84p5j80J99R9k51j46K63k24L89p0j57J19j11j43N6l1J47
$$ 218 30 -284 -46 -148 136 61 -119 80 179 -72 -218 45 -179 210 140 -17 102 -9 -152 -96 -127 20
2753B0J11P7j1j39k3m21J70J10M10p9l90j4n6L3J57l4j9K05k12J07R3m1j81L4
$$ 20 131 208 197 58 35 -386 -216 -106 304 225 -165 -179 -235 -202 -45 -79 -98 107 -105 2 95 54 -127 -93
2777i3K74k00J8L30n74J16l2K6J52L43m00K71k66K31m34O1K05p7q7J91M2j66K50
$$ -93 181 -19 -1 329 -245 -129 -161 -135 17 360 -40 231 -35 196 -238 -177 28 -49 -136 55 97 -69 181
2800A81N1m53K39jQ8L1l02K07j31J0KRK6J15j27J09l50L48j76L8l24N36m58L43
$$ 181 232 -221 18 17 105 136 -166 41 -90 -80 -78 -69 -43 72 -55 54 -296 52 -124 -86 -410 126 -332 11
2824A1n9l3K37j66K57k12k07L91j66O2J29k00k20J77k6R0k26P2k9N7j21K62J08
$$ 11 -48 -81 156 -10 247 35 -172 219 53 115 244 44 -176 1 -25 65 -161 -89 -118 -61 -182 80 188
2847A88m04L32k71J17K72p3j03j43J5M6oJ95o6k82M23l32K89j28k28p7K64n9j74
$$ 188 -216 116 -155 -38 234 161 58 -85 -70 -24 -30 165 99 -183 240 -92 197 69 -159 -236 28 -31 -205
2870b05K16j65K89k66J13k50J89J99k26L43j01k7j53n0J79r3Pj8m1L7O5k01J18
$$ -205 11 -154 135 -131 -18 -268 -79 120 -106 237 136 109 -44 -94 85 -8 -1 -19 -60 -23 42 -159 -41
2893d1J65m13K54K55l39r9L69n9l02L02l6k3N1j60J65o6o8N08q63P02n4n25J46
$$ -41 124 -289 -35 220 -119 -218 151 92 -210 92 56 33 84 -76 89 23 -45 463 -400 302 248 -277 -131
2916a31K57n4M2n4m3k16K57k1J8k3N7Jo5p9J43j72P3K72k92nM0k75K93p8j63P8
$$ -131 126 72 114 60 17 -199 58 37 55 32 89 90 25 -54 89 -83 -10 262 -30 -35 5 -270 23 -55 -218 -140
2942a40J16nR0j41j16J09L03k08J4J16k07K04K5k31J37o3k06L76j24j82J80r6
$$ -140 -24 -29 61 -80 -196 -87 216 8 22 138 -69 135 160 -71 66 3 -203 173 49 -133 47 -49
2964d9l6K78j51k71K56J0j36l7L56m25J49M7j16K31j84J61k59J53K8K42j24j52
$$ -49 -85 193 42 -229 27 37 -99 -136 220 -205 -56 -9 -125 106 -78 83 -176 -23 5 247 123 -29
2986b9j01J31J15k71Q8ro9J98j9k31K00j81l5J04J21j11N0J08K1j14M5k7J30j85
$$ -29 -130 1 116 -155 -67 -76 -145 53 34 -197 3 -178 -213 -109 12 -99 -49 59 80 -34 11 -16 114 -71
3010g1N9k87K62J77l31K45j29j05J49j2j27n0L33l42J46R4o0k3J76n2o9k02J84
$$ -71 -12 -299 -37 140 -191 54 -75 -180 -31 -43 -170 -220 113 -229 -83 11 -49 -72 104 52 -17 -219 -35
3033c5J44j13J58j14J9k31P3K76K7l12K20p8RJ33j3J51l74j07M7Q5m7J42k83R4
$$ -35 109 -4 154 40 59 -172 -99 177 204 -108 112 34 43 176 163 314 -60 -167 -120 -35 -82 60 -223 -129
3057a29J4j3J54n9J33o2J92n3l8N0k53K43k65N4j48J88K75j68K52m31j82M75k2
$$ -129 -115 -128 26 -33 100 38 230 177 139 189 -64 179 -86 -32 -180 8 283 115 367 -64 -246 229 207
3080B07k52n6Q6j60K62j30M8j88M8Q0P6j0n5J96j5k9P3k37N1k94K39Mm5J73n7
$$ 207 -45 -101 -15 -175 87 -43 5 -183 -135 -55 21 11 -44 152 137 108 181 -56 -5 -299 -60 -56 -101 72 15
3105A5l3Q8K0l20L22p2L6j33L50k06o9j46N2R8N7j34QK37j46r1K23j35k84O00
$$ 15 -18 70 90 -230 92 20 56 -77 273 67 -2 -148 -96 2 59 -75 -67 170 24 -67 156 21 -263 337
3129C37p1l64J48J59k71L28j86l61M74j75J56j59j17K24j85k8l7P9N9j42L47m86
$$ 337 266 -98 50 209 -62 266 80 -281 193 18 174 15 -102 122 -63 -91 -128 -49 10 -132 215 -271
3151b71M69p5j35J36m78L95j48J41J79k76J79p4K5J21j95qL9k5O6k42N0J80k64
$$ -271 198 123 -12 124 -354 41 -107 34 213 -63 116 42 67 188 -7 -15 24 -1 65 -177 -127 53 -211
3174b11L42k75J17K09k52K8J68K3j80o7J95j24j00J50l6M2J9J6J29k7k40J07k03
$$ -211 131 -144 -27 182 -70 -42 126 149 -31 -98 97 -27 -127 23 -13 29 48 64 193 166 -74 33 -170
3197a70K38N8j8k46O3J7K45j15l00L08J02j97r8L10m08K26k5n3K07j01j7o6Mj43
$$ -170 68 126 108 -138 -75 -58 187 72 -228 80 182 -15 -113 197 -211 15 -10 -63 144 43 26 -40 -36 -179
3221a79J88k0O1J15j46j79K24k44J57J87n5j55o4J77J64m11J97M8J2j48L0J32
$$ -179 9 -11 50 165 19 -160 64 -180 -23 164 109 -46 -110 67 231 -180 17 65 77 -71 -41 91
3243I1p8R4j72L30l90J27J57j92J22J72k88J55K2j86j39R9j02oQ7L12JO9k93k7
$$ 91 13 107 -65 265 -125 2 159 -33 89 261 -27 128 150 -36 -175 -76 -178 -184 -97 215 216 285 -8 -35
3267c5Q6J7J93k65J25l59J45K2lo7L99n3k22J04NN5r2j37o7J81j00J67j22J02
$$ -35 51 68 261 -4 121 -238 -93 -71 -74 -141 258 205 -17 87 92 147 55 -82 -149 32 -68 99 -23 79
3291G9J37k97J78j24J87j23j75J37J01q2l5l5K16j63j48J42L9k4M47n23K39k61
$$ 79 216 -81 97 -27 160 37 -138 -1 100 18 -17 -52 164 1 -147 -5 34 10 457 -66 173 -88
3313h8K25q8k64L90n33M60m45O16m12K08j21n6P4l25M22j41J07Lop0L09j1o9%
$$ -88 137 49 -215 175 -358 102 -343 273 -139 69 -52 -108 -34 -359 63 -78 29 32 26 -44 265 254 185 185
3337A85N3k63Q3j04J2N5j67Q4L23l56P4L7j94J33M44p80N92l06j18J98m3J1o3
$$ 185 238 -25 58 -46 -34 21 -146 -62 261 -95 -21 16 -178 -45 399 -381 211 -95 -213 -15 -58 -47 -110
3360a10n0J67j46p4o5L66l39J56K30m05M64n2j67J93m48L30M6j65K75l38K71k74
$$ -110 -160 7 -139 -213 -278 88 -251 -95 135 -270 194 142 -25 168 -280 50 96 -69 206 -132 139 -135
3382a35L36j31p3K7J47j58m0J63l17R6Q7L4K33l28K62k11J08L0n6j06LJ83n6N0
$$ -135 201 70 -3 24 171 13 -27 136 -181 -85 2 36 269 -59 203 -8 100 130 74 -32 -29 154 98 148
3406A48k87q0L46k28k0K15K02J9m33JJ25J6Q4p1r8L39l02L0J94m02L20j75J75
$$ 148 -139 -219 127 -101 -121 94 296 315 -118 -117 8 24 108 37 -61 278 -24 6 200 -202 118 -57 118
3429A18JQ8l29J0J2Q5J85o7j14j86J57N6m2q2o7N8J28k5K3j65j16J73J13K75l87
$$ 118 119 207 -122 -112 -100 -15 170 103 -11 -197 -40 16 -26 -108 -175 -117 11 -14 9 -156 -272 -99 14 289 -98
3454i8N4L8J3R2M2J8j25k5J38j49J99j20J1j68rp5R7J15O9k30L28k88p0K07j02
$$ -98 -44 -6 7 99 141 159 34 9 147 -2 197 77 88 -80 -89 -164 -67 48 117 -113 215 -73 -143 64 -38
3479c8mJ60j9K7l38L3K14m0q3L4k3j09J69K4M0J7r5J69k32J16j59J00P6j24k4
$$ -38 -42 118 99 126 -212 -179 35 -5 -88 -54 -77 -186 -17 7 47 64 -31 138 -94 22 -137 -37 39 -85 -109
3504a09j10M25q1k76K44j81r0K22k53K94j99n2N11k98J65m55r4J69L33J4j38j68
$$ -109 -219 206 125 -151 93 -88 -178 44 -209 85 -114 -166 345 47 212 -243 -337 -168 165 179 41 -127
3526a27L2J18m27L90q1K80r9j68L40l06j22J35L20k82K89j19j69L55k61j11J03
$$ -127 -95 23 -404 -14 -95 185 86 -82 258 -48 -170 -35 285 3 292 173 4 359 98 -13 90
3547I0r7M5J5n3j61K63M7k25l7L0R3PQj33n0J02j47K88m94N50k76k8J63K9j01
$$ 90 -7 38 53 0 -161 102 149 -76 -113 -83 10 17 25 -108 -158 -56 -203 85 -409 141 -135 -163 0 29 -72
3572g2j68L51j42P9J14n2n9M7l34K25j8J27M0J34l79L36n31M95k35j28J33J1q9
$$ -72 -240 111 -31 48 162 110 51 98 -236 -11 -29 98 138 272 -107 229 -302 193 -42 -170 -37 -26 -115
3595a15J54r9k19L49n7J54j73j42L70k05o3J41k89L22j52L07n46R3K31j77J95
$$ -115 39 -60 -279 70 13 167 -6 -148 222 17 -46 95 -194 128 -24 283 -263 -170 61 -116 79
3616G9k30J29j29p4J17J64j71K11j26J7j20k9K49m3K3Kj82R2o1L43j61nj84J78
$$ 79 -151 -22 -151 -225 -108 56 -115 96 -30 -13 -133 -162 87 44 67 69 -113 -21 -82 261 100 95 -89 89
3640H9k42J00L10l9n05K51L2OR5l70K93J34l0L1l83K60J11m11M62k91J80j50O9
$$ 89 -153 -53 257 218 -287 -36 -4 2 97 -273 20 154 124 155 -228 32 143 -268 194 -97 83 -67 2
3663Bo2O7J2j79j7J54j12K05k45K46k0p0k15J42j64O5J51J67k72J09J29M2n1j21
$$ 2 -60 7 19 -160 -177 -23 -135 70 -175 71 51 -19 -234 -92 -256 -191 -40 127 -145 -36 93 135 84 -37
3687c7N7k04K84j92J17j92J92j19L4k15K48o5j03M34l00RK86o9k69N6k0j52L60
$$ -37 20 -184 100 -92 25 -167 25 -94 -60 -275 -27 -92 -195 239 -61 -52 234 165 -104 -48 -68 -220 140
3710A40j77N3k5K13o3k51L65n05L04j9j95M18k43j97J69L1K38m64K57k9q2M8Q6
$$ 140 -37 16 -9 204 141 -110 255 -250 54 35 -160 258 15 -182 -13 18 256 -208 49 20 -62 -14 72
3733G2o3K22k39O5j14Q6j0o0k41L43J03p6j75K09J11l7j08j17J31l3L4N5k71l6
$$ 72 9 231 -8 57 -57 29 19 -41 -282 61 164 88 -87 122 233 196 88 -29 102 69 103 158 -113 -149
3757a49K26j01K47j31l17K76KJ20n1o6K38l10n0k5m8R0n6L8p9K52l02J50j7k23
$$ -149 77 -24 223 92 -225 51 53 173 122 56 294 -16 -66 -91 -139 -49 -105 -67 -146 106 -196 -46 -63 -286
3781b86M08j90L9L0L8k80J12kK01j94L4J93O5j61P2N5k68Q7K46l27K91j65j04
$$ -286 122 -68 -29 1 39 -241 -129 -131 70 -124 -90 103 168 7 79 134 -134 -47 199 -128 163 -2 -106
3804a06K26p7j11O9K17k14j46m2L84k28n9n1J62K40o01K73m2Pm1R1L2r0n9M9K18
$$ -106 120 43 -68 1 218 4 -142 -184 200 -28 -87 -138 24 264 -337 -64 -106 -99 -140 -49 -17 -107 -166 -117 101
3829A01k82P2J30J47l7j03P0j62L0Q0k81N03M8j20q5k59J29J74k66K41j74J03
$$ 101 -181 -109 21 168 131 28 98 -64 -34 46 -235 268 316 196 111 -148 -19 155 -111 130 -44 59
3851E9l11M44j42N6O1k5k14J01Q6j28p9P0n0j96j74M67j62j6K41l25K13m3J75
$$ 59 -252 192 50 106 167 142 -72 29 115 -13 -92 -22 -72 -268 -442 25 -137 -153 88 -237 -24 -67 108
3874A08j17J48J10l44j62N09m22J48j15O6R4k9j0J56k33o4K52k85L55k15o2K4
$$ 108 -9 139 249 -95 -257 252 -170 -22 -137 -71 23 -6 -16 140 -93 -157 95 -190 165 -50 -112 -88
3896h8q0J67k21J55J16k03J96kj04J92k41Q6k16N0N42j79j75J11k00K89j68j07
$$ -88 -168 -1 -222 -67 49 -154 42 40 -64 128 -113 -27 -243 -193 349 170 -5 106 -94 195 27 -80
3918h0j30M28j49K1p9K24k97K44k46jl0J09n3K01l68J0J95K4j83pJ83j45L28l13
$$ -80 -210 218 69 90 11 235 -62 182 -64 -65 -95 14 -39 162 -206 -196 -1 23 -160 -167 16 -129 199 -114
3942a14J54j72K26j9J55j60p8m9K36l83K48J91l12L0k8M7K52j02o14M20k2J85
$$ -114 40 -132 94 75 230 70 -8 -57 179 -204 44 235 -77 -47 -75 -28 224 122 -492 -72 -94 91
3964I1M2j79l75M21j19J53j04K62l02J55r3J96j61k71K10K29j45j42J32k29N19
$$ 91 133 -46 -421 0 -119 34 -70 192 -110 45 -48 148 -13 -284 -74 155 10 -132 0 -229 290
3985B90n08J20p3J64l6J11L6q4k10K21j94K6J98j43J2J71J45k72J02P4k68J22
$$ 290 -218 -98 -171 -7 -43 68 104 20 -190 31 -163 -137 61 -82 -70 101 246 -26 76 150 -118 4
4007DL8pL15k53P0k58j14L98k62J17j50R0j5M7K67j61K4j22j71J76KJ15P6k85
$$ 4 42 35 350 97 167 -91 -205 193 -69 48 -102 -12 -27 20 287 126 150 28 -143 33 35 150 226 -59
4031e9K18j96l4J0l62O68n8r7n0j7J92n46K23j71M28j58rJ68k08P6J3q1j2K0K0
$$ -59 159 -37 -71 -61 -423 245 187 90 40 23 215 -331 -108 -279 149 -9 -18 150 -58 18 31 -50 -62 -42 -22
4056b2J97j13l63L21j8j25J39N4j02q1K13j94J11P7j88O1j83L31r5r0K0M5k44
$$ -22 175 62 -301 20 2 -123 16 70 -32 -113 100 -94 17 94 -94 -33 -216 115 20 -70 -50 -5 -249
4079b49J20L3R4n7l6LP8K02l94M07k75J44p8j20J98rj13K29j90j94K67l19L67
$$ -249 -129 -96 -2 -59 -95 -92 -14 188 -206 201 -74 70 -8 -128 70 61 -52 177 -13 -207 60 -259 108
4102A08j74j42J27J34q3j33J40j29O1L0j11l4K14l20M49k23N66m79J77N1l19K63
$$ 108 -66 -208 -81 53 -30 -163 -23 -152 -91 -61 -172 -206 8 -312 137 -86 480 1 178 229 -90 173
4124A73k34R1p3j33J16J25J07k93N2K15l59L00O1k91K6o1L7J64k84q8M08j38p6
$$ 173 -61 30 -43 -176 -60 65 172 -121 -69 146 -213 87 148 -143 -117 -178 -141 23 -261 -349 59 -79 -155
4147a55K98n2J30l37J9K35k00m5J76j29J43k5p3K02l90Q8M4R3r4j54M03l15m2
$$ -155 143 91 221 -116 -97 138 -62 -107 69 -60 83 58 -15 187 -203 -115 -71 22 -72 -226 177 -138 -180
4170a80L98j45j41K04r4k41K06K29q6k77J44o4j62K76k22P5J61n6o8R9n9m0K94
$$ -180 218 73 -68 136 42 -199 7 236 150 -127 17 -47 -209 67 -155 -80 81 25 -43 56 -3 -43 251
4193B51l43J39m7M0l1MJ68k7j43%k77J89M0J73j2J55m95Q0L73j25k75K73k85N4
$$ 251 -92 47 0 40 9 13 181 154 11 11 -266 -77 -37 136 124 279 -216 -136 237 112 -163 110 -175 -121
4217a21K43j33k5o2Q6N6R3%o5j97r5J46j8q6K66r6J42j59K13l90K00q6R7P6j22
$$ -121 122 -11 -36 -98 -12 44 137 137 72 -125 -220 -74 -92 -178 88 -8 134 -25 188 -202 -2 -88 9 85 -37
4242c7j95PL4K90j84K4j29L25l49K43J86k16k5q9P3J14j21Q6O5k12J47R1N1q1
$$ -37 -232 -225 -191 99 -85 -61 -190 135 -214 29 215 -1 -26 -115 -42 72 -49 37 102 -110 37 128 179 98
4266I8k22J92K08m08L04l2j36j9J22k5o8j56M39m40O2J4j4K2p3J65O7J2m8J04
$$ 98 -124 68 276 -132 172 140 4 -15 107 82 14 -142 297 -143 -81 -67 -81 -59 -132 33 100 112 64 168
4290A68l19K5j57L82k20J30K14l25J44P7l56J36K54k18J73K06l92L45k00l4J3
$$ 168 -151 -126 -283 99 -121 9 223 -102 42 119 -237 -101 153 -65 108 314 -78 267 67 33 46
4311D6l1J57k32J21K6j49q6K43K4J10m09n8N42j97j16p2J17k68J08N5j83K83K3
$$ 46 15 172 -60 61 87 -62 -148 95 119 229 -180 -238 304 107 -9 -81 36 -232 -124 -69 -252 31 54
4334E4kl6o3J43k82N6K06l40M78j83j66K2K01O2k58r2J67J51O7k2o8q3R2k07K12
$$ 54 52 16 -47 96 -186 -130 76 -264 214 31 -135 -113 88 150 -108 -200 -33 118 185 163 95 12 104 -103 109
4359A09l11J48J46k13M13k18l6Q5p9k3q1l4K22l16O8L29j16j36K11j1l41O35k77
$$ 109 -202 -54 92 -121 292 74 38 123 44 21 -60 -94 128 -188 -120 209 93 -43 168 157 -184 451 174
4382A74J13m59K54J28j8l4k62J99o5l4p0L54k23R8j40L06l34J01j24J27J10k18
$$ 174 287 -172 82 210 192 158 -104 95 30 -4 -74 280 57 155 15 321 -13 88 -36 91 201 -17
4404a7L8p4n6K00k59K09k67J16L8J95L0j20K02l65O9k7J62K6n8j48K67K1k02J43
$$ -17 21 -53 -109 91 -168 41 -226 -110 -72 123 153 33 235 -130 -61 -88 74 100 42 -106 161 182 -20 123
4428A23r5j37j1m5o3K51R8l16K48K9Po7j02n7J08JM3J24o5j5o3L01l31nL1Lp6
$$ 123 28 -109 -120 -165 -228 23 121 -195 53 82 89 22 -80 -137 -29 -28 15 139 74 59 -4 297 -34 -39 -8 -5 -81
4455h1K23J0j65P7j72M00k50M2j01l01M26j12P9j05O1m4QJ05R5m15J83Q8p2o1
$$ -81 142 152 -13 64 -108 292 42 84 -17 -318 108 -4 75 -30 31 -13 -5 100 195 -220 -37 51 -21 -82
4479h2M6O0K44l86K34Qj16n4L01m20J57r8Q3J91k42J9l1k43J21L08j50qP9j04
$$ -82 -36 24 268 -118 116 124 8 -46 255 -165 -8 -106 -23 168 -74 -55 -86 -329 -208 100 -50 -58 21 -83
4503h3l5J51l2P6m2l4j27Q7n1M4k69M09j30j33J66J10j59K8Q9j64j56L97r6l79
$$ -83 -118 33 1 77 35 1 -126 -39 -90 -46 -315 94 -36 -169 -3 107 -52 -24 65 -99 -255 142 46 -333
4527c33J42K52k12J35J89j24J59k46K19p5j32o4J57M8j15o3M1M4q3qk9K65O4r3
$$ -333 -191 61 -151 -16 173 49 208 -38 181 106 -26 -90 67 115 0 -63 -22 22 -61 -69 -98 167 231 138
4551A38p8P3j95J78j13J51j83r2j1J4J72J48n0K73m24o4Q4r5j87J65M8P2k6oJ94
$$ 138 60 133 -62 116 3 154 -29 -121 -132 -118 54 202 152 425 1 -63 21 -74 -261 -96 -48 24 -2 -8 186
4576A86j97P9j54K70q1K14l49k5J67k74J27j00j77J21J87R1K3j22k41K39n9k11
$$ 186 -11 68 -86 184 103 317 -32 -57 110 -164 -37 -137 -314 -193 -6 85 108 -14 -255 -16 -75 -286
4598b86L36k77k2N39j63j60j6k68L86J4j69j62M14j83J8R1j48rJ36K52l30K09
$$ -286 50 -227 -249 290 127 -33 -49 -317 69 83 -86 -248 166 -17 1 92 -56 -65 71 323 -7 202
4620B02j16L7J2j8q6j50J66J07m1mm7j04j10L25l74K34n7k7J70l8j58J90j66J56
$$ 202 86 123 135 117 31 -119 47 154 113 109 62 -42 -152 173 -201 33 -24 -51 119 81 -77 113 -53 103
4644A03k8J1l0q2N6r9j2j80J94M4K39j05k36O6J61j02j05J55j68Q5J86r5k30j9
$$ 103 75 86 56 -26 30 -69 -81 -261 -67 -23 216 111 -125 -59 102 0 -105 50 -118 -33 153 58 -172 -191
4668a91q1M0K87j07l9J60j35Q0kl9J17n1j2k6L17k90j74J45J13r2j78K2L21j81
$$ -191 -272 -232 55 -52 -91 69 -66 14 12 -27 90 39 27 1 318 28 -146 -1 112 20 -158 -136 185 4
4692DJ12J13j03l37K88j32j66J64j56L75k87K20l54J79K75j20n6j56K07j94J83
$$ 4 116 229 126 -211 77 -55 -221 -57 -213 162 -125 95 -259 -80 195 75 19 -137 70 -124 59
4713E9j18k14K27o5M03j80k49q8K43O7J03j1j53J13j28k44K53p7K04L3l38Q7k4
$$ 59 -59 -273 -46 -111 292 112 -137 -225 18 85 188 177 24 137 9 -235 18 -59 145 178 -160 -73 -97
4736i7K64K2n15K71j7J17k26K20J15j96j06L96j88jj38K1M9K60m27J38mN6k06
$$ -97 167 189 -326 -55 -72 45 -181 39 154 -42 -148 248 60 59 -79 -58 -9 251 -176 -38 -42 14 -192
4759a92K54Q1j89j16K1K24K6J36j11j84J67J28k87l4j2K61l55R8o9K24J10nl78
$$ -192 62 143 -46 -162 -141 83 109 245 134 -50 117 245 -42 -76 -88 173 -182 -84 -153 71 181 176 -202
4782b02K89j91J44P0n2O2p4jJ10R4k30j55lN02p3m96k0K17n2O4j36J5O3J01j80
$$ -202 87 -104 40 110 58 120 46 45 155 249 19 -136 -139 363 290 -206 -226 -9 -61 3 -133 -118 -55 46 -134
4807a34J89l71L95j82k4J13Q5j77K74j47nk5R7k49J20K26l11K33l2k3k65L51k99
$$ -134 55 -316 79 -103 -127 -14 71 -106 168 21 16 -9 88 -161 -41 185 -126 107 75 52 -213 138 -161
4830a61M32m32N1J45M6j58P5l18L52k8p4M47n54mj16L76k43K52k02O7j44L69j17
$$ -161 271 -161 -110 35 81 -77 -2 -320 32 4 -70 377 -177 -181 -297 79 -164 88 -114 -47 -191 178 61
4853F1k07oK2m5M1K17j07J17k60J55j15J3r7J7J25K55l32K60J2R7l86k09N65l11
$$ 61 -146 -152 -130 -175 -134 83 -24 93 -167 -12 -127 -114 -211 -194 -69 186 -146 114 126 223 -163 -372 193 -118
4877a18R2q7k4J42K1k46P1j5K98k56J73Q3j25L5J7P5j13O8j8k0l8J0j86J18K05
$$ -118 -26 -113 -137 5 26 -220 -149 -164 134 -122 51 134 9 44 61 136 23 91 73 53 15 25 -161 -43 162
4902A62j18o0n2Q7q6j67L19k59j32L68j38j4J1l9m5J70O5j50J63j88J07M1jj80
$$ 162 44 -16 -68 19 -67 -234 85 -174 -306 62 -76 -90 -79 -118 -163 7 72 -78 85 -103 4 45 44 -136
4926a36K98l6k76K85j84J78L3n5J39m28L47l00L80p1k96M1J13K1k00K73j45R4
$$ -136 162 126 -150 135 -49 129 162 107 246 -182 165 -135 245 174 -122 -81 32 53 -147 126 -19 75
4948G5l02L57j39l9M39n16m2K55j19J96k65J22q9kk8J53k57O4M26n03K96J1l0
$$ 75 -227 130 -9 -48 391 -125 -167 88 -31 165 -100 22 -67 -69 -97 56 -201 -137 289 -214 82 93 63
4971F3Q3l41J13L0Q2j53J42J01j70j50J07J39r6J79n5j68j6M53k50R9j50l1K91
$$ 63 146 -195 -82 -52 30 -123 19 120 -50 -200 -93 46 -50 129 74 -94 -110 343 93 192 42 11 302
4994C02k64l3k5L78k99j75N8J21j83j8J56l34L57Q1j52J10l18K72j73J57n0k25
$$ 302 38 5 -20 358 59 -116 -58 63 -120 -138 18 -316 41 122 -30 80 -238 34 -139 18 -32 -257
5016b57K61M4K9k04K82k41J1R5m5J65j7k45J25k9J65k39l8J66J64r9r8Nn0j00
$$ -257 4 48 77 -127 155 -86 -75 20 -25 140 123 -122 3 -26 139 -100 -138 28 192 93 -5 0 -50 -150
5040a50j8J54M0M6l6L26n28K85m9k41M24qj61l35R3K10K5o4r7RJm9Q0M9J07l72
$$ -150 -168 -14 26 72 36 362 -166 119 70 -171 253 245 84 -251 -158 52 77 13 -84 -75 -74 -123 -43 6 113 -259
5066b59K45kJ5k45M70m10J85P7k37K80j17j10K5R1l03M04J2j43j05J12Rq7K45
$$ -259 -14 -16 -1 -246 224 -186 -1 76 -161 119 2 -108 -83 8 -295 109 121 -22 -127 -15 -6 -93 152
5089A52k57K48l38K34m4M3M5J68qk17j62L3P9J23j26K7n5J43K06l24J4M7J41l57
$$ 152 -105 143 -195 39 -5 38 83 251 243 26 -136 -103 -24 99 -27 0 -55 88 294 -30 -16 31 172 -185
5113a85K98m3J68l06M85k32J26j56l13k8J22k04P4r0M46k61r9J36k1J59l22K52
$$ -185 113 70 238 -68 417 185 311 155 -158 -186 -64 -268 -194 -284 162 -99 -198 -62 -83 76 -246 6
5135FK6kpJ18O7k97L06k33L6j00n4J55J57l78K49r5M3mk01J92j75M24k16Q2P7
$$ 6 32 30 23 141 208 -89 217 -16 20 -80 -134 21 178 -200 49 -46 -3 -7 -208 -16 -191 233 17 99 176
5160A76k94j96J52K07k39K35J02p5m5J3nj3n9m2k60M81m5k1Q8q0J8N4qj17n1j0
$$ 176 -118 -314 -162 45 -194 41 143 68 23 36 31 18 -41 -83 -343 138 93 72 160 80 98 152 144 27 -24 -34
5186c4j59J61J74j80K76k88K06P2r2pq4K16J64l63n5Lj9J20O6k57R2Q8K5j81m8
$$ -34 -193 -32 142 -38 238 -50 156 228 136 129 45 261 425 62 7 10 -9 111 177 -80 12 100 125 -56 -104
5211a04pO5n2P8J65p4OP4p5l7k35N26j66j40Q9o2rj7l6J36k26J16J56j72m2N2
$$ -104 -111 -46 -98 -20 145 71 77 151 76 39 -196 330 164 24 113 51 42 25 -11 125 -101 15 171 -1 -43 9
5237IK0j2O6k07J58P2j7j0lk41P0k37K51M04k47K2j72J13J7J88m7l21M1o0p3K05
$$ 9 29 17 83 -124 34 106 89 79 76 -165 -95 -332 -81 323 76 98 -74 39 56 244 197 -124 -83 -143 -216 -11
5263a1j3l37M79j49J55j20p3k1j51L74k91J9N1R1P5j03K07m56L58j67J27J04k18
$$ -11 -24 -361 118 -31 124 4 -69 -90 -241 133 -158 -139 -88 3 78 -25 182 -274 84 -83 44 148 -70
5286g0n1J96k36K79k3r7J01j41J17l62J29K25o5m3k2j72M14k6j60N6r6K0K8J63
$$ -70 -121 75 -161 118 95 -2 99 -42 75 -287 -158 67 2 -41 -63 -235 179 153 -7 49 -47 -27 1 164
5310A64l97L20k40jL51k37Q4jn1j13JK30k54k5M46n38M06n9l7O9j77M3P7L7j85
$$ 164 -233 87 -153 -154 197 -40 44 43 -8 -121 -120 110 -144 -169 277 -261 145 86 49 118 -59 -16 61 98 -87
5335h7R5L8j61K38j02p8p0Jk8M54m64Q6L2j38M0J7J07N3j79N5nk73L43K48l61
$$ -87 8 46 -115 123 21 -57 -127 -126 -154 300 -164 -78 -46 -184 -144 -127 -20 33 -146 -91 -96 -369 -26 222 -139
5360a39J6L16r8L6j84Lj2N3Q8j41K00k74L21j77k2J22L6j73j25Q5J25l5j36k02
$$ -139 -123 193 95 131 -53 -50 -62 -9 79 -62 138 -136 185 8 -14 108 144 -29 -154 -69 56 21 -115 -317
5384c17M10p6l96L40l2j61K59R4k28J64k32M2Q9q8k5L26q8j13K04k58J15r1m8
$$ -317 93 17 -379 -39 -71 -232 27 121 -107 57 -175 -133 -44 -132 -157 169 81 -32 172 -86 29 -62 -110
5407a10nJ34j33J41j96J85P0O7m06K57j09N0J21j28K00J76l79%K63k64L02m61
$$ -110 -115 19 -114 27 -169 16 86 153 -253 4 -105 -55 66 -62 138 314 -65 -65 198 -66 236 -225
5429b25L23l20M7J83J5j7M1J36k90M12l48P1j16jJ58k57Q6q1K04j27PM1M0J15
$$ -225 98 -222 -175 8 23 6 47 183 -107 305 -43 28 -88 -89 69 -188 -102 -183 21 -106 -99 -58 -18 97
5453I7j94N4Q5j72J06PM3Q3j65J01m2j4p5O0m2K66k16J08k8l43M97j90k84K38
$$ 97 -97 -43 42 -130 -24 -17 26 109 -56 45 3 -11 -86 -26 -68 198 -18 90 62 -281 216 26 -258 -20
5477b0K06j58L87m77K58J37k65l6J41j30J2k12J91n6L3j00R0K17k38j01q1L97
$$ -20 186 28 415 -62 196 333 68 32 173 43 55 -157 34 -22 11 -89 1 218 -20 -121 -202 195
5499A95l3q4N1Pk52R6N9j73J11j11M33m46j76N41j10m6k5QO5k46J57J96k28K79
$$ 195 162 78 129 136 -116 -20 39 -134 -23 -134 299 -147 -323 218 108 62 37 45 110 -136 21 217 -11 268
5523B68j46k19J24m9kk1j7J25j27j41K58P9L0n6J26k73O7L3K29l16J84p5%j90
$$ 268 122 -97 27 -22 -24 -45 -62 63 -64 -205 53 132 162 106 232 -41 26 59 288 -28 156 81 81 -109
5547a09p3J99m56M61o4k16J90K94r8l03O0j4r8J51L92n80O1K82o3j10K30j49J5
$$ -109 -182 17 -439 22 -42 -258 -68 226 128 -175 -115 -129 -227 -76 316 -264 -203 79 16 -94 136 -13 2
5570Bj99O1K43P7p3P7j03j80L61j66l01J06N7O0q5P5j70N6K62j85K23n46N60l1
$$ 2 -197 -136 107 184 111 188 85 -95 266 100 -201 -95 -38 22 -63 12 -158 -102 160 -25 198 -348 212 181
5594A81j08l34K84k93L25l01L08j01n4k4L82k90L0K21Ll02L73n32J75O6j72LL77
$$ 181 73 -261 23 -270 55 -246 62 -39 -93 -117 265 -25 5 226 229 -73 300 -232 -57 9 -163 -160 217
5617B17l09jJ88m7kR1r4j10Q7j58M4K06m28L22k1o0K42n1R6k72Q8J9j11q7J62
$$ 217 -92 -93 95 48 46 137 43 -67 20 -138 -94 112 -316 6 -15 -75 167 116 212 -60 28 47 -64 -151 11
5642A1p9J17m0l9J8k16O3l79M21P8J57j4j09k69N06k24k98J96R6m5R3K04r7R2
$$ 11 -68 49 9 -30 -12 -228 -165 -544 -123 -45 112 98 -11 -280 226 2 -296 -100 -4 -49 44 248 151 243
5666B43L3j97j14k0p4P6o8J09n7J59N8j67ll8K5k91M69j71j42J42L2j56m5K6Q4
$$ 243 276 79 -35 -55 -129 -53 -121 -12 -69 90 148 -19 -22 -60 -35 -326 143 -28 -170 -28 4 -152 -197 -171 -87
5691h7R4j19J88K41k37p0O2l29R8R2R5j75K36L8j9k80L67k62K80k92k35N86k67
$$ -87 7 -112 76 317 80 10 72 -257 -159 -67 28 -147 89 127 108 -172 195 -67 213 -79 -314 272 5
5714ER3l13J88j15K74k10L31l62mj93M23q9r6M9J77l47J51kj82Q7RP9j52L8J19
$$ 5 98 -215 -27 -142 132 -78 253 -109 -113 -306 117 28 -68 -19 158 -189 -38 -40 -222 -135 -126 -47 -199 -161 -42
5739d2R0l02M88l57K13o9j92M00k11l2k7l2J71R3j12j86m4J68R8j23q8K78j79
$$ -42 48 -254 234 -123 90 21 -171 229 18 -14 -41 -73 98 191 79 -107 -151 17 115 -8 -96 182 3
5762CN9j65N7J23l08J90K10k40Q5l6Q8r4o3N6M0j02L95k36J1j76K3K4o0J27j24
$$ 3 62 -103 -46 77 -231 -41 169 -71 14 -22 66 -28 -91 -35 5 -97 298 62 73 -103 -80 -56 -116 11 -113
5787a13P4L00j84l9J81m50Q4K29r9k2n7J4K36l66J89N6k19J04r1M43l09J48k40
$$ -113 -39 261 77 38 219 -231 -147 82 -17 -39 -96 -82 154 -212 -23 33 -186 -82 -173 270 -39 109 -131
5810a31K79j80K0J37m1m5m7J16k0M4q2q0J0J8m1O0j3K56m62J19N3M5m1K7k5K21
$$ -131 148 -32 -12 125 84 39 -8 108 88 132 50 -30 -20 -2 -43 17 4 260 -202 -83 -30 15 -26 1 -24 197
5836A97k71k05L11j13L87k68Pr2J20j71J84k10r0p6J81J36J59k06k65M20j89O7
$$ 197 -74 -279 32 -81 306 38 45 -47 73 -98 86 -124 -214 -290 -109 27 186 -20 -285 135 -54 13
5858A3K25l13Q2J43l24O9L03k66J61k2J85k5l42K72j50m0J21j1J54k44k21L28
$$ 13 238 -75 7 150 -174 -105 198 -68 93 71 256 231 -111 161 11 -29 92 81 235 -9 -230 98
5880I8j26R8l7R2j89O0K0P4j89K42Lk24J56p9p5Q2J58j0NR7r1j98J82l5k05K2
$$ 98 -28 70 33 125 -64 -4 16 90 -99 143 146 -78 78 -1 -76 6 164 154 159 256 165 -33 149 114 -91 -69
5906f9L7J3J16j51P6j21M20l75M10m16J72j39j04L12j16j07j63L10l0l41N72m33
$$ -69 -32 -19 97 -54 22 -99 321 -54 356 -60 112 -27 -131 181 65 -42 -205 105 75 -266 306 -127
5928a27K06K28l19R9k25R6K10p4J90l78k98M45oj72M3J25k02K03J02ORl55J51
$$ -127 79 307 -12 87 -138 -42 168 94 284 -94 -392 53 47 -125 -82 43 -159 44 146 152 161 -194 -43
5951d3j10J09J29qj7J20k27R5l6k06J13L00q3l23J15j85L27j54J88o6k71M09k00
$$ -43 -153 -44 85 77 60 180 -47 48 12 -194 -81 219 136 -187 -72 -257 70 -84 104 38 -233 176 -24
5974b4l7m9K13K28m02K64k88J54m65N02p0rL1k83K52j07L42K0j60j08l54K65p1
$$ -24 -61 -110 103 331 -71 193 -95 59 -406 96 26 17 48 -235 17 -90 252 272 112 4 -350 -85 -156
5997a56J61j19J08m1q8n4K50j54J2m3J67j13J21k75M22m6j51K86k13l1q4J29l45
$$ -156 5 -114 -6 -47 -135 -189 61 -93 -81 -124 43 -70 51 -224 198 152 1 287 74 43 -41 88 -257
6020b57K53j54J28J22k2R4k86J58K71m42j67L91k18o4K26L3J43j31k82K41L2J57
$$ -257 -4 -158 -30 92 70 164 -122 36 307 -135 -302 89 -129 -193 33 66 209 78 -204 37 69 226
6042B26k09N7j56J52k56K90l7j13J44l39O5P5J41q9J04K47k68Km9N3r6k2O0j2
$$ 226 17 74 -82 70 -186 104 67 -46 98 -241 -176 -101 40 -49 55 302 34 36 -13 40 -56 -78 -18 -30
6066c0M7O8k15K71j71P3Nj78J20j9O0M5j30L7J05k78K88m74M11j51p8J11J50k6
$$ -30 17 85 -130 141 -30 43 48 -130 -10 -29 31 76 -54 -17 88 -190 98 -376 35 -116 -194 -83 67 41
6090D1J64j97k7l04K88np1J22j34Q3j68K00K11M4l46J74o7l79L70J64j39n0j32
$$ 41 205 8 -19 -323 -35 -40 -111 11 -123 -40 -208 -8 203 247 -99 75 8 -371 -1 163 24 -26 -158
6113a58J56Q8J60l50k44J58M22j35l5p1j03K47P8k20j89K83n0l1j77K03q3N5p1
$$ -158 -2 86 246 -104 -348 -190 232 97 62 -9 -112 135 213 -7 -196 87 37 6 -171 32 -51 4 -67
6136f7K12l25K21J62Nk73l17K47K81q4Q6j96K83k88J08r7n5O0K28j6q4j14j00
$$ -67 145 -180 41 203 208 -65 -382 -135 146 62 148 -48 235 -53 55 -42 -97 -37 191 175 91 -23 -123
6159a23J34J86k46m0J42n2k6J30l10K29l56L07K76k98J38j97J77k19M1K23j22
$$ -123 11 197 -49 -89 53 1 -25 105 -205 24 -332 -25 251 -47 91 -106 71 -148 -107 116 -6
6180fJ13k08M6J81k57P3K48l55k24L44K0O8j64K48L4k27K86k43P3j24K01o9j84
$$ -6 107 -101 -55 126 -131 -58 190 -165 -389 -45 -25 43 -121 127 161 -66 220 -23 50 -74 127 58 -126
6203a26K06L4N1l27J37O4R6l2j05J93m19L62j19r6M7l63L57K31j21k92K00KK39
$$ -126 80 114 165 -162 -25 39 135 103 -2 191 -228 134 15 -81 -34 -397 -40 191 70 -222 -22 -20 219
6226B19k53r8J81j23J18%o9J2o9r8M3k6K30J6j85M8J04r7K58Q5k99L4j5P8j20
$$ 219 -34 -132 49 -74 44 44 -25 -13 -82 -180 -137 -163 67 83 -102 -54 50 -47 211 296 -3 31 16 94 -26
6251b6J46k9m8m8J61j40k42R4K54k84J40R7k98M6J30J18O5l26J76R3j21M2j24
$$ -26 120 91 43 -5 156 16 -226 -132 122 -162 -22 75 -223 -177 -47 71 136 -190 -14 79 -42 0 -124
6274a24J48l07j40M60j65j09L29k26J15j86J81k1n1l2K37L9k47R6J37j39k18K01
$$ -124 24 -283 -423 37 -128 -237 92 -134 -19 -205 -24 -45 -96 -128 109 148 -99 -3 134 -5 -223 -22
6296b2m9Rp9J2Q9j15p6L75k31L70l98L73r6l02K91j68l47K00J7J42N5J42j41k5
$$ -22 -71 -62 -141 -129 -40 -155 -231 144 -87 283 -115 258 162 -140 151 -17 -364 -164 -147 -5 50 192 51 26
6320B6p7K91j28j84K8Pq8kK31l0j24J28j24O9K3j69J31J40l30K09m6Q5J37q5j22
$$ 26 -51 240 112 -72 -44 -37 -125 -127 104 74 -50 78 -46 23 46 -123 8 148 -182 27 -19 66 203 118 -4
6345dk21L89m34M03j90J29j97L61j55p6q3L09k56J39J68l56K55j82k0m2o5J63
$$ -4 -225 164 -270 133 -57 72 -125 236 81 5 -78 231 -25 114 282 -74 181 -1 -21 -63 -128 35
6367C5j04J08r5j31K56k4l2O8j65J76j14k7l23J35K62J83r5m50O03o33M03K80
$$ 35 -69 39 -56 -187 69 45 13 81 -84 92 -22 -49 -372 -237 25 208 113 -337 266 -367 36 316
6389C16p08J94K70j1j59J37j1K60j36j71K22k50j13K47NJ72k18qq9j94N01k50
$$ 316 -392 -198 72 61 -98 39 28 288 152 -19 203 -47 -160 87 92 264 46 38 -51 -245 256 6
6411Fm4K08Nk97M38l86J82j48J23J62n56L91j86l1R9J5j7J8L3l89L29K20k87j0
$$ 6 -38 170 175 -122 316 -70 112 -36 87 249 -307 84 -102 -133 -34 -19 -36 -18 15 -374 -45 175 -112 -122
6435a22N1K82j49j22K99r7m73N87kj09l4k61K36K38m11j17K70j34q1K56r0J9k29
$$ -122 -71 211 62 -60 239 142 -331 256 254 145 111 -150 86 324 -87 -204 66 -68 -149 107 17 36 -193
6458a93L62k12j69K43p3K17p0k28OJ03o7R9r8J91N4k05L0R9n1j18j72L66O5m01
$$ -193 169 -43 -212 31 -42 175 105 -123 -117 -14 -81 18 -80 111 165 -40 -10 89 38 -80 -252 114 179 -222
6482b22L18j82N2kM87n67j7K4k03kK85%J47k92K10J37k11n3QJ91j75m2K43l21
$$ -222 96 -86 -34 -36 451 -116 -133 -109 -312 -314 -29 -29 118 -174 36 173 -38 -91 -83 108 -67 -109 134 -187
6506a87K82j49J99k50N4pk23K80M1j17J9L35m80M83k21j08Q5j20nJ09M7j47p3
$$ -187 95 -54 145 -105 -51 -58 -281 -1 40 -77 -58 277 -203 280 59 -49 36 -84 -89 20 67 -80 -153
6529a53J54m6K15k47k15L68l48K67M1J6k67J5N38l05L9j11Jm32N23j48J9O3J98
$$ -153 1 -45 170 -77 -292 76 -272 -5 36 52 -215 -200 338 33 72 -39 -38 -470 53 -95 -76 -13 185
6552A85j70J34l56K04j0N9M4l1Q1j28j26r2J30rK86m66K0M58l14j07oK50j87J47
$$ 185 15 149 -207 -3 -13 46 90 59 140 12 -114 -206 -76 -85 201 -265 -245 213 -101 -208 -214 36 -151 -4
6576dr8K33K17m58J15L2k18J65j0J88k6j65r9J00J88k16P0N5j75MJ74k16N3lO7
$$ -4 -102 131 348 -110 5 37 -181 -16 -26 162 136 -29 -128 -28 160 -56 14 69 -106 -102 72 -144 -91 -94 -27
6601b7J5N4j70K27m49L07k06K25oj42L2L44l47m0M28j96O1K9k01mJ32j94J75J17
$$ -27 -12 42 -128 99 -350 -43 -249 -24 -30 -172 -140 204 -143 -183 245 49 110 139 -62 -66 66 -128 47 164
$$ [...]
8191f7
##END NTUPLES=NMR FID
##END=
