##TITLE=1H_Pr Dep-20
 200.13MHz,DMSO,
 8 sc
 
 27.8.2025
##JCAMPDX= 6.0         $$ Bruker NMR JCAMP-DX V2.0
##DATA TYPE= NMR FID
##DATA CLASS= NTUPLES
##ORIGIN= UXNMR, Bruker Analytische Messtechnik GmbH
##OWNER= pz
$$ XWIN-NMR		Version 3.5
$$ Wed Aug 27 13:43:44 2025 Russian Standard Time (UT+4h)  she@DPX200
##.OBSERVE FREQUENCY= 200.1313
##.OBSERVE NUCLEUS= ^1H
##.DELAY= (6, 6)
##.ACQUISITION MODE= SIMULTANEOUS
##.ACQUISITION SCHEME= undefined
##.AVERAGES= 8
##.DIGITISER RES= 18
##SPECTROMETER/DATA SYSTEM= spect
##.PULSE SEQUENCE= zg30
##.SOLVENT NAME= DMSO
##.SHIFT REFERENCE= (INTERNAL, DMSO, 0, 14.3821)
##AUDIT TRAIL= $$ (NUMBER, WHEN, WHO, WHERE, WHAT)
$$ ##TITLE= Audit trail, XWIN-NMR		Version 3.5
$$ ##JCAMPDX= 5.01
$$ ##ORIGIN= Bruker BioSpin GmbH
$$ ##OWNER= she
$$ F:/spectra/data/she/nmr/H-C/1/audita.txt
$$ ##AUDIT TRAIL=  $$ (NUMBER, WHEN, WHO, WHERE, WHAT)
(   1,<2025-08-27 13:42:28.59 +0400>,<she>,<DPX200>,
      <created by zg, POWCHK disabled, PULCHK disabled
       configuration hash MD5:
       00 E9 B6 7A A2 85 ED C7 34 08 36 98 17 FE 4E 26
       data hash MD5: 16K
       3C BD F1 75 49 48 20 8A D1 11 8E E5 D0 0D F7 C6>)
$$ ##END=
$$ 
$$ hash MD5
$$ 83 99 17 F3 BC EA 9E 80 68 5D E5 DE 66 A9 14 3D
##$RELAX= 
##$RELAX= 
##$RELAX= 
##$RELAX= 
##$RELAX= 
##$RELAX= 
$$ Bruker specific parameters
$$ --------------------------
##$DU= <F:/spectra>
##$EXPNO= 1
##$NAME= <H-C>
##$PROCNO= 1
##$TYPE= <nmr>
##$USER= <she>
##$AMP= (0..31)
100 100 100 100 100 100 100 100 100 100 100 100 100 100 100 100 100 100 
100 100 100 100 100 100 100 100 100 100 100 100 100 100 
##$AQSEQ= 0
##$AQ_mod= 1
##$AUNM= <au_zg>
##$AUTOPOS= <>
##$BF1= 200.13
##$BF2= 200.13
##$BF3= 200.13
##$BF4= 200.13
##$BF5= 200.13
##$BF6= 200.13
##$BF7= 200.13
##$BF8= 200.13
##$BYTORDA= 1
##$CFDGTYP= 0
##$CFRGTYP= 5
##$CHEMSTR= <none>
##$CNST= (0..31)
1 1 145 1 1 1 1 1 1 1 1 1 1 1 1 1 1 1 1 1 1 1 1 1 1 1 1 1 1 1 1 1 
##$CPDPRG= <>
##$CPDPRG1= <>
##$CPDPRG2= <>
##$CPDPRG3= <>
##$CPDPRG4= <mlev>
##$CPDPRG5= <mlev>
##$CPDPRG6= <mlev>
##$CPDPRG7= <mlev>
##$CPDPRG8= <mlev>
##$CPDPRGB= <>
##$CPDPRGT= <>
##$D= (0..31)
0 0.7 0 0 0 0 0 0 0 0 0 0.03 0 0 0 0 0 0 0 0 0 0 0 0 0 0 0 0 0 0 0 0 
##$DATE= 1756287748
##$DBL= (0..7)
120 120 120 120 120 120 120 120 
##$DBP= (0..7)
150 150 150 150 150 150 150 150 
##$DBP07= 0
##$DBPNAM0= <>
##$DBPNAM1= <>
##$DBPNAM2= <>
##$DBPNAM3= <>
##$DBPNAM4= <>
##$DBPNAM5= <>
##$DBPNAM6= <>
##$DBPNAM7= <>
##$DBPOAL= (0..7)
0.5 0.5 0.5 0.5 0.5 0.5 0.5 0.5 
##$DBPOFFS= (0..7)
0 0 0 0 0 0 0 0 
##$DE= 6
##$DECBNUC= <off>
##$DECIM= 32
##$DECNUC= <off>
##$DECSTAT= 4
##$DIGMOD= 1
##$DIGTYP= 9
##$DL= (0..7)
0 120 120 120 120 120 120 120 
##$DP= (0..7)
150 150 150 150 150 150 150 150 
##$DP07= 0
##$DPNAME0= <>
##$DPNAME1= <>
##$DPNAME2= <>
##$DPNAME3= <>
##$DPNAME4= <>
##$DPNAME5= <>
##$DPNAME6= <>
##$DPNAME7= <>
##$DPOAL= (0..7)
0.5 0.5 0.5 0.5 0.5 0.5 0.5 0.5 
##$DPOFFS= (0..7)
0 0 0 0 0 0 0 0 
##$DQDMODE= 0
##$DR= 18
##$DS= 0
##$DSLIST= <SSSSSSSSSSSSSSS>
$$ [...]
##$SUBNAM0= <"">
##$SUBNAM1= <"">
##$SUBNAM2= <"">
##$SUBNAM3= <"">
##$SUBNAM4= <"">
##$SUBNAM5= <"">
##$SUBNAM6= <"">
##$SUBNAM7= <"">
##$SUBNAM8= <"">
##$SUBNAM9= <"">
##$SW= 18.0517328524113
##$SWIBOX= (0..15)
0 0 2 0 0 0 0 0 0 0 0 0 0 0 0 0 
##$SW_h= 3612.71676300578
##$TD= 16384
##$TD0= 1
##$TE= 0
##$TE2= 300
##$TE3= 300
##$TEG= 300
##$TL= (0..7)
0 120 120 120 120 120 120 120 
##$TP= (0..7)
150 150 150 150 150 150 150 150 
##$TP07= 0
##$TPNAME0= <>
##$TPNAME1= <>
##$TPNAME2= <>
##$TPNAME3= <>
##$TPNAME4= <>
##$TPNAME5= <>
##$TPNAME6= <>
##$TPNAME7= <>
##$TPOAL= (0..7)
0.5 0.5 0.5 0.5 0.5 0.5 0.5 0.5 
##$TPOFFS= (0..7)
0 0 0 0 0 0 0 0 
##$TUNHIN= 0
##$TUNHOUT= 0
##$TUNXOUT= 0
##$USERA1= <user>
##$USERA2= <user>
##$USERA3= <user>
##$USERA4= <user>
##$USERA5= <user>
##$V9= 5
##$VALIST= <valist>
##$VCLIST= <CCCCCCCCCCCCCCC>
##$VD= 0
##$VDLIST= <DDDDDDDDDDDDDDD>
##$VPLIST= <PPPPPPPPPPPPPPP>
##$VTLIST= <TTTTTTTTTTTTTTT>
##$WBST= 1024
##$WBSW= 4
##$XGAIN= (0..3)
0 0 0 0 
##$XL= 0
##$YL= 0
##$YMAX_a= 80299
##$YMIN_a= -71143
##$ZGOPTNS= <>
##$ZL1= 120
##$ZL2= 120
##$ZL3= 120
##$ZL4= 120
##$ABSF1= 10
##$ABSF2= 0
##$ABSG= 5
##$ABSL= 3
##$ALPHA= 0
##$AQORDER= 0
##$ASSFAC= 0
##$ASSFACI= 0
##$ASSFACX= 0
##$ASSWID= 0
##$AUNMP= <proc_1d>
##$AZFE= 0.1
##$AZFW= 0.1
##$BCFW= 1
##$BC_mod= 2
##$BYTORDP= 1
##$COROFFS= 0
##$CY= -3
##$DATMOD= 1
##$DC= 2
##$DFILT= <>
##$DTYPP= 0
##$F1P= 0
##$F2P= 0
##$FCOR= 0.5
##$FTSIZE= 0
##$FT_mod= 4
##$GAMMA= 1
##$GB= 0.15
##$INTBC= 1
##$INTSCL= 1
##$ISEN= 128
##$LB= 0.25
##$LEV0= 0
##$LPBIN= 0
##$MAXI= 10000
##$MC2= 0
##$MEAN= 0
##$ME_mod= 0
##$MI= 1.114404
##$NCOEF= 0
##$NC_proc= 0
##$NLEV= 6
##$NOISF1= 3.799351
##$NOISF2= 2.8
##$NSP= 1
##$NTH_PI= 0
##$NZP= 0
##$OFFSET= 14.38212
##$PC= 1
##$PHC0= -1727.056
##$PHC1= 24.99228
##$PH_mod= 1
##$PKNL= yes
##$PPARMOD= 0
##$PSCAL= 0
##$PSIGN= 0
##$REVERSE= no
##$SF= 200.129724274929
##$SI= 16384
##$SIGF1= 3
##$SIGF2= 2
##$SINO= 400
##$SIOLD= 16384
##$SREGLST= <1H.CDCl3>
##$SSB= 0
##$STSI= 0
##$STSR= 0
##$SW_p= 3205.1282051282
##$SYMM= 0
##$S_DEV= 0
##$TDeff= 0
##$TDoff= 0
##$TI= <>
##$TILT= no
##$TM1= 0
##$TM2= 0
##$TOPLEV= 0
##$USERP1= <user>
##$USERP2= <user>
##$USERP3= <user>
##$USERP4= <user>
##$USERP5= <user>
##$WDW= 1
##$XDIM= 8192
##$YMAX_p= 0
##$YMIN_p= 0
$$ End of Bruker specific parameters
$$ ---------------------------------
##NTUPLES= NMR FID
##VAR_NAME=  TIME,          FID/REAL,        FID/IMAG
##SYMBOL=    X,             R,               I
##VAR_TYPE=  INDEPENDENT,   DEPENDENT,       DEPENDENT
##VAR_FORM=  AFFN,          ASDF,            ASDF
##VAR_DIM=   8192,          8192,            8192
##UNITS=     SECONDS,       ARBITRARY UNITS, ARBITRARY UNITS
##FACTOR=    0.0002768,     1,               1
##FIRST=     0,             0,               0
##LAST=      2.2672688,     0,               0
##MIN=       0,             -71143,          0
##MAX=       2.2672688,     80299,           0
$$ Real data points
##PAGE= N=1
##DATA TABLE= (X++(R..R)), XYDATA
$$ [...]
$$ plain form
77 -11510 -22733 -3212 1732 6375 16304 266 -19678 -3869 29231 24057 -18755 -26014 14029
90 14029 24562 -4764 -19376 -7882 3698 1995 -1215 -1959 -11586 -8961 14764 14858 -11213 -13078
104 -13078 11489 19720 -1903 -13103 5912 12188 -5598 -6739 4288 -456 -9460 -3615 6835
117 6835 -1692 -14627 456 15278 -2707 -14655 5401 19800 1049 -17613 1811 23131
129 23131 1967 -19555 -2688 14354 2494 -13607 -7058 6281 385 -7004 1062 2230 -4951
142 -4951 -405 7941 4680 -5136 -3113 9646 6757 -6451 -3504 4917 1443 -4193 -2676 1042 -2464
157 -2464 -6025 2030 4565 -5973 -5278 6395 6603 -3488 -5084 6252 8735 -3894 -5219 5552
171 5552 4218 -4309 -4133 1724 1674 -4743 -3359 3226 -903 -5203 1605 4969 -998 -4174 2262 7898
$$ packed form
77a1510j1223J9521M944M643R929j6038j9944J5809L3100n174m2812p259M0043
90A4029J0533k9326j4612J1494J1580j703l210p44r627K625K3725R4k6071j865
104a3078K4567Q231k1623j1200J9015O276j7786j141J1027m744r004N845J0450
117F835q527j2935J5083J4822j7985j1948K0056J4399j8751j8662J9424K1320
129B3131k1164k1522J6867J7042j1860j6101O549J3339n896p389Q066J168p181
142d951M546Q346l261r816K023J2759k889j3208K947Q421l474n636J517L718l506
157b464l561Q055K535j0538O95J1673K08j0091j596J1336K483j2629j325J0771
171E552j334q527J76N857n0o417J384O585m129m300O808L364n967l176O436N636
$$ plain form
187 7898 43 -6206 2569 6891 -1410 -5172 -9 3359 -1501 -5165 418 2182 -3587 -2313 2662
202 2662 1395 -1811 -871 3242 3021 -1827 -142 3591 343 -1806 602 1207 -1291 -3127 42 2274
218 2274 -2873 -3907 2057 2360 -2151 -2270 2030 3828 -792 -2359 2894 2955 -1362 -1165 977 939 -932
235 -932 -1745 157 -378 -2163 265 869 -1788 -1196 1415 2010 -351 -1881 1946 3483 -977 -1714 1453
252 1453 1697 -588 -2059 9 1243 -1720 -1902 830 -30 -1329 -378 615 764 -367 46 1839 203
269 203 -678 1424 1056 -749 -785 391 1099 -1178 -2339 629 1167 -1430 -1465 281 1177 213 -1003 621
287 621 1462 -121 309 1025 -48 -189 168 445 -111 -1404 -275 941 -879 -1310 44 412 127 -588
305 -588 -100 1139 88 -328 980 538 -217 47 324 480 -579 -1054 455 104 -981 -394 -22 -116 -45
$$ packed form
187G898p855o249Q775M322q301l762N163L368m860l664N583J764n769J274M975
202B662j267l206R40M113k21m848J685L733l248k149K408O05k498j836L169K232
218B274n147j034N964L03m511j19M300J798m620j567N253O1m317J97K142l8j871
235i32q13J902n35j785K428O04k657N92K611N95k361j530L827J537m460p37L167
252A453K44k285j471K068J234k963j82K732q60j299R51R93J49j131M13J793j636
269B03q81K102l68j805l6J176P08k277j161K968N38k597l5J746Q96r64j216J624
287F21Q41j583M30P16j073j41L57K77n56j293J129J216j820m31J354L68k85p15
305e88M88J239j051m16J308m42p55K64K77J56j059m75J509l51j085N87L72r4P1
$$ plain form
324 -45 -222 350 301 -295 746 730 -293 32 417 416 68 -822 -61 573 -510 -571 -204 -207 35 -118 -176 281
346 281 -80 228 784 -160 -214 602 456 175 -403 -413 564 64 -680 -292 -233 -102 172 -323 -184 -10 9 611
368 611 218 -347 324 515 305 25 -394 195 335 -451 -233 -35 -383 -88 -30 -100 8 -275 46 527 -30
389 -30 -57 171 94 326 108 -265 195 -15 -112 131 -291 -355 -37 -102 76 -118 -384 248 294 -13 212 40 165
412 165 296 1 30 20 -175 21 -27 -342 -18 -12 -271 19 -131 23 151 -199 168 388 -6 39 34 186 371
435 371 -259 -351 284 113 -186 -275 -192 209 60 -350 -13 97 52 254 -76 -19 193 65 158 128 -319 -32 166
458 166 62 -122 -397 -194 436 -12 -380 -140 81 360 119 -337 49 286 175 60 -88 -42 38 -65 134
479 134 42 -456 -218 236 198 -117 -515 -112 656 231 -411 -205 185 502 41 -440 69 218 -33 -30 -29 -83 -30
$$ packed form
324d5j77N72m9n96J041j6j023L25L85jl48q90P61O34j083o1L67lK42j53n8M57
346B81l61L08N56r44n4Q16j46k81n78j0R77n00p44L88N9J31K74m95J39J74J9O02
368F11l93n65O71J91k10k80m19N89J40p86K18J98l48K95N8p0J08k83L21M81n57
389c0k7K28p7K32k18l73M60k10r7K43m22o4L18o5J78j94k66O32M6l07K25j72J25
412A65J31k95K9j0j95J96m8l15L24Ok59K90j50J54J28l50L67K20l94M5nJ52J85
435C71o30r2O35j71k99q9Q3M01j49m10L37J10m5K02l30N7K12j28R3l0m47K87J98
458A66j04j84k75K03O30m48l68K40K21K79k41m56L86K37j11j15j48M6Q0j03J99
479A34r2m98K38M54l8l15l98M03P68m25o42K06L90L17m61m81N09J49k51LJn4N3
$$ plain form
502 -30 -138 164 112 -360 -140 264 219 9 -280 -76 392 43 -228 27 179 135 -34 -245 112 45 -258 -57
524 -57 43 36 -27 -253 2 240 -10 -115 33 118 88 -26 -109 183 -120 -178 196 116 -105 -184 -76 277 94 -378
548 -378 -62 229 172 14 -151 10 224 -14 -33 57 -49 -40 36 56 5 -210 -182 196 136 -94 -162 -91 197 108 -159
573 -159 -59 67 87 79 -120 -66 46 -104 -23 84 -100 -10 -15 -34 82 -44 -184 87 97 77 -1 -104 74 103 -51
598 -51 3 -45 -147 -9 70 5 -59 -237 -8 224 -8 -94 -99 73 166 -54 -187 11 -3 33 45 -10 -96 6 72 110
624 110 -76 -185 83 177 -24 3 -86 -43 210 80 21 -50 -69 176 38 -92 -102 -27 97 29 -116 -135 18 37
648 37 27 -72 -104 20 62 109 -12 -99 11 109 7 -3 -29 6 58 3 -63 -3 -23 -24 74 -44 -17 -11 50 83 -28 -76 39
677 39 17 -31 -35 -81 -33 40 -80 27 2 -57 17 11 -47 26 21 -6 52 -42 -52 52 -12 20 13 -68 -38 -47 38 -1 -61 -4 93 23
$$ packed form
502c0j08L02n2m72K20M04m5k10k89K04M68l49k71K55J52m4j69k11L57o7l03K01
524e7J00po3k26K55K38k50j05J48Q5l0j14q3K92l03n8L74q0k21p9J08L53j83m72
548c78L16K91n7j58j65J61K14k38j9R0j06RP6K0n1k15K8L78o0k30o8P1K88q9k67
573a59J00J26K0qj99N4J12j50Q1J07j84R0nj9J16j26j40K71J0k0p8j03J78K9j54
598e1N4m8j02J38P9o5o4j78K29K32k32q6nJ72R3k20j33J98j4L6J2n5q6J02O6L8
624A10j86j09K68R4k01K7q9M3K53j30n9p1j9K45j38j30j0P5J24o8j45j9J53J9
648C7j0r9l2J24M2M7j21q7J10R8j02j0k6L5N2n5o6O0k0jR8j18K7OO1L3j11m8J15
677C9k2m8mm6M8P3j20J07k5n9P4on8P3nk7N8r4j0J04o4L2pq1L0rQ5l9o0N7R7p0
$$ plain form
709 23 44 -20 -19 46 -3 -16 44 17 -26 42 0 -9 15 -42 -12 -33 -38 59 38 -15 12 -13 17 27 -42 26 70 -9 5 -2 -59 29 -73
742 -73 34 51 32 -15 -53 8 50 5 3 58 18 -2 33 24 -39 68 -53 -8 -10 27 37 -10 -32 -14 5 -15 39 0 -22 45 -14
773 -14 24 -8 -56 41 41 -27 37 -38 45 -22 9 -4 29 17 -4 60 11 20 -15 6 20 -35 28 35 -43 22 -9 -4 -4 28 -20 -29 -1 1
807 1 54 -9 -39 6 20 34 -29 -34 22 -23 -17 -20 68 12 38 -40 -27 18 19 -17 17 -10 15 -37 -4 54 -21 -21 32 12 6 19 -9 48
841 48 31 9 86 21 -25 -29 35 8 -24 -16 -8 -48 -22 21 8 -23 -7 -55 -3 28 -17 48 -20 -36 -31 -2 7 35 56 -26 -66 19 -2
874 -2 2 32 36 98 -30 -33 25 50 -17 14 -28 2 -40 19 59 -21 15 -73 -5 -29 -32 48 -45 4 7 -14 -18 -54 27 -74 0 -9 -59 -9
908 -9 3 1 -5 44 29 -16 -42 -24 12 -7 -43 12 36 10 -37 -5 -10 -51 9 -23 -37 38 22 30 16 -41 35 -12 -17 -53 30 14 5 -27
942 -27 -11 -30 -47 4 -65 0 -19 34 -7 6 3 -43 5 24 -17 44 50 45 46 -6 38 38 42 26 52 -21 -6 12 23 -61 -49 47 -7 20
$$ packed form
709B3K1o4JO5m9j3O0k7m3O8m2rK4n7L0k1nR7k1n3K7k5L0J0o9O8M4p9J4pn7Q8j02
742g3J07J7j9m7l8O1M2m5kN5m0k0L5ro3J07j21M5kL7J0m7k2J8J9k0N4l9k2O7n9
773a4L8l2m8R7%o8O4p5Q3o7L1j3L3j2k1O4m9Rl5K1J4n5O3Pp8O5l1N%L2m8rK8K
807AN3o3l0M5J4J4o3nN6m5OlQ8n6K6p8J3M5Jl6L4k7K5n2L3N8p5%N3k0oJ3k8N7
841D8j7k2P7o5m6mO4k7l2QQm0K6M3j3l1J6m8N2L1m5O5o8j6NK9RK8K1q2m0Q5k1
874bML0MO2j28lN8K5o7L1m2L0m2N9M0q0L6q8O8k4lQ0r3M9Lk1ml6Q1j01P4rn0N0
908iJ2koM9j5m5k6J8L6j9l6N5K4k6m7L2nm1O0l2j4P5j6Qj4n7P6m7nl6Q3j6rl2
942b7J6j9j7N1o9O5j9N3m1J3lm6M8J9m1O1OnJn2M4%Mj6K6p3J5J8J1q4J2R6n4K7
$$ plain form
976 20 -17 -16 -16 -43 11 1 73 0 -84 2 -33 17 19 7 -31 5 40 39 2 23 34 5 51 45 -41 11 16 -7 48 64 -50 -8 -11 -32
1010 -32 41 2 -11 -36 -36 -54 7 -31 -1 -11 2 36 24 -6 23 -38 55 45 3 -32 17 30 27 -68 1 -3 -9 -33 32 -10 -24 19
1042 19 -31 16 -52 4 46 -19 -20 -30 45 -62 -33 -22 -17 8 -77 -45 -2 4 10 -30 -29 13 -71 14 23 -33 -45 -8 1 2 -20 12 -25 28
1076 28 15 -3 51 -3 -3 -17 1 49 -8 26 -3 -7 -27 -20 -12 51 46 21 45 -24 2 11 30 -26 27 -13 -1 -35 -3 -14 23 -61 -17
1109 -17 2 -42 26 -2 -10 -12 -7 -37 -32 12 19 -57 39 -96 17 37 19 18 -25 -17 44 6 18 -3 -50 -11 76 -5 22 58 -30 18 -4
1142 -4 24 -18 -21 -6 8 -33 -38 -15 54 -47 16 3 14 -17 54 -24 -15 -18 -21 -21 27 -5 -4 -26 -22 -19 -54 61 44 45 -18 13 23 -47 -40
1177 -40 25 -24 11 31 31 -26 8 44 38 12 -40 -11 4 44 4 11 7 7 -44 -10 -25 11 5 -35 -9 -46 -2 42 8 8 -6 29 62 29
1211 29 -14 18 26 -3 24 27 -2 35 54 33 -47 15 14 8 13 7 -22 41 -42 17 27 11 2 -11 23 -3 -38 -52 16 -39 23 12 1 10
$$ packed form
976B0l7J%k7N4j0P2p3q4Q6l5N0Kj2l8L6L5jl7K1J1k9M6oq6N2Nk3N5J6j14M2lk1
1010c2P3l9j3k5%j8O1l8L0j0J3L4j2l0K9o1R3j0m2l5M9J3lr5O9mok4O5m2j4M3
1042A9n0M7o8N6M2o5jj0P5j07K9J1NK5q5L2M3OOm0JM2q4Q5Rn6j2L7RJk2L2l7N3
1076B8j3j8N4n4%j4J8M8n7L4k9mk0PQO3nk5K4o9K6RJ9n6N3m0J2l4L2j1L7q4M4
1109a7J9m4O8k8qkNl0NM4Pp6R6j35J13K0j8jm3QO1l8J2k1m7L9Q7q1K7L6q8M8k2
1142dK8m2lJ5J4m1nK3O9j01O3j3J1l1P1p8Rll%M8l2Jk2MLl5J15j7Jo3L1J0p0P
1177d0O5m9L5K0%n7L4L6ok6n2K9J5M0m0Pm%n1L4j5L6om0K6l7M4M4l4%j4L5L3l3
1211B9m3L2Qk9K7Lk9L7J9k1q0O2joNok9O3q3N9J0j6rj3L4k6l5j4O8n5O2j1j1R
$$ plain form
1245 10 -10 -39 -55 4 -22 14 -2 26 25 11 -4 27 -44 3 -1 34 -6 -15 25 -25 -33 -1 -10 -20 -1 -13 -41 -49 -38 21 -11 -15 19 37
1279 37 -21 -71 -24 -16 -2 25 -29 -13 -61 -24 13 34 -6 3 29 -17 6 32 6 12 -4 27 9 -7 2 53 -4 -23 25 29 58 -28 -33
1312 -33 17 55 -27 -57 -14 -29 -64 0 -26 -34 -2 29 -46 41 -27 3 16 -5 8 24 -12 15 -45 11 16 60 -12 -33 -15 13 93
1343 93 23 43 8 12 -9 43 -55 -81 27 41 10 10 -2 -27 -27 11 31 -13 -42 -5 48 -54 -78 17 -14 16 -20 -24 40 22 44
1374 44 23 73 -14 9 -29 14 18 -34 11 14 26 27 -18 -32 -18 5 7 41 11 -11 -12 5 -92 -54 -36 17 -20 5 -14 -22 -20 22 -5 54
1408 54 -27 -2 -24 14 -14 13 -11 10 -8 36 28 55 0 -12 52 -12 -3 5 31 -52 40 6 -26 1 57 -63 -1 25 25 10 26 26
1440 26 9 -44 -61 26 -28 -13 38 -32 18 20 -41 -52 2 -14 56 40 -63 20 39 -51 3 40 -42 -15 -6 18 -16 -6 14 22 39
1471 39 49 -12 4 18 0 21 -49 -24 -4 -21 -5 8 -45 -18 24 35 -67 -8 -15 48 -7 -36 -26 21 23 -43 39 -41 -42 39 45 -9
$$ packed form
1245A0k0k9j6N9k6L6j6K8jj4j5L1p1M7mL5m0rM0n0qL2rj0J9j2k8qJ1N9l2mL4J8
1279C7n8n0M7QJ4K7n4J6m8L7L7K1m0RK6m6K3K6k6Oj6L1j8j6RN1n7j9M8MK9q6n
1312c3N0L8q2l0M3j5l5O4k6qL2L1p5Q7o8L0J3k1J3J6l6K7o0N6NM4p2k1J8K8Q0
1343I3p0K0l5Mk1N2r8k6J08J4l1%j2k5%L8K0m4k9L7N3j02k4R5l1L0l6mO4j8K2
1374D4k1N0q7K3l8M3Mn2M5LJ2Jm5j4J4K3KL4l0k2jJ7r7L8J8N3l7K5j9qKM2k7N9
1408E4q1K5k2L8k8K7k4K1j8M4qK7n5j2O4o4RQK6q3R2l4l2K7N6j20O2K6%j5J6%
1440B6j7n3j7Q7n4J5N1p0N0Ko1j1N4j6P0j6j03Q3J9r0N4L7q2K7RK4l4J0K0QJ7
1471C9J0o1J6J4j8K1p0K5K0j7J6J3n3K7M2J1j02N9pO3n5k9J0M7Ko6Q2q0jQ1On4
$$ plain form
1503 -9 47 -12 -43 20 -48 -43 38 -14 22 82 -32 23 -37 27 -19 36 -15 11 -5 43 15 -19 -5 -40 -19 13 -70 -29 11 40 -50
1534 -50 33 14 -43 -8 -11 -27 -18 -22 15 -25 -45 45 3 28 -27 -4 -2 -11 39 -2 15 45 -33 -17 11 -6 -79 -1 12 3 -45 -12 19
1567 19 -53 -10 -6 -14 -64 -22 -9 12 -2 -1 72 -3 30 10 -57 -50 -18 31 -16 18 7 -13 12 11 -8 94 -26 -8 11 -2 -6 27
1599 27 -23 33 -13 33 -27 -10 -20 29 20 -11 19 36 -21 -6 31 -45 -7 -33 -9 8 -54 44 -34 -1 30 -15 -38 28 26 -22 16
1630 16 39 9 -35 13 -1 46 42 -31 0 45 55 112 -43 -7 -50 -37 -65 41 -2 69 19 -40 1 13 -4 -11 -29 -47 12 1
1660 1 64 8 -23 -45 71 0 6 -12 14 0 11 -13 -10 11 8 13 -17 -52 68 8 7 -56 -8 2 36 -13 -62 4 -16 -13 -38 -8 21
1693 21 5 -5 -17 -27 -34 62 -1 -3 54 15 49 1 33 -1 50 32 -105 13 -32 -76 25 9 -26 -6 18 12 38 -4 14 7 13
1724 13 -46 36 -6 -31 -11 -12 -1 17 25 -39 -12 -1 -28 2 -69 -9 -42 -25 -30 -22 -6 61 -10 37 22 -38 -52 6 2 2 30 -1 3 -11
$$ packed form
1503iN6n9l1O3o8NQ1n2L6O0j14N5o0O4m6N5n1K6j6M8k8l4J4l5K1L2q3M1M0K9r0
1534e0Q3j9n7L5lj6RmL7m0k0R0m2K5n5K3KrN0m1J7L0p8J6K8j7p3P8J3rm8L3L1
1567A9p2M3Mqn0M2J3K1j4JP3p5L3k0o7PL2M9m7L4j1k0K5jj9J02j20J8J9j3mL3
1599B7n0N6m6M6o0J7j0M9rl1L0J7n7J5L7p6L8k6K4J7o2R8p8L3L1m5k3O6km8L8
1630A6K3l0m4M8j4M7mp3L1M5J0N7j55L6m3J3k8J06m3P1n0n9M1J2j7pj8j8N9j1
1660AO3n6l1k2J16p1Oj8K6j4J1k4LK1lNl0l5J20o0jo3M8J0L4m9m9O6k0Lk5L0K9
1693B1j6j0j2j0pR6o3kN7l9L4m8L2l4N1j8j37J18m5m4J01j6l5K0K4oK6m2J8pO
1724A3n9Q2m2k5K0jJ1J8Qo4K7J1k7L0p1O0l3J7nQJ6O7p1M7j5o0j4N8m%K8l1Mj4
$$ plain form
1758 -11 18 42 -3 7 3 -36 1 24 9 -18 -20 -7 37 -21 82 43 20 -62 -25 6 -33 28 -30 -40 -8 -52 9 22 14 8 -8 -41
1790 -41 -11 10 -18 15 46 -27 26 20 -28 0 -16 -8 -27 51 3 34 -27 -17 11 -31 18 37 5 -21 -14 -24 28 -21 -58 -23 17 35
1822 35 -26 -40 -17 -46 -26 52 30 1 6 -47 -99 -19 5 10 40 -3 -6 -25 16 17 65 16 -34 -51 3 53 -49 -48 -4 -37 19 -12
1854 -12 -3 -23 10 19 -15 25 52 6 -21 -17 4 0 -21 -24 -35 -49 -48 -10 -31 26 14 -30 -9 6 0 -17 48 -23 13 -8 4 30 54 -21
1888 -21 -13 21 15 0 21 -22 -14 38 6 -15 26 -14 -56 -13 -30 33 -33 -48 -6 -49 23 -2 13 5 -10 54 34 -43 0 35 4 -8
1920 -8 -40 -20 -6 -2 -11 -17 -45 18 -24 -31 30 25 -13 3 27 -9 45 -26 -23 50 48 -62 26 -26 64 -34 -35 19 -38 45 -22 -36 11 -6
1954 -6 -17 19 40 -5 6 -24 -22 18 -28 44 -11 -9 -22 46 61 68 -5 -29 -33 -1 2 -38 22 3 -8 33 -74 21 28 -20 -16 -57 -88 -34
1988 -34 1 -40 -53 15 -6 -3 -10 -2 20 -47 -7 -32 35 -14 27 3 20 -24 7 3 18 -20 23 -5 -1 34 -23 17 29 28 -44 25 -7
$$ packed form
1758a1K9K4m5J0ml9L7K3j5k7kJ3M4n8J03l9k3q2L7L1l9O1n8j0L2m4O1J3qoj6l3
1790d1L0K1k8L3L1p3N3om8K8j6Qj9P8m8L1o1J0K8m2M9J9l2k6Pj0N2m9l7L5M0J8
1822C5o1j4K3k9K0P8k2k9Nn3n2Q0K4NL0m3lj9M1JM8m9n0j7N4N0j02JM4l3N6l1
1854a2Rk0L3Rl4M0K7m6k7MK1mk1lj1j4JL8k1N7j2m4K1J5oj7O5p1L6k1J2K6K4p5
1888b1QL4oj5K1m3QN2l2k1M1m0m2M3j7O3o6j5M2m3P2k5J5qj5O4k0p7M3L5l1j2
1920hl2K0J4Mrok8O3m2pO1nl8J6K4l6N4p1LP3kj10Q8n2R0r8jN4n7Q3o7j4M7j7
1954fj1L6K1m5J1l0KM0m6P2n5Kj3O8J5Pp3k4mL2Lm0O0j9j1M1j07R5Pm8Mm1l1N4
1988c4L5m1j3O8k1LpQK2o7M0k5O7m9M1k4J7m4L1mJ5l8M3k8ML5n7M0J2jp2O9l2
$$ plain form
2021 -7 -61 -5 -9 10 -33 -33 45 -18 -12 -13 -3 -54 -72 -10 -51 -2 -57 -14 -16 -8 -13 15 3 64 13 -17 35 28 -13 -12 22 15 -54 -32 -21 45
2057 45 -9 15 19 -41 23 -6 31 -46 16 21 -26 -70 22 -26 -43 -29 -11 -36 -16 -5 -29 40 1 -9 2 -7 -28 -34 42 -18 1 -36
2089 -36 -57 -10 -50 -1 -34 -44 63 4 -1 17 -11 -24 11 19 -5 -11 -24 8 16 -34 -39 44 -45 -51 39 -6 -23 -21 -5 -10 25 -8 1 -37
2123 -37 -38 -31 -3 -14 34 29 -24 37 -23 -25 -18 49 24 -29 -18 26 -48 2 20 46 -2 -23 0 -30 -45 -8 -23 -30 -21 25 47 -5 -62 21
2157 21 46 -41 15 -2 78 53 -1 -12 -14 27 -13 -32 30 25 -21 -39 -35 -42 28 26 4 20 19 -11 37 32 75 -41 -26 -8 -16 -9 16 -28
2191 -28 27 -73 -36 25 5 -17 7 16 -19 61 43 -5 6 -1 -5 -20 28 1 12 -7 -20 21 14 -10 -2 15 6 16 -26 -33 48 -16 -18 55
2225 55 50 7 6 15 -57 -28 -38 14 10 -16 -25 28 -33 -49 -4 -21 0 -24 -1 -21 5 -1 -12 -48 -25 3 15 -14 26 24 10 17 -9 31
2259 31 -26 -11 -15 34 23 22 46 -41 40 -2 56 -14 -26 -49 37 -4 -34 -15 -36 45 28 27 -41 14 5 4 -61 23 -8 15 -12 15 14
$$ packed form
2021gn4N6mJ9m3%P8o3OjJ0n1j8O2m1M9n5M3kQnK8j2O1n1l0N2pm1JL4po9K2J1O6
2057D5n4K4Mo0O4k9L7p7O2Nm7m4R2m8j7J4J8k5K0J1k4O9l9j0J1rk1oP6o0J9l7
2089c6k1M7m0M9l3j0J07n9nJ8k8j3L5Qk4oj3L2Qn0nQ3q9oR0m5j7KJ6nL5l3Rl8
2123c7jPK8j1M8nn3O1o0kPO7k5n3J1M4p4N0J8K6m8k1K3l0j5L7j5pRM6K2n2n7Q3
2157B1K5q7N6j7Q0k5n4j1kM1m0j9O2nm6j8MpP0kk2J6jl0M8nM3j16J5J8qPK5m4
2191b8N5j00L7O1k0k2K4Rl5Q0j8m8J1pmj5M8k7J1j9j3M1pk4QJ7rJ0m2pQ1o4kP3
2225E5nm3jRp2K9j0N2mk6rN3o1j6M5j7K1k4K3k0K6oj1l6K3K8J2k9M0kj4Pk6M0
2259C1n7J5mM9j1jK4q7Q1m2N8p0j2k3Q6m1l0J9k1Q1j7jo8N5rjo5Q4l1K3k7K7j
$$ plain form
2292 14 18 11 -19 5 18 -30 -35 -26 20 14 -5 -17 -25 -3 53 -19 23 60 1 16 -58 17 -3 40 -19 -20 44 -7 12 -21 54 40 67 -19
2326 -19 12 44 30 20 35 -25 -4 -47 -8 -22 -31 -5 6 35 37 -11 32 -24 -3 2 -52 -13 7 -5 40 23 5 7 -44 -18 -9 -25 -14
2359 -14 -22 -9 33 -54 6 3 46 7 -3 -22 -41 5 -49 8 -30 -5 31 1 -13 5 -7 92 -38 -24 -19 13 19 16 32 -37 2 -34
2391 -34 -43 -22 -9 39 37 12 54 -38 -4 -11 14 -11 16 -23 -57 -9 -10 -7 -34 -4 -18 17 50 -91 -13 -37 -13 47 -73 17 -15 4
2423 4 -26 -1 2 26 10 -21 10 -26 -60 -6 62 -19 0 0 35 -25 -108 -53 -51 28 -32 -17 6 10 8 -52 30 -34 -20 -7 -18 -8 32
2456 32 -16 4 10 -42 85 2 5 -5 -4 -33 2 22 -15 -32 20 4 11 56 -52 -2 0 -17 11 -39 -86 39 54 -21 -21 2 13 58
2488 58 13 -19 25 63 -8 6 -2 -14 -30 40 -20 27 5 -2 -3 10 1 14 32 -6 -15 -2 61 -15 26 32 4 68 38 27 17 -2 -1 -20
2522 -20 1 -22 15 -28 -11 12 3 0 54 -25 41 -8 28 -6 -25 5 14 15 12 -11 -3 41 -40 -22 -42 23 -6 -29 -28 29 11 24 -16 31
$$ packed form
2292A4Mpl0K4J3m8nRM6oj9j2qK2N6p2M2L7n9J5p4P5k0M3n9jO4n1J9l3P5j4K7q6
2326a9L1L2j4j0J5o0K1m3L9j4rK6J1K9Km8M3n6K1Nn4L9K0j2M5j7j8Kn1K6Rj6J1
2359a4qJ3M2q7O0lM3l9j0j9j9M6n4N7l8K5L6l0j4J8j2R9j30J4NL2OlJ6o9L9l6
2391c4rK1J3M8kk5M2r2L4pK5k5K7l9l4M8jLk7L0j4L5L3j41P8k4K4O0j20R0l2J9
2423Dl0K5LK4j6l1L1l6l4N4O8q1J9%L5o0q3N5KP9o0J5K3Mko0Q2o4J4J3j1J0M0
2456C2m8K0On2J27q3Lj0Jk9L5K0l7j7N2j6PM5j08N0Kj7K8n0m7J25J5p5%K3J1M5
2488E8m5l2M4L8p1J4qj2j6P0o0M7k2pjJ3rJ3J8l8rJ3O3p6M1Ok8O4l0j1j0j9Jj9
2522b0K1k3L7m3J7K3rlN4p9O6m9L6l4j9L0RJlk3QM4q1J8k0O5k9k3JN7j8J3m0M7
$$ plain form
2556 31 -6 -9 -36 -7 9 -27 -37 -21 9 9 8 -15 14 62 21 -5 7 -13 -55 -13 -38 39 40 -19 -13 -12 4 10 74 7 49 9 27 -27
2590 -27 -3 19 -10 35 33 -25 -10 28 -24 16 21 -27 -9 0 -16 -10 46 13 18 10 18 -58 -16 -26 -16 3 -49 4 0 -24 -29 1 34 2 2
2625 2 -35 4 -29 -53 -38 -33 7 -26 -32 40 17 40 22 1 -12 -3 21 -7 -14 83 -2 -7 0 28 16 -72 33 22 -15 30 2 -24 -24 77
2659 77 12 -26 9 4 -33 -83 11 -28 11 -40 -24 21 9 -62 -38 -9 42 -51 14 -64 -28 11 32 -25 -29 -19 -1 -16 34 19 -12
2690 -12 -75 22 31 19 -58 10 -26 23 3 35 -35 -31 4 42 -38 34 25 -26 -19 3 -25 -10 -9 -45 24 2 33 -68 -42 5 17 39
2722 39 -10 -70 43 -26 35 78 -24 14 25 -12 7 -11 25 18 -4 4 -2 -24 -28 28 2 -1 43 -13 1 -1 -3 -51 -16 32 -14 42 -7
2755 -7 -5 -12 36 32 -72 -46 26 -3 -40 -1 -59 35 0 -27 -37 2 28 24 14 20 12 -34 -43 37 -31 -21 40 -25 21 -34 -7 -13 13 -14
2789 -14 -27 -29 -25 33 45 -48 24 -40 -2 15 -17 5 15 -71 -7 -10 -16 42 21 38 9 6 -22 -4 10 35 30 -2 -32 -25 -30 -25 -16 -47 13
$$ packed form
2556C1l7lk7K9J6l6j0J6L0%jk3K9M8m1k6J2k0m2M2k5P7Jn9OJJ6OO4o7M2m0J8n4
2590b7K4K2k9M5kn8J5L8n2M0Nm8J8Rj6ON6l3NqQp6M2j0J0J9n2N3mk4nL0L3l2%
2625Bl7L9l3k4J5NM0l3oP2k3K3j8k1j3RK4k8pR7q5nPK8j2q8J05j1l7M5k8k6%J01
2659G7o5l8L5nl7n0R4l9L9n1J6M5j2p1K4K9N1r3O5p8L6L9K1n7mJ0J8j5N0j5l1
2690a2o3R7Rj2p7O8l6M9k0L2p0ML5L8q0P2rn1PK2k8J5Jl6O9k2L1j01K6M7J2K2
2722C9m9o0J13o9O1M3j02L8J1l7J9j8L6pk2Qok2mN6k6lM4n6J4kkm8L5M8m6N6m9
2755gKpM8mj04K6P2k9l7L9n8R4l5k7j0L9K6mj0Oqm6rQ0o8J0O1o5M6n5K7oK6k7
2789a4j3kMN8J2r3P2o4L8J7l2K2J0q6O4loN8k1J7k9lk8J8J4K5nl2l0PnNRl1O0
$$ plain form
2824 13 -51 -21 7 18 22 12 -9 -42 22 -18 -5 -10 -30 -41 -27 22 -29 3 -17 60 -14 -16 -13 -5 -9 -29 -19 12 17 29 17 46 15 -5
2858 -5 -19 -62 -14 37 -7 41 27 15 0 -27 11 -50 12 -21 7 -21 -42 -4 25 -22 -17 -13 99 8 26 31 -2 -20 -23 -50 -3 21
2890 21 23 39 -33 14 -42 13 2 12 -17 -59 -9 -46 -34 25 56 -33 -7 45 43 -18 11 -32 5 28 -23 -21 -38 -65 16 42 2 12
2922 12 46 -47 -22 -24 -43 -16 45 3 20 42 64 -30 -16 7 8 4 -37 -16 -43 -9 12 -3 -20 48 -15 2 -36 30 -14 -19 15 25
2954 25 3 0 -20 -59 -16 -43 8 -58 9 14 29 39 -16 34 -21 5 25 12 23 -5 1 -40 -31 89 3 -25 -31 -37 1 -15 62 -18 -14
2987 -14 -15 -37 -1 -35 16 17 -19 -29 16 17 -18 7 28 -58 54 -26 14 -9 -18 54 -7 4 17 44 -19 29 -21 4 22 -1 -20 5
3019 5 11 -4 -16 9 10 2 47 3 -10 -12 -13 48 2 29 -16 -41 31 -30 9 -35 -12 18 18 8 -9 39 -12 -13 -5 49 19 -7 31 -53 -42
3054 -42 -4 -11 33 -23 -25 -12 3 -32 -3 -5 11 -26 -15 -41 -19 71 -2 26 -5 -33 5 32 -34 -3 46 -38 -1 -9 -6 -27 -15 -23 49
$$ packed form
2824A3o4L0K8J1Mj0k1l3O4m0J3nk0j1J4M9n1L2k0P7p4kLQmk0J0L1NJ2j2K9l1k0
2858ej4m3M8N1m4M8j4j2j5k7L8o1O2l3K8k8k1L8K9m7NMJ12r1J8Nl3j8lk7M7K4
2890B1KJ6p2M7n6N5j1J0k9m2N0l7J2N9L1q9K6N2ko1K9m3L7K3n1Kj7k7Q1K6m0J0
2922A2L4r3K5kj9K7O1m2J7K2K2r4J4K3Jmm1K1k7L4K1j5j7O8o3J7l8O6m4nL4J0
2954B5k2lk0l9M3k7N1o6O7NJ5J0n5N0n5K6K0j3J1k8Om1RJ20q6k8ooL8j6P7q0M
2987a4jk2L6l4N1Jl6j0M5Jl5K5K1q6J12q0M0k3rP2o1J1J3K7o3M8n0K5J8k3j9K5
3019EOj5j2K5JqM5m4j3kjO1m6K7m5k5P2o1L9m4K3L0%j0j7M8n1jQN4l0k6L8q4J1
3054d2L8pM4n6kJ3J5l5K9kJ6l7J1k6K2R0p3K8l1k8L8K7o6L1M9q4L7qLk1J2qP2
$$ plain form
3087 49 -24 -27 -18 17 -15 -26 8 -3 -4 -6 -15 -17 17 -8 20 34 55 23 1 27 24 24 8 -39 -27 -10 -17 2 18 -44 6 -59 -15 16 94
3122 94 16 -23 -48 13 31 -25 11 10 46 -8 35 -10 20 32 16 15 25 -40 49 16 -17 -60 -6 -3 2 31 -44 -7 14 18 19 -5 -7 4
3156 4 -29 0 -21 2 15 30 -32 25 -43 35 38 -62 -6 11 -9 18 -31 -8 51 -32 -57 20 -9 37 -19 48 6 60 46 -3 -10
3187 -10 -69 -7 25 36 -17 51 1 -1 -14 -32 -50 -4 -19 2 2 -28 22 -14 -19 -3 -34 -65 5 52 23 -24 -47 6 -5 33 13 -13
3219 -13 -18 -13 13 32 14 -21 -31 11 -9 -16 -27 -6 -19 47 -14 -59 29 7 -59 21 -15 49 10 34 -10 15 -21 -16 -38 -10 -11 68 12
3252 12 13 -2 26 -2 -4 -23 -36 -11 40 2 45 -22 -15 20 31 -19 -19 1 -17 42 1 -29 12 -8 -2 -17 -14 41 -66 -47 -23 -24 48
3285 48 30 12 26 20 42 -24 23 -17 -50 28 -43 -6 51 -12 -33 -30 -43 -11 1 1 -25 -31 27 -14 -2 33 18 -2 24 -20 4 25
3317 25 31 -16 13 -3 -9 56 17 5 2 -5 16 -75 -12 -8 -41 -30 11 67 45 -27 18 -53 -4 75 41 30 -11 59 -9 80 1 34 4
$$ packed form
3087D9p3lRL5l2j1L4j1jkrkL4k5K8J4K1l2k2K6l%j6m7J2J7pJ9J6o2N0o5M4L1P8
3122I4p8l9k5O1J8n6L6jL6n4M3m5L0J2j6jJ0o5Q9l3l3m3N4LNK9p5L7K1MJk4kJ1
3156Dl3K9k1K3J3J5o2N7o8P8Lj00N6J7k0K7m9K3N9q3k5P7k9M6n6O7m2N4j4m9p
3187a0n9O2L2J1n3O8n0kj3j8j8M6j5K1%l0N0l6nJ6l1l1P0M7k9m7k3N3j1L8k0k6
3219a3nNK6J9j8l5j0M2k0pj1K1j3O6o1m5Q8k2o6Q0l6O4l9K4m4K5l6Nk2K8jP9n6
3252A2Jj5K8k8kj9j3K5N1l8M3o7PL5J1n0%K0j8N9m1l0M1k0Oj5LN5j07J9K4jP2
3285D8j8j8J4oK2o6M7m0l3P8p1L7N7o3k1Lj3L2J2%k6oN8m1J2L5j5k0K6m4K4K1
3317B5Om7K9j6oO5l9j2lpK1r1O3Ml3J1M1N6k2p2M5p1M9P9l4j1m1P0o8Q9p9L3l0
$$ plain form
3350 4 -5 -3 -14 13 -5 -10 -24 2 6 -4 -12 14 -28 -5 -17 9 57 -36 -37 -2 35 7 -20 2 -11 -5 16 15 20 -15 11 -44 36 -40 -10
3385 -10 -26 28 20 -18 67 -15 -11 90 -13 -46 -1 -26 -36 -44 58 -5 -35 -6 -40 -22 31 75 -4 2 -12 19 -14 -28 26 5 -20
3416 -20 -93 -35 -13 -21 25 -11 -23 6 0 -15 -24 89 11 -36 -92 14 9 3 21 13 27 -16 0 30 29 2 44 -7 43 -10 -55 20 -42
3449 -42 -18 -6 -17 3 -24 32 -8 -35 -11 -26 33 14 29 33 10 -34 13 -38 -47 27 38 36 -27 15 5 -10 4 -34 -5 3 -53 -17
3481 -17 -22 -14 -4 -10 19 -31 26 -13 31 6 -10 -38 -7 15 67 -25 -57 -97 -35 1 18 9 -25 8 42 -8 6 -48 34 9 -31 43
3513 43 17 22 -3 -24 20 -16 44 15 31 4 -37 18 -10 -63 -8 31 48 22 55 -27 -68 -11 47 -4 -1 -16 -9 -19 -18 42 29 16
3545 16 -41 -9 -21 37 27 14 -51 -60 -20 5 -29 12 8 -1 29 34 40 -12 -4 31 -1 -7 -11 -4 20 -55 -23 8 17 -60 25 14 -1 -21 -7
3580 -7 24 -22 -47 2 39 -41 6 6 -33 -2 -53 13 -1 -29 58 -1 20 33 39 37 36 -87 29 58 -11 -41 1 -35 9 -70 -20 29
$$ packed form
3350DrKj1K7j8nj4K6Mj0qK6m2K3j2K6M8r3jL5L7k8k7K2j3OK1jNl5K6n5Q0p6L0
3385a0j6N4ql8Q5q2MJ01j03l3M5k5j0qJ02o3l0K9l4J8N3M4p9Oj4L1l3j4N4k1k5
3416b0p3N8K2qM6l6j2K9oj5rJ13p8m7n6J06noJ8qJ4m3J6L0jk7M2n1N0n3m5P5o2
3449d2K4J2j1K0k7N6m0k7K4j5N9j9J5Mk3m4M7n1rP4J1ko3M2j0j5J4l8K9Qn6L6
3481a7nQJ0oK9n0N7l9M4k5j6k8L1K2N2r2l2m0O2L6J7rl4L3L4n0J4n4Q2k5m0P4
3513D3k6Nk5k1M4l6O0k9J6k7m1N5k8n3N5L9J7k6L3q2m1N7N8n1Lj5Pj0JO0j3j3
3545A6n7L2j2N8j0j3o5rM0K5l4M1mrL0NOn2QL5l2omPK4p5L2L1Rp7Q5j1j5k0J4
3580gL1m6k5M9L7q0M7%l9L1n1O6j4k8Q7n9K1J3Okjj23J16K9o9l0M2l6M4p9N0M9
$$ plain form
3612 29 55 -2 1 -28 21 -13 -9 -74 6 15 -29 -68 -1 15 -22 -19 -11 -37 19 29 -30 19 27 -34 -17 -58 7 1 55 19 -52 -13 -33 -1
3646 -1 -19 59 20 32 3 -53 26 10 -18 2 1 8 -36 14 -33 23 -8 -19 -52 -62 -60 -71 16 -10 -10 -14 0 21 -13 68 -14 25 -27
3679 -27 52 -12 -44 -23 12 -24 -32 -48 -36 25 12 10 -69 4 35 59 -15 -3 -35 6 -57 -66 -25 -36 29 32 -40 36 -22 -48 16 23 30
3712 30 31 21 29 -13 -14 -49 -1 9 20 10 49 -2 -38 5 35 15 -6 28 -1 36 -8 25 0 48 -6 -16 -17 -51 -79 26 -10 -44
3744 -44 -25 -21 -15 -23 1 -52 -1 1 15 19 16 44 19 12 6 54 -3 -29 35 -43 55 0 44 -32 12 27 19 33 41 36 3 -13 -19 19 -10 0
3780 0 48 15 18 -22 10 -34 -6 53 -36 35 13 26 10 40 -21 13 31 0 19 55 15 -60 37 17 42 -33 3 -52 55 -11 -12
3811 -12 -1 9 13 38 -10 -39 12 -26 91 -14 73 -22 -80 -12 -2 -11 58 38 -22 41 13 -1 -6 -49 -11 -2 -29 5 -21 -74 -42
3842 -42 42 -5 24 -35 -45 33 12 -14 -48 -32 -9 26 23 59 11 20 -51 11 -18 22 -3 8 0 -42 59 -2 -15 6 24 9 -4
$$ packed form
3612B9K6n7Lk9M9l4Mo5Q0Rm4l9O7J6l7LQk6N6J0n9M9Qo1J7m1O5oN4l6p1L9k0L2
3646aj8P8l9J2k9n6P9j6k8K0jPm4N0m7N6l1j1l3j0Kj1Q7k6%mJ4K1l4Q1q2L9n2
3679b7P9o4l2K1L5l6qj6J2O1j3kp9P3L1K4p4J2l2M1o3rM1j1O5Lp2P6n8k6O4PP
3712C0Jj0Qm2jl5M8J0J1j0L9n1l6M3L0k0k1L4k9L7m4L3k5M8n4j0jl4k8J05l6l4
3744d4J9MOqK4n3N1KJ4MlK8k5poM8n7k6O4p8R8n5M4p6M4J5qJ4Qnl3j6oL8k9J0
3780@M8l3Lm0L2m4K8N9q9P1k2J3j6L0o1L4J8l1J9L6m0p5R7k0K5p5L6n5J07o6j
3811a2J1J0MK5m8k9N1l8J17j05Q7r5n8O8J0rO9k0o0O3k8j4nm3L8Rk7L4k6n3L2
3842d2Q4m7K9n9j0P8k1k6l4J6K3L5lL6m8Rp1O2k9M0k5J1qm2J01o1j3K1J8j5j3
$$ plain form
3873 -4 -16 -29 14 25 -83 -50 11 40 -14 8 19 8 38 -25 30 -2 7 -53 8 27 53 -41 58 -8 40 35 -3 -17 63 -7 42
3904 42 51 19 16 -35 32 30 -29 39 -11 -44 6 19 64 2 21 0 -56 33 39 -2 0 18 -49 40 27 12 -11 -51 17 4 25 9 -14
3937 -14 13 10 12 35 12 2 1 -22 32 -12 26 12 -28 23 -46 -44 44 0 20 12 -1 4 20 17 27 -26 0 69 -29 24 -5 -22 51 31
3971 31 -8 16 6 29 0 35 -21 20 14 13 -5 -39 53 -2 -6 50 22 28 30 -33 -28 46 7 14 -20 3 43 11 2 9 6 -2 -6 -6 17 -15 -27
4008 -27 26 -34 -6 -21 52 -14 -10 4 8 -18 37 50 22 36 -20 14 -26 15 -11 22 -10 53 -48 22 -8 57 -16 -41 26 -30 52
4039 52 -4 100 -42 16 -35 -12 29 28 10 -14 -5 21 33 -49 3 7 17 24 66 24 -21 -14 30 51 -25 -10 12 -4 29 -41 7 2
4071 2 36 58 7 22 0 20 -1 -50 14 18 10 24 5 10 -18 5 -5 44 -16 -46 54 30 -5 3 3 33 20 9 -39 24 7 42 10
4104 10 82 -20 21 3 -7 20 53 10 4 -2 -43 7 -5 26 -19 -31 -9 29 -9 -11 4 -22 -31 42 -43 35 7 7 -30 42 -47 35
$$ packed form
3873dj2j3M3J1j08L3O1K9n4K2J1j1L0o3N5l2Ro0O1J9K6r4R9o6M8nl8j4Q0p0M9
3904D2Rl2ln1O7kn9O8n0l3N0J3M5o2J9k1n6Q9Om1KJ8o7Q9j3j5k3m0O8j3K1j6k3
3937a4K7lKK3k3j0jk3N4m4L8j4m0N1o9KQ8m4K0qj3NJ6lJ0n3K6O9r8N3k9j7P3k0
3971C1l9K4j0K3k9L5n6M1ojj8l4R2n5mN6k8OKo3NP4l9Pl4K3M0l2rPlqm%K3l2j2
4008b7N3o0K8j5P3o6MJ4Mk6N5J3k8J4n6L4m0M1k6L3l2O3j01P0l0O5p3k5O7n6Q2
4039E2n6J04j42N8n1K3M1jj8k4RK6J2q2N2MJ0PM2m2m5PM4K1p6J5K2j6L3p0M8n
4071BL4K2n1J5k2K0k1m9O4MqJ4j9Nk8K3j0M9o0l0J00k4l5Q%L0j3j1m8O3j7L5l2
4104A0P2j02M1j8j0K7L3m3oom1N0j2L1m5j2K2L8l8kJ5k6rP3q5P8k8%l7P2q9Q2
$$ plain form
4136 35 7 -65 -26 15 46 -14 -47 -14 -48 24 25 38 -12 5 3 -8 24 -9 -10 51 9 19 29 -29 53 -10 4 -12 -36 -60 2 -11
4168 -11 43 32 39 8 -12 12 7 -26 -33 35 6 12 18 -6 -29 -5 6 73 -77 -5 54 36 40 -47 -50 47 41 -41 -14 17 -31 -14 2 13
4202 13 74 35 3 41 13 -35 -24 22 42 -20 0 -47 43 -34 -7 -24 -41 48 -53 22 39 33 77 33 27 -22 5 34 -19 34 65
4233 65 46 -32 -24 13 -67 -39 -12 -16 -44 39 -35 12 -12 -6 -18 -36 -7 8 6 -31 48 -3 12 7 -32 0 -21 -3 33 3 38 2 -37
4266 -37 45 -57 9 21 44 -7 29 -22 20 8 8 -25 4 -7 -80 -13 0 12 68 23 16 35 2 18 21 -45 -6 39 9 -1 -4 -12
4298 -12 -2 34 -3 -43 -5 19 2 3 80 -37 16 -18 -66 -9 32 -20 -59 -3 -75 35 10 26 18 0 51 -14 6 15 23 28 -14 -20
4330 -20 3 9 -65 0 17 0 -18 -19 2 74 18 60 36 -20 -73 33 13 42 -23 10 19 -10 -1 15 -12 -25 -52 -14 0 -11 44 9
4362 9 -8 17 2 -9 -12 -55 -6 -18 8 -3 6 4 25 -78 42 -16 -54 -44 32 -6 -72 31 12 -53 -10 1 -29 12 -18 53 36
$$ packed form
4136C5k8p2L9M1L1o0l3L3l4P2JJ3n0J7kj1L2l3jO1m2J0J0n8Q2o3J4j6k4k4O2j3
4168a1N4j1Pl1k0K4nl3pO8k9OOk4k3K4J1O7j50P2N9j8Mq7lR7oq2K7L1m8J7J6J1
4202A3O1l9l2L8k8m8J1M6K0o2K0m7R0p7K7j7j7Q9j01P5J7oM4m4om9K7K9n3N3L1
4233F5j9p8QL7q0K8K7mk8Q3p4M7k4Oj2j8K9J5kl7P9n1J5nl9L2k1J8L6l0L5l6l9
4266c7Q2j02O6J2K3n1L6n1M2j2%l3K9j1p3O7J3J2N6m5pJ9l3J6Lo6L9M5l0j0lq
4298a2J0L6l7m0L8K4j7JP7j17N3l4m8N7M1n2l9N6p2J10k5J6qj8N1o5K0RQNm2o
4330b0K3Op4O5J7j7j8jK1P2n6M2k4n6n3J06k0K9o5L3Rk9RJ6k7j3k7L8J4j1N5l5
4362Ij7K5j5j1lm3M9j2K6j1RkK1j03J20n8l8J0P6l8o6J03j9o5M3J1l0M1l0P1j7
$$ plain form
4393 36 -19 3 -43 -15 -45 -10 -10 -38 5 -8 29 -18 5 7 33 -28 -17 52 4 -46 37 -6 -46 33 -45 -46 -29 -17 -5 32 -39 -10
4425 -10 12 34 -59 -9 21 -29 4 5 -17 1 -63 -23 -12 -11 40 -11 -48 -49 10 -32 13 30 -14 7 56 25 -62 -13 15 -28 -2 11
4457 11 -17 40 -17 3 -6 -3 26 -10 48 -35 30 -16 -5 -10 -15 1 -24 7 -36 -14 40 -40 -7 -9 -16 -12 -31 -34 58 13 19 20 2 1 -6 -17
4493 -17 34 -49 -29 -26 31 8 -29 -19 -12 -7 -31 44 -17 -55 -55 30 -40 -8 35 -29 6 14 3 41 8 -30 35 14 15 -29 -11 3 41
4526 41 17 -15 55 19 -62 -46 -41 39 -67 13 -22 33 -30 -10 0 -28 -53 -26 -12 64 52 -17 4 2 41 -29 -58 -23 5 -40 33
4557 33 -4 10 -5 8 44 -23 -2 24 -27 25 1 -10 6 -12 30 -5 -10 -7 -50 -47 -23 11 -2 -24 3 -13 23 22 5 7 5 -43 39
4590 39 -111 -10 47 11 -29 5 -11 -7 -32 11 4 -1 79 -16 8 60 -13 29 11 23 -6 19 -13 53 -60 -49 -4 13 -24 26
4620 26 -16 -51 -32 16 -4 5 -19 1 27 9 -12 -3 -15 41 9 -48 -17 21 37 -7 -30 18 11 5 21 13 61 -35 1 -4 -34 28 -14
$$ packed form
4393C6n5K2m6K8l0L5%k8M3j3L7m7K3KK6o1J1O9m8n0Q3m3m0P9p8jJ7J2J2L7p1K9
4425a0K2K2r3N0L0n0L3Jk2J8o4M0J1JN1n1l7jN9m2M5J7m4K1M9l1q7M9K8m3K6J3
4457A1k8N7n7K0rLK9l6N8q3O5m6J1nnJ6k5L1m3K2N4q0L3kpMj9lR2m5OJj8jpj1
4493a7N1q3K0LN7k3l7J0PNk4P5o1l8%Q5p0L2M3o4L5Qj1L8l3l8O5k1Jm4J8J4L8
4526D1k4l2P0l6q1J6NQ0j06Q0l5N5o3K0J0k8k5K7J4P6j2o9K1kL9p0k9L5K8m5P3
4557C3l7J4j5J3L6o7K1K6n1N2k4j1J6j8M2l5nLm3LK4L4j3k2K7j6L6jj7Kkm8Q2
4590C9j50J01N7l6m0L4j6Mk5M3pnQ0r5K4N2p3M2j8J2k9K5l2O6j13J1M5J7l7N0
4620B6m2l5J9M8k0Rk4K0K6j8k1Rj2N6l2n7L1L8J6m4k3M8poJ6qM8r6L6nl0O2m2
$$ plain form
4653 -14 -26 -3 -14 26 -25 15 -25 37 1 -19 -14 -7 0 54 -12 18 17 -32 39 -4 -32 -7 -8 -24 51 39 71 41 -25 37 43 -1 19
4686 19 9 -33 -3 -6 23 71 9 35 -37 13 44 -32 27 -10 -7 35 -8 -12 25 -2 -57 -16 -4 15 44 16 -17 6 39 36 -58 -56 14
4719 14 9 -17 -49 30 -13 -32 8 8 21 -5 44 -40 0 -41 42 -1 10 -53 -14 44 -46 -29 -6 -20 -49 6 -56 30 7 -22 2
4750 2 -20 25 -23 0 -3 59 14 -36 47 0 -28 -54 39 -18 -18 45 42 21 -3 3 -18 20 -54 63 15 -28 -41 32 -1 24 -6 41
4782 41 6 -39 -34 13 -17 26 -5 71 7 21 24 -43 -23 -28 -19 -65 1 -40 10 7 -44 18 -13 17 24 26 29 19 -13 -39 17 -17 -49 -14
4816 -14 41 -17 8 1 31 18 -7 -1 -28 77 -64 19 30 65 -20 46 29 3 30 -40 10 4 -25 -23 35 -58 31 26 62 -9 -33 27
4848 27 -47 -48 20 -63 38 1 3 39 55 35 -13 -9 -40 -58 16 20 2 -21 22 -47 -2 -7 -2 37 -20 -53 -26 49 -18 -18 -36 3 22
4881 22 -27 -25 40 50 34 33 43 5 10 -22 1 -25 26 13 45 -22 82 -11 14 22 54 60 -44 -15 -51 -1 34 50 -32 -70 16 21
$$ packed form
4653a4j2K3j1M0n1M0m0O2l6k0NPPN4o6L0jm9P1m3k8K5jj6P5j2L2l0o6O2Om4K0
4686A9j0m2L0lK9M8o2K6p2N0L1p6N9l7LM2m3mL7k7n5M1J2J9K9k8l3K3L3lr4KP0
4719A4nk6l2P9m3j9M0%J3k6M9q4M0m1Q3m3J1o3L9N8r0J7K3j4k9N5o2Q6k3k9K4
4750Bk2M5m8K3lO2m5n0Q3m7k8k6R3n7%O3lk1k4Ok1L8p4J17m8m3j3P3l3K5l0M7
4782D1l5m5NM7l0M3l1P6o4J4Lo7K0nRm6O6m1N0ln1O2l1L0PKLj0l2k6N6l4l2L5
4816a4N5n8K5pL0j3k5Ok7J05j41Q3J1L5q5O6j7k6K7p0N0ok9KN8r3Q9nL6p1k4O0
4848B7p4jO8q3J01l7KL6J6k0m8Ml1j8P4Mj8k3M3o9M5nNL9n7l3K7P5o7%j8L9J9
4881B2m9KO5J0j6jJ0l8Nl2K3k6N1j3L2o7J04r3K5QL2Oj04K9l6N0L5J6q2l8Q6N
$$ plain form
4913 21 33 -23 -27 -38 -3 -50 -16 42 -12 -4 58 22 -24 48 -19 -15 14 -17 -11 -13 10 -11 3 -9 -12 2 17 -11 -44 23 -43 61 37
4946 37 1 2 41 -25 -18 11 -40 6 -13 -19 -9 -4 -31 2 -5 54 -6 -34 -29 -18 -15 10 -3 39 -34 3 27 -49 31 -24 -10 -33 -15 16
4980 16 81 -23 -73 56 -14 -17 57 -1 -21 -8 41 -32 46 -14 8 29 36 -10 24 25 8 40 20 -1 -48 -66 -54 11 19 -39 -27
5011 -27 -53 -43 12 0 1 33 -9 28 13 -1 11 -39 -16 -25 -15 -14 -28 18 21 -49 5 10 43 -105 8 2 17 4 -10 5 -5 16
5043 16 -19 -21 22 -36 -6 1 22 38 10 -12 -28 -6 1 25 46 27 3 24 20 28 -24 45 -2 8 50 -28 43 10 41 -36 18 -10 35
5076 35 -60 78 19 15 33 -11 29 25 -37 -50 27 16 49 -32 -5 -44 -52 36 15 -59 -3 12 -7 42 34 19 -41 50 15 -30 43 -64
5108 -64 8 43 -12 45 6 -30 49 -47 -60 18 -4 -8 -11 -6 47 21 -4 5 -27 1 83 -16 -37 26 18 -33 -14 -25 5 9 44 37 -48 43
5142 43 -6 42 -12 1 -27 -5 -56 15 5 -17 25 18 12 22 6 27 -12 -30 -37 18 -44 -23 1 -4 3 -30 57 14 14 37 -2 -74 -42
$$ packed form
4913B1J2n6mj1L5m7L4N8n4QO2l6m6P2o7MK9l1OkK3k1J4j2lJ4J5k8l3O7o6J04k4
4946C7l6JL9o6PK9n1M6j9oJ0Nk7L3pN9o0k8NJ1LK5j3M2p3L7K4p6Q0n5J4k3J8L1
4980A6O5j04n0J29p0lP4n8k0J3M9p3P8o0K2K1Pm6L4Jj7L2k0k1m7j8J2O5Qn8J2
5011b7k6J0N5j2JL2m2L7j5j4J2n0K3rJ0Jj4M6Lp0N4NL3j48J13oJ5j3j4J5j0K1
5043A6l5kM3n8L0PK1J6k8k2j6K2PK4K1j9k4K1mQn2O9m7J0M2p8P1l3L1p7N4k8M5
5076C5r5J38n9mJ8m4M0mo2j3P7j1L3q1K7l9qQ8k1p4N6J5j9M9qj5o0R1l5m5P3j07
5108f4P2L5n5N7l9l6P9r6j3P8k2mlNN3k6k5Rl2K8Q2r9k1O3qn1J9j1L0ML5pq5R1
5142D3m9M8n4J3k8K2n1P1j0k2M2poJ0j6K1l9j8pN5o2K1K4nPl3Q7m3%K3l9p2L2
$$ plain form
5175 -42 -28 -22 -37 11 -33 27 4 -35 -37 -40 2 36 -16 44 -1 13 -5 14 14 9 12 9 1 -8 18 -34 27 -4 -44 8 12 -8 7 12 23 -18
5211 -18 -28 -15 -37 8 26 15 11 -12 9 -11 26 -35 -2 -39 -2 24 5 18 -41 -34 5 -33 -69 33 15 -40 15 -8 11 -22 12
5242 12 -12 1 29 31 -8 -31 1 -1 20 -55 6 -19 -35 47 -32 24 -28 4 72 20 8 -6 9 2 -27 3 42 9 -23 18 -25 -20
5274 -20 14 -29 -3 -14 -26 -17 -21 51 49 4 -40 16 5 -61 4 -26 19 26 -12 14 -52 -23 -7 -37 -17 -41 -3 -2 -30 10 -13 -28 26
5307 26 4 53 -15 -1 -18 24 52 -5 -20 23 -28 -46 -46 -6 40 -10 38 -3 37 -31 51 35 11 -30 -34 59 74 -41 10 -3 -11
5338 -11 -12 17 -47 -19 -25 -26 -33 -7 0 -27 -20 27 -22 30 23 0 -30 12 25 16 36 1 -12 -54 -38 -35 -11 -5 -22 -51 -29 21 75 14 2
5373 2 33 -16 1 37 -61 -9 45 -17 -47 22 -77 -8 37 -10 -2 5 27 -57 -24 -42 6 11 -34 -25 -21 -25 37 -3 -29 33 -27 -8 24 -103
5407 -103 -69 57 30 14 10 -27 -32 46 20 32 -8 31 -16 -25 17 -48 -11 7 -6 -63 -39 33 -20 28 -3 -26 -30 -30 -2 -32 0 -19
$$ packed form
5175d2J4Oj5M8m4O0k3l9klM2L4n2O0m5J4j8J9%nLlqrK6n2O1l1m0N2Mk0J5NJ1m1
5211a8j0J3k2M5J8j1mk3K1k0L7o1L3l7L7K6j9J3n9PL9l8l6J02j8n5N5k3J9l3L4
5242A2k4J3K8Kl9k3L2kK1p5O1k5j6Q2p9N6n2L2O8n2j2j4J5pk9L0L9l3l2M1m3N
5274b0L4m3K6j1j2RmP2km5m4N6j1o6O5l0M5Pl8K6o6K9J6l0K0k4L8Jk8M0k3j5N4
5307B6k2M9o8J4j7M2K8n7j5M3n1j8%M0M6n0M8m1M0o8Q2j6k4m1mR3J5j15N1j3q
5338a1jK9o4K8ojpK6Pk7PM7m9N2pk3l0M2J3rK0l5j3m2J6LK4Oj7k9K2N0N4o1j2
5373BL1m9J7L6r8N2N4o2l0O9r9O9M5m7QPK2q4L3j8M8Nm5RMmO2m0k6O2o0J9L2j27
5407a03L4J26k7j6ml7nP8k6J2m0L9m7rM2o5L7J8j3n7K4P2n3M8l1k3m%K8l0L2j9
$$ plain form
5439 -19 -1 -3 -15 -59 -34 -2 -12 -44 -37 -3 1 48 29 -7 -22 -17 -6 24 6 16 39 -45 -11 21 2 -35 -1 60 -19 -24 13 34 -30
5472 -30 -14 15 10 11 53 -24 44 33 6 -22 9 39 -1 31 19 43 8 24 4 43 -3 -24 31 -33 -41 -14 -14 -31 -45 -30 24 -22
5504 -22 9 12 -4 9 64 -15 -25 -20 -13 -26 -11 20 -16 -23 -8 -8 5 36 20 -40 34 -40 -36 -16 -3 -5 -45 0 6 -8 27 40 88 46
5538 46 -20 32 1 -50 -41 -42 10 1 -36 8 -4 30 -8 -40 49 -78 -23 14 14 9 -6 -22 -8 22 5 19 -4 -25 8 -37 -9 43
5570 43 27 -1 -6 23 41 39 13 -13 -20 -23 25 -31 -5 0 -35 -14 19 6 -29 -5 -22 -27 42 14 8 4 23 -73 -31 -26 35 -24 -56 -25 -2
5605 -2 43 18 6 4 -42 3 37 15 -46 63 15 6 15 -13 -30 1 37 6 24 -8 -14 -42 -10 -40 -35 25 -20 -27 -12 16 20 -1 -13 18
5639 18 -15 -30 26 5 7 12 9 56 25 81 39 -50 32 17 -9 -4 -1 -4 34 37 19 -15 -7 -6 -17 -9 23 -7 1 -16 -17 -5 2 -52 -31 -38 8
5676 8 42 11 -19 17 4 -15 -42 -70 37 7 36 -26 19 18 -72 -22 -1 47 40 -49 -8 32 65 13 20 10 -1 -54 -46 -6 -48 63
$$ packed form
5439a9J8kj2m4K5L2j0l2PL4MM7j9l6j5NJ1L0j8J0K3q4L4L2j9l7L4O1p9nL7K1o4
5472c0J6K9nJM2p7O8j1k7k8L1L0m0L2j2K4l5J6k0L9m6k1N5o4qK7%j7j4J5N4m6
5504b2L1Lj6J3N5p9j0NPj3J5L1l6pJ5%J3L1j6o0P4p4MK0J3km0M5Oj4L5J3M8m2
5538D6o6N2l1n1RjN2rl7M4j2L4l8l2Q9j27N5L7%nj5j6J4L0j7J4k3k1L3m5K8N2
5570D3j6k8nK9J8kk6k6plM8n6K6Nl5K1L3j3l5K4j7nO9k8omJ9r6M2NO1n9l2L1K3
5605bM5k5j2km6M5L4k2o1J09m8rRk8j7L1L6l1J8l2ok8L2l0NO0m5pJ5K8Mk1j2L1
5639A8l3j5N6k1KNlM7l1N6m2q9Q2j5k6NLlL8Lj8l4QJj1QL2l0Qj7jJ2Pn4K1pM6
5676HL4l1l0L6j3j9k7k8J07l0K9o2M5jr0N0K1M8pq9M1M0L3n2Pj0j1n3QM0m2J11
$$ plain form
5708 63 7 9 35 53 49 10 13 -53 12 8 29 -14 -14 -40 -9 51 -39 10 21 -27 32 -16 -4 7 25 -3 2 53 13 41 30 -35 10
5741 10 58 -16 1 47 -35 36 -10 -63 22 -22 14 -11 89 24 -23 20 -4 -3 -21 -23 48 -20 9 22 10 59 -19 2 -31 -5 9
5772 9 51 -23 -55 -23 -44 3 -26 17 -5 -50 37 38 -72 -63 4 -38 -5 -14 -56 17 -57 -14 -5 -14 -11 40 -23 -7 -19 -44 -2 -27 66
5805 66 52 -41 -90 -11 4 -30 -17 -17 -30 -24 -10 1 39 -27 -4 14 -31 32 -4 -42 25 -7 1 33 -74 5 -2 -13 -5 3 24 31 50
5838 50 20 24 3 14 12 12 -3 22 34 17 32 -24 6 -44 0 11 15 70 -2 -28 -6 4 -44 26 -17 -30 0 21 20 -37 21 11 -55
5871 -55 -5 27 -17 -5 -23 -30 -51 23 21 20 28 -34 24 -18 19 -31 45 -41 -26 -12 6 -9 -35 3 -14 -39 -53 -62 15 -9 -29 -28 -54
5904 -54 -1 1 72 0 -19 -53 -15 -10 39 33 36 18 -44 -14 22 26 -15 -5 -23 -10 -23 35 -11 26 36 -15 -48 12 -10 -63 34 -54 -24
5937 -24 -40 -25 21 -31 -36 23 -23 -40 -7 4 -10 -23 19 55 23 50 -12 -11 3 13 15 -26 -47 -12 44 6 -24 -1 34 6 37 -2
$$ packed form
5708F3n6KK6J8ml9Lo6O5mK1m3%k6L1O0r0M9J1m8N9m8J2J1J8k8NN1m0K8j1o5M5
5741A0M8p4J7M6q2P1m6n3Q5m4L6k5J00o5m7M3k4Jj8kP1o8K9J3j2M9p8K1l3K6J4
5772IM2p4l2L2k1M7k9M3k2m5Q7Jj10RO7m2L3rm2P3p4M3RrLN1o3J6j2k5M2k5R3
5805F6j4r3m9P9J5l4J3%j3OJ4J1L8o6K3J8m5O3l6l8O7l2QL2j07P9pj1QQK1PJ9
5838E0l0Mk1J1k%j5K5J2j7J5n6L0n0M4J1MN5p2k6K2J0m8P0m3j3L0K1jn7N8j0o6
5871e5N0L2m4J2j8pk1P4kjQo2N8m2L7n0P6q6J5J4J8j5k6L8j7k5j4rP7k4k0Jk6
5904e4N3KP1p2j9l4L8NM9oLj8o2L0L6Mm1J0j8J3j3N8m6L7J0n1l3O0k2n3R7q8L0
5937b4j6J5M6n2nN9m6j7L3J1j4j3M2L6l2K7o2JJ4J0Km1k1L5N6l8l0K3L5k8L1l9
$$ plain form
5969 -2 -47 11 35 -42 9 33 -31 16 -2 -29 -50 -4 -66 -18 54 7 23 -13 -16 0 -46 9 36 31 -41 40 -1 -29 -7 -12 17 -72
6001 -72 -23 -35 5 12 18 1 52 66 -20 -59 2 3 24 8 -10 -18 -48 97 -39 -8 -43 -21 34 -7 56 16 56 -10 -58 -41 -15
6032 -15 3 0 -3 -49 4 4 -19 -4 11 3 -35 50 25 26 -17 -48 54 -35 -21 -7 1 5 -37 -59 -9 8 56 -23 -2 42 -4 -12 11 39
6066 39 -3 33 42 -44 5 35 15 24 1 -17 21 -15 4 4 4 102 -21 -27 -7 -22 26 -31 5 -35 45 -18 -48 4 -7 2 12 -23 23
6099 23 11 -12 -55 95 -8 24 18 -19 -30 -25 35 -24 38 -74 -42 -64 -39 61 -20 -22 17 -27 18 -22 43 6 67 31 49 -36
6129 -36 -52 1 -23 16 25 13 -6 -11 -17 -101 7 10 -7 33 -20 46 -50 -37 -14 -27 -6 2 -19 13 -3 -38 12 -29 65 18 -11 27
6161 27 -7 -4 -9 -5 -12 -27 -14 -40 -35 28 1 2 -10 18 -8 -6 -30 -9 51 10 16 35 23 -20 3 -46 -42 36 9 21 37 83 3 39 -14
6196 -14 -34 27 22 28 -17 -26 10 -11 3 1 19 62 0 24 12 60 47 10 -18 -16 -46 -7 14 9 -12 -28 -15 31 30 -1 -50 65 -9
$$ packed form
5969bm5N8K4p7N1K4o4M7j8k7k1M6o2M8P2m7J6l6lJ6m6N5K7np2Q1m1k8K2nK9q9
6001g2M9j2M0POj7N1J4q6l9O1JK1j6j8ql0J45j36L1l5K2N5m1O3m0M0o6m8J7K6
6032a5J8llm6N3%k3J5J5ql8Q5k5Jm3l1J02q9J4J4QMm2k2N0J7M8p9K1M4m6qK3K8
6066C9m2L6Rq6M9L0k0Rk3j8L8l6J9%%R8j23oK0j5M8n7L6m0Q0o3l0N2j1RJ0l5M6
6099B3j2k3m3J50j03L2ol7j1NO0n9O2j12L2k2K5J00q1kL9m4M5m0O5l7O1l6J8q5
6129c6j6N3k4L9Rj2j9noq4J08Lj7M0n3O6r6J3K3j3K1Qk1L2j6l5N0m1R4m7k9L8
6161B7l4LnMpj5J3k6NO3k7Jj2K8k6Kk4K1O0m1OJ9j2m3K3m9MP8k7J2J6M6q0L6n3
6196a4k0O1nOm5rL6k1J4kJ8M3o2K4j2M8j3l7k8Kl0L9K1nk1j6J3M6jl1m9J15p4
$$ plain form
6229 -9 -61 -16 -3 3 -5 20 -12 -15 -32 -36 16 -35 50 32 21 22 24 37 5 -20 -48 39 41 24 -4 11 18 19 -8 -13 34 -40 -26 19 46 -68
6265 -68 -21 -46 -26 -7 -10 41 -9 20 7 -79 -34 22 28 -35 11 45 0 20 9 16 7 -3 34 -10 72 -11 12 54 36 31 31 87 -25
6298 -25 46 -9 17 33 -20 -36 -4 15 -15 16 -18 -48 -31 5 -17 -8 56 -6 5 0 -13 -9 41 9 -10 32 -20 -6 39 -25 -24 60
6330 60 29 3 9 -58 5 43 -30 5 -14 8 31 -3 4 11 26 5 -11 -9 -103 -2 -45 -31 -23 22 -7 2 -48 -14 60 -30 45 -40 -12
6363 -12 2 -19 -24 2 -64 -39 -43 -25 2 6 63 -4 -5 -44 -96 35 8 -35 5 -33 20 6 -2 44 -64 -11 -6 58 72 -3 -27 4
6395 4 16 -28 -30 18 -15 -32 47 -29 -3 2 -28 1 32 -20 20 -20 -8 4 -8 -3 -56 1 3 5 17 -46 -21 18 39 -32 -41 34 -3 2
6429 2 11 -5 27 7 -7 9 -9 -8 23 11 -20 -40 2 2 4 -11 -26 -62 12 27 -13 59 -11 21 -2 -32 38 -15 39 8 -6 54 47
6462 47 -1 -26 4 3 -55 16 -19 66 7 -12 45 -16 -15 29 -5 -16 29 -32 -13 17 -14 5 -15 18 13 -9 -27 8 -19 -52 -35 11
$$ packed form
6229in2M5J3OqK5l2lj7mN2n1Q5j8j1JKJ3l2k5k8Q7Kj7k8J5PJk7nM7p4J4M5K7j14
6265f8M7k5K0J9lN1n0K9j3q6M5N6Oo3M6L4m5K0j1Prj0L7m4Q2q3K3M2j8n%N6j12
6298b5P1n5K6J6n3j6L2J9l0L1l4l0J7L6k2RO4o2J1nj3MN0l2j9M2n2J4M5o4JQ4
6330F0l1k6Oo7O3L8p3L5j9K2K3l4PPJ5k1j6Kr4J01m3J4QM5k9Rn0L4P4r0P5q5K8
6363a2J4k1nK6o6K5mJ8K7MN7o7jl9n2J31k7m3M0l8N3j4qM6j08N3NO4J4p5k4L1
6395DJ2m4kM8l3j7P9p6K6Nl0K9L1n2M0m0J2J2j2Nn3N7KKJ2o3K5L9K1p1rP5l7N
6429BRj6L2k0j4J6j8JL1j2l1k0M2%Kj5j5l6P4J5m0P2p0L2k3l0P0n3N4l1j4O0p
6462D7m8k5L0jn8P1l5Q5n9j9N7o1JM4l4j1M5o1J9L0l1J9k0L3nk2j8L5k7l3J7M6
$$ plain form
6494 11 -17 11 0 -21 50 -30 -7 8 20 14 -33 62 -1 8 -18 -31 -25 48 17 19 7 -3 21 27 25 -47 38 -15 -46 -30 -13 -30 11
6527 11 6 28 -30 -59 -3 -48 -16 72 15 5 -1 44 9 -15 23 -44 5 24 31 -49 -22 24 24 -41 -37 -28 -27 -28 17 57 -41 55 -16 33
6561 33 4 10 -20 -47 27 43 -23 -17 45 -35 20 37 -31 4 50 -9 -56 3 37 19 -22 45 5 28 5 -32 22 -9 35 16 -31
6592 -31 28 -39 51 -69 -13 -11 1 10 -17 2 -39 10 35 41 -38 33 -11 49 5 42 -3 -19 27 8 4 6 -19 -51 -20 1 39 -17
6624 -17 -42 -40 -7 8 -3 26 26 -15 61 0 12 -8 33 0 -10 30 39 -8 6 45 18 -21 10 -10 -53 -71 31 41 2 32 31 50
6656 50 21 -29 2 -20 10 4 33 -23 -1 12 -14 -42 27 18 -54 -21 -24 30 3 -10 -28 -34 -2 -19 13 -27 81 -29 43 -16 -25 29
6688 29 -5 20 -5 25 -37 -77 -13 -21 17 11 1 29 10 -26 -12 4 19 42 11 59 49 -37 62 26 21 10 -12 38 -16 -43 -32 29
6720 29 -3 -7 -29 7 -22 -26 -14 29 -20 11 -61 -35 9 -64 7 -2 -35 -22 -20 23 27 -21 -22 10 -51 21 1 13 -24 24 -25 21 -17
$$ packed form
6494A1k8K8j1k1P1q0K3J5J2om7R5o3Rk6j3OP3l1Kj2j0K4Okp2Q5n3l1J6J7j7M1
6527A1nK2n8k9N6m5L2Q8n7j0oM5l5k4L8o7M9J9Pq0K7M6%o5MRJjM5M0r8R6p1M9
6561C3k9Ol0k7P4J6o6OO2q0N5J7o8L5M6n9m7N9L4j8m1O7m0K3k3l7N4l1M4j9m7
6592c1N9o7R0j20N6KJ2Rk7J9m1M9K5Op9P1m4O0m4L7m5j6M6j9mKk5l2L1K1L8n6
6624a7k5KL3J5j1K9%m1P6o1J2k0M1l3j0M0Rm7J4L9k7l9L1k0m3j8J02J0l9L0jJ9
6656E0k9n0L1k2L0oK9n6K2J3k6k8O9rp2L3lN4k7j3j8oL2j7L2m0J08j10P2n9rN4
6688B9l4K5k5L0o2m0O4qL8oj0K8j9l6J4J6J5K3l1M8j0q6R9l6nj1k2N0n4k7J1O1
6720B9l2mk2L6k9mJ2M3m9L1p2K6M4p3P1rl3J3KM3Mm8jL2o1P2k0J2l7M8m9M6l8
$$ plain form
6753 -17 12 27 -35 -42 -4 56 -23 -13 26 -17 -62 6 -17 -29 32 -31 -10 -24 6 16 -11 -12 -26 39 -32 27 -5 15 -3 -43 3
6784 3 11 -36 9 -41 20 -9 -3 19 -82 -22 30 20 -45 64 33 -12 20 43 17 -7 -8 2 21 7 41 -17 26 -60 38 -35 8
6815 8 -40 15 1 28 61 27 4 -25 -14 75 54 7 -27 11 -12 -16 62 46 -6 3 -71 -11 0 -16 -54 -13 13 -56 10 10 -67 -31
6847 -31 56 -2 -17 0 -44 15 -76 -2 56 -13 -2 -3 -50 -24 29 -23 -4 7 7 -6 28 26 -7 5 2 18 61 -36 41 15 9 76 -11
6880 -11 39 5 23 40 -3 -24 3 -21 -14 47 -28 -29 -23 32 -2 -5 19 32 -13 39 -5 -14 -24 -27 -30 3 29 -15 -72 -101 -24 11 42 39
6914 39 3 29 -22 17 11 16 -38 -12 28 0 39 26 29 11 56 -26 16 -1 11 -28 -22 56 0 10 19 -10 -16 -10 34 -45 -20 61 -12 -45
6948 -45 -34 -19 35 -106 19 -47 -47 2 -18 -8 -8 51 -9 39 17 2 -1 -28 -46 -39 -34 79 32 -13 19 33 18 -40 -30 9 -12
6979 -12 0 -51 -22 -3 -40 -27 -68 15 7 33 -12 -11 14 74 -41 5 6 28 16 -2 87 -36 -7 33 32 -44 13 43 11 -3 -13
$$ packed form
6753a7K9J5o2pL8O0p9J0L9m3m5O8k3j2O1o3K1j4L0J0k7jj4O5p1N9l2K0j8m0M6
6784CQm7M5n0O1k9OK2j01O0N2j0o5J09l1m5L2K3k6k4jJ0J9j4L4n8M3q6R8p3M3
6815Hm8N5j4K7L3l4k3k9J1Q9k1m7l4L8k3mP8j6n2Rp4O0J1j6l8M1K6o9O6%p7L6
6847c1Q7n8j5J7m4N9r1P4N8o9J1jm7K6N3n2J9J1%j3L4kl3J2lJ6M3r7P7k6oO7q7
6880a1N0l4J8J7m3k1K7k4PO1p5jON5l4lK4J3m5N2m4rj0llL3K6m4n7k9P7L5L1l
6914C9l6K6n1L9oNn4K6M0k8L9j3Lj8M5q2M2j7J2l9OP8n6J0Rk9oOM4p9K5Q1p3l3
6948d5J1J5N4j41J25o6%M9k0J0%N9o0M8k2j5lk7j8PNJ13m7m5L2J4j5n8J0L9k1
6979a2J2n1K9J9l7J3m1Q3qK6m5JK5O0j15M6JK2j2j8Q9j23K9M0jp6N7L0l2j4j0
$$ plain form
7010 -13 -41 -10 -11 -43 -43 -1 5 37 50 -5 17 -6 -23 0 -30 -13 -3 -49 34 40 -13 -15 -19 -15 -15 -10 48 26 46 20 -21 -25 8 26 -6
7045 -6 -19 -35 -11 -19 9 -16 2 -21 -32 13 42 -15 -14 6 -20 -25 -10 8 -7 -24 28 40 -4 35 -43 13 -21 -15 13 -20 -35 -1 -6
7078 -6 24 -43 -2 21 -18 -16 13 23 -11 14 48 26 19 9 -12 23 21 31 2 -23 19 -20 -17 -20 -24 13 3 35 17 0 -20 -22 2 -17
7112 -17 -6 36 56 -33 5 -28 -10 -12 -37 8 -33 22 6 8 34 -32 9 39 15 4 30 -36 31 -14 -19 -22 -10 59 16 -36 -13 -15 -7
7145 -7 2 -27 -66 -8 8 -47 18 -15 29 -23 20 -69 -3 34 6 24 52 25 55 -22 60 -22 30 13 -15 -1 -38 51 -20 -10 -1 -5
7177 -5 7 -14 -58 -36 -26 46 -9 7 50 7 19 77 -15 20 31 31 -22 24 16 -28 -11 65 9 -19 29 -36 -27 -13 8 -59 36 44 -22
7210 -22 66 21 -3 -41 -19 27 37 -5 7 6 11 49 27 -21 38 -7 -33 -42 20 -41 16 -53 21 24 -37 66 32 -37 10 15 17 -6 33
7243 33 16 -92 -20 39 -4 -29 -4 13 35 -1 -6 22 -24 12 9 -19 24 -27 13 28 -23 27 77 -33 63 14 13 -39 11 -28 0
$$ packed form
7010a3k8L1jl2%M2OL2J3n5K2k3j7K3l0J7J0m6Q3On3kmM%NN8k2K0k6m1mL3J8l2
7045fj3j6K4qK8k5J8k3j1M5K9n7JK0k6nJ5J8j5j7N2J2m4L9p8N6l4OK8l3j5L4n
7078fL0o7M1K3l9KK9J0l4K5L4k2pj0k1L5kJ0k9k5M2l9LlmL7j0L2j8j7k0kK4j9
7112a7J1M2K0q9L8l3J8kk5M5m1N5j6KK6o6M1L0k4j1K6o6O7m5nlJ2O9m3n2K3kQ
7145gRk9l9N8J6n5O5l3M4n2M3q9O6L7k8J8K8k7L0p7Q2q2N2j7k8J4l7Q9p1J0Rm
7177eJ2k1m4K2J0P2n5J6M3m3J2N8r2L5J1%n3M6qm4J7P6n6k8M8o5RJ4K1o7R5Qo6
7210b2Q8m5k4l8K2M6J0m2J2jNL8k2m8N9m5k6rO2o1N7o9P4Lo1J03l4o9M7NKk3L9
7243C3j7j08P2N9m3k5K5J7K2l6nK8m6L6lk8M3n1M0J5n1N0N0j10R6m9jn2N0l9K8
$$ plain form
7274 0 17 25 -6 -1 9 21 28 -16 84 66 7 -8 -32 -3 41 -18 24 -3 -44 35 37 -13 -33 -4 13 -26 -45 17 61 -72 -27 -5
7306 -5 13 -34 7 53 3 30 -30 -26 1 17 -8 5 -45 3 18 -57 15 31 -9 -51 -14 2 6 44 39 56 -30 29 8 77 -27 -22
7338 -22 29 -10 53 -7 13 -42 16 -20 -44 53 -9 -17 16 -7 22 40 0 5 -41 -20 -16 -11 0 19 6 -13 -33 -14 -45 8 -44 -28
7370 -28 -56 -27 51 39 -49 -21 -34 -1 7 -27 -9 23 -39 -8 36 -28 59 9 4 18 -38 -42 46 -2 -30 -7 -39 -19 26 -1 23 11
7402 11 12 -35 -20 -16 -43 -15 12 -5 -31 -12 8 16 25 18 14 80 7 13 -30 -18 -9 10 19 -51 15 -2 30 15 27 -22 5 8 14 -2 24 -31
7438 -31 32 -19 25 -36 -4 69 -16 -11 15 -26 -33 0 -30 -20 -27 19 23 6 70 54 -65 7 18 46 2 33 30 -2 -7 35 -7 33 -6
7471 -6 -10 56 -22 -39 4 -13 -89 22 -39 -12 11 -39 -16 31 -7 -36 -4 18 9 -44 49 -9 18 73 49 -10 -1 -38 14 -14 -12 51
7503 51 18 17 34 -15 30 32 -7 -4 22 11 22 16 -1 50 21 -11 38 14 27 -16 9 -25 -4 -5 -45 21 50 44 -20 -61 -34 -17 -19 -16
$$ packed form
7274@J7Ql1NJ0J2Pm4J00j8n9j5k4K9M4n9M2k7m1P9Kn0k0K9J7l9j9O2M4j33M5K2
7306eJ8m7M1M6n0K7o0MK7J6k5J3n0M8J5p5P2J6m0m2L7J6ML8nJ7q6N9k1O9j04N
7338b2N1l9O3o0K0n5N8l6k4R7o2qL3k3K9J8m0Nm6K1MNJ1J9j3j9k0J9l1N3n2J6
7370b8k8K9P8j2q8K8j3L3Ql4J8L2o2L1M4o4Q7n0nJ4n6mQ8m8k8K3l2K0M5k7K4j2
7402A1Jm7J5Mk7K8K7j7k6J9K0QRpmO6p3Om3J2RJ9Rp0O6j7L2j5J2m9K7LOj6K6n5
7438c1O3n1M4o1L2P3q5NK6m1pL3l0J0pM6Mj7O4j6j19P2J1K8m4L1ll2nM2m2M0l9
7471fmO6p8j7M3j7p6J11o1K7K3n0K3M7l8k9L2K2rn3R3n8K7N5k4n9Rl7N2k8KO3
7503E1l3jJ7m9M5Kl9LK6j1J1oj7N1k9l2M9k4J3m3K5l4K1jm0O6K9oo4m1K7J7kL
$$ plain form
7537 -16 51 -11 -14 76 -23 21 21 9 58 31 9 -31 47 35 43 27 37 17 -7 -13 -13 16 -23 -31 24 12 30 6 -29 -24 43 -2 -21 -20
7571 -20 -43 -18 6 25 -4 -32 45 4 -38 -10 -1 -8 33 24 56 -25 -18 -14 -22 9 14 -20 14 34 -11 -57 23 -31 -22 -39 10 -9 -52 -19
7605 -19 80 52 23 -19 -3 4 15 -42 28 -4 -14 -11 -61 -1 8 -16 -12 -21 -45 -20 -3 50 2 33 -50 -27 -5 0 27 -4 19 -3 -39
7638 -39 16 9 1 7 21 2 -5 12 4 -4 -20 -4 -18 53 -8 19 -41 -26 29 18 -28 11 38 -29 -79 -10 10 -28 21 -16 -54 -49 39 16
7672 16 15 3 -26 62 23 21 -1 12 42 21 -15 19 6 -14 -2 -40 30 -29 18 -25 -6 -11 9 10 -25 -43 32 29 -50 -4 30 6 7
7705 7 -12 -13 -2 -55 -8 -74 -8 -30 9 36 -26 -18 32 45 83 35 0 35 7 68 -37 23 -40 0 3 31 -14 -25 -9 12 -41 -21
7737 -21 -15 -22 27 3 8 -62 70 31 62 -19 34 -31 4 11 9 -26 2 7 -13 -13 -13 -46 -20 7 -3 -20 -21 1 -29 -36 -50 26 -8 -40 53
7772 53 -44 7 16 27 -16 -17 -28 26 15 11 19 -89 -16 -34 -24 -49 -32 14 45 -24 -1 -20 42 17 36 -28 -28 20 -14 3 17 6
$$ packed form
7537a6O7o2lR0r9M4%j2M9k7k2m0P8j2Qj6J0k0k4o%K9l9qN5j2J8k4l5NO7m5j9J
7571b0k3K5K4J9k9k8P7m1m2K8RpM1rL2q1PMqL1Nl4L4K0m5m6Q0n4Rj7M9j9m3L3
7605a9R9k8k9m2J6PJ1n7P0l2j0Ln0O0Rk4Mrk4K5J7N3m8L1q3K3K2NK7l1K3k2l6
7638c9N5pqOJ4j9pJ7qqj6J6j4P1o1K7o0J5N5j1m6L9K7o7n0O9K0l8M9l7l8NQ8k3
7672A6jj2k9Q8l9kk2J3L0k1l6L4j3k0J2l8P0n9M7m3J9nK0Jl5j8P5lp9M6L4k4J
7705Gj9jJ1n3M7o6O6k2L9K7o2QN0J3L8m8l5L5k8O1j05O0o3M0LK8m5j1J6K1n3K0
7737b1OpM9k4Np0J32l9L1q1N3o5L5Pkl5K8Nk0%%l3K6K7j0j7jK2l0pj4P6l4l2R3
7772E3r7N1RJ1m3jj1N4j1mQj08P3j8J0k5J7M6L1o9K3j9O2k5J9o4%M8l4J7J4j1
$$ plain form
7804 6 -7 -5 0 11 14 -11 1 -5 -9 5 -33 16 -15 56 21 48 -68 26 -25 16 -24 24 -48 -50 33 -22 12 75 14 8 19 -10 -16 26
7838 26 4 -27 33 18 -35 -28 -5 54 42 -3 9 -32 1 -37 39 -22 -43 -5 29 -19 -19 38 -26 25 -28 -25 23 -10 -25 -22 -48 81
7870 81 -8 -5 0 -19 -66 48 1 32 48 -27 -18 32 9 12 44 -2 58 -13 27 24 -13 -4 -9 -14 4 -25 19 34 2 23 -20 -31 -14 -1
7904 -1 -10 -59 -63 -35 1 -11 -39 17 9 44 13 -23 -6 50 -38 -35 -67 2 -14 29 -34 14 15 11 45 5 -34 -29 -26 -21 17 -29 -10 -6 28 15
7940 15 -26 7 -12 -29 19 16 -32 -24 7 -14 -54 31 -11 14 -23 48 37 47 -78 9 -5 15 32 44 12 -33 2 51 -1 7 61
7971 61 -31 -2 -45 -21 19 18 -6 -36 -6 10 -14 -4 -35 52 2 24 14 -53 46 -33 -8 -3 5 21 -37 1 20 3 56 24 -13 50
8003 50 0 30 -14 -51 -48 42 25 -32 -4 34 31 15 45 23 -40 15 35 20 26 -18 14 29 17 -66 -19 12 10 -34 -4 -54 12 22
8035 22 -11 -41 -11 44 -36 -28 36 -7 15 47 -44 -31 -34 24 17 21 26 11 42 1 17 29 10 -14 29 -15 -35 17 18 -28 -10 57 -53
$$ packed form
7804Fj3KNJ1Lk5J2omJ4l8M9l1P1l5K7j16R4n1M1m0M8p2kQ3n5L4O3o1oJ1k9oM2
7838B6k2l1O0j5n3PK3N9j2m5J2m1L3l8P6o1k1L8L4m8%N7o4N1n3LM8l3j5Lk6J29
7870H1q9LNj9m7J14m7L1J6p5RN0k3LL2m6O0p1M0ll7RnnJ8k9M4J5l2K1m3j1J7J3
7904arm9mK8L6j2k8N6qL5l1l6J7N6q8Ll2O9j6M3o3M8JmL4m0l9NLNL8m6J9ML4j3
7940A5m1L3j9j7M8lm8QL1k1m0Q5m2K5l7P1j1J0j25Q7j4K0J7J2l2m5L5M9n2QN4
7971F1r2K9m3K4M0jk4l0L0J6k4J0l1Q7n0K2j0o7R9p9K5NQJ6n8L8J9j7N3l2l7O3
8003E0n0L0m4l7LR0j7n7K8L8lj6L0k2o3N5K0j5Om4L2J5j2q3M7L1km4L0n0O6J0
8035B2l3l0L0N5q0QO4m3K2L2r1J3lN8pMNj5L1m1J6J2j9k4M3m4k0N2Jm6J8O7j10
$$ plain form
8068 -53 -59 -39 48 -24 -9 -41 -54 -13 -14 -44 36 -20 30 83 -68 -13 34 26 51 28 1 2 8 46 -23 33 -25 -6 -60 -23 16 16 -53
8101 -53 38 -12 -4 7 13 24 -1 3 -15 -22 18 -46 -59 -52 -34 12 33 32 93 23 0 -1 15 -5 38 42 13 -21 -2 -8 30 -20 42 5 -3
8136 -3 1 6 22 -12 3 -59 3 -13 12 17 -34 -3 -4 4 -23 6 -19 0 -48 -34 -42 -43 -10 19 -11 -14 -30 10 4 13 29 21 -13 -11 -59 10 18
8173 18 4 40 38 -27 -8 -14 8 15 -7 51 -2 20 -42 2 36 -12 -32 31
$$ packed form
8068e3oK0Q7p2J5l2j3M1jl0Q0n6N0N3j51N5M7qK5k3k7JOL8o9N6n8J9n4L7L9%o9
8101e3R1n0QJ1OJ1k5Mj8pM0o4j3PJ8M6K1jO1p0k3jJ6k0M3Mk9l4J9oL8n0O2l7q
8136cMNJ6l4J5o2O2j6K5Nn1L1jQk7K9k5J9m8J4qjL3K9l0lj6M0oRJ6ql4Km8O9Q
8173A8j4L6ko5J9oK2Pk2N8n3K2o2M4L4m8k0O3
8191C1
$$ Imaginary data points
##PAGE= N=2
##DATA TABLE= (X++(I..I)), XYDATA
$$ plain form
0 0 0 0 0 0 0 0 0 0 0 0 0 0 0 0 0 6 -8 8 -8 8 -8 16 -16 16 -24 24 -32 32 -40 46 -48 56 -64 72 -83 96 -104
37 -104 120 -134 150 -166 184 -203 225 -249 275 -304 335 -370 406 -449 494 -544 600 -664 736
56 736 -817 909 -1018 1147 -1299 1487 -1724 2035 -2458 3075 -4067 5902 -10466 47538 39018
71 39018 -71143 -32473 35874 41328 -17969 -28597 -2617 8415 -1197 3656 -9677 -21672 -4151
84 -4151 25476 14699 -21601 -22961 21719 30836 -4204 -18392 1444 13308 6938 -3251 -4296
97 -4296 -8647 -7360 9456 8273 -17636 -17270 9316 15743 -6051 -15158 6016 16344 -2036 -5540
111 -5540 8500 5707 -4665 -207 7842 -42 -12867 -1854 11947 -5140 -18290 1583 15021
124 15021 -3368 -18808 1075 22398 2546 -18894 912 20054 5195 -11965 -3980 10255
$$ packed form
0@%%%%%%%%%%%%%%%Oj4J6j6J6j6K4l2L2m0M8n6O4p2Q6r4J04j20J36j55J79k00
37a04K24k54K84l16L50l87M28m74N24n79O39p05P76q55R43j038J144j264J400
56G36j553J726j927K165k446K786l211L759m493N533p142R969j6368N8004q520
71C9018j10161L8670O8347N454n9297j0628K5980J1032r612M853j3333j1995J7521
84d151K9627j0777l6300j360M4680R117l5040j4188J9836J1864o370j0189j045
97d296m351J287J6816j183k5909L66K6586O427k1794r107K1174J0328j8380l504
111e540J4040k793j0372M458Q049p884j2825J1013J3801j7087j3150J9873J3438
124A5021j8389j5440J9883K1323j9852k1440J9806J9142j4859j7160P985J4235
$$ plain form
136 10255 3528 -8112 -1761 2003 -6042 -3686 4243 363 -7705 -4341 7854 6320 -6551 -3112
150 -3112 8283 4887 -2113 -311 3463 793 -3705 1242 4009 -6123 -7165 4206 3740 -6671
164 -6671 -6944 4163 7118 -4321 -5915 6548 6574 -3082 -2086 4485 4050 -2473 -2665 3422 224 -5771
180 -5771 -211 3310 -3186 -5859 534 5409 -1109 -6837 2131 7970 -659 -4396 2200 5488 548
195 548 -3672 1077 3546 -2785 -3332 1895 335 -3631 -2316 1360 1373 -2760 -1569 3437 1102 -1629
211 -1629 1558 2683 282 -1122 1127 2996 -1574 -3611 1839 2116 -3322 -3409 939 2110 -1967 -3518
227 -3518 1935 3138 -1593 -1100 2212 2019 200 -507 1071 1145 -1233 67 1135 -1920 -1915 736 627
244 627 -1668 -2625 701 2806 -1289 -2259 1945 2448 -181 -941 926 2293 -476 -1567 1259 530 -1690
$$ packed form
136A0255o727j1640O351L764q045K356P929l880q068L364J2195j534j2871L439
150c112J1395l396p000J802L774k670m498M947K767j0132j042J1371m66j0411
164f671k73J1107K955j1439j594J2463K6r656R96O571m35o523j92O087l198n995
180e771N560L521o496k673O393M875o518n728Q968N839q629l737O596L288m940
195E48m220M749K469o331n47N227j560l966J315L676J3m133J191N006k335k731
211a629L187J125k401j404K249J869m570k037N450K77n438q7M348J171m077j551
227c518N453J203m731M93L312j93j819p07J578P4k378J300J068l055NK651j09
244F27k295r57L326K105m095r70M204N03k629p60J867J367k769j091K826p29k220
$$ plain form
261 -1690 -734 149 -229 -1110 -1003 766 -11 -1263 932 1279 -504 -124 1206 1592 -170 -1419 1098
278 1098 1841 -1395 -1696 332 633 -553 -1712 -403 925 -599 -577 839 85 -95 713 774 395 -480
296 -480 271 1526 -322 -1349 239 435 -375 -938 -636 473 -164 -1020 432 427 -473 142 615 695 169
315 169 -413 875 874 -716 -237 288 -179 -251 -543 -287 -22 -691 21 474 -592 -172 640 551 250 -261 226
336 226 976 22 -520 233 64 -126 -206 -520 -114 -187 -304 245 -304 -651 481 498 82 -172 -24 788 485
357 485 -475 -31 211 33 108 -387 -432 -17 -209 75 -60 -683 3 531 12 -67 -169 311 751 -105 -110 340
379 340 -59 -69 135 -227 -173 -289 -236 238 -250 -413 151 6 129 162 -105 225 304 17 272 101 -212 196
401 196 85 -34 -90 -407 39 157 -357 -168 19 -135 261 -45 -39 217 25 159 279 -126 97 159 -227 10
$$ packed form
261a690R56Q83l78q81J07J769p77j252K195L47j783L80J330L86j762j249K517
278A098P43l236l01K028L01j186j159J309J328j524K2J416p54j80Q08O1l79q75
296d80P51J255j848j027J588J96q10n63L02J109o37q56J452nr00O15M73Q0n26
315A69n82J288jj590M79N25m67p2k92K56K65o69P12M53j066M20Q12q9l01n11M87
336B26P50r54n42P53j69j90q0l14M06p3j17N49n49l47J132J7m16k54J48Q12l03
357D85r60M44K42j78P5m95m5M15j92K84j35o23O86N28n19p9j02M80M40q56nM50
379C40l99j0K04l62N4j16N3M74m88j63N64j45J23L3k67L30P9k87K55j71l13M08
401A96j11j19n6l17M46J18n14J89J87j54L96l06OK56j92J34J20m05K23O2l86K37
$$ plain form
423 10 -128 -133 -48 -245 -155 288 -161 -207 58 107 245 -68 -273 408 323 -214 -62 -77 186 149 -269 -163 57 -107
447 -107 -61 -141 -262 157 44 -2 155 -157 22 415 176 -55 -201 -23 453 77 -464 -192 108 137 -51 -494
469 -494 -83 344 21 -63 -39 -63 186 142 137 213 -204 -66 421 158 -244 -463 -92 514 96 -597 -262 245 371
492 371 0 -425 3 419 3 19 72 -45 94 65 115 89 -320 -150 334 35 -251 -263 -96 269 16 -348
514 -348 15 204 84 -80 -143 138 150 -184 -55 193 -22 -89 -181 -59 136 -155 -153 59 76 40 -35 -37 177 14
538 14 -154 122 149 -166 -129 57 255 88 -386 -166 234 116 -139 -229 5 223 -22 -123 77 8 -6 108
560 108 51 30 -158 -94 278 127 -217 -189 -17 153 81 -208 -90 153 118 114 -43 -73 125 6 -48 115 -84 -101
584 -101 38 -11 65 -39 -168 -13 111 -36 -79 -71 62 105 -12 -20 43 -21 32 106 18 -34 -141 93 171 -53 -185
$$ packed form
423A0j38nQ5j97R0M43m49m6K65M9J38l13k05O81q5n37J52j5K63l7m18J06K20j64
447a07M6q0j21M19j13m6J57l12J79L93k39k31j46J78M76l76n41K72L00K9j88m43
469d94M11M27l23q4K4k4K49m4nP6m17J38M87k63m02k19L71O06m18o93L35N07J26
492C71l71m25M28M16m16J6N3j17J39k9N0k6m09J70M84k99k86j2J67L65k53l64
514c48L63J89j20j64o3K81J2l34J29K48k15o7r2J22J95k91KK12J7l6p5kK14j63
538A4j68K76K7l15L7J86J98j67m74K20M00j18k55r0K34K18k45j01K00o9j4J14
560A08n7k1j88O4L72j51l44K8J72J70p2k89J18K43l5mj57l0J98j19n4J63j99j7
584a01J39m9P6j04j29J55J24j47m3QJ33M3j17qO3o4N3P4q8n2j07K34P8k24j32
$$ plain form
609 -185 -103 69 124 -48 -196 22 118 57 80 -12 -67 94 54 80 -43 -169 63 137 -15 -90 -191 41 189 48
633 48 -142 -11 -48 194 70 -104 -83 17 63 167 -68 -96 74 85 55 -26 -114 46 76 15 7 -44 24 124 25 -99
659 -99 -4 68 53 -8 -69 8 29 -11 69 -61 -87 53 31 36 32 -78 42 52 10 11 54 22 24 -53 -24 76 -2 15 60 -43
689 -43 10 -2 -11 13 -37 -32 61 -15 -13 15 -14 -26 -8 12 75 1 -42 33 -2 -46 16 -72 48 24 -53 23 47 -45 57 42 34 14
721 14 41 -33 -10 -68 1 41 33 -5 41 -33 19 30 -34 21 -15 -58 51 -10 -22 76 -49 61 22 11 37 32 10 30 -44 11
751 11 4 -8 6 21 -60 56 50 -21 14 -9 10 13 -12 39 37 -57 -2 11 15 76 -32 47 29 -12 16 32 -26 -24 38 0 37 70 -25
784 -25 37 -6 26 -25 49 -3 13 -37 -16 -45 29 41 -16 10 -3 -36 33 -1 -4 -7 65 -9 9 -42 -50 -13 11 -55 -77 -18 17 59
816 59 -22 23 -11 27 -5 16 5 42 24 -31 -18 -34 13 -9 -38 23 15 -39 -3 35 11 5 -54 -23 -15 26 -19 16 -29 -3 -2 35 37
$$ packed form
609a85Q2J72N5j72j48K18R6o1K3r2n5J61m0K6j23j26K32P4j52p5j01K32J48j41
633D8j90J31l7K42j24j74K1J00M6J04k35k8J70J1l0q1q8J60L0o1qn1O8J00r9j24
659i9R5P2j5o1o1P7K1m0Q0j30k6J40k2Nmj10J20J0m2JM3l2Kp7K9J00p8J7M5j03
689d3N3j2rK4n0NR3p6KK8k9j2J8K0O3p4m3P5l5m4O2q8J20k4p7P6K4r2J02j5qk0
721A4K7p4K3n8O9M0ql8M6p4N2J1o4N5l6m3J09o1j2R8j25J10l9j1K6nk2K0p4N5
751A1pj2J4J5q1J16op1L5k3J9Lk5N1kr4N5J3MO1j08P9j8m1K8J6n8KO2l8L7L3r5
784b5O2m3L2n1P4n2J6n0K1k9P4J2n7K6j3l3O9l4llP2p4J8n1qL7K4o6k2N9L5M2
816E9q1M5l4L8l2K1j1L7j8n5J3j6M7k2k9O1qn4L6L8k4on9L1QM1m5L5m5K6JL7K
$$ plain form
849 37 42 -23 51 -26 35 -25 -36 45 31 -22 72 -4 25 60 -23 22 81 -6 31 55 -32 3 29 29 -39 12 6 18 -21 2 3 -14 -11
882 -11 25 -1 31 -44 -57 4 39 13 -5 -9 -3 11 -19 21 -44 -69 -21 18 7 16 -10 -7 14 -9 14 65 -45 47 0 -42 -1 14
914 14 17 39 -28 -19 24 13 2 26 -22 6 -29 -12 42 36 8 19 -9 10 -43 15 2 -15 -16 12 19 5 -6 -34 5 68 -18 37 0
947 0 -4 8 -15 -42 -13 46 -10 -7 22 7 11 -25 1 -27 59 1 -32 -20 17 -9 0 43 -23 -2 -48 -9 -25 -16 -40 27 -31 52 13 8
981 8 0 13 -24 6 -3 -25 28 -34 64 -8 23 -28 47 23 18 15 -8 39 -2 34 -41 -40 -59 -13 -5 2 36 -10 -47 8 -62 -24 -55 17 53
1016 53 -17 -4 14 -39 -36 -4 24 30 -2 -70 16 -37 -24 -13 28 -29 4 -28 -23 -18 -26 0 -33 11 45 -37 -13 35 -25 -7 -8 -20 18
1049 18 -49 -21 40 -11 64 -21 25 -4 22 68 49 -28 -7 -51 10 30 10 -1 -10 -12 4 16 8 19 -5 8 23 -11 10 -5 20 -5
1081 -5 20 30 -39 19 43 -31 -25 -28 -65 -23 18 39 11 10 -2 -18 2 -17 17 11 1 -51 -43 -52 -13 21 -14 4 1 -15 33 44 -25 45
$$ packed form
849C7No5P4p7O1o0j1Q1j4n3R4p6K9L5q3M5N9q7L7K4q7L5K6%o8N1oJ2l9K3Jj7L
882a1L6k6L2p5j3O1L5k6j8mOJ4l0M0o5k5M8L9j1Rk6LK1k3K3N1j10R2m7m2M1J5
914A4LK2o7RM3j1j1K4m8K8l5J7N4ok8J1k8J9n3N8j3j7jK8Pj4j1k8L9O3q6N5l7
947@mJ2k3k7K9N9n6LK9j5Ml6K6k8Q6n8l3J2L7k6RM3o6K1m6L9j6Rk4O7n8Q3l9n
981HqJ3l7L0rk2N3o2R8p2L1n1P5k4nlk3M7m1L6p5Jj9M6QPL4m6l7N5p0L8l1P2L6
1016E3p0J3J8n3LL2K8Ol2o8Q6n3J3J1M1n7L3l2NNqK6l3M4L4q2K4M8o0J8jj2L8
1049A8o7K8O1n1P5q5M6k9K6M6j9p7K1m4O1K0k0j1rkJ6J2qJ1k4J3J5l4K1j5K5k5
1081eK5J0o9N8K4p4Oll7M2M1K1k8jj2j6K0j9L4oj0n2QrL9L4l5J8lj6M8J1o9P0
$$ plain form
1115 45 27 -47 33 -7 37 -25 56 -1 -13 26 6 -73 -7 -59 -55 -27 10 -24 13 34 12 36 -29 28 -8 61 -33 -20 -25 -40 -42 13
1147 13 20 -4 -20 -3 15 -34 8 32 -56 89 28 1 57 6 -49 31 -51 -14 30 -8 22 2 31 2 -25 -50 -12 5 -17 -70
1177 -70 -52 11 -28 -51 -36 3 -18 20 19 16 -21 -14 -58 -16 12 14 26 -15 11 -2 7 0 -12 -25 -22 32 -10 14 -8 -24 -19 11 -51 9
1211 9 25 5 -6 68 -7 66 22 -22 32 -8 37 -39 8 -28 24 -42 32 17 11 59 10 -49 18 -48 -24 19 57 19 -25 45 3
1242 3 -22 15 12 -39 13 8 20 9 21 7 -10 32 61 -15 -33 20 -2 25 23 4 -65 -57 12 -32 22 59 58 -27 -35 -7 -15 -10 -29 32 -33
1277 -33 22 10 7 0 -57 -13 10 -10 -34 -84 -63 -11 8 -24 5 -24 18 20 59 -12 -29 -18 -35 -23 44 19 23 -42 -11 32 -8 0 -40
1310 -40 -21 14 21 27 72 1 -29 52 -16 -70 14 -5 38 34 -29 35 19 24 -3 17 -22 21 18 46 -21 3 36 25 -10 70 -5 30 -22
1343 -22 63 -9 2 92 23 15 36 -32 43 -3 -29 47 8 16 37 -32 -30 1 23 -48 -49 -16 -58 -28 17 -26 -30 -11 -34 -8 55 -5 -29
$$ packed form
1115D5j8p4Q0m0M4o2Q1n7j2L9k0p9O6n2MK8L7l4L7K1k2K4o5N7l6O9r4J3nj5kN5
1147A3Pk4j6J7J8m9M2K4q8J45o1k7N6n1n5Q0q2L7M4l8L0k0K9k9k7k5L8J7k2n3
1177g0J8O3l9k3J5L9k1L8jll7Pm4M2K8KJ2m1K6j3Rpj2j3LN4m2K4k2j6NL0o2O0
1211IJ6k0j1P4p5P3m4m4N4m0M5p6M7l6N2o6P4j5oM8m9n9O7o6K4M3L8l8m4P0m2
1242Ck5L7ln1N2nJ2j1J2j4j7M2K9p6j8N3k2K7kj9o9QO9m4N4L7jq5qK8qNj9O1o5
1277c3N5j2lpn7M4K3k0k4n0K1N2J9l2K9k9M2KL9p1j7J1j7J2O7k5Mo5L1M3m0Qm0
1310d0J9L5POM5p1l0Q1o8n4Q4j9M3mo3O4j6Nk7K0l9M3lK8o7K4L3j1l5Q0p5L5n2
1343b2Q5p2J1R0o9qK1o8P5m6k6P6l9QK1o9KL1K2p1jL3m2L0M5m3mJ9k3K6O3o0k4
$$ plain form
1376 -29 37 -22 30 -11 -15 -11 -2 17 -47 -61 7 21 46 14 -57 -42 -17 -6 -44 1 -24 -4 -16 7 56 35 28 -14 -30 -31 -26 11 13 -13
1410 -13 0 -13 17 4 14 7 -36 19 19 -3 -32 10 -14 44 -11 -43 -13 -19 4 1 -12 -1 -1 7 -18 -1 36 -21 -31 -18 9 35 -44
1443 -44 0 22 26 45 1 39 -17 22 1 20 -21 -5 -48 -1 -47 -27 24 36 -36 -1 22 -20 27 21 -45 -6 -14 9 -32 -3 31 -15
1475 -15 -8 -30 16 -13 36 -1 -24 -13 1 -10 7 -12 7 75 -6 -29 23 29 46 44 35 -42 25 1 -1 -4 4 9 -37 18 11 -26 7 6 -7
1510 -7 11 60 35 -16 -29 -52 26 42 -10 -14 -23 49 -21 -14 19 1 24 -91 7 -21 41 32 16 -3 -18 25 -50 -8 10 -6 -7 -69 -23
1543 -23 9 5 -41 -48 57 24 23 -58 -21 11 10 31 -9 -17 -2 21 18 -22 -37 -15 -11 -12 21 28 18 50 -4 36 2 9 -6 5 20 -16 19
1578 19 41 86 -21 19 -1 -53 33 15 8 78 -3 -12 -34 -12 -25 -14 -46 -44 25 -3 -24 -21 -48 19 1 2 -17 -64 -7 -35 -28 -17 34
1611 34 32 27 26 37 20 16 16 -7 12 2 -44 -36 54 11 0 -33 18 -25 23 12 -25 15 -20 20 20 10 -27 4 -20 -11 -8 31 0 9 -33
$$ packed form
1376b9O6n9N2m1mMRJ9o4j4O8J4K5l2p1J5K5J1l8M5k5K0j2K3M9k1pm2j6jNL7Kk6
1410a3J3j3L0j3J0pm3N5%k2k9M2k4N8n5l2L0oK3lj3J1%Qk5J7L7n7j0J3K7K6p9
1443d4M4K2MJ9m4L8n6L9k1J9m1J6m3M7m6K0N1J2p2L5K3m2M7oo6L9qK3m1K9L4m6
1475a5Pk2M6k9M9l7k3J1J4j1J7j9J9O8q1k3N2OJ7krp7O7k4klQNm6N5pl7L3jj3
1510gJ8M9k5n1j3k3P8J6n2mrP2p0PL3j8K3j15R8k8O2rj6j9j5M3p5M2J8j6jo2M6
1543b3L2mm6pJ05l3jq1L7L2jK1m0qJ5K3lm0j5K2MjL3Pj0L2n4M0l4Pj5J1J5l6L5
1578A9K2M5j07M0k0n2Q6j8pP0q1rk2K2j3J1l2KO9k8k1Lk7O7j8Jj9m7N7k8PJ1N1
1611C4knjJ1j7m%k3J9j0m6QR0m3j1l3N1m3M8j1l7M0l5M0%j0l7L1k4RLL9l1Rm2
$$ plain form
1646 -33 -27 -13 -15 6 -45 -33 -20 71 102 -17 -25 3 15 90 -4 32 36 -48 -4 20 20 13 17 20 27 -37 -14 7 -5 -15 14 46 54 -9 -35
1681 -35 -40 21 36 -17 -4 -37 -11 43 -17 24 28 -8 -6 -19 -53 17 -24 9 6 16 17 18 35 0 -36 -33 3 -13 -6 0 -9 -5 -18 9 45 62
1717 62 -15 28 38 -12 -47 -3 20 -33 -18 -7 -11 -36 26 30 -29 6 118 5 30 -19 -9 8 24 32 -6 -22 49 -3 -11 16 -14
1748 -14 -44 6 21 -7 4 -27 -17 24 -44 72 58 24 -57 35 -40 -25 7 2 -29 0 -16 8 39 -2 28 23 -46 -2 37 12 -7
1779 -7 -12 69 -30 -9 -6 21 37 -3 26 50 -8 -17 54 -5 -6 -13 29 -23 56 -56 -53 33 33 63 9 24 8 84 -1 21 18 -34 -33 1 -8
1814 -8 32 -21 2 -3 -46 53 -57 -28 -5 40 -20 17 -7 43 -27 23 78 -32 -1 -27 -8 -8 45 -8 -19 -2 18 39 26 6 6
1845 6 -42 -15 22 41 -8 7 3 32 -58 -35 41 -42 54 -1 -37 -51 37 15 -32 11 -11 -12 -21 -35 23 32 31 21 -17 -13 2 24 11 10
1879 10 -18 36 -19 -33 -36 -7 4 26 49 -18 39 -8 -29 -21 41 -9 -3 -45 -19 3 -47 -26 45 -45 -3 66 40 3 -67 -11 28 -13
$$ packed form
1646c3OJ4kK1n1J2J3R1L1j19qK8J2P5r4L6Mq4M4K4%pMLPo4K3K1j2j0K9L2Qo3k6
1681c5nO1J5n3J3l3K6N4o0M1Ml6Kj3l4P0m1L3lJ0JJJ7l5l6LL6j6POrMj3K7L6J7
1717F2p7M3J0n0l5M4K3n3J5J1mk5O2Mn9L5J12j13K5m9J0J7J6Ql8j6P1n2qK7l0
1748a4l0N0J5k8J1l1J0M1o8J16j4l4q1R2p5J5L2nl1K9j6K4L1m1L0no9M4L9k5j9
1779gnQ1r9K1LK7J6m0K9K4n8rP1n9jpM2n2P9j12LQ6%L0n4J5j6P6q5K2ln2JL4r
1814hM0n3K3nm3R9j10K9K3M5o0L7k4N0p0N0N5j10L1k6J9%N3n3j1J7K0K1j3k0%
1845Fm8K7L7J9m9J5mK9r0K3P6q3R6n5l6j4Q8k2m7M3k2jrj4N8Rjj0l8MJ5K2j3j
1879A0k8N4n5j4lK9J1K2K3o7N7m7k1QO2n0Om2K6K2n0K1P1r0M2O9k6l7p0N6L9m1
$$ plain form
1911 -13 44 -11 3 -22 13 -7 37 -28 10 33 21 10 -38 24 -1 -17 57 -51 -32 13 -32 37 50 41 -44 29 40 -33 35 -6
1941 -6 28 -39 7 -58 -19 -39 -42 12 -17 -17 53 26 14 60 -35 -46 -26 5 26 -18 -33 6 -27 -40 -34 0 -4 -17 3 2 -56 -1 17
1974 17 17 -4 59 -23 35 -27 93 54 -38 -60 -15 -4 -13 -20 -7 2 26 4 -9 29 -40 51 30 -33 -29 32 7 14 -11 18 29 6 26
2007 26 37 22 47 -3 31 40 -15 3 -7 0 4 -12 -31 -11 -14 10 -50 42 -34 -2 10 19 -34 -26 5 -17 11 -37 -11 24 15 26 7 -27
2041 -27 34 21 -9 85 -49 10 25 -53 -18 15 30 -9 1 2 26 -57 -4 51 12 19 26 35 9 -14 1 14 -18 8 -19 2 -14 8
2073 8 -29 32 -28 -9 -4 -17 34 -58 17 -28 45 -19 45 3 -32 8 19 2 84 29 16 60 -13 25 10 -5 -30 -16 39 -13 -59
2104 -59 -14 52 -10 51 17 36 -24 -2 28 44 32 -11 15 11 10 16 5 51 8 -25 -5 34 4 -3 11 -38 -23 26 -11 40 -22 -36
2136 -36 -14 30 15 -21 -15 35 9 18 26 46 -7 44 52 52 -16 13 8 -31 -5 32 -8 29 -23 12 -18 -23 15 11 30 -30 105 36 36 11
$$ packed form
1911a3N7n5J4k5L5k0M4o5L8K3j2j1m8O2k5j6P4j08J9M5m5O9J3rq5P3J1p3O8m1
1941fL4o7M6o5L9k0lN4k9%P0k7j2M6r5j1K0L1K1m4j5L9l3j3OL4mj3K0jn8N5J8
1974A7%k1O3q2N8o2J20l9r2k2M5J1rpJ3RK4k2j3L8o9R1k1o3MO1k5Pk5K9J1k3K0
2007B6J1j5K5n0L4Rn5J8j0PMj6j9K0lK4o0R2p6L2J2Rn3QL1k2K8m8K6L5rJ1j9l4
2041b7O1j3l0R4j34N9J5p8L5L3J5l9J0JK4q3N3N5l9PPRk6k3J5J3l2K6k7K1j6K2
2073Hl7O1o0J9Nj3N1r2P5m5P3o4O4m2l5M0J1j7Q2n5j3M4p3L8j5j5k5J4N5n2m6
2104e9M5O6o2O1l4J9o0K2L0J6j2m3K6mjOj1M6m3l3K0L9l0pJ4m9J5M9l7N1o2j4
2136c6K2M4j5l6ON0k6RQK0n3N1Q%o8K9nl9K6L7m0L7n2L5l0nL8mJ9o0J35o9%k5
$$ plain form
2170 11 30 23 26 14 72 24 -5 -9 -15 -24 47 13 -14 -42 31 15 27 -32 7 -20 14 -20 -16 -83 -12 31 -8 32 38 -23 38 80 -33
2203 -33 -24 -48 31 64 0 -11 19 -12 43 -16 41 62 -21 7 25 -11 5 -17 60 21 -21 -33 -39 38 28 28 6 18 12 -8 9 15 36
2236 36 45 17 18 8 49 -27 22 31 57 0 6 3 -17 -9 8 0 -5 -4 -35 21 11 -34 5 -28 -24 -5 -7 -64 13 -43 5 64 32 5 24 12
2272 12 41 29 -58 24 68 22 -33 -29 44 -9 5 7 6 -45 16 17 -16 -55 -54 4 -23 28 27 20 23 15 -33 -2 -15 -9 2 33 16 8 20 -39
2308 -39 -48 -17 32 37 -52 48 5 44 -15 51 -33 34 30 -33 32 35 11 -49 -3 -20 -7 -57 13 8 16 -34 42 16 8 31 3 -15 -5
2341 -5 6 -15 15 10 -13 12 -16 1 44 -14 3 29 34 13 -12 -3 -29 -28 -4 -34 -43 24 -12 29 -39 -49 -3 -46 -35 -6 5 38 1
2374 1 33 -17 56 -7 -23 26 -4 39 -1 -54 -29 37 15 0 -17 23 -18 -3 -41 5 -15 32 -5 -66 7 27 -11 -19 -44 -8 15
2405 15 70 31 -24 2 11 -43 6 -49 6 6 -19 4 -28 -6 29 -27 -37 -6 -30 -22 -55 -2 18 48 28 23 3 31 -52 -47 8 28 21
$$ packed form
2170A1J9pLj2N8m8k9morP1l4k7k8P3j6J2n9L9k7L4l4Mo7P1M3l9M0Oo1O1M2j13
2203c3Rk4P9L3o4j1L0l1N5n9N7K1q3K8J8l6J6k2P7l9m2j2oP7j0%k2J2ok0J7OK1
2236C6Rk8Jj0M1p6M9RK6n7Olk0QJ7qnJl1N6j0m5L9l3MJ9kn7P7n6M8N9l2k7J9j2
2272A2K9j2q7Q2M4m6n5MP3n3J4Kjn1O1Jl3l9JN8k7N1jpLqm8L1j3OJ1L1j7qJ2n9
2308c9rL1M9Nq9J00m3L9n9O6q4O7mo3O5Lk4o0M6j7J3n0P0nQn0P6k6qK3k8j8J0
2341eJ1k1L0nk3K5k8J7M3n8J7K6Nk1k5Rk6JK4l0rO7l6M1o8j0M6m3J1K9J1L3l7
2374AL2n0P3o3j6M9l0M3m0n3K5O6k2j5j7M0m1J5l8M6k0M7l7o1P3K0l8qk5L6K3
2405A5N5l9n5K6Rn4M9n5N5%k5K3l2K2L5n6j0L1k4Ql3N3K0L0k0nk0K8q3NN5K0p
$$ plain form
2438 21 -12 -44 21 31 12 26 25 3 25 -31 27 -64 -51 -28 -24 19 -46 0 -58 4 -49 -16 -20 23 33 -17 52 14 10 76 -3 46
2470 46 -22 55 -23 4 17 54 1 21 7 20 -11 31 39 -5 37 44 15 23 45 35 -17 -11 8 -31 49 -17 21 -52 36 5 4 -33 30
2503 30 30 43 -21 44 -4 2 8 -4 1 -8 1 21 32 0 49 -51 50 20 -23 -20 29 22 16 42 6 14 -25 11 93 41 29 20 -7 7 -10
2538 -10 24 54 -9 -44 -5 -24 10 -34 46 4 -5 5 18 70 -4 17 17 19 -35 -45 40 -16 39 -10 13 35 5 -40 43 1 25 45
2570 45 7 -62 -26 -22 11 50 -14 25 22 -26 0 -11 15 53 -41 4 -63 -27 -54 12 -10 -34 7 -11 -15 30 30 -16 69 28 -53 27
2602 27 20 1 -4 14 4 60 -39 -36 33 -28 -17 38 1 10 3 18 -5 -12 -13 -15 -5 -15 32 8 -10 -30 26 -2 -6 -2 -23 20 12 -12 -36 21
2638 21 60 53 6 -21 -6 35 41 12 17 -4 22 17 41 15 7 -8 13 10 16 5 48 -3 35 -51 17 32 -10 -22 34 4 -66 16 36 -13
2672 -13 23 9 -59 14 -10 36 -31 -44 -20 12 11 61 28 -1 -20 -20 -21 -18 34 3 -14 -28 27 29 -1 10 32 -4 -17 8 17 -20 38
$$ packed form
2438B1l3l2O5J0j9J4jk2K2n6N8r1J3K3MM3o5M6n8O2n3L3mM3J0n0O9l8mO6p9M9
2470D6o8P7p8K7J3L7n3K0j4J3l1M2Qm4M2Pk9QK2j0n2OJ9l9Q0o6L8p3Q8l1jl7O3
2503C0%J3o4O5m8OOj2NrRK0J1l2M9j00J01l0m3LM9poK6l6Ql9L6Q2n2j2rk7J4j7
2538a0L4L0o3l5L9j9L4m4Q0m2rJ0J3N2p4K1%Kn4j0Q5n6N5m9K3K2l0m5Q3m2K4K0
2570D5l8o9L6ML3L9o4L9lm8K6j1K6L8r4M5o7L6k7O6k2k4M1j8mM5%m6Q5m1q1Q0
2602B7pj9nJ8j0N6r9LO9o1J1N5l7RpJ5k3pjkJ0j0M7k4j8k0N6k8mMk1M3qk4k4N7
2638B1L9pm7k7J5M1Ok9Nk1K6nK4k6qj5K1lOj1M3n1L8q6O8J5m2j2N6l0p0Q2K0m9
2672a3L6j4o8P3k4M6o7j3K4L2jN0l3k9j9%jLN2l1j7j4N5Kl0J1K2l6j3K5Rl7N8
$$ plain form
2705 38 28 30 -35 9 19 29 -1 67 49 -85 -15 4 -30 -42 -13 -5 -10 35 -10 -31 -27 -39 25 -43 -25 -5 33 19 -66 -7 50 7
2737 7 -44 55 -2 7 48 13 54 -16 -3 -25 12 9 -6 2 10 -42 -16 -13 -12 -30 -4 -6 13 -18 51 43 28 -5 71 34 10 -8 -12 -11 -3 64
2773 64 -22 -25 -25 -3 -27 -13 52 -31 31 -1 -13 3 41 7 -76 -4 -28 -16 25 20 -2 -29 9 -19 -24 -19 -4 11 -14 7 27 -10 37
2806 37 43 16 -16 -28 25 5 1 33 45 -26 -3 -19 -8 12 13 7 13 13 16 -25 8 -39 11 -9 -53 -3 -6 -52 1 87 15 31 -11 -2 -15
2841 -15 16 -39 -25 28 20 21 42 30 -22 -32 25 -14 -12 70 -13 18 32 58 15 22 33 5 -71 47 -22 6 27 -24 -17 -6 -13 -6 57
2874 57 -59 43 -13 -13 -8 -51 -21 -14 -29 5 -2 1 12 -2 -3 -26 14 -6 14 16 35 2 30 26 36 19 -36 -23 26 18 -30 16 30 0
2908 0 2 18 -17 -23 52 25 47 35 -43 -36 47 22 12 17 43 13 28 16 -1 36 -29 1 5 -8 -22 -10 24 -27 -1 3 17 14 -41 -31
2942 -31 -20 10 -22 -38 6 7 52 -29 -29 13 1 29 17 35 -34 4 73 5 22 1 -1 -10 -8 -4 -38 20 -56 1 20 33 0 27 -15
$$ packed form
2705C8j0Ko5M4J0J0l0O8j8j34P0J9l4j2K9QnM5m5k1Mj2O4o8J8K0L8j4q5N9N7m3
2737Gn1R9n7RM1l5M1p0J3k2L7lj5QQn2K6LJj8K6kJ9l1O9qj5l3P6l7k4j8mJQO7
2773F4q6l%K2k4J4O5q3O2l2j2J6L8l4q3P2k4J2M1nk2k7L8k8nNJ5J5k5K1K0l7M7
2806C7Ok7l2j2N3k0mL2J2p1K3j6J1K0JoO%Lm1L3m7N0k0m4N0lm6N3Q6p2J6m2Rj3
2841a5L1n5J4N3qJK1j2n2j0N7l9KQ2q3L1J4K6m3PJ1k8p6J18o9K8K1n1PJ1pPO3
2874E7j16J02n6%Nm3L0Pj5L4pLJ1j4jk3M0k0K0KJ9l3K8mJ0j7n5J3M9qm8M6J4l0
2908@KJ6l5oP5k7K2j2p8PQ3k5j0NK6l0J5j2j7L7o5L0Mj3j4J2L4n1K6MJ4ln5J0
2942c1J1L0l2j6M4JM5q1%M2j2K8j2J8o9L8O9o8J7k1krKMl4N8p6N7J9J3l3K7m2
$$ plain form
2975 -15 -13 21 -36 -15 36 -1 12 8 9 -3 55 8 -47 29 6 32 33 49 42 -24 63 -2 57 15 -38 -18 -35 46 52 -20 -1 23 22 -30
3009 -30 8 28 31 -20 -65 -19 6 22 28 24 -2 9 21 28 27 15 -17 -5 -11 -16 -19 26 -8 -52 -35 0 60 11 26 29 -52 25 7 31 28
3044 28 17 -12 -36 5 6 37 11 -3 45 -11 -2 0 -7 -33 50 41 -15 33 -13 9 57 -5 30 47 35 22 3 -28 4 -3 49 -11 -18 -3
3078 -3 7 -10 -3 -39 -38 -4 -6 -1 14 -31 -38 10 6 -34 -32 -11 31 50 -17 -51 -32 -12 68 15 -22 39 7 47 16 2 -4 34 -37 -19 -40
3113 -40 2 41 -3 33 -6 -43 7 58 -17 -24 -13 40 14 3 32 -24 -20 11 5 34 -36 14 21 -7 27 -33 46 85 26 35 -41 -3 49
3146 49 -16 10 42 52 36 3 -25 25 27 -7 14 34 32 7 17 20 11 -10 -22 12 68 84 -34 -7 24 11 -59 -7 0 49 38 17
3178 17 12 14 51 -6 -38 10 -13 -31 24 -24 41 17 29 98 -8 -46 24 -43 -29 -48 -21 22 48 -10 26 -8 17 -7 39 41 3
3209 3 -11 -2 -89 -36 -9 -39 -12 42 -61 22 -37 14 15 3 -5 13 32 30 0 10 -16 5 -10 16 -1 41 37 -73 -4 -1 17 -6 19
$$ packed form
2975a5KL4n7K1N1l7J3mJj2N8m7n5P6k3K6JJ6po6Q7o5N9m2n3K0j7Q1Op2J9K4jn2
3009c0L8K0Ln1m5M6K5J6Omk6J1J2Pjj2l2J2onlM5l4m4J7L5O0m9J5Lq1P7j8K4l
3044B8j1k9k4M1JL1k6j4M8n6RKpk6Q3rn6M8m6K2M8o2L5J7j2j3j9l1L2pN2o0pJ5
3078cJ0j7Pl6JL4kNJ5m5pM8mm0KK1M2J9o7l4J9K0Q0n3l7O1l2M0l1j4oL8p1J8k1
3113d0M2L9m4L6l9l7N0N1p5pJ1N3k6j1K9n6ML1oK9p0N0Pk8L4o0P9L9n9Rp6L8N2
3146D9o5K6L2J0j6l3k8N0Kl4K1K0kk5J0Lrk1j2L4N6J6j18K7L1j3p0N2PM9j1k1
3178A7nKL7n7l2M8k3j8N5m8O5k4J2O9j06l8P0o7J4j9K7M3K6n8L6l4K5k4M6Kl8
3209Cj4Rq7N3K7l0K7N4j03Q3n9N1Jj2qJ8J9kl0J0k6K1j5K6j7M2mj10O9LJ8k3K5
$$ plain form
3242 19 34 20 48 11 6 -10 -1 -7 31 24 -23 -26 39 16 -6 -42 -39 4 32 -2 28 25 50 77 32 26 45 0 1 -24 -51 6 4 35 17
3277 17 -11 -6 -29 42 27 3 -16 -31 -27 29 -16 5 10 -5 72 16 -26 53 5 -20 -1 29 3 -19 47 5 -22 9 -11 -3 -44 2
3309 2 35 73 22 35 43 43 24 -1 6 38 -14 77 -28 4 57 2 -19 -44 -14 -58 21 -4 -6 34 38 -39 6 -16 7 19 39 11 -4
3342 -4 13 -61 45 35 0 26 33 -12 23 21 -51 98 26 62 23 -39 -36 -9 20 10 -24 68 9 -40 12 33 -16 -19 11 10 11 38 -16
3375 -16 45 31 40 -28 47 -26 10 15 22 16 -48 5 -36 -30 34 -5 10 25 -26 -9 -14 26 -6 -2 1 27 23 -6 15 -23 -26 60 3 32 -11
3410 -11 -1 -19 -24 -31 43 -75 -2 -8 4 -12 -4 -13 -25 -20 -24 -9 -18 16 -7 4 26 -13 19 -15 -2 26 28 -17 -46 23 5 -15 -43 14
3444 14 -1 27 30 -3 -9 -54 -4 24 17 2 -13 -9 29 -10 -61 -16 -22 -42 -6 2 -8 9 -7 1 -5 13 15 -29 4 -24 53 27 3 17 39
3479 39 -19 -38 -20 36 5 -54 -12 -37 -16 47 11 24 39 -12 -1 33 49 8 6 1 7 24 -35 -9 59 -75 -24 -1 -34 -18 -27 -11
$$ packed form
3242A9J5j4K8l7nj6RoL8pm7lO5k3k2l6LM3K8l4L0lK5K7m5oJ9m5Jk5k7N7kL1j8
3277A7k8Nk3P1j5k4j9j5MN6m5K1Nj5P7n6m2P9m8k5J9L0k6k2O6m2k7L1k0Qm1M6
3309BL3L8n1J3Q%j9k5PL2n2R1j05L2N3n5k1k5L0m4P9k5kM0Mp7M5k2K3J2K0k8j5
3342dJ7p4J06j0l5K6Pm5L5kp2J49p2L6l9o2LK7K9j0l4R2n9m9N2K1m9lL0jJK7n4
3375a6O1j4Ro8P5p3L6NPoo4N3m1OO4l9J5J5n1J7nM0l2MLK6mk9K1l8lQ6n7K9m3
3410a1J0j8npP4j18P3oJ2j6Qrj2NmJ5rL4k3J1K2l9L2l4J3K8Km5k9O9j8k0k8N7
3444A4j5K8Ll3om5N0K8pj5j5ML8l9n1M5ok0L6Qj0J7j6QoJ8Km4L3k8P7k6k4J4K2
3479C9n8j9J8N6l1n9M2k5K1O3l6J3J5n1J1L4J6m1knOJ7n9K6O8j34N1K3l3J6rJ6
$$ plain form
3511 -11 4 -9 5 81 9 27 -18 -41 -9 -46 -9 -39 2 -5 9 8 24 33 24 24 17 32 50 -16 -1 -48 -19 -21 -44 43 -19 -3 11 3
3545 3 5 -10 -23 -8 -30 -12 -22 -6 -16 -9 -5 3 12 20 18 0 -12 3 26 -4 10 -5 11 7 17 -9 -30 -29 -18 -14 16 -23 -26 -7 -24 13
3581 13 35 9 -17 39 1 -5 28 -31 -6 10 1 -40 24 -31 35 5 -6 31 28 10 -25 -20 75 -3 9 9 61 -9 43 -48 -33 -44 -14
3614 -14 -5 -3 -39 41 -8 -16 -24 -36 7 -18 0 -33 -36 21 26 5 -37 35 -6 -24 25 -21 18 38 47 -65 -31 -22 -7 31 -17 -32 3 33
3648 33 -19 28 -49 -19 3 18 -10 -9 55 -15 10 -20 -6 -27 -29 7 -18 30 -10 -6 -45 -13 -37 28 1 -34 -26 -45 -6 -46 -57 -1
3680 -1 -13 -10 -27 -20 14 -37 -2 -55 -30 29 -23 48 -9 -5 1 -43 -1 47 17 -27 -25 12 -5 -28 -10 14 77 -35 3 -34 34 14 -5
3713 -5 56 26 34 -6 17 11 59 -11 32 23 38 16 -2 105 15 36 -54 21 -10 13 -18 41 35 -30 14 -7 41 4 2 -30 14 -49 16
3746 16 9 5 -26 -59 12 -28 -14 33 -18 -35 24 -10 -36 57 32 -24 5 23 -14 -26 -10 -1 6 12 18 -16 -32 -89 19 52 -44 -10 -13
$$ packed form
3511a1J5j3J4P6p2J8m5k3L2l7L7l0M1pJ4jJ6Rr%pJ5J8o6J5m7K9kk3Q7o2J6J4q
3545CKj5j3J5k2J8j0J6j0PMQRQkj8j2J5K3l0J4j5J6mJ0k6k1JJ1ML0l9lJ9j7L7
3581A3K2k6k6N6l8oL3n9K5J6rm1O4n5O6l0j1L7lj8l5NR5p8J2%N2p0N2r1J5j1L0
3614a4RKl6Q0m9qqj2M3k5J8l3lN7Nk1m2P2m1j8M9m6L9K0Rj12L4RJ5L8m8j5L5L0
3648C3n2M7p7L0K2J5k8JO4p0K5l0J4k1kL6k5M8m0Ml9L2k4O5k7l5Qj9L9m0j1N6
3680aj2Lj7PL4n1L5n3K5N9n2P1n7MOm4M2M8l0m4KL7j7k3J8K4O3j12L8l7O8k0j9
3713eO1l0Qm0K3oM8p0M3rJ5k2j8J07r0K1r0P5l1K3l1N9oo5M4k1M8l7kl2M4o3O5
3746A6pml1l3P1m0J4M7n1j7N9l4k6R3k5n6K9J8l7j2J6RPOOl4j6n7J08L3r6L4l
$$ plain form
3779 -13 -38 33 35 -23 8 19 -55 -5 5 4 -4 13 -27 17 -46 -62 -6 -25 -25 -2 21 22 42 -14 -35 3 10 17 -51 2 23 34 54 22
3813 22 14 -6 -29 -1 3 -35 13 12 -19 6 12 -4 -28 -12 7 -5 -9 -3 -40 32 -16 -29 -39 -24 -93 0 10 71 -11 10 61 -45 -22
3846 -22 35 0 6 -9 -31 32 -18 3 -18 51 42 2 13 -9 -4 -25 -12 1 -41 -43 -6 17 -21 -6 -7 45 27 6 10 -19 33 13 -34
3879 -34 -27 -35 23 41 6 -3 -32 -11 -7 -34 60 7 -9 -55 -19 -33 -30 -16 34 5 -19 -4 -12 31 42 0 -45 50 -42 18 4 3 -39 40
3913 40 -16 27 -6 5 2 12 -2 -69 -1 -26 -3 -2 -35 -8 -45 -9 -54 9 -9 50 -52 -11 5 34 25 -14 44 -3 -9 -4 -16 -49
3945 -49 -52 -38 19 1 11 -3 6 39 -49 15 -1 -49 -88 -37 29 -17 3 -21 -1 22 -49 39 -43 -18 15 -41 16 3 -16 -73 17
3976 17 30 1 61 -11 55 -1 34 32 35 34 -10 1 10 52 -11 1 -20 43 14 -40 7 50 7 -8 23 40 1 0 -57 -29 -62 -15 18
4009 18 44 12 10 25 33 -36 -15 61 30 -26 -20 48 6 33 3 6 42 37 19 9 -12 11 -11 35 30 -47 -10 14 -7 -38 -14 -39 10
$$ packed form
3779a3k5P1Kn8L1J1p4N0J0jqJ7m0M4o3j6N6j9%K3K3JK0n6k1L8PPo8N3K1J1K0l2
3813B2qk0k3K8Ml8M8jl1K5Oj6k4J6J9j2mOl7P2m8j3j0J5o9R3J0O1q2K1N1j06K3
3846b2N7l5Oj5k2O3n0K1k1O9rm0J1k2Nk1J3J3m2kL7K3l8J5jN2j8k1Mk9N2k0m7
3879c4PqN8J8l5rk9K1Mk7R4n3j6m6L6j4LJ4N0k9k4J5qM3J1m2m5R5r2O0j4jm2P9
3913D0n6M3l3J1lJ0j4o7O8k5K3Jl3K7l7L6m5O3j8N9j02M1J6K9rl9N8m7oNj2l3
3945d9lJ4N7j8J0j4RL3q8O4j6m8l9N1O6m6K0k4K0K3p1Q8q2K5L3n6N7j3j9n7R0
3976A7J3k9O0p2O6n6L5kLjm4J1RM2o3J2k1O3k9n4M7M3m3j5L1J7l9jn7K8l3M7L3
4009A8K6l2kJ5Qo9K1P6l1n6OO8m2K7l0LL6nj8j0k1K3k2M6np7L7K4k1l1K4k5M9
$$ plain form
4042 10 39 -33 10 -24 -10 34 6 -6 -61 -23 1 5 -36 -12 -11 32 -86 -26 1 22 18 -19 8 -19 -10 21 42 44 -34 29 15 -13
4074 -13 -53 24 31 -14 -9 33 -27 -49 69 14 23 28 -20 -11 1 -33 45 14 -10 49 50 1 -55 -41 3 50 -62 39 -99 33 42
4105 42 -11 29 -1 17 -11 13 -29 33 12 28 27 -12 5 -15 -6 -27 59 5 -49 7 18 -33 -44 30 22 -7 -18 49 1 41 27 3
4137 3 4 7 -60 -19 18 71 -23 -15 -29 21 -15 51 15 30 33 -1 66 48 16 -45 1 1 3 -36 55 16 7 33 23 49 33 -36 -30 -49 3
4172 3 21 17 -11 18 6 30 -14 -4 -2 17 20 -27 3 38 17 -4 56 -24 8 27 -26 -9 -41 33 1 25 72 26 -23 -2 -2 -29 35
4205 35 -7 25 -27 -10 -25 36 -22 -35 11 -13 -1 15 46 -14 10 69 18 -27 -7 -23 -15 -31 49 36 39 -23 1 -3 9 52 -20 -34
4237 -34 -28 -24 -46 23 -4 21 35 24 -37 -13 33 -20 11 -21 9 39 -9 8 -4 -39 -39 -81 -41 30 -18 12 11 -50 -7 -15 -56 0 -23
4270 -23 24 11 13 -73 -36 21 35 29 -2 33 22 21 43 13 34 14 -9 -39 2 -16 38 19 24 0 -31 -5 10 2 29 56 -20 -20 13
$$ packed form
4042A0K9p2M3l4J4M4k8j2n5L8K4Mm1K4JM3j18O0K7K1ml7K7k7RL1K1Kp8O3j4k8
4074a3m0P7Pm5NM2o0k2J18n5RNm8RJ2l4P8l1k4N9Jm9n6J4M4M7j12J01j38J32R
4105D2n3M0l0J8k8K4m2O2k1J6jl9J7k0Rk1Q6n4n4N6J1n1j1P4qk9j1O7m8M0j4k4
4137CJLo7M1L7N3r4Qj4N0l6O6l6J5Ll4O7j8l2o1M6%Kl9R1l9rK6j0K6j6o9Oj9N2
4172CJ8mk8K9j2K4m4J0KJ9Lm7L0L5k1k1O0q0L2J9n3J7l2P4l2K4M7m6m9K1%k7O4
4205C5m2L2n2J7j5O1n8j3M6k4J2J6L1o0K4N9n1m5K0j6Qj6Q0j3Lo2K4mJ2M3p2j4
4237c4OMk2O9k7K5J4j1o1K4M6n3L1l2L0L0m8J7j2l5%m2M0P1m8L0jo1M3qm1N6k3
4270b3M7j3Kq6L7N7J4ol1L5j1jK2l0K1k0k3l0M1j8N4j9Nk4l1K6J5qK7K7p6%L3
$$ plain form
4303 13 -22 25 -27 27 36 -11 15 -1 -20 -6 7 21 -19 46 13 17 -26 2 -32 0 52 20 28 -17 -31 31 20 -12 8 -22 -39 -42
4335 -42 -61 15 -24 -15 28 -28 -44 58 12 2 19 -49 -17 -42 -6 -22 22 27 -1 -53 28 -12 -7 14 0 -28 -19 28 54 4 27 35
4367 35 17 53 3 44 -24 -25 -27 -25 -4 -19 -11 -26 18 -11 18 -21 -28 -69 -10 20 -52 29 -26 -5 -47 25 -64 -41 14 1 -3 -5 17 29
4401 29 -33 -6 -19 29 39 -7 13 -19 48 42 -5 -27 -52 -2 -17 -38 19 14 -6 15 -2 -55 34 -14 -1 -23 9 56 -21 -77 -13
4432 -13 -38 31 -63 -29 -59 62 -37 -9 32 -14 13 -12 -8 -28 10 -44 -10 -20 33 -24 -27 -16 40 10 -14 -20 0 21 -12 27 9
4463 9 -37 6 -5 17 12 -9 -20 -34 5 -29 28 -8 6 68 -28 -19 18 -12 -23 2 2 29 60 -19 41 70 36 3 9 45 -15 14 1
4496 1 33 -56 32 -3 18 -13 -27 35 20 -24 -23 -20 -11 -13 -15 -93 -19 -67 7 -50 -31 60 -2 12 -37 -23 -4 22 8 20 5 51 16
4529 16 -20 -17 5 58 52 -2 -17 -42 -48 -46 -43 71 21 -66 -16 9 -3 37 -54 23 22 -2 1 -29 -9 -45 35 16 -36 10 -3 -7 30 -15
$$ packed form
4303A3l5M7n2N4Rm7K6j6j9J4J3J4m0O5l3Mm3K8l4L2N2l2Qm5j4O2j1l2K0l0j7l
4335d2j9P6l9RM3n6j6J02m6j0J7o8L2k5L6j6M4Nk8n2Q1m0NK1j4k8RM7K6n0K3Q
4367C5j8L6n0M1o8jkKK1j5Qj5M4k9K9l9pm1N9L0p2Q1n5K1m2P2q9K3N5j3mkK2J2
4401B9o2K7j3M8J0m6K0l2O7om7k2k5N0j5k1N7nk0K1j7n3Q9m8J3k2L2M7p7n6O4
4432a3k5O9r4L4l0J21r9K8M1m6K7k5Mk0L8n4L4j0N3n7lJ1N6l0k4oK0K1l3L9j8
4463Im6M3j1K2nk1j1j4L9l4N7l6J4O2r6RL7l0j1K5%K7L1p9O0K9l4l3OL6o0K9j3
4496AL2q9Q8l5K1l1j4O2j5m4JLRkkp8P4m8P4n7J9R1o2J4m9J4J9K6j4J2j5M6l5
4529A6l6LK2N3on4j5k5oKLJ14n0q7N0K5j2M0r1P7jk4Ll0K0l6Q0j9n2M6j3mL7m5
$$ plain form
4563 -15 45 -15 34 -9 17 15 30 67 7 -29 33 -10 -33 15 30 10 -48 39 12 8 -5 10 34 -11 14 -21 1 31 8 47 19
4594 19 29 -41 -44 13 24 13 -2 -2 -63 -22 29 44 18 -42 -7 -22 1 22 1 0 13 14 8 24 -12 26 29 52 -4 -10 29 -57 1 -16
4628 -16 -2 17 -25 -4 71 -9 42 0 -47 -17 -15 -34 22 18 3 26 -54 36 4 4 -42 10 -4 -18 23 41 -3 25 14 -25 26 -29
4660 -29 -18 -10 40 20 16 -3 -48 -10 -43 9 -14 16 31 24 30 -58 4 -24 -10 -6 -51 -26 -15 -23 47 -22 7 -67 -11 -22 38 -27 54
4693 54 4 -20 43 -9 22 -51 -43 18 0 33 -41 -23 2 -39 36 -76 -20 21 -27 -10 -33 14 -26 -14 -63 56 59 24 33 6 11
4724 11 10 -1 38 16 -33 49 26 -35 4 -9 28 33 7 17 -33 2 34 -7 -37 31 -15 37 42 -62 5 -2 -16 -38 -73 -25 -15 -8
4756 -8 -58 9 11 8 10 36 -30 1 -2 -7 8 11 -3 87 -60 16 14 3 -4 -2 29 -11 2 20 30 29 10 3 11 -16 -19 -31 -45 45 -2 20 -20
4793 -20 3 29 -5 -6 -20 10 20 10 4 -19 81 -36 19 7 -18 -6 4 32 37 88 94 13 42 37 -23 43 -17 77 1 7 -15 11
$$ packed form
4563a5O0o0M9m3K6kJ5L7o0l6O2m3k3M8J5k0n8Q7k7mj3J5K4m5K5l5K2L0k3L9k8
4594A9J0p0lN7J1j1j5%o1M1N1J5k6o0L5j5K3K1k1jJ3JoJ6l6L8LK3n6oL9q6N8j7
4628a6J4J9m2K1P5q0N1m2m7L0Kj9N6mj5K3q0R0l2%m6N2j4j4M1J8m4K8j1l9N1n5
4660b9J1QN0k0mj9m5L8l3N2k3L0J5pOq8O2k8J4Mm5K5J1qP0o9K9p4N6j1O0o5Q1
4693E4n0k4O3n2L1p3QO1j8L3p4J8K5m1P5j12N6M1m8J7k3M7m0J2m9J19Ll5Rk7N
4724A1jj1L9k2m9Q2k3o1L9j3L7Nk6J0n0L5L2m1l0O8m6N2Nj04O7pj4k2l5M8J0P
4756hn0O7KlKK6o6L1lnJ5Lj4R0j47P6kj1pKL1m0J3J8J0jj9pQk7lj2j4R0m7K2m0
4793b0K3K6l4jj4L0J0j0ok3J00j17N5j2k5J2J0K8NN1Oq1K9no0O6o0R4p6Ok2K6
$$ plain form
4825 11 6 14 25 18 12 31 13 51 21 28 -36 44 10 31 21 2 -1 -13 12 -16 14 2 17 47 -13 -10 -4 5 -4 5 2 35 46 -48 -1 35
4861 35 -25 35 -31 -19 23 -30 5 14 13 7 53 -7 -30 17 18 -26 51 49 12 -34 85 23 -17 37 -23 -46 13 -24 -22 -23 -12 -11 53 -7
4895 -7 -13 1 27 68 -12 3 -60 -37 -21 42 41 13 -19 18 4 -7 -45 36 51 -23 -9 11 -6 -17 9 32 18 -20 15 -43 -22 11
4927 11 -56 -11 24 -4 30 -22 5 10 -15 32 18 7 35 36 106 1 3 -36 -30 -41 49 10 12 46 14 -32 -85 -39 -11 37 4 3 -30
4960 -30 16 -56 -10 -10 31 -32 -21 -12 -3 22 -7 -33 -4 -7 -12 0 -41 -10 -19 -32 9 11 -19 36 -15 23 -20 39 21 0 -16 -29 0 -48
4994 -48 15 10 -43 -5 34 25 -91 -66 7 27 -41 17 20 -32 13 -19 57 2 2 74 17 11 -55 14 62 14 -17 -2 3 -11 -53 13 -4
5027 -4 -27 -46 46 -33 -16 -3 -29 24 -32 37 37 9 -20 24 21 -69 38 27 -66 31 -44 54 25 -36 -7 20 -43 -19 -29 9 43
5058 43 -36 33 9 -31 -36 -17 28 35 28 -18 -18 38 37 -4 7 31 14 -46 24 4 22 27 78 -26 8 14 -12 24 18 47 0 -5 19 -21
$$ packed form
4825A1nQJ1poJ9j8L8l0Po4Q0l4K1j0j9lj2K5k8L0j2J5L0o0LORrRlL3J1r4M7L6
4861C5o0O0o6J2M2n3L5RjoM6o0k3M7Jm4P7kl7m6J19o2m0N4o0k3N9l7KjJ1JO4o0
4895goJ4K6M1q0J5o3K3J6O3jk8l2L7j4j1l8Q1J5p4J4K0j7j1K6K3j4l8L5n8K1L3
4927A1o7M5L5k8L4n2K7Nk5M7j4j1K8JP0j05Kl9Oj1R0l9KL4l2m6n3M6K8M8l3jl3
4960c0M6p2M6%M1o3J1RRK5k9k6K9lnJ2m1L1rj3M1Kl0N5n1L8m3N9j8k1j6j3K9m8
4994d8O3nn3L8L9rj16K5P3K0o8N8Ln2M5l2P6n5%P2n7oo6O9M8m8l1J5Nj4m2O6j7
5027dk3j9R2p9J7J3k6N3n6O9%k8k9M4lr0J07j1r3R7p5R8k9o1K9K7o3K4j0L8L4
5058D3p9O9k4m0nJ9M5Ppm6%N6jm1J1K4j7o0P0k0J8NN1j04L4Ok6L6oK9m7nK4m0
$$ plain form
5092 -21 34 19 19 59 41 3 -10 13 26 -25 -41 11 21 13 4 -9 -11 -12 -3 -46 -46 -45 -36 -14 61 11 28 20 21 4 -33 -12 -3 46 20 -35
5128 -35 6 31 -26 -34 -14 -31 -22 31 -36 -8 30 15 3 18 32 18 -34 -7 -2 0 -9 32 26 16 -13 5 40 -24 31 -7 26 -31 -12
5161 -12 65 -6 30 8 -11 -13 -33 -7 -37 51 30 26 -86 12 21 -12 27 -1 75 -24 1 15 -7 -31 -11 -62 63 31 -35 -32 -26 -38
5193 -38 -31 4 19 56 43 -5 46 17 23 -55 9 44 -42 9 42 57 8 -17 50 18 22 2 -9 20 -7 28 38 -13 -24 -2 -47 -15
5225 -15 32 36 41 -65 -25 16 20 38 -1 -7 -23 -21 79 11 14 49 -4 -10 7 6 57 33 -29 -20 18 -42 -51 12 -9 -33 -32 -11 12 -11 -32
5260 -32 -50 -25 -4 37 -11 -18 26 -65 24 20 22 -23 35 -13 -5 35 -70 7 64 -23 54 -16 6 19 20 -24 -1 71 50 -3 39 -61
5292 -61 -8 0 -14 -18 -35 -7 7 23 -40 30 -8 -7 -10 -39 -20 -17 -43 0 -10 25 69 -15 17 -5 -6 13 11 27 25 2 13 -56 4 -4 14
5327 14 -1 -16 -24 -18 39 2 7 11 16 -6 -51 -30 6 1 2 28 -10 -69 52 -9 57 -17 25 36 -34 -54 12 -39 -27 12 -51 9 2 -16
$$ packed form
5092b1N5j5%M0j8l8j3K3J3n1j6N2J0qrj3kjRm3%JRK2P5n0J7qJj7l7K1RM9k6n5
5128c5M1K5n7qK0j7RN3o7K8L8j5j2J5J4j4n2K7NKrM1oj0k9J8L5o4N5l8L3n7J9
5161a2P7p1L6k2j9kk0K6l0Q8k1mj12R8Rl3L9k8P6r9K5J4k2k4K0n1J25l2o6LOj2
5193c8PL5J5L7j3m8N1k9Op8O4L5q6N1L3J5m9k5O7l2Mk0j1K9k7L5J0n1j1K2m5L2
5225a5M7MNj06M0M1MJ8l9oj6KJ00o8LL5n3oJ7jN1k4o2RL8o0rO3k1k4JK1K3k3k1
5260c2j8K5K1M1m8pM4r1Q9mKm5N8m8QM0j05P7N7q7P7p0K2J3Jm4K3P2k1n3M2j00
5292f1N3Qj4mj7K8J4J6o3P0l8Jlk9J9Lk6M3j0L5M4q4L2k2jJ9kJ6kk3J1o9O0qJ8
5327A4j5j5qON7l7NMNk2m5K1L6nJK6l8n9J21o1O6p4M2J1p0k0O6n1J2L9o3O0pj8
$$ plain form
5361 -16 -11 31 9 41 5 -4 -8 37 25 25 47 22 -19 32 30 -50 -49 -10 6 3 25 -8 17 -1 27 -4 -6 -13 -7 -31 64 32 -40 2 30
5396 30 14 -10 2 -18 23 22 -2 63 -33 15 -18 -29 6 29 -16 11 31 2 -32 30 18 15 8 -29 17 9 5 19 -43 -50 1 -16 -6
5429 -6 41 17 15 -19 0 -37 -46 -1 6 50 -7 28 -59 33 -48 20 16 32 -12 35 42 -46 45 25 7 25 8 13 -10 -3 19 25 -15 -8 36
5464 36 3 -58 35 22 -7 13 -1 -36 -9 29 -7 -6 -9 -6 0 23 39 7 -42 -18 -75 -29 -31 16 49 -4 -8 -12 -2 4 20 13 49 -24 46
5499 46 -14 0 32 -32 52 24 52 -13 43 -24 -45 22 -41 9 18 -12 38 17 28 -42 29 -82 -11 34 -11 -43 8 -27 -35 88
5529 88 8 81 -12 56 51 35 -1 8 69 -21 13 -2 12 24 18 -26 -18 38 -28 -10 3 17 -39 -6 37 45 24 -49 8 -24 -7 -4 -41
5562 -41 -41 12 28 -26 11 6 -25 24 14 15 5 33 33 9 -3 38 -47 37 3 26 -16 34 19 -31 7 -41 4 -45 -17 47 -21 -3
5594 -3 15 5 51 -6 48 -24 13 32 3 29 35 -73 -61 15 23 43 -3 -3 -19 39 -31 -18 -27 50 -9 -5 -20 -26 -19 -14 58 2 80 48
$$ packed form
5361a6NM2k2L2l6rmM5j2%K2k5m1N1kq0JL9J6lK2l3K5j8K8l1kpOk4R5l2p2M2K8
5396C0j6k4J2k0M1jk4O5r6M8l3j1L5K3m5K7K0k9l4O2j2lpl7M6qmJ4o2pN1j7J0
5429fM7k4kl4J9l7rM5PM4n7L5q7R2q1O8mJ6m4M7Pq8R1k0j8J8j7Nk3PK2Om0PM4
5464C6l3o1R3j3k9K0j4l5K7L8l6JlLOK3J6l2m9K4n7M6kM7L3n3mmJ0OJ6pL6p3P0
5499D6o0J4L2o4Q4k8K8o5N6o7k1O7o3N0Rl0N0k1J1p0P1j11P1M5m5l2N1l5qJ23
5529H8q0P3r3O8nj6l6RO1r0L4j5J4J2om4QN6o6J8J3J4n6L3M3Qk1p3N7l2J7Ll7
5562d1%N3J6n4L7nl1M9j0Jj0K8%k4j2M1q5Q4l4K3m2N0j5n0L8m8M5m9K8O4o8J8
5594cJ8j0M6n7N4p2L7J9k9K6Oj08J2P6QK0m6%j6N8p0J3rP7n9Mj5oPNP2n6P8l2
$$ plain form
5628 48 21 17 25 23 1 63 -5 47 7 32 -25 16 10 -31 -4 19 49 -6 -41 34 -42 9 2 74 45 15 94 33 -9 1 28 32 61
5661 61 9 21 -1 -3 18 -45 36 -12 34 36 -24 -37 -1 -1 -16 -70 7 37 -36 -20 20 -7 10 6 14 27 -14 -28 -18 20 19 -6 46
5694 46 6 -30 6 -3 32 17 17 12 16 31 21 -7 -1 18 31 46 34 -2 -22 -38 -8 -65 43 -22 -12 1 2 4 22 -7 29 -23 -24 16
5728 16 -5 -12 28 16 4 -8 8 43 -32 42 -7 -13 -4 -50 17 -6 -5 55 -6 -2 -28 35 -8 -14 38 4 -19 -13 -57 12 25 36 -3 -6
5762 -6 31 19 -19 22 10 -5 -7 -58 10 0 -48 -27 51 -6 26 -56 34 35 9 -18 35 63 33 9 42 31 8 -12 3 31 61 -29
5794 -29 -3 27 21 -46 4 4 32 27 36 -1 9 22 -30 30 41 -5 -59 13 -49 8 22 -18 28 40 70 -19 24 -10 -65 52 2 -2
5826 -2 -11 32 61 57 34 1 22 12 24 -15 7 25 -15 26 7 14 -51 31 -11 -17 47 -46 12 -2 7 -32 12 43 8 -8 -9 15 -25 -11
5860 -11 -76 -4 26 5 38 33 15 42 -6 4 28 51 11 20 6 25 13 76 17 -33 25 -16 4 -20 -15 -49 -6 -28 -10 27 11 -35
$$ packed form
5628D8k7mQkk2O2o8N2m0K5n7M1om1K7K3L0n5l5P5p6N1pP2k9l0P9o1m2J0K7MK9
5661F1n2J2k2kK1o3Q1m8M6Ko0j3L6%j5n4P7L0p3J6M0k7J7mQJ3m1j4J0L8jk5N2
5694D6m0l6L6rL5j5%nMJ5j0k8OJ9J3J5j2l6k0j6L0n7J08o5J0J3JKJ8k9L6n2jM0
5728A6k1pM0j2j2j2J6L5p5P4m9oRm6O7k3JO0o1Mk6O3m3oN2l4k3Om4O9J3J1l9l
5762fL7j2l8M1j2j5kn1O8j0m8K1P8n7L2q2R0Jk6k7N3K8l0k4L3j1k3k0J5K8L0r0
5794b9K6L0oo7N0%K8nRl7J0J3n2O0J1m6n4P2o2N7J4m0M6J2L0q9M3l4n5J17n0m
5826brM3K9mk3l3K1j0J2l9K2J8m0M1j9Po5Q2m2oO4r3N8j4Rl9M4L1l5j6jK4m0J4
5860a1o5P2L0k1L3nj8K7m8J0K4K3m0Rj4J9j2O3n9n0N8m1K0k4Nl4M3k2J8L7j6m6
$$ plain form
5892 -35 -36 -39 4 9 37 49 5 -12 20 33 -17 -43 11 -1 22 26 46 41 0 -32 -27 -19 18 4 -46 -42 -41 -12 -35 22 24 14 -12 -28 -12
5927 -12 -4 24 53 -30 -53 9 -46 -57 10 35 -3 40 17 4 -27 24 -45 0 36 -8 -28 12 16 38 22 33 29 25 0 34 22 63
5959 63 -35 1 30 -5 48 -39 -1 5 -17 -21 -28 43 -19 -24 2 25 -19 44 -1 15 -18 -20 9 -15 -31 20 25 19 14 30 -36 17 25 58 -23
5994 -23 -14 33 5 42 -29 11 -1 32 53 -37 -3 20 30 14 -12 15 -69 -14 -25 -11 -14 4 -14 4 -1 -25 -9 -3 20 -10 0 -18
6026 -18 3 -40 35 17 -14 37 6 2 -19 13 7 -41 -36 -5 43 -32 54 18 -11 -6 23 18 8 -24 15 -19 -22 41 -6 -22 0 -55 -54 -11
6060 -11 24 28 6 22 -5 35 4 21 9 -84 -11 -4 -22 35 -14 3 51 -6 57 7 17 5 37 85 -63 -2 -1 0 -10 -14 -8 16 -54
6093 -54 2 -16 -40 0 27 39 -5 10 -56 -26 -18 -34 -28 8 -15 -24 7 -57 10 -3 -30 -23 2 -6 10 -51 60 -35 2 43 24 36
6125 36 -20 -14 46 -16 -10 -40 25 59 -45 7 -74 23 22 12 10 6 -17 9 -85 23 69 7 -41 -84 -12 27 4 -13 48 21 8 -13
$$ packed form
5892c5jlM3NK8J2m4j7L2J3n0k6N4j2K3MK0nm1l2NQL7j4n0MJK9k3N7Kj0k6j6J6
5927a2QK8K9q3k3O2n5j1O7K5l8M3k3j3l1N1o9M5L6m4k0M0MK2j6J1mmk5L4j2M1
5959F3r8L6K9l5N3q7L8Ok2mpP1o2nK6K3m4O3m5J6l3kK9k4j6N1NonJ6o6N3QL3q1
5994b3RM7k8L7p1M0j2L3K1r0L4K3J0j6k6K7q4N5j1J4lJ8j8J8nk4J6OK3l0J0j8
6026a8K1m3P5j8l1N1l1mk1L2om8NL1M8p5Q6l6k9NK9nj0l2L9l4lO3m7j6K2n5JM3
6060a1L5Mk2J6k7M0l1J7j2r3P3Pj8N7m9J7M8n7O3n0J0j2L2M8j48O1JJj0mOK4p0
6093e4N6j8k4M0K7J2m4J5o6L0Qj6OL6k3rL1o4O7j3k7PK5qJ6o1J11r5L7M1j9J2
6125C6n6OO0o2Ol0O5L4j04N2q1R7jj0kmk3K6r4J08M6o2m8m3P2L9k3j7O1k7j3k1
$$ plain form
6157 -13 18 -44 -16 -15 -23 -14 -10 12 31 -18 50 7 28 58 -18 -11 -55 18 -34 72 47 -54 18 20 18 17 -32 -21 2 -43 4 -4 -4 -68
6191 -68 12 46 0 -50 12 39 52 -8 38 32 -4 63 12 -1 28 4 -14 18 35 -4 -11 40 0 -43 2 55 48 15 -73 19 -7 -7
6223 -7 -4 -3 43 -12 5 -48 -4 24 50 -12 -65 9 31 11 -32 50 23 33 18 -21 -6 9 32 -23 -17 -22 -14 8 -4 15 -2 80 -18
6256 -18 51 -15 9 -10 -8 38 4 -66 28 -31 -82 44 1 -23 -22 -29 6 20 -47 -10 32 56 0 -35 -12 8 36 8 2 3 -18 34
6288 34 2 -33 -50 18 35 39 29 23 42 56 -6 34 -32 2 -12 21 -28 29 -40 -31 6 36 -8 39 41 22 24 -6 -64 70 -45 -10
6320 -10 -4 15 10 3 32 27 68 27 -11 14 58 31 -44 -85 5 19 -8 -3 -3 -10 -6 -24 -12 41 -20 55 34 -6 -2 23 -13 -15 50 90 28
6355 28 -3 41 55 -21 -4 34 50 12 47 12 26 43 -7 21 -11 -7 32 86 -23 2 16 28 18 42 4 32 0 17 10 -46 26
6386 26 -8 -12 17 21 27 -61 10 24 7 8 -13 -5 -62 29 -30 21 6 -23 -1 59 -49 8 -18 -26 36 18 36 61 -20 7 3 51 22
$$ packed form
6157a3L1o2K8JqRMK2J9m9O8m3K1L0p6Pm4P3n2J06k5j01P2Kkjm9J1K3m5M7q%o4
6191f8Q0L4m6n0O2K7J3o0M6ol6O7n1j3K9k4j8L2J7l9pN1m0m3M5N3pl3q8R2k6%
6223gLJM6n5J7n3M4K8K6o2n3P4K2k0m3Q2k7J0j5l9J5J5K3n5OnQK2j2J9j7Q2r8
6256a8O9o6K4j9KM6l4p0R4n9n1J26m3k4JpL5J4o7L7M2K4n6l5K3K0K8k8oJk1N2
6288C4l2l5j7O8J7Mj0oJ9J4o2M0o6L4j4L3m9N7o9RL7L0m4M7Kj9Kl0n8J34j15L5
6320a0OJ9npK9nM1m1l8K5M4k7p5m1R0J4k7N%pMj8J2N3o1P5k1m0MK5l6kO5M0o2
6355B8l1M4J4p6J7L8J6l8L5l5J4J7n0K8l2ML9N4j09K5J4J2j0K4l8K8l2J7pn6P2
6386B6l4mK9MOq8P1J4j7Jk1Qn7R1n9N1j5k9K2O0j08N7k6qO2j8J8K5q1K7mM8k9
$$ plain form
6419 22 -12 46 44 -29 86 -30 -46 20 -43 15 -12 23 32 8 -3 23 18 -11 -1 -11 -8 -48 1 -14 -3 -4 -16 -5 -15 37 -11 -41
6451 -41 50 12 35 63 15 31 56 -33 14 14 34 -24 23 24 4 -4 41 -17 32 11 32 -57 -5 26 -26 -13 -8 13 -7 -16 -6 -30 22
6484 22 64 18 34 89 45 -40 7 3 32 -12 5 -37 25 -33 -12 38 39 32 -9 24 -49 -63 -5 -16 -40 -31 3 64 59 -19 -27 12 0
6517 0 67 -28 25 -29 -22 -12 -4 23 -22 -54 -12 -23 -40 -27 -4 -8 48 16 35 1 20 -10 17 25 27 -22 -38 23 16 29 9 -31 -18 43
6551 43 48 29 -27 44 75 -3 -21 -8 1 64 -43 -4 -15 -20 -5 11 -36 18 -28 15 -9 28 21 -7 -3 22 34 33 -1 -48 2 39 -18
6584 -18 20 12 44 -9 30 8 -3 20 -7 23 -14 -32 29 36 -48 0 -46 -24 -23 -25 -50 -30 -6 17 -36 -8 23 27 -59 -26 -18 17 -6
6617 -6 5 -31 19 8 1 -31 -14 10 22 -9 25 -1 -75 2 16 -63 -29 -16 32 -7 -27 -13 -32 -38 -35 -17 27 61 42 -12 -9 -19 13
6650 13 6 28 35 -43 47 20 7 -30 25 33 37 25 30 45 -11 6 28 -12 10 -24 56 -11 76 30 19 5 15 46 1 13 36 -11 28
$$ packed form
6419B2l4N8kp3J15j16j6O6o3N8k7L5Rk4j1K6nk9J0j0Lm0M9j5J1jj2J1j0N2m8l0
6451d1R1l8K3K8m8J6K5q9M7%K0n8M7Jk0qM5n8M9k1K1q9N2L1n2J3NK1k0rJ0k4N2
6484B2M2m6J6N5m4q5M7mK9m4J7m2O2n8K1N0Jpm1L3p3j4N8j1k4RL4O1np8qL9j2
6517@O7r5N3n4PJ0QK7m5l2M2j1j7J3K3mN6l2J9l4J9l0K7QKm9j6O1pJ3k0m0J3O1
6551D3Nj9n6P1L1p8j8J3RO3j07L9j1nJ5J6m7N4m6M3k4L7pk8MK5J2jl4m7N0L7n7
6584a8L8qL2n3L9k2j1K3k7L0l7j8O1Pq4M8m6K2Jkk5K0K4K3n3K8L1Mq6L3QL5k3
6617fJ1l6N0j1pl2J7K4J2l1L4k6p4P7J4p9L4J3M8l9k0J4j9oLJ8M4L4j9n4Lj0L2
6650A3pK2Pp8R0k7j3l7N5QMj2NJ5n6J7K2m0K2l4Q0o7Q7m6j1j4J0L1m5J2K3m7L9
$$ plain form
6683 28 3 -29 -19 -59 48 31 64 7 58 -29 11 -11 -10 5 -19 59 -2 48 45 -60 3 -2 -16 23 29 5 20 20 -11 61 62 24
6715 24 38 -41 22 -15 -62 -33 -8 -10 -2 32 9 23 35 -35 46 -40 -6 -25 -20 47 50 -14 -6 -11 90 -5 -24 39 16 50 -1 28 25
6748 25 16 15 37 26 -31 10 22 -26 25 43 8 -10 3 -1 -24 36 26 16 16 61 -14 -32 -1 -33 24 34 -14 -37 -21 12 5 -4 32
6781 32 -15 35 -30 -2 70 -12 36 27 -15 65 41 -16 2 10 53 37 -16 -11 66 43 27 -24 -48 -34 27 -49 -16 2 -6 3 58 -47
6813 -47 31 23 27 14 -23 21 -10 39 -15 1 0 -35 29 -10 21 3 44 0 15 10 18 -18 -2 36 76 -18 28 40 34 -23 32 23 18 -8
6847 -8 -13 -1 -31 -27 -36 -57 -40 4 -30 10 -21 20 12 -27 -6 1 6 42 30 25 -5 -31 -11 -31 -33 36 -19 25 -19 1 14 -41 64 -7
6881 -7 42 -58 -7 24 33 37 -33 -53 42 -72 14 31 12 -15 -51 34 22 -64 2 52 52 34 3 17 -33 5 12 -36 14 -89 -1
6912 -1 55 4 94 -9 45 -36 -3 -13 -31 0 50 0 -1 -1 27 33 10 40 -4 -24 27 -96 -13 -11 -9 22 17 -29 26 8 -17 -83 32
$$ packed form
6683B8k5l2J0m0J07j7L3n7N1q7M0k2JJ5k4P8o1N0lj05O3nj4L9Ok4J5%l1P2Jl8
6715B4J4p9O3l7m7K9K5kQL4k3J4J2p0Q1q6L4j9NO7Lo4QnJ01r5j9O3k3L4n1K9l
6748B5rjK2j1n7M1J2m8N1J8l5j8J3mk3O0j0j0%M5p5j8L1l2N7J0m8k3J6L3prL6
6781C2m7N0o5K8P2q2M8rm2Q0k4n7J8QM3j6n3NP7k3j6n1k4J4O1p6L3J8qRN5j05
6813d7P8qMj3l7M4l1M9n4J6jl5O4l9L1j8M1m4J5nQl6J6L8M0r4M6J2on7N5rnk6
6847hnJ2l0Mrk1J7M4l4M0l1M1ql9K1PNL6j2nl0k6K0k0kO9n5M4m4K0J3n5J05p1
6881gM9j00N1L1RMp0k0R5j14Q6J7j9k7l6Q5j2q6O6N0%j8l1J4n0L8Pm8N0j03Q8
6912aN6n1R0j03N4q1L3j0j8L1N0n0j%K8Ok3L0m4k0N1j23Q3KKL1nm6N5j8k5o6J15
$$ plain form
6945 32 50 8 33 -7 27 57 7 -37 60 -22 12 37 -8 24 -12 26 19 21 -16 25 14 7 16 12 28 20 6 47 -52 23 -2 -21 7
6978 7 -21 -44 -66 -25 2 48 12 12 40 18 38 -21 59 4 -12 47 11 2 64 19 -35 -18 60 39 51 -45 -14 -31 50 13 -3 7
7010 7 -24 -29 -43 -14 -11 -53 -52 -20 -18 -30 1 -26 -12 -14 -47 33 -22 44 -1 -15 28 -40 6 -28 27 23 -10 19 -4 -8 29 -21 -12 9 -19
7045 -19 24 -57 -51 49 -6 19 37 -40 16 22 32 -12 28 -67 -27 20 -16 0 31 -5 45 2 -53 41 -29 -45 -53 -43 -40 16 20 3
7077 3 -6 60 35 38 -11 -4 70 -28 48 -20 49 -26 -4 -16 -52 22 39 30 19 -7 15 -16 4 60 18 21 15 -10 47 35 -14 -27 59 -20
7111 -20 16 20 2 -26 24 4 -16 25 12 58 5 -28 -17 20 12 43 -11 -23 39 32 12 -21 3 -28 7 30 40 16 44 -28 39 19
7143 19 22 11 -31 -28 -19 25 -3 16 13 -27 42 -41 3 20 -13 -7 -7 54 50 -21 5 27 17 7 3 -70 -3 46 5 66 12 9 9 -47 18
7178 18 -38 38 -9 15 3 19 -17 -39 38 -9 -33 -7 -32 -40 -5 -10 -3 28 29 -47 -27 -68 -13 -20 -48 14 8 59 41 64 5 0 -16 -2
$$ packed form
6945C2J8m2K5m0L4L0n0m4R7q2L4K5m5L2l6L8pKl7M1j1pRmJ6qj4M1r9P5k5j9K8
6978Gk8k3k2M1K7M6l6%K8k2K0n9Q0n5j6N9l6rO2m5n4J7P8k1J2r6L1j7Q1l7j6J0
7010Gl1nj4K9Lm2JL2Kj2L1k7J4kl3Q0n5O6m5j4M3o8M6l4N5ml3K9k3mL7n0RK1k8
7045a9M3q1OJ00n5K5J8p7N6OJ0m4M0r5M0M7l6J6L1l6N0m3n5R4p0j6qJ0LN6Mj7
7077CrO6k5Lm9PP4r8P6o8O9p5K2j2l6P4J7rj1k6K2l1K0N6m2Lok5N7j2m9j3Q6p9
7111b0L6Mj8k8N0k0k0M1j3M6n3l3J1L7qL1n4j2O2pk0l3K4l1L5K3J0k4K8p2O7k0
7143A9Lj1m2LRM4k8J9lm0O9q3M4J7l3O%O1mp1K6K2j0j0mp3O7M9m1O1n4l%n6O5
7178A8n6P6m7K4j2J6l6k2P7m7k4K6k5qL5nPL1Jp6K0m1N5pk8O2oN1j8K3n9nj6J4
$$ plain form
7212 -2 -14 -28 -33 38 -21 18 55 44 -2 -10 1 -41 -53 -5 10 -16 22 -15 -39 -5 56 5 -31 9 21 -63 2 -6 34 -9 -33 -33 58
7245 58 -6 -48 -11 26 21 43 30 8 -14 -9 0 1 11 -36 -13 23 20 24 16 -23 -54 5 49 -14 1 48 7 18 -34 1 19 19 16 55 -55
7280 -55 -12 -38 -23 13 -17 -3 -39 25 -23 -56 -10 2 4 51 5 26 39 14 -26 68 5 19 -4 8 16 -34 34 71 -52 -35 -7
7311 -7 44 -1 -50 -4 -17 -7 13 8 -2 -3 -35 6 -11 11 15 -6 11 2 61 15 9 -8 -32 11 -47 21 41 -12 -2 -23 -14 20 -7 12
7345 12 -8 -48 -18 -11 -32 25 -5 51 -24 -35 8 -16 -5 -24 34 4 -24 -13 29 -5 -24 43 54 29 -37 10 -48 8 11 -1 -19
7376 -19 -4 -32 -21 -39 20 48 12 29 -24 -29 26 20 33 38 -13 36 29 18 -8 26 17 -13 -6 5 -15 28 -25 11 -21 38 43 -8 13 13
7410 13 -24 6 -5 -14 -6 19 -15 9 -27 -28 29 -16 7 -4 42 44 2 -15 9 25 -13 -1 23 48 2 4 -28 -52 -5 -16 22 -7 -43
7443 -43 4 3 -19 36 24 33 13 -68 -3 48 -15 47 -41 15 8 0 58 -5 -20 23 14 -22 20 -15 37 37 -23 -54 18 4 34 -12 -2
$$ packed form
7212bj2j4nP1n9L9L7j1m6qJ1m2j2M8J5k6L8l7k4L4O1n1l6M0J2q4O5qM0m3k4%R1
7245E8o4m2L7L7nK2j3k2k2NRJJ0m7K3L6lMql9l1N9M4o3J5M7m1J1n2L5J8%lL9j10
7280e5M3k6J5L6l0J4l6O4m8l3M6J2KM7m6K1J3k5m0R4o3J4k3J2Qn0O8L7j23J7K8
7311gN1m5m9M6j3J0K0nj0jl2M1j7K2Mk1J7rN9m6oj7k4M3n8O8K0n3J0k1RL4k7J9
7345A2k0m0L0Pk1N7l0N6p5j1M3k4J1j9N8l0k8J1M2l4j9O7J1k5o6M7n8N6Lj2j8
7376a9J5k8J1j8N9K8l6J7n3nN5oJ3Nn1M9pj1k6L4rl0PJ1k0M3n3L6l2N9Nn1K1%
7410A3l7L0j1rQK5l4K4l6jN7m5K3j1M6Km2j7K4J6l8J2K4K5m6Kl2k4M7j1L8k9l6
7443d3M7jk2N5j2Rk0q1O5N1o3O2q8N6pqN8o3j5M3rl6M2l5N2%o0l1P2j4L0m6J0
$$ plain form
7476 -2 -50 -22 -18 -37 7 -20 0 30 26 17 1 -44 11 -50 13 23 -28 56 35 -18 7 5 10 87 -10 37 9 29 26 -4 -11 13 -32 58
7510 58 56 13 -22 -28 6 22 1 29 -10 -64 -6 2 9 38 89 5 -20 37 39 3 -34 55 -38 -23 20 59 25 17 12 14 -38 -4 22 -13
7544 -13 37 22 12 23 12 -36 -7 -5 9 -1 -12 -17 -2 62 21 69 27 -80 -12 -1 -13 31 -6 -28 -7 5 1 11 -17 -5 -8 46
7576 46 -27 52 25 17 24 11 -48 -22 -24 5 13 -30 16 14 -23 26 40 -17 -15 39 31 6 35 -27 -11 -22 -18 -49 -13 -14 3 -15 7 16 -25
7611 -25 -17 14 -40 46 52 -67 78 67 -37 -11 5 -4 4 -16 69 20 21 17 23 1 -62 -17 49 9 -57 38 -11 -28 -28 14 50 -45 -16
7644 -16 59 11 -9 3 -47 24 -23 -15 14 4 4 59 -37 52 44 3 19 -5 65 -33 -9 19 -35 5 29 24 29 -19 57 16 0 -3 3 -36
7678 -36 68 7 9 -17 -8 9 17 30 11 -13 -8 52 -10 -5 25 29 13 -50 18 -18 34 11 45 -19 3 -15 -7 15 -8 34 -3 26 -13
7711 -13 54 65 13 8 40 8 25 -21 67 15 -4 5 49 18 11 -14 -11 -53 15 0 24 1 -42 11 -34 -9 -32 -18 17 33 -41 -40 18
$$ packed form
7476bm8K8Mj9M4k7K0L0mrj6m5N5o1O3J0n1Q4k1n3K5kNP7r7M7k8K0ll0pK4m5R0
7510E8km3l5oL4J6k1K8l9n4N8QPK9N1q4k5N7Kl6l7Q9r3J5M3L9l4qnKn2L4K6l5
7544a3N0j5j0J1j1m8K9KJ4j0j1nJ5O4m1M8m2j07O8J1j2M4l7k2K1J2mJ0k8J2lN4
7576D6p3P9k7qPj3n9K6kK9Qm3M6kl7M9J4n7KN4qk5K9o2J6j1Ml1L6jJ7j8K2Rm1
7611b5QL1n4Q6Oj19J45j1j04K6J6rQk0Q5m9JmOk2o3M5O6m0o6R5m9j7%M2L6r5K9
7644a6P5m8k0J2n0P1m7QK9j0%N5r6Q9qm1J6k4P0r8K4K8n4M0K4nNm8P6m1j6lOl9
7678c6J04o1Kk6RJ7QJ3j9k4NO0o2NL0Mj6o3O8l6N2k3L4o4K2j8QK2k3M2l7K9l9
7711a3O7J1n2nL2l2J7m6Q8n2j9RM4l1pk5Lm2O8j5K4k3m3N3m5K5k3J4L5J6p4JN8
$$ plain form
7744 18 4 -11 20 12 26 -3 16 -28 18 -22 -4 33 41 -12 36 46 32 31 16 8 -22 24 37 -33 14 17 10 -29 6 5 -37 9 -46 79
7778 79 40 -20 2 -9 -48 17 21 66 9 0 69 -1 -53 68 -20 -28 18 16 13 -17 -10 -11 -31 74 6 -58 -17 13 108 -20 3 -4 6
7811 6 -19 -21 -33 -3 13 -18 40 7 -47 57 -1 14 11 14 -19 5 -38 60 21 12 -12 7 1 -63 7 -48 37 38 53 35 26 -9 54 -12
7845 -12 32 -24 -17 -11 24 43 17 -1 -4 73 -40 32 -13 -21 -26 -28 6 7 -2 18 14 1 -6 16 27 2 18 14 34 15 -20 27 -12 -1 13
7880 13 16 32 0 38 -20 3 33 -30 32 5 3 14 -30 -9 5 -27 -23 -19 -19 -4 40 11 57 -3 28 2 15 -28 55 -55 -25 18
7912 18 23 33 -4 24 76 10 31 -26 -6 -17 18 45 -30 -14 9 23 -30 -14 -14 -28 -45 20 19 -9 29 -22 9 31 41 -15 -58 -39
7944 -39 -2 22 43 6 -31 -24 -68 0 -77 13 24 -10 -25 2 41 -36 -2 -21 5 11 -13 -6 16 36 21 24 7 3 -67 30 59 -25 -62
7977 -62 8 23 -18 23 7 -13 -12 -33 -43 -15 1 -10 28 -52 -18 8 -31 -30 2 52 34 14 19 49 3 16 -23 -2 1 43 -13 -59
$$ packed form
7744A8j4j5L1qJ4k9J9m4M6m0J8L7Qn3M8J0j4jj5ql0M6J3p0M7Lpl9L5jm2M6n5J25
7778G9l9o0K2j1l9O5MM5n7rO9p0n2J21q8qM6kll0Pjk0J05o8o4M1L0R5j28K3pJ0
7811Fk5kj2L0J6l1N8l3n4J04n8J5lLl3K4m3R8l9rk4J9oo4P0n5Q5JJ5j8rl5O3o6
7845a2M4n6POL5J9k6j8lP7j13P2m5qnkL4JrK0mj3pK2J1k5J6mK0j9l5M7l9J1J4
7880A3LJ6l2L8n8K3L0o3O2k7kJ1m4K1J4l2MM%J5M4k9M6o0L1k6J3m3Q3j10L0M3
7912A8NJ0l7K8N2o6K1n7K0j1L5K7p5J6K3J4n3J6%j4j7O5jk8L8n1L1K2J0n6m3J9
7944c9L7K4K1l7l7Pm4O8p7R0J1l4j5K7L9p7L4j9K6Ok4PK2K0j5Lj7mp0R7K9q4l7
7977f2P0J5m1M1j6k0Jk1j0K8J6j1L8q0L4K6l9JL2N0j8k0NL0m6J3l9K1LM2n6m6
$$ plain form
8009 -59 -27 24 -11 26 25 -20 13 -13 15 -59 33 -3 54 16 5 -26 -20 -22 -15 44 -45 38 -23 13 23 -22 -4 40 -39 3 15 10 -62
8042 -62 1 -9 -14 18 -15 -7 -12 16 6 35 -37 7 77 -9 13 20 1 -36 15 42 -67 -19 -16 -19 -33 -14 40 -10 -36 33 -19 -10 39
8075 39 -7 0 -6 -11 49 -36 1 22 31 3 -17 -41 -41 33 12 -28 14 11 24 8 -12 -33 13 53 -17 0 -35 11 19 8 8 -9 -11 -11 -69
8110 -69 -36 -10 -19 32 -43 18 -2 -19 3 81 36 50 -20 -10 9 51 56 7 27 14 0 -4 46 18 11 -15 63 11 9 1 56 57 27 -83
8144 -83 13 16 25 -30 20 77 14 -43 22 7 -65 -18 -76 50 -33 6 28 2 -36 25 6 40 45 8 32 -45 86 34 0 -21 2
8175 2 -5 -22 55 -3 42 -3 34 24 -19 0 -8 -33 -18 40 -20 -38
$$ packed form
8009e9L2N1l5L7jm5L3k6K8p4R2l6N7l8j1l1OkPN9q9Q3o1L6J0m5J8M4p9M2J2np2
8042f2O3j0nL2l3QnK8j0K9p2M4P0q6K2Pj9l7N1K7j09M8Llj4J9N4n0k6O9n2RM9
8075C9m6PonO0q5L7K1Rk8k0k4%P4k1m0M2lJ3j6k0k1M6M0p0J7l5M6Qj1%j7k%n8
8110f9L3K6rN1p5O1k0j7K2P8m5J4p0J0J9M2Nm9K0j3j4mN0k8pk6P8n2kqN5Jl0j10
8144h3R6LRn5N0N7o3n7O5j5p2M7n8J26q3L9K2k6l8O1j9L4Nl7K4p7J31n2l4k1K3
8175Bpj7P7n8M5m5L7j0m3J9qk5J5N8o0j8
8191c8
##END NTUPLES=NMR FID
##END=
