##TITLE=1H_Dep-2-Hex
 200.13MHz,CDCl3,
 8 sc
 
 4.8.2025
##JCAMPDX= 6.0         $$ Bruker NMR JCAMP-DX V2.0
##DATA TYPE= NMR FID
##DATA CLASS= NTUPLES
##ORIGIN= UXNMR, Bruker Analytische Messtechnik GmbH
##OWNER= pz
$$ XWIN-NMR		Version 3.5
$$ Mon Aug  4 16:00:40 2025 Russian Standard Time (UT+4h)  she@DPX200
##.OBSERVE FREQUENCY= 200.1313
##.OBSERVE NUCLEUS= ^1H
##.DELAY= (6, 6)
##.ACQUISITION MODE= SIMULTANEOUS
##.ACQUISITION SCHEME= undefined
##.AVERAGES= 8
##.DIGITISER RES= 18
##SPECTROMETER/DATA SYSTEM= spect
##.PULSE SEQUENCE= zg30
##.SOLVENT NAME= CDCl3
##.SHIFT REFERENCE= (INTERNAL, CDCl3, 0, 14.3821)
##AUDIT TRAIL= $$ (NUMBER, WHEN, WHO, WHERE, WHAT)
$$ ##TITLE= Audit trail, XWIN-NMR		Version 3.5
$$ ##JCAMPDX= 5.01
$$ ##ORIGIN= Bruker BioSpin GmbH
$$ ##OWNER= she
$$ F:/spectra/data/she/nmr/H-C/1/audita.txt
$$ ##AUDIT TRAIL=  $$ (NUMBER, WHEN, WHO, WHERE, WHAT)
(   1,<2025-08-04 15:59:17.10 +0400>,<she>,<DPX200>,
      <created by zg, POWCHK disabled, PULCHK disabled
       configuration hash MD5:
       00 E9 B6 7A A2 85 ED C7 34 08 36 98 17 FE 4E 26
       data hash MD5: 16K
       9A EB 60 5C 88 73 F0 9E 85 54 15 88 41 4C 89 1C>)
$$ ##END=
$$ 
$$ hash MD5
$$ 9D FF 8B 6D 42 94 AF B6 BC CE 39 E0 31 54 C2 75
##$RELAX= 
##$RELAX= 
##$RELAX= 
##$RELAX= 
##$RELAX= 
##$RELAX= 
$$ Bruker specific parameters
$$ --------------------------
##$DU= <F:/spectra>
##$EXPNO= 1
##$NAME= <H-C>
##$PROCNO= 1
##$TYPE= <nmr>
##$USER= <she>
##$AMP= (0..31)
100 100 100 100 100 100 100 100 100 100 100 100 100 100 100 100 100 100 
100 100 100 100 100 100 100 100 100 100 100 100 100 100 
##$AQSEQ= 0
##$AQ_mod= 1
##$AUNM= <au_zg>
##$AUTOPOS= <>
##$BF1= 200.13
##$BF2= 200.13
##$BF3= 200.13
##$BF4= 200.13
##$BF5= 200.13
##$BF6= 200.13
##$BF7= 200.13
##$BF8= 200.13
##$BYTORDA= 1
##$CFDGTYP= 0
##$CFRGTYP= 5
##$CHEMSTR= <none>
##$CNST= (0..31)
1 1 145 1 1 1 1 1 1 1 1 1 1 1 1 1 1 1 1 1 1 1 1 1 1 1 1 1 1 1 1 1 
##$CPDPRG= <>
##$CPDPRG1= <>
##$CPDPRG2= <>
##$CPDPRG3= <>
##$CPDPRG4= <mlev>
##$CPDPRG5= <mlev>
##$CPDPRG6= <mlev>
##$CPDPRG7= <mlev>
##$CPDPRG8= <mlev>
##$CPDPRGB= <>
##$CPDPRGT= <>
##$D= (0..31)
0 0.7 0 0 0 0 0 0 0 0 0 0.03 0 0 0 0 0 0 0 0 0 0 0 0 0 0 0 0 0 0 0 0 
##$DATE= 1754308756
##$DBL= (0..7)
120 120 120 120 120 120 120 120 
##$DBP= (0..7)
150 150 150 150 150 150 150 150 
##$DBP07= 0
##$DBPNAM0= <>
##$DBPNAM1= <>
##$DBPNAM2= <>
##$DBPNAM3= <>
##$DBPNAM4= <>
##$DBPNAM5= <>
##$DBPNAM6= <>
##$DBPNAM7= <>
##$DBPOAL= (0..7)
0.5 0.5 0.5 0.5 0.5 0.5 0.5 0.5 
##$DBPOFFS= (0..7)
0 0 0 0 0 0 0 0 
##$DE= 6
##$DECBNUC= <off>
##$DECIM= 32
##$DECNUC= <off>
##$DECSTAT= 4
##$DIGMOD= 1
##$DIGTYP= 9
##$DL= (0..7)
0 120 120 120 120 120 120 120 
##$DP= (0..7)
150 150 150 150 150 150 150 150 
##$DP07= 0
##$DPNAME0= <>
##$DPNAME1= <>
##$DPNAME2= <>
##$DPNAME3= <>
##$DPNAME4= <>
##$DPNAME5= <>
##$DPNAME6= <>
##$DPNAME7= <>
##$DPOAL= (0..7)
0.5 0.5 0.5 0.5 0.5 0.5 0.5 0.5 
##$DPOFFS= (0..7)
0 0 0 0 0 0 0 0 
##$DQDMODE= 0
##$DR= 18
##$DS= 0
##$DSLIST= <SSSSSSSSSSSSSSS>
$$ [...]
##$SUBNAM0= <"">
##$SUBNAM1= <"">
##$SUBNAM2= <"">
##$SUBNAM3= <"">
##$SUBNAM4= <"">
##$SUBNAM5= <"">
##$SUBNAM6= <"">
##$SUBNAM7= <"">
##$SUBNAM8= <"">
##$SUBNAM9= <"">
##$SW= 18.0517328524113
##$SWIBOX= (0..15)
0 0 2 0 0 0 0 0 0 0 0 0 0 0 0 0 
##$SW_h= 3612.71676300578
##$TD= 16384
##$TD0= 1
##$TE= 0
##$TE2= 300
##$TE3= 300
##$TEG= 300
##$TL= (0..7)
0 120 120 120 120 120 120 120 
##$TP= (0..7)
150 150 150 150 150 150 150 150 
##$TP07= 0
##$TPNAME0= <>
##$TPNAME1= <>
##$TPNAME2= <>
##$TPNAME3= <>
##$TPNAME4= <>
##$TPNAME5= <>
##$TPNAME6= <>
##$TPNAME7= <>
##$TPOAL= (0..7)
0.5 0.5 0.5 0.5 0.5 0.5 0.5 0.5 
##$TPOFFS= (0..7)
0 0 0 0 0 0 0 0 
##$TUNHIN= 0
##$TUNHOUT= 0
##$TUNXOUT= 0
##$USERA1= <user>
##$USERA2= <user>
##$USERA3= <user>
##$USERA4= <user>
##$USERA5= <user>
##$V9= 5
##$VALIST= <valist>
##$VCLIST= <CCCCCCCCCCCCCCC>
##$VD= 0
##$VDLIST= <DDDDDDDDDDDDDDD>
##$VPLIST= <PPPPPPPPPPPPPPP>
##$VTLIST= <TTTTTTTTTTTTTTT>
##$WBST= 1024
##$WBSW= 4
##$XGAIN= (0..3)
0 0 0 0 
##$XL= 0
##$YL= 0
##$YMAX_a= 783862
##$YMIN_a= -883623
##$ZGOPTNS= <>
##$ZL1= 120
##$ZL2= 120
##$ZL3= 120
##$ZL4= 120
##$ABSF1= 10
##$ABSF2= 0
##$ABSG= 5
##$ABSL= 3
##$ALPHA= 0
##$AQORDER= 0
##$ASSFAC= 0
##$ASSFACI= 0
##$ASSFACX= 0
##$ASSWID= 0
##$AUNMP= <proc_1d>
##$AZFE= 0.1
##$AZFW= 0.1
##$BCFW= 1
##$BC_mod= 2
##$BYTORDP= 1
##$COROFFS= 0
##$CY= -3
##$DATMOD= 1
##$DC= 2
##$DFILT= <>
##$DTYPP= 0
##$F1P= 0
##$F2P= 0
##$FCOR= 0.5
##$FTSIZE= 0
##$FT_mod= 4
##$GAMMA= 1
##$GB= 0.15
##$INTBC= 1
##$INTSCL= 1
##$ISEN= 128
##$LB= 0.25
##$LEV0= 0
##$LPBIN= 0
##$MAXI= 10000
##$MC2= 0
##$MEAN= 0
##$ME_mod= 0
##$MI= 1.114404
##$NCOEF= 0
##$NC_proc= 0
##$NLEV= 6
##$NOISF1= 3.799351
##$NOISF2= 2.8
##$NSP= 1
##$NTH_PI= 0
##$NZP= 0
##$OFFSET= 14.38212
##$PC= 1
##$PHC0= -1199.591
##$PHC1= 11.9923
##$PH_mod= 1
##$PKNL= yes
##$PPARMOD= 0
##$PSCAL= 0
##$PSIGN= 0
##$REVERSE= no
##$SF= 200.129724274929
##$SI= 16384
##$SIGF1= 3
##$SIGF2= 2
##$SINO= 400
##$SIOLD= 16384
##$SREGLST= <1H.CDCl3>
##$SSB= 0
##$STSI= 0
##$STSR= 0
##$SW_p= 3205.1282051282
##$SYMM= 0
##$S_DEV= 0
##$TDeff= 0
##$TDoff= 0
##$TI= <>
##$TILT= no
##$TM1= 0
##$TM2= 0
##$TOPLEV= 0
##$USERP1= <user>
##$USERP2= <user>
##$USERP3= <user>
##$USERP4= <user>
##$USERP5= <user>
##$WDW= 1
##$XDIM= 8192
##$YMAX_p= 0
##$YMIN_p= 0
$$ End of Bruker specific parameters
$$ ---------------------------------
##NTUPLES= NMR FID
##VAR_NAME=  TIME,          FID/REAL,        FID/IMAG
##SYMBOL=    X,             R,               I
##VAR_TYPE=  INDEPENDENT,   DEPENDENT,       DEPENDENT
##VAR_FORM=  AFFN,          ASDF,            ASDF
##VAR_DIM=   8192,          8192,            8192
##UNITS=     SECONDS,       ARBITRARY UNITS, ARBITRARY UNITS
##FACTOR=    0.0002768,     1,               1
##FIRST=     0,             0,               0
##LAST=      2.2672688,     0,               0
##MIN=       0,             -883623,         0
##MAX=       2.2672688,     783862,          0
$$ Real data points
##PAGE= N=1
##DATA TABLE= (X++(R..R)), XYDATA
$$ [...]
2135G85j579P47J191k243N58J790j805p3J606p67q90Q60M69j038O8J026j011J55
2153a51J218j613j81K127j278j294J994k79j852J531L84j182K74N14j44j73L11
2170B06o0q50J361p6j442J290P30k076Q36J049j868K82J420j300P7J145p48m54
2188d78Q26J0j015Q02O03j468K29J639j389n34K174j358j476K073m75p93P12L59
2206D41q57O88j7q27M76N93o91q29J967n42j465J619O06j922Q31O20j380O98L01
2225C10r32N28M60p75N1P81n7j584J181Q90j625K75J542j050p94J961j172r16
2243i26J618o28p32J020k1j068J126J07r42k41J478n84j190J608j36j633J525
2260C81L90j583J127M13j330R84K35j182N70Q63j388j91J196K1j230P60Q92j560
$$ y = [785, -794, -47, 1144, -1099, -541, 1249, -556, -629, 977, 210, -680, 180, 649, -389, -321, 705, -306, -151, 1067, -546, -727, 1400, 122, -1172, 822, 543, -1309, 222, 606, -576, -302, 212, 68, -105, 206, 146, -704, 657, 581, -861, 429, 1159, -917, -81, 968, -900, -618, 802, -498, -421, 724, -24, -478, 348, 358, -657, 145, 748, -720, -491, 1148, -241, -775, 1399, 41, -1435, 638, 163, -630, 82, 441, -416, 272, 255, -572, -96, 497, -194, -1023, 944, 402, -1063, 556, 1162, -760, 71, 691, -689, 9, 310, -622, -94, 366, -409, -358, 423, 366, -1218, -37, 853, -772, -497, 1045, -5, -799, 1162, -10, -926, 692, 64, -668, 352, 331, -737, 389, 496, -446, -687, 791, 207, -983, 625, 489, -1144, 381, 771, -812, 315, 728, -602, 382, 617, -565, 5, 868, -520, -711, 485, 506, -724, 36, 928, -632]
2278f32K03J375j281k06J672j337k3J083j060o05J205j09j026O26P33r51l59J507
2296H15o28j328J711j62j051J057J31j377J501l87j084R28P98j470P4J211n43
2313A96n87N76K18j240J048J18j105M75J286j684L14J584j741P5J537j006q85
2330h21J223K67j358P36N48o29l90J169p43j042J825n99q41J308n63q44J341J16
2348G03j432Q04P43j174J24O90J4p87L68M15q75L83N64j364R98R59k169M16J861
2367A241j684k82J649q94p03J007R7j014N08O98p52k30J101q61q61J649n31j077
2385i39J485n08q54J347k95p68M77O65n10l68N29lp41Q45P4j263J323J71j830
2404a163J460M48j692M60J473j374j3N72j74j48M75j22q19O39Q29j441L9J654
$$ y = [-632, -429, 946, -335, -541, 1131, -206, -229, 854, -206, -811, 394, 285, -741, -115, 618, -333, -692, 815, 187, -1141, 570, 408, -643, 414, 545, -832, 669, 282, -802, 126, 924, -546, -472, 739, 196, -391, 185, 403, -837, 211, 329, -776, -301, 985, -699, -385, 1199, -542, -467, 1070, 64, -821, 402, 669, -689, 47, 595, -34, -424, 745, 2, -1040, 785, 186, -655, 653, 90, -754, 587, 703, -729, 75, 818, -356, -232, 458, 472, -315, 53, 468, -407, -24, 540, -824, 174, 1133, -1036, -620, 1241, -443, -725, 924, 30, -673, 334, 431, -583, -75, 623, -129, -359, 742, -119, -980, 669, 138, -939, 546, 38, -816, 531, 236, -532, -55, 610, 100, -268, 261, 258, -483, 362, 436, -827, 496, 667, -1163, 297, 745, -947, -487, 986, -388, -401, 171, -3, -151, 324, 202, -617, 22, 851, -590, -551, 1103]
2422A103j232q62J771p95o45J006j43q10Q72q5n53K52M26m59j86O79K23r80O84
2441B66N0j100J315K14j665J060P62j494L83O69o79l33Q99m72l02M76K40p82P23
2460B30R34j417m47J644j088o91J905r09o69R93j41p55L64K91o22K37L91n71l75
2479f96J188j78j075Q39L68r79J079J02j504J018M45j054M48M96p91K8N80l88
2497g4n01N44K84q90R28N06j167j75J591j314j62J102l95j046J404l03n74M07
2515A65L33q09j75R23q04k07J090j49j492J422J85j132J211L7j256R70J54q10
2533c44L29N60p72j39M91r2m13L26M14j065Q64M04j436P81J115j753K27J568q00
2552B65n69P29l21m38M99J38n92O8O31n84m28J395j045p04J457kr93N80J19q33
$$ y = [1103, -129, -991, 780, -15, -660, 346, 203, -607, 265, 180, -373, -121, 305, -154, -340, 339, 562, -418, 266, 316, -784, 531, 745, -920, 140, 902, -592, -209, 460, -219, -552, 347, -125, -427, 49, 289, -493, 230, 1164, -253, -700, 944, -144, -835, 1070, 161, -508, 485, 344, -411, -47, 244, -378, -141, 250, -321, -696, 492, 314, -761, 78, 446, -533, 546, 648, -856, 162, 607, -447, 1, 497, -294, -266, 314, -74, -575, -31, 253, -637, 291, 797, -370, -545, 1046, -268, -430, 672, 277, -769, 635, 332, -242, 165, 498, -311, -486, 437, -367, -574, 516, 367, -1125, 297, 482, -650, 561, 598, -658, 312, 466, -344, -15, 545, -227, -366, 125, 33, -380, -54, 360, -705, 159, 563, -873, -92, 1023, -730, -503, 1065, 265, -304, 425, 104, -334, 165, 303, -289, -221, 410, -174, -602, 793, -252, -956, 501, 499, -494, 86, 205, -628]
2572f28R86L21q38J52K68k81j67M86k09p68J154J07j288Q58L77j273N72P32j011
2591d50J50R40p85k76R38n48k22O83k68q96N99O33j128J68J402j357m50J848r53
2610B8o31J038j22p96P74Kp04N07Q2l16j48P43j90j266J377J00j359J161L55j313
2630f78Q78N08j230M26O86r31L25L13l10l01Q11j93r16R25N78j396L07J303j654
2649e49l83J687p34l27O93l85o71J158k81m91N09M53r86l33J567p35r26J081L05
2668F52j245R80J21j177P06N4q15P89N78j253L77N27o37R2N46K45j043K62J068
2687H27j335N61P09r93k85J543j798L27J143j070l06J204k49r61P00P69q93n80
2705f87J087q5j159J375m91o61J083l24p64J181j78j198R26K89q85J03P01j20
$$ y = [-628, 358, 679, -159, -7, 261, -20, -187, 299, 90, -678, 476, 583, -705, 153, 530, -743, -171, 561, -450, -300, 640, -145, -421, 517, -31, -253, 430, 162, -734, -135, 498, -630, -462, 940, -417, -867, 981, 28, -603, 435, 313, -483, 291, 293, -411, 96, 178, -138, -286, 457, 267, -999, 378, 478, -881, 280, 635, -678, 200, 708, -522, -96, 590, -341, -16, 297, -13, -314, 497, 304, -612, 313, 891, -505, -198, 1105, -549, -932, 755, 21, -306, 387, 2, -669, 489, 208, -283, 226, 679, -307, -640, 927, 192, -734, 347, 652, -593, 387, 508, -669, 37, 91, -724, 65, 643, -610, -233, 294, -343, -251, 295, 540, -503, -241, 827, -508, 53, 762, -231, -516, 1027, -771, -444, 699, -371, -677, 527, 278, -683, 17, 786, -107, -687, 400, 315, -844, 531, 40, -621, 462, 138, -626, 555, 377, -821, 105, 394, -491, -388, 313, 193]
2723A93q03O75O3n37L76L41o89O13L93j343N21J193j612J11J345j378P0P95or35
2743f14P28L79r20Q4P11m54n30J397o42j017J961p80j269J501J17j246N16N77
2761D99q05k93P59O5l03L00k76k11L06M62j074R38L32j543O17J310j630L40N41
2780C34n14J4L53l29k72P02j84n69L29Q83j309j3J555j087n97J648q72q88R38
2799A22M26j012L47J46j02j63N08m12k23O97l76m67J080o1j435J261J63j267R01
2818A33N29o91k20N37m57K51Q1n7o42Q59Q3j433Q89O04j007J97J066j099m90J785
2838I18o04j197J177j4p44O50K53r79J64P27m35n65J065m01r77J392K77j615O49
2857b59J244j349N42J10n54M04K06o34k20R06k88p04O82O71j509M64J009j348
$$ y = [193, -610, 65, 128, -409, -33, 308, -381, 232, 625, -718, -197, 996, -616, -505, 840, -538, -468, 327, 321, -614, 114, 493, -427, -343, 368, -86, -616, 781, 139, -878, 1083, 303, -966, 535, 652, -594, -78, 499, -306, -599, 160, 225, -78, 222, -54, -265, 41, 503, -571, 367, 699, -844, -227, 1083, -547, -207, 334, -180, -166, 187, -142, -414, 288, 104, -465, -136, 747, -562, -575, 980, -107, -704, 944, 72, -816, 122, 548, -464, -117, 29, -73, -236, 272, -140, -363, 334, -42, -509, 571, 510, -925, 336, 499, -768, 133, 662, -29, -249, 288, -169, 82, 163, 106, -536, 323, 406, -1027, -138, 466, -541, -344, 722, -377, -867, 918, 314, -883, 294, 280, -464, 186, 439, -540, -376, 351, -84, -649, 416, 15, -962, 430, 707, -908, -259, 985, -364, 178, 288, -266, 138, 344, -290, -510, 396, 108, -596, 86, 757, -752, -288, 721, -627]
2875f27L00R52r25q9R17q36j1R56k97q71Q53K08j010N3R72p44p28J646o50q55
2895g86J338M4j117O19L02j147J104p4m75L62j10j34l73R16r6r68O63O43j454
2914g43M54J134j124j10O63n53L53L54p97Q0P16k61o82Q87J42q47o6J094j009
2933c15k92J539q48o91J398n82o05P02Q0j035P92j39l86J65M93k09l94N48K03
2952D24r37L83P31j078L34N64q49K38N44p88O59L0n55L2M43J52o73L20N89p08
2972a45j53P97r66K05Q75r29p3J311j050r04J435j65q77M98L86m53k81Q69l26
2991E4n18O38p2p52J189L79j661O32P95j160M41N85o32J8M11l05l09M50J87j052
3011f82M81P91q74J12R56r76J19P97j130J07J423j214n36J045k83n71M86J98l72
$$ y = [-627, -327, 625, -300, -389, 528, -308, -319, 637, 340, -531, 322, 530, -480, -427, 545, -199, -927, 719, 69, -786, 552, 596, -521, 98, 400, -747, 357, 283, -192, 170, 60, -74, -447, 469, 373, -595, 68, 711, -743, -289, 845, -279, -389, 274, -279, 74, 428, -369, -289, 427, 166, -516, 371, 513, -334, -400, 694, -315, -607, 932, 84, -607, 791, 209, -396, 306, 386, -649, 143, 4, -382, -217, 276, 67, -327, 221, 424, -513, -130, 601, -477, -143, 421, -428, -190, 354, -434, 225, 255, -300, -268, 175, 327, -346, -26, 563, -145, -298, 499, -467, -262, 613, -316, -389, 922, -128, -1032, 403, 238, -639, -141, 245, -208, -489, 380, 54, -464, 174, 102, -650, 539, 918, -743, -111, 684, -476, -35, 550, -82, -64, 347, 42, -267, 183, 370, -682, -201, 590, -284, -172, 784, -192, -73, 724, -406, -299, 1124, -90, -626, 419, 136, -435, 51, 249, -123]
3030a23oL31m63p1R89n29j071J439J36j528J012K31q40L61N84p50J72O34m35m36
3050c63N26J05o74M39L49o27K8O71p81L86L54j072O99L51n12m16R65k08k79l9
3070i8M84p35N59K25p30J03Q70q13q83J853l52j136J019k4n70K40K06m47oO81
3090D46l43n62O97K76j290R14L42j081O29M75q34L85N36q82j00P79p85l4P19k82
3110Em06M60N36p63K78O06o74k49R02j067m05J654r39o77J030j82n80O31L67p30
3130b03P5N93k31q05R20M6j259J216L12j347P37M13j002M92L11p29L18M43k82
3149A8p5N3L83o12J5O02o20J42N26o96L8R44j313L59R39p66l71J100m20r48O81
3170b1L7k16l8O10n24l45O81J2o35Q65M4j418J155K77r13K30N36p11K14N15n58
$$ y = [-123, -129, 202, -261, -332, 657, 128, -943, 496, 632, -896, 116, 347, -493, -132, 452, -298, -126, 508, 73, -363, 163, 268, -406, 33, 382, -245, -217, 454, -327, 59, 413, -659, 40, 391, -121, -537, 428, 220, -59, -98, 386, -349, 210, 435, -295, -192, 678, -135, -1018, 835, 483, -653, 366, 342, -228, 12, 218, -229, -235, 446, 103, -459, 238, 514, -776, 138, 480, -601, 28, 503, -331, 54, 590, -292, -392, 387, -398, -432, 287, 5, -401, 59, 595, -168, 110, 716, 42, -207, 695, -372, -777, 877, -62, -739, 291, 109, -471, 160, 527, -203, -128, 465, 234, -571, 349, 395, -864, 352, 664, -683, 54, 467, -535, -43, 268, -461, -143, 300, 18, -57, -4, 379, -233, -218, 384, -236, -94, 432, -264, -226, 718, -595, -236, 703, -63, -434, 666, 246, -702, -21, 16, -200, -238, 372, -152, -497, 184, 196, -439, 426, 470, -948, 207, 484, -429, -199, 337, -374, -160, 355, -203]
3191b03P7J45m8j58J88J99n46K39N62j357R69L02q93Q6J028o69m20Q69l47o29
3211f06N03K80m35J28N28m02n06J087n54p06R68M35j585Q06Q11j362L70M72m30
3230a98M46j15o8k88N73k23n75N00K49p08J78Q02r16J42P21p67J56Q16j091J26
3250b40N34m51o6K67k3m90N54L33q60j08J327p33p63J457k94j104J033j9p10L81
3270B5J87n71N85J18k72l36O04k35l13L60L79j106N81N39j057L03N20m68J33J99
3290A75n92M35M88n56k42L22M4m97K94O16o62m4R01o95m77J114o62n93J250m21
3310A98q22Q76l89j05M5O59q58N0N88k8o38M72L12j077N02L10p00O74K90q55L60
3331a36N63q95L39J57J03k38J10L88p66L81N73j074M62K83q32K04J134j061q7
$$ y = [-203, -126, 19, -29, -187, 1, 200, -346, -107, 455, -902, 67, 369, -524, -438, 590, -79, -499, 370, 23, -606, -103, 177, -258, -130, 398, -4, -510, 577, 23, -683, 285, 720, -865, -59, 752, -610, -240, 232, -198, 248, 133, 65, -223, 350, 127, -448, 52, 301, -407, -229, 573, -343, -201, 520, -247, -91, 725, -366, -240, 294, -157, -223, 44, 21, -469, 85, 418, -442, -550, 777, 44, -719, 738, 444, -660, 373, 354, -356, 25, 212, -359, 226, 344, 72, -264, 340, 105, -208, 152, 531, -575, 6, 545, -512, -209, 311, -157, -24, 175, -417, 18, 506, -50, -292, 30, 74, -423, -129, 487, -175, -219, 682, -13, -490, 624, -38, -631, 619, 198, -624, 252, -137, -242, -197, 462, -396, -346, 242, 214, -424, 48, 360, -717, -215, 95, -605, 69, 359, -496, -136, 427, -468, -129, 28, 131, -107, 3, 391, -375, 6, 579, -495, -33, 250, -582, -378, 756, -305, -392]
3350c92Q65o76j53O45J37p04o0P05m90k31Q51l21p13Q63l6j106J312k33m38K93
3370A18M81q89M14J01k84j45K19Qk37L94L47p83L10K14p96O06M58q41Q7Q16p75
3391a77p7O61m14j80M36l68p3NK90k83j14Q25m60o68J145q3j196R38K2j090J118
3412B57l9m71JO75l57j41M08j24o45N41L74n42J46N00r45L74O97j085J00P73n42
3433d5k93O56o82r9P84k98m67K34M61o66MJ108o18p77J349o61o04J047m93n38
3453e98O21K15o86L45M80m02k41M33J33o69N07J50o87J93O16r77M64L76p14J27
3473c14P09n14j24L32j78L93p9O4m25M03Q6o01O8O61n11l37Q65p35l39J047l50
3494A21o46R22l35m78M80M57n34n92R39k35n66P57j18q76P55M89r81K99N20r14
$$ y = [-392, 473, -203, -356, 289, 426, -278, -338, 367, -123, -354, 497, 176, -537, 326, 290, -816, 496, 263, -175, 118, 599, -290, 124, 225, -59, -204, 15, 23, -214, 180, 527, -256, 54, 268, -528, 78, 536, -305, -218, 598, -177, -254, 407, -7, -187, 249, -119, -192, -187, 103, -180, -294, 531, 71, -597, 548, 465, -731, 207, 229, -861, 257, 218, -253, -252, 423, 66, -75, 333, 209, -436, 105, 479, -63, 83, 583, -362, 12, 709, -376, -276, 497, -45, -338, 318, -364, -463, 321, 23, -444, -210, 251, -415, -411, 697, 79, -698, 651, -10, -614, 433, -60, -598, 23, 238, -448, -103, 377, -25, -266, 167, 300, -369, 138, 288, -399, -206, 410, -567, -103, 273, -441, -314, 395, -119, -243, 89, -89, 304, 225, 289, -136, 267, 353, -248, -180, 481, -30, -367, 498, -237, -576, 471, 121, -525, 397, 62, -416, 64, 521, -13, -605, 334, 99, -467, 290, 172, -704, 51, 540, -441, -142, 378, -536]
3514e36K69O92n34K7J98l6K6k49J62j60K73O05r76k54J087r09J57O68q88qO65
3535B79n39k42Q64J02q67lN51m10M4N51j47p07Q28J22q56Q06O3r92P48L24p02
3556a83K7K37o2k11M03j11j55L54j3n41K82J68m44L3R93q30j59O74m72k35P33
3577D88p75p4N86j34k05K10M17o20l68Q87k21o08P09l29n95J224k39r68R99Q4
3597D68o81k3N05k81k02K28O0m51L21L04n71L51O64j186L42L70k21J3K37m99R5
3618a57Q0k10N1K32J28k13j13O50o73j12Q03p78k50J026k91n89Q62m46m00P58
3638C58K01p06Q7J62j05k55N00l28K2J45N7n43M44M05j009K46P45m60K2L97m50
3659f5J49k24K73n87L72J01k51J28L78n15Q5R40r09k81P35k99k49O81p49j34Q23
$$ y = [-536, -267, 425, -109, -82, 116, 80, 106, -143, 19, -141, 132, 737, -239, -493, 594, -315, -158, 510, -378, -386, 279, -260, -502, 362, 464, -403, -406, 145, -265, -221, 330, 183, -524, 304, 426, -430, 376, 439, -553, 195, 519, -183, -156, 81, 19, -192, 211, 100, -55, 299, 286, -255, 27, 195, -249, -216, 777, -53, -212, 462, -10, -245, 488, -287, -361, 225, 91, -114, 96, 513, -107, -475, 412, 191, -417, 292, -37, -632, 592, 353, -615, 384, 468, -213, -236, 269, -12, -214, 14, 74, -377, -56, 248, -323, 28, 692, -494, -152, 218, -3, 10, 247, -252, -157, -77, -287, -236, -4, 124, -89, -202, 448, -225, -337, 466, -312, -562, 464, 173, -416, 446, 0, -400, 358, 559, -147, -60, 102, -3, -258, 242, -86, -64, 81, 138, -405, 39, 444, -565, -319, 426, -34, -12, 385, -65, 84, -140, 133, -454, -82, 19, -232, -104, 274, -241, -156, 784, -125, -406, 329, 30, -219, 462, -287, -421, 402]
3680D02l21m65M07Q7l9n65P58l7p62P38j47n87N40O49j175M84M97r45L34K98o6
3701H5l24K55j63K9K49K90n56N3Q3l00K71K22j96k94Q10o13k21P05n78o3P33m63
3723A4k59J56O71q89J20N45k60n41P05L13r25O13l3n08L39K31n07R1N08l16l28
3744b60N16k59J33r7K65k95j63M66l85M5J11o3l26O33n64J19N03k82q4L03j27
3765A89n56L65J74l02l25Q58n51l90R33l44m70Q04j67m45K03N25q02J63N43n91
3785a86M1M97l49k89L0L41l53Q0N82p06L63K33o14j06O08l80m1O54j14m23J39
3806GJ82l70j90P68m35j34L88k91l81O77q6o63O81L17p49N90j53k67p1O20k25
3827B15m56M56n1l16L33O2o55L98K32n19N56J03o28L26K52n37L99O6j86l68M31
$$ y = [402, 81, -384, 23, 110, 71, -494, 264, 227, -535, 203, 56, -531, 9, 658, -517, -33, 464, -481, -147, 151, 85, -239, 16, -147, -118, 131, 421, -135, -82, 1, -299, -28, 194, -2, -296, 514, -99, -320, 385, -193, -256, 477, 14, -245, -89, 582, -307, -187, 358, 98, -443, 262, 575, -350, 263, 230, -278, 61, 292, -215, -124, 384, 68, -260, 256, -3, 130, 33, 298, 3, -160, 306, -79, -34, 77, 14, -312, 321, -243, -124, 379, 97, 13, 316, 189, -367, -2, 172, -130, -455, 403, -148, -538, 395, 51, -419, 385, 218, -227, -24, 501, -301, -138, 405, -186, -145, 352, 3, -286, -256, 85, -268, -188, 394, -312, 51, 284, -330, -436, 172, -208, -249, 405, 291, -132, 7, 189, -181, -371, 397, -38, -172, 216, -75, -456, 221, 135, -528, 153, 470, -279, 311, 158, -109, -180, 440, 215, -241, 215, 164, -152, 181, 243, -412, -14, 218, -301, 255, 358, -270, 56, 308, -229, 170, 236, 50, -318, 113]
3848A13j74j36N17M2m89O4O01o13p8M82l85n34J242n31n25O00j39j74K14j03r3
3869i9k81P52k65m44M53m2m97L42L48q11K78M25m82L39K75n78L36j7k24k9K24
3890CK17k06j1L02m75j21N57p73J09J022o71m71R16m55k04L66J58l87m6M17m99
3911b52J51K78q2o25O97J86r31Q00J98q05M88K18n25J81j10K02j1j44K23j55J61
3932A43k43J08M2L08p57j31P57j42l54O73n44k09N74k10k54M98p5k82p8M43n39
3953b72r5Q74n73o9Q6J58q54J037J7q36Q08j4k17O2L5l62R8J87j45j04K47N1m61
3976c42L76K44n44K28M48n93M0N91p41J94N03m73q3N03j44l70L76j35N4k54M63
3997C41l03k13N11k39n08Q03k22l30M60ko96M36J40l82J53N8Ll98O52r5m25K60
$$ y = [113, -61, -197, 320, 362, -127, -63, 538, -75, -153, 329, -56, -590, 652, 121, -404, 196, 57, -117, 97, -6, -99, -380, 372, 107, -337, 116, 74, -423, -81, 267, -544, -266, 159, -323, 16, 291, -287, 49, 32, -192, -221, 3, 220, 14, 3, 305, -170, -291, 266, -507, -398, 624, -47, -518, 398, -57, -261, 105, 263, -124, -170, 247, -252, -101, 177, 95, -530, 167, 353, -578, 222, 420, -385, 103, 321, -204, -23, -133, 69, 58, -86, 137, -18, 143, -100, 8, 50, 358, -399, -530, 227, 85, -269, 404, -140, -349, 225, 15, -239, 259, 184, -98, -176, 267, -272, -367, 507, -66, -135, -49, 109, -745, 292, 309, -527, 281, 267, 50, 112, 147, -215, -117, 70, -75, -179, 68, 119, -342, 34, 278, -266, -38, 410, -183, -143, 448, -293, -99, 404, -69, -152, 351, 207, -163, 213, 78, 132, -122, 341, 38, -175, 336, 97, -411, 392, 170, -160, 300, 298, -398, 38, 178, -204, -51, 7, 10, -388, 264, 169, -256, 4]
4019DK68n89M48j21j96J96P6l38J18K50M8j98l7N7k26N3M47k59j0L50m27P6L77
4042C67n26k68O91k11q5J65M2j83J24r7l66K90J67j28l91P53k78k74J49L43m31
4063a47J97J96n57L09J38j83J53j6Nj17j6J94m50qL60j73J68K91n98K36L47m76
4085a47J12L10j72j0O4k09k73M21m3J29k16m6Mk74O70k04n92R00k58n99N84J2
4107A63l74O2K61k85j50M59j04l7o6L74m43j62P01m50l08M31j51q7N36m90N7K07
4129A44m40K18K87k46o2J72k7L4k24K13J53n77P73o36m8O53p8m94J57K82q53O39
4151D0L1l56J97K65j54n2j9M67o26K59J98n92K63L85n80J74K54m24j32M19j53
4172a36l0L27j20j2K46l41J1j11K60L3r7Q1o2l10N70j82m62O66j42n10L55m3j17
$$ y = [4, 272, -317, 131, 10, -186, 10, 86, -252, -134, 116, 164, -34, -71, -14, -240, -187, 260, 1, -9, 341, -86, -10, 367, -159, -427, 264, 53, -32, 133, 175, -8, 116, 19, -347, -57, 110, -18, -409, 344, 66, -208, -59, 284, -147, 50, 246, -311, -2, 136, -47, 106, 90, 95, -22, -38, 156, -294, -302, 58, -115, 53, 344, -254, -18, 329, -147, -35, 275, 103, 93, 157, -52, -325, 96, 53, 182, -34, -80, -76, -350, 320, 116, -476, 424, 166, -433, 151, 163, -211, -149, 112, -173, -323, 136, 32, -5, -71, 303, -140, -302, 399, -51, -359, 72, -79, -166, 370, -120, -63, 144, -296, -78, 209, -37, -99, 73, 46, 80, -144, 69, 222, -355, 418, -218, -266, 387, 309, -185, -28, 254, -599, 40, 71, -285, -88, 177, 23, -29, -48, 419, -207, 52, 250, -342, -79, 306, -274, -100, 154, -270, -402, 17, -136, -166, 161, 41, 29, 275, -66, -55, -166, 94, 127, 30, 111, 49, -261, 309, 127, -335, 331, 189, -321, 34, -9, -126]
4195a26l8M17k29j01M15k7o63L30J49o03L84L43n77J86N14n87K41m6q3L4K14J5
4217A62j88k1K94m61J57L2N4l25K97J17l72P16n84k07P65m91M2n3q3p2J16K9k53
4240c29M9N85k49o60Q54j6o65L47M55n97Q9M46j67n29N63l41O6o0L17l17O8K43
4262A52n81J54M38k74j92O23l20j71K61j02MO7j07l21L32K65j89l4j87J40j11
4283a53O64n06m01L50J14o34P05K17l84j3K44n62L26J46l77Q6L05K14l87R6L00
4304C50m57j37O42n32o2P09o63L0Q0K68l50j8L21j49j2J31L2l14L18l89k1K71
4326D8L0k09J75j47j90P87l60m34O02m3n41K77J2q3j65L55P1j67p2M44p46k3N22
4349A43p02M36M49k15l25L10j52k41L38o7J40P0j14q5k73N49k86k90O07k52m26
$$ y = [-126, -164, 253, 24, -77, 338, 311, -352, -22, 127, -476, -92, 251, -326, -140, 374, -213, 28, -18, -101, -67, 147, 162, -26, -47, 247, -214, -57, -25, 29, -296, 1, 118, -254, 462, -122, -329, 436, -55, -13, -66, -149, -221, -105, -76, -329, -280, 305, 56, -604, 250, 234, -431, -84, 371, -226, -137, 309, 142, -387, 176, -165, -99, -159, 158, -159, -91, 152, -429, -275, 163, -111, -303, 320, 0, -171, 90, -12, -8, 59, -48, -369, -37, 228, 39, 5, -182, -42, -153, 511, 5, -396, -46, 68, -566, 139, 356, -28, -41, 203, -359, -33, 113, -264, -178, 127, 341, -46, 50, 350, -107, -244, 398, -134, -196, 513, -150, -120, -40, 228, -122, -140, 181, 32, 20, 151, 183, -131, 187, -202, -223, 48, 78, -131, 44, -103, -293, 494, 134, -300, 302, 259, -282, -5, 7, -76, -241, 114, 185, 18, -54, 390, -356, -379, 143, -559, -123, 326, 111, -214, 96, -56, -297, 41, -26, 114, 184, 70, -15, -288, 261, -25, -315, 292, 40, -386]
4370c86N27j73p4K14j70j58L14K51k87p7K45j0l80K19J76n71L31J63k15RK09m45
4392b88J32L52m56N08j27n43K49M37k65k02J37L87k53l33P13m57k85N91m08k23
4412c34O54l27pL17k96m27N81K7l32K62j88K06m2o4N1o5j96L17k93M08j10l00
4434a58L0M62o68L82j21K48j93J54K35n93j76Q37m59J7J09k65M8N40m98j17M96
4455C10l19j82N24o74L35J22j30n9J45J02j89j71J44R2j59L76l39r9J93L64p75
4476c89L84L71l72RL36m09j52K38r7j0J48P0m10L96j1m37N1P06l91k48N04n97
4498c10K36J07j20j19M87K1o04L00K29k14j52M05k97j69N32m33j16L22Jk78K23
4519E1J36j89p3j32K90m3j23K78k13j4L33n74K63J86l37J41n6K45j41j6q8J52
$$ y = [-386, 141, -32, -106, 108, -62, -220, 94, 345, 58, -19, 226, 216, -164, 55, 231, -340, -9, 154, -61, -52, 157, -288, -156, 196, -260, 248, 121, -422, -173, 264, -1, -203, -66, 321, 68, -265, 448, -9, -294, 297, -111, -334, 320, -7, -14, 303, 7, -420, 161, 188, -144, 118, -70, 136, 94, 30, 81, 16, -180, 137, -156, 252, 142, -158, -128, 334, -334, 48, -73, 175, -18, 136, 371, -222, -398, 439, -20, -3, 106, -159, -111, 429, -69, -186, 310, -9, -191, 333, -341, -6, 116, -14, -73, 72, 174, -15, -186, -42, 50, -109, 267, -72, -171, 22, 386, -389, -5, 366, -6, 3, 339, -70, -222, 16, -81, -91, 57, 127, -283, 113, 102, -335, -284, 422, 31, -217, 287, -310, -74, 33, -87, -206, 281, 302, -302, -2, 227, 13, -139, 266, -31, -200, 332, -101, -217, 105, 106, -172, 51, 187, -2, -75, -207, 83, 40, -83, 195, -18, -32, 301, -273, -10, 176, -161, -20, -76, 169, 28, 12, -76, 76]
4541G6NK6k68L34j06j08J95J03l27k6L44l41k00M99l25k70N99l54j27J35L29j65
4563B8j69J12M14l09j63J19j86L49J76l09p7J91n01L47L05n08O8M53o29M10j76
4584e5j51K67j59M08l81J99L00n27J02K47j84K4N5r4l42O84n70N7K49k75J43k1
4606b4K5k7r4J99J71j76p3J90l76K90M2k08L20j88m71M82p2K7K8M5j94l3J17N1
4630E1k16L37j78j42n1K44j75J76L02n67J01J51oj43N56m44l71R7N04l34q8L52
4652A56K13o71N03K7m83K80J27l44L78j21j50Rj05j8M58k69J36J73m42M07l78
4673a14N3L32o29L44M05n39J14K30j57J2K36n3k90J93l3l15L74R5k19k03M78K2
4695C36p20L70p6j49L64j13j73K21l8N9k5J02R7k57q1L85n28K6M66m54L65r2k55
$$ y = [76, 81, 107, -161, 173, 67, -41, 154, 257, -70, -96, 248, -93, -293, 206, -119, -389, 210, -144, -271, -136, 193, 28, -141, -29, 385, 76, -87, 32, -154, 195, 371, 62, -15, 176, -325, 22, 327, -181, -113, 340, -289, 121, -55, -206, 61, -98, 310, -71, 128, 428, -99, 3, 250, 66, 90, 145, 51, -291, 393, -177, -120, 129, -146, -3, -24, 1, -26, -120, 79, 250, 74, 1, 191, -185, 105, 147, -61, 259, 71, -400, 82, 10, 37, 65, 110, -84, -117, 0, 51, -165, 172, -6, -148, -199, 45, -130, 46, 348, -219, -118, 33, 27, -116, 440, -4, -375, -278, 226, -108, -196, 156, 369, -302, 201, 228, -255, 25, 152, -192, 186, 65, -85, -76, -181, -199, 259, -10, 126, 299, -143, 264, -114, -61, 271, -358, -14, 391, -148, -34, 196, 39, 51, 287, 234, -56, 137, 104, -211, 163, 258, 39, -164, 314, 336, -384, -14, -90, -239, 125, 12, -161, 60, 22, 81, 56, 158, 255, -2, -83, 302, -226, -200, 266, -188, 177, 85, -170]
4718a70K4J98m18R7N48o04N31k26k29J86J45J3j52J29J04n04K13M91n52j45K99
4739b2J34j40K25J1n88M92J94l55R2j6k37K89j36J48l73K08K68l80J97j55o1K54
4761D9M08p57K63J28k88J69J6k4J6k27J71J09p6J94m57J99M42o57J44L86j67k19
4783a78J69n4o0N5O8j68J78o0P6p4J79k48m42Q87L0n97K25L72n70j05P37n17J03
4806FJ99k44n4J68J88l47RL65m29j44L72m06J96L10l27o6K91j00k68O37n51L0
4828a65M76k50k26J65J96k53j64M32k50n3j25L93l66N74m04j92j2N96m99K8J54
4849E5k09j18M30k21r0L7L42k68p3K79j8l31L51l13p7P15m77k39O90l70l15J72
4871d8J16r1l68N18j74j23M19j64m46P07k08l40L26q4k8o1O9J03j35p4J24j98
$$ y = [-170, -146, 52, -366, -269, 279, -325, 206, -20, -249, -63, 82, 95, -57, 72, 176, -328, -115, 376, -176, -321, -22, 112, -28, 197, 208, -380, 112, 306, -49, 43, 27, -210, 79, -57, 91, -282, -74, 194, -186, 11, -144, -205, 49, 457, -300, -37, 91, -197, -28, -12, -36, -20, -247, -76, 33, -43, 151, -306, -107, 335, -322, -178, 208, 41, -178, -9, -63, -123, -68, 0, -168, 10, -50, 26, -48, 131, -117, -559, 328, 358, -239, -14, 358, -212, -317, 420, -97, 6, 205, -39, -93, 75, 263, -84, -75, 290, -139, -283, 89, -317, -121, 189, -138, -204, 87, -13, -281, 356, -195, -165, 311, 61, -165, 0, 196, -57, -221, 211, -39, -92, -217, 176, -190, 384, -20, -212, -224, 372, -127, -99, 55, -154, -272, 158, -63, -153, -116, 226, -42, -115, 164, 146, -185, 166, -147, -224, 491, 14, -225, 465, 95, -220, -48, 68, -23, -391, 127, -47, -170, 249, 85, -361, 346, 138, -202, 124, 40, 12, -49, 20, 123, -12, -86, 38, -160]
4893a60L43k7l35K19N3j04j15L60j98PJ51k07k72K55j92J12J69J56m14K35k36
4914b00J98j33K25P3m05M21l64q8O31m27k26M47l17k5K3M25k05J05j88k3K64r7
4936A14l0m49M34R2l90L01J52k81O9q9J7J66J7k98O4J05K57l19J86k65J3Q5K00
4959A51l49m6M06m44k0P25o86J17K61k78K15k9K22l28L0J43j06k68K57J84m48
4980b91L01Q2k16J08Q6J81m72L35L8k25K9K9Q8K84m4l19M7Rk98J49J83J0m43O19
5004B70l01l20P07l96O4J05m44K24L52j88j17K63K7l56K12Q5j35l11J17K79l67
5025b30L95r5k93M58K7m44K45J14N8l21K33j16O7k65K62j64J48K36n76M04j19
5046B4j46r3K61J49o7K16n29m9N53l25j73n5K20J14k67K76n7r8N5k11J8L75j03
$$ y = [-160, 183, 156, -179, 40, 93, -11, -126, 234, 36, 43, 194, -13, -285, -30, -222, -110, 59, 215, -199, 36, -200, -2, -135, 90, 163, -242, 179, -185, -273, 358, -69, -295, 152, -165, -190, -167, 258, 53, 158, -30, -53, 211, 114, 84, -365, 69, 161, -229, 72, 224, -57, 12, -77, -60, 106, 123, -175, -111, -6, 251, -68, 118, -147, -134, -49, 151, -198, -244, 162, -282, -302, 423, -263, -146, 115, -163, 52, 23, 245, -83, -53, 90, -16, -284, -27, 157, -291, 10, 92, -124, -16, 70, 251, -221, 114, 152, -73, -44, -15, 73, 357, 313, -6, 41, 50, -248, -99, 84, 94, -349, 270, -31, -351, 356, -40, 24, 129, -315, -91, 261, 73, -44, 219, 246, -110, 102, 187, 52, -259, -142, 137, -230, 165, 70, -223, 235, 262, -182, 63, 177, 235, -86, 147, 31, 98, -167, 95, -69, 79, 315, -261, 143, 24, -122, -215, 46, 195, 128, 344, -185, -234, 319, -6, -179, -234, -14, 100, -167, 109, 52, -46, 9, -202, -184, 191, 88]
5069H8n9k56M48J00k51K60l75k27L17R0k05R6R5l55J87J06l21K11j2k77K14NJ90
5092F9m4K92l21l04M39l29J62o1M9K06j11Q6o2l3K06k34p5K26L0l78L32j33j30
5115a18L31q8j68q9L9k4K19j96J69k31M03j33k59M84l88j71N51q3k40R3j93k5
5137a17J29k1j23J66k94K74Qj69L53m13J76M23m37J1J89l81J06N7R2p6j15L30
5159A68l5n3j02N1k06j9K96l74L04J37l93K81K14j49n0k42K10J41k77K25k23j55
5181b51J93Q8j38L23j85j82L05k84RL15j71p3L58l37K30j9mk33O3J4j46kp9k8
5205b34J77L20j5j57j64L36p07K50L36k91K03k28J41K5q9J92j55RN2J29j60M34
5227D04m16K8K77l59M6p8J33p8L51n08L74j25J18j63J37p2J64l99K69Jj65L35
$$ y = [88, 29, -227, 221, 321, 70, 330, -45, -272, 45, 135, -70, 26, 121, -234, -47, 59, -262, -51, -63, -340, -126, -121, 69, 25, 317, -4, -308, 131, -198, -36, -97, -48, 158, 47, 133, 71, 38, 244, 10, -65, 161, 191, -187, 145, 12, -118, 213, 125, -43, -132, -93, -117, 102, -94, 75, -156, 247, 114, -145, 339, -49, -220, 331, 248, 8, 101, -92, -117, 12, -9, -132, 34, -260, 14, 22, -147, 206, -207, -31, 392, -45, -34, 155, -226, -120, -63, 29, -47, -162, 168, 133, 80, -22, 29, -177, -196, 100, -274, 30, 167, -226, 55, 269, 120, 70, -172, 38, 179, -98, 127, -96, -251, -58, 30, -108, 215, 30, -152, 153, -131, -122, 193, 22, -51, 307, -30, 200, 181, 177, -56, 7, 21, -125, -127, -206, -234, -57, 263, 248, 91, -73, 263, -444, -194, 142, -149, 54, -174, -33, -8, -97, 95, -60, -51, 1, 130, -30, 404, -12, 16, 293, -66, -20, -98, 35, -43, 308, -200, 174, 49, 167, 4, 141, 69, 233, -166, 103, 104, -61, 274]
5249B74l37J14J41J2m42J83rMl7M7k7J48n6J42k84K85k62k24M43J02j23k8M90
5272E56j031L01N88p55L12J08j8j30n0j78K18K69j31j07m21O96j33k89M39j18
5292A26p9lK57m58N3K23k78k17O63J9n32L21j26l8J21J71l95J46N5j90K97R8l68
5315a34J7L38k45J22l98K72j65K64K98m38J76J26k16k28O02m12l22K20K89m70
5335c04L07r2p1P4J02k3j3K2r7L54l30p5j57K89N38q63O41j89k48L88K29l74N8
5358A66k31R1p1j36K33L4Jj79r9J21M28k30l24N13l40j06Q2k0L2m9J80k15L19
5381B00j39j95j04K04J83l9R9j09j89K59j90q7K69n4n10N19j01j65N7J77j40j26
5403a81L03Q1j43J9M2j37o0M60o32L26k8N8nj67O2p5k3r7Q6J69O4q7j17J16K4
$$ y = [274, -63, 51, 192, 204, -238, -55, -64, -60, -97, -50, -77, 71, 15, 157, -127, 158, -104, -328, 115, 217, 94, 66, 556, -475, -174, 414, -341, -29, 79, 61, -69, -119, -297, -79, 190, 59, -48, -469, 227, 94, -195, 244, 126, 47, 44, 301, -157, -104, 119, -159, -376, 287, 306, -226, 95, -31, -69, 52, 223, -172, -26, 29, -161, 136, 234, -134, -117, 221, -24, 98, -300, -28, -193, 71, 369, -69, 107, 233, 17, -211, 391, -21, -343, -123, 166, -304, 3, -89, -160, -86, 16, -7, -20, 2, -95, 259, -71, -146, -303, -14, 524, -339, 302, 113, -135, 253, 482, 108, 166, -65, 26, -45, -181, 52, 86, 87, -92, -191, -70, 358, 128, -196, 317, -23, -129, -47, -67, -35, -84, 96, -119, 200, 61, -134, -238, -34, 149, 110, 209, 100, -89, 170, -20, -107, 162, 108, -402, 117, 16, -149, -92, 85, -55, -181, 122, 203, 60, 79, 121, -16, -76, 384, -248, 78, 50, 108, 103, -64, -2, -77, -100, -197, -111, 58, 122, 35, -82, 34, 58]
5428E8k01L60r0j63J76J27o08L47Q8l68L73m6l04K75qk08R0J04J14P4K0J2m90
5451b68K52L20m62R0L19l05j81L05j11m4J31l02J73J45k90J80J56k34K38J28j29
5472A11j49k36K04K01l60M70k54j69M36l50P4R2O0l61K24R2m4j77K10m3k36M04
5494A99J87n92L29K36o04M14J16n85M5N23j68j50J95O5k66k0L20k34j45L40k81
5515g6m2K31l15l7L47o30L26L88k12j0J88m2r4j46R7L35m06K99j05l73N24m06
5537a59r7J79L43o98N74j12j10lq9M01n35J95K71m39J84L85l59J23j63j21J33
5558i7J24k43j17O40j72l80M54k65J27jj79j03M70k17J88k09K82k22m66J44L7
5579b05j34L45J27l90K65j19N0o0J84l8o8J03K97m40j20K43j60k89P89k36mk07
$$ y = [58, -143, 217, 127, -36, 140, 267, -341, 6, 94, -274, 99, 53, -251, 24, 16, -192, -102, 2, 116, 190, 210, 222, -268, -16, 304, -158, -68, 251, -54, -235, 70, -41, -85, 46, -256, -83, 62, -228, -48, 108, -126, 112, 240, 111, -38, -274, -70, 131, -229, 241, -13, -182, 254, -96, -22, 70, 130, -231, -7, 85, 41, -136, 74, 31, -205, 199, 386, -206, 123, 359, -245, 169, 285, -300, -255, 268, 100, -50, 145, 210, -56, -76, 244, 10, -135, 205, -76, -118, 113, -202, -239, 108, -522, -196, 192, -20, -30, 158, 116, 22, -124, -27, 308, -98, 201, 96, -277, 247, -159, -256, -77, 266, -432, 142, 30, -80, -83, -172, 229, -306, -111, 160, -279, -95, 290, -69, 54, -109, -230, -97, 27, -216, -333, 307, 135, -245, 209, -56, 71, 70, -109, -212, 258, 41, 229, 20, 302, 80, -386, -242, -205, -339, 6, 133, -257, 8, -111, -61, -121, 63, 25, -43, 60, 357, -83, -203, 40, -120, -409, 380, 144, 140, -67]
5601f7k09K30j04L7L68m96K11K2rO9L33m95L0j96o8M54k68K30J12J19o70M04p5
5624c8k47L58j33j54M66k87K10k61J98k07M6j2K40k64k40L52m6j0J75o0p0qK2
5647C0K40k96K32l50K93J64n38K29j63K09Kn8j16L4J71j69L16j8k66k57K17r1
5669a85j39M08j87o3j69N47p1K4j81L06n11J78O7j46K79j87j90J89m6K70k85j71
5691b63M20J23k73rJ9RJ53j38j89K88l67j84M04j06K94k23o3j5J94k65o9L78m1
5714G7j31r1K50J86k54J98j07m71M17K3j38J29m3j76j83O95j80j43J15k67J49
5735E5k35L14l85L8M79n29L40Q5o0j03J3k89K05J7L25k42p1R9N5J0J33n10J39
5758a17K68r6l75N96j30j44J62l06L23k4k30p0K00j45L08j79K2rk01m3L26l38
$$ y = [-67, -276, -46, -150, -113, 255, -241, -30, -8, -17, 52, 385, -110, -80, -276, -344, 110, -158, 72, 184, 303, -367, 37, -38, -285, 73, -60, -214, 252, -35, 175, -86, 112, -95, -49, -61, 179, -85, -325, 27, -19, -29, 146, 86, 16, 8, 30, 270, -26, 206, -144, 149, 313, -225, 4, -159, 50, 52, -6, -122, -88, 83, -86, 230, 212, -54, -311, -94, -185, -324, 84, -103, -166, -335, 212, 141, 165, -16, 290, -221, -43, 24, -122, 157, -30, -220, -31, -77, 193, -92, -263, 157, 280, 7, -2, 17, 26, 179, 41, -148, 140, -227, -411, -7, -113, 181, -42, -105, -120, 74, -191, -260, 118, 77, -54, -145, 105, 291, 37, 235, 128, -343, 74, 97, -41, 88, 45, -131, -314, 381, 201, 58, 173, -94, 55, -180, 134, -251, -213, 266, -263, 77, 162, 102, -1, 12, -277, -72, -55, 270, 28, -43, 56, 111, 121, 254, -256, -117, 151, 55, -320, 276, 146, 2, 164, -142, 181, 157, -73, -143, 57, -88, 220, 41, 63, 54, -147, -190, 136, -202]
5780b02M2P57p56J64K06o06K96K69l98N54m33J58l79J81L25l83o0K77L29n35M23
5801B29k05l52Q47m61J74L08l75j66J7q7j35j18K99j24l0J85L23m92K83j49k63
5822b92K98J02j93L31k12k36K99N8l76J11K05p2k5k22K98p6k49L19j35j40M74
5843B67j38j32M36n76J66l4J01j10L35l32k67N03m03J23j21J87R2k90J74K56l06
5864f9L21j76k00J40J98n04K06J62k27K92k41K37j88pJ98k02P1K01j06m54M58
5885A10M8l03M21m75k04O06j3j49O2m4L26n61L30j62j7p3m7j62M54Q1m43K23j50
5908a42L55j06J22k32L48m21J79k99J18N97p12l6N27m11j99N19J34n30M92m19
5928a16J78j9o2j6j7Q4Q4k22n6K98j47J79j45k50K24J70k20j6J46k49N19k60j8
$$ y = [-202, -160, 597, -159, 5, 211, -395, -99, 170, -228, 326, -107, 51, -328, -147, 178, -205, -265, 12, 341, -194, 229, 24, -328, 519, 58, 232, 540, 165, -1, 16, -71, -206, -324, -25, -149, -179, 6, 329, -163, 120, -29, -292, 6, 108, -85, 246, 34, -202, 97, 155, -221, -110, 95, 23, -2, -224, 74, -2, -251, 68, -67, -207, 267, 129, -3, 433, -143, 23, -11, 90, -20, 315, -17, -284, 219, -184, -61, -182, 5, 97, -193, -19, 237, -69, 252, 76, -124, 16, 214, -290, -84, 78, -149, 143, -98, 139, -49, -56, 142, -60, 11, 212, 106, -348, 110, 158, -145, 276, -199, -403, 203, 190, 41, 103, 59, 385, -176, 154, -8, -25, -98, -145, -307, 147, 228, -215, 8, -142, 213, 107, 229, -3, 345, -76, 103, -196, -78, 519, -193, -229, 298, -113, -312, 207, 341, -189, 303, -116, 62, 43, -19, -35, -52, 32, 116, -106, -162, 136, -11, 168, 23, -227, -3, 167, -53, -69, 77, -172, 347, 87, 69]
5951F9j40K12l13K2K95k12o1K2j01P3k21O18l90M6L48o02K76K28m83nM4O8R6R6
5975a5Ok85K44Q5P9q4r3J66m82L94l09K00j45L05j08L03m00m4L77J5j0k87K54
5998A66j84J57j48j0r1k9M24m17O3J08m67K86M07j14l0%o4j63O3o7K7lM81m24
6022b9m69N48k0j46K14l7l51M82l53J47J45l37K43k03k04K89o2K64J32l32j09
6043a88L61l49K73j93m2QK17J9l4j1J4j11l49K34n4J4K30j75rL21l45J63j0n6
6067g2J99M1k23l5K54n9m06M97j65k10L78l09K5m0l3K33m5K9J20m03K56J5L8k25
6091a40K94j66J03m4p0Q7N8j62R2K61m28k16N00Q1j52M2J35l48O1J61k76k46M88
6114A15j45OJ22k50K01m2K30l61J10o8m3j84OK26r3mK37m22L65J75k39Ml23L50
$$ y = [69, -71, 141, -172, -150, 145, -67, -128, -106, -207, -134, -355, 263, -127, -81, 267, -335, -59, 169, -314, -319, -275, -207, -111, -15, -9, -294, -50, 35, 114, 30, -63, 103, -379, 15, -294, -94, -239, 66, -42, 261, -139, -183, 194, 209, 199, -88, 166, -18, 139, -9, -19, -110, -139, 285, -132, -69, 39, -428, -142, 265, 151, 121, 121, 57, -106, -43, -110, -83, -86, 395, -29, -498, 50, 30, -116, 98, 61, -290, 192, -161, -14, 131, -206, 37, -166, -370, -81, -143, 121, 253, -79, -188, 173, -176, 97, -96, -138, -130, 87, 106, 72, 61, 75, -36, -385, -151, -205, -191, 39, -136, -145, 176, -169, -6, -16, -72, 127, 168, -55, -90, 164, 105, -301, 196, 31, -179, 199, -110, -85, -125, -158, 75, 30, 59, 179, -224, 32, 47, 85, -140, 154, -12, 91, 47, -23, 64, 122, -40, 52, 313, -115, -331, 169, 250, 98, 140, 275, -73, -12, 149, -127, -373, 115, -30, -24, 98, -152, 49, 7, 237, -124, -14, -82, -125, -309, -303, -77, -170, -174, 63, -359, 6, 181, -58, -54, -377, -27]
6138b7J20j21jJ6j25J38k24O21k59k50K7M53m03r7J62O0oj49j11J76L15l75K51
6161A91j0o7N9k98K56l79L7L08l26K34l4K54k2k68k51M56o4k83K90j52k51L30
6183A0k84K45P1n1K39r8l01k5K67j18KL22l38Oj44oJ58N5j02k7k4L00k61r9L53
6208A50k08J04j24j28K67J8K5m08M47o1k88J17J77l15K51r7L89m68K93j48R3r6
6230a0L36l29K22j67o0K91j54N4j34M19l54j65k51K9J97L52k77Qk69K03J10J97
6252B48m0j83k37L08m02P1L19k88j29L91M3lj68j89K12j2J71L2l57K17J46n1q2
6275A7Q6l7n2L0j12J50m1l1j32O4J90k40q1P1M8j34J17J6O8J02J14l68M26m22
6299a51K61K4k37Q7J93p5j60r8j84N09l58M23l19k89M41l7l5r9L3O4J69K14l14
$$ y = [-27, 93, -28, -29, -13, -138, 0, -224, 397, 138, -112, -85, 368, -35, -132, 30, 90, 84, -65, -176, 0, 315, -60, 191, 181, 114, 173, -125, 131, -248, -211, 97, -229, 5, -29, 225, 203, -65, -316, 140, 76, -207, 83, -69, -320, 10, -274, -29, 42, -9, 230, 132, -169, -194, 73, -45, -43, 279, -59, -53, -197, -203, -45, 10, -92, -119, -143, 157, -104, -203, 150, -58, 46, -78, -206, 61, 79, 104, -304, 143, 82, -206, -89, 88, -227, 24, -73, 316, -152, 141, -7, 86, -10, 326, -3, 219, 52, -8, 283, 129, 183, 49, 468, 114, -51, -302, -273, -76, 276, -1, 7, -262, -59, 51, 248, 208, 25, -212, 96, -306, -235, 84, -204, -333, 58, 101, 98, -70, -259, -47, -59, 112, 144, -213, 4, 150, 99, 17, 103, 66, 14, 44, -68, 82, 41, 10, -122, -58, 132, -108, -189, -118, -70, -204, -87, -71, -3, 99, 213, -155, 271, -151, 110, 134, -103, -16, 177, 102, -58, -156, -340, 169, -189, 234, -85, -374, 67, 30, -5, -104, -71, -7, 162, 376, 62]
6322F2j18J94n75O21j41Ro7K0N3n7j19L13m9m26J38p4O5L21k69J95j48j11J37
6345b6r0K53k80K35J20j83m4K18j43k50K91kk39P8L57k78J31j9l17K86j36J20
6367H2k93K15K38l29N11k35k18r6P7j2k51J96m5L31j5j84J29o4J68m16K87q3j50
6390a57N3J33r2j43N08k17k88L56p8j81K13Lj20L6J39k26N8l6Qj06J79j32J66
6413G6K5J13j41O0p3l58M45j00j29J82l5P2j88k8N5q2J60K4n98M10J64k11J74
6436A7K34l17P4J06k11n9J08O6l6K72k12p2P6k4j48jR3J28k71O5J14j82R3r2O3
6461a16K00j12K8L05l08lo4J90m8L22k53k58M3qK37j69lJ1L20m57K75j31j98M24
6485B27k24r9O3Q7J01j61J86j59j85N30l27r8L70k22k13J47J04k84J66j8p5J92
$$ y = [62, -56, 138, -437, 184, 43, 52, -15, 5, 58, 1, -118, 195, 146, -280, -142, -216, -151, 170, -99, 96, -52, -163, -26, -116, 137, -143, 92, 212, 29, -15, 203, 60, -190, 101, 99, -140, -62, 295, 17, 148, 129, -188, 98, -38, 82, -211, 4, 242, -87, 424, 189, -29, -125, -48, -60, -311, -115, -160, 171, 156, -28, 101, 37, 205, -211, 76, -7, -157, -104, 29, -63, -206, 302, 85, -203, 153, 75, -106, 107, 110, -10, 26, 165, -61, -3, -39, -31, -137, 42, -90, 76, 101, 214, 73, 133, 60, -298, 147, 47, -82, 100, 65, 137, -51, -79, -24, -106, 54, 78, -520, -110, 54, -157, 17, 251, -66, 8, 114, -97, -156, -48, 18, -18, 254, 42, -30, 46, 22, -126, -127, -34, 94, -177, -112, 2, -180, -87, -179, -116, 84, -28, 0, 305, -3, -6, -70, 120, 72, 394, 141, -117, -74, -82, 155, -14, -17, -6, 314, -143, 132, 1, -197, 227, 3, -96, -33, 54, 155, -6, 180, 21, -164, 366, 39, -59, 311, 89, -124, 23, 127, -157, 9, -9, -84, 108]
6507A08m84K73l1K4J05j61L18j67j80M05j66j6j47L21j78n1l4m8m4K64o3m2k11
6530b05J67J75J14k19J74l70L0J00J67q4p8k27M31k18o6R3m3Q0K5J5J3J0o4r1
6554g1o0J29J55j48J19k72O7Q2J25k53J34r6J28J11k92L23l50J44J94l15J08r1
6576a29rN01j55N2k46R7j09j43j5R8J07q3Q3l9J09l27J02j13q0M01l36K96k3k6
6600A3J00j59o3J38M5l14L04k49L12k25J8L04l28j75L92O5k35P4l63K44l5J58
6622B1p3K49k50k2L19l96K79k73K77Oj21k7Op7J31R8j48l6R6l16K81j45J19J6
6646A4P7j44q1Oq9J71rj08N9J56k07O2j4N1j90K84Q3j57j06K90j99RJ2LL51m5
6672B79k13Q7k10Q4J34j13J35k63PQ7Q7j69j89L90j06K5k2J06R5k80J12k9j97
$$ y = [108, -376, -103, -134, -110, -5, -166, 152, -15, -195, 210, 44, 28, -119, 202, 24, -27, -61, -109, -153, 111, 48, 6, -205, -38, 137, 251, 32, 206, -164, -134, -34, 133, 49, -29, -256, 175, -43, -109, -16, -59, 21, 46, 61, 74, 84, 20, -71, -131, -2, 153, 5, 124, -148, -81, 1, 126, -127, 7, -89, 39, 150, -142, 181, -169, -25, 169, -146, -38, -129, -138, 363, 208, 260, 14, 111, 2, -141, -156, -58, 49, -34, 49, 10, 119, -208, -106, -219, -299, 102, -234, 62, 39, 13, 113, -46, -109, 29, 74, -240, 64, -185, 127, -98, -80, 224, -104, -279, 113, 178, -57, 17, -346, -102, -137, 21, -52, 197, -53, -75, 244, -152, 127, -146, 131, 137, 16, -11, -5, -82, 49, 147, -1, -37, 59, -257, 24, -121, -2, 14, 91, -53, -134, -128, -217, -46, -55, -163, -104, 52, -155, -93, -107, -56, -246, 38, 121, -36, -142, 148, -51, -42, -30, -27, 324, 279, 66, 153, -57, 27, 161, 48, 183, -80, -73, 14, 101, -68, -257, 133, 27, 52, 30, 136, 231, -49, 63, 34, -163]
6695a63L81k34k27L65j46j27J91p7K57m52J16J30K46k95K24k06o9J34N4O3K86
6716D51n14K58k24l6L29m12J0M47n69J45M81m20r0J84o9K25j8l69n4%L61p8J08
6739A46q5n9K33O2j45k69K76k21j11K72K1j82K74j42j49J7J40m2R3r9J98j27k36
6762a35K96n36L4N25j95k80K88k77K7L47j60R9K12k41q3K65j23n9k04mK89k3l41
6785b79L13k49K48k2j93K28j83J22J6l5K04m97O1L62%l21K27k20J27J85j06j48
6807a60O0r7J11NJ94k3k12j57K29J23J76k38k14K88k24R1K64m4m89L83q8o1J27
6830D4R6j21L8j70o2K84l39l4K19J65j88j35J20L66k88K2J95m44K08L7r8k9J71
6853E7l3j04J39R7k36pJ81k59K38j20K6p0J94j12m13M64k17K1K44n0k79N45j02
$$ y = [-163, 218, -16, -243, 122, -24, -151, 40, -37, 220, -232, -116, 14, 260, -35, 189, -17, -86, 48, 102, 165, 451, -63, 195, -29, -65, 264, -148, -138, 309, -260, -115, 366, -54, -144, 40, -29, 196, 178, -191, -245, -245, 116, 38, 146, 61, 2, 235, 297, 152, -117, 159, -62, -173, 99, 120, -62, 212, 70, -79, -62, 78, 36, 129, 30, 228, 101, -135, 161, -375, -341, 184, -11, -291, -3, -280, -253, 94, -66, 33, 245, 4, -79, 186, 63, 4, -200, -204, 85, 62, -279, 34, -215, 33, 11, -182, 46, -137, -15, 1, -34, 170, -327, -266, 96, 96, -225, 2, -218, -91, 94, -12, -160, -100, -197, -86, -81, 113, 90, -122, -279, -50, 73, 249, 11, -203, 85, -139, -48, 216, 172, -317, 66, -22, -83, 44, 140, 19, 57, -113, -175, 109, -230, -264, -45, 120, -68, -203, -83, 283, -5, 17, 212, -232, -24, 13, -85, -114, 57, 24, -80, 59, 156, -80, -87, 94, -165, 73, -47, -21, -91, 103, -9, -422, 42, -175, -154, 90, 40, -239, 306, 204]
6876B04k47n2rK65k8k53J34r1qM10j24J4J85n22m0O0Q7J92j21p3O3l26L12Rl3
6901HK6L0l65L41K79l54P1k2k18K97n8k19P6P4j03L85m57K18J23p3M29q36L81
6924C3j96J26j23K40r8J30N9j25j17J89k50M5N6K30o16L91R8j04J6o0R2L11k25
6947A02O6j72J40k80O9K22j71O5j22J72k01J24m4Q2k62K59J47o4j04l8j03nJ44
6970B6j16K32r3r9J35O9j07o7N4l02N23o14M40Rj08O1M0L4J79k73j34L82n24M14
6994A61j78N3r2R7L6l9P9m8o9r4L02j17k54K14J43l68J56j11J4J04j35K23l6J83
7018B24lp8k81M13j83J05k03q8K0j00O9P0K46k61J38J03j63OJ59k69J00J67p9
7041A12O7k95J02m4q8L18j02k27K35l9j65K8J48O1J33r0k89K12j79P2o1P4N4m7
$$ y = [204, -43, -95, -104, 161, 133, -120, 14, -77, -85, 325, 201, 215, 400, -122, -162, -102, -15, 177, 56, -17, 46, -280, 32, 41, 8, 34, 64, -301, 40, 319, -35, 36, 14, -204, 93, 35, -184, -108, -34, -137, 248, -209, 9, 132, 59, 488, -348, 33, -163, -37, -160, 80, -18, 112, 171, 46, -71, 118, -132, -87, -31, 199, -417, -26, 72, -32, -16, -76, 16, 327, 102, 168, -4, 136, -144, -75, 147, -24, 41, -81, 91, -110, 14, -30, 52, -210, 49, 196, 132, 28, -10, -113, -118, 26, -90, 142, 49, -50, 85, 154, 47, -20, 34, -268, 255, -359, 81, 90, -18, 43, 83, 117, 296, 23, -111, 271, -253, 161, -17, 36, -56, 41, 77, 38, 117, 69, 0, -94, 208, 91, -163, 51, 194, -174, -18, -129, -115, -11, -146, 77, 41, 224, 221, 143, -138, 275, 92, 197, -6, -94, -74, -174, -105, -35, 211, -50, 88, 191, 28, 34, 193, -76, 24, 191, 112, 179, -116, -14, -58, -146, 172, 70, -157, 78, 39, -126, -98, 50, 111, 244, 154, -135, 77, -102, -30, -91, -17, 37, -10]
7065a0j85L12P5j8j74MK2J64m06J81J63j76K73l00j97K35j3J10K1j39K10m39J93
7088i4J13O9L5N5j84K48n0n82L59J66k45K25o1o5j8p4J8M9j83K45k31J36O1R4
7112H6l2j52n1O1j05J80k02K95Mm3m4NP4R9k43L46j21l47K26j33K08m48M83j67
7136b1J33k05m4j29K39N2j20J49J16j47M2k9k3l3K09q9k55J21%J26q0J02k20J
7160a05R3N2L7j28K38q0j26J64j21M3J53j24M9n2k2J68j73l49J63K80k70K35k3
7183A02L7k46J08L19k74Lq9J81Q2R8k87j60J79j72K88m65K46k56K73o4P6p7j21
7206b19O7K80j13j6j88Q5N4j70M30k95l03O23m07J91R0l96K54J19P8l40L40j5
7228A49j73q5K08l07K35o0K56o5p2J36m76M55O6n65L24n9K09j27pl8j23N2j38
$$ y = [-10, -195, 117, 192, 174, 0, 4, 26, 190, -216, -35, 128, -48, 225, -75, -272, -37, -50, 60, 81, -58, 152, -287, -94, 19, 88, 123, 178, -6, 242, 192, -390, -31, 135, -110, 115, 54, -11, -29, -103, -85, -36, -219, 26, -205, -69, -8, 86, 54, -98, -149, -88, -193, -13, -215, 80, 84, 41, -3, 2, 76, 175, -68, 278, 157, -190, 36, -97, 111, -337, 146, -21, 112, -93, -137, -266, -27, 25, -95, 54, 170, 23, 65, 36, 13, -20, 189, 100, -155, -34, -34, 92, 12, 114, -106, -105, -12, 40, 77, -51, 187, 107, -19, 145, 24, 67, 220, 96, 145, 93, 71, 239, 66, -283, -120, 160, -110, 125, 102, 139, -107, 1, 320, 46, 49, -40, 141, 223, 321, 34, -126, 53, -119, 169, -296, -50, -306, -33, -97, -21, -98, -219, -152, 128, 15, -1, -189, -104, -50, -220, 210, -85, -388, 235, -172, 19, 109, -287, -33, 86, 164, -176, 164, 149, -24, -109, 99, -208, 27, -33, 223, 158, 86, 222, -254, 201, 267, -298, 26, -33, 176, 49, 42, 4, -119, -67, -205]
7251b05j2K64J21l96L16L4m37P3M37r3l05K23j30M2Q4l3p5K76j94M0q6J40r4j73
7275a83J73P9k26J74N5k23O1k00K65J12k30K27J50k45j18qK23R6k80J78l7l9N8
7298F2J33k15J22L4k62K26j04q1L94m70Q8N9J36J12l37k33N66J5l44N66n76K50
7320A41j72J48l56K17J21K1m0K1k5q3J29j56k48j03J76J55J59j7L5o0k8l7k46
7343b48L13k07L49q7JJ0O6k50Q2p9k6K82p0n8O1k8J78k41K48j60m01M86m6m22
7367b47K04k09K62J62m66L98j44j32J64J41l63J05K63l98J87J83jo6P5O9l04r4
7389b11N03l61J74j01k05Q9J45j76K69j59J16j17J18R6j9k05K5K42k00L6m2L6
7411E3J08K03k67K5k82r4K54J39j19j17J46pj2j74J03L4L0J90k47K1N8K5N7N9
$$ y = [-205, -217, 47, 168, -228, 88, 122, -315, -242, 195, 102, -203, 20, -110, -68, 16, -17, -92, 184, -10, 30, -56, 84, -10, -183, -10, 69, -157, 17, 72, -151, -90, -290, -25, 87, -143, 84, 234, -11, -129, -137, 86, 182, -98, 80, 43, 4, 62, 195, -20, 102, 136, -126, 100, -4, -85, 309, -161, -73, -14, 122, 234, -103, -336, 230, 245, -99, 467, -109, 141, -31, 117, -239, -22, 99, 120, 80, 101, 76, -7, 122, -34, -282, -385, -209, -54, 105, 88, 123, 63, 35, -2, -248, 65, -142, 207, 120, 121, 131, 197, -53, 29, -50, -76, 206, 136, 78, 139, 111, 289, 48, 296, 136, -265, 221, 175, -247, -43, -252, 10, 172, -294, 104, -40, -172, -8, 133, -230, -125, 138, -260, -73, 110, 109, 43, 118, 187, -117, -211, 292, -69, 105, 4, -201, -112, 33, -143, 126, -33, 83, -34, 84, 180, 161, -44, -19, 223, 23, 59, 17, 53, 161, 364, 97, 122, -160, -254, 0, 139, 20, -97, 49, 42, 30, -144, -41, -7, 23, 213, -34, -13, 45, 70, 127, 186]
7435A86mj33L4k23J95K16l70m8K32L0k06R5j38Q2j3K10j67j0j59L66l46K99j50
7458b2K0L4k44J23K30J33m02J59l00M32k45K40lm6j85J87k3j0k11n6L76l46p4
7481b33R5N1P3N7k0m12L61j34M4J12J29N9k55K08Rl48L45jj87j03L56k70K8JJ72
7506A37Jk3K70m99L0M4pq2K46j41k84N39j03j90k74K98k37L62k72j61M28j06M9
7529B5R5Q3j87q0j40K56j84J96j14p1M03Mo96O10k97p2J66L32k24P7k04L2J31
7552A41j30J36Q8m78M17j09QN1rj73K2J72l12L92k18j49K28k23L35J34k43m6m1
7575gQ2j25J39k15K04O0k30J22J6m6o6l7oK03j15N6J24k91K03j60N3j70M9m6L21
7600A18j20r4M64l50n0J39j80J23j37M3J71j62Q0k84K27J4k2K02n8l66j2J1M18
$$ y = [186, 182, 49, 83, -140, 55, 271, -99, -147, 85, 115, -91, 4, -134, -52, -65, 145, -22, -32, -191, 175, -171, 128, -22, -2, 32, -212, -89, 141, 274, -128, 31, -269, 163, -82, 158, 155, 109, -76, 111, 88, 78, -133, -189, 187, -159, -233, -138, -87, -14, 43, 23, -389, -28, -162, -118, -6, 123, 182, -73, 135, 144, -204, 141, 140, -47, -150, 206, -64, -36, -35, 137, 138, 115, 385, -114, -84, -40, -47, -129, 117, -24, -308, 231, 128, -62, -336, -38, -275, 87, -185, -346, 82, -24, 25, 120, 203, 16, -64, -204, 52, -132, 64, -50, -121, 282, 286, -410, 200, -97, -169, -3, 329, 105, 182, -22, 10, 141, 11, 147, 235, -243, 174, 65, 73, 124, 115, -58, -36, 136, -176, 216, -2, -151, 77, -146, 189, 323, 80, 34, -7, 75, -50, 89, -126, 78, 138, -92, 30, 46, 0, -66, -103, -109, 94, -21, 35, 159, -132, 71, -89, -36, -206, -157, -203, 118, -2, -96, 368, 18, -32, 107, -73, 50, -87, -44, 127, -35, 45, -239, -12, 2, -20, 182, 124, -242, -254, -243, 175]
7623A75k79K07l34K9J82Q3rR1k5J43k50o6Q0j31LL6j19J44k44K02L49j16j11Q3
7647A23j33M5J4K0j3l30K17j6q3J76j42N3j00L66k07R8j96o5K09K64k89j9j26
7670a34k29L55J02j09o3L17k51m2j17K63m16J66M80l28J4K45k08j80K50o1o8J23
7692A09k36J42K02m93J99J30J93l33N7J33N9m66L52qL9j0l6j7J01j62J11J59j29
7715I6j09n7L41j22k89k16L50k16L13J51K0m91N01m68K44r2p4M1J23J79l57L24
7737A92K2k83j87K17M3j22K69O3o04M17j2n7n7K26k11R1j31R4N4j97rJ82N6q7
7761c1m95N54K05j36l10O31l69J0Nk62K89J51l40K33l1j54R5J9NQ8l37K49J39
7784B08j76m1J43m74N84l20K83m0k7k29J41J05K97n82J32O2k90K98p1o4K06q6
$$ y = [175, -104, 103, -231, -202, -20, 63, 54, 145, 120, 263, 13, -53, 27, -104, -101, -65, -184, -40, -284, -82, 267, 151, 40, 123, -10, 35, 49, 69, 56, -274, -57, -73, -156, 20, -122, -69, -169, 197, -10, 88, -108, -173, 36, 300, 11, -8, -134, -363, -8, 94, -15, -78, 239, -12, -54, -171, 92, -324, -158, 322, -6, 8, 253, 45, -135, 115, 54, -14, 109, -127, 15, 217, -276, -77, 53, 246, -87, -30, 103, 162, -304, 48, 40, 79, 69, 33, 16, 117, -45, 66, 225, 96, -13, -70, 271, 149, -140, -356, -6, -222, 91, 242, 262, -229, 272, -196, 48, -44, -118, -77, 46, 225, -132, 192, 214, -69, -256, -39, 4, -118, 151, 214, -390, 27, 15, -42, -99, 127, -84, 7, -124, -30, 24, -173, -182, 0, 56, -31, -526, 28, 233, 97, -213, 418, 49, 59, 64, -198, 91, 242, -98, 135, 104, -50, 45, 64, 69, 157, -180, 69, 208, 32, -9, 134, -340, 244, -76, 207, 167, 140, -89, 52, 157, 454, -128, 4, 66, -224, 74, 3, -61, 145, 59]
7806E9k90K20pP4l40L02k18L98k15P4j5j22J10q9j68K49k54R3L30l34q8Q1Q4P8
7830A2j30K3r7L06j6l41P4K53m5P7k04k7J75N6j56j0J70Rl77J12j35K80n2J39
7854I6J42j55J09k32o2J49J7k45K7L8K55l91K46k06L91J43m71J86O9l75L96N3
7876A80k51J15M29k58m53J30R9l5Q9r1J77m0p4N1l57M54j04J60lj80Rn9J4J74
7900A76k47K03n3J10m82R4L54m86N08l61P4P7p4M6K54q7j28R5j57J3N6K2KK46
7924B55l54o4pL87p8k64K31n4n28O08J74k12J73n02K70L4J51j88k01J28J46j45
7946d0KJ41k34K40qk25l7M54l83P5R0j11J54p4o6J06j39J23LLk55J30R5k4j11
7971i1r6o6J73j01O3L6L9K58k76M7p6J16j57o9M08j68j77M6J76n0m3o4J56J3r0
$$ y = [59, -231, -11, -18, 56, -284, 18, -200, 198, -17, 57, 42, -80, 30, -59, -227, 22, -232, -139, 191, -143, -231, -150, -66, 12, -118, -95, -192, 114, 98, -243, -169, 84, 39, 116, -88, -115, 60, 116, -40, -50, 120, 129, -248, -136, -271, 9, -43, 96, 238, 83, 192, -40, -102, 47, 64, -181, -154, -116, 139, -252, -6, -212, 179, 322, -149, 37, 106, -269, 127, 180, -71, 44, 473, 215, -238, -108, -9, -44, 45, -46, 131, 91, 17, 68, -289, 165, 61, 221, 218, 38, 47, -12, 2, 176, -71, 132, 79, 189, -293, -199, 155, -331, 177, -184, -110, -33, -107, -61, 193, 106, -22, 73, -84, -71, -15, 7, 9, 255, -99, -163, -170, 217, 139, -125, 106, 52, -476, 132, 306, 94, 267, -235, 35, 69, 220, 32, -169, -41, 105, -40, -38, 103, -131, 109, 101, -124, -161, 293, -90, -15, 75, -36, 118, 44, -22, 84, -55, 68, 71, 74, -181, -51, 44, 20, -91, -187, -253, -80, -181, -118, -82, -43, 215, -61, -14, -90, 26, -131, -200, 208, 40, -137, -91, 85, 35, -8, -72, 84, 97, 7]
7996GR7M3p2N5R2k15k27K89j01K63l05K5O8Q4n5Q2k58P9N42m24l27M3J54m3Lj36
8022b37L13p7j7J91j55q8J37j60L12J14j31ql10j5q3L55k73QL6l8j26O0L28P7
8046B13n7O8l58J37K1k6P2K77m41J00qj49K81J41k58J81l7j67J63j14j54L15j54
8069D6n8J27j90K33Rk86J2M26m12L9K55j11j01p8J52k48J37j6K0J8K91j79o7j6
8093Co8K8J80k6j16P6q9R9k45J83L24k57o2L92m33j74j9J47L39m08K02Q8j14j4
8117C6J48Q0n43J23K19p5K63J7k65j90k1Q4L7J25K09k37n0K34k65K62p8p9J58
8140A92p4j13l35M63RQ1l00n7K02k62L36j76No7J77k67J68pj18K71k2j25m8L0
8164c7q1J1J51Pj45R4r6q3L36j42j85K80l41J59L9N4j0m5J82j72p0QK4J99m24
$$ y = [7, 104, 147, 75, 130, 222, 7, -220, 69, -32, 231, -74, -49, 19, 103, 48, 130, -128, -49, 493, 69, -258, -215, -61, -104, -101, -237, 76, -1, -18, 173, 18, -70, 67, -93, 219, 333, 202, 194, -116, -131, -214, 141, -132, -124, -88, -126, -252, -192, 136, 213, 156, 224, -134, 3, 24, -2, 70, 347, -94, 6, -2, -151, 130, 271, 13, 194, 157, -10, 153, 39, -115, 200, 46, -12, 115, -75, 158, 167, -119, -107, 319, -93, -54, 201, 90, -11, -89, 63, -185, -48, -64, -44, -26, 265, 86, 19, 3, -65, -37, 143, 117, 1, 77, -12, 87, -158, 25, 349, 92, 30, 422, -11, -185, -204, -57, 282, -126, 76, 164, 50, 36, 184, 264, -279, -156, 63, -12, 251, 268, 3, -187, -208, -124, -87, 38, 247, 10, -40, 194, -71, 191, 113, 34, 192, 118, 5, -330, 133, 142, 223, -77, -134, 68, -194, 142, -34, -29, -96, 81, -186, -18, -25, -143, 128, 106, -19, -67, -37, -118, -107, 44, 51, -94, 0, -96, -179, 157, 15, -170, 110, -231, -72, -33, 21, 11, -34, 148, -24, -94, -86, -62, 137, -287]
8189b87L26j39
$$ y = [-287, 39, -100]
8191a00
$$ Imaginary data points
##PAGE= N=2
##DATA TABLE= (X++(I..I)), XYDATA
0@%%%%%%%qJ6j6J6k4L5m4N7p2Q9j14J39j64J99k40K87l41M00m67N46o35P33q42
30d50R66j105J258j427J614j821K047k295K570k872L202l561L952m380M851n365
46b816N924o533P200p935Q742r630J0609j1697J2917j4284J5829j7592J9626k2006
60a1646K4828k8243L2475l7879M5058n5105P0263r6029J51067m69214N53085O05202
72G83862j163555Q2407N65257k93510j46841N20242l24164m19177M35921K82995
82C23437l93624j1853Q7688j68458J84862K93489l71509k54491L23472K20259
92B33272j73005j85587J0450J90167m42j32660J08854J2791k86191J74431L96009
103C48089l67301l74600N33803J70427n88677J69148M86257n10657k13826O78588
$$ y = [0, 0, 0, 0, 0, 0, 0, 0, -8, 8, -8, 8, -16, 19, -25, 32, -40, 49, -65, 74, -90, 109, -131, 156, -185, 215, -252, 294, -341, 392, -450, 516, -589, 669, -758, 856, -965, 1082, -1213, 1357, -1515, 1687, -1874, 2078, -2302, 2549, -2816, 3108, -3425, 3775, -4160, 4582, -5048, 5561, -6136, 6781, -7503, 8326, -9266, 10360, -11646, 13182, -15061, 17414, -20465, 24593, -30512, 39751, -56278, 94789, -374425, 178660, 783862, -379693, -297286, 267971, -25539, -172380, 347862, 23698, -395479, 40442, 323437, -70187, -82040, 5648, -162810, 22052, 315541, -55968, -310459, 13013, 233272, 60267, -125320, -114870, 75297, 74855, -57805, 51049, 63840, -222351, -47920, 348089, -19212, -393812, 139991, 310418, -278259, -109111, 377146, -133511, -347337, 331251]
113C31251j22193n88229L72446K76702m45416R1116L31623l72812r5220M74330
123B53598j68706l64458L87400J06461m76591J89747M21496l87430k78964M06006
133H8559J38236k98410o9519J59295M9148p7954k9704P5157j6520j11552R4181
144I17J50884j73270j38430K28998M5916k15862J05961R8189k44259R6782K67198
155B23024k89031j46733L76156o5988l15806K76743J39160l99884R1125L96818
165B85584k98113k61117M13944M1189l97667J70143K60605k82011p7138K60752
175A16171o6488j47141J26056K0030j16367O5866P4164r5993k7274P3971j0563
186A2432k8310K9419n030l5613n768O0125N7901j18898r7775J98259Q0023k43552
$$ y = [331251, 209058, -379171, -6725, 269977, -175439, -84323, 247300, -125512, -220732, 253598, 84892, -279566, 107834, 214295, -262296, -72549, 348947, -38483, -317447, 88559, 226795, -71615, -141134, 18161, 67309, -10645, -40349, 34808, 18288, -93264, 917, 151801, -21469, -159899, 69099, 115015, -100847, 5114, 103303, -140956, -44174, 223024, -66007, -212740, 163416, 97428, -218378, 58365, 197525, -202359, -111234, 285584, -12529, -273646, 140298, 181487, -216180, -46037, 214568, -67443, -144581, 116171, 49683, -97458, 28598, 48628, -67739, -1873, 72291, -23702, -50976, 22995, 12432, -15878, 13541, 8511, -27102, -32870, 27255, 85156, -33742, -131517, 66742, 146765, -96787]
198i6787K490K13328j15123j14206K03864k3022k42627J50292K08393k30805j00453
209a44656K33317m4342j43438J70660P60k15049J32088J70222j96579p2805J80595
220G0773l6690j15056J22944K8090j74130N1942J73913j01546j27408J07933O5284
231F6049p5156j9301M4397k421m0393K1016N7141n0798o6016Q0448M6059r2520
243c1495o388P9306l9587m6984Q1627k519j06008O6989R0435j28905k2965J51893
255H5399p1020j15216J44437L8823j65636M2506J39499j00413q5077J32124J5177
266F0603j32655N4132R4465j01861l1154J03999l0817o7484O1727K1504o1884
277b9425J1595N4446k9763m5038M8033K9825o2026k059O1450k8718m7775M7466
$$ y = [-96787, -94297, 119031, 3908, -110298, 93566, 70544, -172083, -21791, 186602, -44203, -144656, 88661, 44319, -99119, 71541, 72301, -142748, -10660, 159562, -37017, -109822, 70773, 34083, -80973, 41971, 70061, -104069, -52127, 121786, 20240, -107168, 765, 66049, -9107, -28408, 15989, 13568, -26825, -5809, 51332, 534, -65482, 14966, 61025, -31495, -37883, 41423, 1836, -45148, 36479, 33960, -72048, -5059, 85376, -43529, -66494, 85399, 14379, -100837, 43600, 82423, -83213, -40707, 98792, -1621, -86698, 45426, 60603, -72052, -17920, 76545, -25316, -56470, 47529, 16712, -50772, 10955, 32459, -29425, -17830, 36616, 6853, -38185, 9848, 39673, -22353, -24412, 37038, 8320, -39455, 8011]
289H011L1703o2362k0041P7876j741q8682L9657P4469p6594k8003R1306k7688
301A7911p2612O8754L7916q5029j465Q2673l5536o2474O9371J6452q4417M0810
313g646O4945q4139k0182R1498k3339o9573M9753L9206o1692r108O8659k2838
325A5544o2965N3401L9095o6192o446N6268j7451l6397K6944K0838l4127j0288
337b1776M3479p557m7651L1999L3631m9552m509M9248k1700l5686M1612J8568
349C0106n4628K994O2671l2907n3946O1927K0748p3412K1715N6470n3913k4865
361c7040O3577n222n7791K8784M3119m5120j7401N4271j6165m3200M3741J7754
373B9307n1851P687L9960k1426k5011K5618J3185l2637j000L9717j5961l8554
$$ y = [8011, 39714, -22648, -42689, 35187, 33446, -55236, -15579, 58890, -17704, -45707, 45599, 17911, -54701, 14053, 51969, -33060, -34525, 48148, 12612, -49862, 19509, 35961, -48456, -7646, 57299, -26840, -47022, 44476, 21137, -48436, 1317, 40523, -21169, -30277, 38382, 15544, -47421, 5980, 45075, -21117, -27563, 28705, 11254, -25143, 1801, 22639, -11488, -21776, 21703, 14146, -33505, -1506, 32125, -17427, -21936, 27312, 5612, -30074, 11538, 30106, -24522, -21528, 41143, 8236, -45710, 16217, 36965, -36447, -14732, 41738, -12175, -37040, 26537, 21315, -36476, -7692, 35427, -9693, -27094, 27177, 11012, -32188, 11553, 29307, -22544, -14857, 25103, 3677, -21334, 4284, 17469, -15168, -16168, 23549, 7588, -30966]
385c0966L2217K4753l6302o907L3935r649k8909K7381K3370m6568p589N6492j9172
398A2086m4160M2210J1985n1157K2592M3300m6994k6408N5191N915m9909J8543
410f806L0837m1079J220N0852l1338m0187M4741J9833l7776j594K2283j1822j1910
423a2746K3078O612l5036k921L8529j476l0521K874J8120n606m573J6172r006
436C500l0686K9422L5336m6803j9613M9438j0739l3241L8155O750n4917J6394
448a7004N5599l2675m1089M1338J0123l7279K9093J8119n5494R192N7086k7602
460I407l6334L0140J0105k2487Q281J6489j9540j4643K1792J1990j5079r468K102
473g245P534P277m517l848o999n459K8984P259m6634P111M4250k7545j9803M1224
$$ y = [-30966, 1251, 26004, -10298, -17205, 16730, 7081, -21828, 5553, 28923, -17645, -25234, 31258, 12086, -32074, 10136, 22121, -29036, -6444, 36856, -10138, -36546, 18645, 24560, -25349, -6806, 24031, -17048, -15828, 35024, 3686, -36501, 8240, 28073, -9703, -11297, 10986, -836, -12746, 10332, 16944, -18092, -21013, 17516, 16040, -14481, -11607, 6513, 907, -3666, 12506, 3500, -27186, 2236, 37572, -9231, -28844, 20594, 9855, -23386, 14769, 21519, -33398, -17004, 38595, 5920, -35169, 6169, 16292, -20987, 8106, 26225, -29269, -20077, 37009, 9407, -26927, 3213, 13318, -9169, -888, 15601, -3939, -18582, 3210, 15200, 121, -9347, -7245, 289, 7566, 3049, -799, -7798, -13257, 15727, 22986, -23648, -16537, 27713, 168, -19635, 21589]
487B1589j1398m5160L5186L9269m8758k2217M5929p482k3582L7339j4199m9869
499d3353N0297L7082o1428r300M6860j4906j9932K9599k390l4687J2755L1206
511B1803j4070j7476M288k928J1931J5348k3957j3995J7016P948P324q629k9767
524b5164K0277L2561k9998j3450L1114j4286k4648L8225J4145n2384O95M6703
536B3790k0100j7518L1755k7455k4597O4562J64p1866K6554M9099l8998j2250
548a6860L6925j7770k8199L4270J6397l3455k352J4651j0671J4621J2375l8127
560a8195l550L7742m227j5738o7r116J3700J8798k1513j0656J9031o737p480K6057
574A8049o441m0674K0927L9431l2239j7096L0009k0394r015N0488k3858n4625
$$ y = [21589, 10191, -34969, 217, 39486, -9272, -31489, 14440, 6958, -16624, 20715, 6516, -43353, 6944, 44026, -17402, -26702, 20158, 5252, -14680, 14919, 12529, -22158, -9403, 21803, 7733, -9743, -5455, -8383, 3548, 18896, -5061, -19056, -2040, 5908, 13232, 4603, -25164, -4887, 27674, -2324, -15774, 15340, 1054, -23594, 14631, 28776, -23608, -22913, 23790, 3690, -13828, 17927, -9528, -34125, 30437, 30601, -41265, -14711, 34388, -4610, -16860, 20065, 2295, -25904, 8366, 24763, -8692, -11044, 3607, -7064, 7557, 19932, -18195, -21745, 15997, 11770, -3968, -4035, -13151, 549, 19347, -2166, -12822, 6209, -528, -8008, 18049, 11608, -29066, -8139, 31292, -947, -18043, 11966, -8428, -17443, 33045, 9187, -45438]
586d5438M7365L3912m9395j483L2914k5125q620M0056j2851l8459K7695J8017
598A8588k8576J2472J2112l6466J1319L8594k5960k3520K1093M746k422M639j3921
611g302k741J9450l560j3455J2736J9k0118J8019J8318l2675k167K9958k0148
624c666p800L1696k3546k4065M3570K414m2608J9945K5392l4091L75L7016k4831
637a99k5338L9666K178l6618K3710J4765l7076J3069K9974k9618j1889K6830n364
650D090j1888J2572m197j1439J4306M680j4279N791N499j2996R839J1403k1618
663h237J278J8203j5192N83J6996k2452o218L2996j0682k9122K4401J2729k9959
676a4676R160K6197k8735j0956L8543j0769l0010K8946O466l1800J8968J8014
$$ y = [-45438, 1927, 35839, -13556, -15039, 17875, -7250, -15870, 24186, 11335, -27124, 571, 18588, -9988, 2484, 14596, -21870, -10551, 28043, 2083, -21437, -344, 4402, 1980, 6619, -7302, -10043, 9407, 5847, -7608, 5128, 5147, -14971, 3048, 21366, -11309, -13476, 16482, -3666, -11466, 20230, -3316, -27381, 16189, 18603, -24005, -4060, 21332, -12759, -12384, 24632, -199, -25537, 14129, 16307, -20311, 3399, 18164, -18912, -5843, 24131, -5487, -17376, 9454, 4090, -7798, 4774, 577, -10862, 3444, 8124, -6155, -364, 5135, -7861, 1978, 13381, -8237, -6959, 11244, -3948, -3365, 13631, -8821, -15039, 17957, 7275, -21847, 2554, 15283, -14676, -5516, 20681, -8054, -19010, 19533, 8764, -21246, 7700, 14166, -17634, 1334, 19348]
688A9348l1627O04K7577j4502j4541J9029r62j6702J3238Q536j7967K788J2938
701G757j0418P91Q199j1342L118R525j1664K580R860j4751J087J6815j2251j1430
715a2124J8699J8j9283J3082J3070k5257J813K8674j9650j6515L0023n097k4024
728a6571K3465P107k8592J0007K1047j9019r906K0793l275j6978J4551O928j9950
741a0393N488J5674j3600l018J0635o234P5O041o776O74N067n353J866L788p279
756c345J89R081m503r574J0299M593j5618O839J3633j9671j198K4326j4794j4831
770a4574K3560k38k0358J2175J0829j8134K43J8029r756j4235J7131M385j9399
783a0342Q740J0672j5811J793J3067r889m219R601j782l665J669R16M08p96n81
$$ y = [19348, -12279, -11675, 15902, 1400, -13141, 5888, 4926, -11776, 1462, 9998, -7969, -5181, 7757, -2661, -1870, 6329, -5013, -1895, 7630, -4034, -1454, 8406, -6345, -5258, 11557, -694, -12124, 6575, 6593, -12690, 392, 13462, -11795, -9982, 18692, -958, -17473, 12550, 7453, -16571, 6894, 14001, -14591, -4584, 16463, -2556, -12462, 8331, 5056, -11922, 2629, 9557, -10393, -4905, 10769, -2831, -5849, 4786, -1448, -1373, 4668, -2108, -1434, 3633, -1720, 146, 3934, -3345, -3156, 5925, 1422, -8152, 2147, 6740, -8878, -2039, 11594, -8077, -9275, 15051, 257, -14574, 8986, 8748, -11610, 565, 11394, -6740, -6497, 11532, 1776, -12459, 4672, 9057, -10342, -1602, 9070, -6741, -4948, 8119, -1770, -5989, 3612, 1830, -1835, -166, 750, 1158, 362, -219]
798b19J101j03j598n10L621r50p155O521N923j3461L436J2522j3432l095J6844
813I445q353j1233J5093K831j5080M820J1758j0786o242J5660m331j4585J4132
826C129N464j7624N714J1689j2056j890J0951m402o516O283L674n685j254N539
840C016j495l429L181j68k025J112j218K660n6o425M704M579q500K040O927p928
856c025r30J0135m640q388Q362N356j0876N82J1743r462p515J6297k297j6059
870a0717J0595Q391j3059J094Q990p330l989R912M23r763L424P322n864j614N853
885C668m620k021O548j373m116J244K08J839m85l523K719P45l537L444L072o732
901b920k696R489J616j0799K218R709q302k781J2124o902r245J2513J489j1255
$$ y = [-219, 882, 779, -819, -1329, 2292, 1342, -5813, 708, 6631, -6830, -3394, 9128, -4304, -7399, 9445, 1092, -10141, 4952, 7783, -7297, -2477, 9281, -1505, -7747, 7913, 3582, -11003, 3129, 8593, -9031, -3317, 8372, -3684, -5574, 5377, 975, -5541, 742, 4416, -1269, -2523, 3016, 1521, -1908, 1273, 1105, -920, 192, -1026, 1634, 1578, -4847, -143, 4436, -4064, -2024, 4903, -3025, -3955, 6180, 1540, -6848, 1514, 6870, -4006, -3424, 8319, -1143, -8658, 7639, 5342, -10717, -122, 8269, -4790, -3696, 5294, -2036, -6025, 3887, 4310, -5453, -2029, 5293, -571, -2185, 3668, -952, -2973, 3575, 2202, -1914, -670, -462, 1377, 892, -2631, 88, 833, -2704, 740, 3812, -2920, -5616, 3873, 5489, -5310, -3092, 6617, -1685, -4466, 7658, 756, -8489, 4024, 5513, -5742]
915e742N285M690r025J680J0624p333r600J1576N217j1916K481P189q220R11Q765
930F582o567m713N631J293j620n18r77n0M66J147P58k058k741J130O006j06r628
947e965L011R151o554j973O707p084r20J0640n609p913R213O27r593O297Q600
962H635j2917o366J7868O59j7090O627Q490q590K506M994q632J495P311m811k293
977b114M778k272m343M737M697p003l882O025J223p88j191n159M826O245p765
992a986m35O047o283J101Q388p139n553R393k05q077N618N444j2260q87J6139
1007I305n528j4686J1129N423r790N903J186j0531Q577P234j1761j276J0578m025
1021A738p856Q594M797j1906r57J0388k130m697O16k456N244M523j0871N50R850
$$ y = [-5742, -457, 4233, -4792, -3112, 7512, 179, -9421, 2155, 7372, -4544, -2063, 5126, -3094, -2183, 6582, 15, -4698, 933, 2226, 606, 88, -889, -939, -473, 674, 1432, -626, -3367, -2237, 3769, 3663, -5965, -2954, 6197, -357, -2330, 4377, -2707, -3627, 7013, 1404, -6509, 2704, 3331, -6262, 35, 8635, -4282, -10648, 7220, 7879, -9211, -2584, 5906, -2684, -178, 4816, -3816, -2321, 4990, 179, -2114, 2664, 392, -3951, 786, 5483, -1520, -5402, 623, 1846, 1058, -133, -5292, -466, 5779, -1986, -2421, 3626, -2657, -1556, 6832, -307, -5860, 3533, 3328, -4749, 869, 6313, -5947, -6834, 9305, 3777, -10909, 220, 5643, -4147, 1756, 2942, -7589, 988, 8222, -3539, -4815, 5763, 1738, -6118, 2476, 7273, -4633, -5590, 4798, 2668, -2029, -1413, -3869, 1375, 5898, -4973, -4423, 5427]
1036E427o043k493P406l839m523N966J163n207K782J948p557L817R932j1510o379
1051i110J5396k597j1657J1185K96j2132R952P215j4026M08J1645n381o689Q854
1065C359P74r683M602O900p763j10L881n965M285O212j1410p94J1517m642n396
1080d233N376o2k729L357k62l014K794O69n906N149O413j3277j089J6200p205
1095B181j1871J2969Q92j1104Q354M436j1034K324Q740p000k932Q869m089o938
1109f203J0778J176j2873O450P347j0992K305Q208r447j495R190l385m891M447
1123F15J8k228L510p70m960N267K699q240L516P258j0540p00J2188p261p087R947
1139C232q85p148O910J39p410N246N052r092N40J0298p692o568J3751j431j3767
$$ y = [5427, -616, -3109, 4297, 458, -4065, 1901, 3064, -2143, 639, 2587, -4970, -1153, 8779, -2731, -9110, 6286, 3689, -7968, 3217, 3513, -8619, 1333, 8548, -5478, -5070, 6575, 1194, -5495, 3359, 4133, -5550, -948, 5952, -1811, -1921, 1960, -4005, 280, 6492, -4918, -5712, 5805, 1163, -4233, 1143, 1081, -1648, 1709, 1447, -1567, 1227, 1896, -4010, 1139, 7552, -5725, -6814, 9386, 2181, -9690, 3279, 4171, -6933, 1421, 5857, -5177, -2853, 5887, -1113, -4045, 4824, 735, -6203, 4575, 5751, -7122, -672, 6675, -4317, -2012, 6196, -3251, -4746, 4444, 1059, -3832, 615, 633, -1595, 1915, 1145, -3815, 1452, 4151, -4089, -573, 6685, -3855, -4555, 7633, 372, -6715, 3232, 2347, -4801, 2109, 2248, -5162, 84, 5136, -3956, -3416, 6882, -810, -7378, 6373, 4942, -8825]
1154h825R487O850j1742J786P419o961m16N591m309j992N538k492m215O645M64
1169B828p959M982N995q544J72P737o485j195O496m990k045O861m264l447P470
1184C612k172p194O784L966r673J132R924o954n807J1307j996r534Q974J936q854
1199d549M818L971p631K558N206o458j352P251k740o780P175K810q931L054O498
1214D900p271J41N715m833K35M474n296R51N129n068k514O816j720n928M363M070
1230D164o801m07P183m955l007P781l924m326Q291k617o529Q172M89q293M775
1245dM894p108j360P456k417o381N966K315p126K819M227o291K127M240n837J361
1261a119N117n628m10N613k948l138L769R25m002J158K746l429j36L925l750n92
$$ y = [-8825, 662, 7512, -4230, -2444, 4975, -1986, -2402, 3189, -1120, -3112, 2426, -66, -4281, 2364, 2828, -5131, -149, 5846, -2698, -2526, 5211, -1274, -2469, 4027, -963, -3008, 3853, -411, -3858, 3612, 1440, -5754, 1030, 4996, -4677, -3545, 6379, -575, -6382, 4925, 2929, -6605, 2369, 4305, -4549, 269, 4240, -3391, -833, 4373, -2085, -3437, 3814, 1074, -5706, 1469, 4279, -4652, -1598, 4900, -2371, -2230, 3485, -1348, -1113, 3361, -1935, -984, 4145, -923, -3437, 3379, 1659, -4269, 94, 4164, -2637, -3044, 4139, -816, -3823, 3958, 34, -4292, 3999, 1382, -5147, 3025, 3514, -4779, -4, 4890, -2218, -3578, 3878, 1461, -4920, 1046, 3361, -3765, -946, 3281, -3010, -883, 3357, -2480, -1119, 3998, -1630, -2040, 3573, 625, -2513, 1256, 2181, -1821, -663, 2083, -1346, -1482, 2443, -1307, -1899]
1277a899N035m715j734P273l919m741P638l66o531M035L389m913o94N103k435
1292E26l442M605On631N156J198o784L991M187o880J304N178m323j572M528o06
1308A441l196J615J810k385M2K096k238L37K602l382m99L932l280j293N160k978
1324b16k796M470m47k987K386J374l383R05L170k619j893M213j187m089N248J31
1340B280o621M481L189o040P68M471l031j208L228o79k683K310J526l061J026
1355d4K453l573j2L822l458r55L546j583j993K996j456j200K140m40j496J438
1371A85O19j973Q99K437k938r13M055j685k778M007q68m097M153J154m619J335
1387a027L021k998l44K849j635k218L389J206m233J757K851l830J02L702l398
$$ y = [-1899, 3136, -1579, -3313, 3960, 41, -4700, 2938, 2572, -3959, 76, 3465, -1448, -2142, 2961, 526, -2916, 1689, 1695, -3936, 1220, 2418, -4366, -375, 3812, -3068, -1764, 3414, -909, -2481, 2047, 1441, -1755, -140, 1670, -715, -673, 1423, -815, -478, 2124, -1258, -1757, 2175, -1105, -2398, 2762, -216, -3012, 1458, 1011, -1976, 410, 1784, -1599, -694, 2476, -143, -2036, 2177, 990, -3099, 2149, 2280, -4341, 140, 3329, -2711, -1943, 2528, -503, -1711, 1517, 838, -1845, 465, 1991, -1070, -44, 2409, -1164, -1176, 2646, -812, -1767, 1779, 196, -1797, 1199, -257, -1457, 683, 243, -1253, 185, 804, -1169, -270, 2167, -771, -1684, 2371, 686, -2092, 1915, 1047, -3050, 1103, 2257, -2362, -1027, 1994, -1004, -1348, 1501, -134, -2352, 1037, 2243, -1990, -233, 2618, -1212, -1110, 2592, -806]
1402h06j037L589j584j132J540p36q74J496K94j921N11J473j131nJ768k038n26
1419a119L486k340j903L999j602k874L844r0l502J764J816j961l06J731j491j036
1435a584L152n1m501L276K815m939J189L400l406k55K751j995j126K069o69j333
1451a207J380Q35k419j2L160j635j695K294o79o99K548k435j111L852j734k449
1467b006L417m7k863J131J651j488n94J092p60n81K743j426l575M458J318n224
1483b754K172L395m015K8L332k129r33J933o90j363J762J30k760R45L047l159
1499a059o87L118j487j197K824k031r28L384j355k118K955n04k076J191J516j688
1515a42p88J523o19p10K329j950k506M767p8n178L101K650m261J136K705k456
$$ y = [-806, -1843, 1746, 162, -970, 570, -166, -1040, 456, 750, -1171, -660, 813, -318, -323, 1445, -593, -1119, 2367, 27, -1876, 2123, 521, -2353, 1491, 1401, -2101, -337, 1479, -482, -788, 943, -548, -1584, 1568, 1517, -2984, 292, 3107, -1832, -643, 2757, -649, -904, 1847, -148, -1274, 795, 126, -1207, 173, 1008, -1411, -1423, 1737, 102, -1593, 701, 22, -677, 1871, -564, -1675, 2177, 443, -2006, 1411, 1364, -1499, -368, 1283, -205, -799, 293, -467, -1048, 1695, 269, -3306, 1152, 2470, -2754, -582, 2813, -1202, -1174, 2158, 29, -904, 1029, 339, -1024, 738, 868, -1892, -947, 2100, -1059, -1746, 1372, -115, -1312, 1512, -519, -1447, 1937, 582, -1536, 1419, 915, -1161, 30, 1546, -142, -930, 593, -26, -736, 1593, -357, -2863, 1904, 1826, -3352, -251, 2399, -1862, -726, 1979, -477]
1531d77n82K449j250j207J936j36k784K007K736m645j50M499k694j552K994j280
1547a36j381K850r24j441J966j86k176J760J118k081k07K329j366j455K619j176
1563A13k571L589l6m005L213J456l615J691J960k970M42K698k081j284K909m18
1579A091l078K339K456n080Q86M262l565j232L432k040j043K837j362j481K608
1594A030j49k535J923J996l391l63L452j532k193K998p30k053K837j185k283L213
1610A035kl052K015J730l381N40L400k242k058L092N36l751K952J247m030J810
1626a59K765m394N77L402l212q35L530j523k547L243P72l497J347K647l239k34
1642a357L701k102k220L518j363j433K583j143k289L412j95l333K615J173k894
$$ y = [-477, -1059, 1390, 140, -1067, 869, 733, -2051, -44, 2692, -1953, -2103, 2396, -298, -1850, 1144, -136, -1517, 1333, 409, -1032, 934, 748, -1428, 332, 1450, -631, -838, 1491, 125, -1330, 1289, 113, -2458, 1131, 1095, -2910, 303, 1759, -1856, -165, 1795, -1175, -733, 1965, -116, -1400, 1509, 1091, -1987, 352, 2808, -2272, -1386, 2876, -689, -1921, 1511, -529, -1572, 1265, -97, -1578, 1030, 881, -1654, 269, 2265, -1126, -1489, 1963, 431, -1762, 1236, 506, -1547, 1290, 105, -2178, 1035, 1033, -2019, -4, 1726, -1655, -1115, 2285, 43, -2015, 1077, 1613, -2138, 814, 2061, -1969, -159, 2606, -1788, -1211, 2191, -1021, -1856, 1674, 151, -2396, 847, 1619, -1878, -531, 2116, -1123, -1357, 2344, 242, -1978, 1540, 177, -1256, 1327, 184, -2105, 1307, 1112, -2221, 394, 1567, -1327]
1657a327j37L203j512k114L062j01k890K694P97l881L238J050m520K194K800l572
1673a016r29L889j621k916L065J018l219J275K327l000L17K585k654l29L057j934
1689h5j538L570j377k567K669O72l116J230J732j796n66K235j253j252K462p01
1705C19j702K762k55l181K827J376m036J852K419l613k50K938j346j610K100J27
1721G27k520J681J738l115P60L024l247q85M152k385j739L535r86k438K370N94
1737A266k097M87J111j177m69J925j409j298L006j437j674L084j61l344K828J210
1753A851l211J461J402k071J29J667j164r51J743n04j794K057O70l602J706K606
1769A995l017k27L646k426j795L116p95j319J477J73j637R46Q34j833K18J887
$$ y = [-1327, -1464, 1739, 227, -1887, 1175, 1074, -1816, 878, 1675, -2206, 1032, 2082, -2438, -244, 2556, -1016, -1945, 1944, 323, -2593, 472, 1490, -1729, -454, 1873, -1127, -810, 1775, -879, -1208, 1849, -85, -1623, 1947, 570, -1997, 672, 1344, -1772, -542, 1190, -606, -1172, 1063, -190, -1442, 1020, 319, -1383, 1379, 1124, -2057, 770, 2146, -1890, -38, 2381, -1232, -1482, 1456, 110, -1500, 600, 727, -1793, -112, 1626, -1489, -729, 2295, -952, -1837, 2315, -70, -1809, 1726, 740, -1698, 672, 1266, -831, -344, 767, -410, -879, 1046, -363, -1661, 1345, -92, -1766, 1318, 1157, -2187, 641, 1851, -1360, 101, 1503, -568, -439, 1228, 64, -887, 856, 352, -1442, 615, 1285, -2317, -611, 1995, -1022, -1249, 2397, -29, -1824, 1292, 497, -822, 655, 828, -809, 137, 971, -862, -644, 1243]
1785A243j600j364K949q25k425K813K23k635K000O16k226J395O38j428M55J440
1801A269j618m34K146r82k040K008J153l191J156K028k559J00K466k358j26J958
1817I76p75j293K030n1j859R61J364j742m90K030j285j427K747p67k120K244J99
1834G42j970J545L74j730J220N87j647M97J603j212r53J760p9k192J662R43k115
1851i65P21J552k032N42J092j887M07J772j470r71K081l70j516R47J533k123k77
1868i64K609j482j249K032j053j171K192m86j735J583K2j168N97J140j378k6J589
1885A052q09j170J317M87j645J224M51j807R28R97j918P43J069k008K86J672p67
1902A02j112R29N59j154L54J289j517r8J761j687l28K405j430j005J997o79j445
$$ y = [1243, -357, -1721, 1228, 403, -2022, 791, 1014, -1621, 379, 995, -1231, 164, 802, -626, -171, 1269, -349, -783, 1363, 381, -1659, 349, 1502, -1689, -533, 1495, -1064, -964, 1502, -856, -982, 976, 201, -1092, 938, 887, -972, -11, 1353, -389, -879, 1151, -134, -1561, 1186, 419, -1701, 543, 742, -1228, 317, 691, -1039, 181, 768, -879, -382, 1221, 9, -944, 816, 737, -1455, 207, 1150, -965, -244, 1308, -724, -182, 910, -977, -570, 1202, -268, -1239, 842, 472, -1044, -97, 1436, -687, -964, 1645, 163, -1086, 946, -107, -1278, 914, 428, -1307, 276, 298, -870, -273, 867, -511, -537, 1052, 243, -927, 390, 877, -768, 456, 907, -900, 28, 1025, -893, -150, 919, -1089, -803, 869, 102, -1010, -81, 478, -676, -322, 967, -550, -648, 1113, -574, -902, 1503, 73, -932, 1065, 386, -1059]
1919a059R88P79r25k25J075q29m60J266l99j411J611N32j915J137J122k043Q53
1936I7N54j393J028L95j487K40J187r62p69J022P26j423L39J051j043K97J161
1953A020j921K66K130j765m54J876o96j384J168N03j185p2R25n21o37J217k92
1970A78j485K089n3k002J465Q99j796P19P53j193M69L15o86J41Q12o68p99R21
1988G9P05j309j24J397j036j23J375j338j30J670j581r0J624r69q64J295K16j130
2006c33j56J049p36o49J502p43j245K121p9k145J760L66j462Q10M10q16J71P41
2024E66m95m91Q99L4j217Q17Q03j456j48J447j411K87N95p97N51R17j716L23J424
2043I32p04r56J113P46j361k54J269p72m86J273r90r09J791m21j513J732Q1j582
$$ y = [-1059, -71, 708, -217, -442, 633, -196, -656, 610, 211, -1200, 411, 943, -972, 165, 1287, -756, 97, 651, -742, 286, 681, -806, -566, 621, -341, -1110, -88, 638, -785, -446, 605, -438, -141, 1020, -901, -635, 1495, -270, -724, 1152, 456, -928, 240, 743, -442, -514, 411, -110, -747, 470, 178, -1307, 782, 729, -1273, 192, 1091, -705, 14, 767, -426, 43, 358, -328, -187, 625, -43, -842, 79, 784, -525, -649, 748, -288, -411, 964, -374, -504, 1166, -415, -505, 1119, 150, -714, 581, 797, -333, -489, 560, -176, -825, 677, -66, -1311, 810, 731, -1414, 346, 712, -750, 60, 470, -346, -175, 566, 71, -420, 479, 513, -704, 113, 916, -540, -688, 759, -652, -365, 230, -567, -16, 901, -815, -492, 932, 228, -728, 385, 1131, -230, -484, 785, 13, -473, 800, -190, -1099, 692, 271, -1242, 490, 571, -1011]
2061a011R64J070j397j86J199l21q22O72L97j148P11N81j405L91J204j408L08
2078b01Q49j179K66J089j132k81J030k01p72Q88L93j073pP79n59m08J440r96m50
2097e25J580j079j293J909j73j655J471O75j292k02J157n4q11P47j87n82Q43P3
2115F02j376J337K56j926Q97J088j497k56J305m73l01O25J21q39M58M97o92K52
2133G8Q61j249j63J531j623j59J814j278r55J899l81r50P02M10j075M7J119o02
2151B6k66J010o63q76J687q10j378J915L70k259R57R80j227J72P94m77k20L64
2169I9K9o73Q96P6j266P92J350k039J31J850j495n40J722r91o37J408m11o56M72
2188A17j23j29R3O94j134K65J190j196q87K044r9k173J746N30j674Q33M90r14
$$ y = [-1011, -47, 1023, -374, -560, 639, 318, -504, 168, 565, -583, 128, 709, -696, -305, 899, -509, -201, 648, -531, -265, 824, -308, -589, 441, 240, -532, 356, 749, -324, -331, 448, -111, -519, 921, -75, -525, 1055, -24, -1317, 592, 419, -1236, 235, 910, -382, -584, 573, 519, -292, 455, 268, -314, 529, 602, -774, 563, 819, -1107, -210, 878, -619, -875, 430, -43, -344, 281, 402, -437, 21, 518, -174, 78, 939, -310, -473, 1058, -565, -724, 1090, -188, -1143, 756, 375, -575, 127, 537, -538, -491, 628, 26, -240, 770, 107, -769, 918, 108, -1270, 645, 1015, -1244, -287, 693, -534, -362, 432, -45, -265, 99, 128, -545, 351, 427, -839, -47, 1303, -736, -605, 1245, -250, -790, 932, -59, -696, 712, 301, -355, 117, -6, -135, -42, 652, -482, -217, 973, -223, -1110, 934, 835, -1338, 408, 938, -736, 97, 587, -327]
2206c27K93L15q19K74R38r13p68J132Q81k084P65J469j833J08J797j617K8J241
2224H80j076L8J006j015l19R02k62j077P73J177j692o08K468j155j258K172n22
2241D32j505J468k02r95J231p1j195J096M55j219L43R15n73j276J176P49k000
2258a171Q64J323j841N60J351j279K49P95j384L81J270j215l68J045m0j262L84
2275c38J316j230n33J579p98r80J750r17o70J658n37j348J383L07j496J189N23
2292H58j035n52J330k30j364J329L73j641R70N27j452P66Q12j570P77J122j732
2309g12L67J146l04j122P54O84j160j82J455j382lJ268j358l06J868j080r37J863
2327H59n96j119Q93P59j247K51R11o26p35J220o2j440J252j28j176J343J56j485
$$ y = [-327, -34, 281, -538, -264, 674, -239, -1007, 125, 1006, -1078, -313, 1156, -677, -569, 1228, -389, -361, 880, -196, -158, 848, -167, -486, 416, 154, -923, -150, 1027, -665, -1273, 1195, 40, -1218, 954, 432, -1073, 395, 193, -802, 429, 358, -837, 259, 714, -505, -162, 753, 180, -1096, 80, 829, -1171, -307, 1016, -825, -265, 1086, -193, 56, 851, -533, -152, 1118, -97, -465, 580, 540, -722, -338, 978, -252, -785, 794, -4, -984, 766, -151, -821, 837, 300, -1048, 335, 642, -854, 335, 858, -177, -729, 601, 371, -993, 336, 709, -932, 38, 565, -887, -121, 691, -879, -102, 1020, -712, -345, 801, 497, -625, 129, 813, -347, -529, 926, -456, -459, 809, -549, -855, 1013, -67, -1004, 859, 263, -856, 37, 796, -451, -200, 711, 85, -650, 570, 508, -932, 320, 192, -984, 359, 515, -970]
2345i70J144P45j601N27P44j119J99P99j37q77O65P25j245K21P44j044L74J197
2363A091j820LJ734j278r04J587p9j210R42N35p01l14P81l29o94J380o17r81J330
2382D56K1j227J206o6j245P68L75j069J73J053m03n54O79J1m76M90L2j051P77
2401e0P42j449O52J313j809J99J455r30q28J109j35n77L05M04q89L86O66n68n13
2420e17J441p81r57J394J59j400J025K02j139O21K40m74O5N77m53m04M59L83j014
2439e73O60M06j250P97N86j349P63P40j454K66J278q41o57R03m7o23K71K85p04
2458e43j28J482j090m04J562n14j460J752j37j559J286K33q18L58J93m20l00P98
2476B91m63l44O98L10j040M07Q55j101L93N04j063M76Q55j346J49J089q63l18
$$ y = [-970, 174, 919, -682, -155, 589, -530, -331, 468, 331, -546, 119, 844, -401, -180, 564, -480, -106, 1091, -729, -726, 1008, -270, -1174, 413, 334, -876, 66, 601, -100, -414, 367, 38, -656, 724, 107, -874, 456, 477, -750, 456, 390, -855, -87, 288, -781, -608, 445, 42, -512, 167, 178, -298, 192, 224, -827, -50, 692, -757, -105, 1208, -601, -402, 1053, 123, -705, 404, 269, -308, -3, 401, -488, -102, 564, -4, -517, 924, 143, -814, 580, 739, -661, 364, 566, -573, 48, 288, -186, -121, 456, 3, -401, 58, 441, -573, 87, 493, -757, 40, 626, -723, 40, 780, -674, -408, 870, 29, -628, 275, 228, -395, -124, 161, -543, -671, 811, -279, -683, 879, 365, -1095, 657, 520, -1039, 247, 480, -338, 20, 213, -207, -507, 291, -172, -516, 182, 492, -548, -141, 714, -387, 6, 510, -553, -77, 778, -568, -419, 670, -193, -511]
2494e11Q65j24n14L35M8m34J93P30o84n84J616j095p99J545l57o42P67K31q86
2513c00L99M84r39J26N89k96r30R56N02j324O26O54j355R68K25j069Q84N01j123
2532d22J38R53p11l32O16K47n65k41O51o29K75P50j344J67J316j085o81J659n31
2551B31q36J167j96o39J86M71m75N4N84o90n06J202l3j465J242M78j942J088R05
2570H26j342M99N91p62p8O16k56k21qM33o62O41J62j035L96Q82j173J77J334j608
2590e88j56J257n09n46Q21k98j56M04Rp23M44O19o27m26J313n60j431J694M28
2609I69j952R78M97j026L35M37p10J21O21n06p1M66J56r46Q26M23j104N35O24
2628F73j172K38P51n22k02P72q28j06Q99l23n66O28K67j215O01P53j004r7J693
$$ y = [-511, 354, 230, -284, 51, 99, -335, -142, 588, -96, -680, 936, -159, -958, 587, 230, -412, 355, 586, -300, 99, 583, -356, -230, 359, 63, -867, 89, 591, -733, -107, 547, -808, 160, 385, -684, 200, 701, -422, -284, 669, -42, -374, 242, 489, -76, -317, 334, -295, -20, 730, -614, -447, 869, -216, -897, 762, 231, -605, 562, 366, -273, -87, 384, -91, -37, 547, -143, -649, 553, 520, -945, 297, 775, -1167, -79, 826, -516, -17, 574, -188, -266, 350, 94, -127, -135, 298, -364, 277, 439, -596, -200, 682, -491, -314, 1020, -588, -744, 513, 4, -542, 279, -19, -175, 229, 238, -485, -41, 578, -49, -475, 838, 278, -1153, 541, 969, -983, -5, 492, -534, -199, 238, -472, -351, 270, -236, -307, 159, 315, -631, 195, 618, -486, 49, 673, -499, -261, 490, -32, -234, 538, -290, -396, 503, 180, -386, 242, 509, -706, -105, 648, -356, -453, 1240]
2647A240j463p05J659j29j515J561l34j051J370l24j080N70R12n13j024J291j49
2664C16j188J023O86j405M48Q36j137M51P52j146M48N71r09j95Q73m21p89R01
2682A15K24o43K5J081r52m27J331p02p18J570j178m24J334p06o33J327l06j067
2700g49N22J009j070m80J318n1j424R09N87j247O59O27j229P82O78j645Q38R63
2718I97j150j25O17j23p83M02L37l19k06O43m98j36J015j490N04J150j178m36
2736g79J716p08q83J115o5r27K78P21o24p25J312m03q77J343K0j317J288n2j363
2755i30R53P85j389J61J166o58o00P54J39p95K73Q51j142N56L64r39M93O50j249
2774e57M0J473j000m06J082n03n99P56p2n11O10K23j096K63J101r28p65K033j166
$$ y = [1240, -223, -928, 731, 602, -913, 648, 314, -737, 633, 309, -771, -201, 711, 198, -826, 465, 316, -872, 151, 837, -568, -120, 716, -421, 30, 782, -364, 84, 655, -254, -449, 424, 3, -786, 115, 339, -304, -279, 802, -150, -577, 754, 52, -666, 904, -274, -698, 636, -70, -703, 624, 318, -749, -227, 782, -288, -768, 550, 499, -925, -16, 571, -676, -17, 610, -619, 163, 841, -804, 34, 997, -153, -278, 339, 216, -567, -165, 172, -147, -353, 290, -208, -344, 671, -819, -315, 835, -343, -779, 937, 229, -654, 461, 396, -531, -253, 468, -156, -881, 431, 28, -849, 494, 514, -803, 485, 433, -930, 23, 808, -581, -420, 746, 88, -512, 242, 381, -414, -141, 710, -432, 124, 488, -451, 42, 692, -557, -517, 956, -44, -450, 632, 129, -470, 286, 214, -297, 313, 536, -560, -297, 804, -124, -889, 1144, -22]
2793b2r98J683M6j636R91Q56j435L37P42m79k17J99K03n11P25m33q35J118L92
2812G26j545N27J113j467L14P20n50l45P70m22J26N65l92k44J61L61q10K48J017
2831H73j219m03J629o51j073J290K20j408R55M7n72J94L84m11j56M37R9p32P96
2850B99L78j454P14R02j697O80R52j183J34Q27o59M0N48o36L5L97q4m55J03J062
2870I03j317K0J483j640j15J351p00m27R25m89p29J158j78o80J11Q30r05L4J198
2889H33q48q45J406R1j401J193L90j647P54O44o66J33M48p79n7Q09l33m93M69
2908A01L12n55k85J169q76j64J062r83n6Q75p94n5P40n84l99R10k72m71K14O50
2928E39p12l14J098o71p67J206J94j480J602Lj400Q10L80r92M36M24m95mP87o34
$$ y = [-22, -1020, 663, 709, -927, 64, 920, -515, -178, 564, 85, -132, 67, 270, -241, 484, 51, -784, 334, 726, -819, -292, 821, -646, -332, 388, -162, -507, 263, -159, -33, 532, 140, -104, 57, 418, -392, -144, 873, -346, -749, 880, 229, -844, 446, 666, -742, 213, 260, -312, -118, 266, -145, -301, 136, 235, -497, 299, 677, -777, -63, 839, -858, -178, 774, -409, -275, 552, -107, -67, 481, -155, -120, 277, 193, -262, -159, 903, -414, -394, 1089, -551, -666, 685, -15, -442, 483, -6, -735, 423, 245, -435, -324, 506, -399, -365, 833, -15, -860, 546, 637, -764, 429, 819, -828, -74, 570, -96, 37, 485, -294, -351, 458, 125, -368, 101, 413, -142, -427, 742, -134, -298, 764, -219, -275, 600, -194, -249, 491, -93, -492, 418, 146, -325, -111, 539, -173, -487, 611, -60, -827, 379, 573, -907, 695, 698, -702, 108, 488, -504, -68, 356, -139, -143, 644, 10]
2948A0m10L60P59j146J99R93j140R7R58r09j32P60n89m3R99p60j38M83P6r38L43
2969a68R01j009j50J197p74p74J498o38o80J050k98j033J338J5r82P0R58n99l04
2988c82Q06J2r93O17K77j000M69Q49j270J89J195j148J49J026r47k39O21l04k96
3007c69L12M02o07J94L99m86j74R55p24n07J159p03r10J727l92j236J196m6r38
3026g48R43J15m80r7O51k10n66P28K10j615R23R75j422Q83J50p64NP85l96m28
3046c58P28l01m73M92J43o14M12N18o92j94P64o18P2Q42q01l38Q89l85p47J104
3066D43j62o69N06R5k66j1M63k46n78J111n94q42R45L47j172M72P50j063K30P37
3086D96p45JO41m3p71L72L31m79j42J162j163R1O54o38P8M84p25N0Q70n41m42
$$ y = [10, -400, -40, 719, -427, -228, 765, -375, -278, 680, -229, -361, 399, -190, -233, 766, 6, -132, 351, 427, -511, -168, 733, -276, -426, 771, -3, -777, 721, 83, -597, 453, 155, -878, 460, 475, -507, -437, 521, -78, -382, 424, 436, -557, 60, 337, -663, -194, 655, -615, -426, 769, -379, -230, 796, -151, -390, 231, -73, -369, -57, 345, -262, -68, 331, -155, -329, 626, -98, -605, 554, -149, -1059, 668, 276, -960, 236, 190, -748, 195, 310, -170, -267, 384, 174, -392, 336, 546, -1069, -146, 829, -593, 290, 440, -324, -319, 466, 70, -358, 370, 69, -404, 88, 231, -383, 29, 547, -145, -339, 425, -193, -121, 721, -80, -418, 471, 86, -661, 443, 281, -388, 118, 213, -53, -64, 399, 153, -425, 686, 92, -750, 195, 542, -630, -158, 592, -471, -241, 496, -249, -248, 393, 350, -421, -49, 282, -197, -339, 823, -340, -249, 405, -233, -155, 329, -396, -346, 524, -17, -459]
3107d59O94n3p01M38K26k17k23P53n81j74N63l43m30J178k64j200J085K40r10
3126c78L89L59n66k40P69m4n89L80M08j047L09J138j079R1N31p36J02O75n39l26
3146c93P16o99J5N83J18o56J33L17l61O9N54l37l50Q76o20p88J527k06j387J367
3166D78j18q73N38L07o28K11M14j88p66Q24L22q36M41N74j132M40M08q39K04N18
3186B99j95n31P24l56j08J78L9k24N4L00l14k13P42q33j49J311p35p45J707q45
3206A06r42J252l54m07O41J86p10P1K54Qn56Q69J79j154Q75M1r03N56Q56j307
3226d39l3P72n13K29L34j88j35R4M8l77j4Q29r75K11P20p98k61R19n92k93J300
3247H38p42k55M79j98n77N62J19k32K9L80l22p11R94O4j155O75M54j200R09M46
$$ y = [-459, 235, 182, -519, -81, 145, -72, -295, 458, -123, -297, 266, -77, -507, 671, 407, -793, 292, 532, -378, 11, 370, -196, -436, 333, 289, -300, 80, 488, -559, -250, 888, -191, -100, 431, -305, -203, 472, -67, -393, 323, -376, -361, 222, 340, -316, -183, 134, -227, -158, 396, 59, -291, 585, -35, -823, 704, 498, -889, 478, 360, -513, 25, 332, -296, -85, 329, 141, -625, 199, 521, -315, 126, 700, -432, 8, 416, -423, -219, 299, 104, -427, 297, -59, -167, 11, 50, -174, -120, 180, -134, -347, 395, -438, -587, 724, -11, -756, 951, 106, -836, 416, 62, -345, 296, 482, -228, -157, 97, 105, -451, 418, 597, -557, 318, 359, -544, 12, 868, -439, -472, 300, -213, 16, 350, 162, 27, 121, 169, -208, -222, 607, -368, -157, 563, -235, -496, 423, -169, -462, 838, 96, -159, 320, 122, -455, 107, 226, -6, 23, 403, 81, -630, 364, 428, -727, -52, 402, -798, 111, 557]
3267E57q71L50M32m38J63J74m04l86O93J60p31L0Q61j190K16J002o89m33J056
3286E52n78j1N53p36p9O26k80m17P54l75j33Q9P13o03p00J397l97p58Q06j85r02
3307f64R08q8p92P49J81l64j2L55m63l15O46K50q14K41R05q34j05P24q28R4O97
3328D71r25M55N64q32K43J26j2k26L37J68k51l02P19m67o96J192q33j07Q31l93
3348F2m90Q53n92l50N89L24o30j23N55k41m20N71M03j191P16L18j071O58P15r85
3368c29K29M08p84M83L27m68j90L86L09o80K71L22l01q7N94o25l34J030o33n51
3388f23J416q07m49P13%o22Q58j67q20K45M02k80k75R38l25q51P80J22p85P42
3408B12L99j374M47P02q57J21P99o88k1J06L24l26j9N90n20l79Q21n35K36P65
$$ y = [557, -314, 36, 468, 30, 193, 367, -37, -423, 270, 430, -301, -271, 590, -600, -384, 618, -71, -504, 552, -26, -37, 516, -220, -299, 327, 47, -370, 384, 9, -124, -35, 678, 75, -625, 772, 375, -383, 423, 238, -664, 244, 156, -636, 113, 294, -70, -82, 273, -190, -505, 141, 391, -423, -182, 723, -111, -216, 508, -320, -226, 471, -454, 1, 565, -267, -24, 102, 90, -136, 201, 369, 118, -184, 535, 68, -628, 564, -269, -376, 455, 62, -428, 425, -167, -517, 72, 396, -234, -357, 198, -43, -463, 108, 511, -680, 36, 354, -717, -59, 656, -329, -100, 308, -476, 7, 334, -134, -324, 62, 371, -309, -38, 284, -17, -104, 490, -135, -469, 561, -72, -623, 793, -14, -463, 250, 250, -372, 486, 319, -501, -256, 146, -134, -409, 529, 204, -647, 133, 255, -530, 212, 611, -763, -316, 386, -471, -350, 449, -239, -260, -154, 170, -156, -175, 415, -105, -484, 337, -198, 38, 803]
3428H03j258J02J020q08m60R88m95l2l4K97n49L92L46j40n63P70l68m50P74K67
3448F02j086P81R9r66M93M12o60L46N01n98j40K69J59m03oP75p13j07P83j030
3468d89K61N33l95k70Q93m07n06Q05l88l14L53m1m69N24L56l23n70P71l80n53
3488f09J039m87n32P77l3q80J123m9n21J60M31j56o94P25l34m73M16M21r20L41
3508b55P11r88M02N55n15o6O75p47J78L4rj92K36L91n43P6O49o56m06Q88m97l58
3530d37O84j13n26O99N8q96P56l1n25L59M00k80n64P46K20p77L55J05r46P38O00
3551F25j104KR79q99j06P49l52k11L27K00m83O5N62o19R3O00p19r3J059r30r9
3572c54O19j54m39M18j35l72N83r5k81J49N51p18m2N84kr29Q91J58j081Q29K22
$$ y = [803, -455, -353, 667, -141, -601, 387, -108, -140, -174, 123, -426, -34, 312, 172, -391, 379, 11, -439, 335, 602, -484, 297, 396, -570, -77, 335, -325, 21, 522, -76, -216, 53, 212, -191, -197, 578, -135, -242, 541, -489, -228, 305, -90, -360, 533, 126, -380, 425, 37, -277, 76, 35, -434, 90, 446, 123, -447, 324, -56, -609, 430, -57, -589, 188, 155, -725, 398, 349, -172, -12, 419, 263, -431, 294, -40, -513, -97, 324, -596, -255, 456, -532, -130, 425, -90, -156, 519, -228, -50, -16, -25, -217, 19, 410, -133, -57, 592, -64, -470, 418, -79, -437, 247, 134, -392, 307, 365, -531, 225, 194, -331, 28, 428, 148, -416, 330, 550, -227, 128, 233, -713, 25, 625, -479, -477, 502, -397, -503, 246, -106, -317, 10, 210, -273, -208, 354, -265, -172, 428, -291, -384, 675, -255, -354, 265, 111, -328, 90, -45, -417, 166, 71, -210, -61, 490, -228, -270, 314, 312, -617, 274, 432, -649, 180, 402]
3593D02j130R16L14r11MO55p3l95N78n3m91mO39o12q3N46n69q3R25n38m41O60
3615B56k94k61L76j80R2K45l06O2o8M48n34m4N81j26p91Q67k42o99O25M63j055
3636e85M53M61n45j2N74j38m19K84J70n15jP82q95M1Q68o92m17J060l79l57M71
3657B09l61%J33K19m85J77K77r8j77K88j56o48R25j30p43R18k30p66Q61j71k24
3678a82M48m8n01K29M55k43n20L99L57r23N83O70q91r3R89j051Q5P73q37j21N29
3699A07k38J46L3O3m66M93M2k83j37O83m34k57P82q23j82P77l6n31O73l62l64
3720c14N07J76o83K74J59k68M8%N19j080P57O96j274L58N07o77L78N06q96J34
3740a73O11l12o12O28k24O6l26N03l54p8O83k32m77P59n78k30P71n64m0M18k29
$$ y = [402, -728, 188, 502, -409, -405, 250, 177, -218, 360, 307, -184, -188, 451, -161, -244, 302, -267, -350, 575, 37, -404, 256, -38, -299, 77, -103, -11, 234, -72, -10, -78, 370, -164, -208, 373, 247, -544, 323, 81, -618, 7, 470, -585, -132, 329, -216, -228, 346, 208, -211, 73, 243, -272, -273, 509, -386, -345, 523, -169, -586, 474, 95, -262, 209, -152, -152, -19, 200, -285, -108, 169, 71, -106, 182, 26, -622, 303, 173, -570, 348, 118, -648, 213, 42, -182, 266, 218, -283, -54, 401, 158, -362, 37, 394, -529, 54, 724, -167, -260, 729, -322, -237, 536, -301, -422, 107, -131, 15, 48, 111, -355, 138, 180, -103, -240, 443, 9, -248, 534, -289, -471, 306, 270, -261, 412, 50, -314, 193, 369, -314, -40, 119, -149, -101, -101, 418, -662, 95, 791, -483, -125, 382, -295, 83, 589, -307, -173, 438, 126, -486, 142, -82, -16, -342, 161, -193, -271, 412, 180, -297, 462, -116, -346, 425, -139, -179, 239, 10]
3761A0j33P5L22o74K75M31k42m46Q09k87o81O49k7m23K17O83j182O06J62m30J1
3782b75R27n99n09P29o7k99j33P00n21k33O10m79j5O96o51l22R60m07l68N12K56
3803E12o54K51R2m86J4N12q8m23P15l41m80P67k5q99Q32K56j030N27K72r86O35
3824b7M07n41k21M45K99l36k60L24n34K61O34o96L0N50k14m88Q79o13j56O03j40
3845B06l87J18j30k0K17J23j20p1K87M8l30K95k12n15Q87k99n30N12j90o1j65
3866c37M80k25k14M23q8j66J58M38p08Q7N02m67l3L29o2l82O69k38k02P3p2J52
3888A17J1p1m5k5J43k61r4N93l22m81O10o4n51N26k96O7K39N5l51L1K18J7l39
3911b73L98k56k38N72J99o41J70M41o23O3N73m07l44N65m36K94J68k70J29k39
$$ y = [10, -123, -48, 274, -400, -125, 306, 64, -382, 427, 140, -541, 108, 81, -342, -125, 558, -624, -18, 144, -286, -275, 652, 53, -456, 273, 206, -93, -226, 474, -47, -280, 330, -149, -164, 532, -119, -441, 519, 112, -256, 256, 512, -142, 109, 201, -285, -271, 241, 153, -270, 445, 104, -376, 391, 366, -533, 299, 555, -475, 52, 324, -662, -27, 380, -161, -382, 63, 362, 26, -234, 90, -444, -183, 451, -245, -215, 335, 121, -367, 512, -101, -257, 346, 206, -181, -63, -193, -213, 4, 127, 7, -64, 223, 271, -59, 236, 24, -491, 396, 97, -433, 79, -111, -172, -337, 143, -82, -296, 127, 39, -127, 31, 469, -239, -152, 350, -117, -150, 179, 117, -265, 404, 166, -36, 37, -35, 117, 128, 57, 12, -13, 130, -131, -225, 368, 46, -435, 175, 111, -440, 86, -210, -143, 96, 151, -200, -169, 49, 66, -273, 125, -131, -369, 203, 402, -239, -69, 372, -251, -188, 385, -22, -366, 199, -237, 57, 225, -45, 84, -155]
3931a55L95j78l02M04j90j97O54m12n66P32Kn91O79Q1o76O54J51q36N57J7l03
3952h0L2J97J10n48N38q8n36K40N48l91l10Q27q29L02Q8r8k31M61ol53J2O51m77
3975E9J1J12m37m2L82p3m54R27q04L06L38l37l21N36m46PJ69R4o0r1M06l42k99
3998c59P09j34m76J12J65k38K36K54m61J39J15n5n9Q9j66J2K80P2l92N1K53m72
4020c25K08N43n70j78O23k82q6L62k01n26P43l10J92l68J86j99Q9J00J6j89M10
4041B38r7n49M26O7n24O29Pl55L28Q9o36N58J01k13j4L0K68p78L44L89n88R1M32
4064B43m65K48J81l10%L49k43K6J92n0j49k65M47j99r3K73k90k86O58l15l80L81
4086d7lo9K85K1m46L31q6mM6L52m16r4L45l42j25L05N35j002M46K49o65K78M22
$$ y = [-155, 240, 62, -240, 164, -26, -223, 431, 19, -547, 185, 187, -404, 275, 356, -320, 334, 485, -351, 206, 223, -80, -48, 149, 259, -289, 249, 161, -375, -135, 413, 22, -288, 539, -290, 12, 100, 2, -229, 232, 226, -127, -115, 536, 59, 70, 182, -255, -297, 85, 12, -442, 485, -319, -13, 325, -12, -333, 203, -243, -236, -67, 27, -33, -124, 282, -60, -359, 350, 216, -260, -148, 17, -221, 15, 269, -192, -53, 62, 7, -52, 37, -129, -117, 163, 235, -157, -106, 147, -325, -117, 426, -144, -322, 301, 19, -67, 295, 94, -432, 311, 1, 193, -175, 11, -188, -99, 1, 17, -172, 238, 141, -408, 18, 85, -439, 190, 197, -158, 170, 259, -377, 181, 282, 69, 55, 85, 353, -425, -81, 308, -280, -189, 243, -222, 26, 207, -103, -103, 246, 3, 29, 221, 171, 22, -243, 204, 5, -88, 185, -105, -391, 267, -48, -428, -47, -50, -119, 166, 187, -259, 72, -14, -18, 28, 380, -36, -130, 215, -127, -252, 53, 588, -414, 32, 281, -384, -106, 316]
4109C16n53q0K52m5Ro9M49l15k1N67k94l16N37l69J4K13l90j5L21j09k65K50q8
4132aJ6Ml6J50m31N42O7p71M90N8n74P21k6o15O90k72k01j3K31j4j90M18l19j88
4156b64J78Q3p4K13m5l37l64Q78l68j25M47k11j79L14J19k32L5j77L7k53M56k88
4178a57j01M23l04O0J58j75j92N88J0p83P60j67k51L9L86l79R3M6n4j13N4L15
4200B56o02L14K66l30l4N23l82l06M12j73p2J93J45m83J10M32k63J28o5o0j97
4221a88M17l21l31O34k33l41N94j98k16M33m00J90L8K7j14J26J00q4k05K65J3
4242B06l96L49K66r71L59N90o85K66K31r3l03K30j46j77K22M4j07k31M77J24m70
4263b15P11k85l69M14q3n06N51j47l73M24m4j06p0J53j10J13J25n8k99L72J87
$$ y = [316, -237, -317, -65, -110, -101, -170, 279, -36, -57, 510, 216, -100, 437, 68, 82, 295, -95, -110, 211, 102, -163, 87, -1, 15, 19, -17, 133, -298, 244, 311, -460, 30, 88, -486, 235, 209, -406, 284, 12, -189, -202, 29, 15, -175, 243, -76, -264, -86, -3, -77, 136, 91, -246, -610, 268, -100, -225, 222, 11, -168, 146, 265, 33, 68, -109, -72, -325, 131, -157, -258, 165, -139, -79, 79, -96, -288, 300, 310, -473, 287, 120, -131, -92, 294, -85, 8, 54, 0, -113, -59, 256, -346, -32, 234, -96, -130, 393, 11, -295, 117, -56, -128, 65, 210, -273, -163, 269, 6, 134, 69, 9, -188, 229, -92, -423, 211, -22, -363, 231, 33, -183, 250, -150, 40, 78, 105, -9, 117, 217, 133, -72, 193, 206, -190, 159, 425, -546, -187, 403, -282, -16, 215, 122, -181, 49, -97, -274, -52, -8, -115, -346, 131, 255, -215, 496, 211, -158, 256, 173, -333, 218, 71, -302, 122, 78, -28, -98, 55, -55, 58, 183, 125, -174, 198, 385]
4284C85p52O15j39n18K00M67p18L05K75l45K44J80j22p7k17L71l01K07L96o45
4304a89l8O91l97k87M86mm24L49k94j98J64k7K10l1J47j38k3K04R1m72J72K37
4326B29p24O89k18k21P7J95l08L09K09n63L48O6k25Q5O5J43l13K1P26q86P7K94
4348G5J06m03M37r3k76M32o95L21j13L95rj69k7j24j4L43p6n78O91l1n57O29j2
4371B52m00M89j03o34O78k81Oj47L61L5l35L47J89m83R7L65p15K37J26p0JM4j0
4394D9l71O38j86j82r1M84k20k31J62j13n0K52l7m01M88j0k44J24j33j46M50j45
4416H7m53O47l3o32M59j80q7oK60J94m01L78J22o72J25N47l75K86J13m78O6K76
4438B43q3n69M28J72k76k67N86k56l85O30m37K38M7L9n17O37j53k64K42N0j27
$$ y = [385, -367, 248, 109, -409, -209, 258, -460, -155, 120, -225, 19, 199, 77, 0, -217, 154, -147, 60, 456, -189, -227, 464, 67, -220, 266, 262, -162, 187, -107, -305, -141, -168, 42, 11, 158, 20, -3, 201, 292, -180, -8, 229, -495, 194, -24, -245, -168, 27, -281, 28, 237, -326, 22, 88, -137, -52, 13, 156, -157, -136, 590, -296, -219, 75, 181, -222, 215, 122, -154, 278, -417, -96, -209, 186, 177, 8, -19, -143, -157, 186, 110, -468, 223, 192, -365, 264, 252, -148, 341, 238, -396, 282, 1, 7, -140, 221, 256, -79, 268, 457, -26, 71, 436, -279, -42, 84, 14, 15, 59, 49, -322, 316, 130, -52, -143, 341, 121, -110, 52, -61, -111, 141, 104, -297, 191, 181, -63, 61, -72, -218, 232, 87, -366, 281, 248, -384, 75, -105, -192, -198, 62, 256, -145, 233, 355, -317, -192, 355, -20, 266, 379, -99, -33, 243, 160, -409, 19, 191, -85, -352, 234, -22, -407, 223, -214, 24, 71, 110, -407, 230, 77, -187, 55, 105, -22]
4459b2nn2R0j66J0q9J50J69K9k80KK69k84K08K85o09L19J27n75M94J57l3j11K
4483H5j40mr6J36q4k61P29n97n0N76l14l53N41m13M22q9N4m37L02j63n4L0L31
4506A51l73j94P24j87n31P78m11p9K49O6m54K57L45p17N39o9l25Q8R9k2N6J7R
4529A6j57j26Q94o72m86R65n25j38M95l54K31j95J79l79J14J49K19l22KJ78m59
4550c71M55j49r8K81k16l19L67J38l66kK83p6K11Q2j07M2k67M14m05M3K0k3R0
4573B7M10l54j89O2l07L01J45q3p4J86k51k25L95j17K48k35N98n74j89K65j11
4594g2j49N77k77l21M21J17k37O6j34j69K38J00j00J28J19m1k55J7l3L9j79K51
4616A06k19J29L50m32m3P1j42R7P9K42j56j48k24R4K4L64j86J4J1n4k60K13q7
$$ y = [-22, -27, -79, 11, -155, -145, -234, -84, 85, 114, -166, -164, 105, -179, 29, 314, -295, 24, 151, -424, 70, 227, 194, 83, 85, -55, -59, -155, -19, -103, -364, 365, -232, -282, 294, -20, -373, 168, -245, 177, 88, 142, -295, 7, -156, -210, -180, 151, -222, -416, 308, 121, -410, 368, -43, -122, 127, 193, -261, -4, 341, -376, 163, 94, -231, -143, -44, -66, -10, 7, 16, -141, -267, 627, -45, -531, 434, -91, -229, 266, -88, 143, -52, 127, -252, -138, 11, 230, -92, -90, 88, -371, 84, -65, -163, 118, -98, -417, -50, 88, -278, -280, 3, -73, 138, 220, 113, 155, -112, 302, -103, -60, -40, -63, 27, 437, 83, -106, -44, -351, -50, 95, 12, -62, 124, -127, -352, 43, -74, 174, -61, 537, -37, -226, 39, -72, -221, 356, 79, -242, 179, 296, 59, 125, -9, -178, 60, 160, 60, 188, 307, 266, 11, 28, -5, 34, -145, 106, -113, 16, 366, -66, -109, -38, -180, -83, -4, 238, 82, -66, -290, -196, -172, 192, 6, 20, 31, -23, -283, -70, -157]
4639a57o3L24ok17P2L4k04j7R4O5l57N60o2k59M72q1n24L84K32m47Q6M54m67J1
4663g3R8J3p2P8L5p1k55K87Q7k1m6J39j64M35o63M7L50j96k77M97j57k81K02q
4687a6k4P0J19k94lK34l4l59N41N3o04L23L71p60L20K11k44N8K77p1j22p0K26
4710B02m13J20M88n18K25o5j02N3j04J60j54M54n59n8O37m68L5J17J50j34J60
4731B26m4k99m5N10k04n64M84J27m38K85J39l65K01K15m26J88j54J99k18L54o5
4752A06k11K83J95l25k07M08k93j90N16k97q8J89j37j01K53j78K03k76J45O7r9
4773c7J52j10j02K84o7n73L29J40m25Q31j60n83M15O6j09j36M0k9j99K12K47n54
4795c68K84M02k34k50O59m90n6J53O9j55J09l76K34ML1j66L9O0j84K3N36k76l60
$$ y = [-157, -220, 104, 98, -119, -47, -13, -217, -234, -140, -75, -432, 128, 66, -193, 279, 198, -326, 58, 290, -157, -71, 383, -84, -73, 25, 38, -34, 44, 79, 8, -247, 40, 127, 106, 60, 199, 35, 470, -193, -146, 204, 8, -269, 228, 71, -210, -8, -16, -40, 30, 149, -145, -148, 86, 52, -307, 234, 287, -317, 6, 377, -383, -63, 148, -96, -38, 239, 168, 46, -24, 202, -211, -91, 397, -121, 104, 39, -63, -10, -114, 46, -108, 346, -213, -271, 366, -102, -67, 50, 200, 66, 226, 182, -117, -162, 348, 144, -420, 64, 191, -247, 38, 177, -188, 13, 228, -198, -10, -164, 35, -183, 171, 106, -105, 178, 373, 48, -159, 249, -44, -234, 282, -15, -103, 86, -51, -152, 101, -77, 126, -150, -5, 62, -37, 115, 5, -97, 187, 120, -453, -124, 16, -409, 422, 262, -321, 94, 160, 51, -85, -45, -74, -273, -61, 186, -368, -84, 318, 84, -166, 493, 3, -53, 100, 169, 14, 123, -253, -19, -15, 16, -150, -111, -51, -235, -212, 324, 48, -312]
4818c12L61K8j12J23j11k41K43J66p2j57J82l14j60P28l07m60M08J19m51O7P16
4839D44o95M22K81p61J78J73K06m47J86K70l11N9p1Q4J72M8k65l9J67j77n1O2
4861f5J38k37M40k69L5k2o5R0k76J01K0j20J56k7q7L70p1m09L20J78n39M15J38
4884B14o61M09K45k28P3r5m3p0K56j75J8J06J1j41P7K64n46M07m2q2n1L50k11
4907H5l01M17j48j67Q3J61l2m96K50J92j10M66l87j15K93j10m37N72j19j50O1
4928HJ62l05N4p7K18J16k08L6k36K67J35k92k18O09m08L6M22m40j78L42K9l77
4950c05N52j81k12j03K06j16R5M40o25K91L17k29r0L34k65m49O31j38k62L23k03
4971A1k2k05M32M7m33J97Pj99K72J53o31N18M4l82K91J20l45P1M21l54k67K34
$$ y = [-312, 49, 77, -35, 88, -23, -264, -21, 145, 73, -84, 98, -216, -376, 352, 45, -415, -7, 112, -339, -272, 444, -251, 171, 452, -309, -131, 42, 248, -199, -13, 257, -54, 5, -66, 18, 190, 238, -27, -66, 101, -76, -127, -65, 73, -164, 276, 7, 42, 20, -45, 45, -231, -130, -110, -230, -74, -101, -188, 182, 111, -298, 22, 200, -339, 76, 214, -447, -38, 207, -21, 52, -43, -86, -156, 100, -75, -57, 49, 60, -81, -4, 260, -286, 121, 79, -3, -54, 296, 85, -216, 201, 53, -114, -31, 130, 98, -398, -148, 44, -66, 400, 13, -102, 191, 81, -356, 216, 97, -53, 8, 170, -135, -81, -158, 60, 176, -32, 4, -232, 35, 170, -122, -340, 269, -139, -103, 319, -121, -299, 43, 72, -305, 247, 66, -146, -249, -43, -159, -64, 376, -249, 42, 359, 130, 40, 374, 109, -340, 291, 153, -109, 214, 11, -11, -216, 216, 263, -170, 27, 34, -165, 107, 260, -371, 147, 191, -191, 100, 220, -125, -54, 367, 13, -254, -20]
4993b0L7J04k57l0j64K91K00n14K63N98o23l7O21m77o5K4K25k97r1J33K45j59
5015GJ80L5m17L75l01m8L14k18m40Q95m13k49K87m5J34j40P1j1J04j40J6j34M7
5038i1L51l96k52M98q9k18K24N1j16K44n45K42K12j9k83J05K04O1k55K89J24n95
5060b54L33l0l12L95J86o57L00L28o59N00j68J0K37m27L55k47K40o3j82r3K42
5081C4R2k68L99k39j50L60l84M2N05p52K27L68j10j68J82k25L06l58R3l8Q2k6
5103b8K2l40M00n2k14L27N8l71J17K97m59O9M20m30K03j5M1k88N92l70j54K59
5125H4j13o9o1K76j24j01ON0k49L66q8j73L39m9p5j24LJ60J46o6j8l3p9j90q1
$$ y = [-20, 17, 121, -136, -166, -330, -39, 161, -353, -90, 508, -115, -152, 469, -8, -73, -49, 176, -121, -212, -79, 166, 7, 187, 222, -195, 180, -121, -169, 145, -73, -513, 382, -31, -280, 7, -38, 96, -44, 27, 16, 120, -20, -4, -138, -91, 260, -136, -388, 110, 21, -197, 27, 78, -38, 206, -339, -97, 115, 96, -187, -82, 122, 183, -72, 217, 341, -254, 79, 49, -263, 132, 318, -339, -39, 289, -370, 130, -38, -28, 209, -218, 137, -110, 130, 67, -115, -208, 34, 126, -142, 257, 18, -132, 228, -156, -114, 391, -361, -134, 234, 124, -44, 138, -87, 219, -139, -46, -84, -2, -28, -6, -346, 54, 2, -212, 115, 173, -198, -81, 216, -243, -174, 246, -184, 19, 4, 45, -243, 349, -21, -175, 84, -29, -98, -159, 117, -7, -108, -102, -52, -301, 65, -23, -196, 143, 94, 19, -105, -102, 58, 204, 138, 120, 87, 8, -182, -263]
$$ [...]
8191B2
##END NTUPLES=NMR FID
##END=
