##TITLE=1H_Pr Dep 5g
 200.13Hz, CDCl3.
 8 sc
 
16.3.2026
##JCAMPDX= 6.0         $$ Bruker NMR JCAMP-DX V2.0
##DATA TYPE= NMR FID
##DATA CLASS= NTUPLES
##ORIGIN= UXNMR, Bruker Analytische Messtechnik GmbH
##OWNER= pz
$$ XWIN-NMR		Version 3.5
$$ Mon Mar 16 15:38:37 2026 Russian Standard Time (UT+4h)  she@DPX200
##.OBSERVE FREQUENCY= 200.1313
##.OBSERVE NUCLEUS= ^1H
##.DELAY= (6, 6)
##.ACQUISITION MODE= SIMULTANEOUS
##.ACQUISITION SCHEME= undefined
##.AVERAGES= 8
##.DIGITISER RES= 18
##SPECTROMETER/DATA SYSTEM= spect
##.PULSE SEQUENCE= zg30
##.SOLVENT NAME= CDCl3
##.SHIFT REFERENCE= (INTERNAL, CDCl3, 0, 14.3821)
##AUDIT TRAIL= $$ (NUMBER, WHEN, WHO, WHERE, WHAT)
$$ ##TITLE= Audit trail, XWIN-NMR		Version 3.5
$$ ##JCAMPDX= 5.01
$$ ##ORIGIN= Bruker BioSpin GmbH
$$ ##OWNER= she
$$ F:/spectra/data/she/nmr/H-C/1/audita.txt
$$ ##AUDIT TRAIL=  $$ (NUMBER, WHEN, WHO, WHERE, WHAT)
(   1,<2026-03-16 15:36:35.95 +0400>,<she>,<DPX200>,
      <created by zg, POWCHK disabled, PULCHK disabled
       configuration hash MD5:
       00 E9 B6 7A A2 85 ED C7 34 08 36 98 17 FE 4E 26
       data hash MD5: 16K
       28 19 B2 3C D5 0E 16 08 3D 8C 0B B7 DC A6 4C ED>)
$$ ##END=
$$ 
$$ hash MD5
$$ 5C 19 11 45 C8 01 2E 58 79 35 ED A3 21 42 C0 33
##$RELAX= 
##$RELAX= 
##$RELAX= 
##$RELAX= 
##$RELAX= 
##$RELAX= 
$$ Bruker specific parameters
$$ --------------------------
##$DU= <F:/spectra>
##$EXPNO= 1
##$NAME= <H-C>
##$PROCNO= 1
##$TYPE= <nmr>
##$USER= <she>
##$AMP= (0..31)
100 100 100 100 100 100 100 100 100 100 100 100 100 100 100 100 100 100 
100 100 100 100 100 100 100 100 100 100 100 100 100 100 
##$AQSEQ= 0
##$AQ_mod= 1
##$AUNM= <au_zg>
##$AUTOPOS= <>
##$BF1= 200.13
##$BF2= 200.13
##$BF3= 200.13
##$BF4= 200.13
##$BF5= 200.13
##$BF6= 200.13
##$BF7= 200.13
##$BF8= 200.13
##$BYTORDA= 1
##$CFDGTYP= 0
##$CFRGTYP= 5
##$CHEMSTR= <none>
##$CNST= (0..31)
1 1 145 1 1 1 1 1 1 1 1 1 1 1 1 1 1 1 1 1 1 1 1 1 1 1 1 1 1 1 1 1 
##$CPDPRG= <>
##$CPDPRG1= <>
##$CPDPRG2= <>
##$CPDPRG3= <>
##$CPDPRG4= <mlev>
##$CPDPRG5= <mlev>
##$CPDPRG6= <mlev>
##$CPDPRG7= <mlev>
##$CPDPRG8= <mlev>
##$CPDPRGB= <>
##$CPDPRGT= <>
##$D= (0..31)
0 0.7 0 0 0 0 0 0 0 0 0 0.03 0 0 0 0 0 0 0 0 0 0 0 0 0 0 0 0 0 0 0 0 
##$DATE= 1773660995
##$DBL= (0..7)
120 120 120 120 120 120 120 120 
##$DBP= (0..7)
150 150 150 150 150 150 150 150 
##$DBP07= 0
##$DBPNAM0= <>
##$DBPNAM1= <>
##$DBPNAM2= <>
##$DBPNAM3= <>
##$DBPNAM4= <>
##$DBPNAM5= <>
##$DBPNAM6= <>
##$DBPNAM7= <>
##$DBPOAL= (0..7)
0.5 0.5 0.5 0.5 0.5 0.5 0.5 0.5 
##$DBPOFFS= (0..7)
0 0 0 0 0 0 0 0 
##$DE= 6
##$DECBNUC= <off>
##$DECIM= 32
##$DECNUC= <off>
##$DECSTAT= 4
##$DIGMOD= 1
##$DIGTYP= 9
##$DL= (0..7)
0 120 120 120 120 120 120 120 
##$DP= (0..7)
150 150 150 150 150 150 150 150 
##$DP07= 0
##$DPNAME0= <>
##$DPNAME1= <>
##$DPNAME2= <>
##$DPNAME3= <>
##$DPNAME4= <>
##$DPNAME5= <>
##$DPNAME6= <>
##$DPNAME7= <>
##$DPOAL= (0..7)
0.5 0.5 0.5 0.5 0.5 0.5 0.5 0.5 
##$DPOFFS= (0..7)
0 0 0 0 0 0 0 0 
##$DQDMODE= 0
##$DR= 18
##$DS= 0
##$DSLIST= <SSSSSSSSSSSSSSS>
$$ [...]
##$SUBNAM0= <"">
##$SUBNAM1= <"">
##$SUBNAM2= <"">
##$SUBNAM3= <"">
##$SUBNAM4= <"">
##$SUBNAM5= <"">
##$SUBNAM6= <"">
##$SUBNAM7= <"">
##$SUBNAM8= <"">
##$SUBNAM9= <"">
##$SW= 18.0517328524113
##$SWIBOX= (0..15)
0 0 2 0 0 0 0 0 0 0 0 0 0 0 0 0 
##$SW_h= 3612.71676300578
##$TD= 16384
##$TD0= 1
##$TE= 0
##$TE2= 300
##$TE3= 300
##$TEG= 300
##$TL= (0..7)
0 120 120 120 120 120 120 120 
##$TP= (0..7)
150 150 150 150 150 150 150 150 
##$TP07= 0
##$TPNAME0= <>
##$TPNAME1= <>
##$TPNAME2= <>
##$TPNAME3= <>
##$TPNAME4= <>
##$TPNAME5= <>
##$TPNAME6= <>
##$TPNAME7= <>
##$TPOAL= (0..7)
0.5 0.5 0.5 0.5 0.5 0.5 0.5 0.5 
##$TPOFFS= (0..7)
0 0 0 0 0 0 0 0 
##$TUNHIN= 0
##$TUNHOUT= 0
##$TUNXOUT= 0
##$USERA1= <user>
##$USERA2= <user>
##$USERA3= <user>
##$USERA4= <user>
##$USERA5= <user>
##$V9= 5
##$VALIST= <valist>
##$VCLIST= <CCCCCCCCCCCCCCC>
##$VD= 0
##$VDLIST= <DDDDDDDDDDDDDDD>
##$VPLIST= <PPPPPPPPPPPPPPP>
##$VTLIST= <TTTTTTTTTTTTTTT>
##$WBST= 1024
##$WBSW= 4
##$XGAIN= (0..3)
0 0 0 0 
##$XL= 0
##$YL= 0
##$YMAX_a= 104374
##$YMIN_a= -85207
##$ZGOPTNS= <>
##$ZL1= 120
##$ZL2= 120
##$ZL3= 120
##$ZL4= 120
##$ABSF1= 10
##$ABSF2= 0
##$ABSG= 5
##$ABSL= 3
##$ALPHA= 0
##$AQORDER= 0
##$ASSFAC= 0
##$ASSFACI= 0
##$ASSFACX= 0
##$ASSWID= 0
##$AUNMP= <proc_1d>
##$AZFE= 0.1
##$AZFW= 0.1
##$BCFW= 1
##$BC_mod= 2
##$BYTORDP= 1
##$COROFFS= 0
##$CY= -3
##$DATMOD= 1
##$DC= 2
##$DFILT= <>
##$DTYPP= 0
##$F1P= 0
##$F2P= 0
##$FCOR= 0.5
##$FTSIZE= 0
##$FT_mod= 4
##$GAMMA= 1
##$GB= 0.15
##$INTBC= 1
##$INTSCL= 1
##$ISEN= 128
##$LB= 0.25
##$LEV0= 0
##$LPBIN= 0
##$MAXI= 10000
##$MC2= 0
##$MEAN= 0
##$ME_mod= 0
##$MI= 1.114404
##$NCOEF= 0
##$NC_proc= 0
##$NLEV= 6
##$NOISF1= 3.799351
##$NOISF2= 2.8
##$NSP= 1
##$NTH_PI= 0
##$NZP= 0
##$OFFSET= 14.38212
##$PC= 1
##$PHC0= -3863.17
##$PHC1= 9.7923
##$PH_mod= 1
##$PKNL= yes
##$PPARMOD= 0
##$PSCAL= 0
##$PSIGN= 0
##$REVERSE= no
##$SF= 200.129724274929
##$SI= 16384
##$SIGF1= 3
##$SIGF2= 2
##$SINO= 400
##$SIOLD= 16384
##$SREGLST= <1H.CDCl3>
##$SSB= 0
##$STSI= 0
##$STSR= 0
##$SW_p= 3205.1282051282
##$SYMM= 0
##$S_DEV= 0
##$TDeff= 0
##$TDoff= 0
##$TI= <>
##$TILT= no
##$TM1= 0
##$TM2= 0
##$TOPLEV= 0
##$USERP1= <user>
##$USERP2= <user>
##$USERP3= <user>
##$USERP4= <user>
##$USERP5= <user>
##$WDW= 1
##$XDIM= 8192
##$YMAX_p= 0
##$YMIN_p= 0
$$ End of Bruker specific parameters
$$ ---------------------------------
##NTUPLES= NMR FID
##VAR_NAME=  TIME,          FID/REAL,        FID/IMAG
##SYMBOL=    X,             R,               I
##VAR_TYPE=  INDEPENDENT,   DEPENDENT,       DEPENDENT
##VAR_FORM=  AFFN,          ASDF,            ASDF
##VAR_DIM=   8192,          8192,            8192
##UNITS=     SECONDS,       ARBITRARY UNITS, ARBITRARY UNITS
##FACTOR=    0.0002768,     1,               1
##FIRST=     0,             0,               0
##LAST=      2.2672688,     0,               0
##MIN=       0,             -85207,          0
##MAX=       2.2672688,     104374,          0
$$ Real data points
##PAGE= N=1
##DATA TABLE= (X++(R..R)), XYDATA
$$ [...]
1489H43J324k101o99K251P1k788M9J592m32j29j58p32R05j0k087O16K745J24k770
1508a386M74L010j436l325L160K630k667j368J718O6j703l90J302N21m01m70j083
1525a348LJ930j277j296L491J228l736r24L274L13k771P93L222j609k954J338
1541c23O69j194P54J81n05N24m50j581K39K669L74k482J079K775k785k589L546
1558I01J613k458k91J820o46k559J05J644j74J13L94j503K19J244j942l26L609
1575A763L96l139p3K792p11l248K167L357k518k063J640j92j268K64P18L79K12
1592D76p77j373K27K396o37k076K977J881m034j300L568M53k690M07K797j072
1608A223l156O41J527q65L35L48p13R97k87k033P49K700lk224Q50K558k363k822
$$ y = [843, 2167, 66, -633, 1618, 1689, -1099, -1050, 542, 110, -19, -177, -909, -4, -14, -2101, -1485, 1260, 1384, -1386, -912, 2098, 662, -2663, 497, 3127, 460, -908, 810, 876, -827, -1217, 85, 606, 205, -265, -1348, -1345, 585, -692, -1988, 1503, 2731, -1005, -1929, 1345, 1658, -1113, -320, 2902, 1293, -1661, -323, 346, -848, -94, 87, -418, 106, -344, -1925, -1686, 983, 1357, -1125, -46, 2729, -56, -2645, 901, 2514, 56, -235, 1585, 939, -1620, -1515, 129, -45, 68, 462, -1041, -822, 422, -1520, -1846, 1763, 2159, -980, -1053, 1739, 1028, -2220, -53, 3304, 786, -1277, 363, 171, -1097, -833, -115, 264, 476, -301, -1674, -1447, 949, 312, -1764, 1213, 3094, -940, -2240, 1328, 1781, -909, -502, 2295, 1223, -1933, -1292, 235, -630, -295, 53, -660, 337, 50, -1983, -1234, 1466, 1463, -761, 89, 2647, 284, -2538]
1626b538L214K146l039o12J662m20j854m8J433M19l50k84o40K67J157j219l83
1643a089L082K25l248K22K291p73k167J225K696j894k245J476L20j114L68M73
1659a52J05M87p09j085Q80J538m78j526J685J754k975j368L124L37k239J07J430
1676I15n08j680J2J304l9l20K04n86O73N78j683L91K635n58k133O13J967j136
1694F49k201J562K088k123j297J380J30r09k53L70J069j74q27l16R64J006j148
1711c0r09K435M86k800j53K361l65k026K63K022n53k367N04J522n35l97j02N58
1729h6R75j070j103J637J165j322q53J163J531k108j507K161R77k280l10J274
1745B44K34j162q23J302Q96j080l85P36O71J2j315M46J932q88j688R97J183q31
$$ y = [-2538, 676, 2822, -217, -829, 833, 413, -1441, -1489, -56, 363, 13, -271, -911, -644, 513, -706, -1089, 1993, 2218, -1030, -808, 1483, 710, -1457, -232, 2464, 570, -1675, -199, 121, -993, -625, -152, -47, 440, -269, -1354, -474, 1064, 586, -940, 745, 2499, -476, -1844, 1280, 1617, -622, -515, 915, 407, -1273, -1261, 43, 4, -316, -112, -698, -25, 553, -1130, -739, 1896, 1338, -795, -182, 1785, 649, -1552, 10, 2098, -25, -1322, 58, 188, -721, -974, -604, 465, 291, -536, -852, 112, 1118, -30, -939, 1496, 1982, -818, -971, 1390, 1025, -1001, -738, 1284, 731, -1636, -1132, 390, -145, -542, -644, -86, 889, -181, -1284, 353, 1518, 196, -657, 506, 2037, -71, -1578, 583, 1560, -720, -1030, 244, 478, -684, -1507, -205, 691, -389, -774, -38, 633, 645, -670, -224, 1708, 820, -868, 129, 1312, 481]
1763D81j514M40J667r54j691J044R90p45o21K23J016K85j362K61J421j16r29k40
1781c44J114O35j744m00J618k26j417j10R92M43j386m73J517K62j171J16P44P39
1799I09o38j066J347R09j253o98P14P88n45j521P68J266j197j245J039P28m11
1816a06r96M54J616p56j159Q15J202l98j114P3J688l81j626M41J162m76j323o0
1834i44J350nj597J11J540k08r84Q5J227N24j398m32J828j6j466O9R37N21j552
1853d10o42J412M22j778j32J144M24j044o07J345Q46j367m09J327P23p99j048
1870e93Q80J035r99j211J118N68q68j001N29J215r32j252J212Q84o88n70K70J233
1888H30k01j226N60J241n62p84k37J146R5j670K0J605o89j313L88J008m8j074
$$ y = [481, -1033, -593, 1074, 120, -1571, -527, 463, -282, -903, -680, 336, 621, -741, -480, 941, 825, -104, -344, 770, 1405, -339, -739, 879, 653, -764, -874, 118, 561, -825, -1298, 219, 481, -690, -574, 170, 909, 271, -795, 552, 1461, 208, -490, 224, 1012, 467, -1054, -286, 980, -217, -1462, -423, 305, -106, -1102, -648, 968, 212, -947, -132, 1070, 672, -442, -369, 1319, 938, -688, -247, 915, 439, -884, -944, 406, 401, -1196, -1085, 455, 247, -737, -652, 575, 1099, -299, -731, 1097, 1081, -385, -316, 621, 1142, -410, -1052, 360, 782, -996, -1128, 16, 440, -604, -1211, 134, 980, -387, -796, 531, 1254, 455, -593, 287, 1322, 323, -888, 230, 798, -70, -1071, -542, 673, -259, -1511, -299, 585, -103, -673, -403, 830, 629, -597, -37, 1204, 642, -142, -379, 767, 862, -808, -788, 817, 128, -1185, -797, 211, 163, -911]
1906i11P4J418j17j081K35Q43M40n97q38J216P76j664o58J164O13j219j002J299
1924iQ67j671m99J494K20o61k47M49Q75m31p61O70O79k10q90k98J368l51j858
1943a264P81J601j151j341P28J173p14j032J058J198j040l82L57L70N12p95m19
1960c60J249K40j498m60J128O94j789m50K090k20k278O01J631l78p46K88J069
1977H11m19p25Q8N94N78j21j170J89J460j421j532J711J282j604j332J525R05
1994H19j872m26K056K46j093L13J68m2J11j81qQ13K79j360q68J406L22j996M85
2013h28K348j200j998J135J190q86p26J362Q83j197m50N93k94O46K88j162P18
2030D22P53j701j078J383J396j545r86K003J95k521L57K189n29n11O34J06l09
$$ y = [-911, -837, 581, 464, -617, -382, 461, 901, 304, -534, 682, 1458, -206, -864, 300, 913, -306, -1308, -9, 858, -813, -1312, 182, 402, -259, -506, -57, 818, 387, -374, 296, 975, 765, -125, -423, 945, 594, -1264, -483, 1118, -33, -1374, -646, 527, -187, -1219, -161, 1037, -3, -385, -28, 342, 854, 59, -360, 889, 1129, -369, -829, 299, 993, -796, -1246, 844, 624, -1654, -1053, 578, 200, -546, -258, 811, 392, -333, -245, 349, 927, 806, -364, -175, 1285, -136, -1668, 43, 1325, -279, -1611, -86, 819, -1053, -1479, 577, 823, -270, 43, 211, 169, 280, 99, 91, 904, 1183, -177, -1045, 361, 683, -1313, -828, 1520, 320, -1678, -543, 647, -239, -965, 397, 1280, 83, -367, 226, -68, 578, 866, -296, 422, 1175, -526, -1604, -221, 1175, -370, -1356, 647, 842, -1679, -1322, 867, 338, -173, 461, 567, 258]
2047B58l85k25M47N99M76j337p50J650n23k229J494K081j592j304J181Q79j458
2064g38m89J972N49j386L01J85p12O55r4o28J116M68j802r29J446Q16j737m5K523
2083A471q39k628J270J682j081k89J165L18q67m65L27q8N30M16j193k7J239j359
2101d18j608J967J274j612r29J740M19k147J59K319l13j092P74m4n28P0k43K08
2119dP60J08j315o53J377l7j855J055K192j523j640J404P62j010k51J442N52j397
2137c3j02M18m54M36J95p64N36O57j606p18J468O81j558j26J966k00k404R62J728
2156A082q82l29Q33J6m84l81j06L23M48R8j066l23J139n33j701J705J305j497
2174c53p57J328N66j245n19J808L52j266J54L61n06L05m34l10J096m7j270k37
$$ y = [258, -127, -352, 95, 694, 1170, -167, -917, 733, 210, -2019, -525, 1556, -36, -1340, -159, 720, -738, -1227, 745, 1294, -92, 209, 394, -318, 337, 243, -385, 731, 1199, -603, -1532, -86, 730, -1007, -1052, 1471, 632, -1996, -726, 956, -125, -414, 751, 1069, 202, -263, 64, -24, 506, 922, -271, -298, 941, -418, -2026, -59, 1215, -397, -1326, 414, 833, -1314, -1155, 1164, 851, -241, 533, 489, -39, 31, -212, -4, 756, 864, -451, -1104, 273, 236, -1619, -564, 1628, 105, -1535, -131, 631, -379, -630, 812, 1364, -33, -135, 283, -171, 265, 460, -304, 232, 889, -717, -1435, 33, 714, -844, -970, 996, 796, -1608, -646, 1082, 200, -129, 704, 720, 236, -145, -251, 72, 520, 618, -448, -771, 368, -165, -1866, -161, 1144, -353, -1110, 218, 784, -461, -980, 828, 1180, -86, 68, 429, -77, 228, -206, -516, 580, 533, -737, -974]
2192i74J174K14j494L21J972p53j826J219J038o56n78O89O85n87q75L03L88p0
2210A90r4o44M84O10j232o38J557L23j142m8J123K68j342o3J710l50r93L73M85
2229E77j65m35n46N19N58o45o74M03O52l12j118R53J273j313n49J111N27p80n73
2248e37Q57P02q67o07O63J41l39l74q5O99lj173K58R46j30p23OJ181J8j198L88
2269a77J122n32o04J3P29j6q60j46P35K2p82o8M11N25p96n26J181K87q41m9O99
2290C27M77o53o77J117M09j048k49N95J34m24q15N38Q65q37q02P78O09k94q02
2309g52M35J173o04q41P04Q55n88o14J86P32j30j313N12P55n10o45j5Q17O9j057
2329h31J51J132k27p02J97Q33J40r25p3J054r2j001J59M38J24p17l66Q95K38j115
$$ y = [-974, 200, 414, -1080, -759, 1213, 460, -1366, -147, 891, 235, -343, 346, 1031, 444, -431, -128, 260, 190, 96, -548, -64, 546, -686, -1324, 233, 556, -586, -634, 489, 757, -585, -648, 1062, 712, -281, 92, 577, 412, -23, -569, -50, 508, -137, -811, -408, 244, -68, -1186, -233, 1040, -273, -822, 289, 816, 36, -537, 320, 1022, 155, -452, 211, 352, 13, -361, -446, 253, 250, -923, -665, 281, 151, -572, -566, 615, 633, -565, -177, 945, 413, -191, -178, 551, 535, -325, -471, 264, 286, -496, -564, -153, 372, -424, -950, 231, 518, -323, -372, 327, 804, 151, -526, 591, 1000, -48, -297, 298, 432, 8, -807, -269, 596, -241, -1043, -265, 344, 50, -752, -317, 856, 252, -589, 115, 970, 382, -232, -46, 686, 556, -757, -245, 510, 0, -645, -660, 157, 226, -831, -680, 452, 225, -477, -280, 553, 693, -232, -305, 749, 657, -344, -185, 253, 377, -340, -706, 189, 427, -688]
2349f88M8P09J69n72k84R21N46j012k05Q95Q2l83m20L52P67r78n99P37K87n07
2369a35n19K27P23l89q73P81Q29o89m34M46O01P7j156N47P49n87m53J37N07o4
2389C25q24Q2O76k55p24K21P04J13q08j48J125K22j126K59P23J98r26j53J052
2408G36j2j234J16P28j81m60l98M70O46p45l93O36N73m29o92O09J000q50q23J222
2428E19L33p69n26M40N68o54n95N93L08l66k89j47P35L06j113K76J161l92p45
2447c57J17Q99q3r27K11J110q07r01N80M07l04l13JL75R8o72R4M63M57l76p19
2468f47J092L95j204r9J343k05r27o6P24K9j014J72O13j28k60k67j33N34J02p73
2488g19P02R33n63r24M21J111o57r42J023N91j247l20O87k9k47o0K0M13l47j66
$$ y = [-688, -640, 69, 238, -334, -618, 303, 849, -163, -368, 527, 609, 226, -194, 158, 925, -53, -652, 85, 372, -135, -654, -427, 296, -93, -966, -185, 644, -45, -479, -33, 568, 645, -511, 36, 785, 198, -255, -118, 389, 325, -499, -417, 259, 4, -720, -499, 205, 318, -490, -638, 487, 709, -417, -158, 565, 763, -163, -316, 736, 724, -510, -394, 334, 153, -307, -705, -235, 411, -334, -727, -91, 482, 53, -639, -30, 970, 120, -703, 519, 852, 83, -443, -3, 565, -89, -684, -91, 217, -149, -438, -585, 150, 456, -657, -381, 780, 388, -357, -240, 659, 576, -351, -140, 970, 163, -738, -158, 249, -55, -368, -367, 8, 106, -566, -472, -9, 448, 72, -647, 445, 840, -364, -463, 880, 675, -252, -318, 406, 435, -579, -407, 206, 78, -182, -449, -582, -48, 54, -719, -17, 916, 353, -571, -150, 961, 304, -638, 385, 976, -271, -591, 96, 67, -180, -240, -220, 193, -154, -320]
2508c20j69M51N62n89m00J194l1j475M62J207l35j009M59Q10p92r40P07L81l10
2527a37J73k33j75O05n01m51O72Q10l22j042Q38P32j311n26J757k3j322P8O48
2546B70k83n83K06M39k8m8k60m22O16O30j024J64J381n88j259O09J046n23j021
2565f78J024O92j378n41R43j86j79L31j95R4J24l07l84O27Q16n30r06J232L36
2584I35j710K26J381k56j046L54O76p84o71O26N00l97K85p9o06N69J15o75O20
2603F3J030n90j106O45Q60j003q06J474L51j506K4O75l36l17L88K14J11j25k14
2622a68k74L64Q40q52l27J337k14j648O09J244o70p62N62N53r04o83R67N8l69
2641c37M99k53j20M49m27k96P24O68o72o67P76N52j433l46J602j25j157K55O28
$$ y = [-320, -489, -38, 524, -65, -465, 729, 698, -777, -315, 892, 557, -452, 7, 817, 25, -915, -208, 173, -137, 36, -197, -372, 233, -268, -719, -47, 763, 441, -601, 237, 969, -342, -868, 889, 866, -456, -378, 270, -13, -596, -390, 49, 21, -27, -287, -709, -93, 537, -487, -323, 1058, 470, -789, -180, 866, 343, -678, 346, 1038, -340, -881, 62, -124, -303, 28, -167, -73, 51, -256, -640, -13, 803, 273, -633, 599, 935, -775, -549, 832, 576, -470, -116, 560, -224, -895, -269, 231, -166, 119, 40, -566, 3, 118, -557, 63, 1093, 503, -603, 42, 902, -101, -907, 567, 918, -588, -564, 111, -225, -542, -154, 60, 171, 46, -168, -442, -78, 762, -90, -417, 920, 706, -942, -333, 911, 241, -521, 41, 594, -310, -993, -26, 32, -337, 162, -91, -211, 238, -189, -485, 239, 907, 235, -432, 344, 896, -537, -883, 719, 594, -563, -308, 320]
2660C20m74n41J83O58k1q9j19k23L06M01o67J53J098o03j068N83P65o06q32J009
2680B33M00j036l18O95r9r3J13J49J36n5k90m6N27K46m71m44J009n8j387L47J183
2701G41o42n58K11O75n34p13N51N07l02j9LM0K38j42m97Q26L49o80m95N38M22
2722E19p44m06J059o8j071K04O80k33j48q7K99L68l54k29K00M42m8n35K2R53p04
2743A19p14N30N37l64n85K95M27l49o08N61K80k69j1O1K06K08m25p5O11n8m13
2764c6j81N19J42q58j14Q83k34o54J17M55M3m13j28O49K5m64J47K87K15j12m74
2785a86L17M76o18m14O09N4m87k54M43L55o24l21O81K19l44k57K63N36k22m88
2805b62M86L63m44l96J84M21j52p77M48M86m56l74K33L48q2n19K42O14j57l99
$$ y = [320, -154, -695, -512, 146, 125, 36, -83, -306, 0, 401, -266, -113, 985, 382, -686, -103, 662, 56, -776, 233, 633, -403, -721, -26, -125, -218, -105, 44, 180, 125, -165, -211, 316, 562, 91, -353, 656, 598, -789, -442, 741, 99, -459, -248, 427, -107, -820, -269, 238, -64, -83, -80, -40, 198, 56, -441, 385, 734, 54, -441, 97, 519, -225, -631, 428, 360, -711, -507, 173, -60, -208, -295, 4, 372, 18, -211, -11, 431, 383, -152, -130, 823, 119, -595, -65, 472, 108, -477, -182, 245, -104, -712, -151, 129, -140, -151, -90, 116, 324, -101, -176, 435, 377, -36, -217, 302, 444, -414, -528, 355, 121, -533, -416, 39, 82, -331, -459, 190, 215, -249, -102, 185, 400, 288, -186, 131, 607, -11, -425, 184, 238, -249, -503, -60, 295, -329, -650, 31, 250, -94, -351, -88, 448, 226, -262, 224, 587, 143, -253, -69, 352, 200, -577, -129, 357, -99, -473, -240, 108, 26, -493, -251, 363, 206, -193]
2825a93K50L56P4o57M8N66k33l60r5K88P3l55l69N92Q8o62K23M83m1j85k22M25
2847I4M15o51o7N69j00j36k44K07K77m31n27O18R4l12j56Q3N18l62l38M63L19
2868C33k23k62K49L28o6o61K86M68l15l08K1K70K5n97M0O09j95l83P2M25J42n01
2890b43J13M93p2l95J46L31n7k75k51M35J31p44l7N99m4l05l05M38L51n28k06
2911d25O70j2l62l9L29L26l96l34M66J85l61k87P4M62k25o68N02L43m51l89M10
2932a82L79k38k62M22L07l34j20O8J44O3l02k15O35k08n70J32L20J12n52j83P80
2953A96k13n53N25M55j98l46L8L05jk19J6Q2K24k17m85L67K90m86l96P97J43n23
2975a99l26O27K98n20r7O58k00l63K00qM2L8k40J6L64k9o29K9N56r5o78L19P51
$$ y = [-193, 57, 413, 487, -170, -122, 444, 211, -149, -244, 44, 117, -238, -607, -15, 73, -589, -366, 117, 76, -109, -331, 94, 509, -142, -209, 360, 260, 124, -120, 87, 364, -67, -594, 24, 118, -194, -350, -267, 251, -111, -449, 14, 333, 110, -152, 97, 425, 359, -302, -16, 452, 137, -171, -150, 120, 145, -452, -412, 197, 2, -381, -309, 116, 258, -243, -130, 363, 291, -104, 42, 373, 316, 41, -210, 225, 356, -388, -425, 174, 130, -175, -480, -42, 309, -219, -425, 245, 233, -129, -168, 161, 487, 91, -243, 223, 408, 47, -240, -166, 296, 71, -597, -95, 248, -203, -592, -182, 197, -41, -303, 119, 426, 92, -28, 40, 184, 247, -55, -270, 365, 157, -413, -281, 39, 151, -401, -584, 196, -17, -570, -45, 410, 212, -134, -96, 209, 208, -11, 5, 87, 311, 94, -391, -24, 266, -220, -616, 181, 324, -199, -525, 102, 400, -120, -217, 441, 241, -122, 78, 70, 112, 150, -90, -74, 290, 261, -368, -339, 217, 122, -556, -237, 514]
2998E14o60n30O84L97m79j28M63j6p2k25M6R2K77j94n56L83L51p67j57Q58P6o58
3020c01j7N86n6p82M07P93n12k28K17J8o1J84l32J79Q8m1m85p8O50k58p01Q70
3042A40M37p97l24P67P6m97J08O00j90m65J29M4j30M25k30l13L87m7p48J09O75
3063A56J38p65J07R70o37p01P08M52m44O4K56j55j09q0J23j7K12j13n72J63L82
3084A38m37m21R72L60r97j6O89k4o98K67Q53m27m39L45k18mK26k52p3L86j18o25
3106e13O3N98Pp10N47O44p22n53Q60K18n42J46L03n1m39jJ44l3K05p5m53J97L36
3129A76o23j25R02P3o77J6O70k74o82O93N55o52j20L40k48k06J15m8M6K12j80
3150c7l16K9M90l66l57O97M55q80j35P29K2l58r4O12n4n97R7J51l01M22k72j67
$$ y = [514, -146, -676, 8, 405, -74, -202, 261, 245, 173, -52, -6, 86, 363, 169, -387, -4, 347, -420, -577, 281, 357, -301, -318, 268, 212, -570, -163, 630, 118, -110, 107, 125, 64, 248, -84, 95, 183, 142, -343, -421, 229, -29, -730, 140, 577, -220, -544, 223, 299, -198, -90, 510, 320, -145, -16, 28, -102, 323, 93, -220, 167, 120, -628, -519, 156, 294, -471, -364, 606, -31, -732, -24, 428, -16, 48, 304, 149, 40, -40, 83, 66, 278, 165, -407, -244, 138, -299, -720, 252, 612, -385, -401, 288, 264, -434, -167, 686, 259, -180, 165, -53, -57, 169, -83, -156, 230, 112, -513, -450, 148, 155, -555, -8, 636, -86, -639, 221, 439, -103, 43, 346, 295, -144, -145, -1, -34, 171, 96, -357, -160, 176, -447, -572, 330, 403, -274, -258, 412, 138, -544, 149, 704, 52, -68, 272, 24, -182, -67, -115, -69, 143, -37, -353, -324, 166, -200, -557, 140, 595, -285, -420, 309, 331, -27, -121, 491, 437, -160, -63, 88, -213, 209, -63, -230]
3172b30M30k36m59J78N24l9n73K27P97n06n35N04M55n35J2J71l3k22j40J08O2
3193d0N4N7l40N9M16m81k92Q33J25o86O7N62j7n60J50N46k53l81L26k04K5k5j99
3216b58K39K00l00k35O2N57k58k79L46M00o00k01O34j26k34J0J87J23m14p1K48
3237C0o2J8j79k9K96N9n28K70L27L3m41Q3M64j94m21K56M66m35j77J96J41j62
3259A1l09P6L42p0k28KK59O8l38j72O27J20n10j47M98o0k65j2K41K55o18R2J74
3282C6kj27k77L19J45k37k24M44J18j21k21J38L98k98l39L69J53k73j44J67J11
3303A35j22l01J58K07j57j66J22J27J38k51r2N33l37j60K81J27J5k80j74M04p4
3324A33l32P0K51o4k12k38M40N1l35M0K70Q5j11n6J65J69l81l5K96O1l08o7J65
$$ y = [-230, 200, -36, -495, -317, 207, 168, -405, -178, 619, 113, -422, 82, 537, 2, 14, 185, 152, -70, -210, -102, -40, 14, 71, -269, -210, 206, -275, -567, 266, 391, -295, -228, 334, 317, -243, -93, 453, 200, -181, 145, -59, -34, -59, -258, -19, 181, -119, -354, -292, 265, 7, -272, 74, 474, -126, -327, 307, 181, -53, -43, 144, 267, -147, -218, 30, -32, -14, -193, -222, 74, 133, -395, -125, 202, 235, -206, -123, 341, 147, -274, -18, 448, 13, -164, 32, 173, 11, -298, -222, 120, 50, -178, -176, 83, 151, -187, -359, 268, 388, -122, -269, 229, 169, -96, -108, 133, 388, -230, -138, 36, 34, -93, -370, -51, 94, -143, -367, 77, 195, 74, -147, -9, 389, 91, -248, 121, 274, 1, -143, 24, 135, 13, -288, -130, 77, -80, -246, -124, 3, 141, -110, -202, 331, -6, -166, 115, 242, 257, -23, -197, 207, 133, -199, -129, 122, 58, -154, -392, 48, 99, -236, -196, 74, 159, 48, -8, 157, 326, -55, -90, 206, 267, -41, -108, 57]
3347E7p0j38j08K56J86l59m8J18K24j86j01J38K67k35r8J74J57j10l19J10M36
3368C51l54k51J76J47p0j80M4K36r5k61K53K02r0j52r5L27P2m37J46J56J41m13
3390a47j02L75J7l28r5K50qj45kJ62J82k86NJ49K14k84o7K34K04k86k39L48J15
3413B66l48j9J00O5r5k03P8J39j0j47Q4J47M1j91K2N26l86j83K16J02k2l88O3
3436a43L57k05m23L10J07j59J8q2J63R6k55R9L24L7k18j47K22K49n47J40K09o6
3458H6k43o7L34j05k10j8K84j57J01J0j17L22q8m13K90M16m30j17J85K31j96m21
3480c23N38k0l52l4J76rj35J77j46K18l1j76QK64J24k80j77M56r5n22K98L55k42
3503G2l22J70J19l6l61K87J62n2j8p2k4J23o9j06K90L01l64l72K71K34k90k43
$$ y = [57, -13, -151, -259, -3, 183, -176, -224, -106, 118, -68, -169, -31, 236, 1, -97, 77, 234, 124, -195, -85, 351, -3, -254, -78, 69, -1, -181, -137, 99, 4, -257, -4, 198, 108, -44, -139, 188, 260, -177, -31, 125, 266, -147, -249, 126, 143, -185, -280, -30, -38, -183, -185, -23, 159, -127, -122, 27, 241, -43, -110, 124, 328, 42, -197, 151, 266, -82, -101, -1, 64, -31, -234, -156, -17, -27, -174, -90, 57, 98, -93, -71, 455, 69, -114, 102, 204, 182, -206, -143, 214, 9, -414, -104, 3, -156, -138, -220, -57, 39, -216, -117, 207, 244, 26, -121, 101, 350, -197, -57, 152, 86, -157, -224, 110, 5, -205, -223, 61, -96, 5, 15, -102, 220, 132, -281, 9, 425, -5, -122, 63, 294, 98, -323, 215, 195, -157, -191, -15, -24, -159, 18, -128, 90, 59, -117, -109, 155, 279, -1, -178, 278, 183, -339, -41, 314, 72, -250, -80, 39, 3, -358, -71, 91, 39, 21, -51, -75, 48, -21, -127, 163, 464, 100, -272, -1, 233, -57, -300]
3525c00N93k02l74J45J80j89J3J0J71L1j47J22k48N00l6l22QL71k40l78L13K74
3547B95l85j80M06N1m22JL62j06j00Q1j48Q2J65k06M8K22J77m32j31N18p9n73
3569c54K58M39k44l76J93O7p9m2K01N5j70J77j96j65L03J75m00K99K38m11j80
3590b12L25J83m20j61N77j38m15J45R9j29L7J89p2j3%j5j63L48K0j52r2L21j93
3613F9m47L39L29k96k42L00m8j82j43L88rj00J31q5l0J13q2j96L23K18l78k25
3635b53L91K03o52J76M67l83k64J74K13k05j5J26Q3o2M4p8k1J94J05l78J69L53
3657C87l58l68M13K48m70r9L82M8m83O6K81q2L6J77j89J33k5j01l2J56M6k08k27
3680b69M77r0l68K32K92l95j21K71K3j40j2J29J12k16J45P8j64J58m8o8K08j04
$$ y = [-300, 293, 91, -283, -138, 42, -147, -134, -124, 47, 78, -69, 53, -195, 305, 269, -53, -45, 326, 86, -292, 21, 295, -90, -270, 136, 187, -235, -234, 128, 22, -78, 3, -145, -63, 102, -104, -56, 166, 343, -89, -220, 298, 219, -354, -96, 343, 99, -277, -84, -17, -96, -138, 63, 118, -52, 125, -71, -236, 67, 242, -158, 141, 379, -32, -212, 113, 296, -124, -285, 292, 154, -261, -116, -17, -146, -109, 80, 8, -5, -5, -20, -183, 165, 185, 33, -59, 262, 69, -378, -39, 290, -6, -248, 52, 4, -178, -321, 67, 58, -42, 89, 4, -26, 87, 5, -191, 132, 350, -28, -253, 138, 341, -311, -135, 332, -51, -315, -141, 72, -133, -148, -22, 61, -1, 43, -35, -56, 138, 243, -135, 34, 387, 29, -339, 74, 322, -148, -247, 135, 183, -300, -234, 47, -35, 1, 178, -11, 122, 97, -4, -36, 120, 166, -42, -269, 208, 118, -250, -18, 274, -121, -242, 29, 52, -88, -100, 29, 141, -75, 70, 148, -16, 142, 94, 26, 234, 130]
3702A30k91J7J24J20j66j49L29m1l61K16K09r9j07O6J5K40j76j23R2L9Q0j62j7
3725a5J99j08l59K52K45k52j46J96J10j92q9K79mj2j00L0j8K09l07L0K83k55j18
3748a42L9L66j39k38J8L03j55k26J09K26p4q2OrN3q7J09r4Q4k5j76K04O9l03l4
3773a98J59O7j91k8K50J19k61m0K63R8k15o6J69O2j59p1N3J9k6k4qJ94k01j50
3797a85%K65k03K9K6J68j38MJ05J69j29j55O4m7J21j76q6L16Ol41J34M0p8L2r3
3822a52J55N4k81K94O2l2j33r4K55n9q0n7K75j66k8j51K14l2k51K8J75k6o3n9
3846a52M7K61j36p8M2K06j35lJ50K5j51k02J89N9j53j25J92m2J2j37j13K68l7
3869a3j39J56J60Kk61Q5J31J07l08L5J44m9j64MJ31J31k06j01J35J12j33m7J86
$$ y = [130, -161, -144, -20, 100, -66, -215, 114, 73, -288, -72, 137, 38, -69, -3, 12, 252, 76, -47, 45, 84, 164, 2, -15, 184, 76, -283, -31, 214, -38, -184, 12, 122, -70, -159, 120, 116, 104, 4, 34, 16, 225, -82, -52, 231, -24, -142, -103, 263, 124, -114, -96, 207, 52, -174, -65, 161, 87, 5, 11, 2, 55, -32, 77, -17, 67, 42, -134, 70, 139, -164, -198, -39, 28, -163, -191, 59, 178, -83, -123, 140, 238, 23, -43, 126, 188, 29, -42, 11, 30, 4, -20, -28, 166, -35, -185, -185, 80, -123, -94, -68, 100, -38, -34, 71, 240, 111, -44, 20, -27, 94, -82, -168, 148, 154, -187, -53, -13, -91, -59, -152, 3, 57, -224, 70, 132, 100, -33, -127, 128, 69, -11, -68, 207, 41, 13, -138, 76, 44, -207, -179, -4, -30, -93, -152, -105, 156, 20, -58, -16, 190, 55, 52, 202, 227, 76, -126, 63, 122, -31, -156, 36, -6, 6, -131, -244, 24, -13, -152, 4, 164, 166, -95, -10, 121, 228, -80, -45, 99, 50, -114, -110, 21, 152, -54, -155, -20, 92, -41, -88, 98]
3892I8J17l27L1K59j16q7P8o8Q1M0k23K54q7j20J2N8j3k3j68J70J86j93K6k8J53
3917A10j66P3l2J10k8j22RJ23n2j1j34K67j46k11J02J84o8q0O8J10r0q8Q8J30
3941A46j86m8K7Q8R9k12k6R9l3P2k46K13M8o9k04K43Q0j21q9K08M6r1r4Q8Rj25
3967g8P1L2l1K2j39L9J59m2j59k6K01Qk10J17J02n6j56L17q4j27K0J51k6j05j09
3992a09J02L8M4j47j11J35J54k00p9K26M0k32L1K20r3j07K51P0k96oJ00J83r4
4015A20n2j17k5Q6%j04J23J54j90k26L35R8m17J22K70k7j45L6M5m6j50R0J15p6
4039A9R0j27j87K11k9j45L6K82l1k30N8K35k17k07L96K2k75M2J16l4Rq7n2Q3R4
4064G2j14j95K33K81m03r7L25Lj92j4K60j14r3Q8J65k56n4M7J14j42J64j93j1
$$ y = [98, 215, -112, -81, 178, 62, -25, 53, -15, 66, 106, -117, 137, 50, -70, -58, 0, -13, -36, -204, -34, 152, -41, -15, -43, 110, -56, 17, -15, 95, 67, -55, -46, 77, 25, 14, -120, 147, 1, -210, -108, 76, 8, -72, -4, 106, 16, -72, 16, 146, -40, -88, -61, 27, 126, -86, -112, -13, -46, 26, -220, -7, 41, -28, -232, 11, 91, -30, -119, 89, 135, 44, -50, 38, 47, -78, -7, 25, -6, 16, -123, -84, 75, 33, -126, -152, 49, 57, -153, -36, 66, 10, -146, 171, 87, -40, -20, 131, 105, 0, -109, -7, 31, 75, -72, -183, -48, 106, -94, -173, 53, 93, -139, -108, 112, 19, -88, 163, 233, -63, -69, 31, 214, 120, 68, -49, -74, 12, 12, -92, 31, 185, -5, -231, 104, 202, -215, -93, 177, 150, 5, 41, 86, 40, -110, -20, 95, 19, 109, -18, -205, 6, -23, -168, -132, 150, 119, -111, -53, 182, -35, -242, 154, 176, -99, -57, 59, 25, 34, -53, -105, -22, 72, -42, -237, -4, 277, -126, -223, 102, 105, -87, -101, 159, 45, -48, 40, 205, -51, -105, -58, 56, -86, 78, -115, -126]
4087a26O6l2j07K30J08j75j49K11P9k07J17J23o6j16L7O8jj03P3J9r5N6K7k50
4111b13K08P1k02k2L18n5k82J23J85l5k17K32l9n5l1J24j92N7j6L2m1n8J66k85
4135b27J97O7q3kJ57O8k53k7K89k45K2NR0m1p1O2q0k1J09o5o6J03O3k49J19J64
4161H5M7j80J36R5j49j74L95j06j94l7R2j39J06L8k5L3pJ1j09pK32k05J7J76q8
4186D3j68P0J48r2j4J25p9j49K7J61j16l3J09n3Q5m7l6j46K00o3L7j47K44K1j28
4211ap4L15j60n9Kk0L9o8n5K7n2L2J06k03J89K6j43J28M8L8j98J43J29j79o7P1
4237A4J47j93P0k3o2k6R0p3O1K0q3p3J41K3L7j71J25J69l05M2K30j00n3j0k1M6
4263B2o0m8Q4P9m2j23J07J27j34j37K46j12m8J6K00K6k66J08N3n2p0K8k3o2R9
$$ y = [-126, -60, -92, -199, 31, 139, -36, -185, 26, 105, -102, 15, 138, 72, -44, -7, 61, 60, -43, 30, 49, -46, 10, 37, -213, -5, 66, -136, -158, 160, 105, -177, -54, 131, 96, -121, 111, 72, 17, -14, 110, -82, -25, -41, -9, -50, -108, 58, -227, -30, 37, -46, -48, 109, 177, -76, -103, 186, -59, -37, -32, 58, 17, -54, 8, -72, -93, 16, -49, -115, -12, 51, -198, -79, 85, 132, -48, 88, 183, 34, -140, 255, 149, -45, -82, 10, -129, -23, 15, -10, 23, 16, 27, -82, -89, 143, -62, -45, 131, 43, -125, -55, 93, 1, -13, 112, 33, -116, -89, 72, -44, -77, 32, -21, 64, 17, -19, -165, 35, -28, 9, -138, 106, 127, -1, -75, 240, 80, 21, 23, 3, 42, -26, -81, -54, -106, -74, 32, -171, 18, 44, -99, 29, 77, 115, -83, 60, 189, 10, -57, 14, 161, -32, 38, 15, -47, -73, 17, -56, 5, 25, -58, -131, 10, 33, 70, -101, 24, 193, -112, -70, 160, 60, 7, -3, -24, 22, -38, -86, -2, 77, 35, -88, 19, 146, 12, -125, 121, 9, -39, -23, 177, 203, -63, 45, 98, 46, -24, 4, -19, -81, 18]
4288A8j96J11O0l1o7J34j32J27n8LJ41j08M4j14L8k2q3J42qK0j26jM6P0j6j60
4314a68J68k2J23p8L3J8q7L3oK55k96j4J53j58o1J45j0j17P3j15J98r7N1K5j30
4339h4J16J8j63J10J24j81J38l8N8k13q7P6K01q6n0J3P7qj65J6J63K6j75J21J65
4364A72j14n4l3J80k01M2LP9j2r3L9j9o6L7r8J36J19j74MJ12o3l3pJ76j30K3j4
4391A1n4K4M3k01K15J3j07O9oL0P7j35L3O9r4r2J40L1Q7k09j9K32j17K0o9mM6
4418C3p1n2OL1O1lk6LQ7j42J17n9n1N7l0O3j45Q0J23J1j36k4J77j30j02J22K6
4445B6J8K6k18J22o0R8mp7J96j23m1J20N0k94J05J72Nj48m3J4pM5o8R3k5J6m2
4472d4J6L5K9n4Q2m5K8J6j4N6q5j94J63J02j60n3lK84k07r0M2K58r4n4l6J28O7
$$ y = [18, -178, -67, -7, -38, -105, 29, -103, 24, -34, -31, 110, 2, 46, -68, -30, -52, -135, 7, -1, 19, -107, -108, -62, 8, -8, -168, 0, -22, 101, 23, 56, 74, -13, 20, 14, 269, -27, -41, 112, -46, -107, 38, 28, -89, -16, -131, 67, -30, 21, 46, -84, 32, 50, -113, -3, 121, -60, 78, 40, 98, -115, -202, -126, 75, -11, -61, -48, 29, 21, -144, -128, 35, 61, -114, 7, 172, 58, 4, -29, 151, -50, -8, -5, 74, 62, -31, 8, -11, -77, -40, -138, -2, 117, -57, -53, 59, -4, -37, -44, 132, 2, 25, 11, -43, -19, 24, -177, 38, 51, -56, 13, 7, 37, 114, -21, 12, 81, -13, -105, 35, 66, 153, -56, -75, 157, 40, 60, -9, -13, 33, -38, -90, -84, -53, 8, 5, -21, -18, 69, -73, 44, -15, -66, -9, -39, 24, -121, -41, 82, 93, -43, -67, 110, -20, -122, 0, 26, 44, 70, -148, -26, -86, 12, 8, -69, 127, 4, -37, 83, 133, -161, -56, 116, 121, -27, -70, -56, -63, -18, -86, 7, -18, -2, -44, -28, 7, 36, -18, 64, 19, 47, 63, 49, 105, 20, -174, -11, 91, -69, -122, -125, 159, -48, -138, -96, 162, 68, 14, -22, 106, 173]
4499A73j46j37J18M4j12P6k4J61l05M2N3mn6J25o0o8K17j02o2K9M6K9J0O8j02
4524A3Pj14J57m4j64K15k0k5k9n7Q2p0k9J22p0J42j11Lj07O0J7q8K69q0j82m4
4550a47O9J15j32J72k1j47K3O2mj9J6KJ0nj6m2P3L2M1j01k5J76j43J53m7r2j48
4577a45M7P7K9p5J27k2p8J50r1Lj21Q7M6n4M1J12j03n8N4r5j8l0K40j71k1m6J12
4604cj33k3J25l3O1L0Po5O0L9j12J40jj69JK4Nq2J46J9q3M8L3J1L4n6J4O2k04
4633a05R5nJ57k13J07j76J52L8r9r0J97m1j24P4J8K0j25J40j1r7O9P3p2l7J87
4658A32j40r0J80K4r7j34J68j41K6j7P1q5P9J31o1j22M7Q6j38J32L3j74R7Op7
4683f4pj2K53k76J33l6J08n4j4N7r3p1J7J10n7N0J4N0K9p6n2L7m9nj04J60op4
$$ y = [173, 27, -110, 8, 52, -60, 16, -8, 153, -152, -110, -57, -61, -117, 8, -52, -120, 97, -5, -67, -38, 8, 37, 47, 115, 13, 20, -94, 63, 19, -145, 70, 50, 25, -4, -61, 21, -49, -78, 44, -26, 116, 5, 8, -99, -39, -22, -110, 159, 79, -103, -147, -78, 37, -95, 77, 56, -91, -68, -6, -10, -29, -13, -11, -1, -6, -22, -64, 9, 41, 82, -19, -44, 132, -11, 142, 95, 3, -145, -98, -21, 8, -67, 60, 38, -40, 110, 19, 22, -99, -12, 34, -20, 21, 133, 30, -28, 26, -69, -87, -117, 123, -48, -69, -115, -3, -136, -159, -34, -67, -6, 24, 31, -34, 26, 65, -47, 93, 92, -77, -76, -52, -47, -129, 17, 36, -47, 1, 34, 45, 79, 23, 37, 99, -105, -10, -15, 142, -71, 36, -140, 12, 50, -49, -139, 58, 17, -107, -33, -15, 5, -120, 20, 9, -88, -19, 54, -18, -55, 132, -8, -98, 82, 106, 9, -125, 43, -98, -72, -89, -18, -103, -24, 107, 46, -76, -29, 57, -81, 51, 84, -90, 7, 13, -64, -71, -83, 170, -106, 27, -9, 99, 45, 31, 88, -5, -76, -59, 51, -6, 44, 58, 108, 137, 61, 9, 46, -3, -8, -112, 48, 42, -32]
4711c2j21J81L3ml4p5N7k1P3n9J7O0m8N2j25J13KK7j35k9K8j4k7J06qj52K34k34
4739a35J06O4m9J2m6O7M0n0L1n2P5j83J10o2Q1J30j99l0J19M6q5l9K1k5j22J19
4765e6Q2K2m0l0qK9p7J99j49M4qJN6j35Q9j48P0rK5P7L2kk5l9R0j74N7N4J1m2
4795dJ48j24LN6oj64pJ27k1j25R4K5o5j2K10j48l1J27jo5J0L5m6J09o2j36J64
4822I1j37Npl5K2kJ15j19Q6J18r5l0l3j7K0N8M0r0N7n2j3J85k89J35q4J78n1j08
4850e2J7N7j16J17k4R3j58o4J31k6Q7j15n0J15r9N1mPkN1o9P5J04l8r1K3L0PK7
4879H4l6j13P5m5P8l7j5M4l5j46K7l0J01L8L3JN9m0O1j32J01q0n2P3n0l3R7j0
4907A8o0J17q9K6k0nj00J17o3J68r5l7N3L4k3j57R7Q0p9k4N2R1j2n5%Nrr3p3N4
$$ y = [-32, -153, 28, 61, 57, 23, -52, 5, -16, 57, -2, 15, 75, 27, 79, -46, 67, 69, 96, -39, -68, -40, -54, -81, 25, 17, -135, 99, -135, -29, 35, -14, -2, -48, 19, 59, 9, 40, -12, 63, -120, -10, -72, 9, 139, -60, -90, 29, 75, -10, -49, -28, -53, -175, -56, 26, 48, 8, -22, -30, -1, -78, 121, -28, 16, 8, 9, 65, -70, 19, -129, -59, -68, -43, 34, 66, 64, 39, 0, 90, -84, -27, 27, 38, -4, 144, 20, 23, 79, 73, -91, -98, 29, 8, -117, -23, 2, -63, -75, 135, -13, -44, 83, 82, 17, 27, 62, 16, 125, 63, -73, 91, -46, -41, -48, -83, -61, -63, 52, -67, 19, 137, 42, 12, -21, -38, -18, 40, 80, -10, 47, -5, -18, 167, -122, 13, -71, 107, 56, -52, -35, 22, -94, 23, -1, 92, -66, -130, 1, -25, 62, -53, -103, 12, -87, -36, -40, -33, -35, 16, -53, 22, 126, 88, -3, 20, 50, 57, 84, 48, -65, 10, -35, 43, 6, -9, 35, 0, -146, -119, -149, -48, -10, 23, 24, 83, 43, 104, -28, 73, -7, -59, 14, -36, -69, 28, 18, -42, 75, -14, 12, -8, -13, -113, 4, -59, 109, 14, -23, 30, 64, 41, -116, -19, 61, -18, -42, 10, 101, 89, 34, 34, 39, 30, -63, -136, -82]
4937h2J26n2n6M8M0m8j32J00J06p2l0JJN2M7p3J05n8p8M2lk2P5P7k23J69M0j27
4965b7N0n4K3O1Q6j21o9l3K92j48qk23K21j12j6J5j0L2Q9j05J04n3K3r1J16m3
4991ak2P0r1M5N0j66O4M6k0M8j05P6M9p1P0%j29J24mL5j01K33j67l9l2nN5p6L9
5020b5P8O0j18j5k6j5J09q0N2O4k3j55R1K6Pk6J2k4qj11J25r2R3J13r6j43J21
5047fp7K2N8M0L0m7kJN3r2N2o5M3k2k5J02j8j67J86j6q0R6q9k3k3j9J49k6q6J15
5077F4q5N2N9k8q6K0m1P3j4n2n3J14Pj30Q1P4k8on8O8j22J15O0j4j40R4M7Qq1
5106bl9K8m5J40j76qO3K8p0j0M6j5P4O4j11m3K21j43L5j16J29l4J1m7J29j85Q7
5133A1k8j6R8j61J57N1j13j39J87j9o9J08P8j62J15q6Jl5m4J49j49J09p5J3P6
$$ y = [-82, 44, -8, -64, -16, 24, -24, -156, -56, 50, -22, -52, -51, -50, 2, 49, -24, 81, 23, -55, -13, -16, -38, 37, 114, -109, 60, 100, -27, 23, -31, -8, 53, 139, 18, -51, -84, 208, 60, 52, -171, 50, -62, -78, -63, -73, -41, 48, -57, 47, -6, 17, -74, 42, -1, -23, 47, -44, 1, 51, -115, -51, -5, -25, 23, -82, -6, 43, -28, 42, 42, -87, 37, 33, 68, -33, 200, 33, -6, -38, -43, 12, -64, -25, 53, 113, -5, -20, -46, -61, 48, -32, 20, 84, 61, -94, -3, 23, 30, 4, 16, -8, -16, -127, -2, -94, -1, 112, 16, -127, -6, -83, -61, -3, 37, 67, 20, 18, 19, 72, -20, 32, -33, 10, -12, -37, 65, 47, -120, 66, 50, -30, 66, -23, -46, -69, -88, 61, 35, -51, 64, -21, 31, 90, 62, -24, -4, -45, 28, 14, -38, -91, 23, 30, -100, -19, 55, 27, 21, -37, 31, -91, 24, 84, 70, -70, 24, 71, 79, -2, -41, -13, -58, 82, -94, -102, -39, -11, -81, -91, -45, -60, 14, 78, -33, -76, 145, 2, 37, -79, 50, 16, 27, -20, 109, -76, 11, -17, -33, 65, -96, 61, 112, -1, -140, 47, 28, -41, 67, 145, -17, 98, 12, 13, -22, -66, 83, -66, 43, -32, -19, 57]
5158E7q9o2J5Q8M2o3m8R2p3n5J83k9r8J80j39rJ05J2k5j63N4P2j37q0R4O9M4j9
5186A8j47R5N7m2K8L4kl9n8R5j4p8N0om5J57k2q2R4j05n5J11m5K2j12R1J13p2
5214D1KK1K3p4L3P3n8o9M7M5j40N9j4jj3L0k9q4J7KJ75q2q1J73r9q3J30m8M7n7
5244a4l4Qq4K46j47K1Kj02J72j48Q2L7K5n3korQM1q4rR9j4k8o7Q2k7M3q1N5o1
5275d9L6M5Jq0J52j96K32j99M6l3pPL9n5Q9q4RK9o7O6M1K7o6QL2J9j46K03m0j2
5305D7n7P1j20J34l6j53J22K4k8O0l2P3j51O4o5m9J45j17J16j3M1m2n2p0k9J50
5331C3L8j3jj8q4J6n9J09m8k2Q4j23R6JO4j13l7O8K3M0j36J0J05l0pp2j4L7J30
5360G7j62Q7J02k00P5L6qm7L2Ok8J46j01m3J09n8Mo8j18P8J27j27J78m9rj18j9
$$ y = [57, -32, -94, -79, 9, 51, -12, -60, 32, -41, -96, 87, 58, -40, 140, 1, -8, 97, 109, 84, -79, -25, 47, -90, -170, -76, -7, 37, 18, -129, -34, 23, -19, 9, 43, 41, 2, -56, 39, 25, -53, -3, -9, -54, 103, 81, -1, 93, -12, -67, 44, -1, 21, -91, 0, 113, 41, 43, 64, 87, 13, 46, 119, 61, -8, 39, 84, -56, 3, -11, -12, -25, 5, -24, -108, -91, -89, 86, 4, -77, 96, -3, -86, 44, -4, 43, -14, -48, -40, -124, 122, -25, -4, -2, -104, 68, -80, 2, 39, 64, 11, 9, 3, -6, 2, 43, -41, -50, 49, 35, 7, -60, 22, -5, 38, -43, 12, -49, -13, 32, 33, -47, 105, -91, 141, -58, -12, -45, -52, -45, -6, -61, 28, -56, -47, -18, -85, -19, 22, 49, -17, -9, 23, 42, -104, 99, 59, 47, -10, 61, -59, 75, 39, -114, 8, 32, 4, 64, 32, 105, -46, 18, -47, -96, 49, -68, 48, 35, 76, 34, -18, -88, -117, 33, 71, 58, 57, 39, -45, -29, -88, 21, -27, -49, 35, -88, 8, 9, 73, -40, -77, -9, 14, 54, -82, -72, 33, 3, -4, -76, -90, -53, 77, -85, 2, 104, -96, -21, 15, 7, -40, -8, -2, -30, 116, 15, -28, 81, 23, 27, -41, -159, -81, 46, -81, 97, 48, 39, -79, -98]
5387i8J12l9R4j28J62p8N4k08J39j18n6K04n0K1Kq7J24j44J7J7J47o6nN3k4j1
5413C4j21j7R9J39j47pk8M4j5rP7o8Q5M7r0O5m9j7j56R4J3j7m7L9j3L9J0Q5m9
5442B0J3r7Q8n5n3kJ21qj2ON6j33N2K3o3J16j2L8m3j04Mj4jl6J13n8K4N9p3J23
5472I2p2J0L2l5k1O8j54J38Lj23M3J5Oj50J44M5lj3n4l1O7j2J08j10n3O0o1J31
5500G0k8j14J55j04RJ1o1K4J64m1j29n5J70K2j13M9j5o7N0l4j2PJ4j7R6p8J61
5527A34m5J4j24jl8r7J96N0j28Q0M6j06J7n6Q1m5j6J5R5p9J38n7r6J9lm9Q5m8
5555a8m9oN5oj9l0J62j18j28J64j3o0P3J25j21j01J95l3j8l4R4r8j06j7K3M6m0
5582g8J17q6O1j03R3Q3j35O0p0r2P1P7Q1o0m7m2J26pl0K1q2J74j55J06j04J10
$$ y = [-98, 14, -25, 69, -59, 103, 25, 79, -129, 10, -108, -164, 40, -10, 11, 13, -74, 50, -94, -77, -60, 87, 21, 16, 69, 45, 34, -87, -104, -5, 134, -13, -20, -48, -4, -19, -28, 49, -19, 66, 113, 23, 88, 39, 22, -134, -40, -27, -44, -91, -52, -65, -26, -16, 69, 20, 33, -64, 24, -31, -84, -86, 35, 27, 15, 21, 77, -56, -4, 19, -44, 72, 60, 98, 55, -49, -45, -59, -60, -96, 17, -41, -17, 42, -31, 92, 20, 30, 62, 27, 6, 74, -80, 58, 61, -62, -19, -4, 2, -148, -4, 41, 38, 25, -29, -60, 7, -5, 103, -7, -60, 0, -61, 70, 42, -72, 83, -21, -12, -1, -62, -38, 126, 85, -44, -99, 71, 93, -20, 29, 14, -53, -3, -37, -49, -42, -28, -45, 51, -27, 134, 89, 103, -21, -22, -60, -157, 39, 89, -39, 41, 87, -19, -2, -58, 23, -22, -38, -23, 72, -7, 131, 74, -22, -3, -6, -55, 30, -18, -67, -73, -18, -24, -43, -73, 89, -29, -157, 7, -6, -66, 7, 132, 11, -90, 105, 72, 54, 20, 114, 16, -90, -107, -84, -38, -78, 39, -47, 14, -89, 4, 87, -48, 12, -58, -150, -79, -2, 79, 19, -28, -70, 56, 49, 19, 40, -42, 132, -23, 83, -21, 89]
5608H9o2L9K3k27Q9J47k15J10o5J44j32O6p3N5K1m1J8J6o3P8r1J53n9j34Q9j01
5634a26J00m2P2J39j33k1L0n1R1M1j47N7K7O3j83J11l1J23j68K0P2m4l8o7Q6K1
5660BN2K9j19K5N1j21J07j16J14j07N2Q9j45P5N9m2r9N7L0L8n5n5N4N6n6J14j58
5687f9n2J80j7L4q6J04j17J2m2J69j54J2N3j40P8KJ5R3n6J0q4J6M3j4n0P9j09
5714i0N0j24J54N2p0Q7p9L3j35Q5P9j47J56j2j22J08j17O2J26l0k6j30N2K1o9
5739h6P5O6q4K5r1O6O3n2O1j27J55k18J30N6lj23J25Kj35R5k8M2R4j02l8M2m4
5766c4R0j16J0J25l3L2l6K5roM4r5M5p1J62j91R8j19R5M9o8j07J41kL0n7l0J13
5794H5M6k72J60J67j39k2r0J42q6Q7k1oj53J4Q0l0J0J6jP2Lp3P0l0p6L8r2l7J36
$$ y = [89, 27, 66, 89, -138, -49, 98, -117, -7, -72, 72, -60, 6, -67, -12, 9, -32, -14, 2, -61, 17, -74, 79, 20, -114, -25, -126, -26, -68, 4, 143, 10, -11, 19, -32, 59, 100, -47, 10, 37, 100, -83, 28, -3, 120, -48, -28, 44, 0, -38, -105, -19, 2, 54, 83, -36, -11, 40, -81, 26, -90, 24, -83, -31, 58, -87, -12, 47, 5, -94, -37, -7, 31, -24, -79, -25, 31, -25, 89, -69, -121, 59, 42, 76, -10, 94, -23, -11, -53, 116, -38, -26, 27, -113, -35, -33, -18, 75, 19, 29, -55, -39, 4, -10, -60, 19, -90, -40, -164, -10, 42, -28, 59, -20, 13, -122, -37, 42, -105, 51, 39, -83, 25, -92, -30, 96, 66, 40, -90, -38, -17, -86, -11, 55, -29, -4, -95, -29, 34, -18, 43, -84, 71, -147, -17, 39, 36, -87, 38, 40, -95, 0, -28, 14, 108, 6, -32, 10, -34, 56, -60, -50, 75, 42, 74, 38, 63, 54, 48, 92, -3, 42, -29, 133, -58, 40, -79, 16, 65, -3, -110, 31, 29, 59, 2, -28, 85, 131, -141, 19, 186, 47, 25, -65, 77, -9, 78, 57, 51, -102, -88, -8, -38, -28, -12, -13, 59, 62, -11, 59, 29, -47, -9, -101, -138, -2]
5823bo5J17p7m0J14j6Nk3rL5k2r3J05J0j41J93m4M9j66J52j2q6L5J6L6q4J0M8
5851D5O1p1KJ3J6Q0k08R1q1n6Q2L7kML9o9MJ02j20j3R4q2K7m6J28j41m2R9J02
5880I5r9k9P2N2m3p0JK7r1Q1lJ11m6j4l8K9qj64K03Oj10Q4R0j02J6N7n3p4K6L
5910IL1qj20L7R8j25L2Q3Qj02Q3M6n2m6MJ15j41O9L6p2q3R0%O8J9r6J19j43J6
5939b5m8J14O2j19J10k16J05J32j83qk5J62m7m6K7J34k2n6J6j1j5O3j16l7K3l5
5965f1M8L1n6j8n1J27K2j00R9Rj25N3QJ14k08P2L6M6K6j27P7OL7r8K6k7o1Q2N7
5994D4m0l5J11q4L5J27j11p8rJ71j36JmJ6j16J54lj31M1m%J4K33j64Mk4O5m6q1
6023e0J48p1j2ok7o4J25M6q1P2o9m5Q5l9Q2q9k6J2k4p2N9J46j40l4J32Q4j62J9
$$ y = [-2, -67, 50, -27, -67, 47, 31, 36, 13, 4, 39, 17, -76, 29, 39, -102, 91, 47, 96, -70, 82, 70, -16, 19, 35, 71, -13, -3, 45, 106, 35, 37, 50, 66, 146, -62, 29, -52, -108, -26, 11, 9, 13, 52, -17, -13, 89, -31, -44, 50, -32, -5, -51, 77, -64, -106, -7, 95, -4, -33, 39, 91, 48, -22, -21, 6, -85, -4, -7, 104, 58, 44, 6, 35, 27, -137, 66, 72, -38, 46, 136, 34, 50, 107, 54, -20, 6, 9, 40, 32, -88, -51, 47, -78, -46, 37, 45, -57, 26, 72, 20, -26, -22, 93, -48, 21, 57, -15, -98, -8, -8, 60, 79, -17, 102, -41, -25, -73, 41, 103, -16, 94, -122, -17, 115, -68, -76, -101, 61, 14, -32, -5, 129, 107, 51, 67, 56, 41, 104, -12, -49, -26, -61, -13, 18, -38, -56, -107, 20, 42, -58, 41, 50, -75, -22, -14, 100, -108, -36, 0, 46, 72, -55, 22, 28, 65, -33, -7, -34, -95, -13, 44, 4, -31, 80, -4, 31, 158, 47, -31, -40, 131, -5, -4, -8, 8, -108, 46, 43, -88, -47, -51, -51, -37, 196, 32, 36, 12, 77, 31, -50, 98, 27, 15, 9, -18, -82, 43, 89, 8, 80, 11, -34, 51, 12, 94, 5, -21, -9, -33, -105, -46, 100, -40, -74, 58, 142, -20, -1]
6051ap6Ok7M3Jj0j5O6o0J20r8J18j03j5R4j85J43k8L2j1K3jk4N8RQq6J2m3P7q1
6082e4L9j8l2O3j6K5L0q8K6N0ln8n8R8n7J13r0J26l4n1l1l8Q4Km7o1O1j3PR0q1
6113a6Q9n0j5Q9j55K4O2k0l7J11j25P5r1Q2%L9J04k74J34n2N8K3j01L4O8n8o4
6140f6L6R0mj02N0J20r4l5J1j8K2J6qj04PJ99k16J06J28j46J29p5l5m7k4K10j35
6167A5j4q4R5K9l1J3l7n2K7J32n4O7k6o2K8j4ln5O1N1p4k1KQm4J2j5J54J5o3j4
6198D6n7J62j71PJ33j19Q1q3M7qJ33j78J5kj54K41n8m2l1J0p7J18L3N9Mm4m8l7
6226b0J02Kj19L8J2l1O5N2j52J12p3k1L0l4J12j33PO6K1p3Q8J7n7p9O5l4M2M4
6254D9l8L8L3o5o5J05n8J0L5k4q7J44j28PJ13N5q0n6lM4lpOo3NK2j22J16K6l2
$$ y = [-1, -77, -71, -98, -55, -54, -64, -79, -13, -73, 47, -51, 67, -36, -51, 43, -142, 1, -27, 5, -6, 17, 16, -8, 50, 59, 67, -19, -7, -50, 27, -54, -15, -33, -65, -2, -18, 7, 37, -51, -25, 25, 22, -36, -94, 4, -53, 60, -30, 96, 62, 11, -20, -58, 26, 28, -19, -80, -19, -32, -25, 65, -16, 73, 23, 8, 97, -58, -34, 28, 8, -29, 82, -43, 32, -59, 23, 23, 62, 166, -108, 26, -26, 32, 55, -46, -12, 56, -2, -66, -30, 60, 56, -46, 4, 124, 30, -5, 6, -12, 10, 26, 18, -86, -79, 120, -96, 10, 138, -8, 121, 46, 11, -36, -60, 150, 15, 1, -83, 12, 41, 10, 23, -14, -66, -39, 93, 39, 106, 80, 18, 46, 32, 29, -26, 35, 86, 12, -9, -7, 1, -43, -31, -46, 108, 123, 60, 46, -11, 151, -20, -13, 120, 1, 82, -1, 46, 38, 171, -7, 8, 6, -148, 93, 35, -7, -38, -28, -105, 13, 46, 105, 109, 65, 17, -20, 82, 84, -35, 3, 15, -16, 49, 101, -51, 61, -12, -33, -3, -37, 75, -58, -51, 15, 36, -37, 51, 68, 11, -68, -3, -37, 5, 49, 11, 49, 82, 17, -48, 57, -1, 9, 44, 20, -67, 77, -51, -44, 69, 124, 44, -12, -15, 29, 26, 19, 25, -38, -33, -11, -133, -17, 9, -23]
6284b3L8j3J26p8jq4K4Kp6O5M8J5O1q1o1J62n5n7m6p2J51k3o7R8Pj27Q3M8p4J9
6314Ij05Q8mR0m4j90N6P2R9j16J7q1K35j63Q2J0l0m8K6Q7k9r0Q5jp7MLr2R1J4
6344bp2P1O1j39J28k9MRo1L4j8J5J5o4QJ4k6QN0q5L6R3j44O5N3j0Km0RK9j1q3
6376h0O7m0P2q5n3N7Q2n3O2k4n5M0n7O7Q4k48J37P5Lo3J0j4k8R6%o3K1M7o9R4
6406H2j45k0J45pn7l6J91j27o6J79o1K8j45k4Q3Q7j00l8Q5o4K5j4jpP4m9L8j54
6434i8J77j99J64l7j21J77M4j11k7lR1K8Q3q4qp9kR3j11p9l0K34j74J79j03K0
6460B4K6o2k2R0j02J09J4j88J24k8R2p3J1R6j51J8J15j28o9J61o1J3L2j13L9J3
6486b0m1K2J39p9l1Rn6J04L7o6m8l8k9R1m6O0j42J35J7q6K0k4m0K03L6j63M4J49
$$ y = [-23, 15, 2, 128, 50, 49, -35, -11, -9, -85, -20, 28, 43, 104, 23, -38, 124, 69, 12, -34, -106, 45, 22, -45, 53, 60, -67, 16, 64, -10, 9, -96, -8, -12, 78, 34, -156, -100, -28, 71, -45, -28, -109, 126, -37, 45, 55, 25, -23, 3, 90, 61, -29, 56, 55, -22, -18, -15, -107, -16, -2, -74, -3, 58, -81, 47, 18, 22, 31, -30, 4, -14, 1, 16, -48, -40, -26, -52, -44, 6, -79, -43, 50, -94, -29, 24, 14, 16, -24, -15, 14, 3, -80, -13, -53, 19, -66, -119, -62, 20, -33, 29, 5, -50, -10, -67, 0, 84, -164, -27, 48, 51, -12, -2, -16, -44, 52, 52, -11, 10, 57, -12, 82, -63, -83, 62, 55, -2, -38, 153, 26, -40, 139, 78, 106, -39, -63, 20, 107, 7, -31, 54, -10, 15, 1, 0, -7, 67, 18, 56, -98, 79, -120, 44, 7, -114, 63, 107, -4, -31, -34, 57, 85, 168, 84, 76, -3, -5, 88, -23, -102, -132, 102, -72, 107, 4, 24, 50, -12, -34, 56, -46, 63, 77, -111, 13, -15, 77, 4, 15, 111, -40, -22, 93, -35, -104, 57, -4, 9, 41, -72, -33, -20, -61, -39, 100, 21, -10, -1, -57, 47, 84, 18, -30, -68, -97, -6, -52, 8, -134, 1, 18, -68, -48, -72, -112, 91, 127, -36, 8, 157]
6514A57j87K2l2o1J36q1L5kj3rj7R5p3r5J87j85O4J19k9m4J9J9r2J20n4J13k10
6541i8N2J9MO4p0J35j29j8N4L1j44J96j47J34j84M1Q2k6j0J9O7k12N6R6N4J1j36
6568e9P0Nn9L5K7l4n1Kp1J56p9L3K4Q4j12N5m2L2J0j11J59K0j9j9k3r4M6p7J93
6597A01O6j80K5K1J7m7J13j61K1j7R2j28Q8kLr0M5o6R8K8L7l2M0M8r7m6k8J80
6625A29j79P0n9j1J72j39M7l5J4l4J7m2M5L4j8p2L1p4J44o0M0N3j45P9L8l5o5
6652e5P2n6K1j8J02pq8OK4o5k7N7r6J52l8jN9l1r7M1J03r4P4L5j3m7O5j0j43J26
6682E1j31J73rj27P1Nn3P6lo7K7Q4mr0n6P5r9Q4r5L4P5QK6j26N8j0N2oJK9m3J28
6714A38j88Q0PJ1n0P0p1L3j16K8J24K5j12%J42j31J9K0M2Pj37K3P7p5L3o8K0M8
$$ y = [157, -30, -8, -40, -101, 35, -46, -11, -13, -26, -35, -52, 43, -30, -125, 62, -123, -59, 60, 31, -13, 6, 25, -67, 53, -1, 112, -98, -46, -27, -23, 41, -29, 106, -23, -41, 13, 44, -100, 96, -51, 83, -101, -60, 22, -4, -14, 5, 72, -140, -84, 12, 66, 77, -59, 11, 16, -43, -8, 19, -15, -66, -64, -135, 21, -58, -25, -1, 83, -29, 26, -16, 16, 26, -85, 74, 94, 75, 56, 33, -61, -15, -92, 101, 167, -13, 12, 33, 50, 3, 116, -45, -24, -41, 51, -77, 11, 9, 12, -78, -33, -99, -1, 27, 64, 32, 72, 120, 23, -23, -51, 129, -50, 20, -39, -50, 122, -17, 30, -5, 9, -25, -8, -50, -5, 29, 11, -61, -30, -104, 40, -20, 20, 73, -72, 7, 45, 10, -55, 17, -39, -18, -36, 66, 59, -29, -23, 1, -64, -91, -34, -130, 22, -16, -17, 42, 11, -86, -45, 58, -36, 38, 73, 60, 13, 78, 68, -75, 51, -80, 93, 84, -43, 28, 33, -20, 56, 53, -14, 13, 97, 93, 3, -53, 22, -77, 7, -88, -54, 21, 29, 55, -71, -13, -23, 29, 23, 24, 53, 10, 138, -50, 30, 37, 48, -2, 68, -3, 30, -86, -58, 66, 91, -21, -21, 121, -10, 9, 29, 71, 78, -59, -36, 41, -34, -1, -69, -49, -1]
6742an0o3J08qo9J43j29N2M8l0J2j06O7L5q5R8O4M9lj34Km3M5k1n7N7N1j3k3l
6772gM1k3L0n0j1O0k5n7K9L6L8O9j11K8l0k2N6m3K7n8N0P4j95J76o6N9p7N1j9
6801C0N4p1k5K5j6r4J10J09q5k1l7L1M4q0J3P4l7O9k8n9OO0j6k2O0j52K5o9P5
6830b7l1J08j1m4n1M5k17Q2P6J58j33Mo4J29n1k5J30r1l0L0O0K8j20J52j70Q9
6856B6R5j22Lm8R1l3M4n3P6q2Jmq3Q6j05J05p7O3k7J45p7m5nK3k6M6J9p8j6j3
6886g1q5J44M2n4o3Q8o6o8J96n9OP1o0K3m1l7P3l0M3j03K3Q0q0Rk7O5rp6Q8Jq2
6917e9J06j05J53k30J40k5rJ7q3R9k5K02k30k8N4Q9p1L2n6Qj12K42n6K3r0n3J0
6944e7J05j79N6N4KJ4q7J76j43J39j64J25j3jq4R8K1j96J31J16j41Q0j04O1j03
$$ y = [-1, -51, -114, -6, -14, -83, 60, -69, -17, 31, 1, 13, -93, -26, 9, -76, 22, 86, 135, 132, -2, 0, -43, 2, -19, -76, -19, 32, 19, -4, -7, 34, 11, 41, -9, -20, 40, 15, -42, -13, 23, 61, 130, 19, 47, 17, -5, 51, 8, 35, -23, 27, 101, -94, 82, 16, 75, -2, 49, 30, 84, 13, -12, 13, -3, -97, 13, 122, 37, 16, -21, 10, 54, -26, -13, 61, 24, 93, 65, 6, 12, 72, 56, 34, 94, -58, -33, -102, -27, -58, 50, 39, -5, -56, -11, -228, -146, -70, 88, -45, -41, -105, 24, -27, -52, 78, -13, -43, -13, 47, 75, -45, 107, -63, 26, 121, -1, 2, -46, 45, 12, 56, 3, 79, -3, -2, -6, -89, -3, -108, -3, -80, -17, -44, 101, 24, -21, -26, -3, -29, 17, 36, -42, -58, -71, -156, -12, 30, -24, -87, 1, -65, -133, 63, 4, 10, 81, 21, 44, 3, -34, 39, 9, 52, -51, -28, 52, -28, -19, -46, 19, 10, -66, 22, 23, -59, 47, -58, 95, -135, 5, -20, -29, -12, -95, 4, -21, 181, -49, -77, -23, 66, -5, 27, -29, -21, -133, 109, 53, 76, -14, -67, -57, 48, -131, -75, -21, -19, -5, -92, 84, -59, 80, -84, 41, 28, 27, -57, 41, 62, -134, -3, 113, -28, 52, -52, 9, -94]
6969i4M9m8M4M7M3j41R3l3R0n7J1j4PL3qn1OM6k7P4j20j1O4j82O6J41n9m6q8J49
6999a6r0J93j54j0lJ79o6O7j09M6q7J26j46k1J71j0o8j0o0R1o3J1L4m2P8r1J23
7026G3o8L6p4P4n3R4j10J21j81J8rJ48j11l4J08l5k1J4j4m2K5pJ5N9K7J5q6P3
7054E5j39K8J46j75N4K8k1J1L5o5J59p6N3q1j3J76j13K0j29J12j38K7J48j48M4
7079bM7p2N7j19J88j08RL8l9J8j5k8O8o9j6P5m4j4J0QO6m1J79k76P6L4M8j27m6
7108i5rQ9P0j6l0j14R5J13m0K1m9j0n1nl0pQ4J6m1M1j7ok0M5m5m5k0k9Q3R3q2
7139a1J24k39J53m2j56K43p7P0n9o0J01k7k12L51k45J22n0o1K8O0l1j2P9p3P0
7164D6k1J5n1NJ8o5O2L3k7k6nQ8q1j8K4O3j06M6l7J28j75J07Rq2j5J11O3o6m3
$$ y = [-94, -45, -93, -49, -2, 41, -100, -7, -40, 50, -7, 4, -10, -3, 30, 22, -29, -23, 23, -4, 70, -50, -61, 3, -179, -113, 28, -31, -77, -165, -16, -106, 87, -67, -77, -80, 99, 33, 100, -9, 37, -50, 76, -70, -91, 80, 70, 2, -8, -68, 23, -40, -29, 5, -37, 41, -50, 73, 5, 41, -33, 41, -12, 82, -28, 93, -88, -70, -79, 69, -42, -76, 32, -3, -24, -10, -24, -66, -41, -48, -33, 26, 53, 68, -18, 55, -84, -56, 90, -85, -31, -3, -24, -13, 22, -43, 116, 40, 93, 12, -1, 175, 62, 82, -47, 65, -73, -46, 102, -46, -2, 45, -27, 30, -89, 99, -9, 0, 38, -1, 17, 2, -26, 42, -27, -43, 32, -12, -26, -16, -8, 58, 17, 196, -80, -4, 30, 78, -49, -95, -104, -15, 55, 39, 9, -105, -10, 103, 63, 84, 35, 25, -26, -31, -61, -68, 16, 32, -9, 32, 15, 9, -11, 34, -11, -56, -76, -105, -22, 71, -11, 113, -126, 27, -15, -171, 72, -5, 65, 6, -54, 47, 20, -192, 159, -86, 36, -14, -75, -47, 13, -18, -30, 49, -24, 46, 25, 40, -11, -6, 12, -53, 9, 42, 15, -11, -16, 72, -9, -27, -3, 60, -46, 0, -37, 91, -84, 23, 32, -50, -65, 46, 109, 43, 0]
7193@Rm9P4o9J5M3n1j5j01P3O3qK8P0j76j2O4N8P7j04j13J45k3M5N8j17M8k6M5
7222E1j44Q7Omr0J54rl5J07j12M9j67J55j7R4k21N5Q8M9j94J45p6P1n8K6n2Q9
7249D7m3M3j31R5m7LJ06j1%k00J72p6M8P8o7R0p3o9J56j41lk2J06q4N2J1p7Q6
7277D9j31L03o9j06M5j15OL5qj0oN1J7j38J47j10L7Q6j4q6J02j79N2J16k32K34
7303G6n1l2Q0o5q8P8p7O4J42p0j32K6L7m5M3K1K3M2k5k2j01J21l7l8j4J2M4m0
7331b8L7K0J10r3l1n5N2k6N3r0L4j02O7J18l0j03O8p4J25l4o7M9JM0MJ6K1J5j25
7360b8%O2L3j21R0j70K52r2k1J05m3p0j8N1Q6j54L6P7j53P7l8J21mj34J39o5l
7387A5M7o1K0J8j34P6N1M7n9m9J21j44j4J31k6o2O7L3l3m2j27J79Q7k35J83n2
$$ y = [0, 9, -40, 34, -35, -20, 23, -28, -43, -144, -71, -8, -16, 12, 82, -94, -106, -42, 16, 93, -11, -124, 21, -2, 43, 101, -16, 32, 6, 51, -93, -6, 0, -4, -94, 60, 51, 16, 123, 11, 60, -107, 48, 31, 125, -96, -41, 47, 96, -98, 47, -29, 42, -16, 10, -42, 47, 4, 47, -84, 11, -36, -33, 73, 62, 62, -138, 34, -42, 6, 84, 17, 107, 34, -35, 121, -20, -23, -45, 61, -23, 29, 40, -37, 49, -82, 221, 152, 46, 91, -24, -18, 17, 9, -1, -7, 44, 61, -77, 70, -40, -3, 83, 69, -17, 85, -94, -42, 74, -158, 76, 25, -7, 73, 8, -80, -2, -79, -15, 127, 57, -75, -49, -12, -57, -14, 7, 30, 72, 47, 25, -76, 45, 8, -30, -44, -32, 12, -28, 9, 29, 139, 46, 15, -40, 12, -14, 39, -51, -17, -119, -52, 66, 36, -67, 1, -73, 52, 18, -49, 0, 1, 41, 45, 61, 82, 97, -28, -28, 34, 67, -54, 36, -134, 118, 26, 5, 110, 67, -3, -21, 30, 116, -38, -2, 75, -78, -1, -39, 82, 78, -56, 83, 18, 15, 62, 1, 21, 39, -95, -19, 32, 79, 20, -29, 92, -52, -66, 65, 39, -23, 44, 77, 44, 2, -125, 54, 141, -94, 89, 37]
7413C7j05OM9l3m3J25j07J07o6JL4K9k3n9R8mj00N0J46j1l6j42l2M5n1k3J29Q3
7441A04j80K2Q4LO1j07M5J1m9n9N4P5m8k5K2o9l1R8M0j37J21p2P5j92J80L9o1
7468DJ0l5l2O8J13j08r0M3k0k1K5n3J01joL8p0P0l4J52j64p2J00n7p0J09K5j6
7496Im2k0k5QqN1R6l2n7M1J18j53r5K1J13j11Q0O1j24J28j78J25j6J22j59N6J4
7523B3k1Or1Q7j7ll2M8N5n6R5p8j3J2J1p3j38K96j35Q0%L0m7n3m6Q4Mm4P1rl0
7554A6l3L0l4Q8n9jJ70l0j18J4j25Q0K9q8PR6m6jJ2kJ11j17l1l9N1%O3J1o0P1
7584F5j17L9Q8j14k9K00j05J1l4NJ4n6M5Q3j17R6o0j1M2n1N5J7q0M3j4m4p1O7
7612c3J8K0JL0p3L0M6j9K4p5K7l6P7l6kl3k3O5JN0n1n2O0L2j4l5q8J70k1mj54
$$ y = [37, -68, -62, -13, -46, -89, 36, -71, 36, -30, -29, 5, 34, 11, -48, 50, 46, -54, -4, 142, 131, 95, -47, -79, -34, -85, -108, 21, 104, -76, -54, 30, 33, 94, -13, 32, 43, -6, -65, -11, 64, 16, -9, 13, -56, -87, 11, 51, -86, 35, -37, 38, -154, 26, 65, 4, 14, -21, -53, 15, 128, 20, -70, -27, -47, -68, -43, -96, 5, 4, -2, 36, -34, 36, 2, 154, -10, -82, 18, -39, -109, 0, 25, 9, -33, -53, -78, -70, -78, -27, 69, 37, -20, 21, 139, -14, -109, -88, 25, -86, -6, 55, -69, 59, -119, 6, -10, 112, -47, 9, 23, 2, 8, -83, 4, -13, -16, -48, 0, 55, -1, 94, 16, 3, 15, 26, -47, -185, 111, -24, 56, 56, 86, 39, -14, -60, 24, 28, -16, 55, 46, 16, -17, 13, -21, 67, 8, 7, 177, 147, 29, 43, -82, -2, 27, -61, -54, 42, -4, -5, 7, 5, 116, -1, -32, -71, -20, -20, 43, 54, -6, 65, -52, -13, 75, -39, -68, 132, 27, 38, 4, 9, 23, -33, 12, 95, -22, 74, 14, 3, 45, -6, 49, 66, -14, 29, 15, -29, -100, -33, -15, 5, 6, 36, -37, -7, 39, 20, 44, -31, -4, -40, 37, 1, -1, -34, -57, 8, 9, 59, 8, -44, 16, 48, 34, -1, -89, 81, 60, 56, -98]
7643i8J50j62J25K3P9j37Q8J1j10L1N3j8n4Q5l9pO8j8q0k3J34j43ko3J66k4k1
7670A4R4j42q9J76l4j21P2M1P6j15L3lJ07j4j18q7J52lJ0m2j0N3m6L4r2J56k02
7697a00J64l9nN5p4n9R8q7Q7m8J1K1J9p0N2k8J34j04N9M6q7Nq2Jo4P1J1L8ML3
7727F2j12R5n4Q6j17O3J9q5MJ0K7M8j00r9K08m2m1J21p7q7J56r5O1r5J15m7Kj02
7755g6J14k6p9J62J8j33j1o3Q3j07J94j76J10M1o7J69r8n8N0l8k7k9j7J03J1o5
7781a5O3R7r2K4K5j67K4J22m1L9Kj60J7O5PL7K0Nj28%J02m1Q6n5j1j5k8L4j9J0
7811GK18k00J5j1k5j9M8j6M5J6j18N0k2L3Q3r0QL4K9j86L5J45k9j6QL3j02NnN0
7841B3j6p0J78m9n3J7J04p0o8j2K0K9n0M5J9m0J0j0j2K5n2P5o8p8N6R5n9kQj5
$$ y = [-98, 52, -110, 15, 38, 117, -20, 68, 79, -31, 0, 53, 35, -19, 66, 27, 20, 88, 70, -10, -33, 101, -42, -44, -107, 59, 35, 14, 108, -34, -123, 53, 19, -102, -30, 11, 87, -28, 5, 2, 109, 95, -23, -110, 42, 39, 49, 7, -3, 50, 4, 38, -54, 102, -100, 64, 25, 20, 75, 1, -58, 40, -47, 40, -8, 3, 24, 43, -27, 25, -3, 131, 27, 86, 132, 45, 50, -32, -31, -95, -24, -13, 25, 29, 62, -50, 45, -9, 77, -40, 23, 42, -43, -39, -29, -2, 46, -54, -153, 55, 13, -28, 93, 16, -71, 85, -10, 51, -44, 71, 24, 26, -76, 38, 12, -67, 95, 113, -20, -31, -94, -11, -118, 76, -100, 10, 51, -16, 153, 55, -3, 47, 9, -18, -47, -64, 39, 50, -15, 48, 145, 53, 77, 102, -65, -41, 81, 40, 79, 81, -79, -62, 3, 10, 47, 67, 72, -56, -56, 46, 5, 91, 36, 25, 10, -18, 16, -3, 7, 225, 25, 40, 29, 4, -15, 33, 17, 62, 78, -40, 10, -12, 21, 104, 14, 22, 56, 85, -101, -66, 79, 50, 34, 42, 75, -27, -22, -27, 23, 7, -63, 115, 66, 13, 30, 134, 64, -4, -16, 4, 33, -17, 28, 47, 7, 17, 7, -5, 20, -32, 43, -25, -103, -47, 48, -11, -13, -5, -20]
7871b0O5r9R6j22L1l9J19k5R2j04m6o0R1O8j47k7K40m4j71J54mj20J01l1k3J3
7897a2q3P9J4o1R8p8P6l7j2J05n6P4k9m2M6K3q0k2O2j01K9l4OM1%O9j9r1O8j38
7927a05N4M9M0j0o7jj5J13j35N0P5J19j43pk0O2j2j9Jj12J43j37M3J57p6M0j01
7954a4n4l2P6P0p6j2R7j58K05j14j22J90m8l3P4m9j68J12J02rM1q4K1o5J37q2
7980EP4o0K5L9n2j41J73Ko3N2l6o7nR9m8J4L5O9j87k4J67j78l6J41L1Nl2o2Q9
8009B9jj87J61m2Q4j29N2O4Qp0K3j8N0%l2J1j34J62mp0j3J01Pn3J60j37k4k0M1
8038A9j08J21j9J06k12J12Kq1R1N9o5p4J34j7r0kn0kR3J32j60R5j18N1M8l4n9
8065b8l4O2M2l7m1J38p6q3O7M5j01P4j08J83j11m3N9K9jqj2N2r8J81k62J08L6
$$ y = [-20, 45, -54, 42, -80, -49, -88, 31, 6, 98, -6, -52, -112, -21, 47, -100, -127, 113, 69, -102, 52, 48, -72, 29, -2, -25, -12, -95, -16, -2, -63, 35, -43, 33, -4, -16, 89, 33, 107, 78, 36, 82, 105, 25, 3, 65, -36, -7, -41, -35, 6, 6, 75, 56, -35, 33, -105, -51, -2, 38, 28, -39, -40, -55, 58, -77, -27, 48, 167, 24, 17, -3, 59, 47, 28, 29, -83, 60, -77, -34, 123, 47, 87, -14, -68, -100, -24, 46, -30, -42, 55, -103, 102, -12, -134, 56, 8, -25, 49, 0, -168, -56, 46, 37, 78, -6, 15, -50, 87, 5, 79, 19, 44, 83, 31, -110, 63, 65, 2, 54, 18, -49, -54, 45, -3, 11, 46, 115, -72, -96, 71, -107, -143, -2, 29, 34, 2, -60, 29, 28, -159, 2, -40, 44, -85, -33, 31, 39, -31, -8, -26, 24, 24, -8, 3, -131, 31, 27, -43, -56, 45, 52, -1, 159, 22, -2, -22, 19, -89, 32, 13, 119, -93, 19, 21, -60, 31, 90, 25, -49, 85, 68, -22, -24, -74, -76, 17, 149, -11, 84, -34, 17, 65, 31, -28, -62, 0, 42, 5, -36, 102, 26, -57, 10, 55, -46, 28, -80, 103, -8, -51, 8, 37, 36, 28, 16, 68, -30, 151, -111, -3, 33]
8092C3K8j83J30M9n6m7j8mM7K7j3J09p6q0N7lq8O3Q7n7K7k4P1j03K1KJ4J09r0
8121C2o0N9O3n7j14K6O1k8N9o2PLJ5L4kL3l6K3p6J02j19N0N8n4j9nl9j18P2R9
8151Go3M2L1L8j13M5l6j4k8K2R7Q5p7J25j29K1ol1q8K06j14r8J57j23L0m4J32
8178G4l9o9Q1N1q2P1j25Q1m8N2l1j4l5
$$ y = [33, 61, -122, 8, 57, 1, -46, -64, -68, -21, 6, -7, 102, 26, -54, 3, 0, -88, -25, 62, 5, 32, 8, 79, -24, -3, -1, 13, 122, 32, -28, 31, 94, 37, -77, -51, 10, -18, 41, -21, -14, -11, 4, 38, 36, 69, 33, 56, -20, 82, -37, 13, 71, 17, -2, -7, -46, -164, -92, 7, -56, -14, 17, 55, -58, -13, -49, -63, -91, -69, 28, 113, 36, 161, 32, 53, 47, 16, -72, 134, 20, -78, 79, -44, -14, -58, 74, 35, -34, 47, 98, 16, 87, -38, 43, -5, 47, 16, 2, -33]
8191c3
$$ Imaginary data points
##PAGE= N=2
##DATA TABLE= (X++(I..I)), XYDATA
0@%%%%%%%%%%%%%%qJ6j6J6j6K4l2L3m1N0n8P2q5R4j06J23j46J68j89K14k41K72
36A44l05L42l83M27m76N31n90O52p22Q00q82R72j070J179j299J431j579J741j923
55a010K127k359K624k931L293l722M244m898N739o868Q476j0965J5373k5483R1863
70G5503J1614j72324K8079J06514K5020q1773J201J3564J205j0661L0867N936
82C4745n0853j2436L6773M1014j8782n5536J4969K6427M448k1717R838Q486k7973
95a0597K310K4347r22m1146Q956N0255k5987l7155J0117L5968j3083k8991K5257
108f71J2999j6351j3211J5189L382j7978J3123J0832l013k5155j370L4303o305
121E774l2634r388M5035K0417m8493k3472L2767K8906k7506j0156K3133o326j1989
$$ y = [0, 0, 0, 0, 0, 0, 0, 0, 0, 0, 0, 0, 0, 0, 0, -8, 8, -8, 8, -8, 16, -16, 17, -24, 26, -32, 40, -45, 49, -57, 66, -80, 88, -101, 113, -128, 144, -161, 181, -202, 225, -251, 280, -310, 342, -380, 420, -462, 510, -560, 619, -680, 751, -828, 913, -1010, 1117, -1242, 1382, -1549, 1744, -1978, 2266, -2632, 3107, -3761, 4715, -6250, 9123, -16360, 75503, 87117, -85207, -57128, 49386, 74406, -7367, -6166, 7398, 8603, -2058, 28809, 34745, -16108, -28544, 8229, 49243, 30461, -25075, -10106, 16321, 20769, -948, 8890, 17376, -10597, -8287, 16060, 15138, -26008, -17052, 33203, 7216, -29939, -19822, 16146, 3063, -25928, -671, 12328, -4023, -17234, -2045, 1337, -16641, -3518, 7314, 4301, -20854, -22224, 12079, 5774, -26860, -36248, 8787, 29204, -19289, -42761, -9994, 18912, -8594, -18750, 4383, -1943, -13932]
134a3932N715K0159j3010j6466K0133L328j3102l893J5658j716j8112O240J5351
147F353O697k1950j0174J9059R943l819j3004J2505Q200k0480k486K2470Q740
160B2054k8427m371K5088K693j9066q624J7856j094p422J0672k699j1096l230
173g666J8579P855j8406j1589J3366K3940j1020k6277k121K6072J6747k6810j6056
186a3386J0695J0678p81p293Q11k983m43L732L819k021p570Q45J699J2203L057
201A3062j9015n004J0852J1553o953j1523K992M353K21k963L1n473J27R140p10
216F90k908p831J622J2343qq397m906J0759O271j0691p146J0362P751j3817k718
231h624R985K21p507m998J0649K918q427p46N142K750l595j127J701M548l17l809
$$ y = [-13932, -8217, 11942, -1068, -17534, 2599, 5927, -7175, -11068, 4590, 2874, -15238, -8998, 6353, 13050, -8900, -19074, -15, 9928, 6109, -6895, 5610, 13810, -6670, -9156, 13314, 22054, -6373, -10744, 14344, 17037, -2029, -10653, 7203, 6109, -1313, 9359, 6660, -4436, -7666, 10913, 18768, 362, -11227, 2139, 26079, 15059, -11218, -13339, 12733, 29480, 2670, -13386, -2691, 7987, 7206, -87, 724, -2259, -2702, 1030, 4849, 2828, -4742, -3897, -2198, 10005, 13062, -5953, -10957, -105, 11448, 4495, -7028, -4036, 317, 538, -2425, -2394, -7867, -7740, 1400, 690, -2218, -10049, -8427, 3916, 3908, -4489, -9395, 1364, 7635, -3056, -10202, 160, 7911, -5906, -8624, 1361, 1582, -5925, -10923, -274, 2644, -5783, -6529, -1387, 1363, -2232, -3359, -1658, 2890, 2573, -1236]
247a236L615k003j677K748K303p72q827J532R721p01r474k109P737K860j391m769
263b443Q77M566o95J511j722N14J678l349P72L868l54o312j669M926L482l946
279A704p891M762N645k188l435j211N697K39m156K481L385l191l376N111K645
294F221m971n206M867O906r330n898P216M952n170p903N646P846n185p364O378
309i95O849n568m869L879P615m452r402O632O394n527n998K389N777l556n921
324f753L618N454n291l761N949L155k692n430L854P730m648n029L621M157k014
339A920m707R70M905j931o390L273L938k957l197l20N659J035n733O53M481J104
355B703k073j482J606L510k144l216L469o9k224q62Q60K376l984l027N598K308
$$ y = [-1236, 2379, 376, -1301, 1447, 3750, 2978, -5849, -4317, 5404, 4703, -4771, -6880, 857, 3717, 2326, -2443, -1566, 3000, 2305, 3816, 2094, 2608, 4286, 937, 1709, 5577, 5223, -1089, -2758, 2168, 5650, 1704, -6187, -1425, 4220, 2032, -1403, -2614, 3083, 3322, -834, 1647, 5032, 1841, -1535, 3576, 6221, 1250, -3956, 911, 7817, -1513, -7411, -195, 4757, -413, -8316, -2670, 5176, -9, -7373, -995, 5854, 286, -4583, -704, 6911, 2459, -6943, -311, 6083, 556, -5442, -3053, 2724, -832, -6753, -3135, 2319, -2972, -6733, -784, 2371, -321, -5751, -1897, 5833, 1185, -3844, -223, 3934, 1920, -2787, -1817, 3088, 1157, -5233, -1960, 1978, -979, -4176, -4496, 1163, 2198, -3535, -2882, 1599, 2703, 630, -852, 754, 4264, 2120, -1096, 2373, 2304, 80, -782, 78, 2454, -1530, -4557, 1041, 3349]
371C349n119k690L599M698n02n818J126N876j238k319k67K490kn337J922O257
387F025l855p986K343O644o06o000q47O155o83m580L237K912j045k919J00N094
403C989J120o003k271M853J999l463k860L090P85o745J281P743k524o707J560
418d153O552P50o135j324N527K874j808k479j393K672O57k987K632O72n736j346
434e025O533K856q453n379Q806O766o326m065K832J387O88N38J286J333l708l446
450c377K446N837M2r034j767J0076Q2j0662J545P965l005n668M033Q095l782r066
466f240K037O924L732j429o915j621P363M81o601R94M063k347l773L904L113r050
482e365k671J2034K637r038j926L941J889J000p03j441n48K926K160n002k796
$$ y = [3349, -1770, -4460, -861, 3837, 3335, -2483, -1357, 4519, 3281, 962, 695, 3185, 3183, -2154, -232, 6025, 2170, -5816, -3473, 3171, 2565, -3435, -4282, 1873, 1190, -3390, -153, 2759, 1714, -1205, -1105, 3989, 5109, -894, -3165, 1688, 3687, 224, -2636, 454, 1239, -5506, -4225, 3518, 994, -5713, -4153, 2399, 3149, -2986, -4310, 1217, 4091, 2283, -196, -1589, 1083, 1740, -1247, 1385, 2057, -3679, -5025, 1508, 4364, -4089, -9468, -662, 6104, -222, -4287, -1455, -68, 620, 1158, 2444, 3777, 69, -3377, -931, 4906, 4948, -4086, -5853, 4223, 4305, -6357, -4812, 3153, 148, -5520, -1487, 6608, 2826, -6240, -4203, 2721, 6453, 5024, -1891, -3512, 3851, 4332, -2269, -1275, 2788, 441, -3332, 572, 3685, -5365, -8036, 3998, 6635, -2403, -4329, -388, 1501, 2501, 1798, 357, -191, 2735, 4895, -107, -2903]
497b903J904j164L968O374q011j0937N225R938j934o594K785M833m299j607M655
512B233j821j592L359J47j36R27l488m002K450M634j219l362L131j036q959L415
528e319J1143l033o776K966L344l149j490M032N19k518K743J914m889j708K90
543a931j035N041L047p054l983O215K279q446j361J1798K424r417L54M711m191
558a549j306O025K719l238m031l67J803J567j017m773K123Q458n178j1077O500
573c341R652o358o835P672Q338p046q729L555O281J503n13l668j444K059l342
588b216k222P200K771q721m475R643N087j1777n360J1051N128l952j515j308j556
603b222K038K969L90j844j054j16q73J413j164m773M687P272p221p309N664M571
$$ y = [-2903, -999, -2163, 1805, 8179, 168, -10769, -5544, 4394, 2460, -4134, -1349, 3484, -815, -2422, 2233, 412, -1180, 2179, 2326, 2190, 3117, -371, -4373, -1923, 2711, 1492, -1870, 1261, 225, -8734, -5319, 5824, 2791, -3985, -1019, 2325, -824, -2314, 1718, 2237, -281, 2462, 4376, -513, -2221, -1931, -2966, 2075, 5122, -1932, -5915, 300, 2579, -5867, -7228, 4570, 6994, -2423, -2069, 2642, -1549, -2855, 3170, 5889, 2651, -1380, -1747, 56, 1623, 606, -4167, -2044, 6414, 1236, -9841, -3341, 6311, -47, -6882, 790, 9128, 2082, -6647, -3092, 3189, 4692, 4179, 511, -933, 1126, -2216, -4438, 2762, 5533, -3188, -7663, 1980, 7067, -4710, -10070, 981, 6109, 2157, 642, -666, -2222, -184, 2785, 3175, 1331, 277, 161, -712, 701, -463, -5236, -549, 6723, -498, -7807, -2143, 2428]
619B428l852r05N643P88o778P16N155k473j642L066l59o0M06m683k350M213L213
636B526l430j915N141j042q213L018Q147k386l097K955K03k723O6K893n6k382
652b95R52Q99j235N38l234l811O756N456o948n234N110L606n002j083P523O46
668D644o989R02M932j887k646L73K372K074k627m143N77L001l63l593K235N163
684D025m801n416O531L948o261j483O890K075o235k397N334R14l677L69J627j65
700A278j505l281J002M862j326m892Q46N267Q8o228R38O442j250l308K512Q71
716B316k377m27J647Q93j526j458N21J29K76j002k608K672L482l615k315L359
732c3K019k260j474L376K099m341r97M003J90k921j475J479L256k405m581J860
$$ y = [2428, -1424, -2329, 3314, 4102, -2676, -1960, 3195, 722, -920, 2146, 1787, 1727, 2133, -2550, -4900, -687, 2526, -904, -2819, 2322, 1280, -6933, -3915, 4232, 1846, -1251, 1704, 1907, -816, -750, 2143, 2087, -295, 657, 1556, 321, 859, -2375, -6186, 570, 6026, -922, -6156, -1046, 2560, -2442, -3525, 3998, 4644, -2345, -1443, 3489, 1602, -1044, -671, 1701, 3775, 1148, -2995, -2418, 583, 220, -3373, -1138, 4025, -776, -6192, 339, 4287, -1974, -3457, 3433, 5508, -727, -3124, 2210, 3124, -553, -184, 1443, 1278, -227, -3508, -2506, 2356, 1030, -3862, -3016, 2251, 2339, -3889, -2951, 3491, 2241, -1067, 1445, 2316, -61, -488, 1159, 2052, 526, -932, -411, -282, -6, -1008, -3616, -944, 2538, -1077, -3392, -33, 1986, -274, -1748, 1628, 3727, -614, -1611, 2392, 2582, -339, -1814, -335, 2921, 516, -4065, -2205]
748b205L945j084l826K60M802k64n101K458M603k516k743K211K997j528m238J686
764e43M287k672l750J550K288m16l541p2M683j068m526K245M097j124l653M62
780a753N343Q1n715P25M492o96l390q70K733J145l976r07L574l91k537k93K542
797A07J855l276j391M342J227l070p18K011J919k073k649K692J567l334j030J751
813g0J171j791k670K318L080k856k328K492K674o28l210R23M116j165l223J403
829B36J950m94k852k57L259o51m086R22K923p54k351m18L288O56l587P68L882
846B434o20k544q3K886J152l805r65L858l26l229o18K209J081l138j923L837J373
863A579l100j027K439K441k188k441L425K481l368j684K587J559j846k781J691
$$ y = [-2205, 1740, 656, -3170, -2910, 1892, 1628, -3473, -1015, 3588, 1072, -1671, 540, 3537, 2009, -2229, -543, 3744, 1072, -2678, -1128, 1160, 744, -2797, -2869, 1814, 746, -3780, -1535, 2562, 1438, -2215, -1753, 3590, 3671, -2044, -1319, 3173, 2477, -913, -1783, 950, 2095, -1881, -2788, 786, 395, -2142, -2435, 107, 1962, -1314, -2705, 1637, 2864, -206, -924, 1087, 3006, 933, -1716, 976, 2543, -791, -1821, -70, 1101, -690, -3360, -1042, 2038, -818, -3146, -654, 2020, 1392, -1818, -895, 3221, 2056, -1167, 236, 2186, 1692, -1160, -1417, 1842, 1191, -2895, -1973, 950, 196, -2155, -2573, 715, 1371, -2216, -1448, 2434, 1814, -730, -813, 2073, 3225, -580, -1545, 2313, 1987, -1242, -1860, 349, 1430, -1708, -3631, 206, 1579, -1521, -2548, -109, 2332, 144, -2297, 1128, 3609, 241, -1443, 1144, 2703, 857, -1924, -233]
878b33K527l037k137J915J759p42k741O12L981j259l146K083K846r88k872J113
894c19M168j669n077K407L648j515l088p19K503O49l238KK918l03k176k34K955
911I12J824m094j278N392P41m267k33K681N76l029p71L510o82l602M91J717K00
928H8o55j687J739K346k402j765K651K114j718k410L221K776m880k527M988J042
944B921l585j257J727J455j925k141J313J639L11r75j001K552M54m406J679N981
960D742j359n671M67M933n51n006J048L555j550j954N54j83K36n72r55K609K485
977B828k508l432J837M647k041l554M231K489n461j506L833L99k821j61K481k23
993A038k720o06O13P68J998j101j330K862m77l897K164M497j855l935K624L957
$$ y = [-233, 2294, -743, -2880, -965, 794, 52, -2689, -2077, 1904, 645, -2501, -418, 2428, 1440, -1432, -319, 3849, 2180, -2897, -490, 3158, 1643, -1445, -2164, 339, 988, -2250, -2248, 670, 367, -1809, -2043, 912, 2736, -1358, -2636, 2756, 3497, -770, -1003, 1678, 2254, -775, -1546, 1964, 1282, -2320, -1829, -112, 88, -567, -2254, -515, 1831, -571, -2336, 315, 2429, 711, -1699, 1522, 4298, -582, -3109, 1879, 2921, -664, -1921, -194, 1261, -664, -2805, -1492, 147, 458, -517, -1518, 1034, 1488, -2918, -1239, 4742, 3383, -2288, -1821, 3112, 2561, -2445, -1397, 2158, 608, -1346, -792, -975, -739, -1311, -2266, 343, 2828, 320, -3112, -1275, 3372, 1331, -2223, 2008, 4497, -964, -2470, 1363, 1762, -1059, -1220, 1261, 1038, -1682, -2288, -1675, -907, 1091, -10, -1340, 1522, 1045, -2852, -688, 3809, 1954, -1981, 643, 4600]
1009D600m817m616M852L002l011q05L51o76l61k24R73J520O45j622j929L342K038
1026C262n486r17P732L72o663j33L584j660l021K773L390l555k321K085q05l05
1042a668K081r67M44K695j986l194K150L456k012k726M441K020p412j510O493
1057B305r08l796K157J978k240k619J279J658j89J074M52j650J808J56m837K356
1073a016O323k487n173K030L218l581l561M251K926l991k99K002k171o35J258
1088i06J8K028K219k538l680K297M017l118l072N985J583p241q41M653j083k651
1104b330J742K492j752k086K88J07P12K543j222j222L513r36n350K206N542k107
1120B140m427K997L427n561l721N623J957m048L58K120j118j664nJ557J729N47
$$ y = [4600, -217, -4833, 19, 3021, 10, -795, -444, -1120, -1481, -1705, -732, 788, 1433, -189, -2118, 1224, 3262, -2224, -3141, 4591, 4963, -1700, -1833, 1751, 91, -2930, -157, 3233, -322, -2643, -558, -1363, -1668, 413, -554, -110, 2585, 599, -2595, -445, 3011, 999, -1727, 2714, 4734, -2678, -4188, 2305, 1397, -2399, -242, 1736, -504, -3123, -1844, -186, -375, 699, 1151, -499, 1309, 1465, -3372, -1016, 5307, 2820, -2353, -323, 2895, -686, -4247, 4, 2930, -1061, -1360, 642, -1529, -2164, -906, -888, 1140, 3359, 821, -2859, -562, 3455, 337, -2735, 3250, 4833, -2408, -3249, 1404, 321, -2330, -588, 1904, 152, -1934, -1646, -1539, -827, 1716, 494, -728, 2785, 1849, -3501, -1295, 4247, 2140, -2287, 710, 4137, -1424, -5145, 478, 2435, -1613, -1255, 865, -253, -1917, -1922, -365, 1364, 1911]
1136A911j509j547K375J364m800J3O694j285o006J178L856k678l477L205L708
1151C002l279k510K599K55j189O75K75J503J278k520j836K255J787k211j727L638
1167A995J202n658n85M337r10k839J645K121r85k239M35J748L28Q2n5o67J892
1184A847l48l413J481L276j878k664J530J820k364k554K922K153k772o63J731
1199A04j82j69l48K08J900M17j997m15J526R01k576j081L899M5m666N78K970r99
1217A15k177N13K551k06k588N35K296j40q58n36J245K002k401k099K716J332k645
1234c45j429K069J560l008j984L544J010k913k53J891J024j382j489K020J941
1249B256j725j265J251J417r50k700J270L028k250k751J783J764j381k023R48
$$ y = [1911, 402, -1145, 1230, 2594, -2206, -2193, 4501, 3216, -2790, -1612, 2244, -434, -3911, -706, 3002, -277, -2787, -188, 67, -1122, -447, -172, 1331, 2609, 89, -1747, 508, 2295, 84, -1643, 1995, 3197, -2461, -3046, 1291, 381, -2458, -813, 1308, 323, -1916, -1481, 267, 595, 677, 622, -45, 1847, 1499, -1914, -433, 2843, 965, -1699, -169, 1651, -713, -3267, -345, 1808, -964, -1627, 104, -78, -247, -595, -387, 1513, 1930, -67, -482, 1044, 1945, -631, -1712, 2187, 2232, -2434, -1856, 1114, 115, -2062, -1549, 1002, 796, -1792, -1257, 1039, 899, 41, -495, 750, 2752, 351, -1748, 968, 2300, -345, -1774, 295, 1855, -1153, -3137, 407, 1417, -1496, -1749, 142, 1166, -216, -1705, 315, 2256, 531, -734, 517, 1934, 984, -1716, -446, 2582, 332, -2419, -636, 1128, -253, -2276, -1328]
1264a328K633j024k210J508J824o23j443J31K543k2k856K30K387m75k323l58K473
1281A067K17l304L0K788l73k141K32K012Q02k192m48K840K00k030j56J471J102
1298B117k033j622K420Q10k805p19J809P82j552j651K034J858k239p92J816J032
1314A265p35j439J124K012j529j626J561Q21q44j683O1K172q90k355J106J581
1330F02p98j095k7J998L37k283O78K250n78j435P3J527O79k608n33K431j21k252
1348a155k20J314R78j985j128K602P80k436o4J882J079j539j429K186J425k218
1364G2j058J773O82j221k015J537J892k300j826K122J327j383j587J325K436j721
1380E5j611J959J449j223j286P32J734o86k572J112J881j303k002M85K090l70
$$ y = [-1328, 1305, 281, -1929, -421, 1403, 780, -663, -532, 2011, 1989, -867, -637, 1750, 1275, -1048, -1406, 1067, 1284, -2020, -1990, 798, 425, -1716, -1484, 528, 1330, -862, -1310, 1530, 1730, -300, -456, 1015, 2117, 84, -1538, 882, 1692, -1113, -1832, -23, 759, -793, -2444, -410, 1448, -791, -1583, 233, 1265, 530, -909, 215, 2227, 698, -928, 633, 1454, 610, -1073, -1012, 1160, 270, -2085, -979, 602, -196, -1291, -1318, 680, 1017, -1266, -588, 1662, 1084, -351, -278, 1249, 1928, -680, -1213, 1218, 1097, -1155, -1375, -61, 917, -1068, -2196, 406, 1186, -1250, -1314, 568, 1647, 108, -1321, 865, 2290, 72, -986, 787, 1469, 248, -1767, -230, 1662, -638, -2464, -342, 985, -398, -1985, -660, 1776, 55, -1556, 403, 1852, 629, -657, 75, 1809, 1123, -1449, -337, 1544, 241, -1761, -1276, 814, 444]
1396D44k712R11K764j228j814J030J855j76j909M02K263l88j802j12J186P79j590
1413i7j538K013Q28k722m91K219O52j852r05K484Q46k440L0J834L59o28o70M82
1431D04R74r77j456R55J128n49k055N18K241j489k449K482J854j791j229J501
1447F2J314j225j126J896Q55j321m15l28O92P13j979m73K568j31k989k19K529
1464D23N25k900L80L780j174k957J481J703m76n87m7R93J74j544q31P55J395o50
1482D43k330J311K630l312j958L415J635k355q84K347O06k590J41K327j47q42
1498D37J81q02N82J98j935L17K470l98k856r5K892q78l026K624L257k890j933
1515a855K364O66j436j12J657L53j027o69p06j04J560o78j752K362J183l935q33
$$ y = [444, -2268, -1357, 1407, 179, -1635, -605, 1250, 1074, -835, -433, 1830, 1442, -360, -472, 714, 1493, -97, -1635, 378, 1206, -1516, -2007, 212, 864, -988, -1893, 591, 1437, -1003, -973, 861, 1220, 592, -78, 404, 1378, 401, -1055, -100, 1028, 479, -1576, -1058, 1183, -306, -2755, -273, 1581, -210, -1439, 62, 1376, 151, -975, 921, 1776, 455, 40, -288, 404, 1117, -862, -1335, 1233, 1102, -1887, -2106, 423, 948, -1952, -1572, 2208, 1034, -1923, -442, 1261, 785, 198, 151, 1144, 1318, -226, -1057, -302, 1093, 443, -1887, -576, 2054, -1258, -3216, 199, 1834, -521, -1405, 942, 1548, -1042, -901, 1426, 1279, 437, 618, -184, 398, 596, -1339, -1022, 1448, 1050, -1806, -1901, 991, 113, -2913, -289, 2968, 78, -1855, 509, 1175, -261, -373, 1284, 1637, 610, -59, -765, -869, 691, 13, -1739, 623, 1806, -2129, -2962]
1532b962L638P14k609L31L199j110l066J596J810j190J68O29q35j11l04j183K38
1549a047K101J23k792J31K815k054k538L630K384k932q76K162j62k090N15K226
1565A596j87r78K81j239l22J147j158o78K804J97l331m50L020rk736J700L571
1582C228k441k705K129R00j252K71Q41O9o05q03j052M80J860m03k299J707K233
1599B158l864j438M039J093k715J62K686p16l168R53K412q31n31N88r63q1J09
1616a07j761N89K735p72k346M42K364j274k586L152K841l204j480K458Rj718L23
1633c35J485J78j236n54k71l8R21o63r20K266M64l143r0K916l8k017J042K603
1651B570j620k556J581J342j332MO77m51q9o18j017P98J375m58j629J075J731
$$ y = [-2962, 676, 1390, -1219, -888, 2311, 1201, -1865, -269, 1541, 351, 519, 1148, 313, 202, -102, -1285, -1047, 1054, 1177, -1615, -1484, 1331, -723, -3261, 369, 2753, -179, -1055, 1107, 945, -1145, -630, 1596, 1409, 431, 712, -527, -849, 298, -860, -1538, 1266, 1463, -1868, -2318, 702, 693, -2043, -343, 3228, 787, -1918, 211, 1111, -141, 130, 971, 1040, 435, -368, -1420, -940, 920, 517, -1782, -75, 2158, -1706, -3144, 895, 1988, -727, -565, 2121, 1405, -1763, -810, 1602, 771, 240, 828, -135, -216, -107, -1868, -1279, 1456, 684, -1662, -1220, 1144, -130, -2716, 436, 3277, 73, -1407, 1051, 1060, -658, -335, 1150, 1328, 92, -462, -733, -771, 150, -513, -1433, 833, 1297, -1846, -1936, 980, 942, -1075, -33, 2570, 950, -1606, -25, 1317, -15, -11, 666, 215, 126, -492, -1509, -711, 664, 206, -1423, -348, 1383]
1668A383k133j492L324J083k714J45J832m44j710L90J418l83q30k6m73K06L90
1685c4j114p4K474o07k181N02K156o86j874J613K330j971j742J749N13j246j82
1702c74M55N97n37j066j58Q26P11j001r77J918J021k626j49K627M6k056M15J935
1720A607l47k300M16J824o52j008M0K35M35q73r55J497J044j242r78J352J255
1737A350j480j410K358J287k397n34J741O8j183p06J118P99j445p02Q73M30l24
1754a57q99K88J740n47j724J060J558q20j127P11J530q07j865J105J067j226p62
1771h75M26O10j7j246J36J302r2j046L8J090O42j286m77J887mj472K04J027R3
1790I40j074o73J223K22j396j93R48K44o54r63J180J292j223o87J130Q72p25r83
$$ y = [1383, -750, -2242, 1082, 2165, -549, -404, 1428, 984, -726, -336, 1082, 699, -131, -157, -630, -424, -34, -1148, -1222, 1252, 645, -1536, -1034, 1122, 436, -1438, 175, 2505, 534, -1208, 541, 1054, -192, -374, 81, 678, 141, -925, -1083, -257, 454, -547, -1524, 394, 1415, -1211, -1360, 1267, 1313, -743, -328, 1607, 1260, -1040, -624, 1200, 548, -460, -420, -185, 250, -623, -1578, -81, 963, -279, -1257, 95, 1350, -130, -1540, 818, 2105, -292, -826, 915, 983, -200, -906, 212, 1011, -434, -1136, -263, 167, -157, -1056, -768, 972, 425, -1299, -239, 1319, 499, -628, 83, 1613, 806, -1059, 46, 1113, -113, -875, -449, 161, 144, -1102, -966, 336, 244, -802, -764, 326, 968, -318, -795, 1092, 1088, -384, -180, 847, 940, -134, -807, 416, 638, -758, -951, -3, 241, -413, -1376, -196, 1096, -127, -814, 316, 1188, 463, -520]
1808e20O62J380j049j326J132O52q55r81K56J217m20j605Q95J160n40r98L71J352
1826G83kj566M79J755o48j106J08J122j3j535j57J581l36j532J96R83K79j293
1844i02k74J646K69j465J60J368L46j203n77J513N13j702l82J327J05j098p51
1861a107J022Q75j567p07J576L62p44o86Q53J254r57j011J357P61j016p24O02
1878A43J125q72j440Q76R68j114n80L76P01j52j082L08J488n44q73L53J029K06
1896I16j415P4J714n02j416L61R76k10j221j58J335l22j287K38J010K89n53p27
1914h98J054R42j327n47J426O92j121q41J092P94j725o33J420K03j083l47M10
1931d89P46m07q66O89R43l49q03J56J275P2j640O24J717j130j558R22J093r24
$$ y = [-520, 142, 1522, 473, -853, 279, 931, 76, -905, -649, 568, 148, -1457, -562, 598, 58, -940, -569, 783, 781, -785, -306, 1449, 801, -305, -197, 925, 912, -623, -780, 801, 465, -1067, -871, 112, 391, -902, -1176, 470, 739, -726, -566, 802, 1148, -55, -632, 881, 1394, -308, -690, 637, 742, -356, -1107, -85, 790, -777, -1484, 92, 454, -290, -976, -123, 1131, 174, -837, 520, 1281, 265, -459, 143, 1268, 396, -1044, -168, 800, -314, -894, -518, 183, 31, -1051, -743, 745, 201, -672, -319, 710, 916, -499, -425, 1289, 787, -629, -268, 708, 498, -723, -881, 454, 132, -1155, -917, 93, 382, -171, -898, 156, 1098, -229, -776, 650, 1342, 221, -620, 472, 1266, -459, -1092, 328, 531, -552, -899, -489, 257, -150, -1016, -327, 616, 267, -536, -380, 895, 967, -673, -49, 1668, 538, -1020, -98, 995, 71]
1949G1j228R19J013j288n59O13L28L21m43k90J006M37j369j89J521O37j481o47
1967f28J837j36k283K99J980o54j405L94P12o1j004L56O40L79o5q81K12J500q15
1986C77j355J541J377j659j498J278R98j609r17K161K56j931K41N80j81K33j97
2003c05K09P70J71j154m46J388P09j948R1K385j211k389J171J426j016q35R17
2020f7O93j099p89Q75K64K99M45q01J95J161j176j185J754J232j679j236J654
2037E40M91k502J8K492m96j465P25J90m25k16L62M87M67K27r78p08J543J87k105
2056a166J093K187j830j861J336R67j349o25J696N38j834j44R15l38N07L87n25
2073d6P65M32j486o88J740P28j714n08K061n20k715R75K049j076j029J153L86
$$ y = [71, -1157, -238, 775, -513, -1072, -459, -131, 190, -253, -543, 463, 900, -469, -658, 863, 1500, 19, -628, 1209, 1073, -1210, -911, 1069, 415, -990, -596, 116, 55, -949, -593, 47, 426, 361, -520, -308, 1192, 377, -978, 563, 1940, 281, -1217, 61, 1059, -550, -1467, 694, 950, -981, -740, -160, -341, -108, -305, -96, 674, 845, -309, -755, 633, 1342, -606, -515, 1870, 659, -1730, -559, 867, -149, -984, -67, 626, -473, -1262, -387, -123, 176, 621, -180, 15, 1176, 0, -1185, 569, 1801, 122, -1114, 540, 1031, -1471, -1453, 1039, 543, -922, -197, -7, -432, -648, -286, 201, 668, 895, -83, -791, 752, 939, -1166, -73, 2114, 284, -1577, -241, 726, -623, -1248, 448, 986, -848, -992, -77, -415, 92, 479, -46, 719, 1151, -335, -1023, 717, 1445, -269, -777, 1284, 764, -1951, -976, 1073, -3, -1032, 121, 507]
2090E07j053m56Q45N26J65L49q92j98J255q23j479J662J456j999j174J532L52
2107E75j818j69K394k07j679N68M56n45K73L03J51M92O3j162m03J246M93j756
2125g25K83K107j350k310J596J118j229m53J383K98j336k05R46kN8N58n94K02
2143C45P27j305q13J590P30j474p41J496J5k325N22K193p33j117J008J00m72j37
2161c91K80O09J88n0p10k72J076j97j677J095J564j714j234J355N30j298l09J667
2179E12M05j532l5R31j32N6jj75O94L8j220m0J111Pj065l07J622n38k069J116
2199f22J441r51p28Q15N31m58p22N71Q59j83l77o1J41O22j118p24J549K71j324
2218d68m56J105J77j268j31J626k8j283N69O44o4l27k32L86O77p72m77L67N68
$$ y = [507, -546, -1002, -157, 369, 534, 883, -9, -207, 1048, 225, -1254, 408, 1864, -135, -1309, 223, 575, -1243, -1412, 982, 775, -904, -336, 120, -425, -152, 151, 302, 794, 857, -305, -708, 538, 1031, -725, -442, 1665, 315, -1995, -399, 719, -510, -963, 420, 718, -618, -823, 123, 121, 179, 737, 143, 345, 1072, -233, -1046, 544, 1274, -200, -941, 555, 570, -1755, -1233, 960, 227, -890, 118, 218, -254, -391, -111, 498, 686, 636, -74, -346, 730, 533, -1144, -49, 1515, -199, -1433, -78, 452, -846, -1155, 512, 917, -615, -650, 281, 149, 205, 204, 29, 723, 761, -459, -499, 612, 619, -446, -753, 869, 331, -1738, -622, 819, -132, -860, -45, 486, 28, -694, -123, 736, 553, 176, 115, 256, 878, -240, -964, 585, 856, -468, -924, 181, 358, -910, -1041, 585, 557, -726, -157, 487, 423, 96, -136, 250, 927, 155, -322, 45, 613]
2237F13m30q89M52J072j075j041J156O30q88l78Q44O03p36o09R18M55l20m08R7
2256F6N99j9j097Q7Q77k86q44j8R05Nj144K20J307l85q90M62O61j5p05m6Q69K3
2278F32o55j06L58K78o39p15R67L62j119j33Q82K56o75m65Q39Q34j060l07Q75
2297D09J93l36n69L15Q54o97q29Q21L71o92m80K46R20n75j030Q06R47o06o00N02
2317c0O87j68r45L21J098n62q19K81N66J6j036L3J036l72j027M37N94J51p33k24
2337f96J243l1q90K38Q72k52m49l18P45K72j055j80Q93j13n39m84O17N70r42m05
2357i04J127P9n19j78N20O14n42o76Q22M64p39k76K66M65l16r12M10O13l94p23
2377g99M27O19j84q08N22R46n90m65M13N45l2o20p2P07j44q51J89N19j17n63l73
$$ y = [613, 183, -706, -254, 818, -257, -1298, -142, 488, -400, -778, 66, 669, -67, -676, 242, 697, 377, -31, 66, 665, 646, -451, -364, 513, 227, -617, -635, 270, 275, -869, -649, 658, 273, -617, -155, 506, 491, -214, -260, 609, 632, -23, -129, 229, 507, -132, -847, 120, 482, -637, -770, 112, 368, -307, -772, 67, 901, -159, -466, 409, 602, 266, -303, 12, 866, 169, -660, 161, 532, -160, -640, -394, 526, -49, -1079, -273, 674, 68, -532, -30, 657, 489, -456, -135, 963, 401, -418, -137, 429, 445, -591, -558, 478, 106, -921, -484, 110, 261, -472, -696, 547, 516, -374, -136, 736, 484, 35, -283, 462, 734, -321, -501, 392, 279, -260, -744, -127, 443, -499, -904, 223, 302, -217, -395, 125, 739, 197, -479, 343, 807, 68, -208, 58, 523, 207, -705, -295, 318, -76, -799, -372, 247, 63, -745, -223, 723, 133, -332, 81, 626, 594, -26, -98, 609, 465, -386, -197, 322, 205, -358, -731]
2398g31Q24K18j019J07J003l3o15k66J005K65r81J02P05r9l52m33M48M48p29n15
2418f48N84M87o68o92N58R04o75o73J058N32q29l92P32M32m87n65O61M06o77l14
2438b66l6M89J74r38o5J087l48r52M07R23j71p74L25R29l97r00O94N33m17l14
2458a7m8K18K01p64p3O32Q9m29o95Q84O00j224j92J481Or73K8P37Q5q14J44R08
2480G84l40o15Oq8L67m7o66L04Q50n37r87M72R13j55r60Q85Q67j205m74J069J26
2501E69m86o5J13M7k18k95j76M91M45n98o52J027K24j410L28J459k67r70M68O96
2521G30m43r36Q06N63n60k04R4l36K36o8n79N72O07n39r18N76J049q71o39J581
2541G21N05j731P3R30j71n29K00M94k30n06l7k82M79L69p03j28J216l56j452O68
$$ y = [-731, 93, 311, -708, -601, 402, 369, -246, -512, 493, 758, -223, -121, 584, 485, 133, -300, 148, 596, -133, -648, -64, 423, -245, -937, -379, 525, -150, -823, 235, 767, -62, -454, 278, 710, 223, -342, 319, 725, 48, -266, -302, 187, 361, -577, -642, 445, 97, -855, -448, 475, 304, -470, -145, 784, 387, -513, 181, 714, 297, -17, -65, 153, 354, -410, -483, 149, 238, -191, -886, -2, 598, -626, -818, 663, 669, -304, -276, 461, 546, -268, -124, 784, 444, -171, -165, -253, 114, 67, -599, -295, 555, 18, -969, -497, 416, 261, -699, 186, 1053, -152, -626, 443, 569, 83, 18, 131, 178, -40, -335, -511, -20, 425, -173, -825, 202, 426, -984, -656, 803, 536, -434, 34, 730, 287, -649, 157, 720, 160, -44, 50, -286, -50, -118, -697, -125, 482, -57, -975, -399, 650, -221, -860, 721, 1226, -505, -432, 498, 327, -202, -2, 492, 262, -244, -281, -563, -84, 285, -418, -546, 670, 314, -1138, -470]
2561d70J266k60j021P39R14j290o90J228J36o78K44m9k76P6k85j22L86P15n68
2580ep88Q75N85j474J75J841l04j405L39P74m45q38P10O11o15j98J2l66J73M24
2600H1n44K62R65o93r96P71R30o75p35J329M74j584j72J132l31n38M14J65k32
2619B3k93j75n8K48N18l41n34J100p4j461O48J382m94q86N96O83r68p26J103L13
2639F04p28J13Nm25K40r7l26O12O82o24p64O62P86r79l93J501R6j425J41Q71m24
2660A28n85M48L90k70m24Pj91L52L68n07j24J112m09j144Q35P36m84p37Q85L70
2680G56j013m53J075k6m71o3K45m9k42l43K67M56K68n47k62O85J08q51J36J248
2700I24m82p92L97N75o00o68N88M24m34l15J61r8K96Nm90N46N26o23l09N40N18
$$ y = [-470, 796, 536, -485, 254, 1168, -122, -812, 416, 552, -126, 118, 69, -207, -131, -416, -538, -152, 563, -5, -793, 82, 667, -807, -632, 1209, 905, -500, -161, 613, 168, -670, 40, 651, 36, -162, -150, -516, -343, 81, -463, -201, 764, 71, -925, -154, 776, 101, -634, 695, 1169, -415, -587, 545, 214, -324, 90, 255, 23, -270, -445, -503, -255, 263, -78, -612, 488, 414, -1047, -399, 983, 489, -397, 199, 882, -86, -812, 291, 604, -124, -11, -6, -431, -191, -288, -614, -2, 680, 56, -708, -46, 740, -239, -632, 869, 965, -460, -319, 552, 128, -457, -9, 381, 111, -313, -306, -497, -145, 223, -284, -408, 704, 295, -849, -14, 722, 238, -499, 386, 756, -257, -710, 365, 339, -132, -195, 50, 1, -241, -584, -317, 139, 407, -140, -402, 283, 391, -460, -324, 924, 442, -350, 47, 622, 22, -646, -58, 366, -68, -383, -222, -320, -24, -19, -509, 37, 563, -60, -369, 171, 689]
2721F89n86n51J059K87j246j28Q03j83l90R7K51K2m50j69L49J73J56l49p1O95
2741D58j79q27O35O13n63l74L72M17n41n63M62N15o28j64J50K49J11n89J05O09
2761B68k7m63M2N20J00n86j07Q95j51q03J62M45j80n34k0M58J81o86J01L67J60
2782A42l06k72M83N09n64k31N45L08o14k62L73M63o25n56O60J39n17j15K51L43
2802A54k89l06L29M60l34k36J62N32j78n94L81N76m19n20L34K38q3o57J03O29
2822B82l80m35K67M07q5k38m2N34O4m94J13L47J08m60k95N57Q1o59j03N82n6l13
2844b18j80L22L84o96j29N61J67k63jJ43L54k63l86N81Jl25k58K12L40l38n15
2865e07M42L07m45k24K38J93Q7m82K12P19m98l04K18M25l2m92j09P23k47o45K35
$$ y = [689, 103, -448, 611, 898, -348, -476, 327, 144, -246, -149, 102, 124, -326, -495, -146, 27, 183, -166, -237, 458, 279, -548, 87, 700, 137, -237, 135, 552, 11, -552, -90, 425, -203, -367, -217, 32, 143, -446, -341, 268, 241, -222, -180, 340, 440, -146, -253, 642, 491, -312, -150, 295, 115, -419, -439, 19, 200, -486, -385, -18, 142, -164, -436, 47, 556, -8, -239, 306, 614, 0, -262, 111, 574, -51, -607, 53, 192, -325, -440, -189, 154, -135, -441, -112, 348, 14, -222, -60, 472, 294, -300, 81, 657, 238, -282, 52, 290, 207, -450, -347, 282, -98, -533, -266, 141, 56, -182, -224, 310, 374, -120, -7, 340, 448, -12, -307, 250, 331, -328, -431, 151, 95, -218, -398, -76, 308, -388, -517, 44, 211, -52, -53, 90, 444, 181, -205, 376, 377, 52, -206, 6, 346, 8, -507, -65, 242, -203, -427, -189, 4, 91, -391, -179, 540, 42, -262, -44, 381, 349, -143, -252, 471, 224, -421, -186]
2886a86L21p1m27p2N32P7o21K06M44%l65j9L90K95n06k46O57j11m37j27M55J09
2908B98n61j65N93K3n00m2K62L01l37j16L30L24l42k29L01K65k88m14K99M56n98
2929a40l56N27K20l44m03K80M95m65j62M07J34Ok81R2K79J65o17J16M62k3o11
2950b19j5N70j23p08M03M74m01l36J89K58j2j88k6M40j15j41k40K16M74m43l60
2971c03O29J10o85k10L69L68m96l15P65j12n24J85K41K1K13k31j21M29j1l71P4
2992B5M41j39n79qQ20o65n76P26L03m67k70K30L99l58q5L08J58M1o0l46K39M00
3014E37o48k93P34J16p73j19N88O0p61K00Q09m03o52O21l8J8J18k0M6K46k05m55
3036b74J89M85k6q19M66N60r03n21R69J29m95j11N95j26n19K47M02k12K13R4l76
$$ y = [-186, 135, 64, -363, -435, 97, 174, -447, -241, 203, 203, -162, -181, 209, 504, -2, -248, 409, 298, -139, -266, 189, 298, -263, -428, 165, 188, -312, -354, -92, 209, -128, -244, 86, 410, 68, -161, 140, 405, 117, -297, 2, 458, -140, -496, 31, 251, -93, -496, -216, 279, -186, -348, 59, 193, 199, -82, 10, 289, 454, -163, -47, 415, 392, -219, -234, 336, 213, -495, -92, 382, -19, -355, -166, 92, 80, -108, -134, 306, 191, 50, -190, 26, 500, 57, -303, 326, 436, -249, -459, -90, 278, -218, -533, 232, 120, -404, -219, 22, 43, 256, 25, -96, 333, 322, -49, 25, 466, 327, -252, -260, 560, -105, -681, 45, 348, -119, -389, -159, 240, -118, -203, 105, 263, 304, 244, -102, 137, 537, -111, -404, 330, 446, -327, -446, 142, 202, -559, -359, 450, 47, -605, 16, -22, -4, 114, 94, 140, 386, 181, -274, -85, 400, 374, -445, 21, 581, -322, -843, 126, 255, -240, -351, 244, 118, -401, -154, 248, 36, 249, 343, -33]
3057c3J99K39o94L0O44J08q66j62Q52l44p82P97O01p85l11O56j49k38K07J53J38
3078B60K5m2m44K6N85l32m77O10L01r70k21Q48k7n70J04Q85m72n81M62J91k52
3099i1K91K3j67K65m9n18j16P69j74o37K22P02o76o78Q71M69p77K8M93j25k72
3120a47R2L09j30P2J47n12J61M93o58k30P65n3p54m8O10p7q08N88Q11p02m21O27
3142A35j07m6R8J28j0N9k79j82r1N97k29n55M81M66q08k81P70J28m99ON40j93
3164A28m05K23L30j88P3Q6l15K41L1o21J91N40j62n91J74N64m16m93P37M29o21
3185f5j44L95j14j5p1J77R0j13j21k39J54L44m07k87P03q2n19kN01j43l13J67
3207a04M59j89m95L91J94j89L7j00R9J27j72k77K61JOm38K98L70n90j70N27K66
$$ y = [-33, 166, 405, -289, -259, 385, 493, -373, -535, 317, -27, -809, -12, 589, -196, -507, 149, 0, -238, -31, 122, 260, 285, 243, -201, -175, 410, 78, -399, 211, 512, -458, -679, 169, 142, -428, -324, 561, 89, -492, -30, 161, -91, 200, 223, 56, 321, 272, -246, -362, 407, 233, -404, -182, 520, -156, -834, 37, 506, -271, -243, 250, 125, -147, -55, 254, 124, 196, 343, -169, -8, 485, -173, -403, 362, 309, -445, -493, 117, 40, -768, -180, 631, -71, -492, 135, 28, -18, 80, 208, 198, 257, -22, -204, -295, 302, 73, -482, -1, 465, -343, -624, 146, 274, -225, -219, 321, 128, -277, -54, 276, 88, 161, 247, -68, 173, 204, -417, -226, 314, 152, -439, -265, 299, -117, -610, 127, 556, -65, -209, 186, 72, 57, -14, 163, 253, 140, 19, -220, -66, 278, -129, -416, 287, 205, -314, -316, 185, 42, -271, -104, 355, 166, -329, 62, 256, 67, 104, 4, 103, 230, 58, -219, 42, 43, 49, -389, -91, 279, -311, -481, 46, 312]
3229C12m38K3K55l1j74j9J82J51j85K9k44J77Q4m37l6N76q0n59K51M01k11m44
3251d17K95M88k08k83K50J38j33j83N4L18j45l93L3K44L2k35k82M74J88n02n1
3272c18N29j5l39K8L87Q2m83J1M58k46n0j33O6K15j10m41L38J24k51j09J61K26
3294A30m8k86P5N20l37n5J33N6J4l76J43L11l67j18J17J13k1l00k5M98j95k91
3316c09K09L13o3k61lL43l3l17J11K44j08j30j57J94J26l17Q7J81j38k49j7K35
3338e9K16l06j05L96J17k53o5K39R1j90k55L36R8l03j72K08J88l96j55J22M68
3359B20m03k33M00J09j2k82K49K61j87l03K58J96j94k31P4K64j59k95N0L70j48
3380Dk37JJ86L38o65L61L42k09q4j60L69J12n54LN96l68q3o3Q9N1k36j79L33P5
$$ y = [312, -126, -103, 152, 121, -53, -72, 110, 261, 76, 105, -139, 38, 122, -315, -351, 225, 145, -414, -163, 238, 27, -417, -122, 366, 158, -125, 125, 263, 130, -53, 1, 319, 174, -219, -186, 58, 90, -145, -427, 47, 235, -267, -318, 211, 196, -143, -115, 272, 354, -129, -118, 340, 94, 44, -89, -23, 192, 82, -359, -21, 103, -148, -257, -96, 130, 82, -204, -129, 391, 54, -1, 132, 188, 202, -174, -31, 280, -87, -205, -88, 25, 4, -296, -321, 177, -18, -309, -100, 213, 150, -111, -114, 229, 196, -121, -10, 234, 126, -4, -161, 33, 159, -158, -71, 110, -28, -277, -294, -59, 157, -149, -254, 142, 259, 6, -59, 180, 271, 81, -174, 162, 260, -43, -215, -7, 181, -215, -370, -248, 220, -183, -416, -16, 93, 81, -201, 48, 309, 122, -181, 77, 273, 79, -152, -78, 186, 27, -268, -218, 152, 4, -233, -232, -46, 292, -373, -12, 330, 121, 37, -123, 246, 358, -196, -193, 403, 35, -48, -111, -22, 29, -207, -386, -53, 22]
3404B2j82r0K05J95q2k16K65J51k34q5K66M7j43k42Q4K15l04j50K53J79j44j75
3426a65m3M31k26k07J29L61j67l45J68M11j90l62L23O7k98K0l4N0J71k64LK09
3448D2O8k57j13L46J33m43K7M24Kl42J63J18n3j74N5N8K2k44J16j5J18o7k88J85
3472a19L05k63j49K33L08k77j96L39J62m63q1L08j3j34m9LQ6M0j93J08QJ61k79
3495a55l2L37o1l69K31M63k76j76m6K96j63m1L6J44k20r0Q6n8L4J5k7K0K36k72
3519h8k46M94K18l97k05N00k1n28J58K52Qk50P3Q4j59l5k2N1K35l7l04k9M75j90
3543C7l32L85K91j94l20K51J75l97n8L29N9l95J63m9k1O5m0o5J48J14k80j38L21
3566D9K81n42J03N62l48l13K17K48k06k63L66j03j29r0Q4j7R2Q8k55J56L03l69
$$ y = [22, -160, -250, -45, 150, 68, -148, 117, 268, 34, -51, 215, 262, 119, -123, -39, 176, -128, -278, -25, 154, 10, -165, -208, 223, -3, -210, -81, 280, 113, -232, -64, 347, 157, -205, 118, 185, -113, -93, -127, -77, 94, -170, -167, 42, 110, -147, -260, 86, 219, -224, -197, 227, 229, -113, 50, 168, 115, -59, -4, 54, 76, -168, -52, -67, 51, -16, -304, -119, 186, -77, -226, 7, 315, 38, -158, 181, 343, -120, -201, 107, 94, -40, -89, -86, 0, 40, -153, -45, -37, 124, -155, -187, 150, 89, -280, -49, 414, 138, -38, -84, 212, 49, 8, 44, 188, -32, -122, -36, -94, -60, -45, -72, -52, 184, -88, -334, 160, 378, -19, -224, 276, 255, -273, -115, 137, 145, -105, -32, 52, -107, -142, -164, -113, 122, 85, -219, -248, 227, 37, -295, 90, 381, 187, -133, 118, 293, -104, -162, 167, 226, -169, -6, -55, -76, -11, -51, -116, 32, 146, -134, -272, 49, 330, -212, -109, 453, 105, -208, 9, 257, 51, -212, 154, 51, -78, -168, -84, -101, -9, 79, -176, -20, 283, -86]
3588h6k16M77J27k78j39L94O3o70K04L65k58j41R8M0k38J34N5L5J99N2k17k33
3610b33N15j88m61M79K92l06k36J07J31j40k06K31J59l58M3Q4k6J45p7j40K92
3631A07J92l59l0K21J35l14o5M47q8n53K19K09j89jQ3M9j35m1l2N8J41Q6j85o7
3655a12L24k15l52M96J89l27j99K50N5k11q8M65k31k62K39k14L0J29o3k3J85J00
3677A65k40k9K22J54m01M3M63l47k34J22J82k02r9J62J54k09%J35q0N3P6k53K53
3700I0J50k82j52K58J41l63NL60M5n52J17K49k27O4R6p6J5L6k15K18J79j02q3
3723b9m2K80j5m45L73K34k83k43K32Q0k78n3J16J46k62J55N5k0l2o2m5K52Qj01
3747B1j13J98Mj93J5L17k10k57N0K90j72q4R2J81j91J9r1J67m0J32j77J58J81
$$ y = [-86, -302, 175, 302, 24, -115, 279, 342, -328, -124, 241, -17, -158, -60, -20, -258, -124, -69, -34, 165, 217, 0, -233, 282, 94, -367, 112, 404, 98, -138, -31, 100, -40, -246, -15, 144, -214, -171, -87, -113, 32, -45, -185, 107, 299, -60, -90, 131, 266, -48, -113, 334, 246, -307, -88, 121, -68, -69, 14, 63, -72, -113, -145, -87, 54, 140, -45, -112, 212, -3, -355, 141, 330, 3, -196, 54, 109, -102, -190, 275, 44, -218, 21, -193, -163, -34, -97, -120, 65, 165, -75, -104, 118, 272, -129, -86, 377, 30, -204, -82, 100, -102, -201, -39, 115, -94, -94, 41, -39, 14, 90, -163, 90, 240, -42, -194, 64, 205, -158, -153, 207, 252, -300, -183, 66, -161, -97, -1, -77, -62, -26, -241, -23, 156, 54, -29, -71, 209, 194, -251, 122, 356, 73, -170, 62, 142, -136, -189, -73, 73, -189, -34, 21, 1, -31, -93, -138, 114, 122, 21, -92, 106, 110, -83, -68, 249, 39, -218, -168, 122, -50, -134, -42, 139, -52, -33, -124, 43, 3, 135, -42, 116, 297]
3770B97l03j43K80Q3k17q9J06J72l20p2K44mk11R7O6J5J03j67J37R7j29j76J25
3793iJ22K7k88J02K64k27j71J31J06j18r1Q2J46p7j39Q2J22K1l3N9o9J91k08j9
3817FJ08j24j4j60J94M0j22q5J87o6j15J57L6J61k82m5K77k5j49Q9J00Nk84J10
3841aO1O9j84l8J91Mk1j78R7J57j76r7K01k4m9p6R9J34l2j84J06J0j18L9o9J61
3867H2j08j25J74P5k66J49j38J66R0j83J06J67q2j46K3R4M1j60NK02j04j82k8
3890a48K06rj36o5K15r6oK8J02n3Q0j15Q9J68k37K3O5n2j4k19J75j0o8n2J20O7
3916E8j01q8J59%k4l2J14M8k9r7o0J97j94J41j06M5J6k41J74Q5n7j39N1J81r4
3941Gn7P4O5J0m3J7j8J02o6j46M2K03r2k05J14K28l83j05L27Jk60N9J03M4j12
$$ y = [297, -6, -149, 131, 214, -3, -92, 14, 186, -134, -206, 38, 34, -177, -80, -14, 1, 104, -63, 74, 171, 42, -134, -9, 113, 140, -148, -46, 218, -9, -180, -49, 57, -61, -152, -70, 76, -1, -140, -58, 64, 85, 52, 111, 42, 233, 25, 6, 114, -10, -24, -184, 10, 50, -72, -157, 30, -36, -151, 6, 42, 203, -79, -124, 153, 128, -21, 68, 168, 173, -111, -1, 60, 129, -55, -93, 98, 102, 81, -97, 0, 157, -19, -116, 85, 61, 12, -64, 35, 169, 137, -47, 59, 69, -49, -10, -79, 82, -26, -151, 23, 98, -168, -19, -157, 9, 99, -84, 22, 189, 107, -39, -16, 78, 119, -41, -36, 166, 62, -120, -148, 58, 49, -87, -152, 63, -33, -39, -11, 91, 38, 118, 3, 92, 260, 23, 46, 111, 59, 45, -174, 1, -9, -77, -129, -9, 58, -43, -131, 28, 28, 4, -28, 86, 134, 105, 8, -52, 145, -49, 92, -14, 31, 47, -194, -20, 65, 8, -131, -80, 101, 7, -50, 24, 89, 99, 56, 73, 55, 157, 91, -55, -13, 190, 98, -107, 7, 235, -148, -253, 74, 75, -185, -126, -23, 21, -91]
3966i1J01M6o2KM8m7%J09j91M7K13j54k08J59J86j89j38J63Q5o8j53J37J85q1
3990I9j13K8j01K38j14j26N4J66k85PL76k05k00J75J39p8k09L0J76o1n7n3J20
4013FPR8j69O6J55j09q9O2J13o0k54J59J32k63L4J34O0k19R3N4N4j31Q7J12m9
4038H3m4jr5J10M0k06R3J57m8l22J89J14k6k32L46k0j70oj3P3j01K23j32N5q8
4063b1L5j39J74J30j97j41J76O0k86m5M88j88j73J38Oj9k28K88M3j58N0P6j6n9
4087fK8r7N6Q0r7k19J05K27k43L9K58j13m5q0J90j41O8j5p4J48L3L5k44J48L6
4112G7j81K5J34l8k73J47L49k18j59K56mk90J08J60Kq6JL0j38J17p8j20Q5K97
4136B03l09jJ77m5j03j5K73j09k4k0L7k3j22P8J29q9L0j1j23J47Q1l34J27J37
$$ y = [-91, 10, 56, -6, -4, 44, -3, -3, 106, -85, -38, 175, 21, -187, -28, 158, -31, -169, -6, 79, 11, -142, -5, 180, 99, -14, 14, -87, 151, 37, -89, -35, 131, -154, -147, 229, 24, -176, -1, 138, 60, -149, -119, 57, -4, -61, -114, 6, 13, 111, -58, 8, 163, 54, -35, 27, 140, 80, -174, -15, 117, -146, -112, 22, 82, -137, -44, 10, 64, -67, 20, 132, 83, 39, 38, -57, 53, 93, -113, -20, 137, 89, -233, -44, 70, 44, -188, 158, 138, -32, -38, -51, 22, -79, 144, 12, 67, -21, 14, -125, 49, 179, -18, -159, 17, 77, -209, -254, 234, 46, -127, 11, 17, -2, -230, 58, 101, -57, -7, 69, 53, -6, 22, -75, -19, 61, -36, -255, -150, 77, -166, -127, 131, 18, -27, -107, 83, -58, 10, -5, -79, 69, 102, 137, -107, 41, 77, -104, -79, 55, 17, -256, -109, 240, 22, -137, 119, 115, -175, -67, 93, 95, 9, 10, 40, -98, 19, -59, -179, -94, 203, -106, -107, 70, 25, -78, -93, 180, 71, 47, 27, 64, 41, -81, -3, 126, 37, 67, 56, -67, 80, 161, -173, -46, 91]
4160I1p3j51M9L14k19k03K90M7k54P8Q0N5j14J1k4J61o2k15O4J37N2k28QK23q0
4185C7k12J34K09j86M1mJ26j65k3M3R1j35Q4o3l9J29q0%l1M4k4n7M5K46k60j02
4211a52J02K04k74K60q6j6j5l2M1L4n1j09M6%P9k11J49J41j46k1m4J39l4m8L1
4236a3M5rr2J59j40J55j79M7J80j2l04N2J74m2j15j6R1M0j75J13P8M6l5L3p5P9
4262H5j68L6J14rj51QM1J2P0j91K70j46o1kJ02MJM8j09J10p6m1J06j10nJ53j36
4289d5Q3j38J94k24J20K0j33O5K26j89j11J30O8K2q1l0J85j01j82K10n4M3k25
4312a47O1l8J01%p3J76k8k85K67r7J37o2j08J74M0j61l1J68p7N5n8PN6j31k5L4
4338d5J65o2k78J33J92j85j6J25O9j71M9m4J03N4j96R2J4K6r3J46qj52J1N4J09
$$ y = [91, 18, -133, -84, 230, 11, -192, 98, 145, -109, -31, 49, 104, -10, 1, -23, 138, 76, -139, -75, 62, 114, -114, -106, 117, 37, -175, -41, 168, -18, 23, 19, 145, -20, -43, 0, 91, -44, 40, -23, -62, 67, -13, -13, -44, 0, -24, -81, -36, 210, -50, -152, -50, 154, -120, 140, 54, 38, 23, -9, 32, 66, 15, -94, -48, -48, 31, -180, -31, 110, -36, -57, -101, 38, 4, -44, -13, 32, 23, -69, 90, -50, 105, -74, -27, 153, 141, -163, -111, 63, 21, -94, -110, -19, 21, -154, -41, 37, 83, 48, 81, 6, 85, -83, -47, 67, 58, -93, -85, -44, -32, 38, -153, 117, -29, -90, -92, 10, 14, 15, 63, -46, 64, -12, -53, 53, -57, -62, 91, -45, 38, -100, 94, -130, -10, 10, -123, -58, 168, -21, -132, -2, 66, 88, 7, -23, 162, 61, -121, 89, 35, 78, -147, -86, -124, -23, -23, -96, 80, 52, -233, 34, -63, 74, 12, -96, 78, 118, -43, -74, 94, 17, 72, 14, 21, 77, -54, -79, -45, 120, 58, -220, -87, 105, -80, -96, 29, 98, -73, -24, -68, 35, 89, -107, -15, -1, 25, -68, 78, 70, -82, -71, -17, 92]
4363I2j22N1q5P7N0j50J63Pl4P2j13K2l6n6k6Q1J09j78L9J17m1j03l4J34j44K7
4389h1J21J02m5j62Q1k9J1j5L1j7k5q4j3K0J85q2n5L8J08j54K3J1J57j55OO7N1
4416I5j6r1k4J06q1r0J38p8K7q8K2Q1N6j08J2K5m3N6Jm5R0r7L3J55k06K2P3k5
4444@K9p8m3J01O5r3n3M1m2Q2k6R8n7l6m8J86lj73M4O5K0q9p0J14k3q1K2L6o3
4473g5J04o5Q1l5n0JK4R0j14JL5J14n5q7nO2p1J15n6m8J2Q7j81R3J63j46mQK9
4502B7r4R6oL1J1j22J41O7j58K1K3p3K7%o3k9j2J31j0J3rj34P0J39j46O4J31J2
4530A48j46j2N3L7r2o0j6P0p0N5oP3k0p2l4J78q3q1P5N9L1j57J72J9j03j05J32
4557D5l5j16R9n3J06j02J15l1m0R1Nk21J95J8j23Q3M4Rj56N5J39r8q2R0qJ8j17
$$ y = [92, -30, 21, -64, 13, 63, -87, 76, 83, 49, 121, 8, 30, -6, -62, -88, -7, 102, -76, -37, 80, 39, -64, -98, 36, -108, -81, 40, 142, 97, -65, 16, -13, -2, -17, 14, -3, -28, -112, -125, -105, 80, -2, -57, -19, 89, -65, -42, -31, 126, -29, -23, 44, 95, 79, -12, -36, 70, -11, -101, 37, -41, -14, -102, -80, 1, 57, -51, -39, -14, -57, -1, 0, -45, 45, -52, -19, 136, -70, -48, 25, 0, 29, -49, -92, 9, 74, -19, -72, -31, -73, 9, -17, 81, 24, -12, -60, 126, 123, -50, -6, 59, 79, -10, -80, 34, 11, -70, -48, -12, -75, 29, -36, 45, 10, -40, -39, -15, 75, -39, -38, -3, 111, 56, -31, -36, 26, -45, 70, 14, -34, -22, 65, -116, -23, 140, -6, -10, -2, 27, -67, 29, 23, 54, 65, -57, 84, 151, -7, 14, 37, -36, -9, -9, -72, -101, -113, 18, 8, 21, 12, -122, -52, 87, -59, 5, 136, 148, 2, -10, 43, 80, -12, -72, -88, -18, -88, -33, -39, 34, 14, -58, -92, 86, 3, -78, -3, 56, 87, -70, 102, 121, 18, -87, 45, 10, -106, -7, -60, 46, -56, 59, 28, -12, 79, 84, -137, 58, 76, -47, 36, 80, 89, -67, -12, 127, 29, -53, 37, 29, 47, -70]
4584g0K8k8O0J00r8o8J95j11o0o4K50o3k05J68j0J6q0j6L5P3j4j06J1K1J2P6J1
4611F3P9k54Q7R9q4J02j19K14o0n4j43K11j42j21J01R2j28N3P8k03RJ29L6n4J32
4636A23n1q9K3j9j29J12L5P9k9k33K63K4j13k4O2m5M5qo2N5J16j50j00R0J13k64
4662a76J75J06l5j08%J48o0l9K2m4l6jmL8q0M2O5k2J12j32L0k3J83k41K19m6l8
4689E5k07J10N8On4n1J29j16k7P4k2J25q0nO5M5L6j26O0O9p3j94J24M0j24j1R8
4716Dqo5L3K02k00J11j37R3r1J30p6k9O5J1j5n4J71j13o8MR5l5l4L3n8N6j58J57
4744B4K7j11L2j2R8k6m3P0p9m6n7oK09r7o9J38j08j9k2N4Q3j4j66K16q4K3n8J05
4772F2o6P9j12J02N0k29J33j75J62J03j33q8J81K2j70QL3J32p0l8P9M4K5j58q6
$$ y = [-70, -42, -70, -10, 90, -8, -76, 119, 8, -52, -116, 134, 71, -134, 34, 24, 40, -40, -56, -21, 52, 38, -68, -57, -36, -24, 52, 63, 142, -112, -25, 74, -10, 92, -27, 187, 127, 73, -70, 141, -1, -122, -21, 71, -57, -4, 74, -129, -120, 9, 45, -9, 123, 72, -17, 6, -13, -142, -30, 5, 84, 55, -178, 85, 109, -4, -28, 34, -11, 34, 26, -36, 19, 135, -15, -115, -25, 88, -176, -1, 105, 70, -38, -38, 110, 50, 11, 33, -11, -47, -48, -52, -14, -94, -52, 13, -9, 103, -29, 1, -22, 161, -80, 139, 93, 55, -152, -42, 16, 22, -32, -83, 46, -70, -97, -23, -45, 80, 0, -5, 60, 105, 141, 15, 75, 144, 71, -123, 1, 41, -83, -94, 4, -4, -69, -36, 166, -34, 77, -60, 33, -58, 72, -4, -33, 32, 43, 28, -26, 145, 32, -36, -32, 63, 28, -6, 27, -31, 25, -133, 24, 51, -60, -28, -40, 58, 32, -11, 59, -20, -66, -123, -129, 80, -17, -86, 52, -56, -75, -97, -43, 40, 26, -140, 76, -8, 15, -43, 62, -4, 75, -37, 65, 115, -114, 19, -156, 6, 109, -24, -112, 69, 91, -79, -71, -38, 94, 24, -14, 65, 109, 134, -24, -110]
4797a10K00m6j80J25Q5q3m5n5J69j35M9L2Q3j29On7J34J08k07n8J63m2Pj1l2J08
4823G9l0j33L9K6L7oj8L9j13%N6R8r7n3R0k5Q7m1j22J84j62R7j16L9J3K7J8q2
4851f9j4P2J05ro7M2j87J44K8m9k6J00N5j25M7l5L2L1j31R3Pj15NQJ22Q5k58P1
4879c8L4Q8L5q1mk7nN0m0o4MJ29p9k6m9n6L3P8K1J18r6p0m2J14O7j75R0m5M9k5
4909a2M3l9O2m1j29J55nm3j1K2J0j3k2K3L7K1j84K33j62r0O7P6oJ13j45K3p8J37
4937D2op8R1j91Q4m0N1L4M4m6J18j16O2j07J30J2m5M0m5M2j29nQ1Pr4J10k48L02
4965A00n5RJ01q0j55J35p4LM5o6J7Q2l2k0P5p6k8j32J64K7k5j12N8N1ln9J88j8
4993A20q7l5l3R3M0j20J2nMj31K15j18L9N1L9j54P0L1O4Mq9J2k7O9o5Lo1R2M9
$$ y = [-110, 90, 44, -136, -11, 74, -9, -54, -109, 60, -75, -26, 6, 89, -40, -34, -91, 43, 151, -56, -114, 49, 7, 14, 3, -29, 79, 49, -84, -45, -19, 18, 12, -6, 33, -80, -80, -24, 74, -23, -76, 14, -11, 76, 35, -87, 97, -65, 32, -84, -45, -32, -5, 13, -69, -83, -11, 94, 85, 18, 60, -127, 17, 45, -4, -30, 70, 125, 0, 47, 12, 44, 75, -56, 37, 44, -71, -66, -58, 64, 149, -109, -38, -4, 84, 119, 38, 34, 7, 2, 52, 12, -52, -48, 81, 2, -24, -73, -129, -96, -18, 3, 121, 25, -45, -87, 27, 94, -81, 9, -36, 13, -12, 31, -8, 54, 13, -116, 39, 34, -9, -20, 2, 12, -1, -23, 0, 37, 58, -126, 107, -55, -145, -78, -2, -8, 105, -40, -17, -95, 42, 36, -42, 49, -142, -58, -98, -47, -13, 31, -15, 103, -13, 49, -58, 72, 84, 39, 79, 34, 76, -53, -58, 23, 30, -64, 46, -202, 100, 45, 54, 155, 75, -80, 55, -19, -16, 29, -37, -20, 62, 30, 10, 85, 9, -19, -151, 13, 40, 15, -97, -39, 12, 9, -50, 138, 120, 33, -2, -35, 58, 98, -22, -10, -15, -11, -142, 73, -45, -6, 45, 84, -70, 0, 31, 95, 99, 10, 22, -5, 64, -1, 2, -59, 33, 82]
5022H2r3O0j44J49p2R5l6q3J59q5p4L5J3p4J9K5m0M0R9r7J72k08O4o9J74j20P1
5049F2j37L2k9K22p6j1j31Q0m5l6Q0M0L9r6J1PO4p8q8P0k2J19k6n5Q5q4Rk3PO9
5079E9j43J6j3O0j29J97M8q1q9j0R8m9P7M4p5l7j2j4Q2pr9m2O4P4q0N7O3L9j76
5108g8R9k2o5J55n7J0j37N9J03l14L02o9q1L6K6J00j33op4J83j26J81q8k6J13
5133I1j06r0J28j9o7j1N8q0J2J38j45J21j55J55p3J6j13K04L2n3P0j64rJ62o9
5158C3Pj6M8M2r2j0o9r9J93jl0l6RJ40j59J41j30q8J53m4J7m1O0j4q3J16K5r0
5186a8M1m9J14ML3r1n3J16l0M6j29Q0o4L3k6N6o9pq9L3R8j13M4K9n4J48K1p5m7
5215a8O3n6J5o5O1K2o2o0J04Q1j01Nl8J3J7J4lj8J18J1j30m2O3m8rP9J3r4R3J03
$$ y = [82, -11, 49, -95, 54, -18, 77, 41, -42, 117, 32, -42, -7, 6, -68, -49, -24, -64, -24, 75, -22, 150, -58, 6, -63, 111, -9, 62, -75, -43, -72, 150, 74, 63, -68, 12, -33, -69, 11, 51, 90, -6, 5, 12, 76, -2, -90, -20, -42, 77, 51, -4, 81, -3, 6, -17, -10, 59, -84, -68, -81, -21, -150, 47, 95, 14, -75, -85, 13, -36, 41, 85, 10, -27, -39, -53, 29, 22, -77, -119, -55, 19, -61, -4, 59, 98, -78, 21, -1, -66, 89, 32, 42, -95, -36, 67, -247, 55, -14, -95, -59, -33, 67, -66, -72, -146, 37, -89, 92, 4, -22, 91, -15, -105, 23, 4, -63, -74, -16, -96, -84, 54, -91, 30, -125, 30, -43, -27, -140, 64, 96, 43, 113, -51, -60, 102, 33, 40, 24, 72, 114, 22, 12, -57, -156, 37, 36, 6, -30, -21, 119, -40, 101, -29, -117, 36, -8, 9, -32, 28, 14, -69, 47, 72, -18, 23, -26, 88, 92, 125, 34, -19, 97, 67, 113, -16, 64, 0, 33, 7, 63, -6, -13, -102, -69, 29, -84, -40, -11, -65, 83, 104, 29, -18, 45, -11, 4, -61, 0, 22, -40, -100, 4, 85, -16, -11, -49, -36, -19, -5, -8, -26, 92, 103, -27, -69, -6, -54, -63, 16, 29, -65, 28, 131]
5245A31j76j3J29j34P1l2j42J04J10l8OJ9j00O8o6m6J26j67R4QO6r0N2J23o9n6
5271b2L9L0j04J50q7ol0P4j62J20m2J7o4J51oj19J04o4K9M8mOK9Jj27m7J59l5
5299C8l4j91J12J52p0J1n3P7O1m0p5P6k0k4ok8k1M7M3k2L9m8j8j4J01j09J11q0
5327A5J1j92O8P1l7K76k53l0j5K35j33k8n7o6J36o0K3N4j2j9M9l6p5J37j16R5
5353D1J2J7j43R3J9J12j38o8l8J90n2l3q1J77p3n5p4q3J91j24J12R0j20J2J9r3
5379i0O6k0J40j73L0K0j6Q0k9m1k0O5l8m3K8J00J2j05O4jKo4K5j38J07L3J2Q1
5407H7j44O4M5j01O5j24P0K8k3jm4P9K7r4J01o0J67m2k01l0J25N1q1J2J40j16
5433@r7Mk5J92m4m0l7J21j56R5K9q1lQk5R4j1mk1J0j0R7j57j5J18j08J16M4m9
$$ y = [131, -45, -58, 71, -63, 8, -24, -166, -62, 48, 10, 16, 35, -65, 3, -63, -109, 17, -150, -56, -48, 18, -72, -20, 103, 34, -22, 17, 47, -57, 93, 6, 0, -30, 44, -118, 2, -40, -23, -87, 64, 58, -61, 43, -21, 8, 56, 52, 58, 87, 88, -39, -86, 73, 38, 4, -187, -75, 77, 7, 18, -35, 42, 103, 63, -12, 64, 44, 20, 14, -14, -35, 12, 55, 33, 72, 24, 6, -8, 93, -16, 95, 15, 26, -166, -98, -27, -64, 212, -41, -71, -86, 149, 16, -12, -69, -135, 1, -59, -36, 18, 6, -13, 36, 0, -75, 62, -54, 41, 53, 70, -73, 20, 39, 151, 13, -55, -93, 97, 45, 12, -69, 108, 35, -20, -94, -177, 14, -110, 2, 92, -28, -16, 3, -90, -24, -44, 96, -77, -47, -27, -43, 37, 8, -33, -53, 12, -26, -69, -41, 59, 71, -34, 30, 29, 31, -33, -8, -146, -39, -6, 6, 87, -57, 7, 52, -49, 16, -108, -38, -10, -33, -34, -78, 1, 28, -66, 35, -25, 142, 100, -101, -131, -6, 45, -36, -24, 116, 0, -97, -93, -118, 74, 30, -10, -47, 74, -82, 13, 42, -39, -42, -34, -59, 35, 24, 20, -1, 9, -1, 96, -61, -76, 42, -66, 50, 94, 45]
5462D5km1j4J9L0j0Pj03n9L8O4o2P5R7o2j7Lo0K3R7j14J79j22l3J35j44R6p7O7
5491E5l7M8j61J19k3K9n4L6r7J26j1q8J4m1j1M2J1K5J32j08L6o8L5K6m5l9J34
5518H5q3Q1m7p5J00j0j16L0K3J13j6r9K3m0qk1J06%j01M7p4J00p6p2J88L8j97
5545a01K2R7m9J9L6k3O9j77n7J67J1N5r7R2j55L7J09m9M3o7n5N4Oj0K6Kn3K8j
5574b1N9N9j51N3Qj28J45n9L4%l9j01N9P3P1k7j63P8m3J08m2P3rj43J92m9j90
5601a53J57l1J21Mm2m5j6J03r1oR4l9j4r9R9m2n5N2LJ9m9q0K28j07n0k2K1K3L7
5630B0k0j40P5P8M5n7l0p6J45k4k2K1j3K3PKp0K9P0q6m7M9j22K55k46J77j74K1
5658a10pJ33l1mm4m9J51J0n9k1pr4J66o9K6Q0k4j02P2o5P9j21N6j3o2J45r4J04
$$ y = [45, 43, 2, -12, 7, 37, 27, 34, -69, -128, -90, -26, -88, -13, 84, 22, 5, 8, -52, -29, 68, -46, 133, 11, -22, 113, -31, 65, -12, 55, 18, 66, -95, 24, 1, 30, -24, 12, -85, 41, 30, -58, -44, -85, -96, -54, -43, -18, 114, 6, 42, -26, 9, 35, -10, -49, 85, 2, 83, 36, -39, 61, 51, -65, -35, -12, 101, 85, -14, 9, -31, -39, -60, 46, 46, -55, -8, -82, 18, -58, -130, 58, 96, -101, -79, 18, -31, -12, 24, 1, 70, -107, -164, 3, 14, 69, -28, 64, -91, -54, 55, 6, 49, -18, -73, -19, -13, -23, 3, 5, -48, -20, -21, 38, 97, -54, -1, 7, -121, 24, -35, -1, -1, -40, -141, -82, -9, 62, 35, -128, -50, -93, 15, -27, 46, 37, -106, 86, 37, -153, 4, -27, 94, 98, 56, 11, -5, 98, 7, 1, 95, 56, 42, -57, 42, 0, -55, -3, 0, 19, -30, -110, 118, 11, -39, -61, -40, -17, 20, 0, -140, -65, 13, 58, 1, -29, -105, 40, 16, -6, 15, 2, 25, 32, 34, -36, -7, 63, -23, -70, -21, -143, 112, -134, 43, -131, -110, -117, 16, -15, -19, -63, -112, 39, 49, -10, -31, -38, -132, 34, -35, -9, 71, 47, -55, 17, -48, 31, -90, -34, -47, -109, 36, -58, 46]
5686D6Lj60P1k5J55j38L1j7J2n6K4P9%%m7J3l3J78j27j7J38j23k1m6NJ5j4R7j6
5715B7j80J46k4k8M5n1J32o4J5m9N9l6j3J7J24j75O1L5R5j31O3q2p7J51j75P4
5741d1K5O2o7J1l2R6o7K4l6P2j22m2J03m0J86j45N0k1Jj4N2m4P6q8L4q8O9m2K9
5770AK3j1N8l9j2J3R2j02j6N7j02M4J23k00J23q1n6L7Q8Rq3J12m6m0Kj5o6J2P6
5799Alj18N6P0l5P6Rj02K1l0Q9j08kJ09p9NPr7J52q1JO5j7K4n7O4m6M8m8j47K05
5830C2j10k2K10Pk6j34jL8j1j29J77n5r6N1n4J51L4p2P9J9l2J5j6k3L4j25P2p6
5858f3L4Q1o0KK09k52l5J24p1M1j6l0J93p7j53J18n2l3N2l4M6K7j19J86j19j00
$$ y = [46, 49, -111, -40, -65, 90, -48, -17, -34, -22, -78, -54, 25, 25, 25, -22, -9, -42, 136, 9, -8, 130, 7, -14, -60, -55, -40, -54, 43, 27, -153, -7, -31, -59, -14, -65, 67, 3, 18, -31, 28, -8, -21, -4, 120, -55, 6, 41, 136, 5, 68, -14, -91, 60, -115, -41, -16, 46, -21, -10, -42, 54, -13, 11, -25, 47, -75, -117, -14, -54, 132, -13, 37, 16, 17, 3, 55, 11, 87, -1, 33, -55, 14, -28, 1, 24, 13, 71, 32, 20, 33, 125, 23, 7, 64, -38, 6, 129, -71, 52, -29, -85, -48, 40, 49, -34, 78, 32, -8, -6, -21, -87, -75, 1, -2, -120, -64, 6, -29, 47, 56, -46, -25, -55, 34, -74, -76, 33, -46, -41, -34, -131, 21, -60, -59, 6, -11, 13, -44, 20, -26, 22, -26, -173, 32, -78, -100, 110, 117, 91, -43, -44, -6, -17, -146, 31, -24, -120, -69, -123, 28, 62, -10, 69, 88, 56, 71, 55, 32, 66, -59, 13, -63, -29, 52, -8, -6, 203, -49, -84, 40, -31, 10, -6, -36, 157, 80, -73, 45, -7, -40, 12, -22, 24, 51, -68, 118, -1, -101]
$$ [...]
8191e
##END NTUPLES=NMR FID
##END=
