##TITLE=1H_Pr Dep 1
 200.13MHz,CDCl3,
 8 sc
 
 4.8.2025
##JCAMPDX= 6.0         $$ Bruker NMR JCAMP-DX V2.0
##DATA TYPE= NMR FID
##DATA CLASS= NTUPLES
##ORIGIN= UXNMR, Bruker Analytische Messtechnik GmbH
##OWNER= pz
$$ XWIN-NMR		Version 3.5
$$ Mon Aug  4 16:14:04 2025 Russian Standard Time (UT+4h)  she@DPX200
##.OBSERVE FREQUENCY= 200.1313
##.OBSERVE NUCLEUS= ^1H
##.DELAY= (6, 6)
##.ACQUISITION MODE= SIMULTANEOUS
##.ACQUISITION SCHEME= undefined
##.AVERAGES= 8
##.DIGITISER RES= 18
##SPECTROMETER/DATA SYSTEM= spect
##.PULSE SEQUENCE= zg30
##.SOLVENT NAME= CDCl3
##.SHIFT REFERENCE= (INTERNAL, CDCl3, 0, 14.3821)
##AUDIT TRAIL= $$ (NUMBER, WHEN, WHO, WHERE, WHAT)
$$ ##TITLE= Audit trail, XWIN-NMR		Version 3.5
$$ ##JCAMPDX= 5.01
$$ ##ORIGIN= Bruker BioSpin GmbH
$$ ##OWNER= she
$$ F:/spectra/data/she/nmr/H-C/1/audita.txt
$$ ##AUDIT TRAIL=  $$ (NUMBER, WHEN, WHO, WHERE, WHAT)
(   1,<2025-08-04 16:12:29.26 +0400>,<she>,<DPX200>,
      <created by zg, POWCHK disabled, PULCHK disabled
       configuration hash MD5:
       00 E9 B6 7A A2 85 ED C7 34 08 36 98 17 FE 4E 26
       data hash MD5: 16K
       FF 2F 9E 4A 49 09 50 19 14 C9 AE BD 90 25 68 48>)
$$ ##END=
$$ 
$$ hash MD5
$$ AF F4 2A 9B 72 8C 1A 83 D4 DF 74 4D AD 24 43 6D
##$RELAX= 
##$RELAX= 
##$RELAX= 
##$RELAX= 
##$RELAX= 
##$RELAX= 
$$ Bruker specific parameters
$$ --------------------------
##$DU= <F:/spectra>
##$EXPNO= 1
##$NAME= <H-C>
##$PROCNO= 1
##$TYPE= <nmr>
##$USER= <she>
##$AMP= (0..31)
100 100 100 100 100 100 100 100 100 100 100 100 100 100 100 100 100 100 
100 100 100 100 100 100 100 100 100 100 100 100 100 100 
##$AQSEQ= 0
##$AQ_mod= 1
##$AUNM= <au_zg>
##$AUTOPOS= <>
##$BF1= 200.13
##$BF2= 200.13
##$BF3= 200.13
##$BF4= 200.13
##$BF5= 200.13
##$BF6= 200.13
##$BF7= 200.13
##$BF8= 200.13
##$BYTORDA= 1
##$CFDGTYP= 0
##$CFRGTYP= 5
##$CHEMSTR= <none>
##$CNST= (0..31)
1 1 145 1 1 1 1 1 1 1 1 1 1 1 1 1 1 1 1 1 1 1 1 1 1 1 1 1 1 1 1 1 
##$CPDPRG= <>
##$CPDPRG1= <>
##$CPDPRG2= <>
##$CPDPRG3= <>
##$CPDPRG4= <mlev>
##$CPDPRG5= <mlev>
##$CPDPRG6= <mlev>
##$CPDPRG7= <mlev>
##$CPDPRG8= <mlev>
##$CPDPRGB= <>
##$CPDPRGT= <>
##$D= (0..31)
0 0.7 0 0 0 0 0 0 0 0 0 0.03 0 0 0 0 0 0 0 0 0 0 0 0 0 0 0 0 0 0 0 0 
##$DATE= 1754309548
##$DBL= (0..7)
120 120 120 120 120 120 120 120 
##$DBP= (0..7)
150 150 150 150 150 150 150 150 
##$DBP07= 0
##$DBPNAM0= <>
##$DBPNAM1= <>
##$DBPNAM2= <>
##$DBPNAM3= <>
##$DBPNAM4= <>
##$DBPNAM5= <>
##$DBPNAM6= <>
##$DBPNAM7= <>
##$DBPOAL= (0..7)
0.5 0.5 0.5 0.5 0.5 0.5 0.5 0.5 
##$DBPOFFS= (0..7)
0 0 0 0 0 0 0 0 
##$DE= 6
##$DECBNUC= <off>
##$DECIM= 32
##$DECNUC= <off>
##$DECSTAT= 4
##$DIGMOD= 1
##$DIGTYP= 9
##$DL= (0..7)
0 120 120 120 120 120 120 120 
##$DP= (0..7)
150 150 150 150 150 150 150 150 
##$DP07= 0
##$DPNAME0= <>
##$DPNAME1= <>
##$DPNAME2= <>
##$DPNAME3= <>
##$DPNAME4= <>
##$DPNAME5= <>
##$DPNAME6= <>
##$DPNAME7= <>
##$DPOAL= (0..7)
0.5 0.5 0.5 0.5 0.5 0.5 0.5 0.5 
##$DPOFFS= (0..7)
0 0 0 0 0 0 0 0 
##$DQDMODE= 0
##$DR= 18
##$DS= 0
##$DSLIST= <SSSSSSSSSSSSSSS>
$$ [...]
##$SUBNAM0= <"">
##$SUBNAM1= <"">
##$SUBNAM2= <"">
##$SUBNAM3= <"">
##$SUBNAM4= <"">
##$SUBNAM5= <"">
##$SUBNAM6= <"">
##$SUBNAM7= <"">
##$SUBNAM8= <"">
##$SUBNAM9= <"">
##$SW= 18.0517328524113
##$SWIBOX= (0..15)
0 0 2 0 0 0 0 0 0 0 0 0 0 0 0 0 
##$SW_h= 3612.71676300578
##$TD= 16384
##$TD0= 1
##$TE= 0
##$TE2= 300
##$TE3= 300
##$TEG= 300
##$TL= (0..7)
0 120 120 120 120 120 120 120 
##$TP= (0..7)
150 150 150 150 150 150 150 150 
##$TP07= 0
##$TPNAME0= <>
##$TPNAME1= <>
##$TPNAME2= <>
##$TPNAME3= <>
##$TPNAME4= <>
##$TPNAME5= <>
##$TPNAME6= <>
##$TPNAME7= <>
##$TPOAL= (0..7)
0.5 0.5 0.5 0.5 0.5 0.5 0.5 0.5 
##$TPOFFS= (0..7)
0 0 0 0 0 0 0 0 
##$TUNHIN= 0
##$TUNHOUT= 0
##$TUNXOUT= 0
##$USERA1= <user>
##$USERA2= <user>
##$USERA3= <user>
##$USERA4= <user>
##$USERA5= <user>
##$V9= 5
##$VALIST= <valist>
##$VCLIST= <CCCCCCCCCCCCCCC>
##$VD= 0
##$VDLIST= <DDDDDDDDDDDDDDD>
##$VPLIST= <PPPPPPPPPPPPPPP>
##$VTLIST= <TTTTTTTTTTTTTTT>
##$WBST= 1024
##$WBSW= 4
##$XGAIN= (0..3)
0 0 0 0 
##$XL= 0
##$YL= 0
##$YMAX_a= 101061
##$YMIN_a= -127900
##$ZGOPTNS= <>
##$ZL1= 120
##$ZL2= 120
##$ZL3= 120
##$ZL4= 120
##$ABSF1= 10
##$ABSF2= 0
##$ABSG= 5
##$ABSL= 3
##$ALPHA= 0
##$AQORDER= 0
##$ASSFAC= 0
##$ASSFACI= 0
##$ASSFACX= 0
##$ASSWID= 0
##$AUNMP= <proc_1d>
##$AZFE= 0.1
##$AZFW= 0.1
##$BCFW= 1
##$BC_mod= 2
##$BYTORDP= 1
##$COROFFS= 0
##$CY= -3
##$DATMOD= 1
##$DC= 2
##$DFILT= <>
##$DTYPP= 0
##$F1P= 0
##$F2P= 0
##$FCOR= 0.5
##$FTSIZE= 0
##$FT_mod= 4
##$GAMMA= 1
##$GB= 0.15
##$INTBC= 1
##$INTSCL= 1
##$ISEN= 128
##$LB= 0.25
##$LEV0= 0
##$LPBIN= 0
##$MAXI= 10000
##$MC2= 0
##$MEAN= 0
##$ME_mod= 0
##$MI= 1.114404
##$NCOEF= 0
##$NC_proc= 0
##$NLEV= 6
##$NOISF1= 3.799351
##$NOISF2= 2.8
##$NSP= 1
##$NTH_PI= 0
##$NZP= 0
##$OFFSET= 14.38212
##$PC= 1
##$PHC0= -1201.029
##$PHC1= 20.1923
##$PH_mod= 1
##$PKNL= yes
##$PPARMOD= 0
##$PSCAL= 0
##$PSIGN= 0
##$REVERSE= no
##$SF= 200.129724274929
##$SI= 16384
##$SIGF1= 3
##$SIGF2= 2
##$SINO= 400
##$SIOLD= 16384
##$SREGLST= <1H.CDCl3>
##$SSB= 0
##$STSI= 0
##$STSR= 0
##$SW_p= 3205.1282051282
##$SYMM= 0
##$S_DEV= 0
##$TDeff= 0
##$TDoff= 0
##$TI= <>
##$TILT= no
##$TM1= 0
##$TM2= 0
##$TOPLEV= 0
##$USERP1= <user>
##$USERP2= <user>
##$USERP3= <user>
##$USERP4= <user>
##$USERP5= <user>
##$WDW= 1
##$XDIM= 8192
##$YMAX_p= 0
##$YMIN_p= 0
$$ End of Bruker specific parameters
$$ ---------------------------------
##NTUPLES= NMR FID
##VAR_NAME=  TIME,          FID/REAL,        FID/IMAG
##SYMBOL=    X,             R,               I
##VAR_TYPE=  INDEPENDENT,   DEPENDENT,       DEPENDENT
##VAR_FORM=  AFFN,          ASDF,            ASDF
##VAR_DIM=   8192,          8192,            8192
##UNITS=     SECONDS,       ARBITRARY UNITS, ARBITRARY UNITS
##FACTOR=    0.0002768,     1,               1
##FIRST=     0,             0,               0
##LAST=      2.2672688,     0,               0
##MIN=       0,             -127900,         0
##MAX=       2.2672688,     101061,          0
$$ Real data points
##PAGE= N=1
##DATA TABLE= (X++(R..R)), XYDATA
0 0 0 0 0 0 0 0 0 0 0 0 0 0 0 0 0 0 0 0 8 -8 8 -8 8 -8 12 -16 16 -17 24 -24 28 -32 36 -40 47 -51 58 -66 74 -82
40 -82 90 -98 111 -121 135 -148 163 -180 199 -219 241 -265 293 -324 359 -398 443 -494 557 -630
60 -630 719 -833 977 -1174 1450 -1872 2593 -4038 8058 -44944 -127900 6160 66412 -7167
74 -7167 -30609 5335 -3393 -11537 16023 15568 -26663 -13092 26807 13930 -1007 6200 -17039
87 -17039 -11101 32733 18567 -27967 -12849 19710 2216 -18217 8242 9612 -31425 -9098 38604
100 38604 -4659 -43876 10456 34276 -17448 -22397 25084 14598 -24437 2521 25899 -11431
112 -11431 -11537 23537 2125 -20457 6008 11890 -7038 -1509 1464 -14969 -1294 23476 -9375
125 -9375 -36319 14983 33756 -26024 -26312 29448 15435 -24889 -2704 24190 -423 -14392 12127
138 12127 9410 -15140 5541 19557 -14091 -17153 14578 7819 -13889 -4554 3168 -8658 -3975
151 -3975 12834 -3620 -18285 9065 12307 -14099 4341 21554 -14277 -17026 28572 22065 -26184
164 -26184 -15981 24571 8671 -16899 2914 3013 -19754 1965 20068 -11336 -22067 5123 10323
177 10323 -4735 -1149 3974 -7973 -674 20950 1921 -17669 10364 17375 -11043 -4432 16596
190 16596 -1586 -18593 3508 15704 -11358 -16518 9732 973 -16680 6744 10154 -16555 -4439
203 -4439 18227 2444 -11053 5703 12544 -4517 -2427 13898 -1221 -11108 10930 5222 -16166
216 -16166 1224 10562 -13884 -11792 11772 3065 -17856 -3184 15108 -3773 -10786 12105 6230
229 6230 -10598 7569 14415 -7732 -5711 13656 5000 -11653 -1292 8360 -6760 -7320 7080
242 7080 -5412 -13622 6834 6060 -13700 -3456 12481 -808 -9498 8774 11410 -9034 -1639
255 -1639 17479 -1002 -11442 9111 7190 -10623 -1203 7821 -6736 -10945 5248 4546 -12501
268 -12501 -3780 9158 -5206 -6161 10511 893 -8858 8521 11044 -6754 -3419 12019 3713 -10294
282 -10294 3222 10014 -10020 -7369 10582 -2534 -13499 3124 5622 -9418 -4498 8973 247
295 247 -8863 5321 9320 -6415 -1164 11518 -840 -5265 8559 3118 -8709 731 7761 -5718
309 -5718 -9513 5658 2560 -12502 -510 9274 -7802 -6608 9994 1842 -8745 3616 10179
322 10179 -3269 -4793 9682 4340 -9094 2904 8670 -7521 -4678 7231 -3279 -8699 3209
335 3209 2861 -8151 -3039 7917 -1162 -8259 6803 7327 -8037 829 11408 -2436 -5338 8162
349 8162 4410 -7745 -1185 7680 -3108 -9129 4869 2872 -10740 -66 7469 -6418 -5138 7398
363 7398 1314 -6159 3250 7399 -3809 -3230 9639 2216 -9005 4348 7304 -7273 -3071 6635
377 6635 -2924 -8077 3366 4454 -7914 -4876 7735 -363 -7479 5426 5295 -6892 1230 8741
391 8741 -2121 -4512 5631 3755 -6131 -1036 6845 -4051 -7940 5912 2025 -9291 1011 5561
405 5561 -5985 -3817 7261 1952 -6841 1583 7808 -3406 -3680 8799 777 -8250 4497 6757
419 6757 -6852 -3914 5207 -1106 -6131 2100 2904 -7338 -2574 7970 -1181 -7141 5401 4358
433 4358 -5285 1329 7042 -2479 -5034 5602 4393 -6850 -1582 6864 -4020 -6787 5121 1401
447 1401 -7639 450 4561 -4273 -2863 6602 1943 -7468 1934 9116 -3175 -4224 6498 259 -5119
462 -5119 4334 3862 -6881 -3629 5214 271 -6128 1397 2855 -6587 -232 8878 -2890 -7779 5236
477 5236 6024 -3133 -864 4332 -953 -2950 4786 2838 -7525 -896 6168 -4191 -5058 4968 -374
492 -374 -7725 921 6023 -2642 -4885 4286 3034 -5323 2650 6974 -4544 -3189 6568 654 -4728
507 -4728 2749 1974 -6075 -1796 6607 -842 -9631 1099 5716 -4622 -1655 4820 -2657 -3193 5949
522 5949 3865 -4068 -732 5229 327 -2992 4310 1472 -7965 1052 7041 -4622 -6294 3173 1917
537 1917 -4431 -658 3708 -1678 -3048 4807 1849 -4452 3655 5936 -5360 -2199 7317 1103 -5557
552 -5557 355 3323 -3408 -2942 4276 -1440 -7164 2275 4293 -4859 -1346 3931 -2047 -1882 6026 2866
568 2866 -5341 -568 7594 730 -4766 2612 1549 -4434 1546 3638 -4907 -4438 3466 1900 -4783
583 -4783 -965 4152 -2492 -2909 5875 1407 -5060 2636 5295 -2429 -1877 4541 1263 -4165 517 3195
599 3195 -3055 -2299 3907 -2810 -5605 4295 2566 -6457 -1524 5460 238 -3064 2811 3258 -3253 279
615 279 6432 -1082 -4454 3245 1596 -3705 1073 1827 -4345 -3329 3599 1817 -5577 -1561 4503 -1345
631 -1345 -2605 4197 148 -3542 3533 4328 -2455 -1520 4270 1054 -4264 778 3790 -4245 -3175 4207
647 4207 -1028 -5256 2287 1708 -3979 -432 4163 -267 -3221 2574 3570 -2816 281 4798 -1717 -2539
663 -2539 3989 787 -4694 331 2600 -2197 -3440 2233 1187 -4864 -76 4347 -2215 -2458 4049
678 4049 1049 -2642 2082 3468 -1937 -1222 3743 1106 -3993 815 2998 -3616 -2214 2761 -1805
693 -1805 -3370 2466 1208 -4051 -614 4426 -665 -3808 3195 3668 -3237 730 4529 -1696 -2353 3433
709 3433 898 -3706 -475 2160 -2072 -3717 2254 901 -4231 606 3492 -2558 -1099 3113 555
724 555 -1588 2065 3222 -2138 -1568 4107 530 -4408 1531 2634 -3826 -1494 2727 -1514 -3591 1470
740 1470 1894 -2956 -1430 3827 -44 -3032 3432 2601 -3077 895 3812 -1419 -1516 2213 650 -3135
756 -3135 -197 2449 -2709 -3555 3135 552 -4343 777 2799 -2321 -832 2956 614 -2197 1438
771 1438 3545 -1774 -1687 3721 400 -3715 1498 1607 -3261 -1230 1729 -1476 -2899 839 1828 -3034
787 -3034 -788 4030 -738 -2951 3504 2161 -2711 953 3058 -1199 -1771 1991 1141 -3236 -634 2706
803 2706 -2394 -3032 2620 2 -3410 1099 2223 -2067 -978 2759 948 -1912 1301 2928 -1715
818 -1715 -1078 3849 -436 -3422 1556 1211 -2747 -1217 1806 -738 -2931 1157 1466 -3285 -387 3997
834 3997 -739 -2138 2857 1585 -2080 753 2633 -925 -2106 2266 1263 -3202 -96 2483 -2674
849 -2674 -2355 2590 -314 -3121 882 2067 -1292 -1024 2492 904 -2220 1574 3333 -2127 -926 3456
865 3456 -1058 -2325 1095 906 -2456 -1485 1671 -563 -2963 997 1666 -2768 -27 3411 -1167 -1672
881 -1672 2747 1649 -1714 328 2530 -429 -1945 1916 1255 -3387 -110 2118 -2502 -1807 2112 -341
897 -341 -2855 563 2028 -1073 -1415 3113 1197 -2566 1911 2444 -2242 -450 2742 -609 -1950 511
913 511 691 -2095 -1239 1683 -713 -3317 1333 1492 -2666 24 2350 -958 -1134 2527 1334 -1056
929 -1056 -19 2478 -535 -1998 2000 995 -3375 241 1977 -2169 -1693 1368 54 -1928 522
944 522 1999 -1401 -1122 3033 1001 -1766 2038 2052 -2013 -297 2668 -284 -2179 286 1192 -2115
960 -2115 -939 1599 -1307 -2532 1657 1080 -2473 290 2119 -291 -743 1907 1537 -1911 59 2983
976 2983 -560 -2121 1552 603 -2320 207 648 -1934 -1398 928 431 -1867 188 2406 -1668 -1230
992 -1230 3286 338 -2017 1803 1937 -1484 -322 1681 32 -1939 448 1181 -1965 -1478 1903 -1086
1008 -1086 -2125 1874 770 -2527 39 2317 173 -1128 1316 1481 -1354 425 2508 -1467 -1575
1023 -1575 1734 -165 -2031 71 919 -1994 -1685 1645 524 -2890 288 2312 -970 -733 2062 348
1039 348 -1362 1663 1285 -901 -773 1605 -178 -2141 783 1179 -2977 -1018 1894 -958 -1684 1430
1055 1430 199 -1440 132 2079 230 -1306 1643 1590 -1497 676 2240 -1523 -1128 1745 38 -1903
1071 -1903 -414 777 -821 -1797 883 521 -2272 391 1940 -1558 -268 2158 -68 -768 1363 1713
1087 1713 -1385 -839 2020 -236 -2650 816 1179 -2378 -784 1130 -1159 -860 789 456 -1127 -47
1103 -47 2031 -60 -1106 1972 1385 -1418 928 1635 -1334 -508 1166 16 -1645 -321 1448 -1144
1119 -1144 -1799 1415 318 -2138 941 1554 -1568 -167 1973 351 -831 742 1700 -666 -880 1584
1135 1584 -208 -2079 999 475 -2102 -450 1298 -1101 -1230 1073 845 -1101 161 1780 -250 -1098
1151 -1098 2180 824 -1263 598 1429 -756 -733 873 351 -1980 -123 864 -1496 -1300 1420 -26
1167 -26 -1608 988 938 -860 -260 1422 408 -968 918 1994 -1357 -612 1907 -647 -1631 964 178
1184 178 -1779 -226 781 -411 -1279 641 1288 -1473 -3 2078 -622 -929 2033 628 -868 1074
1200 1074 937 -578 -1025 682 285 -1716 -188 1302 -1722 -930 1693 -442 -1538 818 1151 -616
1216 -616 -49 1777 475 -816 1006 1563 -911 -367 1665 -826 -1421 553 61 -1593 -612 771 -493
1233 -493 -1502 710 800 -1465 228 2024 -562 -570 1958 579 -989 749 1419 -585 -1106 522 248
1250 248 -2046 43 728 -1530 -1069 896 -445 -1157 597 659 -713 -55 1203 394 -851 845 1164
1267 1164 -1226 -181 1550 -738 -1006 579 167 -1652 -911 1139 -634 -1410 1062 899 -1450 628
1283 628 1527 -2 -246 1146 417 -630 126 1340 -623 -1002 980 -9 -1541 361 690 -1319 -451
1300 -451 801 -114 -1142 613 1486 -593 -536 1797 606 -1343 1289 1161 -1112 -314 1107 -116 -1123
1317 -1123 16 523 -1153 -586 1091 -807 -1410 1149 359 -1063 818 1207 -570 -248 1242 679 -724
1334 -724 160 1417 -713 -1352 1039 -337 -1897 462 559 -1297 -520 797 -209 -587 207 1282 -182
1351 -182 -434 1512 292 -791 1108 734 -1066 109 891 -292 -1018 234 438 -1710 -724 1088 -543
1368 -543 -1285 1039 437 -999 305 999 -42 -185 1053 1061 -910 338 1495 -1139 -753 1105 -335
1385 -335 -1230 275 212 -1042 -429 700 168 -884 784 1106 -705 -435 1742 232 -856 1157 611
1402 611 -890 -328 693 -72 -1117 142 336 -1420 -296 979 -597 -891 1047 215 -653 552 1351
1419 1351 134 -390 1195 866 -891 264 1041 -1094 -849 790 -392 -1330 122 649 -615 -610 893
1436 893 180 -1432 867 1171 -529 133 1295 -241 -353 762 529 -660 -755 537 -222 -1140 424
1453 424 354 -1568 -237 841 -705 -405 768 286 -532 47 839 160 -650 1172 699 -1070 314 512
1471 512 -1163 -469 613 -383 -788 -107 437 -706 -607 740 263 -1029 516 953 -827 453 1125 -227
1489 -227 -316 385 651 -623 -146 1043 -311 -1195 565 194 -1186 -345 498 -445 -554 480 364 -266
1507 -266 280 1261 -188 -71 1303 378 -845 433 407 -747 -544 379 119 -1039 -528 510 -642 -839
1525 -839 922 -59 -854 978 671 -670 336 1040 334 -683 456 787 -591 -308 914 -324 -1115
1542 -1115 409 -51 -1324 223 460 -656 -463 400 288 -504 291 1269 -67 -280 939 268 -581 472
1560 472 610 -631 -315 244 3 -962 -167 427 -877 -531 889 -88 -665 920 376 -127 229 728 380
1579 380 -633 643 930 -653 -72 599 -838 -622 417 -304 -826 -357 505 -224 -448 749 496 -693
1597 -693 296 932 -277 -223 880 79 -309 203 477 -603 -513 173 -84 -1170 -187 576 -838 -466 708
1616 708 -66 -379 671 379 -256 14 853 356 -380 619 686 -971 -139 751 -672 -693 2 -133 -606 -49
1636 -49 296 -447 -611 692 376 -684 282 1208 -217 15 780 209 -519 212 580 -629 -538 653 -202
1655 -202 -1355 376 354 -972 -298 607 95 -329 724 674 -318 -163 1012 255 -581 955 693 -735
1673 -735 158 412 -614 -654 81 -121 -968 -338 718 -470 -384 567 278 -639 376 662 -453 -19 499
1692 499 168 -526 -62 459 -514 -560 473 -32 -818 134 282 -489 -272 325 44 -493 506 514 -106 -155 1176
1713 1176 -155 -307 654 332 -580 -38 36 -424 -729 -89 82 -747 -29 347 -523 -507 814 340 -397 266
1733 266 603 21 -95 609 231 -635 79 323 -751 -383 442 -167 -775 26 10 -481 -110 348 30 -379
1753 -379 380 710 -483 230 485 8 7 648 -71 -601 -252 304 -292 -577 277 -195 -749 -248 666 -710
1773 -710 -68 738 89 -188 503 628 158 -130 278 409 -670 110 213 -914 -267 485 -437 -683 27
1792 27 71 -224 -290 415 170 -435 383 558 -324 236 1061 -139 -201 434 163 -371 -113 230 -230 -1067 400
1813 400 145 -898 -224 636 -269 -228 743 156 -213 4 614 -91 -326 557 124 -682 270 332 -544 -49
1833 -49 129 -501 -351 195 343 -594 -357 714 127 -366 828 696 -308 430 738 -163 -47 303 327 -445
1853 -445 -270 535 -686 -670 480 74 -934 -15 444 -372 -92 522 375 -148 406 648 -29 -398 892
1872 892 87 -692 257 272 -532 -265 129 -450 -335 -80 372 -581 -407 817 96 -307 479 -41 289 397
1892 397 553 -322 -172 417 101 -595 -452 319 -384 -644 386 -58 -588 331 233 23 -322 125 238 -232
1912 -232 -8 647 -46 -276 713 -41 -446 486 295 -552 -248 236 -321 -589 -41 340 -624 -103 735 -153
1932 -153 -94 660 234 -49 270 424 38 -161 310 380 -607 -1 340 -504 -346 324 -9 -215 147 431 -27
1953 -27 -200 403 319 -127 469 656 15 -38 443 -203 -543 242 -114 -483 -397 78 -151 -706 234 274 -498 -179
1975 -179 499 109 -169 550 297 91 20 515 127 -213 430 160 -463 -97 333 -617 -452 223 37 -513
1995 -513 40 254 -136 -545 350 171 -247 353 781 -241 228 703 -270 -415 151 374 -269 -370 192 -11
2015 -11 -763 264 106 -339 -33 387 -177 32 392 310 -330 -291 436 379 -308 380 187 -404 263 -116 -389
2036 -389 -532 174 -26 -314 -124 240 -213 -115 511 -38 -583 485 478 -183 132 183 -25 -201 -230 103 -520
2057 -520 -282 313 -256 -771 107 413 -302 194 189 185 -143 544 574 -86 84 436 -100 -336 396 1 -675 199
2079 199 96 -591 -372 235 -23 -679 -53 308 -252 -76 722 433 -100 400 334 -160 176 310 -365 -195
2099 -195 58 458 -353 -363 208 -384 -664 -47 325 -465 262 334 230 87 265 203 -80 -208 531 -43 -341
2120 -341 356 -243 -367 -169 71 -349 -404 -87 28 -349 -306 23 -330 35 643 214 -57 291 113 -29 34
2141 34 238 277 -491 85 177 -549 -186 340 -167 -502 -3 -67 -115 -266 378 -191 -187 582 602 -286 211 764 -226
2164 -226 -84 368 -231 -116 42 127 -436 -393 615 231 -363 160 546 -187 187 545 237 -105 211 282 146
2185 146 -333 523 345 -375 55 195 -607 -29 264 -89 -459 -32 27 -271 -199 500 -46 -401 341 324 -321
2206 -321 394 50 -238 -154 220 -50 -398 -326 -15 -200 -381 171 -147 -73 450 267 -157 113 615 284 360
2227 360 -137 532 62 27 191 -147 -647 82 -146 -558 -206 30 -136 -63 29 176 -88 -176 383 145 -46
2248 -46 484 311 -153 454 -63 -98 -58 -107 -20 -320 -179 350 -68 -356 404 99 -248 604 269 -95 347 492
2270 492 88 55 68 416 -108 -61 389 -30 -305 471 -42 -428 -138 12 -301 -23 97 333 -290 11 491
2291 491 -114 95 604 101 -303 199 83 -32 -51 32 310 -476 -74 216 -377 -392 54 -144 -14 39 124 -251
2313 -251 90 150 349 11 8 719 -20 -194 256 -320 100 63 67 -345 -267 123 171 -507 161 283 -338 -238 214
2336 214 -130 50 617 -190 181 292 269 -29 -412 -14 164 -736 -74 140 -410 -11 205 -144 -153 178 40
2357 40 187 -65 279 103 -229 234 475 -307 166 461 -167 -33 -106 -30 -401 -255 9 -79 -423 58 193
2378 193 -209 2 273 -110 232 363 178 91 113 385 -79 -392 -12 -207 -427 -49 -6 -180 -312 283 -171
2399 -171 -332 -32 183 -37 106 365 121 -305 381 187 -301 -74 166 -72 -242 -143 -98 -246 -280 293 -154
2420 -154 -174 312 -169 -54 294 53 69 -104 286 531 -174 267 447 -186 -93 314 -95 -449 300 -229 -219
2441 -219 -256 55 158 -260 24 253 -35 49 425 98 -80 379 211 -275 249 245 60 -66 -115 185 -439 -287
2463 -287 75 -169 -400 -126 -18 -126 255 102 158 -182 295 151 -257 -180 118 -287 -242 164 -306 -337 -251 195
2485 195 -383 -190 -106 182 -377 90 65 -114 149 180 71 -553 345 385 246 156 128 -19 -315 104 -68 -581
2507 -581 -162 22 -251 -116 338 -216 215 -25 435 -4 -69 90 401 -229 164 273 -293 -191 178 300
2527 300 -54 -58 19 -477 -244 189 91 -163 250 150 174 98 517 -200 -170 133 222 32 75 295 -138 -749 55
2550 55 -58 -517 -93 207 -248 -321 76 236 -35 -42 150 91 -22 407 339 -155 33 262 -187 204 16 -186
2572 -186 -69 -270 164 -75 -263 335 -14 -432 -35 11 -345 358 586 132 278 7 108 -160 -255 133 -104
2593 -104 -147 174 -125 -363 -63 -154 33 -280 59 -46 177 82 174 -18 -52 310 368 -63 162 237 -223 -315 -47
2616 -47 -183 -201 -355 206 -533 -196 91 -70 -161 -57 108 -16 37 279 66 -111 154 15 56 -125 339 -35
2638 -35 -346 133 -147 -362 114 -262 130 -70 -4 191 -33 178 381 120 -244 509 -52 110 206 23 -25
2659 -25 -95 -270 231 -374 -271 106 -660 -221 140 -232 -225 411 369 -18 190 177 84 -106 -180 -7 -122 92 365
2682 365 -123 -149 -112 -276 -89 -418 73 231 -325 119 4 -59 127 376 -257 50 -22 -5 -60 -108 150 -265
2704 -265 -24 -29 106 -407 -123 240 -185 19 -24 -136 -33 107 144 -50 -208 119 -108 -130 145 261 -227 -47
2726 -47 7 -319 96 217 -341 39 -190 -147 -208 -166 274 160 -321 213 192 -237 103 340 100 -177 60 91
2748 91 -128 -161 112 -209 -164 95 310 -207 -285 -13 -34 54 -9 233 -41 -372 406 203 58 381 -91 -170 23
2771 23 223 -123 30 -59 -5 -255 46 125 66 -158 398 181 -292 392 377 9 -66 136 137 -6 15 44 -144 -175
2795 -175 196 -166 -234 -63 70 -135 148 56 74 -116 -14 39 -36 421 215 -2 127 296 85 7 35 64 -88
2818 -88 -196 -203 -132 -141 226 373 40 1 -127 114 -217 444 234 166 -50 187 26 -127 2 -139 -180 19 13 -322
2842 -322 -384 213 -113 77 -57 120 -138 90 178 139 -16 48 356 -22 92 286 106 72 76 57 -70 -16 64
2865 64 -20 -192 -43 53 -152 -176 -102 98 43 -16 271 276 -114 112 119 -175 238 348 182 1 129 -60 -154 149
2889 149 -68 38 -120 313 -73 113 -50 -38 -18 193 207 -125 0 -9 -64 -41 -190 231 136 -217 211 -23 -202
2912 -202 214 -103 -218 37 -10 0 -46 254 274 110 -122 128 46 -462 -120 289 -142 85 -85 -128 -195 -51
2934 -51 185 104 -387 366 214 -191 112 -9 -10 39 217 -257 347 19 -101 -109 116 -198 63 -242 88 -182
2956 -182 -150 42 178 56 -225 152 -85 257 187 321 68 139 344 -21 -153 100 -30 -225 -232 -370 -274 -211
2978 -211 -151 82 -82 107 231 -80 -40 142 -58 -162 377 272 -201 -64 -51 19 59 -144 75 -217 -49 118
3000 118 -406 -92 -238 -114 216 53 -16 271 -188 208 145 -144 -106 214 117 -196 277 -119 -131 191 182 -69
3022 -69 -92 -248 82 87 -110 283 -80 -90 -9 -244 338 9 244 -61 -127 96 290 -39 0 -26 -277 -37 4
3045 4 -296 -96 -168 -70 -240 31 186 -151 221 -240 274 -122 215 203 -86 -36 73 -272 -21 -86 -140 357 -396
3068 -396 23 73 -357 -199 -14 -232 248 23 10 66 -17 228 -31 30 -53 52 -112 58 -28 -424 -225 58
3090 58 -170 -91 54 125 44 -37 -84 300 -284 176 356 -114 266 94 18 24 354 67 -30 -404 -76 -311 -288 101
3114 101 -86 65 134 133 274 -70 152 98 39 -152 156 72 15 -148 195 -8 247 58 -124 -156 -175 27 -78
3137 -78 -87 156 128 -190 20 -123 81 177 114 -135 -64 -27 290 -2 -75 31 -169 -343 139 0 -101 107 7
3160 7 161 81 -135 -64 98 -20 506 -9 217 136 -114 -153 21 -97 -174 333 -96 -443 -91 104 -94 -252
3182 -252 -20 -5 -174 -40 233 -165 -81 253 12 -118 68 -30 -104 -117 -182 8 -99 -54 -248 -248 -16 372 -292
3205 -292 -15 130 126 -9 22 44 224 -65 -69 232 16 -29 189 111 -200 36 106 41 -322 125 -25 -160 118
3228 118 78 104 55 138 -228 65 23 215 44 262 227 232 148 29 251 -278 76 107 -543 -230 78 69 227 204
3252 204 169 -41 -188 88 90 85 228 195 210 26 263 133 -30 22 173 -149 -270 -53 150 -186 395 142 -73
3275 -73 -49 70 -74 79 -189 -34 -80 -135 85 -339 -310 101 146 -126 -213 -358 -2 -281 -90 -273 78 -103
3297 -103 126 49 169 96 -153 -179 368 235 20 194 -26 317 -184 129 60 -292 -64 -78 73 16 218 199
3319 199 -68 149 62 -93 -20 -86 119 -48 285 29 64 99 166 25 -153 -125 -13 18 -44 -82 184 96 133 295
3343 295 2 222 -156 83 -24 33 44 -54 -24 40 -277 -105 -175 29 -214 -355 20 -120 -251 -3 -235 77
3365 77 -116 -20 53 59 -255 120 -183 -238 108 -99 117 113 178 76 -82 -75 -90 -156 81 9 107 66 111 118 142 111 103 223
3393 223 199 -20 84 73 298 200 -108 24 128 -458 -156 177 -68 -200 64 146 -89 -31 147 1 -41 139
3415 139 125 34 118 -37 1 -438 -54 1 -104 -283 -58 204 -97 -28 69 -125 -89 187 -50 175 243 0 -169
3438 -169 233 187 99 26 -40 -14 -55 -74 -183 -248 -90 -123 106 387 80 20 116 -146 261 -253 -121 -16 77 -45
3462 -45 -57 57 -225 46 45 15 -173 -53 217 -204 -25 61 162 -205 -21 77 -11 -21 135 150 163 29 358 -311
3486 -311 -254 26 -238 -210 -30 -134 -165 -50 23 -114 66 -15 -76 -127 212 -100 -18 25 14 -43 17 452 188 -259
3510 -259 -66 73 56 -122 -202 141 -156 -66 382 10 -1 115 -103 164 169 156 145 258 -145 64 -33 -128 -115 -62
3534 -62 -74 -312 -44 -525 -6 -11 175 -25 -287 116 80 39 67 -112 -48 76 -20 156 -177 111 136 -166 37
3557 37 -31 -270 -141 161 -321 -121 -90 99 19 55 153 -69 64 128 140 -126 73 325 -129 -44 248 -179 209
3580 209 12 -11 67 -74 -245 184 -234 217 56 72 52 -30 -130 -55 114 176 -289 7 -21 114 119 -22 -115 -262
3604 -262 64 -111 -329 123 179 -16 102 -231 185 383 134 95 62 44 252 112 45 405 -179 -124 -72 -154 -187
3627 -187 -73 -52 65 -97 -284 201 269 -198 360 121 -228 -115 24 226 21 172 -205 -9 -290 -285 -121
3648 -121 -78 73 -239 125 133 17 185 -102 72 116 -30 -29 49 -96 -120 59 99 -13 -154 -133 -162 -111 -175 182
3672 182 -169 -173 256 -228 -14 3 146 -81 47 248 94 131 -119 -364 -66 184 153 -80 0 72 -123 -59 -23
3695 -23 -105 15 -173 -19 -29 6 92 156 -30 -11 -140 68 -172 95 3 -158 110 -81 74 -147 -53 46 137 -208
3719 -208 -19 -68 -46 137 -17 57 179 -110 108 209 -143 122 -78 109 59 10 28 -112 -175 -130 -93 52 234
3742 234 -28 31 47 275 288 43 -2 -67 181 164 -10 -91 -1 96 -111 50 60 -136 44 -164 -60 199 -2
3765 -2 58 -55 44 5 -44 305 111 161 -80 257 109 -174 45 264 -75 -187 50 -95 -194 -26 25 -49 -9 -26
3789 -26 193 17 144 192 -269 137 32 -60 286 -73 40 118 73 6 155 126 113 -177 80 -184 81 254 -53
3812 -53 -108 237 439 -138 129 76 -5 88 65 -67 -68 181 -34 95 -163 65 -19 -338 229 116 7 -14 174
3835 174 -386 -26 226 69 49 102 -283 82 -103 245 24 -63 -80 -30 -113 -169 28 21 -120 -98 -29 -251 78 92
3859 92 -80 -81 105 22 -102 -64 39 96 382 16 -10 11 -64 -74 -31 77 113 -14 -12 102 212 19 -134 220 -158
3884 -158 -130 43 -103 68 -290 -22 95 174 -145 -182 -238 5 115 -104 -248 113 83 -160 -105 121 160 227 196
3907 196 -34 -40 -24 -14 11 -36 -108 -66 5 -100 -113 46 -206 182 -147 -166 -157 195 -8 341 223 127 387 -18 5
3932 5 -125 -158 17 -96 -160 -4 -57 -110 164 61 -177 7 273 248 -172 150 80 -24 -19 40 44 -230 274 -153
3956 -153 -39 85 142 30 30 -227 86 -265 59 -16 -91 -205 14 137 79 185 -13 -141 -42 -134 -50 35 -27 -99
3980 -99 -317 -140 -89 -123 243 -91 -38 -84 -166 69 -86 -120 237 -134 -305 96 116 -80 121 231 -153 -235 57
4003 57 42 -106 52 72 -108 55 -132 150 -266 -213 96 138 127 94 156 194 -230 -30 -165 55 194 -43 -67
4026 -67 -72 281 -120 182 -204 180 -53 -109 -86 316 -121 52 16 68 101 -45 -123 21 1 255 50 -188 25
4049 25 -178 181 -158 34 15 -53 -146 -237 31 -37 13 -159 -105 193 -105 -21 -74 105 -123 221 141 -112 -123 -106
4073 -106 103 -34 149 -41 80 106 96 -148 -223 31 87 34 193 -70 4 -51 125 -278 -49 108 -169 47
4095 47 -172 240 -88 -60 211 67 -11 146 172 37 -137 -207 245 99 -23 39 -36 -47 517 164 -73 -155 -119
4118 -119 67 -323 101 120 10 -68 230 137 -35 196 -23 18 -24 142 24 79 117 35 -133 -13 72 -36 12
4141 12 -61 -202 -27 0 -71 -145 23 89 95 66 -107 113 -142 -42 1 38 167 85 50 -72 -234 -114 -68 48 38
4166 38 -127 -187 43 23 231 33 146 143 279 0 47 -30 -83 129 4 -2 -273 196 -33 10 306 -2 28 186
4190 186 269 -61 -306 111 -125 -53 394 250 -10 -17 183 -141 64 -14 56 -111 66 80 325 -52 -154 -15
4212 -15 -179 -134 84 -91 -142 28 105 39 -156 13 169 -53 127 134 -4 33 -229 -178 -65 115 -68 -45 135
4235 135 14 -209 -50 60 -148 269 -140 -8 -143 91 -24 1 59 19 -63 65 157 70 -99 49 49 -18 -19 -87
4259 -87 42 1 177 36 62 -71 77 -21 -96 2 104 -268 -135 128 -34 159 -160 -69 25 -52 -39 363 -131
4282 -131 24 -111 -40 -172 -186 -63 251 281 33 -193 109 25 -39 -91 -104 -86 -66 123 -152 -54 264 177 -69 -119
4306 -119 55 -333 -220 -42 59 63 -172 -120 -72 -30 68 -82 -183 -2 -196 -229 -65 -234 -30 179 -275 -95
4328 -95 -46 212 305 203 203 150 178 34 145 172 18 50 -110 -115 -130 49 166 -139 -135 -46 -64 -172 -102 -77 84 60
4354 60 47 -40 206 -237 -133 170 111 -18 -62 211 -102 125 123 -110 -14 66 -336 -70 217 22 44 53 147 -58
4378 -58 -134 -226 156 -265 117 -80 -18 59 47 100 -139 -156 224 -18 37 393 -150 39 -167 -27 -244 -142 54
4401 54 143 -142 -19 132 140 -121 144 139 -29 -36 288 62 92 32 -296 272 -117 49 -169 -65 -254 59 -51
4424 -51 -87 232 121 -262 -55 -163 -88 -97 174 357 76 16 -16 171 -100 135 -224 65 94 10 92 -64 -260
4447 -260 -25 120 -125 -40 -116 -33 -22 -66 15 -114 126 82 -41 19 -141 -236 -326 124 -54 108 -89 -110 85 302
4471 302 305 -159 -133 -184 -66 -85 -122 -224 -44 -15 -110 42 -104 11 18 -100 188 194 58 -183 72 164 -2 -8 -156
4496 -156 -260 107 -94 -202 61 27 9 10 37 77 -30 -51 4 -28 58 -221 -153 54 306 13 -184 215 -50 28
4520 28 -56 50 5 -66 -35 -212 7 -87 26 -162 36 -46 -66 42 -73 82 -8 -38 148 97 96 -181 -84 16 3
4545 3 -93 29 158 20 -323 106 99 41 -102 -11 -358 11 -7 333 -189 -143 28 -340 24 27 92 -266 128 48
4569 48 61 133 8 355 243 -11 -29 -172 77 102 74 107 105 8 149 243 -235 -104 342 -322 165 97 34 102 -30
4594 -30 -80 -102 -52 76 -38 125 -1 93 16 -265 30 -8 -130 13 -159 -180 -167 117 21 43 -17 204 -146 -164
4618 -164 31 133 8 -129 -64 -77 -1 -104 158 -168 116 159 -142 -190 -203 81 -69 -151 76 -20 192 -52 183
4641 183 83 -185 -10 191 -88 147 296 88 150 -193 -101 73 -22 -4 106 -207 318 -162 -20 -128 -212 218
4663 218 438 416 -82 -23 -69 8 169 -64 -76 -190 -129 -11 -161 64 -98 6 -183 72 -118 119 60 -318
4685 -318 -290 143 10 102 -133 1 10 -141 269 -17 105 243 -52 -45 -27 -185 238 19 139 279 -91 -333
4707 -333 75 31 -183 -121 -26 -140 223 184 -111 321 -5 190 -151 -416 -295 -17 -190 -142 -21 56 82 22 48
4730 48 -215 -155 17 -10 -22 27 -70 41 51 -75 115 -117 -4 -97 19 -171 41 -54 -13 -208 -210 42 142 -232
4754 -232 34 -28 -19 -12 -101 3 72 293 -55 65 -179 196 -226 -105 -86 -129 27 141 -24 -158 -58 -87 24
4777 24 -231 97 136 172 -111 -55 103 73 47 46 -26 -132 -331 304 99 -317 -155 108 63 -35 -43 -57 297 19 -70
4802 -70 334 -150 -74 40 168 108 38 -16 52 -10 -127 133 -384 -209 -58 -110 36 202 -329 227 -69 346 168
4825 168 115 31 37 -172 68 -253 190 102 121 110 1 -152 112 220 102 -95 -209 -135 389 101 -112 129 -192
4848 -192 99 95 13 154 82 181 -183 10 -63 -17 -54 -149 54 -149 19 191 -36 138 30 -156 195 0 -36
4871 -36 227 226 142 415 395 140 123 127 -122 304 114 -66 107 200 -58 -300 153 -174 320 4 -25 -93 -39 131
4895 131 -318 139 171 -52 -161 10 138 189 -53 53 136 -141 -147 173 -32 91 56 266 -198 -51 -114 166
4917 166 275 -25 55 0 120 -37 -100 -98 -228 -283 -188 -123 -18 -7 49 -231 -226 -72 -79 -19 149 133 11 191 -20
4942 -20 -50 -204 -362 -45 -155 319 -70 244 -3 129 257 7 9 141 -138 -59 105 139 210 -121 258 -99
4964 -99 -308 123 11 -15 -202 105 -75 -185 119 -297 -215 -166 102 107 146 -122 -88 75 -83 202 95 204 72
4987 72 -35 -86 -24 62 168 144 -117 41 152 2 31 -72 12 -47 -132 88 -79 -11 89 -21 -169 -99 75 -16
5011 -16 303 24 -308 -139 -51 64 74 -82 -6 212 -192 -41 125 220 188 140 -33 140 96 -52 69 107 53
5034 53 -155 -64 209 -185 1 -265 119 151 206 91 79 -163 165 52 173 -125 176 108 -173 -95 -52 -101 -148
5057 -148 -211 -154 33 -228 140 15 -125 -115 -45 -217 50 103 -219 -81 -62 23 157 216 41 89 -148 37 148
5080 148 -131 10 162 -75 24 -280 6 68 157 -28 174 -127 15 193 -462 -31 -80 -42 -82 172 -171 -243
5102 -243 -122 -260 -151 -124 -56 -340 -31 147 -87 -67 -198 183 177 263 111 122 -172 -39 -111 -24 13 -173 -86 -291
5126 -291 95 281 -201 10 -128 160 64 28 -42 -294 -42 138 -28 -48 155 90 9 -2 430 -114 -62 143 106
5149 106 1 -421 120 80 -258 -8 86 174 -185 -27 -77 62 42 12 100 291 76 -90 44 -26 132 -150 100
5172 100 -9 0 -36 203 261 102 -165 -109 74 32 64 236 109 63 -55 91 -131 140 144 -28 150 22 -1 109
5196 109 32 -33 68 188 -242 67 215 216 -24 275 -219 186 -78 92 -37 -47 150 -4 -171 -87 -23 64 -45
5219 -45 -119 -125 -191 -337 -33 -63 -131 105 -123 156 31 -108 134 185 191 40 143 -130 61 102 -145 -307 -147 -74
5243 -74 -336 174 0 -50 -107 242 80 44 -146 118 203 27 61 81 44 139 79 16 305 -75 68 11 -18 -71 -270
5268 -270 -6 -95 101 171 316 87 -56 -13 -65 214 -162 81 206 -290 -27 -112 128 356 -46 50 -218 141
5290 141 -104 174 35 299 23 -5 156 -66 -179 258 112 132 175 -88 111 68 62 140 104 -24 178 253 25
5313 25 -122 133 -155 -99 152 -53 36 18 217 63 12 -7 145 -303 -71 -260 109 -258 -56 200 -175 22
5335 22 52 16 -325 330 339 -70 219 171 189 -163 -248 -34 -15 -119 41 19 179 170 7 24 131 -213 -140 55 -195
5360 -195 99 49 14 -38 -148 42 105 -160 23 -46 -109 -56 -121 -60 99 169 206 -94 41 -51 0 48 157 -15 140
5385 140 -142 -99 -266 -72 -100 -50 63 75 -165 -83 29 -229 15 -30 -179 32 64 -26 -115 76 74 41 52 107 -198
5410 -198 -313 -41 -310 -298 78 12 -16 6 -113 -121 40 -56 -8 38 -117 -87 91 -164 -133 -130 147 94 135 -88 56
5435 56 -61 -366 -95 -227 91 32 117 54 265 -59 210 68 70 -162 72 -199 157 237 35 37 112 79 -56 -16
5459 -16 79 -239 -146 -112 99 194 127 251 -69 105 5 -69 -53 125 -76 -27 -160 -226 298 83 -231 187 -79
5482 -79 -328 -183 -95 -104 -80 104 -118 -36 43 -177 -2 -189 176 125 266 -106 247 342 51 -277 -98 -47 -93 103
5506 103 31 -35 64 197 -109 221 -102 216 -58 66 36 -34 81 53 243 13 101 21 67 13 196 -13 -77 166
5530 166 -67 -78 70 -152 -40 246 41 16 -56 343 -45 84 -1 -68 -189 94 -298 -108 -62 169 -103 247
5552 247 -96 -298 -21 -137 101 -175 147 3 -213 -137 48 81 13 -166 146 7 350 126 153 251 132 64
5574 64 -265 -87 187 -320 4 -133 -69 133 34 -224 148 -5 24 30 -41 -129 24 -17 36 -7 27 -190 18 -32
5598 -32 85 235 -25 -321 -96 -244 -114 -87 -160 255 -140 84 -51 -70 -83 88 -41 54 -52 39 -96 47
5620 47 21 -117 -48 231 -96 -178 -27 20 17 84 119 29 48 53 -41 168 19 -221 -87 40 66 195 -34 250 105
5645 105 104 232 322 119 165 12 -196 7 -92 109 -183 102 -189 74 -191 61 -223 28 -54 -154 -15 125
5667 125 -183 -202 -127 -240 -3 -316 330 -89 -292 -19 -103 -23 0 -58 110 122 110 -218 420 -44 50 -193 95
5690 95 105 70 -56 159 270 -64 114 446 51 -66 164 185 51 36 -44 3 14 47 -190 -105 -69 81 241 -58
5714 -58 -95 88 17 -159 -204 -44 256 217 1 49 37 -79 -187 110 250 -192 -37 71 -83 320 -307 -88
5736 -88 -118 -177 -32 37 -96 185 -52 111 6 -49 -17 124 -9 141 -141 20 -87 -82 -38 -217 9 220 16
5759 16 -39 -232 -54 -51 -221 -87 -82 156 40 65 -78 -62 14 57 220 143 106 82 -14 11 -17 65 -54 -100 40 -191
5785 -191 191 52 290 -22 65 222 -149 208 -76 -119 118 71 -121 113 -80 -237 -451 45 -96 -280 -25
5806 -25 386 76 84 56 -28 173 -150 98 7 7 -41 -1 234 -90 -28 26 -98 -77 -131 150 -16 -84 -31 -117 -52 155
5832 155 -245 94 105 -9 -32 114 66 -28 35 114 6 -147 -134 64 -76 372 141 2 206 97 -8 -246
5854 -246 -92 43 33 197 -182 25 -133 -188 -51 -5 273 -22 72 299 -131 -6 131 212 -90 -209 72 93
5876 93 12 -187 -94 -191 -134 -10 -108 -15 114 23 50 45 25 -111 -193 -39 -32 156 8 -45 -46 91 121 -165 -109 -344 60
5903 60 283 -159 58 -4 -110 56 -58 88 -26 -19 140 191 -24 -184 -5 83 101 -20 -85 252 466 30 79
5926 79 -192 -166 -195 458 327 -66 49 159 -460 -21 1 173 63 -94 83 -128 259 -147 2 -86 -35 -98
5948 -98 24 304 97 56 94 156 -2 25 169 -56 19 382 51 228 -141 -79 -11 -132 -68 -24 49 129 66 -138
5972 -138 -177 -18 63 -189 236 68 52 149 -85 -125 -132 -19 153 72 -13 -55 170 80 35 13 431 -124 140 128 -170
5997 -170 131 -45 -90 -50 155 -54 103 162 65 40 99 -252 -112 -44 -46 1 -176 -47 82 181 20 -204 -56 8
6021 8 18 123 -167 -21 14 132 51 0 -138 213 -37 51 -87 148 -11 -309 14 -178 -221 -113 -63 -48 -114 206
6045 206 -178 247 -16 -90 -119 153 -161 -280 176 -259 -112 120 -42 -21 81 186 -113 33 83 78 121 50 -105
6068 -105 24 -63 186 252 -13 301 -111 -45 155 217 -221 -230 67 16 -46 88 -314 -61 -175 59 -112 -91 -90 -252
6092 -252 -210 67 -75 81 -192 -123 -32 119 182 -54 -32 56 88 53 -21 22 -19 140 -131 -122 -235 227 141 214 197
6117 197 38 165 28 47 -77 114 -93 -21 -14 81 74 154 193 -9 88 -96 177 -34 -139 -15 -61 7 -174 33
6141 33 -48 23 161 82 -2 -101 8 -61 -210 -293 158 288 124 -265 -41 -144 1 -134 -8 -342 -170 157 15
6164 15 -35 139 133 -188 -128 147 187 129 125 -148 70 -45 63 -235 -17 -62 170 14 10 -43 160 249 -233 43 195
6189 195 22 48 127 -194 214 -217 -282 -48 53 -88 218 -28 273 358 148 -88 -168 37 -142 72 -39 -12
6211 -12 13 -53 -71 -57 166 134 102 -285 161 -66 -264 -107 -61 -114 -36 54 139 29 124 -268 166 126 124 208 -27 236
6237 236 -106 -156 -96 -27 -25 -66 107 118 -84 293 0 189 -32 -185 -59 101 352 -149 2 -112 183 66
6259 66 16 -211 46 14 -199 272 -167 150 -130 279 -9 18 -4 -67 -105 175 -54 -96 21 -75 269 -157 144
6282 144 -214 -22 63 451 249 -78 123 -56 -99 -143 24 -70 -7 -172 165 -201 -85 -155 162 88 -190 122
6304 122 57 68 212 -171 21 -227 -160 298 13 17 206 125 -217 89 -108 -126 -125 91 7 123 -89 73 -27
6327 -27 176 -311 133 -217 66 -176 -118 -44 50 44 180 73 80 -32 -89 -180 -168 -247 -232 -60 158 -229 43 103 27
6352 27 25 50 207 -53 289 1 -42 108 290 -107 88 -140 251 -99 -97 181 -143 -298 129 204 6 147 -30
6375 -30 -22 86 -18 1 -44 252 68 130 -153 313 -151 -58 265 297 10 80 143 39 54 52 -164 33 -22 -95 134
6400 134 -173 -79 -89 167 27 86 364 207 -178 180 -162 37 -201 367 18 199 -302 229 272 -63 63
6421 63 -178 31 142 132 45 -20 16 134 -203 199 -46 -356 113 1 138 48 139 309 62 69 165 80 -10 136
6445 136 -3 -81 38 -96 119 154 -2 47 106 84 75 115 129 -3 -190 -59 -195 -20 -22 123 -142 -179 -124 -143 -124
6470 -124 108 44 19 175 -82 -55 121 -21 -29 -80 63 77 88 91 -181 258 -154 -320 73 -128 -117 74 -15 374
6494 374 -226 -69 -136 150 198 -149 -91 139 -20 -100 122 5 32 64 -147 34 30 -9 -172 -59 104 5 170
6517 170 -114 134 -105 -15 -80 -112 18 -144 232 113 -228 -223 179 38 -28 -297 -155 -23 -220 -215 -107 130 235
6540 235 90 -168 -1 -54 -138 -43 30 87 26 -84 -40 -2 124 -89 -156 -195 207 -218 93 -82 -139 506 54 330
6564 330 -257 -44 -28 31 -220 111 -184 60 -177 193 111 -22 -56 -198 55 27 -79 55 86 16 210 -293
6586 -293 -145 11 -13 -136 -29 -177 -102 -343 -137 159 135 -120 -21 -50 -64 99 3 -27 -122 4 -21 -176 129
6609 129 -7 -23 -2 -46 44 39 -18 -222 61 -139 207 -102 -205 -74 -37 47 -276 -65 -197 214 73 -171 73
6632 73 -8 -161 241 -75 27 -82 86 -362 -96 -255 -93 22 91 192 295 8 98 213 4 -117 315
6653 315 58 -72 152 -196 -10 37 -54 -126 334 43 -24 89 -99 -66 -129 114 -217 -50 5 -20 -27 -275 -79
6676 -79 28 -117 5 -141 -41 252 -157 96 -7 -43 14 121 158 97 -11 -102 -54 35 -91 -177 78 180 384
6699 384 24 -27 91 -167 156 98 -203 -12 189 169 75 -33 -115 -18 57 172 132 -154 262 -62 -106 -67 -98 152
6723 152 130 -28 -95 -38 200 19 64 93 -124 -156 -134 33 -145 -21 104 -142 -9 -7 82 101 -45 77 -57 39
6747 39 -76 54 13 283 199 115 -154 91 -348 58 90 -17 -201 298 292 80 -199 -238 -19 157 -131 2 22
6770 22 20 80 36 -89 -64 -48 33 65 271 -2 -124 -104 187 103 111 -56 -185 42 -54 -59 22 60 1 273 -16 -15 188
6797 188 139 -96 -106 215 45 83 138 38 158 -65 -231 -105 -234 18 26 340 27 -34 0 141 -168 206 97
6820 97 160 -88 5 -212 -21 129 -64 30 -33 11 -56 115 -15 -150 0 -205 -275 94 253 -265 -147 58 18
6843 18 -140 -72 -101 -214 -73 265 -2 -120 235 -211 140 -33 -91 -171 -251 300 37 101 53 -115 -1 -177 -7
6866 -7 252 121 -39 12 -147 127 -110 -154 35 -101 -46 5 95 12 -33 -74 213 15 -103 27 -94 161 -76
6889 -76 -113 162 40 50 85 -48 42 -214 -171 236 -113 8 118 144 268 93 46 19 -107 164 -27 75 50
6912 50 31 -142 -167 -127 -31 41 -23 -188 -188 -31 122 -305 -89 56 42 66 259 330 19 47 152 136 -50 -40 48
6937 48 -65 56 32 -79 -140 7 -175 -373 0 -3 195 82 41 -36 27 33 -169 -6 -349 -15 83 27 2 8 74
6962 74 -97 55 -6 -137 147 182 97 -13 71 -27 166 41 -18 117 -237 -206 37 -36 -7 77 -41 -87 66 -37
6986 -37 12 152 -177 70 117 63 -38 323 -56 173 -29 105 13 -68 9 14 -94 -28 -11 103 115 -316 95 -91
7010 -91 -59 -50 9 150 72 18 -102 -17 47 13 -85 185 38 -136 -321 22 -60 9 -182 220 36 21 -119 41 -159
7035 -159 -105 -16 -24 -21 -201 80 8 45 65 -208 -208 -4 268 -109 50 -161 -161 254 126 155 91 104 130 -2 -119 53
7061 53 49 -143 -23 171 -38 -289 31 57 -26 124 110 -103 55 46 64 -81 168 132 209 98 -42 -145 300 -42
7085 -42 -6 21 -220 -167 -337 -22 133 25 -144 63 224 16 9 -79 64 60 -99 -211 125 15 147 92 48 133
7109 133 171 -140 21 -99 -125 -60 52 -193 -12 -29 -67 31 -89 -58 -59 66 170 99 112 81 18 -94 146 -169
7133 -169 -59 46 -6 -337 151 -18 -55 70 -67 143 -28 218 -177 -189 -154 -181 -135 138 342 -113 337 -61
7155 -61 114 134 91 -210 -169 301 -12 160 -76 175 -101 -216 201 111 291 142 -85 -140 -47 149 217 -15 -139
7178 -139 -41 145 229 42 -23 18 141 -241 229 282 20 64 -41 313 -90 38 -28 -194 1 122 -113 65
7200 65 -7 93 12 39 202 118 1 -32 8 79 -6 84 -94 104 307 -138 -218 -25 -110 50 51 11 84 17 -121 -149
7226 -149 110 -83 95 17 -55 -104 154 107 36 46 -1 37 113 14 214 -65 -55 163 -29 -85 -216 -38 -339 9
7250 9 -25 -196 143 -139 152 203 -274 -32 186 73 -48 -230 -50 -217 252 -220 283 -134 -303 98 137 277
7272 277 -63 101 -117 138 -86 77 -128 354 -105 98 44 78 72 228 134 1 27 -22 226 104 178 -52 -117
7295 -117 2 -36 107 -288 47 -110 158 -102 70 -303 -196 71 75 134 102 -90 232 -25 -102 175 22 -11
7317 -11 -22 -37 -57 257 100 -45 361 -169 121 33 -19 -127 82 56 -205 -1 -38 69 241 261 -117 -65 -259
7340 -259 -17 117 159 -160 58 -148 -161 -117 19 17 45 -83 -35 137 189 94 -173 -7 -77 103 19 36 126 65 20
7365 20 25 -17 81 106 -118 -344 192 -47 -125 -66 86 -87 -20 184 83 -143 228 -102 -104 185 53 95 81 144 -97
7390 -97 78 127 162 -86 -372 84 -24 179 -280 -108 -8 134 -160 -220 -109 14 -31 -5 -146 181 -51 159
7412 159 118 -171 -207 -280 -87 -115 -115 -109 -142 -57 205 55 112 -131 71 236 40 -299 -161 43 126 -110 -142 117
7436 117 88 -268 172 -54 -61 16 -6 269 325 -45 106 -125 -89 79 -135 -112 10 -81 -81 -145 75 -145 -195 -86
7460 -86 -46 116 -261 -12 -118 306 26 134 68 93 -2 45 386 63 144 -60 -46 -89 -18 189 -134 -1 3 -171
7484 -171 136 199 36 19 -123 75 -178 112 56 -96 8 -63 11 73 -290 108 150 16 80 170 187 -53 224
7507 224 104 -189 47 -170 151 0 48 -17 -37 -158 40 53 45 -24 114 -305 -148 167 80 -117 115 63 16
7530 16 -133 -100 -75 94 129 168 -174 -35 92 -218 -208 -278 -396 -12 156 -67 120 -92 14 32 -19 -261 31
7553 31 223 -18 -140 6 -212 82 174 -120 -425 112 26 -156 66 36 220 -73 112 -155 55 -136 18
7574 18 197 -73 -195 -8 120 -138 -101 66 164 -46 -46 -136 9 -222 44 -54 -52 75 -169 -47 191 94 114 113
7598 113 -150 89 -290 -140 -117 10 -139 49 -90 -57 55 -65 151 -133 169 112 -173 166 -15 42 22 111
7620 111 -203 -148 132 93 229 37 226 -264 230 -13 67 -25 137 -13 -62 -62 61 178 -244 63 314 4
7642 4 93 -147 46 82 -111 -112 -128 -126 76 -47 -153 -28 -224 166 10 112 46 39 17 89 89 -88 -24 14 -106 256
7668 256 -68 152 12 13 -15 -196 99 106 52 -64 -57 137 -82 163 -21 81 -490 -166 414 242 -17 374 0
7691 0 -75 -276 90 228 -296 -67 133 -17 -103 -339 -19 -149 -103 -4 157 -2 -318 -344 66 167 -99 127
7713 127 151 54 7 -14 70 -42 -36 112 22 269 -80 104 -180 -31 35 -16 -75 262 58 350 100 194 64 -30
7737 -30 -33 81 -20 231 295 -66 -24 -32 -93 327 129 150 -158 19 -22 24 -54 -203 -255 66 -135 -102 57 -139 -241
7762 -241 107 -203 149 0 164 -86 -93 -25 -100 -5 -35 -18 57 111 -354 -431 122 -40 -105 -132 83 348 -49 267
7786 267 -194 -98 -177 37 280 54 47 183 -79 -4 -8 141 8 -98 17 21 295 48 37 -93 242 -195 -115 217
7810 217 -27 240 186 13 34 -180 110 86 -148 229 190 188 163 -3 -252 73 120 107 -229 299 27 -134 185
7833 185 -20 7 -83 190 -133 -25 -165 -49 -20 149 56 434 156 -181 -21 111 61 -246 -11 -107 -89 59
7855 59 56 -157 85 179 13 19 139 -18 121 208 -169 28 -265 -20 -109 -65 -15 -144 -223 148 202 57 15 -99
7879 -99 124 -10 -114 77 13 -211 151 -130 -166 -77 157 -240 72 -68 281 -2 -60 194 106 -4 -8 37 -55
7902 -55 146 81 89 145 109 9 -90 -105 -244 116 110 69 67 -40 426 43 -174 63 12 142 -197 -195 -55 -138 -226 -150
7928 -150 -71 -171 34 22 -4 182 22 59 302 138 156 -16 55 -140 121 93 -129 -132 118 -274 173 -47 7
7951 7 -76 -111 137 12 11 28 2 266 221 44 97 -196 31 36 214 4 -46 -173 -27 14 119 -74 -10 -77 -82 144
7977 144 -56 18 -1 -153 115 -180 83 164 117 0 267 153 55 -144 59 -67 69 -179 -339 -250 -164 -40
7999 -40 -37 -118 -185 83 57 73 157 196 223 68 -116 -61 -297 -62 -79 369 231 -108 -42 58 109 93 -232 -276 0
8024 0 155 253 155 77 -47 -34 79 -92 199 128 -26 210 180 -67 46 -27 2 228 31 157 83 128 80 124 55
8049 55 40 29 12 44 106 -72 -45 -118 -155 48 -27 342 -51 -55 -37 163 -45 -65 -121 14 178 -55 -53 143 -89 -107
8075 -107 138 -174 174 -272 -180 104 96 -157 183 -96 -53 -90 26 -52 83 135 -194 184 -43 135 -102 -10 74
8098 74 -166 77 -104 -178 -141 219 -106 -132 39 -77 533 246 195 26 112 12 -250 -27 -112 -104 56 -32 -7 -24
8122 -24 -5 -225 19 470 174 32 185 87 112 37 -159 -2 297 -121 -171 78 5 183 54 185 -47 18 309
8145 309 76 -14 -104 177 -110 143 35 47 -86 -109 -94 204 -100 -178 -81 -102 183 -107 213 148 -95 -265 118
8168 118 -115 -175 -19 -9 102 -73 86 53 112 -59 -85 6 108 -106 122 113 -166 53 -32 -41 166 196 -86
8191h6
$$ Imaginary data points
##PAGE= N=2
##DATA TABLE= (X++(I..I)), XYDATA
0 0 0 0 0 0 0 0 0 0 0 0 0 0 0 0 8 -8 8 -8 8 -16 16 -20 24 -29 32 -40 46 -52 60 -69 79 -88 102 -116 130 -147
36 -147 165 -184 205 -229 257 -283 315 -349 386 -427 470 -518 571 -630 695 -765 843 -931 1028
55 1028 -1138 1263 -1405 1571 -1766 2001 -2288 2647 -3115 3749 -4664 6110 -8737 15082 -68353
70 -68353 -8796 101061 -15706 -44338 865 14939 -9361 17189 18071 -12111 -7121 39188
82 39188 19892 -8919 -834 -4579 -9267 26506 11647 -37316 -24835 16492 589 -25214 -4377
95 -4377 8834 -24737 -11695 36232 5627 -37946 14180 46526 -7347 -21802 28551 24938 -20488
108 -20488 -4041 26170 -9337 -22751 13948 1349 -29319 -4302 9760 -13581 -12027 1340
120 1340 -7600 -890 21112 -735 -26395 17682 43123 -13971 -24753 33206 23733 -25773 -7640
133 -7640 24070 -1200 -23617 697 6078 -20017 -7696 13936 -14024 -21776 14085 12775 -12937
146 -12937 -3102 12838 3119 1322 15680 4819 -12315 9420 18717 -11273 -5960 15346 -12755
159 -12755 -23073 18243 15085 -32453 -24010 22499 11264 -22047 -2557 11826 -9450 2949
171 2949 24557 -3572 -17499 13146 19679 -3192 -5257 3932 -4162 -4414 12549 -1546 -23922
184 -23922 -141 14806 -13474 -12498 13211 120 -17245 4090 19596 -4471 -13559 13554 12045
197 12045 -11343 4743 15064 -12025 -7734 16995 1600 -17509 -1109 9332 -7165 -9852
209 -9852 7495 -703 -14073 6389 9660 -12577 230 16147 -6083 -9112 15205 9186 -13627
222 -13627 -2660 16536 -921 -14794 6725 7394 -13752 -1200 11095 -9590 -11122 10301 5353
235 5353 -11940 -2231 11459 -1332 -6703 8958 2816 -9487 7235 10442 -11071 -5395 12704
248 12704 312 -12542 2699 9093 -10418 -7226 13320 600 -14921 5630 10429 -9099 -2702
261 -2702 11008 -1351 -8342 7062 8757 -8846 -4712 10668 -1505 -9053 6525 2166 -11160
274 -11160 3071 9217 -8388 -7111 9506 4388 -10442 717 11898 -5114 -8115 11778 3469
287 3469 -11530 3326 9556 -7350 -5990 7966 958 -10482 1192 8761 -6716 -6257 9440
300 9440 630 -8036 6188 5495 -7577 481 9738 -2066 -8055 6184 6632 -9947 -2698 10275
314 10275 -5063 -9736 8239 3112 -10754 -167 8936 -3334 -7191 7184 5744 -8366 469
327 469 10872 -4193 -5494 8962 1128 -7933 2986 5160 -6807 -4237 6579 -313 -9809 2521
341 2521 7488 -8311 -3841 10410 -1308 -7639 7058 6455 -6629 -1126 9282 251 -7771 4401
355 4401 6211 -8525 -2611 8156 -4998 -8091 5732 1954 -8223 173 6209 -3402 -5351 7732
369 7732 4007 -8348 2267 10042 -4680 -3968 8334 528 -7266 3129 6155 -6392 -6420 6864
383 6864 1093 -9601 1511 5578 -7418 -2551 8277 -1636 -5757 5177 5628 -4219 -1098 8263
397 8263 -181 -7402 5724 5135 -8302 -1117 6688 -5429 -6246 5354 1097 -8074 -933 7055 -2528
412 -2528 -5666 6590 3524 -7595 3651 9684 -4318 -4040 7282 2189 -5377 1328 4288 -5843
426 -5843 -4400 6493 -608 -9539 1857 4891 -6384 -1495 6556 -1767 -5626 5421 6320 -4538
440 -4538 -1622 8335 88 -6054 5260 4015 -6986 -995 4994 -3785 -5274 3732 819 -8256 -639
455 -639 8517 -2924 -6733 5613 3479 -5051 3688 6299 -4467 -2550 7206 2895 -5687 145 4090
470 4090 -5076 -2872 6855 -3087 -10454 2894 5824 -4853 -3822 3645 453 -2476 4130 4640 -4871
485 -4871 -807 8385 -490 -4977 5304 2322 -6900 -132 5720 -2673 -6810 2185 2952 -6203 -1067
500 -1067 5792 -3653 -4770 6279 2941 -4531 2496 4331 -3293 -918 7208 1111 -7958 781 7240
515 7240 -3892 -4733 3826 -2019 -5459 3195 2794 -5765 -2711 4590 1203 -3355 3119 3509 -5137 1071
531 1071 9055 -2060 -6414 4155 4135 -4330 -2441 2938 -1443 -4669 2314 1538 -6012 251 5074
546 5074 -4867 -3873 7152 2272 -5576 796 5909 -950 -2437 4488 1169 -5727 2147 5761 -4856
561 -4856 -4085 3348 -1609 -3692 3030 1281 -6002 -1433 6797 1247 -5581 1979 4267 -2491 1151
576 1151 5419 -2852 -3717 4591 3183 -4571 -2182 3317 -1488 -4448 2944 1362 -6415 245 5325
591 5325 -2611 -3307 4025 2498 -3296 649 4903 -733 -2366 4219 387 -4971 3686 3768 -6475 -3139
607 -3139 4794 -314 -4909 370 2579 -3322 -1819 5486 -20 -5018 3476 4163 -2885 928 3721
622 3721 -2166 -2173 3989 2090 -4851 -2422 4242 -427 -4561 1862 634 -4464 1526 3845 -2934 -2326
638 -2326 3971 1903 -2999 1143 4810 -2024 -3211 4784 1027 -5264 1639 2831 -3917 -2253 3062
653 3062 -900 -4558 579 3159 -2951 -1464 4329 -864 -3464 4192 2667 -3743 694 4236 -1085
668 -1085 -2867 2595 1950 -3892 -1562 3948 -2261 -4401 2723 1152 -4005 418 3011 -1651 -1972 3565
684 3565 2037 -3129 624 4658 -1597 -2413 3830 313 -3572 1797 1674 -4015 -2028 3080 -976 -4977
700 -4977 1162 3381 -3655 -1509 4435 -743 -2792 3505 2502 -2869 207 3679 89 -3138 1859
715 1859 1776 -3815 -891 3011 -2566 -3245 2126 337 -3009 826 2552 -1971 -1905 3925 2167 -3508
731 -3508 1535 4636 -2065 -1481 3741 99 -3227 977 2135 -2757 -2588 2209 -84 -4494 1383 2940
747 2940 -3723 -715 3742 -454 -1936 2660 1940 -1757 269 3539 -1133 -2647 3109 1723 -4413
762 -4413 -491 2772 -2744 -2494 1693 142 -2975 452 2889 -1085 -2214 3173 2135 -3057 1612
777 1612 3041 -2047 -883 2853 -99 -2624 786 1787 -2512 -2219 2558 -930 -4490 1804 2531 -3507
793 -3507 -383 3228 -650 -1835 2592 2155 -1792 -130 3547 -457 -3069 2465 959 -3571 -49
808 -49 2073 -2547 -2296 2086 504 -2704 -36 2440 -1258 -1469 3539 996 -2702 1844 3509 -1688
824 -1688 -925 2552 30 -2541 345 1727 -2775 -2206 2818 -783 -3575 1419 1412 -2499 5 2513
840 2513 -53 -1675 1997 2547 -1931 -180 3642 -1030 -2619 2769 626 -3532 317 1644 -1902
855 -1902 -2190 1209 824 -2889 49 3136 -1543 -1809 3675 970 -2190 1813 2101 -1555 -667 2018
871 2018 178 -2631 240 1761 -2764 -1862 2258 -1283 -3217 1394 1511 -2102 -622 2449 339 -1484
887 -1484 1755 2774 -2194 2 3437 -1131 -2099 1973 277 -2537 -26 1247 -1632 -2605 1512 791
903 791 -2836 551 2706 -1927 -1112 3309 491 -1886 1588 1905 -1120 -984 2520 -31 -3071 820
919 820 2041 -2448 -1599 2020 -1425 -2319 1572 848 -1843 -381 2451 734 -1594 1872 2313 -2241
935 -2241 260 3170 -1352 -1834 1840 522 -2232 -543 1380 -1478 -2310 1860 772 -2751 624 2173
951 2173 -1558 -510 3143 334 -1647 1105 2374 -866 -991 1955 24 -2443 1219 1506 -2789 -1269
967 -1269 1556 -822 -1671 925 1185 -1796 -581 2838 417 -2066 1833 2088 -1886 411 1917 -1287
983 -1287 -1136 1139 176 -1956 -884 1539 -1697 -2444 1999 323 -2939 847 2312 -1194 -448 2034
999 2034 510 -1141 732 2222 -1066 -1045 1878 -3 -2482 1523 879 -2674 -874 1753 -260 -1777
1015 -1777 323 1409 -703 -303 2540 -261 -988 2484 1278 -1343 442 1922 -1026 -1495 1219 924
1031 924 -2586 -864 1809 -1307 -2334 1333 306 -2015 953 1191 -726 -325 1900 779 -1405 1142
1047 1142 2384 -1771 -1001 2380 -349 -2284 1002 689 -1799 -628 1125 -602 -1836 807 1721 -1741
1063 -1741 -342 2440 -341 -1162 2229 1044 -1607 113 1520 -36 -1603 653 869 -2004 -380
1078 -380 1626 -1869 -1458 1836 -269 -1971 938 1490 -918 -407 2236 796 -1636 957 2248 -1677
1094 -1677 -438 2000 -757 -1699 683 561 -1637 -872 1039 -529 -1975 1066 1580 -1739 -20 2304
1110 2304 -486 -523 1653 800 -1010 207 1528 -201 -1533 650 720 -2329 -126 1577 -1493 -1100
1126 -1100 1470 -114 -1641 452 1636 -369 -975 1913 952 -1146 1168 1703 -1323 -398 1646 -600
1142 -600 -1223 676 362 -1770 -860 1519 -440 -2109 894 1048 -1589 358 1748 -262 -523 1367
1158 1367 946 -934 106 1532 -398 -1368 1164 298 -2130 45 831 -1537 -953 1055 314 -1126
1174 -1126 491 1874 -822 -864 2223 393 -1339 1511 1386 -1446 -216 1382 -206 -1279 165 691
1190 691 -1553 -1244 1482 -258 -1916 1391 579 -1351 651 1297 -354 -427 937 1007 -1162 -185 1683
1207 1683 -534 -1511 1134 50 -2002 157 850 -1176 -889 1054 361 -1283 192 1836 -747 -411
1223 -411 2128 375 -1265 1077 968 -784 -130 1044 -233 -1289 317 725 -1483 -628 1396 -977
1239 -977 -1254 1504 646 -1040 183 1433 -29 -693 1279 1472 -1078 15 1760 -771 -890 1101
1255 1101 -280 -1474 -57 575 -844 -829 522 420 -1256 296 1715 -947 -132 1819 39 -1011
1271 -1011 1089 783 -779 -470 1090 22 -1729 439 656 -1883 -586 1109 -921 -1223 941 767
1287 767 -649 75 1342 38 -902 1136 890 -1151 263 1286 -1023 -502 857 -103 -1911 -294
1303 -294 548 -1049 -1365 1079 477 -1567 655 1349 -912 -264 1033 281 -357 339 811 -596 -893 810
1321 810 -30 -1895 375 403 -1474 -307 841 -975 -927 1050 578 -768 48 1315 134 -1088 1586
1338 1586 829 -1517 519 1283 -864 -658 930 -210 -1095 -480 405 -751 -998 1177 320 -1289 655
1355 655 744 -664 274 1392 60 -637 701 1135 -714 -431 1358 -354 -1458 501 434 -1272 -290
1372 -290 703 -550 -878 716 703 -407 83 1687 -4 -792 1482 543 -909 578 694 -500 -558 159
1390 159 1 -1263 -399 599 -843 -511 1339 -99 -1157 647 773 -504 -88 1122 240 -551 625
1407 625 1292 -1064 -633 1113 -244 -1229 275 423 -1347 -222 611 -49 -961 597 913 -919 77
1424 77 1435 -397 -546 1294 540 -817 138 581 -697 -814 682 88 -1473 -108 981 -1079 -757
1441 -757 1087 -280 -616 198 844 119 -303 863 279 -676 680 748 -1204 -447 1069 -642 -1196 444
1459 444 84 -825 -249 610 45 -948 819 888 -802 204 1393 -384 -1 1272 276 -760 -238 390
1477 390 -782 -700 437 196 -1250 87 871 -1098 -543 928 -266 -410 854 682 -210 -345 1316
1494 1316 233 -730 604 863 -759 -149 863 -334 -877 62 40 -1040 -438 634 -404 -614 1080
1511 1080 561 -663 327 1162 -351 -90 899 447 -472 -229 626 -258 -884 646 138 -1287 65 555
1529 555 -1025 -339 684 -188 -560 147 887 -33 -242 881 199 -667 655 459 -1046 -22 515 -642
1547 -642 -831 94 94 -741 -337 723 -173 -699 709 454 -957 417 1007 -156 -257 824 542 -610
1565 -610 -179 794 -704 -590 735 -512 -1124 143 367 -626 -141 437 -119 -493 479 1070 -61 -33 1220
1584 1220 131 -866 679 296 -735 38 470 -157 -547 178 342 -866 -345 744 -337 -591 852
1601 852 199 -522 218 747 69 -240 641 408 -774 -196 904 -645 -922 557 -252 -473 289 264 -564
1620 -564 -265 472 465 -582 417 935 -521 -72 1064 46 -474 620 22 -546 -324 174 -358 -885 165
1639 165 279 -988 -410 583 -280 -406 650 338 -354 -12 801 250 -227 843 491 -901 62 506 -669
1658 -669 -824 428 -275 -935 44 477 -338 -323 217 326 -804 879 784 -482 92 860 -45 -337 463
1677 463 223 -313 -483 66 -418 -988 367 410 -1178 48 649 -555 -89 536 166 -192 209 699 -233
1696 -233 -276 649 263 -594 307 430 -781 -418 410 -376 -700 -106 404 -503 -795 723 132 -592 944
1715 944 516 -206 604 682 53 -185 148 350 -560 -366 370 -358 -835 400 171 -899 181 313 -491
1734 -491 -435 284 195 -299 -229 876 52 -283 727 212 -687 88 411 -611 -393 114 -500 -725 -280 317
1754 317 -410 -285 609 49 -590 771 651 -175 53 696 -34 -219 225 390 -460 -81 416 -474 -650 454
1774 454 33 -748 -14 342 -309 -194 261 549 -319 76 756 -455 -185 812 -114 -531 62 214 -262 -359
1794 -359 10 9 -443 -62 216 -402 -334 810 -280 -417 725 385 -24 205 587 -34 -275 509 359 -589
1814 -589 -112 516 -596 -609 240 230 -447 -219 51 -181 -218 609 410 -331 457 891 -508 -15 170 -102
1834 -102 -458 -3 154 -578 -674 46 -240 -721 201 491 -614 -74 538 -94 -43 474 650 31 279 448
1854 448 240 -476 199 341 -791 -326 321 -755 -719 236 -200 -373 -41 376 145 -269 372 499 -346 224
1874 224 595 -294 235 434 37 -182 229 212 -515 -822 533 162 -559 181 263 -858 281 398 -34 91
1894 91 336 357 -157 58 712 8 -363 398 96 -748 115 214 -241 -193 131 -134 -218 -133 675 -148 -253 811
1916 811 364 -280 398 519 -304 67 579 21 -283 -70 197 -168 -396 203 -183 -793 160 248 -417 47
1936 47 14 -164 59 560 584 -98 -259 750 -54 -344 346 264 -463 -113 170 -284 -157 48 -265 -652 -316
1957 -316 387 -228 -218 339 249 -552 169 476 57 -222 489 206 -623 -152 374 -312 -664 302 -393 -354 331
1978 331 54 -251 -28 273 364 -176 357 598 -320 -42 856 -251 -280 305 188 -264 -195 37 -280 -403 -16
1999 -16 219 -719 -105 688 -250 -215 476 407 97 210 434 -34 -69 291 181 -588 173 168 -539 -169 173 -184
2021 -184 -313 131 178 -201 94 400 250 -564 306 524 -190 348 467 -251 -449 217 46 -257 -147 165
2041 165 -186 -670 256 -23 -414 -85 429 -336 -93 414 121 -5 387 332 69 -348 194 430 -585 190
2061 190 -49 -374 37 216 -205 -375 82 310 -63 -199 430 25 -360 589 436 -248 277 380 -340 -187
2081 -187 217 -170 -66 -190 303 -181 -561 45 -155 -343 51 127 -163 34 166 62 31 115 521 -105 53
2102 53 485 -38 -251 269 -6 -267 -155 208 -215 -614 48 100 -308 -242 684 -10 -154 399 269 -177 346
2123 346 412 -301 -94 133 26 -338 -132 320 -196 -333 299 -134 -277 327 378 -194 70 374 20 -174 134
2144 134 375 -66 -336 448 -103 -299 74 47 -372 -307 33 135 -519 -15 166 -66 164 290 123 -172 186
2165 186 180 94 233 120 31 -195 2 251 -483 -216 78 -620 -142 117 -250 -249 170 131 -26 -318 488 527 -193
2188 -193 96 604 -68 -38 567 -245 -333 47 -120 -246 -272 -22 -219 -546 90 168 -380 -100 654 297 -306
2209 -306 455 178 74 -27 303 -139 -292 50 -14 -580 -244 146 -263 -95 46 -560 -211 -47 377 351 -456
2230 -456 562 400 -177 342 247 -173 131 -27 -108 -136 -34 130 -396 -545 256 26 -360 342 75 -809 314
2251 314 442 -140 -146 174 477 128 74 170 27 -754 344 -232 -510 -140 278 -113 -263 91 -144 -111 -79 371
2273 371 77 -171 646 146 23 379 226 -152 65 183 224 -520 -53 -125 -316 -171 467 -185 -234 138 170
2294 170 -134 488 268 77 50 353 394 -241 16 230 -139 -324 519 -97 -370 -116 -115 -289 -297 179 -93 -491
2316 -491 79 337 215 120 561 -100 27 195 350 -3 108 140 12 -453 38 120 -533 -169 175 -426 -170
2337 -170 205 -112 -156 176 201 193 111 385 499 -476 93 461 -292 -107 254 40 -383 18 231 -203 -449 -105
2359 -105 33 -155 34 252 -370 158 394 166 -16 361 247 -53 -157 62 68 -323 -177 193 -798 -236 106
2380 106 -299 -9 38 453 -254 -160 246 445 -310 332 185 -323 13 301 167 -205 404 -261 -279 81 -80
2401 -80 -163 -380 389 -117 -320 -112 496 -5 -21 202 254 219 -26 351 -167 30 637 -140 -489 159 -9 -418
2423 -418 -221 -8 23 45 -247 94 15 194 227 -222 -305 301 280 -149 231 30 -99 -61 -78 -9 -113 -116 208 46
2447 46 -677 135 -128 -353 207 46 -264 2 248 213 97 248 171 57 -179 207 -398 -272 367 -118 -305
2468 -305 -104 251 -189 13 14 109 -456 208 173 -83 -10 399 164 -46 280 -44 3 -118 -192 -144 -408 -170 200
2491 200 -296 -19 114 -23 -154 19 289 8 -51 97 -158 -83 22 274 -379 -255 236 -66 -340 136 7
2512 7 -341 121 -19 -173 132 52 215 24 55 455 41 -30 213 -28 -116 202 324 -441 -497 298 -57 -367
2534 -367 -38 312 -280 -363 430 71 -41 267 12 -230 112 163 -60 -184 203 -11 -176 -90 170 -53 -214
2555 -214 235 100 127 -197 -61 -21 -220 80 331 -307 182 221 -17 -64 287 73 -91 79 223 -44 -57 180
2577 180 244 -412 -14 193 -562 -261 199 -103 -14 372 383 276 -264 225 -25 -145 269 221 -442 -113 189
2598 189 7 -211 132 162 -382 -279 0 5 -345 344 399 -377 105 219 -203 71 191 197 9 -264 222 20
2620 20 -340 -112 -114 -104 -108 32 -287 37 203 167 87 453 237 -222 -67 145 311 -65 322 196 -250 59 186
2643 186 -26 -220 -21 9 -286 -269 156 -309 -84 38 125 -27 135 311 10 147 167 -185 -99 78 452 -122
2665 -122 -5 298 -211 -223 -25 -71 -160 -111 -68 -126 -33 458 523 135 178 306 124 -152 131 61 -343 -63 -228
2688 -228 -174 -211 -125 120 -224 -480 109 -182 -8 224 -31 60 104 163 79 33 56 249 30 -79 221 -185 -212
2711 -212 121 -29 -364 -219 226 188 29 -3 88 -378 -107 525 -149 -113 306 300 -89 210 131 45 -44 69 149
2734 149 -297 -139 139 -326 44 166 -288 -188 99 -86 -24 151 368 219 52 583 197 -191 -25 328
2754 328 -44 -29 -15 -474 -22 -25 114 102 11 -39 105 -175 50 207 -20 -296 227 -235 33 243 263 -119 -439
2777 -439 -125 89 -170 -252 75 -275 -84 83 -262 137 327 84 -174 167 295 -105 161 365 -120 -364
2797 -364 -43 149 -224 -131 -16 -140 -115 0 257 -338 -214 196 132 -93 327 173 256 114 -30 258 -153
2818 -153 177 -1 -274 -199 73 155 -119 -21 -140 -233 80 156 23 202 346 210 3 -231 126 -109 -62 92
2840 92 -70 -332 236 -188 -181 -7 58 -73 -320 -191 -51 -298 -117 323 -132 -98 264 37 -50 18 95 96 89 5
2864 5 -80 -75 -116 -34 -191 -323 6 -282 49 -63 -193 -148 -22 383 321 53 1 240 -67 -145 278 -173 -260 65
2888 65 70 -321 -101 -187 -134 -314 23 143 -68 88 219 -267 -108 330 76 -69 41 259 93 -347 76 286
2910 286 -256 -334 28 -263 -339 95 -302 25 193 222 171 31 387 207 -3 -69 368 -32 106 113 42 -86 26
2933 26 -113 -176 -236 4 209 -307 94 -166 -344 32 -134 -43 153 308 50 196 144 248 -82 -137 236 -47
2955 -47 -295 83 244 -116 -165 -102 -280 -262 -69 -53 -187 -381 157 169 -35 268 154 -121 52 109 104 164 177 27
2979 27 -36 -177 256 -51 -237 -126 119 -10 104 81 -245 94 27 82 55 87 37 -33 -170 9 -221 -84 -49
3002 -49 33 -229 -351 -58 55 -254 -357 230 130 -145 268 123 123 91 83 119 33 109 21 -47 170 53 140 -133
3026 -133 131 -66 -257 113 -40 -203 -162 163 79 325 167 90 -133 213 55 -41 9 343 -96 -344 86 -333
3048 -333 -96 92 -68 33 95 -445 185 -6 -114 197 11 -203 230 87 -29 100 -43 199 -214 113
3068 113 22 -287 32 -43 -123 -156 -187 -149 -119 -187 138 -62 20 264 110 31 231 50 -274 -73 -130 -66 71 119
3092 119 -314 119 -337 -39 -294 -254 -74 216 -258 41 257 -184 189 55 331 200 17 -196 359 17
3112 17 12 -34 -185 71 -161 66 63 -407 -105 122 -237 44 -60 -10 98 210 57 -247 72 -269 57 -157
3134 -157 -112 -177 136 -99 29 -13 -102 137 -243 107 169 -129 87 -178 -161 104 182 -10 95 210 2 -31 -200
3157 -200 -76 111 -27 -184 74 51 -359 -76 -28 -70 52 135 60 96 386 -24 -90 189 -324 -110 126 88 -18
3180 -18 -164 -88 21 86 -23 106 261 -317 114 55 129 -58 42 145 198 -81 25 -142 41 93 378 175
3202 175 167 -95 95 -166 106 14 -72 -216 45 -131 -123 71 59 -189 85 158 47 264 54 214 153 38 -110
3225 -110 1 42 6 -97 -186 -186 160 55 97 31 30 -39 92 254 -184 36 94 10 -102 -16 209 -178 134 -3
3249 -3 -146 -311 -134 200 0 333 -38 21 -157 -59 -114 61 26 -89 1 97 213 5 42 10 118 -197 -70
3272 -70 103 -202 134 107 -157 -33 154 -163 119 -131 -127 62 -201 155 55 123 -88 168 111 153 -92 174
3294 174 -69 -208 141 -150 14 377 -17 -163 -137 -86 -138 -97 262 18 -298 101 197 8 -191 55 39 -117
3316 -117 -128 55 -119 -220 -154 146 152 46 35 91 -24 -62 9 38 167 99 -312 -128 210 -50 -13 -36 -230 58
3340 58 -134 -6 -26 -153 28 110 -58 -48 256 84 99 -206 -100 21 -40 -89 -199 21 120 149 -46 107 -78
3363 -78 42 -248 39 -120 -192 -58 107 -166 60 470 270 44 26 -31 -88 259 46 387 -185 -146 -134 -92 -198
3386 -198 127 173 -277 12 -318 16 -169 95 -25 -19 -61 -124 32 103 237 -10 -40 -28 201 -327 107 148 5
3409 5 -67 -26 -115 -284 176 21 -91 -54 319 22 91 302 -92 -80 -92 -40 -84 -260 -218 -270 -213 0 112 -6 -152
3434 -152 136 2 -123 153 -215 413 -106 7 291 -111 61 -26 -211 -6 147 280 -97 -69 -193 89 101
3455 101 61 -320 -207 -144 -48 -89 89 88 -152 77 -269 162 158 44 20 105 -20 45 -64 -56 -96 -18 -115 7 152
3480 152 -33 -34 -187 462 50 -119 142 0 63 13 38 -143 93 -314 351 -175 -77 -16 182 -185 7 210
3502 210 -217 -88 323 79 163 178 -97 234 -29 35 25 -54 153 -100 131 235 174 -270 138 6 -86 44
3524 44 235 41 106 -66 48 59 -183 211 -19 133 13 251 -30 -151 137 -78 -118 -129 -26 -31 -414 168
3546 168 -365 -31 -26 87 -38 -224 191 101 51 -127 58 -101 -47 1 -209 -157 -128 -322 0 -181 -9 -122 -178
3569 -178 130 168 -301 -83 -68 -198 37 0 -199 -15 244 160 -82 -213 -113 34 -88 91 -18 -312 -182
3590 -182 -54 -215 -226 96 -166 -159 92 -125 210 -119 47 29 219 6 352 -65 -158 214 -234 -181 -14 -356
3612 -356 -56 -201 117 39 -182 13 104 223 -132 384 126 -143 142 -46 -95 -42 300 -91 -357 194 53
3633 53 -191 55 39 -233 -2 3 -113 -181 36 330 77 -315 52 187 -154 -104 0 -193 -154 -49 35 252 -193
3656 -193 -232 -71 2 148 82 -253 51 242 -81 -69 268 5 12 -47 146 10 -120 -120 -19 -106 102 73 -545 246
3680 246 23 -142 409 51 43 -113 -51 -21 44 -104 138 81 -145 62 61 91 -48 93 76 -170 58 -172 -147 45
3704 45 88 -53 -95 -47 157 -146 177 38 -114 212 -125 85 -38 -67 71 -129 30 77 -192 -197 -64 -311 -91
3727 -91 -181 114 350 -83 -284 431 -134 164 -37 -273 227 -157 -104 313 119 12 376 -140 176 143 51 -158
3749 -158 -45 -76 -242 32 136 173 154 104 197 -86 -38 36 -20 -220 -228 142 -118 28 -83 65 158 -106 221 174
3773 174 -231 125 0 -40 -49 254 110 42 -147 196 143 -239 -139 169 -194 139 -63 -177 110 47 -208 -78
3795 -78 -28 -197 -62 -78 189 -59 238 188 -237 -113 172 249 171 -24 79 -121 -61 -11 94 23 -49 -221 91
3818 91 -81 17 -151 33 -68 107 245 125 64 -18 31 93 164 0 -83 38 -345 -46 -36 -313 -150 -32 -190
3841 -190 76 114 -87 167 -51 431 117 -10 187 -50 -19 271 6 -163 -201 -168 -100 -5 -36 37 -24 -89 191
3864 191 109 -136 -20 125 78 102 -3 236 172 -84 24 -152 -3 -89 40 -136 -111 48 -244 47 -80 256
3886 256 100 265 -91 -203 160 44 -81 216 -101 -83 62 -272 -86 215 -83 -253 222 -213 -38 266
3906 266 -39 -79 164 62 39 308 -300 89 -2 132 -231 -279 -45 114 -159 -84 174 -131 -101 -191 169 -190
3928 -190 78 -105 232 -117 92 364 97 -124 24 114 180 41 -210 -176 89 52 -23 -70 46 -74 -125 -216 -19
3951 -19 -107 -120 3 181 -47 -95 105 -163 58 141 285 -135 -334 79 61 -11 -245 3 -246 -166 174 130 -89
3974 -89 108 201 -126 167 -30 -46 -240 92 -139 -39 -284 -165 118 133 -68 -271 28 -136 -19 33 112 79
3996 79 -133 93 60 58 -126 47 93 29 7 -80 455 -178 -29 111 -388 37 87 154 134 -190 139 -247 -81 235
4020 235 -68 -71 -99 394 32 134 210 -173 230 113 -49 -169 -106 120 129 -283 60 -172 -175 -3 -107 -148 -15
4043 -15 -6 -35 -112 -123 -174 97 150 170 88 -31 63 -95 36 -14 -112 -81 173 -146 51 146 -428 394 326 -283 57
4068 57 -24 80 30 -129 -179 166 38 99 50 -97 368 312 97 -272 47 -188 117 -152 -214 57 -158 115 -126
4091 -126 137 58 178 35 58 -60 -4 -8 -262 -179 -244 -21 82 33 31 241 -24 184 177 -109 -104 13 319 214 77
4116 77 109 -58 179 214 124 -67 -45 283 -171 50 -32 -51 -174 -28 -182 -211 -70 -34 -120 -23 -107 228 -57 49
4140 49 287 -191 6 -303 -183 7 -130 348 -49 48 -121 54 -140 -49 -7 -136 120 305 66 -164 7
4161 7 -13 62 30 256 -86 -68 -27 -68 -218 -94 68 -168 -255 -72 41 185 75 174 195 23 72 351 -215 30
4185 30 223 -247 49 -252 5 194 88 -251 248 70 -359 -106 90 35 37 92 131 103 81 -84 -67 -113 -103 99
4209 99 182 141 24 24 -49 -3 35 -29 -168 14 -318 -294 105 110 199 184 -136 12 104 -55 -158 51 56 139 -139 46
4235 46 142 -47 211 -218 -259 -141 -6 -264 -131 -49 -23 62 -139 -43 48 169 -57 220 107 78 -83 -91 -147 220
4259 220 -320 117 -106 -23 -4 -102 98 -155 195 -77 297 103 -121 80 -108 -33 127 -176 -38 -16 -24 -35 -197
4282 -197 62 193 150 180 69 40 -70 99 249 -16 86 209 -101 -293 38 -37 -196 -161 -60 47 -149 -145
4304 -145 -8 3 -263 -93 32 -142 -159 -63 63 233 -131 103 161 54 357 99 60 -154 -59 -61 -31 -6 -9 -303
4328 -303 37 21 -191 81 -1 49 -15 -169 -20 -33 191 211 40 80 63 37 -24 -138 -100 -27 32 5 34 55 87 159
4354 159 118 144 -248 67 32 -30 5 -31 -16 104 -102 -71 -129 -47 55 -174 -61 -268 -153 -117 95 88 125 -268 -242
4379 -242 79 76 -156 173 -18 103 40 -65 -141 36 46 46 221 -190 -97 -42 268 -103 37 120 55 116 30 50 -269
4404 -269 -75 -95 -90 -59 -130 -86 186 153 -94 -217 -147 60 166 108 -248 222 -93 127 -89 81 174 -195 178
4427 178 38 -30 -123 106 -46 -66 -64 -69 179 -20 108 72 -85 -249 107 -186 -77 46 231 21 6 -307 -348
4450 -348 -18 130 -107 222 -9 47 150 -80 -203 -3 -170 -81 -56 -104 -251 -111 12 227 -251 64 297
4471 297 -275 -130 65 46 70 120 168 96 45 -209 -100 -150 -127 -309 -81 109 -104 10 200 -269 -6 128 187
4494 187 8 151 96 49 187 -116 224 -88 -41 100 21 -162 53 32 -47 -105 -144 -125 -36 22 -72 -300 -20 22
4518 22 -151 -2 163 -43 -81 -28 -164 247 94 -3 -16 -171 46 -12 -136 4 20 82 86 -117 -247 -111 -14 2
4542 2 -129 31 89 113 2 90 -59 -77 -62 -139 -230 33 -54 179 50 48 63 116 202 334 -152 -41 -213 93 -52
4567 -52 150 -82 14 -151 178 94 -138 142 -391 -82 33 64 -60 -219 -109 -447 -50 209 -64 -180 100
4588 100 39 -77 40 139 -28 -57 31 86 25 21 -227 -282 -114 196 -91 -46 -12 -123 -20 -37 -132 -67 293 24 -68
4613 -68 124 296 59 -2 -102 -283 8 -54 298 78 -106 -55 163 62 -19 171 319 16 198 -129 46 -69
4635 -69 -29 113 -106 81 -130 74 -54 -154 71 -159 130 166 -49 -139 22 38 -42 172 246 -92 -140 226 204
4658 204 -29 143 127 40 -272 -40 56 146 -8 -154 -61 -44 219 87 -21 -3 -50 -241 21 -64 -93 -38 41 -117
4682 -117 -65 -101 -39 66 133 -154 166 37 170 -69 8 -1 -64 -12 14 283 162 187 -220 108 -113 -68 -125 -80 -98
4707 -98 -219 -275 149 -4 -222 -140 70 71 46 -87 -6 -28 16 -109 -274 -84 128 -70 -47 120 -171 84 200
4730 200 -165 -158 -241 -194 -193 -11 51 83 -95 103 34 47 195 0 94 12 -261 15 -180 -1 -151 179 168 -121
4754 -121 151 -226 -152 125 -30 181 69 -51 38 71 65 4 -19 -82 275 -154 -198 -231 -54 -308 46 -142 81
4777 81 150 -218 -133 -78 -12 -72 -172 202 -94 -226 159 139 198 -86 -266 -4 54 -63 -112 27 -79 256 -28
4800 -28 -289 -96 73 156 23 -137 162 17 228 24 -90 59 -184 -74 58 87 -278 94 5 -173 -16
4821 -16 -232 -149 -146 -102 -175 165 -151 82 -145 42 10 196 2 -180 45 -20 148 -234 105 13 -186 -76 -34
4844 -34 -51 -60 8 -89 -44 19 65 28 399 89 73 66 -155 102 -117 -52 159 -11 -243 -25 51 -52 36 -39 228 -38
4870 -38 -30 92 -210 -257 298 -66 397 200 70 -31 201 13 92 80 -160 173 9 40 -34 -64 -91 62 -119
4893 -119 179 43 -74 -117 -162 38 88 -7 -26 63 -2 116 -51 -63 -154 66 134 280 -124 -182 2 3 87 0 -289
4918 -289 13 -62 185 -197 -200 54 -8 136 241 122 25 107 118 -175 -35 -108 120 -72 -194 -119 73 -124 -200
4941 -200 -83 221 -59 73 107 82 -89 -1 -126 -21 100 -217 -332 -144 -45 17 7 -219 -51 149 3 68
4963 68 -192 151 5 51 -53 113 -60 -21 151 -85 81 -227 278 86 -285 -5 -265 -140 -206 -11 -73 -37
4985 -37 242 49 148 -155 190 -35 -143 7 -3 109 57 -157 105 -91 -71 -123 -135 -159 88 -124 240 -7 53
5008 53 -183 -82 130 223 -129 139 -90 56 -63 -137 47 -62 134 -27 -263 -265 -151 -141 -272 34 75 -375
5030 -375 19 -62 -9 -155 -89 -9 -75 110 -15 66 -17 40 86 -327 11 100 -134 -21 -353 146 -319 59 -212
5053 -212 171 -79 -161 66 1 226 -280 36 -82 -71 19 -81 -128 -74 -173 1 -199 19 139 36 -221 -75
5075 -75 272 -32 -29 -36 -20 50 -116 -121 106 -147 -191 -102 317 27 -161 17 162 9 -107 291 160 -166 77 -47
5099 -47 399 -346 -67 -87 -62 -235 -41 -111 14 -122 -55 6 94 -85 136 -21 -83 30 7 -63 8 -78 -15 54 -24
5124 -24 57 -151 -22 -424 -169 -84 -171 -3 296 138 133 15 -123 8 -112 -137 -12 -2 30 102 -139 77 216
5147 216 -78 213 -76 22 -62 -215 -120 211 63 223 136 -186 -66 -23 -44 -76 -55 -8 98 20 137 -37 -74 -67
5171 -67 -167 -218 29 -82 -1 97 -11 -137 12 -26 215 55 139 61 -66 158 308 115 -294 393 103 218
5193 218 45 -56 61 -99 277 238 -101 -23 -182 -36 -89 100 -113 140 -244 -236 54 190 -74 50 68 29
5215 29 -74 53 -122 -305 38 -177 -110 -75 139 -9 44 109 88 -64 129 10 -137 -38 71 -305 -217 -4 -18
5238 -18 142 -57 267 276 95 -256 -246 50 49 25 -155 281 46 236 -214 196 380 -89 40 23 2 72 209
5261 209 33 171 -121 216 -94 393 -42 214 -85 -87 50 -135 -53 -48 -95 -80 -73 142 7 153 -1 -218 76
5284 76 -1 -13 -170 -240 311 95 -276 -66 -16 -189 94 -117 -86 -135 -51 273 16 -114 134 -86 28 130 175
5307 175 166 -140 -126 -158 118 124 -15 -54 -141 -229 -37 329 95 20 241 -178 24 -2 25 -266 66 -85 75 149
5331 149 -80 179 -113 -121 34 -261 -39 0 256 -39 198 62 -108 458 112 -200 27 96 -69 -108 17 -196
5353 -196 -60 -279 57 -207 32 -13 -249 181 -14 -108 -65 75 -18 140 78 -104 -88 -40 -14 -71 43 64 -29 131
5377 131 -297 -1 22 197 9 -104 -41 168 132 -60 94 111 -56 -71 -125 12 3 38 12 -36 216 -62 -126 105
5401 105 23 35 -84 150 -2 199 185 -128 -130 25 -60 87 -256 -168 69 178 -106 71 -62 -184 -157 -171 108
5424 108 -66 -64 181 -24 124 110 -272 -61 -121 44 -116 -19 -164 64 -36 37 224 -67 -124 -108 25 105 -236
5447 -236 -246 -210 67 -32 41 142 46 220 64 -192 127 135 -335 116 -116 -31 53 232 -294 85 -87 -3 193
5470 193 -54 104 142 -181 -189 -10 -197 113 -184 153 -156 322 -94 -11 -75 177 373 -129 147 -98 101 -65
5492 -65 -33 143 22 -49 61 -73 121 22 58 -193 -167 -102 82 -68 -344 -241 -12 -43 100 118 -64 206 147
5515 147 245 -378 -273 89 128 328 61 9 -94 46 -177 169 -222 -250 33 70 275 130 35 -9 92 -85
5537 -85 -75 120 -146 -66 -52 -118 155 -13 130 -172 43 46 -230 201 116 -57 -81 -64 -52 -47 63 58 34 -137 59
5562 59 -54 -374 -16 -82 -53 68 31 -6 -54 49 415 84 129 -145 24 67 -123 -105 -87 -158 170 -68 -277 -55
5586 -55 -149 -10 19 -134 63 263 182 26 124 302 -3 61 -238 -68 -132 -344 -4 82 -239 -177 136 63 49 -18
5610 -18 126 -24 -123 147 143 -97 51 -73 74 -95 -133 -107 112 -81 128 168 76 -125 28 65 -45 137 -170
5633 -170 19 213 106 183 107 12 -37 -321 240 12 -12 117 -52 38 3 -241 152 35 53 -1 66 -9 45 47 213
5658 213 32 -26 -23 22 -24 63 -118 4 58 -68 156 3 230 -26 -76 163 165 -64 -363 -21 -60 -13 0 101
5682 101 142 120 -39 266 5 -73 248 -139 -27 35 -43 73 89 135 58 209 -355 12 -223 40 -26 -30 358 86
5706 86 -52 5 172 77 59 -113 120 63 -80 -114 -121 57 -184 -10 35 33 133 167 25 51 191 -85 365 184
5730 184 59 -331 189 -14 1 -108 -51 -120 20 -155 85 42 111 22 67 -65 -57 -145 -41 -163 -8 -88 188 210
5754 210 -74 9 -173 247 -121 9 305 -14 -142 -117 158 173 -34 -18 -49 84 -74 -262 -130 -79 126 155
5776 155 275 230 435 314 -84 -1 -21 83 -110 5 73 -71 29 -263 -93 31 -179 342 80 -70 -129 20
5798 20 114 152 57 -273 71 -152 -21 -162 263 213 -78 187 54 116 104 -107 149 23 -144 -53 -96 140 28
5821 28 185 37 149 269 -21 5 84 -104 153 131 -20 37 26 193 -63 227 -7 -80 -57 -73 206 -111 98
5844 98 -46 -106 -45 170 -385 -74 121 -65 -178 -91 -258 -300 -20 -213 116 -242 92 -96 -47 34 -240 -73
5866 -73 -15 87 -72 -98 66 -55 -18 -235 66 -23 55 -41 186 -12 -55 -187 114 -154 -70 -18 -107 -15 161 79
5890 79 -153 -145 -193 220 -265 114 -61 71 64 -214 44 -85 -3 235 187 -278 92 129 218 -31 98 -224 84
5913 84 -54 20 -186 217 -305 140 -105 -129 115 -71 -113 57 -75 15 -228 48 -265 -240 111 185 173 169 46
5936 46 -283 -228 -41 -58 47 25 -117 -166 -340 -236 126 17 -273 -239 -117 116 203 13 -67 -159 61 -115 -127
5959 -127 -202 -13 258 -32 49 -61 68 -105 96 -207 -205 6 11 55 69 -47 -95 -16 84 8 -73 22 10 -280 -106
5984 -106 51 178 20 148 16 74 63 46 227 4 19 39 59 24 -30 -67 -157 201 76 29 276 -63 -227 -150
6008 -150 -154 156 -150 -125 -160 96 223 52 153 -106 -63 -98 -183 -48 61 27 36 -134 70 157 -35 20 -176 -141
6032 -141 119 -23 -150 -278 -9 28 66 113 -197 210 99 21 108 44 -132 -93 -58 -58 -185 -23 -83 3 -76 354
6056 354 8 -58 -94 -69 172 166 -73 -88 196 -152 -33 -25 48 166 -89 -86 -90 -199 291 -341 230 -48 -221 91
6080 91 -178 86 -164 204 106 114 193 198 89 -203 146 -183 -17 -144 -145 159 74 -72 -121 94 -59 -167 77 -405
6104 -405 -113 71 18 258 -296 162 153 25 68 -87 -25 -90 -212 -64 -54 43 23 42 151 -154 316 -153 -107 47
6128 47 109 -301 -67 -428 -300 147 -22 -151 -47 -152 -48 -103 -53 26 75 146 219 -171 125 248 84 -106 -12
6151 -12 139 -119 -31 -125 32 -54 -22 251 -105 -50 -76 -47 -67 -96 -4 100 132 25 40 -163 -8 172 -5 -217
6175 -217 -45 -26 80 69 196 -55 -174 141 149 19 -109 77 -38 177 84 137 -83 261 4 -92 -81 -55 -117
6198 -117 -6 -24 -18 -52 93 206 -155 -175 -160 -51 111 128 108 -93 -234 205 60 6 -50 78 24 -51 -74 -150 350
6223 350 -36 267 111 185 -89 -56 -142 135 -53 -225 367 213 114 -5 108 -142 -39 103 278 74 -26
6244 -26 -141 125 65 80 -66 99 8 -98 30 154 19 83 51 161 -24 -72 -296 -237 -135 -27 86 -82 165
6267 165 -36 -238 70 24 -48 85 -162 -74 -122 36 103 165 -79 -70 140 5 85 172 65 34 62 -80 -129 -66 12
6292 12 36 71 -75 84 -30 28 24 -278 47 111 -183 151 112 -111 42 -150 -49 194 -99 -260 97 -87 -26
6315 -26 77 -59 202 282 32 -42 47 87 -141 186 -315 -31 -197 -151 93 180 -67 188 70 89 -12 -86 -176
6338 -176 133 -57 110 141 -42 72 -266 106 -129 23 28 97 115 43 158 -216 -253 24 -103 32 178 -234
6360 -234 -58 35 95 157 24 10 294 -61 -23 -133 185 -112 -2 -61 14 -123 -188 30 13 -259 -67 60 -93
6383 -93 -21 -199 62 -36 -94 103 103 144 94 153 178 -226 119 -155 -62 -346 155 231 -202 -35 -45 209 -78 -96 -10
6408 -10 36 56 -146 -190 130 -114 -179 -89 -87 -11 -71 104 -61 23 284 167 -216 -196 -42 206 36 216 44 114
6432 114 -125 -63 -84 -55 290 -41 -56 -175 -133 -198 64 -147 -155 28 -116 4 62 118 359 -33 41 -3 -129 144
6456 144 74 -155 -206 45 -17 264 73 4 10 199 226 -110 178 -16 -113 -152 -52 -5 -94 184 -301 -182 84 -30
6480 -30 31 14 125 -13 -54 36 -62 -31 253 -178 -47 -44 96 -201 -9 -243 84 107 -232 -240 156 18 -179 -55
6504 -55 -18 -131 -85 -51 63 -47 -75 -143 -84 -144 -86 176 -88 -186 -93 -158 -18 211 -43 78 -60 -102 -63 -32 -48
6529 -48 90 -108 -11 19 -140 -46 326 67 -352 381 188 216 235 -160 -70 -179 -67 98 -311 0 76 1 67
6552 67 -145 285 -98 71 -15 14 -152 -125 -314 5 56 -48 279 102 15 -79 219 105 5 54 12 64 -159
6575 -159 -107 -20 76 216 337 147 205 263 -173 52 57 49 142 70 -10 57 156 -162 -6 41 -133 -3 -15 92 13 143
6601 143 -118 137 -96 -220 127 23 204 31 -64 226 -2 68 -9 85 -99 -283 -288 -207 102 41 -236 35 -159
6624 -159 -93 -85 16 36 -49 236 -81 -92 114 -93 90 56 -87 401 61 -114 83 11 57 -35 10 154 203 -107
6648 -107 174 289 9 250 101 144 -161 -108 7 62 208 -2 -96 114 -93 18 104 -257 -193 -216 99 -32
6670 -32 -206 -18 -37 -5 -130 -239 100 10 -48 -165 144 -129 -77 -111 -74 276 -196 -20 11 -139 -55 89 82 288
6694 288 -248 -39 365 -85 26 20 178 4 -113 80 145 322 -207 -24 65 40 42 -79 -4 -14 -10 -16 -94 -32 146
6719 146 140 27 134 -89 -76 49 -97 36 -209 -93 99 99 72 59 -2 56 -78 76 -255 55 -1 30 -126 -26
6743 -26 26 -57 213 -64 -193 189 99 -167 132 82 3 108 37 46 122 295 -233 -215 -190 100 -109 34 115 -160
6767 -160 -80 22 -50 17 -44 -148 41 -164 -47 -60 80 -93 -88 -122 -210 -129 -261 -85 -10 75 6 -15 103 -102 15
6792 15 -131 360 19 151 67 58 18 -48 285 69 94 -80 127 27 -48 -162 41 271 -23 -56 -101 183 -48
6815 -48 -5 107 143 -159 -194 -19 169 213 -110 -86 34 -126 74 103 81 -199 -219 -138 -43 -129 124 257 -109 38
6839 38 -165 62 -46 112 -184 -14 102 -351 35 149 -163 95 -30 -335 276 -31 134 -69 114 56 22
6860 22 -58 -123 -93 -104 25 -63 48 -218 427 167 -28 272 75 -31 112 -83 -299 57 102 -175 23 38 85
6883 85 -30 230 -203 263 105 33 54 -251 -91 -141 -16 20 -77 82 -62 45 -56 -58 -100 -77 -100 -128 -15 75
6907 75 95 214 148 45 214 -37 -118 -263 62 137 68 14 -275 -92 -32 -73 22 323 130 117 158 -236 -153 -144 -83
6932 -83 -23 -60 -84 -358 -65 201 -20 173 189 202 -178 19 -197 -31 228 17 -35 -210 218 22 91 87 25 87
6956 87 -4 -46 256 -157 214 52 397 -257 34 -35 -128 -67 109 115 -97 34 -62 118 -60 78 57 -111 -12 134
6980 134 199 218 -89 27 19 78 124 133 -121 161 -128 8 -3 -205 -42 -31 224 -36 -133 -98 -101 70 208 30 -71
7005 -71 184 79 102 178 -39 232 -28 -4 109 -94 132 272 -121 28 154 117 67 -55 51 -61 -3 239
7027 239 110 98 59 198 -2 107 -7 274 -71 47 276 104 -149 -69 -63 101 -68 -120 21 32 242 -62
7049 -62 34 197 248 -64 32 -75 -247 162 -79 26 98 -29 78 246 -145 136 175 121 172 -300 26 127 -88
7072 -88 149 -1 -148 29 155 89 217 116 136 -21 52 -198 54 232 155 -29 -18 -265 7 -93 -104 -400
7094 -400 -104 -91 -130 -240 83 -62 130 -83 -74 199 -278 77 -90 6 378 5 21 14 -12 279 61 -154 -81
7117 -81 43 149 222 114 268 -9 186 -100 -27 192 -43 189 45 278 95 23 252 -117 163 -273 -60
7138 -60 -33 37 202 -144 -60 207 134 101 -154 -42 -16 -17 -73 34 126 4 109 -47 -102 -151 164 197 -29 8 -80
7163 -80 56 -9 -186 156 120 119 274 4 -316 197 -187 -84 -68 -71 30 73 -185 -175 17 -360 -27 186 182 145
7187 145 -4 -179 -326 107 17 -65 97 220 91 -61 263 -99 -121 36 -31 143 -102 141 -31 36 -65 -148
7209 -148 -151 24 47 18 206 -44 -154 -184 -126 7 113 163 75 -45 -56 12 162 -379 107 96 56 106 -83 99
7233 99 26 134 92 46 121 306 -34 89 -20 105 48 179 -84 -135 91 2 102 213 141 1 -212 256 -25
7256 -25 -172 142 -298 40 -136 26 -38 -213 237 273 -69 41 -223 96 94 -37 112 -84 136 -86 177 -42
7278 -42 -90 55 182 142 -37 35 11 151 15 94 21 -25 298 -245 21 52 218 105 11 119 48 -14 135 -91
7302 -91 -136 -30 299 2 -57 -11 37 -150 -46 -10 -201 31 241 19 73 110 30 -20 -110 -50 -327 -101 -8 -109
7326 -109 -60 45 14 -38 -247 -204 -13 7 143 -122 97 -21 -49 205 -34 -53 -111 231 53 38 11 -60 84 150
7350 150 43 161 -161 -3 37 -382 6 41 -18 126 147 140 26 120 28 -112 180 -87 148 108 135 261 -323
7373 -323 -114 14 44 93 39 -91 -31 45 27 -69 130 -26 59 80 -64 -206 -72 90 -94 -37 -163 -41 106
7396 106 -15 210 73 217 -98 121 -43 -86 -13 -62 -44 66 -84 -89 29 113 -172 129 101 134 -127 -138 134
7419 134 -119 4 176 224 -189 -55 -103 -323 -128 142 -235 44 -45 -13 20 161 -8 -146 -194 -33 33 143
7441 143 69 148 -117 67 -234 -52 101 184 -238 -53 52 -102 52 -18 -121 -13 150 155 11 -211 21 61
7463 61 21 282 -237 42 -94 -43 88 125 7 -71 -51 23 161 -202 -51 161 -79 -71 157 257 217 75 115 -10
7487 -10 129 149 -127 -73 145 125 110 57 231 264 -151 237 -51 -20 -34 108 12 -139 -105 -429 -217 136 -255 17
7511 17 104 -294 139 -258 -310 52 282 -58 -71 -57 -6 -112 -144 223 59 11 -54 134 -13 119 -322 -9 418
7534 418 -165 23 202 208 -6 -16 130 -70 55 50 55 -129 -5 -193 -150 129 -4 71 -4 -154 -18 60 -164 176
7558 176 -213 177 -166 73 112 -417 -116 43 -220 -103 198 -90 310 28 2 41 -8 237 -86 -94 -108 -114 -32
7581 -32 -125 -173 -18 123 80 232 139 -241 -164 41 -213 -39 91 82 132 -249 -66 73 154 180 -40 235 -79 152
7605 152 95 -118 -41 -67 79 -41 -165 194 56 61 27 92 -96 -97 -230 70 -100 88 -176 -109 -59 209 -8 -83
7629 -83 45 112 97 93 -13 17 -53 337 8 -62 -33 -133 40 -210 55 122 -58 79 -202 -155 -203 129 -168 -191
7653 -191 288 -11 53 170 6 -135 124 -85 31 -99 180 -101 55 -45 -157 293 -107 -7 146 -127
7673 -127 58 -151 -2 -150 89 261 100 126 101 11 -108 -55 48 166 4 176 104 -163 73 -233 -201 -130
7695 -130 -268 -73 -102 -1 53 -58 159 -189 -104 212 79 -9 70 -159 11 -148 -99 78 -76 -199 161 68
7717 68 -269 -171 -64 -88 -113 2 4 -2 -231 -278 -90 -145 144 -193 -4 16 114 190 126 -81 173 -118 -49 230 -145
7742 -145 -258 -21 63 51 -29 -141 -108 -341 34 -81 221 67 -91 133 30 7 -67 98 -106 -170 77 -156
7764 -156 -76 65 -198 -458 -36 117 -86 -16 37 2 83 239 -121 126 -11 307 -80 16 127 -68 -112 66
7786 66 108 126 2 -49 -125 159 82 41 -55 15 186 75 -7 5 130 84 -4 -30 108 -145 32 -110 228 6 -121
7811 -121 -186 -44 44 -45 -79 -40 63 42 102 156 10 211 -125 23 -20 11 -249 -35 -139 -22 146 143 84 -119
7835 -119 -275 -194 -142 -139 33 -62 140 -190 -148 221 142 -86 -26 -202 -113 -161 52 -47 -2 56 356 -3 -165 -91 147
7860 147 -143 -113 -113 66 -74 344 32 -49 -343 215 -194 130 267 33 -38 -131 -93 -165 171 -186 262 -229 213
7883 213 -66 -15 -42 344 -152 -74 -110 -129 93 -199 179 -196 -74 -18 -70 235 122 69 -6 -157 46 -33 187
7906 187 162 -102 -26 86 36 138 -6 -48 187 67 -305 21 123 -63 -84 -16 -19 164 143 -55 130 -110 -140
7929 -140 -296 22 -225 -102 3 255 -56 -37 -11 -36 115 67 -263 26 92 36 -85 11 8 -34 48 14 -101 -18
7953 -18 111 135 -65 -100 107 -168 -161 145 -51 92 34 80 14 -119 -94 306 78 -31 90 -202 119 -480 -276
7976 -276 166 27 -7 -168 154 92 -58 158 245 22 -118 39 -118 -211 97 -8 -90 207 -13 -95 325 284
7998 284 48 178 165 160 172 -204 -15 -428 -3 23 350 -231 102 111 118 94 15 27 -140 -44 110 -85 -62 -93 -221
8023 -221 -183 -31 -84 -57 43 -249 -176 -129 63 174 -80 163 130 28 -45 -213 -40 -73 -97 -282 -59 121 92
8046 92 16 -175 91 155 205 187 -156 14 -159 309 -90 27 164 279 -280 -106 65 -105 139 24 -293 1
8068 1 -240 -29 -53 16 189 244 -97 -229 -201 -83 -137 -124 -87 62 -185 64 30 -9 73 25 -207 -275 180 -65 -79
8093 -79 -150 84 65 -46 -32 -131 36 -51 -83 -168 291 -98 -97 80 144 -97 138 -68 -42 -140 -92 -4 -110 30 232
8118 232 286 83 116 16 52 80 -332 -56 94 -216 -208 -14 209 105 198 294 -20 89 -74 -17 -73 -419 118
8141 118 -56 -81 -3 85 57 29 15 -101 -215 200 102 93 -77 -2 -93 -135 -32 -219 32 52 -58 103 -166 -159 199
8166 199 -30 26 167 -152 1 63 12 -96 -466 32 -84 185 161 252 182 -15 -124 145 416 -100 -109 -109 -66 114
8190 114 -233
8191b33
##END NTUPLES=NMR FID
##END=
