##TITLE=1H_Pr DMSO
 200.13MHz, CCl4,
 8 sc
 
 6.8.2025
##JCAMPDX= 6.0         $$ Bruker NMR JCAMP-DX V2.0
##DATA TYPE= NMR FID
##DATA CLASS= NTUPLES
##ORIGIN= UXNMR, Bruker Analytische Messtechnik GmbH
##OWNER= pz
$$ XWIN-NMR		Version 3.5
$$ Wed Aug  6 14:43:19 2025 Russian Standard Time (UT+4h)  she@DPX200
##.OBSERVE FREQUENCY= 200.1308
##.OBSERVE NUCLEUS= ^1H
##.DELAY= (6, 6)
##.ACQUISITION MODE= SIMULTANEOUS
##.ACQUISITION SCHEME= undefined
##.AVERAGES= 8
##.DIGITISER RES= 18
##SPECTROMETER/DATA SYSTEM= spect
##.PULSE SEQUENCE= zg30
##.SOLVENT NAME= CDCl3
##.SHIFT REFERENCE= (INTERNAL, CDCl3, 0, 14.3821)
##AUDIT TRAIL= $$ (NUMBER, WHEN, WHO, WHERE, WHAT)
$$ ##TITLE= Audit trail, XWIN-NMR		Version 3.5
$$ ##JCAMPDX= 5.01
$$ ##ORIGIN= Bruker BioSpin GmbH
$$ ##OWNER= she
$$ F:/spectra/data/she/nmr/H-C/1/audita.txt
$$ ##AUDIT TRAIL=  $$ (NUMBER, WHEN, WHO, WHERE, WHAT)
(   1,<2025-08-06 14:41:06.14 +0400>,<she>,<DPX200>,
      <created by zg, POWCHK disabled, PULCHK disabled
       configuration hash MD5:
       00 E9 B6 7A A2 85 ED C7 34 08 36 98 17 FE 4E 26
       data hash MD5: 16K
       ED 06 1B 59 79 00 FB 10 42 BC A7 E4 8E BA 2A 92>)
$$ ##END=
$$ 
$$ hash MD5
$$ B6 23 84 E5 6D AA 58 7B 45 D9 27 DA 8E 39 F1 62
##$RELAX= 
##$RELAX= 
##$RELAX= 
##$RELAX= 
##$RELAX= 
##$RELAX= 
$$ Bruker specific parameters
$$ --------------------------
##$DU= <F:/spectra>
##$EXPNO= 1
##$NAME= <H-C>
##$PROCNO= 1
##$TYPE= <nmr>
##$USER= <she>
##$AMP= (0..31)
100 100 100 100 100 100 100 100 100 100 100 100 100 100 100 100 100 100 
100 100 100 100 100 100 100 100 100 100 100 100 100 100 
##$AQSEQ= 0
##$AQ_mod= 1
##$AUNM= <au_zg>
##$AUTOPOS= <>
##$BF1= 200.13
##$BF2= 200.13
##$BF3= 200.13
##$BF4= 200.13
##$BF5= 200.13
##$BF6= 200.13
##$BF7= 200.13
##$BF8= 200.13
##$BYTORDA= 1
##$CFDGTYP= 0
##$CFRGTYP= 5
##$CHEMSTR= <none>
##$CNST= (0..31)
1 1 145 1 1 1 1 1 1 1 1 1 1 1 1 1 1 1 1 1 1 1 1 1 1 1 1 1 1 1 1 1 
##$CPDPRG= <>
##$CPDPRG1= <>
##$CPDPRG2= <>
##$CPDPRG3= <>
##$CPDPRG4= <mlev>
##$CPDPRG5= <mlev>
##$CPDPRG6= <mlev>
##$CPDPRG7= <mlev>
##$CPDPRG8= <mlev>
##$CPDPRGB= <>
##$CPDPRGT= <>
##$D= (0..31)
0 0.7 0 0 0 0 0 0 0 0 0 0.03 0 0 0 0 0 0 0 0 0 0 0 0 0 0 0 0 0 0 0 0 
##$DATE= 1754476865
##$DBL= (0..7)
120 120 120 120 120 120 120 120 
##$DBP= (0..7)
150 150 150 150 150 150 150 150 
##$DBP07= 0
##$DBPNAM0= <>
##$DBPNAM1= <>
##$DBPNAM2= <>
##$DBPNAM3= <>
##$DBPNAM4= <>
##$DBPNAM5= <>
##$DBPNAM6= <>
##$DBPNAM7= <>
##$DBPOAL= (0..7)
0.5 0.5 0.5 0.5 0.5 0.5 0.5 0.5 
##$DBPOFFS= (0..7)
0 0 0 0 0 0 0 0 
##$DE= 6
##$DECBNUC= <off>
##$DECIM= 32
##$DECNUC= <off>
##$DECSTAT= 4
##$DIGMOD= 1
##$DIGTYP= 9
##$DL= (0..7)
0 120 120 120 120 120 120 120 
##$DP= (0..7)
150 150 150 150 150 150 150 150 
##$DP07= 0
##$DPNAME0= <>
##$DPNAME1= <>
##$DPNAME2= <>
##$DPNAME3= <>
##$DPNAME4= <>
##$DPNAME5= <>
##$DPNAME6= <>
##$DPNAME7= <>
##$DPOAL= (0..7)
0.5 0.5 0.5 0.5 0.5 0.5 0.5 0.5 
##$DPOFFS= (0..7)
0 0 0 0 0 0 0 0 
##$DQDMODE= 0
##$DR= 18
##$DS= 0
##$DSLIST= <SSSSSSSSSSSSSSS>
$$ [...]
##$SUBNAM0= <"">
##$SUBNAM1= <"">
##$SUBNAM2= <"">
##$SUBNAM3= <"">
##$SUBNAM4= <"">
##$SUBNAM5= <"">
##$SUBNAM6= <"">
##$SUBNAM7= <"">
##$SUBNAM8= <"">
##$SUBNAM9= <"">
##$SW= 18.0517779522481
##$SWIBOX= (0..15)
0 0 2 0 0 0 0 0 0 0 0 0 0 0 0 0 
##$SW_h= 3612.71676300578
##$TD= 16384
##$TD0= 1
##$TE= 0
##$TE2= 300
##$TE3= 300
##$TEG= 300
##$TL= (0..7)
0 120 120 120 120 120 120 120 
##$TP= (0..7)
150 150 150 150 150 150 150 150 
##$TP07= 0
##$TPNAME0= <>
##$TPNAME1= <>
##$TPNAME2= <>
##$TPNAME3= <>
##$TPNAME4= <>
##$TPNAME5= <>
##$TPNAME6= <>
##$TPNAME7= <>
##$TPOAL= (0..7)
0.5 0.5 0.5 0.5 0.5 0.5 0.5 0.5 
##$TPOFFS= (0..7)
0 0 0 0 0 0 0 0 
##$TUNHIN= 0
##$TUNHOUT= 0
##$TUNXOUT= 0
##$USERA1= <user>
##$USERA2= <user>
##$USERA3= <user>
##$USERA4= <user>
##$USERA5= <user>
##$V9= 5
##$VALIST= <valist>
##$VCLIST= <CCCCCCCCCCCCCCC>
##$VD= 0
##$VDLIST= <DDDDDDDDDDDDDDD>
##$VPLIST= <PPPPPPPPPPPPPPP>
##$VTLIST= <TTTTTTTTTTTTTTT>
##$WBST= 1024
##$WBSW= 4
##$XGAIN= (0..3)
0 0 0 0 
##$XL= 0
##$YL= 0
##$YMAX_a= 21739
##$YMIN_a= -29730
##$ZGOPTNS= <>
##$ZL1= 120
##$ZL2= 120
##$ZL3= 120
##$ZL4= 120
##$ABSF1= 10
##$ABSF2= 0
##$ABSG= 5
##$ABSL= 3
##$ALPHA= 0
##$AQORDER= 0
##$ASSFAC= 0
##$ASSFACI= 0
##$ASSFACX= 0
##$ASSWID= 0
##$AUNMP= <proc_1d>
##$AZFE= 0.1
##$AZFW= 0.1
##$BCFW= 1
##$BC_mod= 2
##$BYTORDP= 1
##$COROFFS= 0
##$CY= -3
##$DATMOD= 1
##$DC= 2
##$DFILT= <>
##$DTYPP= 0
##$F1P= 0
##$F2P= 0
##$FCOR= 0.5
##$FTSIZE= 0
##$FT_mod= 4
##$GAMMA= 1
##$GB= 0.15
##$INTBC= 1
##$INTSCL= 1
##$ISEN= 128
##$LB= 0.25
##$LEV0= 0
##$LPBIN= 0
##$MAXI= 10000
##$MC2= 0
##$MEAN= 0
##$ME_mod= 0
##$MI= 1.114404
##$NCOEF= 0
##$NC_proc= 0
##$NLEV= 6
##$NOISF1= 3.799351
##$NOISF2= 2.8
##$NSP= 1
##$NTH_PI= 0
##$NZP= 0
##$OFFSET= 14.38212
##$PC= 1
##$PHC0= -1193.255
##$PHC1= 3.592301
##$PH_mod= 1
##$PKNL= yes
##$PPARMOD= 0
##$PSCAL= 0
##$PSIGN= 0
##$REVERSE= no
##$SF= 200.129724274929
##$SI= 16384
##$SIGF1= 3
##$SIGF2= 2
##$SINO= 400
##$SIOLD= 16384
##$SREGLST= <1H.CDCl3>
##$SSB= 0
##$STSI= 0
##$STSR= 0
##$SW_p= 3205.1282051282
##$SYMM= 0
##$S_DEV= 0
##$TDeff= 0
##$TDoff= 0
##$TI= <>
##$TILT= no
##$TM1= 0
##$TM2= 0
##$TOPLEV= 0
##$USERP1= <user>
##$USERP2= <user>
##$USERP3= <user>
##$USERP4= <user>
##$USERP5= <user>
##$WDW= 1
##$XDIM= 8192
##$YMAX_p= 0
##$YMIN_p= 0
$$ End of Bruker specific parameters
$$ ---------------------------------
##NTUPLES= NMR FID
##VAR_NAME=  TIME,          FID/REAL,        FID/IMAG
##SYMBOL=    X,             R,               I
##VAR_TYPE=  INDEPENDENT,   DEPENDENT,       DEPENDENT
##VAR_FORM=  AFFN,          ASDF,            ASDF
##VAR_DIM=   8192,          8192,            8192
##UNITS=     SECONDS,       ARBITRARY UNITS, ARBITRARY UNITS
##FACTOR=    0.0002768,     1,               1
##FIRST=     0,             0,               0
##LAST=      2.2672688,     0,               0
##MIN=       0,             -29730,          0
##MAX=       2.2672688,     21739,           0
$$ Real data points
##PAGE= N=1
##DATA TABLE= (X++(R..R)), XYDATA
$$ [...]
$$ plain form
2021 -260 -140 365 -445 431 406 -397 -185 587 -512 311 360 -388 101 291 -656 101 504 -345 284 81
2041 81 -715 153 553 -228 223 -100 -708 555 658 -303 266 -113 -584 703 231 -413 117 5 -488 629
2061 629 173 -405 431 104 -523 561 -186 -219 375 -430 -595 392 -79 -245 551 -817 -77 582 -170 -274
2081 -274 5 -348 90 659 -396 -275 181 -604 171 505 -429 106 352 -488 88 214 -506 236 225 -754
2101 -754 -11 582 -319 150 354 -503 124 424 -521 41 -171 -444 384 330 -387 353 -417 -518 584 187
2121 187 -528 73 -349 -236 427 112 -210 323 -150 -223 459 -181 -262 246 -230 -224 612 66 -83 244 -628
2142 -628 127 823 -175 169 12 -327 -69 661 -321 87 90 -784 151 254 -276 19 225 -387 75 160 -377
2163 -377 156 248 -418 289 308 -255 188 -113 -520 429 201 -193 -12 -291 -274 445 -27 -281 276 200 -256
$$ packed form
2021b60J20N05q10Q76k5q03K12P72j099Q23M9p48M89J90r47P57M03q49O29k03
2041H1p96Q68M00p81M51l23o08J263J03r61N69l79m71J287m72o44N30j12m93J117
2061F29m56n78Q36l27o27J084p47l3N94q05j65R87m71j66P96j368P40O59p52j04
2081b74K79l53M38N69j055J21M56p85P75L34r34N35K46q40N76J26p20P42j1r79
2101g54P43N93r01M69K04q57O27L00r45N62k12k73Q28n4p17P40p70j01J102l97
2121A87p15O01m22J13O63l15l22N33m73p3O82o40q1N08m76OQ36n46j49L27q72
2142f28P55O96r98L44j57l39K58P30r82M08Lq74R35J03n30K95K06o12M62Q5n37
2163c77N33R2o66P07J9n63M43l01m07R49k28l94J81k79J7P19m72k54N57p6m56
$$ plain form
2184 -256 509 68 -343 175 -156 -115 410 -266 -636 196 -366 -392 388 111 -181 363 -628 -158 362 -313 37
2205 37 577 -585 11 457 64 -90 -61 -140 270 660 -266 -9 309 -469 17 106 -200 -92 -7 -442 270
2226 270 317 -250 169 -139 -360 557 2 -98 199 53 -757 822 284 -268 410 -201 -474 437 222 -424
2246 -424 218 -347 -369 318 -57 -351 196 -298 -186 422 -153 -148 262 -168 -36 487 -485 -67 516 -390 82
2267 82 385 -108 -82 466 -192 123 460 -48 165 116 -317 -37 387 -52 -62 249 -557 142 491 -519 -64
2288 -64 121 -504 304 252 -408 136 -175 -256 399 -187 -380 171 94 -235 281 285 -438 312 -277 -426 465 27
2310 27 -332 317 -139 -251 662 -52 -143 246 -110 26 357 -353 -335 491 -535 40 504 -136 22 467 -440
2331 -440 -78 633 -96 -47 68 -458 140 349 -239 -130 242 -226 197 443 -447 181 72 -358 288 161
$$ packed form
2184b56P65m41m11N18l31M1N25o76l70Q32n62k6P80k77k92N44r91M70N20o75L50
2205C7N40j162N96M46l93j54K9p9M10L90r26K57L18p78M86Q9l06J08Q5m35P12
2226B70M7n67M19l08k21R17n55j00K97j46q10J579n38n52O78o11k73R11k15o46
2246d24O42n65k2O87l75k94N47m94J12O08n75NM10m30J32N23r72M18N83r06M72
2267H2L03m93K6N48o58L15L37n08K13m9m33K80M24m39j0L11q06O99L49j010M55
2288f4J85o25Q08n2o60N44l11q1O55n86j93N51p7l29N16Mp23P50n89j49Q91m38
2310B7l59O49m56j12R13p14r1L89l56J36L31p10J8Q26j026N75M64o40J58M45r07
2331d40L62P11p29M9J15n26N98K09n88J09L72m68M23K46q90O28j09m30O46j27
$$ plain form
2351 161 -551 189 172 -442 491 154 -409 95 -146 -471 496 72 -143 196 -236 -343 486 128 -304 423
2371 423 -429 -359 612 -141 -102 78 -450 -243 163 -172 -106 226 -270 26 397 -255 148 446 -398 -411 477
2392 477 -336 20 404 -53 100 360 -255 179 275 -571 66 176 -184 -39 13 -344 253 302 -505 -33 80
2413 80 -279 385 224 28 175 -96 -230 570 258 -10 43 205 -294 142 76 -144 295 -316 -273 562 67
2434 67 -76 224 -379 -357 437 76 -42 134 -283 -67 240 -99 -153 281 -218 -123 453 -346 -340 463 -447 193
2456 193 566 -557 248 189 -244 -75 106 -351 8 56 -54 374 334 -398 202 16 -181 166 253 -337 144
2477 144 -35 -174 254 6 120 326 -93 -321 272 134 -295 282 75 -550 215 -1 -222 13 -142 27
2497 27 446 44 -132 -148 -451 162 294 -281 98 108 -79 -50 563 -54 262 157 -471 -111 275 -139 -321
$$ packed form
2351A61p12P40j7o14R33l37n63N04k41l25R67m24k15L39m32j07Q29l58m32P27
2371D23q52P0R71p53L9J80n28K07M06l35O6L32m96K96L71o52M03K98q44j3Q88
2392D77q13L56L84m57J53K60o15M34R6q46O37J10l60J45N2l57N97M9q07M72J13
2413H0l59O64j61j96J47k71j34Q00l12k68N3J62m99M36o6k20M39o11M3Q35m95
2434F7j43L00o03K2P94l61j18J76m17K16L07l39n4M34m99R5N76p99OQ03r10O40
2456A93L73j123Q05n9m33J69J81m57L59M8j10M28m0p32O00j86j97L47Q7n90M81
2477A44j79j39M28k48J14K06m19k28N93j38m29N77k07o25P65k16k21K35j55J69
2497B7M19m02j76j6l03O13J32n75L79J0j87K9O13o17L16j05o28L60L86m14j82
$$ plain form
2518 -321 -21 -351 121 523 -217 251 41 -336 113 219 -230 189 34 -453 211 308 -236 168 -69 -318
2538 -318 348 336 -46 148 213 -404 444 166 8 283 -40 -327 387 -265 43 175 49 -435 278 94 -114
2559 -114 -29 -263 18 292 23 44 393 -225 -156 173 -321 -163 146 -165 127 259 -296 -101 53 -97 28
2580 28 82 -253 197 194 -266 152 271 -284 95 115 -482 119 247 -180 -74 29 -576 243 325 -74 17 17 -89
2603 -89 568 -13 -310 269 -284 -337 216 117 -150 237 175 -135 367 -152 -285 224 -196 -311 333 -107 0
2624 0 213 -135 -162 527 -202 -234 355 -102 -8 364 -324 32 -124 -371 131 1 -253 -223 225 -140 387 292
2646 292 -111 82 -46 -107 253 335 -404 92 83 -401 407 245 -234 51 37 -111 137 363 -193 243 -197 -327
2668 -327 267 249 -189 332 -198 -313 563 -97 -255 161 -47 -305 149 64 -153 52 -172 45 683 -286 -112
$$ packed form
2518c21L00l30M72M02p40M68k10l77M49J06m49M19j55m87O64R7n44M04k37k49
2538c18O66j2l82J94O5o17Q48k78j58K75l23k87P14o52L08J32j26m84P13j84k08
2559a14Q5k34K81K74k69K1L49o18O9L29m94J58L09l11K92J32n55J95J54j50J25
2580B8N4l35M50lm60M18J19n55L79K0n97O01J28m27J06J03o05Q19Q2l99R1%j06
2603h9O57n81k97N79n53n3N53r9k67L87o2l10N02n19j33N09m20j15O44m40J07
2624@K13l48k7O89p29l2N89m57R4L72o88L56j56k47N02j30k54L0M48l65N27r5
2646B92m03J93j28o1L60Q2p39M96rm84Q08j62m79K85j4j48K48K26n56M36m40j30
2668c27N94j8m38N21n30j15Q76o60j58M16k08k58M54q5k17K05k24K17O38r69J74
$$ plain form
2689 -112 249 -328 41 364 -270 164 43 -254 9 463 -346 22 196 -418 286 580 -7 -8 102 -41 97
2710 97 337 -243 -332 -142 -194 270 106 -98 227 -53 -105 188 -50 -8 126 -193 -380 -23 14 -328 306 98
2732 98 -150 410 -48 -210 441 -155 -141 607 -240 -208 75 -272 -139 352 24 -109 402 -308 29 569 -405
2753 -405 -8 282 -352 -203 322 -312 104 118 -352 -62 312 -149 54 201 -500 217 -37 -45 101 125 -339
2774 -339 227 -60 -69 186 177 -209 202 -75 -416 89 -74 -312 371 202 -289 181 -113 -148 329 149 -57 413
2796 413 -315 -184 91 71 -436 88 25 -182 330 -28 99 470 -112 -16 335 20 13 372 -117 35 386 -97
2818 -97 -14 327 -15 61 463 -323 -218 212 -146 28 200 -459 84 44 -212 73 305 -172 219 139 -382 504
2840 504 226 -56 80 183 -118 313 54 -309 315 -116 -372 424 -106 -167 277 -154 -48 435 -336 -50
$$ packed form
2689a12L61n77L69L23o34M34j21k97K63M54q09L68J74o14P04K94n87jJ10j43J38
2710I7K40n80q9J90n2M64j64k04L25k80n2K93k38M2J34l19j87L57L7l42O34k08
2732I8k48N60m58j62O51n96J4P48q47L2K83l47J33M91l28j33N11p10L37N40r74
2753d05L97K90o34J49N25o34M16J4m70K90L74m61K03J47p01P17k54qJ46K4m64
2774c39N66k87rK55rl86M11k77l41N05j63k38O83j69m91M70k94l5M77j80k06M70
2796D13p28J31K75k0n07N24o3k07N12l58J27L71n82R6L51l15pL59m89J52L51m83
2818i7Q3L41l42P6M02p86J05M30l58J74J72o59N43m0k56K85K32m77L91q0n21Q86
2840E04k78k82J36J03l01M31k59l63O24m31k56P96n30o1M44m31J06M83p71K86
$$ plain form
2860 -50 -37 -329 -158 429 -133 -309 275 -216 -240 51 -120 -162 53 -229 -217 111 116 -363 231 -392 -45 163
2882 163 -281 54 263 -281 69 172 -300 -68 328 -553 60 293 -460 243 16 -310 -46 110 -273 471
2902 471 -4 -231 178 51 -519 252 -58 -277 311 -178 -118 298 -65 -152 301 -84 -229 266 7 -182 183
2923 183 -27 53 374 -131 26 293 -277 -135 166 -269 -196 30 -160 13 422 -415 -40 4 -297 105 71
2944 71 -133 159 370 -556 96 -32 -369 377 85 -307 341 -28 -324 248 -5 -234 164 114 -269 365 159
2965 159 -93 295 -27 -277 46 3 -149 423 -382 97 182 272 -384 219 -285 -314 159 -152 -191 37 -370 -105
2987 -105 404 -89 -36 269 -302 -49 453 -266 -33 305 -313 100 442 10 192 173 -168 -147 39 -90 145
3008 145 336 -388 487 108 -340 281 70 45 325 -40 -413 181 97 -459 292 -86 -140 164 -323 -189 254
$$ packed form
2860e0J3k92J71N87n62j76N84m91k4K91j71m2K15k82J2L28Nm79N94o23L47K08
2882A63m44L35K09n44L50J03m72K32L96q81O13K33p53P03k27l26K64J56l83P44
2902D71m75k27M09j27n70P71l10k19N88m89O0M16l63q7M53l85j45M95k59j89L65
2923A83k10Q0L21n05J57K67n70J42L01m35P3K26j90J73M09q37L75M4l01M02l4
2944G1k04K92K11r26O52j28l37P46k92l92O48l69k96N72k53k29L98n0l83O34k06
2965A59k52L88l22k50L23m3j52N72q05M79Q5R0o56O03n04k9M73l11l9K28m07K65
2987a05N09m93N3L05n71K53N02p19K33L38o18M13L42m32J82j9l41K1J86j29K35
3008A45J91p24Q75l79m48O21k11k5K80l65l73N94q4n56P51l78n4L04m87J34M43
$$ plain form
3029 254 165 -280 117 -69 -376 192 8 95 254 -220 -24 262 -24 -98 72 -90 -157 518 -336 -188 197
3050 197 -151 148 325 -64 -254 -36 -126 270 318 -241 -174 12 -385 -75 271 -229 36 150 -377 316 270
3071 270 -302 -123 129 -145 336 263 -311 432 3 -378 403 169 -216 152 -273 -190 460 -76 -261 164 223
3092 223 -96 206 -167 -217 260 -117 -306 238 -232 -203 357 -147 -97 189 -53 -166 275 -58 67 399 -158
3113 -158 -254 112 -234 161 331 133 57 -43 -647 267 116 -180 -138 -73 -304 134 303 -604 140 -19 -375
3134 -375 195 95 -342 47 154 -255 178 134 -377 105 170 -567 263 121 -268 268 -147 -46 151 80 -25
3155 -25 225 -17 -166 341 193 -153 383 -403 -163 71 -164 -125 20 -145 -52 148 69 79 463 -197 142 262
3177 262 -363 140 -20 -32 250 454 -538 66 187 64 160 40 -113 -2 213 -64 305 205 -495 -14 -326
$$ packed form
3029B54q9m45L97j86l07N68j84Q7J59m74J96K86k86p4J70j62o7O75q54J48L85
3050A97l48K99J77l89j90K18r0L96M8n59O7J86l97L10L46n00K65J14n27O93m6
3071B70n72J79K52k74M81p3n74P43m29l81P81k34l85L68m25Q3O50n36j85M25N9
3092B23l19L02l73n0M77l77j89N44m70K9N60n04N0K86k42j13M41l33J25L32n57
3113a58r6L66l46L95J70j98p6j00o04R14j51k96M2O5k31M38J69r07P44j59l56
3134c75N70j00m37L89J07m09M33m4n11M82O5p37Q30j42l89N36m15J01J97p1j05
3155b5K50k42j49N07j48l46N36p86K40K34k35L9J45j65R3K00p9J0L84o60L39J20
3177B62o25N03j60j2K82K04r92O04J21j23R6j20j53J11K15k77L69j00p00M81l12
$$ plain form
3198 -326 -481 164 143 -53 388 -123 -289 281 -192 -316 272 90 -90 587 43 -224 119 -49 -317 331
3218 331 -42 -392 129 52 -63 205 -71 -240 49 -146 -57 273 -109 -76 226 -258 94 286 -205 12 195
3239 195 -234 255 221 -376 213 -196 -86 177 289 -254 109 159 -284 273 129 -242 -22 -273 -154 434 220
3260 220 -372 -66 -171 -252 -2 52 -230 346 79 -420 215 273 -162 345 101 33 383 62 -33 390 -318 -317
3282 -317 383 30 -82 142 -94 -294 69 -228 38 273 -348 -209 230 68 -161 46 -166 277 33 -380
3302 -380 71 489 -183 159 214 -398 160 23 -452 -135 220 -169 236 1 -279 371 54 -186 246 -116
3322 -116 -50 141 -16 -237 15 -203 -198 132 -115 -229 81 -141 -210 206 -124 -327 -25 -90 -29 408 -74 -53
3344 -53 110 -41 154 207 -273 64 -17 -282 286 410 -173 20 222 -336 -7 204 -451 47 166 -167 236
$$ packed form
3198c26j55O45k1j96M41n11j66N70m73j24N88j82j80O77n44k67L43j68k68O48
3218C31l73l50N21p7j15K68k76j69K89j95Q9L30l82L3L02m84L52J92m91K17J83
3239A95m29M89l4n97N89m09J10K63J12n43L63N0m43N57j44l71K20k51J19N88k14
3260B20n92L06j05q1K50N4k82N76k67m99O35N8m35N07k44o8L50l21r5M23p08J
3282c17P00l53j12K24k36k00L63k97K66K35o21J39M39j62k29K07k12M43k44m13
3302c80M51M18o72L42N5o12N58j37m75L17L55l89M05k35k80O50l17k40M32l62
3322a16O6J91j57k21K52k18NL30k47j14L10k22o9M16l30k03L02o5O1M37m82K1
3344e3J63j51J95N3m80L37q1k65N68J24n83J93K02n58L29K11o55M98J19l33M03
$$ plain form
3365 236 390 -228 -77 -2 -202 446 412 -242 161 78 -217 197 96 -291 53 111 -267 102 219 -358 65
3386 65 -93 -346 222 -212 -77 172 10 -27 396 -135 -14 371 -292 -11 572 -26 -11 -181 -122 -225 188
3407 188 -70 -106 76 -212 155 515 -427 -174 78 -163 -101 313 -84 -173 99 -450 108 -12 -297 169 179
3428 179 -153 -6 -34 -310 514 100 -289 287 158 -262 438 11 -272 323 8 -110 135 -142 -76 200 -92
3449 -92 -339 134 48 -94 201 -253 -95 112 9 41 203 -293 -143 57 -99 -81 262 -59 53 112 -139 -107
3471 -107 406 -212 4 27 -168 133 262 -32 -44 220 -9 443 -62 4 -120 104 -224 74 57 -438 133
3492 133 -296 -252 95 67 -181 -236 -35 -340 248 230 -225 317 -42 -51 104 158 -210 245 169 -258 25 -105 -141
3515 -141 430 51 -14 56 -248 27 -334 -315 18 326 35 -9 189 2 99 206 -99 192 170 -21 -79 156
$$ packed form
3365B36J54o18J51P5k00O48l4o54M03q3k95M14j01l87L44N8l78L69J17n77M23
3386F5j58k53N68m34J35K49j62l7M23n31J21L85o63K81N83n98J5j70N9j03M13
3407A88k58l6J82k88L67L60r42K53K52k41O2M14l97q9K72n49N58j20k85M66J0
3428A79l32J47k8k76Q24m14l89N76j29m20P00m27k83N95l15j18K45k77O6K76k92
3449i2k47M73q6j42K95m54J58K07j03L2J62m96J50K00j56J8L43l21J12N9k51L2
3471a07N13o18K16K3j95L01J29k94j2K64k29M52n05O6j24K24l28K98j7m95N71
3492A33m29M4L47k8k48n5K01l05N88j8m55N42l59rJ55N4l68M55p6m27K83j30l6
3515a41N71l79o5P0l04K75l61J9L33L08k91m4J98j87R7J07l05K91k2j91n8K35
$$ plain form
3537 156 -201 63 195 68 30 269 -188 155 25 -142 294 67 -27 212 -36 25 126 440 -361 330 38
3558 38 -114 133 48 -259 331 143 -71 339 11 -181 244 -329 -300 274 31 -107 -134 -11 175 43 22 -274
3580 -274 -25 -318 -137 101 -104 -75 136 -225 2 10 -273 -12 -104 -227 20 -85 -91 -89 143 -97 308 274 -196
3603 -196 -20 211 -369 171 152 -159 -25 50 -130 97 -137 -467 -301 128 -115 -31 -33 -47 125 72 -315 2
3625 2 28 -362 -69 77 -44 -116 -158 -210 117 -248 -209 1 -115 -144 157 -216 121 275 24 178 254 -201 106
3648 106 -16 -228 126 64 -53 -201 124 -231 -34 147 -206 -18 139 -103 116 74 -63 364 122 -203 9
3669 9 182 -49 317 -68 -72 96 -51 -186 104 -234 -192 134 9 -40 94 -106 -239 -92 -54 -175 201 -56
3691 -56 -375 321 -372 -143 307 219 30 255 -98 39 16 -123 68 109 35 19 -185 -226 -2 561 23 -147
$$ packed form
3537A56l57K64J32j27l8K39m57L43j30j67M36k27r4K39k48O1J01L14q01O91k92
3558C8j52K47q5l07N90j88k14M10l28j92M25n73K9N74k43j38k7J23J86j32k1k96
3580b74K49k93J81K38k05K9K11l61K27Qk83K61r2j23K47j05oKK32k40M05l4m70
3603a96J76K31n80N40j9l11J34P5j80K27k34l30J66M29k43Q4kj4J72n3l87L17
3625BK6l90K93J46j21p2m2n2L27l65L9K10j16k9L01l73L37J54k51J54P6m55L07
3648A06j22k12L54o2j17j48L25l55J97J81l53J88J57k42K19m2j37M27k42l25K12
3669IJ73k31L66l85mJ68j47j35K90l38M2L26j25m9J34k00j33J47L8j21L76k57
3691e6l19O96o93K29M50q8j89K25l53J37k3j39J91M1p4j6k04m1K24N63n38j70
$$ plain form
3713 -147 135 -133 -178 12 -283 128 81 -48 -53 -39 6 -129 -108 -219 -14 24 -145 108 -93 -28 152 -13 147
3736 147 194 52 -153 121 -5 -69 -10 71 -221 -148 94 91 418 65 -186 173 -218 67 162 203 -189 215 85
3759 85 -128 197 -391 -150 -9 -42 -114 284 -140 -96 -13 -216 -41 325 -65 108 137 83 122 225 -217 57 193
3782 193 -118 30 187 -165 352 92 -143 101 196 -221 -101 171 102 -58 -298 -272 -11 -21 -176 254 -94
3803 -94 -23 366 -8 -329 286 2 -100 248 -56 104 247 -219 -36 54 -308 -179 69 30 -11 -14 -331 17
3825 17 301 -64 -191 303 -168 -164 123 -280 -47 202 -319 -14 345 -109 40 59 -74 -113 162 -389 -36 243
3847 243 19 262 67 18 274 -39 -162 -135 20 14 355 132 -75 322 40 -36 -252 -83 -181 270 -83 -159
3869 -159 -49 105 184 -46 227 -55 68 -33 417 322 -189 171 159 120 50 93 -272 -12 422 -140 212 -33
$$ packed form
3713a47K82k68m5J90k95M11m7j29nJ4M5j35K1j11K05L8j69K53k01O5J80j65J60
3736A47M7j42k05K74j26o4N9Q1k92P3K42lL27l53k51L59l91K85R5M1l92M04j30
3759H5k13L25n88K41J41l3p2L98m24M4Q3k03J75L66l90J73K9n4L9J03m42K74J36
3782A93l11J48J57l52N17k60k35K44R5m17J20K72o9j60k40K6K61j0j55M30l48
3803i4P1L89l74l21O15k84j02L48l04J60J43m66J83R0l62J29K48l9m1ll17L48
3825A7K84l65j27M94m71MK87m03K33K49n21L05L59m54J49J9j33l9K75n51L53K79
3847B43k24K43j95m9K56l13j23K7J55oL41k23k07L97k82p6k16J69r8M51l53p6
3869a59J10J54P9k30K73k82J23j01M50r5n11L60j2l9p0M3l65K60M34n62L52k45
$$ plain form
3891 -33 -159 -171 136 32 16 66 -89 -87 207 -3 -54 -220 -180 12 169 -241 256 145 -72 15 246 346 118
3914 118 187 2 25 108 -149 139 150 -244 212 -9 -283 -80 72 -105 154 221 -119 304 -39 -168 -111 141
3936 141 -200 46 129 -125 91 169 -50 259 -207 43 559 -52 11 -50 -330 266 -47 -73 214 135 -25 -115
3958 -115 218 120 -99 -95 -399 18 -75 66 -114 -85 -25 -95 -194 -70 156 -108 -110 -161 107 -147 -24 149 -297 120
3982 120 -79 -109 246 -62 -62 167 -119 -163 -16 -38 -507 109 82 -335 304 92 28 -149 31 114 12 223 -169
4005 -169 -189 -94 -173 146 14 -53 193 31 -13 148 -76 -244 305 -76 177 66 -154 -79 -54 -47 -2 -2 -82 -125 145
4030 145 66 101 93 -115 0 -102 21 -95 -212 -68 -79 -37 87 57 -103 -165 364 51 43 178 -129 152 126 236
4054 236 9 -21 -263 -17 264 42 47 159 -98 59 -59 -172 123 -175 191 96 131 -35 106 296 -52 64
$$ packed form
3891c3j26j2L07j04j6N0j55KK94k10n1j66M0J92J57m10M97j11k17Q7K31J00k28
3914A18O9j85K3Q3k57K88J1l94M56k21k74K03J52j77K59O7l40M23l43j29N7K52
3936A41l41K46Q3k54K16P8k19L09m66K50N16o11O3o1k80N96l13k6K87p9j60r0
3958a15L33r8k19Ml04M17r3J41j80K9O0p0r9J24K26k64kn1K68k54J23J73m46M17
3982A20j99l0L55l08%K29k86m4J47k2m69O16k7m17O39k12o4j77J80Q3j02K11l92
4005a69k0R5p9L19j32o7K46j62m4J61k24j68N49l81K53j11k20P5K5PM5%q0m3K70
4030A45p9L5qk08J15j02J23j16j17J44j1M2J24l0j60o2N29l13qJ35l07K81k6J10
4054B36k27l0k42K46K81k22NJ12k57J57j18j13K95k98L66r5L5j66J41J90l48J16
$$ plain form
4076 64 -42 28 216 69 -97 74 108 109 280 123 77 -92 -59 231 -22 -91 -154 141 26 54 247 296 135 142
4100 142 326 -306 -73 -52 227 69 11 -114 57 42 81 94 7 -69 87 63 -27 87 106 -183 386 -135 -108 118
4124 118 -48 136 -78 -72 153 190 125 89 -39 52 -157 311 -59 160 97 -96 267 -122 -142 280 203 44 -6
4147 -6 269 -113 178 -100 100 115 -21 -375 60 199 -377 301 -96 -252 108 -19 4 -211 78 -194 222
4168 222 307 -251 389 -201 96 57 129 -77 166 -89 -116 118 -36 -198 -10 -133 -279 -100 103 -259 -42
4189 -42 -99 104 149 4 -109 -8 16 89 -50 184 29 87 -270 -24 370 -75 -5 42 -10 293 -84 -192 113
4212 113 102 -40 -41 81 -137 -123 100 -170 19 -58 -8 -118 189 -189 141 161 -212 117 68 195 187 -42 18 134
4236 134 -11 -352 146 28 40 299 -165 -180 249 14 -229 333 -119 -91 57 -21 -186 68 20 -138 197 -170
$$ packed form
4076F4j06P0J88j47j66J71L4JJ71j57m6j69L3K90k53o9o3K95j15K8J93M9j61P
4100A42J84o32K33K1K79j58n8j25J71j5L9J3q7p6J56k4r0J14J9k89N69n21K7K26
4124A18j66J84k14OK25L7o5l6j28R1k09M68l70K19o3j93L63l89k0M22p7j59n0
4147fK75l82K91k78K00J5j36l54M35J39n76O78l97j56L60j27K3k15K89k72M16
4168B22Q5n58O40n90K97l9P2k06K43k55k7K34j54j62J88j23j46J79K03l62K17
4189d2n7K03M5j45j13J01K4P3j39K34j55N8l57K46L94m45P0M7n2L03l77j08L05
4212A13j1j42jJ22k18J4K23k70J89p7N0j10L07l78L30K0l73L29m9J27qk29O0J16
4236A34j45l41M98j18J2K59m64j5M29k35k43N62m52K8J48p8j65K54m8j58L35l67
$$ plain form
4258 -170 -190 -13 -256 181 -1 208 12 66 200 113 170 -145 24 212 -167 -42 298 62 172 265 -246 66
4280 66 -31 -156 175 19 -215 137 -16 -114 48 229 -109 -4 -80 -358 102 -108 -10 -68 -111 -161 154 80 90
4303 90 198 -143 -37 -106 87 -195 176 232 44 134 152 -21 221 -103 -16 221 -94 -63 211 -8 181 188 -116
4326 -116 22 31 -288 266 120 -59 198 -134 -163 23 39 -86 396 127 -82 -47 76 -63 -37 133 -353 -53
4348 -53 -258 -103 -10 40 20 -127 -141 -98 121 50 -161 -83 -151 -62 267 -248 31 69 65 -26 14 -128 -27 -166 7
4373 7 69 314 18 17 200 70 -74 48 -386 -128 -19 -12 -171 132 -265 146 306 -52 -120 -208 -185 -119 -14 -78
4397 -78 3 2 39 -38 186 -278 338 -99 -254 398 282 108 -38 126 -9 371 15 -72 4 115 -62 -272 150
4420 150 69 103 -48 -121 -25 76 56 220 30 108 10 41 -214 -48 -10 -50 91 50 -116 346 -147 78 173 -285
$$ packed form
4258a70k0J77k43M37j82K09j96N4J34q7N7l15J69J88l79J25L40k36J10R3n11L12
4280F6r7j25L31j56k34L52j53r8J62J81l38J05p6k78M60k10R8n8m3n0L15p4J0
4303I0J08l41J06o9J93k82L71N6j88R0J8j73K42l24Q7K37l15L1K74k19J89Pl04
4326a16J38Rl19N54j46j79K57l32k9J86J6j25M82k69k09L5J23j39K6J70m86L00
4348e3k05J55R3N0k0j47j4M3K19p1k11P8o8Q9L29n15K79L8mr1M0j42J01j39J73
4373GO2K45k96jJ83j30j44J22m34K58J09Pj59L03l97M11J60l58o8q8K3O6J05o4
4397g8Q1jL7p7K24m64O16m37j55O52j16j74j46J64j35L80l56q7P6J11j77k10M22
4420A50q1L4j51p3R6J01k0J64j90P8r8L1k55J66L8m0J41m1j66M62m93K25R5m58
$$ plain form
4444 -285 24 88 85 -148 35 110 185 -64 -44 231 125 -64 -117 38 -17 236 -123 126 181 97 -55 98 -71
4467 -71 -43 96 -216 -227 12 -184 -153 88 44 -204 64 -80 -36 366 -43 179 346 -150 220 98 -126 2
4489 2 300 -157 259 -140 22 -146 157 -162 -128 166 -110 -261 193 97 58 113 -119 6 187 37 52 -94
4511 -94 169 305 53 -59 47 88 -262 83 -159 -75 476 218 -106 59 19 -54 121 60 -76 -89 184 -161
4533 -161 267 29 -134 -201 -130 65 -35 -84 -71 45 -54 34 275 22 -203 28 -134 62 271 -70 -131 240
4555 240 -175 -89 21 123 67 187 -163 34 -25 -237 -60 228 137 -153 -47 11 12 182 114 183 13 -53 -56 53
4579 53 -248 -134 -181 103 -70 138 -162 -280 69 7 76 -187 18 -148 -36 20 -50 -88 222 124 50 -92 131
4602 131 72 -7 52 0 -197 -278 91 -77 -92 -97 -145 -68 -38 93 -73 184 -272 -83 30 230 26 -105 -162 280
$$ packed form
4444b85L09O4lk33J83P5P5k49K0K75j06j89n3J55n5K53l59K49N5q4j52J53j69
4467g1K8J39l12j1K39j96L1K41m4k48K68j44M4M02m09K22J67m96L70j22k24J28
4489BK98m57M16l99J62j68L03l19L4K94k76j51M54r6l9N5k32J25J81j50J5j46
4511i4K63J36k52j12J06M1l50L45k42Q4N51k58l24J65m0p3J75o1j36j3K73l45
4533a61M28k38j63o7P1J95j00m9J3J16r9Q8K41k53k25K31j62J96K09l41o1L71
4555B40m15Q6J10J02n6J20l50J97n9k12J77K88r1k90J06N8JJ70o8O9j70o6lJ09
4579E3l01J14m7K84j73K08l00j18L49o2O9k63K05j66J12N6p0l8L10r8p4j42K23
4602A31n9p9N9n2j97q1L69j68j5nm8P7L0J31j66K57m56J89J13K00k04j31n7M42
$$ plain form
4626 280 -238 109 15 -251 123 -3 -164 -73 54 -268 -20 129 92 85 71 121 -4 -213 -218 17 97 86 178 -185
4650 -185 -240 266 -187 -62 156 34 48 304 -44 -41 -131 -78 -37 116 -178 -225 114 196 -89 -6 -105 -12 -208 54
4674 54 161 266 -51 -113 213 -59 -1 174 -12 33 138 -32 107 30 145 152 -57 -47 -240 12 -21 -109 347
4697 347 -171 248 117 -166 259 40 -71 -42 25 -208 2 -240 -257 -40 175 -213 -62 -58 -139 -66 171 -16
4719 -16 138 -142 150 120 -14 -235 -233 15 11 110 194 -9 -47 140 186 -28 64 -244 324 -151 -220 186 108 16 -137
4744 -137 19 59 -120 102 -94 134 145 62 105 -345 245 -81 -223 48 104 -114 -162 -112 -93 5 14 -53 -120 -214 27
4769 27 278 -3 -79 -27 -57 -74 338 145 -294 -22 76 -41 149 5 62 153 -208 -79 93 15 222 -373 -8
4792 -8 -13 82 -209 -164 60 -57 41 322 -102 -326 -61 112 48 110 -93 -161 -12 -383 202 147 -408 -94 99 -81
$$ packed form
4626B80n18L47r4k66L74j26j61R1J27l22K48J49l7pj4N0j25k09nK35Q0j1R2l63
4650a85n5N06m53J25K18j22J4K56l48Lr0N3M1J53k94m7L39Q2k85Q3r9R3j96K62
4674E4J07J05l17o2L26k72N8J75j86M5J05j70J39p7J15Pk09J0j93K52l3q8M56
4697C47n18M19j31k83M25k19j11K9O7k33K10k42j7K17K15l88J51Mq1P3K37j87
4719a6J54k80K92l0j34k21KK48mR9Q4k03l8J87M6k14R2l08N68m75o9M06p8r2j53
4744a37J56M0j79K22j96K28J1q3M3m50N90l26j42K71N6k18m8N0J9R8Ro7o7r4K41
4769B7K51k81p6N2l0j7M12j93m39K72R8j17J90j44N7R1l61J29J72p8K07n95L65
4792hnR5k91M5K24j17R8K81m24k24K65J73o4O2k03o8J49l71N85n5n55L14J93j80
$$ plain form
4816 -81 10 -37 -135 -191 53 69 354 -104 -270 80 160 -73 46 -88 -308 292 -17 -132 164 5 -268 176
4838 176 12 140 225 -77 114 47 -149 -219 289 -56 -340 164 229 -131 -12 -46 -158 106 -300 127 152 -264
4860 -264 -57 -56 65 -23 -21 -111 167 70 108 -33 -47 205 261 69 -123 -67 52 -224 -125 104 -23 -127 194 -249
4884 -249 274 -106 -123 -150 -241 -111 192 28 -167 70 24 90 448 -37 67 116 -137 -106 -6 -52 152 -50 -116
4907 -116 43 -132 -16 -282 201 8 -8 17 -37 -111 110 231 77 178 -38 43 17 6 225 228 87 -6 28 197
4931 197 108 -7 88 33 -46 20 123 2 258 -16 106 -76 89 -28 -115 -10 -38 189 212 -80 -158 100 -251
4954 -251 -63 -142 18 -11 -54 -81 -43 292 -144 44 223 188 109 97 29 245 -26 -320 -16 125 89 -8 145 -65
4978 -65 255 61 -480 142 -57 -230 228 35 148 59 -98 9 161 -56 -159 234 137 30 250 253 -129 155
$$ packed form
4816h1R1m7r8n6K44J6K85m58j66L50Q0k33J19j34k20O00l09j15K96j59k73M44
4838A76j64J28Q5l02J91o7j96p0N08l45k84N04O5l60J19l4j12K64m06M27K5m16
4860b64K07JJ21q8Kr0K78r7L8j41j4K52N6j92j92N6J19k76R9K29j27j04L21m43
4884b49N23l80j7k7r1J30L03j64j95K37m6O6L58m85J04M9k53L1J00m6K04k02o6
4907a16J59j75J16k66M83j93j6K5n4p4K21J21j54J01k16Q1k6j1K19Lj41r3L4J69
4931A97q9j15R5n5p9O6J03j21K56k74J22j82J65j17q7J05k8K27K3k92p8K58l51
4954b51J88p9J60k9m3k7L8L35m36J88J79l5p9j2o8K16k71k94L04J41l6r7J53k10
4978f5L20j94n41O22j99j73M58j93J13q9j57J07J52k17j03L93r7j07K20Ll82K84
$$ plain form
5000 155 -132 -141 -152 80 -137 118 -98 -291 383 -126 13 -76 36 -132 49 240 12 203 16 -160 100
5021 100 41 33 186 -33 -111 14 -146 -34 -16 -80 139 -47 -63 -96 353 -105 -70 70 237 133 58 -145 152
5044 152 195 -50 -35 -37 0 -69 24 293 269 134 -170 -26 -43 19 -33 132 -20 -49 -396 -260 345 -22 -11 207
5068 207 -29 104 -198 -70 -76 26 64 66 65 -127 34 70 -182 -131 76 -168 -120 393 -4 237 134 -115 238
5091 238 253 140 -98 62 -5 213 303 12 9 125 56 159 42 10 290 259 -45 -250 45 0 -233 -55 -119
5114 -119 164 -117 -112 93 -216 -177 -25 9 -179 -221 -367 -472 90 -128 20 246 279 46 127 224 87 2 -85
5137 -85 -145 81 106 -116 35 47 160 -83 38 -174 2 -246 76 -115 148 -270 162 -71 -3 116 -13 355
5159 355 -19 -85 18 349 96 -44 -32 48 118 166 31 4 -176 -153 357 133 -58 -93 122 -335 157 79 56
$$ packed form
5000A55k87rj1K32k17K55k16j93O74n09J39q9J12j68J81J91k28J91j87j76K60
5021A00n9qJ53k19p8J25j60J12J8o4K19j86j6l3M49m58L5J40J67j04p5k03K97
5044A52M3k45J5kL7o9R3K69k4j35l04J44j7O2n2J65j52k9l47J36O05l67J1K18
5068B07k36J33l02J28oJ02L8Kjj92J61L6k52N1K07k44M8N13l97K41j03k49L53
5091B38J5j13k38J60o7K18R0k91lJ16o9J03j17l2K80l1l04k05K95m5k33J78o4
5114a19K83k81NK05l09L9J52L4j88m2j46j05N62k18J48K26L3k33Q1R7j37q5q7
5137h5o0K26K5k22J51J2J13k43J21k12J76k48L22j91K63m18M32k33O8J19j29L68
5159C55l74o6J03L31k53j40J2Q0P0M8j35k7j80K3N10k24j91l5K15m57M92p8k3
$$ plain form
5182 56 -74 269 15 -96 148 -262 -62 53 14 258 -36 17 246 -26 -218 -29 -47 233 111 -163 -75 37
5204 37 -127 -105 213 2 -210 93 -127 55 -112 185 254 116 -166 59 63 -300 -40 268 -144 -207 1 -96
5226 -96 64 15 -13 105 233 -69 -23 -7 -127 70 161 -331 59 133 -50 72 129 -231 -186 -227 -80 100 -7
5249 -7 -96 -16 59 2 35 -43 -2 -6 -200 197 144 61 -136 18 -52 -326 48 59 -231 219 -16 299 111 -190 65
5274 65 -115 -99 -108 1 -178 44 216 -227 -130 -21 -99 2 -44 86 -1 193 -68 154 -175 -184 -62 111 -204
5297 -204 155 -44 -299 180 -39 -240 -1 141 -146 187 192 -139 26 -64 -31 -18 128 -5 52 146 -78 -4 98
5320 98 -178 -124 6 -121 -142 -18 -40 -102 20 -160 53 -105 71 -159 149 -108 -95 69 141 -38 -78 51 -96
5343 -96 88 -76 -29 142 -2 335 58 183 -44 -381 167 9 -135 -102 -23 -46 77 112 -235 201 -161 311
$$ packed form
5182E6j30L43k54j11K44m10K00J15l9K44k94N3K29k72j92J89j8K80j22k74Q8J12
5204C7j64K2L18k11k12L03k20J82j67K97O9j38k82K25Ml63K60L08m12o3K08r7
5226i6J60m9k8J18J28l02M6J6j20J97R1m92L90P4j83J22N7l60M5m1J47J80j07
5249gq9Q0P5n7L3p8M1mj94L97n3q3j97J54p0k74L74J1k90M50k35L15j88l01K55
5274F5j80J6rJ09j79K22J72m43R7J09p8J01m6J30q7J94k61K22l29rJ22J73l15
5297b04L59j99k55M79k19k01K39J42k87L33Nl31J65r0L3J3J46j33N7R4k24P4J02
5320I8k76N4J30j27k1J24k2o2J22j80K13j58J76k30L08k57J3J64P2j79m0J29j47
5343i6J84j64M7J71j44L37k77J25k27l37N48j58j44L3P9k3J23L5l47M36l62M72
$$ plain form
5365 311 272 -41 11 -10 11 -47 38 -233 -111 -171 -57 225 -54 170 -108 194 -28 180 230 -302 101 269 -235
5388 -235 -202 23 -236 120 87 284 65 139 140 175 118 77 -57 124 -108 251 -143 -163 -60 -33 -295 -11 69 27
5412 27 50 -233 -132 -8 64 -12 296 366 -65 135 187 -338 134 61 32 40 -68 201 -300 -70 -48 72 169 258
5436 258 107 -20 -139 261 -147 -393 9 164 182 94 111 -93 -129 -59 -142 -92 -107 18 229 -101 -158 -85 -61 234
5460 234 186 -136 4 -133 87 322 228 -5 224 49 -58 29 -245 -232 95 309 -229 40 -169 -26 -104 -193
5482 -193 -369 155 158 131 -107 293 -52 75 -30 160 305 143 18 -119 -81 -70 -113 -75 -91 374 -20 -130 -27
5505 -27 355 -138 152 -94 202 86 -103 163 -2 -317 176 181 121 -78 -91 50 86 23 -73 -67 55 -109 58
5528 58 -77 -131 108 30 42 -5 442 -116 68 54 54 253 -113 -3 267 357 -74 56 -151 -36 297 115 -6
$$ packed form
5365C11l9l13N2k1K1n8Q5k71J22o0J14K82k79K24k78L02k22K08N0n32M03J68n04
5388b35L3K25k59L56l3J97k19P4JL5n7m1j34J81k32L59l94k0J03K7k62K84Q0m2
5412B7K3k83J01J24P2p6L08P0m31K00N2n25M72p3k9Qj08K69n01K30K2J20R7Q9
5436B58j51j27j19M00m08k46M02J55J8q8J7k04l6P0q3N0j5J25K11l30n7P3K4K95
5460B34m8l22J40j37K20K35r4k33K29j75j07Q7k74J3L27K14n38K69k09J43p8q9
5482a93j76N24Lk7k38M00l45J27j05J90J45j62j25j37L8J1m3L8j6M65l94j10J03
5505b7L82m93K90k46K96j16j89K66j65l15M93No0j99j3J41L6o3r6OJ22j64J67
5528E8j35n4K39p8J2m7M47n58J84j4%J99l66J10K70R0m31J30k07J15L33j82j21
$$ plain form
5551 -6 -111 199 90 187 -105 311 68 -99 16 -29 -2 -154 104 -63 59 364 -316 -147 -71 -75 -60 -48 -99 127
5575 127 111 20 151 155 -10 -179 -15 -108 -29 347 -173 -172 399 -172 62 165 -243 -102 -45 329 162 -127 75
5598 75 171 -119 -139 114 -18 -81 56 17 114 176 -74 146 11 39 -305 145 -246 -172 -156 -9 -169 24 225
5621 225 -344 138 -29 -65 32 216 51 130 254 -40 347 -19 135 -70 -7 250 -146 -267 -98 42 95 -9
5643 -9 170 -18 139 70 242 -222 56 133 -251 46 -55 -22 -161 -191 -325 -122 17 234 412 -116 -94 -13 16
5666 16 351 47 -112 -90 -48 61 339 -24 -356 33 -398 -195 120 55 311 -330 -70 35 35 -205 -59 -37
5688 -37 93 40 427 319 50 21 -20 235 133 145 -12 125 -56 51 69 -270 -113 108 -50 69 -203 -34
5710 -34 19 17 -317 -65 -240 -29 -5 59 -142 153 -41 64 54 113 -7 -85 -58 -34 145 269 -129 -355 153 9
$$ packed form
5551fj05L10j09R7k92M16k43j67J15m5K7j52K58j67J22L05o80J69P6mJ5J2n1K26
5575A27j6r1J31Mj65j69J64r3P9L76n20JN71n71K34J03m08J41N7L74j67k89K02
5598G5R6k90k0K53j32o3J37l9R7O2k50K20j35K8l44M50l91P4J6J47j60J93K01
5621B25n69M82j67l6R7J84j65P9J24k94L87l66J54k05O3K57l96j21J69J40N3j04
5643iJ79j88J57o9J72m64K78P7l84K97j01L3j39l0j34K03J39K17J78n28K2Q1K9
5666A6L35l04j59K2M2J09K78l63l32L89m31K03L15o5K56o41K60J05%k40J46K2
5688c7J30n3L87j08k69k9m1K55j02J2j57J37j81J07J8l39J57K21j58J19k72J69
5710c4N3kl34K52j75K11K4O4k01K95j94J05j0N9j20p8K7K4J79J24l98k26N08j44
$$ plain form
5734 9 -162 -15 20 -125 159 351 265 59 -211 174 -285 118 75 -80 -294 -238 -3 107 22 -271 -42 334
5756 334 -203 -272 46 41 96 -34 139 -49 -38 23 -87 60 -94 165 146 -83 -43 76 -224 -308 230 -40 -22
5779 -22 73 -160 -30 148 -90 84 -269 125 -182 -74 140 -44 -196 -349 -111 -153 -152 144 -117 -39 -14 67 -116
5802 -116 -98 117 -246 143 -80 -232 -170 -30 211 84 263 -5 -37 54 178 -57 -156 53 250 204 -32 67
5824 67 -181 197 -25 -26 -106 -116 -63 156 39 85 41 -357 -48 134 110 -60 100 149 69 -106 28 -47 208 -97
5848 -97 -87 216 -98 -52 103 28 79 -27 290 -25 -68 -154 28 168 -121 -123 -27 -45 63 136 -205 -436 -135 -47
5872 -47 10 53 142 -98 165 -63 117 201 -98 12 -51 12 -77 223 -235 -60 -357 154 -30 80 135 -84 -23
5895 -23 -7 -137 101 43 89 51 112 229 -86 96 48 -83 -39 99 143 163 135 -87 101 -98 -48 -23 -153 149
$$ packed form
5734Ij71J47L5j45K84J92q6k06k70L85m59M03m3j55k14N6K35J10q5k93K29L76
5756C34n37o9L18nN5j30J73j88J1O1j10J47j54K59j9k29M0J19l00q4N38k70J8
5779b2R5k33J30J78k38J74l53L94l07J08K14j84j52j53K38m2JK96k61P8K5Q1j83
5802a16J8K15l63L89k23j52O2J40K41j27J79k68l2R1J24k35r9K09J97m6k36R9
5824F7k48L78k22jq0j0N3K19j17M6m4l98L09J82k4j70J60M9q0j75J34p5K55l05
5848i7J0L03l14M6J55p5N1j06L17l15m3q6J82J40k89kR6j8J08P3l41k31L01Q8
5872d7N7M3Q9k40K63k28J80Q4k99J10o3O3q9L00m58J75k97N11j84J10N5k19O1
5895b3J6j30K38n8M6l8O1J17l15J82m8j31M4J38M4K0k8k22J88j99N0K5j30L02
$$ plain form
5919 149 -187 -3 65 -109 43 244 -61 -83 153 37 239 120 -130 310 -168 183 113 63 34 -165 -42 -112
5941 -112 70 -120 90 118 -163 5 -143 -142 87 30 53 -40 93 226 -153 25 -191 -122 36 246 -71 -94 259
5964 259 134 54 24 194 276 -137 150 367 -137 241 126 43 303 55 5 -35 92 188 227 -60 17 168 -113
5987 -113 -92 -42 -365 178 -17 -175 -228 10 -77 -150 12 -68 16 109 173 115 37 144 -74 -118 114 48 57 -370 -3
6012 -3 90 -87 -34 241 97 -48 153 -186 67 233 -27 -158 293 4 62 -13 -139 28 41 5 -34 112 -110
6035 -110 108 25 -53 252 139 -60 -87 -60 -70 -39 57 217 158 -177 68 -22 135 -170 -277 59 -130 118 156
6058 156 -23 -88 23 43 45 77 33 101 -57 197 12 -143 40 -82 -62 -92 -65 -171 85 -22 104 -353 34
6081 34 -78 45 2 -16 164 156 108 262 52 98 -151 119 -17 54 253 -160 268 111 25 -3 -144 -137 160 -40
$$ packed form
5919A49l36J84O8j74J52K01l05k2K36j16K02j19k50M40m78L51p0n0k9j99J23p0
5941a12J82j90K10K8k81J68j48JK29n7K3r3J33J33l79J78k16O9J58K10l17k3L53
5964B59j25q0l0J70Q2m13K87K17n04L78j15q3K60k48n0m0J27R6L9k87P7J51k81
5987a13K1N0l23N43j95j58n3K38q7p3J62q0Q4R3O4n8p8J07k18m4K32o6Rm27L67
6012cR3j77N3K75j44j45K01l39K53J66k60j31M51k89N8p5j26J67J3l6l9J46k22
6035a10K18q3p8L05j13j99k7K7j0L1R6J60n9l35K45r0J57l05j07L36j89K48L8
6058A56j79o5J11K0KL2m4O8j58K54j85j55J83j22K0l0K7j06K56j07J26m57L87
6081C4j12J23m3j8J80qm8J54k10M6k49K70j36P1J99m13M28j57q6k8j41PK97k00
$$ plain form
6105 -40 155 117 23 13 -111 -12 -202 -95 -74 74 216 -49 177 140 58 103 81 288 53 -45 187 -121 -103 89
6129 89 -181 -108 -218 238 286 -34 -47 41 12 -111 -132 -136 126 9 -217 -28 2 212 -153 -150 -16 -47 174 -63
6153 -63 -34 270 86 -44 28 -144 213 279 146 -41 20 -37 110 108 -178 267 -79 66 195 47 -259 110 0
6176 0 -147 -46 179 15 129 63 9 98 -341 -178 19 -99 106 -109 118 290 189 -35 34 -196 44 254
6198 254 237 -148 268 42 169 90 94 -197 -229 502 6 -182 -104 -77 131 -178 10 -211 45 -108 114 158 -76
6221 -76 32 114 98 181 -162 -313 -4 -121 54 -169 69 83 -31 -124 34 155 85 -188 -153 13 -22 -179 -161
6244 -161 -170 9 -133 -146 241 -252 -380 161 -29 56 11 53 -32 65 160 -207 -39 284 295 -146 -27 -108 -152 -272
6268 -272 143 -51 230 258 278 -128 303 -61 -2 34 -60 79 -5 93 -287 -128 -113 2 53 166 57 -39 47 101
$$ packed form
6105d0J95l8r4j0j24R9j90J07K1J48J42k65K26l7q2M5k2K07k35r8K32l08J8J92
6129H9k70P3j10M56M8l20j3Q8k9j23k1mK62j17k26J89L0K10l65LJ34l1K21k37
6153f3K9L04j84j30P2j72L57O6j33j87O1n7J47kk86M45l46J45J29j48l06L69j10
6176@j47J01K25j64J14o6n4Q9m39J63J97j18K05k15K27J72j01k24O9k30K40K10
6198B54j7l85M16k26J27p9Mk91l2P31m96j88P8K7K08l09J88k21K56j53K22M4k34
6221g6J08Q2j6Q3l43j51L09j17J75k23K38J4j14r3J58J21p0k73L5J66l5j57J8
6244a61rJ79j42j3L87m93j28N41j90Q5m5M2q5R7R5l67J68L23J1m41J19q1m4j20
6268b72M15j94K81K8K0m06M31l64N9L6r4J39q4R8l80J59J5J15N1J13j09r6Q6N4
$$ plain form
6292 101 74 -193 51 128 -46 57 51 18 -55 -152 74 -189 -9 -6 -297 62 63 99 -206 -143 43 -18 -175 116 -122
6317 -122 -97 206 327 -219 -147 -10 -73 -65 316 274 -180 114 -154 62 41 -68 9 -12 -174 -91 34 -125 33
6340 33 -70 -139 160 246 98 164 -171 -314 167 176 166 292 -288 3 52 -117 -49 -251 71 86 -24 -41 127 68
6364 68 -70 76 42 -181 -67 15 -136 -82 112 -75 199 308 -16 12 118 -29 137 147 -144 9 -101 -39
6386 -39 5 -39 61 377 -75 81 247 68 -211 -184 120 -344 -43 347 -218 197 -185 -291 236 -65 -123 -185
6408 -185 -37 11 241 -185 -125 89 -160 -192 119 -93 -207 154 180 -21 285 -156 25 133 170 55 -129 -76
6430 -76 -265 112 -128 -63 -13 1 171 190 184 180 94 285 281 167 -211 73 -75 -152 74 -214 169 99 -113 61 73
6455 73 41 -56 147 79 -149 -118 268 -97 -8 -114 -216 -40 -224 -105 19 62 29 -72 -25 20 -40 23 194 224
$$ packed form
6292A01k7k67K44P7j74J03ol3p3r7K26k63J80Lk91L59JL6l05O3J86o1j57K91k38
6317a22K5L03J21n46P2J37o3QL81m2m54K94k68K16k1j09P7k1j62Q3J25j59J58
6340C3j03o9K99Q6j48O6l35j43M81Rj0J26n80K91M9j69O8k02L22J5j10j7J68n9
6364F8j38J46l4k23J14Q2j51N4J94j87K74J09l24K8J06j47J66J0k91J53j10O2
6386c9M4m4J00L16m52J56J66j79k79K7L04m64L01L90n65M15l82j06N27l01n8o2
6408a85J48M8K30m26O0K14k49l2L11k12j14L61K6k01L06m41J81J08L7j15j84N3
6430g6j89L77k40O5N0J4J70J9omq6J91mj14l78K84j48p7K26k88L83p0k12J74J2
6455G3l2r7K03o8k28L1L86l65Q9j06j02J76j84J19J24M3l3j01M7M5o0O3J71L0
$$ plain form
6479 224 -166 28 90 -48 -104 -22 9 191 138 -126 -139 -69 1 32 -38 -92 -38 -108 -86 56 28 -304 88 245 12
6504 12 -103 56 -110 173 15 -44 66 244 30 144 99 -19 193 -424 82 286 3 -234 59 -111 -22
6525 -22 343 87 122 59 -338 108 101 67 69 -65 -25 93 158 -237 169 328 -154 264 310 -37 -179 -143 -28 -26 -154
6550 -154 -165 112 -50 215 -76 165 73 206 61 -13 99 206 -130 -55 198 -101 -116 48 -40 -109 190 -302
6572 -302 72 -63 22 228 166 -89 -211 -24 -12 18 -182 -123 39 20 -96 111 -82 41 29 168 -122 -58 192
6595 192 80 -28 167 114 65 -274 -118 -105 -18 -32 139 59 -3 168 -166 201 118 62 -161 89 109 -150 40
6618 40 83 53 39 111 295 194 -212 19 -33 21 207 166 123 -22 -116 -230 436 71 -178 192 20 229 -120
6641 -120 77 -48 -184 184 -120 -144 41 -31 93 98 145 127 -26 -10 -121 40 76 -38 -61 67 210 -100 -279
$$ packed form
6479B24l90J94O2j38n6Q2L1J82n3k64j3P0P0L1p0n4N4p0K2J42k8l32L92J57k33
6504A2j15J59j66K83j58n9J10J78k14J14m5j18K12o17N06K04k83k37K93j70Q9
6525b2L65k56L5o3l97M46pl4Kj34M0J18O5l95M06J59m82M18M6l47j42L6J15Kj28
6550a54j1K77j62K65k91K41r2J33j45p4J12J07l36P5K53k99j5J64q8o9K99m92
6572c02L74j35Q5K06o2k55j22J87J2L0k00N9J62j9j16K07j93J23j2J39k90O4K50
6595A92j12j08J95n3m9l39J56J3Q7j4J71q0o2J71l34L67q3n6k23K50K0k59J90
6618D0M3l0j4P2J84j01m06K31n2N4J86m1m3j45r4j14O66l65k49L70j72K09l49
6641a20J97j25j36L68l04k4J85p2J24NM7j8j53J6j11J61L6j14k3J28J43l10j79
$$ plain form
6664 -279 -68 117 -54 135 -155 -114 76 -85 168 129 -58 -81 -50 -71 29 27 180 139 -114 83 91 314 -153
6687 -153 -165 43 -34 170 -177 -94 58 -131 -109 96 -253 -19 221 59 -8 74 58 -71 -60 251 -69 -31 67
6710 67 267 237 -187 9 252 -190 -221 100 248 -13 -190 184 278 32 -94 18 175 157 58 209 -85 207
6732 207 -92 -51 178 198 -93 -242 -52 -139 57 144 -199 -59 -192 -126 -74 -138 -2 -14 -323 161 90 -209 254
6755 254 206 -324 42 -24 -156 18 -125 -129 28 -64 -78 9 141 160 55 -288 93 -27 121 -168 -7 -115 -241
6778 -241 -134 42 -148 -73 84 -24 -156 107 -76 174 19 73 46 -61 87 -114 146 -104 49 40 -90 108
6800 108 189 16 201 175 -145 250 125 -42 -189 117 -247 -94 -107 -97 104 -86 -364 272 80 -277 -17
6821 -17 -245 12 174 78 152 273 150 -139 -22 -86 -60 311 -133 9 74 -136 -29 40 -165 -85 -102 -91 -75 101
$$ packed form
6664b79K11J85j71J89k90M1J90j61K53l9j87k3L1k1J00kJ53m1k53J97QK23m67
6687a53j2K08p7K04l47Q3J52j89K2K05l49K34K40j62o7Q2j6j29J1L11l20L8R8
6710F7K00l0m24J96K43m42l1L21J48k61j77L74R4k46j26J12J57j8r9J51k94K92
6732B07k99M1K29K0k91j49J90q7J96Q7l43J40j33O6N2o4J36j2l09M84p1k99M63
6755B54m8n30L66o6j32J74j43mJ57r2j4Q7J32J9j05l43L81j20J48k89J61j08j26
6778b41J07J76j90P5J57j08j32K63j83K50j55N4k7j07J48k01K60k50J53rj30J98
6800A08Q1j73J85k6l20L95j25j67j47L06l64J53j3J0K01j90k78O36j92l57K60
6821a7k28K57J62r6P4J21j23k89J17o4K6L71m44J42O5k10J07O9k05Q0j7J1J6J76
$$ plain form
6845 101 -287 50 -135 -43 -35 216 88 71 -7 13 81 141 199 344 106 -116 39 -57 37 -205 15 -201 354 48
6869 48 -23 183 -58 12 72 -21 -40 350 -230 -77 98 26 311 -57 -123 -48 71 125 -123 -38 -109 94 54 126 -22
6894 -22 -3 -116 81 58 -175 -107 106 -77 -52 126 15 69 175 -191 -31 52 -70 63 110 165 -105 -71 -229
6917 -229 41 -45 -152 41 221 -101 87 106 155 415 93 -11 80 134 -214 130 59 -58 -28 -55 95 -16 2
6940 2 -76 14 -55 -56 -149 106 -194 -216 -51 -18 180 9 298 199 -153 -275 -18 230 102 58 219 -160 -36 -79
6964 -79 -74 84 -361 -5 -25 -113 124 11 85 -4 -24 119 -191 -5 112 -72 -23 -73 119 -111 98 127 33 -94
6988 -94 43 128 -67 22 -229 76 -85 304 201 164 -221 -79 256 -196 -79 182 -113 -177 -311 -229 27 486
7010 486 -100 -151 95 -83 19 31 -232 4 39 -161 77 213 -117 139 193 -99 217 -30 105 85 297 57
$$ packed form
6845A01l88L37j85R2QK51j28j7p8K0O8O0N8J45k38k22J55r6R4k42K20k16N55l06
6869D8p1K06k41P0O0r3j9L90n80J53J75p2K85l68o6P5J19N4k48Q5p1K03m0P2j48
6894b2J9j13J97k3k33O8K13j83K5J78j11N4J06l66J60Q3j22J33M7N5k70L4j58
6917b29K70q6j07J93J80l22J88J9M9K60l22j04R1N4l48L44p1j17L0k7J50j11J8
6940Bp8R0o9jr3K55l00k2J65L3J98j71K89r9l52j22K57K48j28m4J61l79J24m3
6964g9NJ58m45L56k0q8K37j13P4q9k0J43l10J86J17j84M9n0J92k30K09K9r4j27
6988i4J37Q5j95Q9k51L05j61L89j03l7l85J42L35m52J17K61k95o4j34Q2K56M59
7010D86n86n1K46j78J02J2k63K36L5k00K38J36l30K56N4k92L16k47J35k0K12k40
$$ plain form
7032 57 -114 -369 145 -30 67 -31 111 270 -173 -150 82 -215 128 32 -207 -52 -224 24 108 96 -27 134
7054 134 -73 -106 276 -200 -145 53 -285 138 63 -236 133 -32 -236 87 -150 -16 -190 185 -72 -133 -23
7075 -23 78 282 92 -388 -83 267 -179 -117 100 90 1 249 123 15 -46 -140 -1 18 134 -144 25 -3 -131
7098 -131 -292 99 7 126 -17 -69 14 -34 165 120 26 104 -50 88 10 84 -204 -170 297 -94 271 85 116 26
7122 26 77 31 76 -38 -39 -88 -52 -169 1 137 -9 -79 -98 393 120 51 93 -136 -10 4 -228 57 71 84 -32
7147 -32 -69 90 247 -96 6 -195 -172 233 -44 -255 -90 457 49 84 -157 23 -68 -97 118 235 -7 101
7169 101 385 -54 -142 190 124 -92 -37 5 -91 158 102 36 -83 -193 -77 -232 -108 111 30 -128 244 2 67
7192 67 47 -157 66 -179 -304 -130 -123 3 174 183 45 96 -81 136 13 71 19 -142 140 -115 171 -27 -43
$$ packed form
7032E7j71k55N14j75R7r8J42J59m43K3K32k97L43r6k39J55j72K48Q4j2j23J61
7054A34k07l3L82m76N5J98l38M23p5k99L69j65k04L23k37J34j74L75k57o1J10
7075b3J01K04j90m80L05L50m46O2K17j0q9K48j26j08o1r4J39J9J16k78J69k8j28
7098a31j61L91r2J19j43n2Q3m8J99m5r4P8j54J38p8P4k88L4M67l91L65j86L1r0
7122B6N1m6M5j14jm9L6j17J70J36j46p0j9M91k73o9M2k29J26J4k32K85J4J3j16
7147c2l7J59J57l43J02k01K3M05k77k11J65N47m08L5k41J80r1k9K15J17k42J08
7169A01K84m39q8L32o6k16N5M2r6K49n6o6j19j10J16j55J24K19q1j58L72k42O5
7192F7k0k04K23k45j25J74PJ26J71Rj38N1j77K17j23N8n2j61K82k55K86j98j6
$$ plain form
7215 -43 -89 -74 -190 -86 -21 -26 -336 -179 -58 3 97 -202 51 334 116 150 -34 34 16 -156 25 131 -79 -53
7239 -53 -85 -64 -154 181 156 331 95 -177 -68 -21 -79 -143 64 62 62 -304 497 -107 154 -164 -2 23 42 -177 -109
7264 -109 39 22 -41 -119 192 88 97 92 16 -38 -39 105 -290 101 -127 -268 -15 -4 181 79 105 -152 276 -16
7288 -16 -134 -376 -83 68 182 120 142 -67 109 -79 35 -224 -193 -62 13 -132 10 220 -3 125 -162 37
7310 37 -39 -65 -202 90 -124 39 -355 -15 81 -2 110 -97 -59 82 -203 -65 334 87 24 -27 73 -13 66
7333 66 -91 22 158 -29 -187 -267 68 -65 245 57 -80 119 -189 -115 16 -31 105 -211 -48 151 303
7354 303 -19 13 23 6 54 52 -63 6 8 92 8 -86 8 5 -245 30 -60 113 10 -123 117 240 20 -82 48
7379 48 4 60 -79 7 -229 -94 -83 108 51 -439 42 -79 -12 48 54 -29 -125 185 -270 -34 -8 233 -12 -140
$$ packed form
7215d3m6J5j16J04O5nl10J57J21O1R4k99K53K83k18L4j84O8j8j72J81J06k10K6
7239e3l2K1r0L35k5J75k36k72J09M7n8o4K07k%l66Q01o04K61l18J62K5J9k19O8
7264a09J48j7o3p8L11j04Rnp6n4jJ44l95L91k28j41K53J1J85j02K6k57M28k92
7288a6j18k42K93J51J14o2K2k09J76j88J14k59L1J31P5j45J42K10k23J28k87J99
7310C7p6k6j37K92k14J63l94L40R6q3J12k07L8J41k85J38L99k47o3n1J00q6P9
7333F6j57J13J36j87j58q0L35j33L10j88j37J99l08P4J31m7J36l16J63J99J52
7354C03l22L2J0j7M8kj15O9KQ4q4r4R4lk50K75r0J73j03j33K40J23k20j02J30
7379D8m4N6j39Q6k36J35J1J91n7m90M81j21O7O0Oq3r6L10m55K36K6K41k45j28
$$ plain form
7403 -140 -123 -66 81 6 -166 -74 29 -162 28 79 -67 -164 26 -84 -7 165 9 -124 -13 188 -204 330
7425 330 -18 -16 54 111 -78 -152 143 -80 135 328 -84 -31 -77 -27 42 -1 242 -5 99 57 196 -110 -91 -76
7449 -76 -9 3 -234 -44 -4 -78 -189 -256 79 25 -255 -47 282 95 -57 -158 -201 96 133 58 70 116 -186 -144
7473 -144 40 -123 -172 66 -183 -77 7 5 233 -17 -4 9 -43 -56 -235 319 -185 210 204 -105 147 93 -35 -64
7497 -64 52 -149 15 -22 -6 133 1 -27 77 22 30 93 157 -84 9 -75 86 -210 -200 208 -40 -38 194 -203 87
7522 87 -139 81 107 -61 9 137 -208 -17 47 124 275 190 -19 -189 -2 73 7 114 -140 -37 39 0 -92 -160
7546 -160 115 137 -152 -39 -71 -122 -132 112 34 130 24 -66 125 92 -242 -78 76 108 23 89 190 -156 105 -237
7570 -237 62 -68 205 -136 -288 40 -38 51 133 6 -21 135 251 -10 169 -319 10 -197 252 53 -17 26
$$ packed form
7403a40J7N7J47p5j72R2J03j91J90N1j46r7J90j10P7J72j56j33J11K01l92N34
7425C30l48KP0N7j89p4K95k23K15J93m12N3m6N0O9m3K43k47J04m2J39l06J9J5
7449g6O7J2k37J90M0p4j11o7L35n4k80K08L29j87j52j01m3K97L7p5J2M6l02M2
7473a44J84j63m9K38k49J06Q4kK28k50J3J3n2j3j79N54n04L95ol09K52n4j28k9
7497f4J16k01J64l7J6J39j32k8J04n5QO3O4k41R3q4J61k96J0M08k48KK32l97K90
7522H7k26K20K6j68P0J28l45J91O4P7J51q5k09j70J87P5o6J07k54J03P6l9r2o8
7546a60K75K2k89J13l2n1j0K44p8R6j06r0J91l3l34J64J54L2q5O6J01l46K61l42
7570b37K99j30K73l41j52L28p8Q9Q2j27k7J56J16k61J79m88L29k07M49j99p0M3
$$ plain form
7592 26 -49 -12 78 138 86 -19 -50 173 -117 10 -113 -167 80 -36 -128 16 -134 -209 111 -57 144 -70 246
7615 246 46 -129 235 206 -43 -77 -129 43 9 62 63 -68 -10 -168 18 275 74 248 -55 166 -71 -57 -165
7638 -165 92 56 141 -176 133 -182 -120 -19 21 124 100 -125 -70 8 -41 7 -140 -119 46 112 -18 3 -415 -85
7662 -85 -25 57 265 132 -389 82 -97 -69 0 108 55 -27 291 -8 -179 -85 -80 -133 -58 69 -56 -209 -76 -35
7686 -35 179 -44 178 131 21 30 -73 -49 -68 153 -43 108 -293 -40 -73 -93 37 105 6 -57 -53 20 91 -40 16
7711 16 -112 -9 -176 -126 -336 104 24 245 71 33 -3 -63 151 -229 341 455 190 217 78 -196 154 160 -189
7734 -189 194 -82 -6 10 -54 -100 91 3 -314 -271 -139 171 -105 182 -129 -13 79 173 72 104 190 -106 41
7757 41 93 -205 -59 286 -34 36 311 -345 84 117 -136 128 41 182 -114 57 166 -44 148 194 74 -246
$$ packed form
7592B6p5L7R0O0n2j05l1K23k90J27j23n4K47j16r2J44j50p5L20j68K01k14L16
7615B46k00j75L64k9k49l4n2J72l4N3Jj31N8j58J86K57k01J74l03K21k37J4j08
7638a65K57l6Q5l17L09l15O2J01M0J03k4k25N5P8m9M8j47K1J65O6j30K1m18L30
7662h5O0Q2K08j33n21M71j79K8O9J08n3q2L18k99j71R4Nn3P5J27j25j53J33M1
7686c5K14k23K22m7j10Rj03K4j9K21j96J51m01K53l3k0J30O8r9o3MP3P1j31N6
7711A6j28J03j67N0k10M40q0K21j74l8l6o0K14l80N70J14k65K7j39k74L50Ol49
7734a89L83k76P6J6o4m6J91q8l17M3J32L10k76K87l11J16R2R4j01L2Q6k96J47
7757D1N2k98J46L45l20P0K75o56M29L3k53K64q7J41k96J71J09k10J92M6j20l20
$$ plain form
7779 -246 139 -83 -59 -3 143 -63 -177 -34 246 322 54 -34 -232 116 424 18 164 -2 17 78 -146 44
7801 44 105 -57 -219 112 135 -117 92 107 74 21 -115 -5 -86 -92 122 120 327 37 63 175 -71 -156 234 -6
7825 -6 113 -182 -62 -49 216 -211 16 -114 47 67 88 233 -102 88 144 -187 -80 -7 38 -19 -184 -171 -49
7848 -49 165 138 114 -81 25 303 -177 136 -145 131 -145 -146 -69 -234 -50 16 -76 141 -81 -22 311 84 112
7871 112 -264 -78 -71 168 -53 -154 205 13 -163 -94 63 -321 75 47 250 155 -299 70 -58 -8 51 77 14
7894 14 165 165 79 -42 -55 -38 -76 53 83 -129 -246 66 -11 259 148 80 -93 -59 151 80 116 -35 251 59
7918 59 12 -59 42 82 68 128 -37 -119 57 283 -356 -193 -145 -55 -251 9 -132 60 107 -69 -202 97 285
7941 285 -157 -36 67 75 -1 25 87 -44 -147 -87 -16 -133 53 78 -90 -114 128 36 50 262 156 126 2 -135
$$ packed form
7779b46L85k22K4N6J46k06j14J43K80P6k68q8j98L48L08m06J46j66J9O1k24J90
7801D4O1j62j62L31K3k52K09J5l3n3j36J10q1oK14kK07k90K6J12k46q5L90k40
7825fJ19k95J20J3K65m27K27j30J61K0K1J45l35J90N6l31J07P3M5n7j65J3J22
7848d9K14k7k4j95J06K78m80L13k81K76k76jP7j65J84O6r2K17k22N9L33k27K8
7871A12l76J86PK39k21j01L59j92j76O9J57l84L96k8K03r5m54L69j28N0N9K6o3
7894A4J51%q6j21j3J7l8J29L0k12j17L12p7K70j11o8j73L4K10p1L6j51K86j92
7918E9m7p1J01M0j4O0j65q2J76K26o39J63M8R0j96K60j41J92M7j76j33K99J88
7941B85m42J21J03Qp6K6O2j31j03O0P1j17J86K5j68k4K42r2J4K12j06l0j24j37
$$ plain form
7965 -135 101 -78 -338 169 -198 -84 -58 -72 -58 -75 -85 216 26 120 167 -171 -273 -102 -33 276 99 95 29 -106
7989 -106 200 -100 141 -33 14 258 175 -17 -41 -266 -26 -327 -6 -47 -135 -114 -243 217 93 37 99 251 107
8012 107 160 -79 20 152 -133 -7 218 191 -185 147 -314 -39 -57 123 284 -41 -11 -46 -126 38 65 128 174
8035 174 4 -51 -114 -84 -47 -82 -112 114 301 199 -10 -40 -91 32 -134 -129 158 54 -61 -142 53 28 1 73 -283
8060 -283 36 -32 -82 -43 -271 289 87 -179 -57 -5 -61 -301 -15 335 -343 -31 -149 37 -119 110 140 -286
8082 -286 -93 -60 -79 85 -194 -15 4 221 -136 2 -21 69 -61 321 -229 -13 59 -105 77 132 72 -171 21
8105 21 254 58 103 -2 73 -67 238 109 -139 233 260 -90 51 259 261 -115 -155 -11 130 128 108 -160 97
8128 97 96 -47 -105 5 204 -95 102 -43 -189 103 -290 -3 6 -12 138 30 4 -33 -153 -7 126 -144 -103
$$ packed form
7965a35K36j79k60N07l67J14K6j4J4j7j0L01j90R4M7l38j02J71O9L09j77mo6j35
7989a06L06l00K41j74M7K44q3j92k4k25K40l01L21m1q8K1j29M60j24n6O2J52j44
8012A07N3k39R9J32k85J26K25k7l76L32m61K75j8J80J61l25L0l5q0J64K7O3M6
8035A74j70n5o3L0L7l5l0K26J87j02k09l0n1J23j66NK87j04j15q1J95k5k7P2l56
8060b83L19o8n0L9k28N60k02k66J22N2n6k40K86L50o78L12j18J86j56K29L0m26
8082b86J93L3j9J64k79J79J9K17l57J38k3R0j30L82n50K16P2j64J82N5o0k43J92
8105B1K33j96M5j05P5j40L05j29k48L72K7l50J41K08Kl76m0J44J41kk0k68K57
8128I7jj43n8J10J99k99J97j45j46K92l93K87Rj8J50j08k6l7j20J46J33k70M1
$$ plain form
8151 -103 -95 112 -4 132 -85 -281 -9 107 -17 315 -110 -36 -295 -132 69 -28 144 -350 169 147 23 51
8173 51 222 104 63 139 -173 54 -181 142 2 -32 33 123 -80 -30 -161 63 42 -178
$$ packed form
8151a03QK07j16J36k17j96K72J16j24L32m25P4k59J63K01r7J72m94N19k2j24K8
8173E1J71j18m1P6l12K27k35L23j40l4O5R0k03N0j31K24k1k20
8191a78
$$ Imaginary data points
##PAGE= N=2
##DATA TABLE= (X++(I..I)), XYDATA
$$ plain form
0 0 0 0 0 0 0 0 0 0 0 0 0 0 0 0 0 0 0 0 0 -8 8 -8 8 -8 8 -12 16 -16 16 -24 24 -28 32 -36 40 -46 52 -56 64 -70 78
41 78 -87 100 -108 120 -132 146 -162 178 -195 215 -238 262 -288 319 -354 391 -436 488 -549 621
61 621 -709 822 -965 1162 -1444 1883 -2686 4623 -24061 764 21739 -764 7659 -14873
75 -14873 -17865 16626 12116 -7900 4652 -9973 -8308 16752 -550 -9287 12574 -4756 -9712
88 -9712 8218 -4562 1277 17000 -11028 -14592 7343 1203 9123 11602 -22195 -12554 15669 5880
102 5880 6196 538 -23369 -735 20237 173 -209 -2862 -16526 8662 15224 -9543 264 2937
116 2937 -10640 6276 5383 -9367 8699 4566 -14272 1837 3065 -2144 14560 -2306 -20680
129 -20680 4024 8704 2930 9383 -12000 -17748 12831 10196 -843 2631 -13708 -8301 17548
$$ packed form
0@%%%%%%%%%%%%%%%%%%%qJ6j6J6j6J6k0K8l2L2m0M8n2O0o8P6q6R8j08J20j34J48
41G8j65J87k08K28k52K78l08L40l73M10m53N00n50O07o73P45q27R24j037J170
61F21j330J531j787K127k606L327m569P309k8684K4825K0975k2503Q423k2532
75a4873k992L4491m510k0016J2552j4625J665K5060j7302q737K1861j7330m956
88i712J7930j2780N839J5723k8028l564K1935o140P920K479l3797R641K8223r789
102E880L16n658k3907K2634K0972k0064l82k653j3664K5188O562k4767R807K673
116B937j3577J6916q93j4750J8066m133j8838J6109J228n209J6704j6866j8374
129b0680K4704M680n774O453k1383n748L0579k635j1039L474j6339N407K5849
$$ plain form
142 17548 3750 -6602 2646 -8337 -2154 13122 -4214 -4097 8235 -6659 -4062 7074 -5151
155 -5151 3069 10423 -12298 -7282 7529 183 7163 3854 -17331 -3411 12480 2171 3833 -3420
169 -3420 -16532 5316 14026 -3037 -698 -3479 -9960 9312 7932 -7899 1537 192 -6924 6660
183 6660 1589 -6596 7587 676 -9769 3728 1795 -712 9247 -5523 -12296 5997 4931 1421
197 1421 5528 -10604 -9114 11307 5384 -1798 1217 -9638 -2761 12473 297 -4340 1658 -6369
211 -6369 305 8621 -4638 -2158 5467 -5475 -1298 4968 -3505 3271 5350 -9116 -2896 5484
225 5484 124 5099 674 -12378 277 8685 343 2184 -3052 -10129 5270 8337 -3148 144
239 144 -2630 -6229 7339 4249 -5727 1745 -382 -4578 5318 707 -4057 5232 -877 -6636 3682
$$ packed form
142A7548j3798j0352R248j0983O183J5276j7336J17J2332j4894K597J1136j2225
155e151Q220P354k2721N016J4811p346O980l309k1185J3920J5891j0309J662p253
169c420j3112K1848Q710j7063K339k781o481J9272j380j5831R436j345p116J3584
183F660n071q185J4183o911j0445J3497j933k507R959j4770o773J8293j066l510
197A421M107j6132J490K0421n923p182L015j0855O877J5234j2176m637N998q027
211f369O674Q316j3259K480P625j0942M177O266q473O776K079j4466O220Q380
225E484n360M975m425j3052J2655Q408q342J841n236p077J5399L067j1485L292
239A44k774l599J3568l090r976P472k127m196R896m611m764R289o109n759J0318
$$ plain form
254 3682 798 -263 6053 -4369 -7440 5141 2831 557 3170 -7481 -4755 7914 2459 -1214
268 -1214 497 -6945 -842 8660 -1051 -2712 1280 -4412 732 5678 -3224 -781 3454 -3984 -193
283 -193 3577 -2457 2267 3085 -6589 -865 3986 -546 3263 250 -8120 1049 5723 -491 2062 -2422
299 -2422 -6897 4224 5276 -2455 656 -1539 -4119 4846 2624 -3818 1847 -986 -3205 3896 292
314 292 -2622 4072 -1190 -4243 3015 325 -494 3934 -3716 -4788 4002 1792 374 2180 -4928 -3472
330 -3472 5678 1082 -747 939 -4935 -543 5858 -880 -1396 1214 -3515 321 4161 -2535 -92
345 -92 2427 -3567 -325 2940 -1897 1678 1977 -4902 -242 3134 -955 2339 266 -5869 1135 3935
361 3935 -991 1194 -1116 -5070 2826 3558 -1820 820 -1438 -3360 3693 1757 -2718 1755 -569
$$ packed form
254C682k884j061O316j0422l071J2581k310k274K613j0651K726J2669n455l673
268a214J711p442O103R502r711j661L992n692N144M946q902K443M235p438L791
283a93L770o034M724Q18r674N724M851m532L809l013q370R169M674o214K553m484
299b422m475J1121J052p731L111k195k580Q965k222o442N665k833k219P101l604
314B92k914O694n262l053P258k690q19M428p650j072Q790k210j418J806p108J456
330c472R150m596j829J686n874M392O401o738n16K610m729L836L840o696K443
345i2K519n994L242L265m837L575K99o879M660L376m089L294k073o135P004K800
361C935m926K185k310l954P896P32n378K640k258j922P053j936m475M473k324
$$ plain form
376 -569 -3209 2966 523 -1859 3111 -975 -3310 2484 217 -336 3202 -2500 -3742 3178 1117 -273
392 -273 2100 -3587 -2681 4436 345 -685 993 -3538 -929 4415 -765 -950 1530 -3061 -104 3371
408 3371 -1804 286 1792 -3234 -68 2401 -1594 1444 1723 -4021 -140 2610 -827 1858 559
423 559 -4692 1078 3051 -681 1428 -952 -4288 2594 2675 -1568 1189 -1101 -3202 2999 1577 -2053
439 -2053 1784 -720 -2893 2280 555 -1409 2576 -1399 -3073 2507 446 -25 2968 -2474 -3049 3006
455 3006 572 149 1656 -3452 -1863 3647 109 -279 1367 -3461 -792 3632 -680 -207 1468 -3274
471 -3274 -202 3168 -1193 618 1470 -3638 311 2504 -1493 1492 1216 -3705 245 2569 -908 1623
487 1623 -76 -4139 1228 2404 -1056 1479 -561 -3956 2253 1919 -1512 1741 -1051 -2854 2679
$$ packed form
376e69k640O175k443k382M970m086k335N794k267n53L538n702j242O920k061j390
392b73K373n687R06P117m091j030J678m531K609N344n180j85K480m591K957L475
408C371n175K090J506n026L166K469l995L038K79n744L881K750l437K685j299
423E59n251N770J973l732K109k380l336O882Q1m243K757k290k101O201j422l630
439b053L837k504k173N173j725j964L985l975j674N580k061m71K993n442n75O055
455C006k434m23J507n108J589N510l538l88J646m828K669M424m312M73J675m742
471c274L072L370m361J811Q52n108L949K193l997K985k76m921L950K324l477K531
487A623j699m063N367J176l460K535k040l395O209l34l431L253k792j803N533
$$ plain form
502 2679 991 -1635 2056 -1202 -2905 2893 349 -1082 2379 -2044 -2582 2706 141 -554 2174 -2845
518 -2845 -2194 2949 12 -20 1744 -3455 -1438 3282 -324 61 1119 -3404 -247 3523 -945 393
534 393 1240 -3415 202 2838 -1492 933 1003 -3485 533 2112 -1480 1406 472 -3822 1153 2067 -1344
551 -1344 1731 -279 -3772 1941 2188 -1163 1576 -1045 -3187 2436 1433 -1333 1526 -1556 -2827
566 -2827 2753 605 -1067 2200 -1823 -2055 2756 169 -612 1971 -2432 -1974 2972 -311 -331 1639
582 1639 -3098 -1360 3162 -285 182 1209 -3044 -630 3005 -675 460 929 -3409 230 2579 -1012
598 -1012 743 812 -3263 650 2419 -1452 921 145 -2956 1490 2159 -1219 1420 -314 -3504 1563
614 1563 1770 -1152 1392 -1091 -3147 2200 1163 -990 1612 -1371 -2622 2772 1017 -644 1472
$$ packed form
502B679j688k626L691l258j703N798k544j431L461m423n38N288k565o95K728n019
518b845O51N143k937l2J764n199K017M720l606L85J058m523L157L770m468J338
534C93Q47m655L617K636m330K425P0m488M018J579l592K886r34m294M975R14l411
551a344L075k010l493N713K47l351K739k621k142N623j003k766K859l082j271
566b827N580k148j672L267m023k32M811k587p81K583m403M58M946l283k0J970
582A639m737J738M522l447M67J027m253K414L635l680J135M69m338L639K349l591
598a012J755O9m075L913J769l871K373p76l101M446O69l378K639j734l190N067
614A563K07k922K544k483k056N347j037k153K602k983j251N394j755j661K116
$$ plain form
629 1472 -1770 -1993 2779 192 -691 1536 -2158 -1551 2790 39 -170 1529 -2193 -939 2746 -302
645 -302 -88 1187 -2558 -691 2872 -590 50 688 -2728 79 2624 -975 636 81 -3235 593
661 593 2012 -928 695 -71 -2911 1248 1873 -859 1066 -287 -2759 1636 1861 -1170 1314 -736
677 -736 -2763 2154 1236 -980 1079 -1199 -2329 2315 829 -924 1406 -1674 -1805 2591 357 -742
693 -742 1204 -1998 -1400 2722 228 -432 960 -1941 -901 2563 -467 -304 1118 -2402 -462 2354
709 2354 -903 -55 836 -2678 37 2317 -628 370 337 -2812 595 2036 -895 750 -52 -2461 1160
726 1160 1792 -1294 746 -409 -2379 1547 1378 -967 869 -614 -1866 1941 1165 -1036 1175 -1005
742 -1005 -1896 1881 660 -883 1021 -1445 -1634 2300 542 -648 1151 -1567 -1054 2164 -388 -487
$$ packed form
629A472l242k23M772k587q83K227l694O07M341k751k09J699l722J254L685l048
645c02K14J275l745J867L563l462O40O38l416K807K545l599J611n55l316L828
661E93J419k940J623p66k840M159O25k732J925j353k472M395K25l031K484k050
677g36k027M917r18k216K059k278j130M644j486j753K330l080j31M396k234j099
693g42J946l202N98M122k494o60J392k901J040L464l030J63J422l520J940K816
709B354l257Q48Q91l514K715K280k945R98l3l149L407J441k931J645q02k409L621
726A160O32l086K040j155j970L926j69k345J836j483j252L807p76k201K211k180
742a005q91L777j221j543J904k466j89L934j758j190J799k718N13L218k552r9
$$ plain form
758 -487 1260 -1870 -789 2540 -445 -607 892 -1972 -226 2290 -597 174 608 -2254 499 2161
774 2161 -775 243 194 -2340 560 1847 -1028 435 299 -2301 928 1670 -1179 587 -141 -2254
790 -2254 1340 1440 -1086 1237 -577 -1870 1682 1064 -742 946 -952 -1711 1874 618 -801 967
806 967 -899 -1412 2028 127 -788 945 -1127 -864 1823 18 -683 702 -1680 -818 1933 -101 -464
823 -464 647 -1915 -282 2334 -454 -172 728 -1829 79 1732 -742 36 485 -2008 537 2068
839 2068 -982 318 181 -2041 1028 1463 -1068 461 -260 -2046 1063 1427 -883 658 -314 -1618
855 -1618 1711 936 -904 592 -663 -1489 1623 609 -975 668 -857 -1261 1860 233 -1006 723
871 723 -1131 -1380 1809 -2 -739 662 -1410 -711 1979 -78 -573 788 -1612 -666 1656 -677 -354
$$ packed form
758d87J747l130J081L329k985j62J499k864J746K516k887P71M34k862K753J662
774B161k936J018m9k534K900J287k875J463j36k600L229P42k849J766p28k113
790b254L594J00k526K323j814j293L552o18j806J688j898p59L585j256j419J768
806I67j866n13L440j901r15J733k072K63K687j805p01J385k382Q62K751k034l63
823d64J111k562J633K616k788K82R00k557J908J653k474P78M49k493K545J531
839B068l050J300j37k222L069M35k531J529p21j786L109L64k310J541r72j304
855a618L329p75j840J496j255q26L112j014j584J643j525m04L121j627j239J729
871G23j854k49L189j811p37J401k072O99K690k057m95J361k400R46K322k333L23
$$ plain form
888 -354 730 -1477 -181 1496 -726 -154 741 -1570 164 1899 -728 232 54 -1743 458 1579
904 1579 -1095 426 92 -1496 896 1104 -837 682 -93 -1868 1150 1088 -731 688 -360 -1434
920 -1434 1346 578 -1102 639 -610 -1284 1628 337 -1118 795 -926 -935 1609 -38 -784 1100 -814
937 -814 -949 2055 -177 -624 585 -1377 -566 2017 -407 -500 644 -1649 -159 1798 -943 -77 765
954 765 -1587 443 1659 -885 109 294 -1738 613 1436 -920 403 -19 -1593 708 1194 -734 498
971 498 13 -1744 1178 874 -767 554 -175 -1648 1273 525 -871 893 -618 -1126 1534 398 -889
988 -889 717 -645 -1073 1649 336 -736 908 -1162 -968 1654 -249 -437 957 -1245 -640 1576
1004 1576 -398 -670 710 -1229 -150 1754 -460 -227 614 -1400 73 1811 -734 64 493 -1563
$$ packed form
888c54J084k207J296J677k222N72Q95k311J734J735k627R60j78j797K201J121
904A579k674J521l34j588K392K08j941J519p75j775L018o2j819J419j048j074
920a434K780p68j680J741j249o74K912j291j455J913j721rK544j647p46J884j914
937h14j35L004k232m47J209j962Q11K583k424r3J144k293J490J957k741Q66Q42
954G65k352K030J216k544R94J85k032K351Q23k356J323m22j574K301M86j928J232
971D98m85j757K922l04j641J321p29j473K921p48j396J764j511n08K660j136j287
988h89J606j362m28K722j313j072J644k070J94K622j903j88J394k202O05K216
1004A576j974k72J380j939J079J904k214K33Q41k014J473J738k545P98M29k056
$$ plain form
1020 -1563 403 1536 -858 86 395 -1814 709 1435 -712 420 -33 -1759 928 901 -630 651
1036 651 29 -1552 1164 784 -1042 533 -616 -1263 1585 479 -783 949 -815 -1152 1797 260
1052 260 -949 706 -686 -646 1616 -112 -484 796 -1063 -433 1591 -314 -314 820 -1404 -184 1805
1069 1805 -578 -373 928 -1452 -221 1508 -448 -148 440 -1638 685 1355 -947 -164 446 -1466
1085 -1466 831 1136 -850 463 183 -1190 791 717 -1080 407 -26 -1375 1288 368 -980 679
1101 679 -339 -1044 1246 502 -969 759 -708 -1071 1409 198 -856 944 -1041 -469 1461 -107
1117 -107 -677 763 -987 -449 1407 -207 -488 598 -906 -221 1402 -267 19 763 -1488 -386 1455
1134 1455 -660 -289 524 -1214 264 1355 -688 -34 326 -1119 479 1312 -813 354 254 -1367
$$ packed form
1020a563J966J133k394R44L09k209K523P26k147J132m53j726K687k7j531J281
1036F51o22j581K716l80j826J575j149o47K848j106j262J732j764l37K949j537
1052B60j209J655j392M0K262j728l72J280j859O30K024j905%J134k224J220J989
1069A805k383K05J301k380J231J729j956L00N88k078K323O70k302P83O10j912
1085a466K297L05j986J313k80j373J981p4j797J487m33j349K663r20j348J659
1101F79j018p05K290p44j471J728j467l63K480j211j054J800j985N72J930j568
1117a07n70J440j750N38J856j614k81J086j504O85J623j669K86P44k251J102J841
1134A455k115L71Q13j738J478J091k043O54L60j445J598Q33k125J167j00j621
$$ plain form
1150 -1367 922 1009 -842 417 38 -1240 1288 819 -593 435 -196 -1120 1042 676 -862 476 -643
1167 -643 -800 1193 430 -796 766 -702 -694 1671 112 -750 914 -806 -373 1483 -155 -161 634 -838
1185 -838 -301 1353 -464 -445 635 -835 -211 1116 -593 -189 619 -1463 247 1405 -358 36 338
1202 338 -1353 400 1387 -632 168 62 -1275 594 1009 -979 543 -88 -1007 884 439 -870 561
1219 561 -50 -822 1012 694 -777 508 -146 -1112 1334 425 -726 827 -593 -711 1037 179 -573
1236 -573 873 -909 -762 1441 117 -584 532 -570 -121 1167 -397 -453 599 -887 -224 1168 -525
1253 -525 -222 329 -1007 -12 984 -484 -166 486 -1356 324 1260 -730 51 502 -1041 678 778 -717
1271 -717 190 175 -1057 844 809 -612 303 -24 -1144 988 549 -690 467 -174 -967 1218 639 -743
$$ packed form
1150a367K289Q7j851J259l79j278K528m69j412J028o31r24K162l66j538J338j119
1167f43j57J993p63j226J562j468QK365j559q62J664j720M33J856j638oP95j472
1185h38N37J654j817J9J080j470O24J327j709M04Q08k082J710J158j763L94L02
1202C38j691J753R87k019Q00j06j337J869M15j988J522o31r19J891m45j309J431
1219E61o11p72J834l18j471J285o54r66K446r09j151J553j420j18J748q58p52
1236e73J446j782J47K203j324p01J116j102M49J288j564n6J052j486O63J392j693
1253e25L03N51j336R95R96j468L18O52j842J680R36j990P81M51j543J719J00j495
1271g17R07j5j232J901l5j421R15l27j120K132m39j239J157o41p93K185n79j382
$$ plain form
1289 -743 620 -486 -765 1192 61 -822 502 -494 -576 1253 -27 -600 797 -707 -567 1445 -299
1306 -299 -206 567 -884 -112 1260 -358 -223 590 -1063 296 1140 -433 22 322 -999 249 1090 -276
1324 -276 25 345 -1338 102 1135 -614 294 126 -1106 484 1146 -593 217 11 -1275 761 827
1341 827 -746 474 -277 -855 633 375 -582 540 -532 -775 840 148 -518 568 -590 -866 1139
1358 1139 229 -567 439 -683 -598 1253 -45 -305 523 -637 -478 1418 -434 -387 287 -929 35 930
1376 930 -568 -322 479 -1059 120 1403 -702 61 397 -904 273 1045 -536 218 246 -1203 215
1393 215 674 -672 300 133 -1101 865 1036 -727 192 36 -860 1093 692 -828 417 -145 -986 934
1411 934 237 -702 465 -535 -809 999 59 -590 598 -474 -566 1210 168 -289 571 -817 -616 1064
$$ packed form
1289g43J363j106k79J957j131q83J324r96q2J829j280n73J397j504J40K012j744
1306b99R3P73j451P72J372j618J35Q13j653J359Q44j573M55L00j321J248Q41j366
1324b76L01L20j683J440J033j749R08j68j232J590O62j739Q10k06j286K036O6
1341H27j573J220p51n78J488k58r57J122j072k43J615o92o66J086j158k76K005
1358A139r10p96J006j122Q5J851j298k60Q28j160J59J896j852M7O74j216R64Q95
1376I30j498K46Q01j538J179J283k105P63L36j301J177P72j581P54K8j449J418
1393B15M59j346R72j67j234J966J71j763R19j56q96J953m01j520J245n62q41J920
1411I34o97r39J167j000k74J808r40o49J188j072r2J776j042m57Q60j388K01J680
$$ plain form
1429 1064 -452 -593 645 -846 -167 1090 -642 -333 320 -891 26 1418 -539 -90 208 -1023 374
1446 374 1282 -526 -133 261 -1022 614 1057 -577 308 279 -1021 773 776 -883 476 7 -983 875
1464 875 486 -870 569 -134 -831 938 492 -777 574 -490 -926 1004 26 -486 429 -414 -432 1291
1482 1291 28 -660 702 -773 -258 1149 -273 -261 510 -714 -194 1164 -81 -154 167 -847 -38
1499 -38 1090 -549 -178 568 -1079 107 1158 -609 -160 152 -944 585 902 -733 122 275 -1059
1516 -1059 500 747 -811 251 -122 -871 540 488 -662 504 -175 -975 1144 392 -694 310 -590
1533 -590 -666 1070 253 -619 512 -309 -616 836 -62 -619 449 -574 -448 950 -221 -255 393 -775
1551 -775 -297 921 -153 -387 464 -1115 134 892 -488 -6 136 -844 245 1086 -243 92 442 -870
$$ packed form
1429A064j516j41J238j491O79J257j732L09O53j211R17J392j957M49K98j231J397
1446C74R08j808L93L94j283J636M43j634Q85k9j300J794Lj659J359m69r90J858
1464H75l89j356J439p03o97J769m46j269J351j064m36J930r78n12R15q43j8J723
1482A291j263o88J362j475N15J407j422J2P71j224N20J358j245p3L21j014Q09
1499c8J128j639L71P46j647J186J051j767M49L12j096J529L17j635Q55J53j334
1516a059J559K47j558J062l73p49J411n2j150J166o79q00K119p52j086J004r00
1533e90p6J736q17q72J131q21l07J452q98n57J068j023J26J398j171l4O48j168
1551g75M78J218j074k34Q51j579J249P58j380M82J42r80J089Q41j329L35L50j312
$$ plain form
1569 -870 158 942 -861 63 537 -842 205 659 -859 305 338 -690 331 554 -783 391 -39
1586 -39 -942 872 511 -356 553 -411 -839 1085 32 -564 394 -397 -533 933 21 -774 386 -262 -247
1605 -247 1093 -163 -448 478 -664 -260 1016 -290 -347 526 -781 -25 1053 -166 -291 585 -907
1622 -907 250 965 -407 -155 226 -730 114 888 -547 12 54 -770 556 576 -901 280 201 -891 591
1641 591 418 -742 125 178 -773 708 268 -638 662 -281 -797 838 470 -264 310 -537 -249 1142 -20
1660 -20 -292 261 -459 -208 1088 -74 -714 352 -532 -103 992 -379 -460 704 -674 -19 963 -640
1678 -640 -210 366 -659 -208 856 -337 -12 -66 -692 405 735 -458 -180 46 -682 539 676 -449
1696 -449 -19 147 -632 685 608 -799 435 108 -547 610 177 -605 310 -75 -797 877 304 -610 625
$$ packed form
1569h70J028P84j803R24M74j379J047M54j518J164L3j028J021K23j337J174m30
1586c9r03J814l61q67R09r64m28J924j053n96R58p91j36J466r12p95J160o48J5
1605b47J340j256k85R26j142M04J276j306n7Q73j307P56J078j219j25Q76j492
1622i07J157P15j372K52L81r56Q44P74j435N59M2q24J326K0j477J181p9j092J482
1641E91j73j160Q67N3r51J481m40r06J300r43n16J635l68p34N74q47K88J391j162
1660b0k72N53p20K51J296j162o40J066q84M29J095j371q1J164j378O55R82j603
1678f40M30N76j025M51J064j193L25n4o26J097L30j193K78K26p28J221J37j125
1696d49M30J66p79J317p7j407J234l27o55J157m33p82R15l85p22J674n73r14J235
$$ plain form
1715 625 -205 -467 1051 201 -690 410 -637 -440 1086 144 -329 611 -554 -159 1282 -315 -638 278
1733 278 -348 167 586 -478 -224 310 -537 65 674 -535 -20 285 -532 -24 637 -306 182 333 -527
1752 -527 325 748 -333 -159 129 -705 668 221 -905 61 146 -534 515 328 -660 576 120 -638 772
1771 772 -19 -347 319 -359 -601 745 8 -251 660 -577 -283 793 260 -348 311 -625 130 905 -28
1790 -28 -239 397 -654 -334 772 -545 -191 381 -502 227 795 -832 -111 572 -581 98 701 -383
1808 -383 -36 463 -808 27 990 -435 284 -95 -701 544 754 -436 28 -151 -706 465 360 -787
1826 -787 207 -79 -364 461 141 -429 278 -215 -305 519 -80 -541 340 -319 -254 555 82 -254 100 -398 -600
1847 -600 970 -49 -526 203 -634 -70 1040 -348 -243 490 -315 -30 963 -394 -317 352 -501 67 647
$$ packed form
1715F25q30k62J518q50q91J100j047J97J526r42m73R40j165L95J441j597l23R16
1733B78o26N15M19j064K54N34q47O02O09j209N15L05q17N08O61r43M88J51q60
1752e27Q52M23j081J74K88q34J373m47j126R66Q5o80J049j87r88J236m56p58J410
1771G72p91l28O66o78k42J346p37k59R11j237K94J076n33o08O59r36P55P75r33
1790b8k11O36j051L20J106j317L54N72q83P29N68j627P21O83j153O79O03j084
1808c83L47M99j271Q35R63j425P19l79o06J245K10j190M64j79n55J171j05j147
1826g87R94k86k85Q25l20n70P07m93r0Q24n99m61Q81o59O5Q09m73l36L54m98k02
1847f00J570j019m77P29q37N64J110j388J05P33q05K85R93j357P7O69q53N68N80
$$ plain form
1866 647 -487 167 383 -793 -63 653 -663 330 434 -762 220 631 -361 160 83 -580 869 397 -561
1885 -561 -165 -177 -617 662 253 -556 242 -10 -95 899 -81 -429 389 208 -406 850 11 -223 474 -129
1905 -129 -601 407 -30 -156 890 -636 -358 867 -47 -134 317 -570 211 797 -225 -190 98 -631 140
1924 140 545 -634 -204 172 -501 419 505 -371 -226 799 -293 368 374 -439 269 119 -621 385 450 -381
1944 -381 -68 -44 -654 493 391 -655 95 -294 -474 921 40 -560 317 -74 36 726 -307 -282 483
1963 483 -145 -244 588 -421 -353 459 -185 -223 906 -277 -150 376 -824 45 713 -400 -279 178 -520
1982 -520 184 708 -586 -434 -36 -463 580 526 -743 -187 440 170 559 149 -365 133 150 -439 425 182
2002 182 -413 506 -91 -606 384 326 -451 117 165 -431 908 191 -630 382 -101 -274 748 -145 -582 188
$$ packed form
1866F47j134O54K16j176P30P16j316R93J04j196R82M11r92N21p7o63J449m72r58
1885e61L96j2m40J279m09q09P98k52q5R94r80l48Q18j81o14J256q39k34O97o03
1905a29m72J008m37j26J046j526K78J225r14q7M51q87P81N86j022L5K88p29P71
1924A40M05j179M30L76o73R20Q6q76J45J025j092O61Oq13P08j50p40J006O5q31
1944c81L13K4o10J147j02j046P50l89j80J395q81o00Q77l91J10O90j033K5P65
1963D83o28r9Q32j009O8Q12o44l8J129j183J27N26j200Q69O68j113J21M57o98
1982e20P04N24j294J52L98m27J043n4j269N56O27k70L89m10n14M98J7n89Q64k43
2002A82n95R19n97n15R90n8p77N68M8n96J339p17q21J012m83j73J022q93m37P70
$$ plain form
2022 188 -199 -58 554 -579 -461 427 51 -337 609 -298 -259 565 -501 -163 650 -121 -83 159 -633 160
2042 160 685 -325 -80 53 -518 308 478 -576 -325 199 -315 602 359 -423 169 59 -550 391 161
2061 161 -421 325 249 -367 584 405 -338 120 -50 -392 337 364 -458 119 -166 -28 579 91 -479 225 -249
2082 -249 -53 607 -185 -309 211 -82 -63 694 -376 -362 515 -342 167 434 -202 -302 452 -216 -247 477 -194
2103 -194 19 128 -455 113 582 -329 -6 140 -366 773 455 -443 26 75 -225 432 366 -674 16 124
2123 124 -249 443 208 -438 135 302 -224 222 64 -8 572 -74 -391 420 152 -355 218 -251 -103 514
2143 514 47 -456 -13 -360 -168 442 -266 -181 111 58 -75 403 -313 -320 408 -225 -23 187 -603 52 505
2164 505 -482 163 390 -109 -72 167 -488 135 526 -321 -94 93 -620 429 334 -426 -4 23 -414 456 210
$$ packed form
2022A88l87J41O12j133J18Q88l76l88R46r07L9Q24j066L38Q13p71L8K42p92P93
2042A60N25j010K45J33n71Q26J70j054K51N24n14R17k43p82N92j10o09R41k30
2061A61n82P46p6o16R51j79p43M58j70l42P29K7q22N77k85J38O07m88n70P04m74
2082b49J96O60p92j24N20k93J9P57j070J4Q77q57N09K67o36j00P54o68l1P24o71
2103a94K13J09n83N68M69r11L23J46n06J139l18q98M69M9l00O57o6j040O90J08
2123A24l73O92k35o46N73J67n26M46j58p2N80o46l17Q11k68n07N73m69J48O17
2143E14m67n03M43l47J92O10p08Q5K92n3j33M78p16pP28o33K02K10p90O55M53
2164E05r87O45K27m99L7K39o55O23L91q47K27J87p13J049r5p60M22K7m37Q70k46
$$ plain form
2185 210 -634 -186 222 -139 372 -138 -139 452 -27 -183 374 71 -268 377 -121 -253 677 -90 -531 110 -335
2206 -335 -262 467 -125 -448 186 -249 42 619 -392 24 214 -46 132 584 -441 -373 177 -53 53 349
2226 349 -321 -89 311 -402 -112 603 -396 22 160 -502 368 250 -465 -122 310 -102 528 516 -936 -79
2246 -79 49 -186 507 221 -557 280 -145 -175 618 -46 -688 28 -161 -299 384 -32 -469 227 35 -7 494
2267 494 -75 -765 111 -122 27 643 -116 -371 235 13 -87 405 -218 -426 56 -175 -373 520 -360 -124
2287 -124 381 -420 145 292 -272 149 185 -354 130 421 -173 268 183 -251 166 410 -444 -103 -157 -191 177
2308 177 62 -608 352 4 -433 409 -22 -316 234 -159 -422 272 14 -461 113 -130 -145 647 -275 -363 51
2329 51 -360 -102 266 -133 -86 365 -248 180 555 -331 -149 255 -159 210 396 -277 57 219 -492 8 253
$$ packed form
2185B10q44M48M08l61N11n10jN91m79j56N57l03l39O45m98j32R30p67m41O41m45
2206c35P3P29n92l23O34m35K91N77j011M16J90k60J78M52j025O8N50k30J06K96
2226C49o70K32M00p13K90P15r99M18J38o62Q70j18p15L43M32m12O30j2j452Q57
2246g9J28k35O93k86p78Q37m25l0P93o64o42P16j89j38O83m16m37O96j92m2N01
2267D94n69o90Q76k33J49O16p59k55O06k22j00M92o23k08M82k31j98Q93q80K36
2287a24N05q01N65J47n64M21L6n39M84K91n94M41q5m34M17K44q54L41n4l4L68
2308A77j15o70R60l48m37Q42m31k94N50l93k63O94k58m75N74k43j5P92r22q8M14
2329E1m11K58L68l99M7M51o13M28L75q86J82M04m14L69J86o73L34J62p11N00K45
$$ plain form
2350 253 -534 -27 -9 -458 259 463 -343 -44 72 -402 207 290 -417 83 159 -525 396 271 -291 0 123
2371 123 -416 255 253 -613 416 256 -215 546 -101 -265 139 71 -72 170 -184 -121 313 -41 -169 479 -385
2392 -385 -238 195 -236 -39 383 -8 -104 95 -291 -15 168 -230 -66 452 -306 84 483 -446 -314 134
2412 134 -285 299 161 -516 253 127 -272 49 384 -297 110 9 -470 157 375 -380 -78 25 -358 421
2432 421 162 -258 89 -267 -148 516 72 -368 40 -86 -162 297 -60 -292 482 -54 -92 372 -30 -306 305
2453 305 -296 -21 414 -59 37 189 -355 81 499 -168 -147 355 -345 63 193 -189 59 215 -391 25 330
2474 330 -381 3 80 -471 565 287 -491 2 30 -286 137 114 -465 -109 189 -422 273 85 -596 -33 76
2495 76 -323 403 -182 -500 147 -303 -78 266 -12 -305 -79 -129 -116 330 -227 -133 442 -57 -192 417 -245
$$ packed form
2350B53p87N07J8m49P17K04q06K99J16m74O09Q3p07N00P6o84R21j25n62K91J23
2371A23n39O71kq66J029j60m71P61o47j64M04o8j43K42l54O3M34l54j28O48q64
2392c85J47M33m31J97M22l91r6J99l86K76J83l98J64N18p58L90L99r29J32M48
2412A34m19N84j38o77P69j26l99L21L35o81M07j01m79O27K18p55L02J03l83P79
2432D21k59m20L47l56J19O64m44m40M08j26p6M59l57k32P74n36l8M64m02k76O11
2453C05o01K75M35m73R6J52n44M36M18o67K1N02p00M08J30l82K48J56o06M16L05
2474C30p11L84P7n51J036k78p78M93K8l16M23k3n79L56K98o11O95j88o81N63J09
2495G6l99P26n85l18O47m50K25L44k78k93K26n0J3M46n57R4N75m99j35O09o62
$$ plain form
2516 -245 -235 177 -223 81 339 -488 8 286 -373 -71 322 -590 -3 205 -387 344 156 -255 -16 127
2536 127 -155 27 332 -12 -10 -63 -404 288 138 -357 129 156 -146 379 152 -265 87 -133 -338 245 30
2557 30 -240 285 93 -178 94 -79 -492 159 -146 -80 346 -92 -470 66 -253 -154 559 -365 -81 465 -58
2578 -58 156 457 -192 -102 331 -187 166 266 -387 -129 185 -456 176 342 -353 -108 120 -2 -65 338 -394
2599 -394 185 239 -402 109 453 -253 132 83 -104 475 487 -366 -21 214 -52 372 99 -381 -189 -174 -224 409
2621 409 96 -381 25 -27 -15 216 113 -168 414 -63 45 412 -327 -197 320 -222 -293 264 -77 -443 331
2642 331 -151 66 327 -143 -88 343 -174 -176 298 -394 -84 339 -249 -44 222 -243 -91 -80 86 67 138 -375
2664 -375 279 190 -269 246 223 -283 153 36 -210 354 -98 -149 65 15 -255 79 88 -180 51 94 -403 245
$$ packed form
2516b45J0M12m00L04K58q27M96K78o59L02L93r12N87K08n92P31j88m11K39J43
2536A27k82J82L05l44Kn3l41O92j50m95M86K7l02N25k27m17L52k20k05N83k15
2557C0k70N25j92k71K72j73m13O51l05O6M26m38l78N36l19R9P13r24K84N46n23
2578e8K14L01o49R0M33n18L53J00o53K58L14o41O32J66o95K45K28j22o3M03p32
2599c94N79N4o41N11L44p06L85m9j87N79J2q53L45K35k66M24k73m80J92J5n0O33
2621D09l13m77M06n2J2K31j03k81N82m77J08L67p39J30N17n42p1N57l41l66P74
2642C31m82K17K61m70N5M31n17kM74o92L10M23n88K05K66m65J52J1J66j9P1n13
2664c75O54q9m59N15k3n06M36j17k46N64m52n1K14n0k70L34Rk68K31M3m97O48
$$ plain form
2686 245 -123 -285 197 -37 -129 155 -218 -22 130 26 -236 346 -194 -404 244 -177 101 429 -313 -387 103
2707 103 -43 -36 295 -127 -328 6 -237 329 396 -520 -58 26 -143 50 228 -235 -14 11 -136 167 252 -191
2729 -191 64 447 -134 204 -49 -367 164 69 -161 257 119 -587 136 -17 -292 222 9 -315 149 -69
2749 -69 -271 207 -244 -507 249 -115 44 294 -59 -405 44 -88 -21 123 -119 -86 409 -297 -102 319 -485
2770 -485 -138 35 -404 -105 336 -297 -116 -87 -186 65 476 -235 18 98 -214 135 247 -66 -26 120 -122
2791 -122 404 19 -202 93 -174 -128 101 345 -496 146 104 -501 395 -191 -111 184 -37 -51 320 -177 -224 103
2813 103 -346 -71 143 -191 -309 7 -243 -282 486 -127 -119 291 -46 -251 423 4 -186 250 -168 184 531
2834 531 -261 208 175 -215 102 104 -141 -80 122 -453 343 243 -428 20 309 -396 333 173 -215 213 127 -152
$$ packed form
2686B45l68j62M82k34r2K84l73J96J52j04k62N82n40k10O48m21K78L28p42p4M90
2707A03j46PL31m22k01L34k43N66O7r16M62Q4j69J93J78m63K21K5j47L03Q5m43
2729a91K55L83n81L38k53l18N31r5k30M18j38p06P23j53k75N14k13l24M64k18
2749f9k02M78m51k63P56l64J59K50l53l46M49j32O7J44k42L3M95p06J95M21q04
2770d85L47J73m39K99M41o33J81K9r9K51M11p11K53Q0l12L49J12l13M0J46k42
2791a22N26l85k21K95k67M6K29K44q41O42m2o05Q96n86Q0K95k21j4L71m97m7L27
2813A03m49K75K14l34j18L16k50l9P68o13QM10l37k05O74m19j90M36m18L52L47
2834E31p92M69l3l90L17Kk45O1K02n75P96j00o71M48K89p05P29j60l88M28q6k79
$$ plain form
2856 -152 354 225 -100 23 61 -117 236 -21 -173 362 35 -52 173 176 -488 299 -142 -215 642 -78 -106 130
2878 130 -201 58 489 -241 -54 303 -130 -228 483 -314 61 414 -468 81 400 -240 -40 128 -449 -14
2898 -14 245 -178 -37 137 -275 39 458 -182 410 -53 -320 271 153 -461 64 150 -104 72 -48 -212 103
2919 103 158 -293 506 -19 -372 277 42 -221 369 118 -328 346 -20 -363 223 -118 -157 62 -135 -259 248
2940 248 -104 -423 224 -369 -213 348 -216 -80 250 -246 191 119 -289 -126 140 -250 285 386 -168 -145 182
2961 182 -224 163 307 -271 34 254 -111 396 318 -182 17 9 -183 492 110 -370 289 -9 -166 248 -15
2982 -15 -173 276 46 -237 585 -57 -136 181 -108 -211 203 -121 -219 133 -44 -123 326 -114 114 387 -100
3003 -100 -1 412 -201 -70 352 46 -90 273 -321 68 429 -307 291 381 -50 80 282 -176 313 200 -243
$$ packed form
2856a52N06j29l25J23L8j78L53k57j52N35l27q7K25Lo64P87m41p3Q57p20k8K36
2878A30l31K59M31p30J87L57m33r8P11p97L75L53q82N49L19o40K00J68n77M35
2898a4K59m23J41J74m12L14M19o40N92m63k67N91j18o14N25Q6k54J76j20j64L15
2919A03N5m51P99n25l53O49k35k63N90k51m46O74l66l43N86l41l9K19j97j24N07
2940B48l52l19O47n93J56N61n64J36L30m96M37p2m08J63K66l90N35J01n54K3L27
2961A82m06L87J44n78L05K20l65N07p8n00J99qj92O75l82m80O59k98j57M14k63
2982a5j58M49k30k83Q22o42p9L17k89j03M14l24r8L52j77p9M49m40K28K73m87
3003a00R9M13o13J31M22l06j36L63n94L89L61p36N98R0m31J30K02m58M89j13m43
$$ plain form
3024 -243 199 127 -149 -12 364 -402 -91 46 -190 79 44 -262 177 -205 -397 162 -228 82 357 119 -194
3045 -194 495 -120 -129 253 -41 -179 311 -230 -375 225 31 -39 456 -148 -339 411 -357 99 128 -231 -169 286
3067 286 -181 -48 127 -339 42 135 -65 54 201 -350 -124 219 -104 204 544 -272 15 257 -138 40
3087 40 18 -13 332 -89 -121 102 141 -188 121 -179 -74 336 187 -327 243 -95 -126 346 -116 -369 58 -219
3109 -219 -121 529 -198 -143 167 -162 -109 566 -54 -164 90 -137 165 363 -310 -247 112 -199 -116 407 104 10
3131 10 -87 -187 10 113 -403 -102 347 -252 232 335 -233 -42 -98 -74 186 231 -306 159 67 55 346 111
3153 111 -153 108 -77 -251 45 198 -368 419 -27 -133 514 -78 -201 183 70 -166 147 -89 -368 68
3173 68 -241 98 111 2 -341 307 -3 163 215 -347 -314 417 76 43 439 -184 -65 234 -351 116 591 -264
$$ packed form
3024b43M42p2k76J37L76p66L11J37k36K69l5l06M39l82j92N59l90L10K75k38l13
3045a94O89o15rL82k94j38M90n41j45O00j94p0M95o04j91P50p68M56K9l59O2M55
3067B86m67J33J75m66L81R3k00J19J47n51K26L43l23L08L40q16K87K42l95J78
3087D0k2l1L45m21l2K23L9l29L09l00J05M10j49n14N70l38l1M72m62k53M27k77
3109b19R8O50p27N5L10l29N3O75o20j10K54k27L02J98o73O3L59l11Q3N23l03r4
3131A0r7j00J97J03n16L01M49n99M84J03n68J91n6K4K60M5n37M65r2j2K91k35
3153A11k64K61j85j74K96J53n66P87m46j06O47n92j23L84j13k36L13k36k79M36
3173F8l09L39J3j09l43O48l10J66N2n62L3P31l41l3L96o23J19K99n85M67M75q55
$$ plain form
3195 -264 -61 61 -276 69 265 -385 -65 -134 -452 372 188 -220 -223 48 -53 262 152 -266 265 39 -402
3216 -402 244 -81 -275 199 -126 -226 211 102 -320 196 -167 -223 592 -182 -327 313 115 52 486 -52 -323
3237 -323 -19 -159 8 304 -38 -53 355 -360 -180 -6 -306 22 217 -349 161 163 -419 -130 96 -219 278
3258 278 81 -230 -62 195 34 119 328 -37 0 222 -150 178 179 -595 375 -155 -136 367 -54 -314 151 192
3280 192 -219 96 -6 -206 244 221 -266 427 -97 -108 289 -118 -13 -10 -238 111 160 -269 -225 286 -151 -133
3302 -133 281 -211 -310 332 -76 -130 250 -164 -303 232 -406 -63 136 -75 -56 230 18 -3 189 -397 152
3323 152 301 -309 -77 202 -148 303 -38 -134 82 -122 -222 75 127 -267 283 -188 -210 392 -68 -233 284
3344 284 -188 -97 366 114 -421 435 -222 24 289 -169 -183 52 66 37 171 -236 -46 265 -36 297 305 -215
$$ packed form
3195b64K03J22l37L45J96o50L20o9l18Q24j84m08lK71j01L15j10m18N31k26m41
3216d02O46l25j94M74l25j00M37j09m22N16l63n6Q15p74j45O40j98o3M34n38k71
3237c23L04j40J67K96l42j5M08p15J80J74l00L28J95n66N10Kn82K89K26l15M97
3258B78j97l11J68K57j61Q5K09l65L7K22l72L28Jp74R70n30J9N03m21k60M65M1
3280A92m11L15j02k00M50k3m87O93n24j1L97m07J05Lk28L49M9m29M4N11m37J8
3302a33M14m92r9O42m08n4L80m14j39N35o38L43J99k11J9K86k12k1J92n86N49
3323A52J49o10K32K79l50M51l41r6K16k04j00K97N2l94N50m71k2O02m60j65N17
3344B84m72R1M63k52n35Q56o57K46K65m58j4K35J4k9J34m07J90L11l01L33Qn20
$$ plain form
3366 -215 -161 25 -227 176 331 -63 208 230 -12 50 147 -342 -16 174 -182 212 249 -112 293 50 -135 50
3388 50 100 -213 78 23 -215 351 1 -121 393 52 -118 263 -237 -384 219 110 -82 476 -398 -261 -96
3409 -96 87 33 266 -393 50 220 -167 127 8 -255 -54 166 -297 -208 15 -9 -82 65 -47 -4 11 -273
3431 -273 -235 227 21 96 368 -484 -117 129 -177 136 151 -23 92 -20 -198 174 -18 -326 189 2 174
3452 174 90 87 22 10 141 -282 361 149 -23 216 -152 70 239 -141 -192 476 -43 -85 52 -87 -109 -59 -387
3475 -387 -104 423 -79 -66 302 -84 -134 215 -132 177 248 -95 83 14 -290 196 -39 -130 151 238 -67 95
3497 95 284 -303 -110 224 -274 81 2 96 375 140 -276 116 -114 -236 76 31 -279 176 316 -214 373
3518 373 128 -253 250 37 -142 218 -189 -98 -36 75 -93 -62 -281 -137 308 -251 -16 -10 -89 -40 95 132 97
$$ packed form
3366b15N4J86k52M03J55l94K71K2k42O2R7m89L26J90l56L94L7l61M05k43j85J85
3388E0N0l13K91n5k38N66l50j22N14l41j70L81n00j47O03j09j92N58q74J37J65
3409i6J83n4K33o59M43J70l87K94j19k63K01K20m63Q9K23k4p3J47j12M3J5k84
3431b73L8M62k06P5K72q52L67K46l06L13J5j74J15j12j78L72j92l08N15j87J72
3452A74q4lo5j2J31m23O43k12j72K39l68K22J69l80n1O68n19m2J37j39k2N0l28
3475c87K83N27n02J3L68l86n0L49l47L09P1l43J78o9l04M86k35r1K81Q7l05J62
3497I5J89n87J93L34m98L55p9R4K79k35m16L92k30j22L12m5l10M55J40n30N87
3518C73k45l81N03k13j79L60m07R1O2J11j68L1k19J44M45n59K35Op9M9J35L7l5
$$ plain form
3541 97 399 -18 44 104 -146 -2 543 -170 42 143 83 -97 209 -150 5 221 -174 131 206 -154 -309 188
3563 188 -231 -11 114 -206 -267 -180 16 271 258 -1 34 -192 -72 284 51 2 194 27 3 130 -103 -287
3585 -287 10 83 -115 314 -269 -184 91 -223 -136 203 -58 147 -76 -141 250 131 -53 -106 310 -140 133 48
3607 48 -272 -36 148 -350 16 65 -241 -213 247 -68 -75 62 -196 5 214 -120 116 78 37 219 135 -430 71
3630 71 130 -297 202 -197 -76 339 -166 -159 -47 -48 90 241 119 -44 145 119 -119 315 57 -3 378 -96 276
3653 276 15 58 209 148 -118 15 77 -210 -346 -91 47 -141 287 -376 -464 42 -204 291 101 -31 85
3674 85 304 -71 331 -19 63 97 298 -1 145 374 -183 285 -87 -252 79 180 22 57 98 53 -74 -446
3696 -446 -288 136 123 -90 -68 211 -271 -147 190 -87 38 -44 -312 110 -12 -68 29 -63 -213 193 -310 145
$$ packed form
3541I7L02m17O2O0k50J44N45p13K12J01o0j80L06l59J55K16l95L05P5l60j55M97
3563A88m19K20J25l20o1Q7J96K55j3k59L5k26J20L56k33m9J92j67k4J27k33j84
3585b87K97P3j98M29n83Q5K75l14Q7L39k61K05k23o5L91j19j84n3M16m50K73q5
3607D8l20K36J84m98L66M9l06K8M60l15pJ37k58K01K09l34K36l8m1J82q4n65N01
3630G1N9m27M99l99J21M15n05PJ12jJ38J51j22j63J89k6k38M34k58o0L81m74L72
3653B76k61M3J51o1k66J33O2k87j36K55J38j88M28o63q8N06k46M95j90j32J16
3674H5K19l75M02l50Q2L4K01k99J46K29n57M68l72j65L31J01j58L5M1m5j27l72
3696d46J58M24j3k13K2K79m82J24L37k77J25q2k68M22j22n6R7r2j50M06n03M55
$$ plain form
3718 145 161 -301 58 94 -134 -77 37 -124 37 11 126 35 44 -115 -78 166 148 -72 93 -178 152 235 -51
3741 -51 246 35 -273 95 32 -99 66 142 53 -2 137 -283 -91 60 -256 5 -319 -117 166 -48 -188 -32
3763 -32 -54 -241 204 -77 -339 194 317 -49 255 -292 -11 -116 -139 -232 175 -131 -175 16 -117 0 137 -365
3785 -365 -153 80 -87 103 30 -192 76 10 -29 -12 171 -105 182 43 -40 176 -71 -51 73 150 -44 -152
3807 -152 87 -175 -83 116 -111 82 27 -91 124 31 -94 300 -234 -265 189 -14 -47 59 -235 151 167 100
3829 100 -111 247 -223 -151 -49 56 -12 245 -114 -89 238 -204 -81 239 -124 -149 125 -70 264 312 -425 67
3851 67 -53 -220 271 -13 -254 140 253 -120 -15 113 47 136 -115 -51 247 7 -67 -89 73 -57 65 22
3873 22 19 9 -166 197 190 -104 -82 100 31 -109 -93 132 -255 108 116 -163 -62 -70 -217 68 -131 -65 -161 -259 73
$$ packed form
3718A45J6m62L59L6k28N7J14j61J61k6J15r1Rj59L7K44j8k20J65k71L30Q3k86
3741e1K97k11l08L68o3j31J65P6q9n5J39m20J92J51l16K61l24K02K83k14j40J56
3763c2k2j87M45k81k62N33J23l66L04n47K81j05k3r3M07l06m4J91j33J17J37n02
3785c65K12K33j67J90p3k22K68o6l9J7J83k76K87j39q3K16k47K0J24P7j94j08
3807a52K39k62R2J99k27J93n5j18K15r3j25L94n34l1M54k03l3J06k94L86J6o7
3829A00k11L58m70P2J02J05o8K57l59K5L27m42J23L20l63k5K74j95L34M8p37M92
3851F7j20j67M91k84k41L94J13l73J05J28o6Q9k51O4K98k40p4k2J62j30J22m3
3873B2lj0j75L63pk94K2J82o9j40J6K25l87L63Qk79J01qj47K85j99O6r6r8L32
$$ plain form
3898 73 322 -48 241 267 -154 -161 58 83 -196 135 5 154 251 -76 84 -261 -47 375 14 -200 62 10
3920 10 -477 29 -116 -220 -184 51 -43 -154 6 -228 219 31 -167 -237 24 -102 -38 29 -45 193 -50 -64 108
3943 108 -30 268 41 -12 106 -222 23 -286 264 -80 -88 -123 -152 110 -118 -264 145 110 -220 -243 -31 -102 -79
3966 -79 -210 -456 -14 263 10 -89 208 -359 4 288 2 167 -27 -126 -69 -91 -218 -119 345 -170 285 377
3988 377 -63 34 -143 -160 -34 -96 -107 27 140 67 338 -88 137 168 -22 -49 10 -181 -59 -36 23 -67 1 177
4012 177 63 287 175 -48 116 -219 30 121 277 -183 219 -101 -25 257 -354 -94 92 -101 -112 264 22
4033 22 -72 -39 -147 124 280 -169 159 58 15 113 343 -150 -194 92 -83 -17 -142 121 166 -175 86 121 -126
4056 -126 -7 -10 154 -327 -7 -39 -123 -200 16 -247 388 -251 -116 243 262 -123 71 -301 285 226 -13 -204
$$ packed form
3898G3K49l70K89K6m21pK19K5k79L31j30J49R7l27J60l45K14M22l61k14K62n2
3920A0m87N06j45j04L6K35r4j11J60k34M47j88j98p0K61j26O4O7p4K38k43j4J72
3943A08j38K98k27n3J18l28K45l09N50l44ql5k9K62k28j46M09l5l30k3K12p1K3
3966g9j31k46M42K77k53r9K97n67L63K84k86J65j94r9N7k2j27R9M64n15M55R2
3988C77m40R7j77j7J26o2j1J34J13p3K71m26K25L1j90k7N9j91J22K3N9r0O8J76
4012A77j14K24j12k23J64l35K49R1J56m60M02l20P6K82o11K60J86j93j1L76k42
4033B2r4L3j08K71J56m49L28j01m3R8K30m93m4K86j75O6j25K63M5l41K61L5k47
4056a26J19lJ64m81L20l2q4p7K16k63O35o39J35L59J9l85J94l72N86n9k39j91
$$ plain form
4078 -204 96 -46 -241 563 -59 50 -7 2 -342 232 -201 -156 90 -88 -162 -44 -293 -128 -25 -214 166 122
4100 122 -135 55 90 -40 -194 105 27 -25 -61 -256 62 -28 39 102 -216 -125 179 -98 118 78 12 -66 -152 -234
4124 -234 -218 248 271 -249 107 -103 106 39 -94 -18 -69 -59 58 155 124 126 -111 -2 128 187 -139 -40 -144 138
4148 138 208 -23 -295 -360 165 -219 -42 402 -284 140 89 -216 -117 -6 -81 -134 260 -167 -205 205 -277 -17
4170 -17 -25 -431 -33 163 -123 4 -148 41 204 -21 -124 -203 -35 -120 -38 235 -51 -109 85 193 111 -81 -103
4193 -103 214 45 -361 94 -395 206 107 81 -148 175 44 -64 215 -52 -145 291 139 349 -50 -112 -107 39
4215 39 -55 -139 150 -199 73 231 -113 39 -190 -162 -70 179 -258 -40 76 -198 104 -205 -186 48 -165 32
4237 32 305 -89 -335 278 -141 -10 208 21 -46 149 70 -122 -180 -72 -218 69 192 -90 96 99 -109 -44
$$ packed form
4078b04L00j42j95Q04o22J09n7Rl44N74m33M5K46j78p4J18k49J65J03j89L80m4
4100A22k57J90L5j30j54K99p8n2l6j95L18r0O7O3l18R1L04k77K16m0o6p8q6q2
4124b34J6M66K3n20L56k10K09o7j33P6n1J0J17R7l1Kk37J09J30N9l26R9j04K82
4148A38P0k31k72o5N25l84J77M44o86M24n1l05R9J11p5n3L94m27l8M10m82K60
4170a7qm06L98J96k86J27j52J89J63k25j03p9J68q5Q2K73k86n8J94J08q2j92k2
4193a03L17j69m06M55m89O01r9k6k29L23j31j08K79k67r3M36j52K10l99o2NJ46
4215C9r4q4K89l49K72J58l44J52k29K8R2K49m37K18J16k74L02l09J9K34k13J97
4237C2K73l94k46O13m19J31K18j87o7J95p9j92n8J08j46K87J23k82J86Lk08O5
$$ plain form
4259 -44 121 -36 71 -57 -10 -145 -244 -142 187 -1 -59 36 -102 154 206 -106 170 92 -149 15 80 -73 -42
4282 -42 -20 -156 47 190 -216 52 80 41 20 -398 -86 325 216 -154 37 -4 -141 29 -32 -178 37 79 -275
4305 -275 -15 112 -113 -199 10 86 19 -180 40 98 -226 -180 244 -146 -146 45 5 3 87 -27 90 144 -324 152
4329 152 -21 2 3 10 -295 -278 -52 216 156 -15 -42 25 304 -148 -225 105 63 86 63 -122 13 -147 -198 126 189
4354 189 225 238 -222 109 369 117 -157 137 140 -232 179 -21 -99 38 -79 -166 -44 116 165 -138 -229 -82 35
4377 35 -127 -6 -58 -75 -56 191 151 297 125 -38 257 -61 -57 41 49 -237 -75 38 -238 81 130 -21 108 100
4401 100 5 145 -125 38 -98 -19 -155 271 147 -81 147 -55 20 -134 116 68 -19 -47 110 490 -15 -310
4423 -310 39 112 -17 235 57 -253 72 230 -238 194 61 -20 265 -70 -123 27 384 -313 -56 -203 -137
$$ packed form
4259d4J65j57J07j28M7j35r9J02L29j88n8R5j38K56N2l12K76p8k41J64O5j53L1
4282d2K2j36K03J43m06K68K8l9k1m18L12M11j09l70J91m1j37J70o1j46K15M2l54
4305b75K60J27k25q6K09P6o7j99K20N8l24M6M24l90%J91m0kQ4j14J17N4m68M76
4329A52j73K3JPl05J7K26K68o0j71k7O7K79m52p7L30m2K3k3j85J35j60n1L24O3
4354A89L6J3m60L31K60k52k74K94Ll72M11k00p8J37j17q7J22J60M9l03r1J47J17
4377C5j62J21n2j7J9K47m0J46j72j63K95l18MR8Qk86J62J13k76L19M9j51J29q
4401A00r5J40k70J63j36P9j36M26j24k28K28k02P5j54K50m8q7k8J57L80n05k95
4423c10L49P3j29K52j78l10L25J58m68M32j33q1K85l35n3J50L57o97K57j47O6
$$ plain form
4444 -137 116 -230 8 -292 34 70 24 -126 10 80 -279 103 42 -69 -154 68 3 -99 70 -151 303 -76
4466 -76 -131 133 -294 -133 139 -25 -147 -193 -52 136 -262 116 -51 -173 279 -53 -211 164 -37 -6 -191
4487 -191 -226 169 -121 31 200 -43 -165 157 -32 -178 167 -194 218 0 -231 307 162 -31 -229 238
4507 238 -255 -288 473 -38 -184 194 -309 257 42 139 -115 -292 -90 -105 92 21 -251 16 -147 78 39 -41
4529 -41 -71 215 43 -129 381 -55 -13 -65 -56 6 130 -43 -134 -113 -136 -45 86 -76 -46 -116 -231 161 -149 105
4553 105 64 1 -181 145 -290 -59 97 -58 126 193 -38 -99 -63 -104 56 239 -6 73 -23 -152 -76 144 -243
4576 -243 -11 179 -253 240 205 -102 16 -182 50 -25 -172 71 129 107 -30 -135 50 -126 83 92 -430 42
4598 42 146 -147 -467 -49 -137 357 68 39 109 136 21 -188 38 -76 -134 -292 68 160 -128 -114 273 61 57
$$ packed form
4444a37K53l46K38l00L26L6m6j50J36P0l59L82o1j11q5K22o5j02J69k21M54l79
4466g6n5K64m27J61K72j64j22m6J41J88l98L78j67j22M52l32j58L75k01L1j85
4487a91l5L95k90J52J69k43j22L22j89j46L45l61M12k18k31N38j45j93j98M67
4507B38m93l3P61n11j46L78n03N66k15R7k54j77K02j5J97p1k72K67j63K25l9q0
4529d1l0K86j72j72N10m36M2n2RO2J24j73r1K1k3R1J31j62L0p0j15L92l10K54
4553A05m1o3j82L26m35K31J56j55J84O7k31o1L6m1J60J83k45P9r6j29P6K20l87
4576b43K32J90m32M93l5l07J18j98K32p5j47K43N8k2j37j05J85j76K09Rn22M72
4598D2J04k93l20M18q8M94k89k9P0K7j15k09K26j14n8j58L60R2k88J4L87k12m
$$ plain form
4621 57 108 -9 10 52 -51 -162 86 -61 -52 395 -134 -73 50 -162 101 299 -206 125 63 -403 247 188 -158
4644 -158 -124 5 -253 -143 -23 -101 259 -38 29 105 152 -377 -178 -303 -228 172 16 -261 179 -237 44 -141
4666 -141 175 -53 7 -51 -251 76 86 130 -60 217 -41 196 -192 171 127 118 -142 299 78 -116 90 -183
4688 -183 65 106 -201 106 -13 126 -249 17 -126 143 24 -187 292 31 -8 -297 39 -18 -115 -176 -140 -36
4710 -36 49 -193 118 134 -215 271 -23 -42 -53 292 90 -88 34 -380 82 -71 -43 153 263 -193 -179 37
4732 37 3 159 -54 -49 -172 -122 18 197 -106 25 -60 14 -108 -59 -117 204 149 221 -148 -48 -33 107 116 23 231
4757 231 44 -203 -173 233 -320 -11 -340 -367 -61 114 -33 114 108 -440 167 110 -152 -158 -94 -66 -25 97 -142
4780 -142 9 -78 -277 160 185 -90 -157 -367 -150 19 -18 -224 130 -3 -326 -139 92 201 118 38 -39 308
$$ packed form
4621E7N1j17J9M2j03j11K48j47RM47n29O1J23k12K63J98n05L31o2m66O50n9l46
4644a58L4J29k58J10J20p8L60k97O7P6M7n29J99j25P5M00j56k77M40m16K81j85
4666a41L16k28O0n8k00L27J0M4j90K77k58K37l88L63m4rk60M41k21j94K06k73
4688a83K48M1l07L07j19J39l75K66j43K69j19k11M79k61l9k89L36n7r7o1L6J04
4710c6Q5k42L11J6l49M86k94j9j1L45k02j78J22m14M62j53K8J96J10m56J4K16
4732C7l4J56k13Nj23N0J40J79l03J31q5P4j22M9n8L21n5P2l69J00J5J40Rr3K08
4757B31j87k47L0M06n53L09l29k7L06J75j47J47on48O07n7k62oO4K8M1J22k39
4780a42J51q7j99M37K5k75o7k10K17J69l7k06L54j33l23J87K31J09q3q0p7L47
$$ plain form
4802 308 -238 97 54 -39 150 184 8 136 238 306 24 188 50 171 193 -4 -60 179 -110 1 156 -124
4824 -124 206 290 -307 -87 -57 -295 164 -159 -55 282 -68 -252 158 -122 -458 127 116 234 298 -46 -106 -25
4846 -25 -130 -182 95 88 42 57 65 55 93 -123 25 148 -295 -11 -199 -36 1 -163 -256 2 110 -226 -45 -74
4870 -74 -306 -134 161 -161 -94 -24 -131 44 102 68 -122 -100 -65 -107 35 145 47 90 -496 271 325 -243 -31 124
4894 124 -84 -15 220 43 74 -52 -17 -149 -191 -59 -203 -109 -10 168 -31 -59 71 -63 -198 -125 -160 -86 213
4917 213 250 39 44 105 26 9 85 46 -112 -47 29 73 -14 105 35 -21 -34 192 -215 129 -31 -14 0 -33 80 150
4943 150 86 50 209 -109 -201 -73 -110 -298 97 304 -108 334 182 -262 15 -26 -87 -160 138 -173 70 -15 1
4966 1 248 -100 -190 5 425 -154 33 -28 -46 107 -165 -354 134 193 308 -34 -259 10 159 -65 -210 78
$$ packed form
4802C08n46L35m3r3J89L4j76J28J02O8k82J64j38J21K2j97n6K39k89J11J55k80
4824a24L30Q4n97K20L0k38M59l23J04L37l50j84M10k80l36N85j1J18O4l44o0Q1
4846b5j05n2K77pm6J5Qj0L8k16J48J23m43K84j88J63L7j64r3K58J08l36J81k9
4870g4k32J72K95l22O7P0j07J75N8l4j90K2L5m2J42J10r8M3n86P67N4n68K12J55
4894A24k08O9K35j77L1j26L5j32m2J32j44R4R9J78j99k8J30j34j35P3l5P4K99
4917B13L7k11NO1p9j7P6l9j58O5P6M4q7J19p0n6j3K26m07L44j60J7J4l3J13P0
4943A50o4l6J59l18r2J28l7j88L95K07m12M42j52m44K77m1o1p3K98l11K43q5J6
4966AK47l48r0J95M20n79J87o1j8J53k72j89M88N9J15l42k25K69J49k24j45K88
$$ plain form
4988 78 -258 112 -68 78 95 189 -260 -108 -230 -125 122 337 1 308 241 -132 27 189 197 160 -129 -133 -158
5011 -158 113 -35 -192 79 -80 135 -218 110 -89 -219 207 73 -146 -267 -9 -20 -130 -11 201 -14
5031 -14 168 -116 315 107 -22 -73 -64 -63 -237 279 -70 -57 190 47 -2 -16 -99 9 -143 97 286 -209 -50
5054 -50 165 -165 192 3 -55 -178 -72 -146 112 -143 -170 154 14 -165 -71 113 102 47 13 120 118 145 158 -198
5078 -198 -80 -99 -157 -52 -79 168 -18 113 206 -217 55 85 142 95 -38 -78 62 134 134 0 152 166 -27 -394
5102 -394 91 -41 -281 190 43 -48 16 -111 58 -27 84 -185 238 89 -13 -5 95 103 162 215 25 1 -205
5125 -205 -31 -195 -38 -345 233 61 -165 179 -289 243 -75 323 115 101 128 -76 4 -131 280 149 250
5146 250 -19 -133 -135 20 125 130 -6 -205 181 -100 -136 29 -76 -61 39 -138 -74 74 -204 17 -119 132
$$ packed form
4988G8l36L70j80J46J7R4m49J52j22J05K47K15l36L07o7l73J59J62Ql7k89mk5
5011a58K71j48j57K71j59K15l53L28j99j30M26j34k19j21K58j1j10J19K12k15
5031a4J82k84M31k08j29n1RJj74N16l49J3K47j43m9j4q3J08j52K40J89m95J59
5054e0K15l30L57j89n8j23J06p4K58k55k7L24j40j79R4J84j1n5l4J07kK7J3l56
5078a98J18j9n8J05k7K47j86J31R3m23K72L0N7m7j33m0J40P2%j34J52J4j93l67
5102c94M85j32k40M71j47r1O4j27J69q5J11k69M23j49j02QJ00QN9N3j90k4k06
5125b05J74j64J57l07N78j72k26L44m68N32l18L98k08j4K7k04Q0j35M11j31J01
5146B50k69j14kJ55J05Nj36j99L86k81l6J65j05J5J00j77O4J48k78K21j36K51
$$ plain form
5168 132 -220 -132 15 38 70 -65 98 164 15 -121 -62 172 46 43 287 -34 -93 184 -132 81 120 48 179
5191 179 -43 -54 206 137 7 34 -21 -202 -46 357 194 -39 25 -119 -195 -95 1 39 -149 -3 107 -112 47
5214 47 72 137 -85 6 98 106 -219 203 184 64 156 262 -39 -265 -51 148 -174 -69 134 35 -392 145 -189
5237 -189 43 160 90 321 169 -27 271 194 -149 131 32 -333 43 157 -24 296 -24 -52 192 145 39 233
5259 233 -157 209 -94 -17 64 438 -67 155 200 128 29 312 8 -56 -126 -19 118 -164 -149 86 14 -142 -115
5282 -115 -18 42 -101 84 -31 123 -270 -44 91 105 118 23 79 52 -158 -7 -79 194 249 -62 74 -123 -156
5305 -156 -18 -29 200 -28 198 -35 -55 -58 34 -78 111 -77 -110 108 66 -159 -208 -63 289 42 -81 58 38
5328 38 -111 243 -140 -37 217 -117 33 156 180 -306 -41 46 22 226 15 -29 79 23 201 46 36 74 118
$$ packed form
5168A32l52Q8J47K3L2j35J63O6j49j36N9K34j26lK44l21n9K77l16K13L9p2J31
5191A79k22j1K60o9j30K7n5j81J56M03j63k33O4j44p6J00R6L8j88J46J10k19J59
5214D7K5O5k22R1R2Ql25M22j9j20R2J06l01k26K14J99l22J05K03r9m27N37l34
5237a89K32J17p0K31j52j96K98p7l43K80r9l65L76J14j81L20l20k8K44m7j06J94
5259B33l90L66l03P7Q1L74n05K22M5p2r9K83l04o4p0J07J37k82J5K35p2j56K7
5282a15R7O0j43J85j15J54l93K26J35J4J3r5N6k7k10J51p2K73N5l11J36j97l3
5305a56J38j1K29k28K26k33k0lR2j12J89j88l3K18m2k25m9J45L52k47j23J39k0
5328C8j49L54l83J03K54l34J50J23K4m86K65Q7k4K04k11m4J08n6J78j55j0L8M4
$$ plain form
5351 118 -24 200 235 -6 12 2 144 124 104 18 16 211 -18 -61 50 301 214 -145 58 -70 -142 9 288 -89
5375 -89 215 10 -62 110 36 129 65 156 -8 -262 -83 100 177 119 53 84 13 -8 -65 39 -133 -212 2 -354 8
5400 8 92 -202 -120 -10 -117 45 123 -117 69 -134 1 195 231 -48 -272 90 -65 -365 -106 18 65 88 120
5423 120 276 134 57 -57 -15 153 53 132 -73 118 66 47 225 161 -156 27 136 -96 -139 -243 263 53
5445 53 31 -34 -73 -219 137 -88 3 99 -115 -107 15 51 25 -2 218 88 215 -80 -91 68 -84 -106 -177 26 -41
5470 -41 46 134 -62 252 61 -79 251 127 18 45 125 -14 -4 100 -26 152 134 -107 56 40 41 20 -98 -220
5494 -220 53 -121 19 -27 4 -30 67 -65 -128 108 -20 -33 224 -156 -72 224 53 20 -101 97 -36 -76 -34
5517 -34 -144 -34 -227 -107 -222 38 -183 160 37 -111 -81 -183 53 -360 97 -11 120 -25 -246 345 3
$$ packed form
5351A18j42K24L5k41J8j0J42k0k0q6kJ95k29m3J11K51q7l59K03j28p2J51K79l77
5375h9L04k05p2J72p4R3o4R1j64k54J79J83P7n8o6L1p1k1n7J04j72p9K14l56L62
5400HQ4k94Q2J10j07J62P8k40J86k03J35J94L6k79k24L62j55l00K59J24M7K3L2
5423A20J56j42p7j14M2J68j00P9k05J91n2j9J78o4l17J83J09k32m3j04N06k10
5445E3k2o5l9j46L56k25R1R6k14QJ22L6k6k7K20j30J27k95j1J59j52k2p1K03o7
5470d1Q7Q8j96L14j91j40L30j24j09K7Q0j39J0J04j26J78j8k41J63j6Jk1j18j22
5494b20K73j74J40m6L1l4R7j32o3K36j28j3K57l80Q4K96j71l3j21J98j33m0M2
5517c4j10J10j93J20j15K60k21L43j23j48L0j02K36m13M57j08J31j45k21N91l42
$$ plain form
5538 3 -155 20 -116 -82 149 117 177 6 38 -141 212 124 114 -142 -5 -14 -124 -14 17 8 -278 106 -173 -190 -44
5563 -44 195 -149 106 248 36 58 -2 52 -8 -9 48 32 92 -193 -115 160 -27 41 -42 -196 -231 -56 194 101 -181
5588 -181 -158 -5 -42 -24 159 16 -97 -92 53 60 87 -280 13 254 -86 176 337 -19 -276 75 218 -12 -34
5611 -34 -134 -200 324 -92 -254 -156 244 -230 65 175 -44 -332 -201 -70 138 124 121 -220 -170 -43 125 -252
5633 -252 126 16 5 84 139 87 -24 42 -126 277 68 93 65 -74 -77 -93 -224 -75 97 102 -380 55 13 -204
5657 -204 66 20 -35 -179 -263 -48 31 -78 19 43 22 -237 58 -156 12 4 -49 -175 8 -123 -193 -136 -291 -36
5681 -36 90 -122 25 -91 -220 122 -203 -65 41 -127 -75 -5 -66 27 302 7 76 -31 -428 -250 -106 -206
5703 -206 -49 296 -64 -192 -3 -27 -25 -89 -144 -5 54 -91 25 -20 -349 -188 -91 -25 88 14 -258 -188 -103 82
$$ packed form
5538Cj58J75j36L4K31l2O0j71L2j79L53q8j0k56J37rj10J10L1rk86L84k79j7J46
5563d4K39l44K55J42k12K2o0N4o0jN7j6O0k85P8K75j87O8q3j54l5J75K50r3k82
5588a81K3J53l7J8J83j43j13NJ45PK7l67K93K41l40K62J61l56k57L51J43k30k2
5611c4j00o6N24m16j62R8M00m74K95J10k19k88J31J31K08j4ll41N0J27J68l77
5633b52L78j10j1P9N5n2j11O6j68M03k09K5k8j39lj6j31J49J72Nm82M35m2k17
5657b04K70m6n5j44q4K15P9j09R7K4k1k59K95k14J68qn3j26J83j31p0N7j55K55
5681c6J26k12J47j16j29L42l25J38J06j68N2P0o1R3K75k95O9j07l97J78J44j00
5703b06J57L45l60j28J89k4Ko4n5J39N9j45J16m5l29J61R7O6J13p4k72P0Q5J85
$$ plain form
5727 82 69 -2 208 27 259 -28 86 89 -79 -120 114 -138 -102 310 -67 125 -69 111 184 4 -196 315 -156
5750 -156 73 -62 -205 227 131 -19 -65 19 -130 306 50 80 -114 -150 -34 -43 -163 -288 18 132 -163 25
5772 25 -45 -5 -162 -100 17 -219 273 -192 47 69 -22 -141 482 -24 278 24 -33 33 -284 -256 -43 47 -114
5795 -114 -368 -110 -168 62 55 2 -74 -95 -29 109 -79 60 12 32 96 177 117 46 -111 38 -347 -90 -92 -16 60 4
5821 4 -22 -125 88 14 -13 -50 158 379 74 53 63 169 -99 14 -171 117 85 -95 60 131 39 -25 183 -22
5845 -22 -22 107 -27 -190 -130 47 340 111 -205 87 80 61 77 41 -211 -128 72 -64 -59 -24 31 87 -87 69 26
$$ packed form
5727H2j3p1K10j81K32k87J14Lj68m1K34k52L6M12l77J92j94J80P3j80k00N11m71
5750a56K29j35j43M32r6j50m6Q4j49M36k56L0j94l6J16rj20j25L06J14k95J88
5772B5p0M0j57O2J17k36M92m65K39K2r1j19O23n06L02k54n7O6l17K8K13R0j61
5795a14k54K58n8K30pn3p6k1O6J38j88J39m8K0O4Q1o0p1j57J49l85K57kP6P6n6
5821Dk6j03K13p4k7l7K08K21l05k1J0J06k68J13j85K88l2j80J55P1r2o4K08k05
5845b2%J29j34j63O0J77K93k29l16K92pj9J6l6k52Q3K00j36NL5N5N6j74J56m3
$$ [...]
8191f5
##END NTUPLES=NMR FID
##END=
