##TITLE=1H_Pr DMSO-d NCS
 DMSO
 8 sc, 
 16.02.2022
##JCAMPDX= 6.0         $$ Bruker NMR JCAMP-DX V2.0
##DATA TYPE= NMR FID
##DATA CLASS= NTUPLES
##ORIGIN= UXNMR, Bruker Analytische Messtechnik GmbH
##OWNER= root
$$ XWIN-NMR		Version 3.5
$$ Wed Feb 16 12:20:59 2022 Russian Standard Time (UT+4h)  she@DPX200
##.OBSERVE FREQUENCY= 200.131346
##.OBSERVE NUCLEUS= ^1H
##.DELAY= (6, 6)
##.ACQUISITION MODE= SIMULTANEOUS
##.ACQUISITION SCHEME= undefined
##.AVERAGES= 8
##.DIGITISER RES= 18
##SPECTROMETER/DATA SYSTEM= spect
##.PULSE SEQUENCE= zg30
##.SOLVENT NAME= DMSO
##.SHIFT REFERENCE= (INTERNAL, DMSO, 0, 15.7039)
##AUDIT TRAIL= $$ (NUMBER, WHEN, WHO, WHERE, WHAT)
$$ ##TITLE= Audit trail, XWIN-NMR		Version 3.5
$$ ##JCAMPDX= 5.01
$$ ##ORIGIN= Bruker BioSpin GmbH
$$ ##OWNER= she
$$ F:/spectra/data/she/nmr/H-F/1/audita.txt
$$ ##AUDIT TRAIL=  $$ (NUMBER, WHEN, WHO, WHERE, WHAT)
(   1,<2022-02-16 12:19:33.53 +0400>,<she>,<DPX200>,
      <created by zg, POWCHK disabled, PULCHK disabled
       configuration hash MD5:
       00 E9 B6 7A A2 85 ED C7 34 08 36 98 17 FE 4E 26
       data hash MD5: 16K
       8E DE 79 0E AD AE E8 47 66 1F DB 2A 59 4C 0B 19>)
$$ ##END=
$$ 
$$ hash MD5
$$ 9E F1 B1 55 2D E1 3B 1E 07 01 43 4A 2C F1 34 24
##$RELAX= 
##$RELAX= 
##$RELAX= 
##$RELAX= 
##$RELAX= 
##$RELAX= 
$$ Bruker specific parameters
$$ --------------------------
##$DU= <F:/spectra>
##$EXPNO= 1
##$NAME= <H-F>
##$PROCNO= 1
##$TYPE= <nmr>
##$USER= <she>
##$AMP= (0..31)
100 100 100 100 100 100 100 100 100 100 100 100 100 100 100 100 100 100 
100 100 100 100 100 100 100 100 100 100 100 100 100 100 
##$AQSEQ= 0
##$AQ_mod= 1
##$AUNM= <au_zg>
##$AUTOPOS= <>
##$BF1= 200.13
##$BF2= 200.13
##$BF3= 200.13
##$BF4= 200.13
##$BF5= 200.13
##$BF6= 200.13
##$BF7= 200.13
##$BF8= 200.13
##$BYTORDA= 1
##$CFDGTYP= 0
##$CFRGTYP= 5
##$CHEMSTR= <none>
##$CNST= (0..31)
1 1 145 1 1 1 1 1 1 1 1 1 1 1 1 1 1 1 1 1 1 1 1 1 1 1 1 1 1 1 1 1 
##$CPDPRG= <>
##$CPDPRG1= <>
##$CPDPRG2= <>
##$CPDPRG3= <>
##$CPDPRG4= <mlev>
##$CPDPRG5= <mlev>
##$CPDPRG6= <mlev>
##$CPDPRG7= <mlev>
##$CPDPRG8= <mlev>
##$CPDPRGB= <>
##$CPDPRGT= <>
##$D= (0..31)
0 1.2 0 0 0 0 0 0 0 0.06 0 0.03 0 0 0 0 0.0002 0 0 0 0 0 0 0 0 0 0 0 0 
0 0 0 
##$DATE= 1644999572
##$DBL= (0..7)
120 120 120 120 120 120 120 120 
##$DBP= (0..7)
150 150 150 150 150 150 150 150 
##$DBP07= 0
##$DBPNAM0= <>
##$DBPNAM1= <>
##$DBPNAM2= <>
##$DBPNAM3= <>
##$DBPNAM4= <>
##$DBPNAM5= <>
##$DBPNAM6= <>
##$DBPNAM7= <>
##$DBPOAL= (0..7)
0.5 0.5 0.5 0.5 0.5 0.5 0.5 0.5 
##$DBPOFFS= (0..7)
0 0 0 0 0 0 0 0 
##$DE= 6
##$DECBNUC= <off>
##$DECIM= 32
##$DECNUC= <off>
##$DECSTAT= 4
##$DIGMOD= 1
##$DIGTYP= 9
##$DL= (0..7)
0 120 120 120 120 120 120 120 
##$DP= (0..7)
150 150 150 150 150 150 150 150 
##$DP07= 0
##$DPNAME0= <>
##$DPNAME1= <>
##$DPNAME2= <>
##$DPNAME3= <>
##$DPNAME4= <>
##$DPNAME5= <>
##$DPNAME6= <>
##$DPNAME7= <>
##$DPOAL= (0..7)
0.5 0.5 0.5 0.5 0.5 0.5 0.5 0.5 
##$DPOFFS= (0..7)
0 0 0 0 0 0 0 0 
##$DQDMODE= 0
##$DR= 18
##$DS= 0
##$DSLIST= <SSSSSSSSSSSSSSS>
$$ [...]
##$SUBNAM2= <"">
##$SUBNAM3= <"">
##$SUBNAM4= <"">
##$SUBNAM5= <"">
##$SUBNAM6= <"">
##$SUBNAM7= <"">
##$SUBNAM8= <"">
##$SUBNAM9= <"">
##$SW= 18.0517287032376
##$SWIBOX= (0..15)
0 0 2 0 0 0 0 0 0 0 0 0 0 0 0 0 
##$SW_h= 3612.71676300578
##$TD= 16384
##$TD0= 1
##$TE= 0
##$TE2= 300
##$TE3= 300
##$TEG= 300
##$TL= (0..7)
0 120 120 120 120 120 120 120 
##$TP= (0..7)
150 150 150 150 150 150 150 150 
##$TP07= 0
##$TPNAME0= <>
##$TPNAME1= <>
##$TPNAME2= <>
##$TPNAME3= <>
##$TPNAME4= <>
##$TPNAME5= <>
##$TPNAME6= <>
##$TPNAME7= <>
##$TPOAL= (0..7)
0.5 0.5 0.5 0.5 0.5 0.5 0.5 0.5 
##$TPOFFS= (0..7)
0 0 0 0 0 0 0 0 
##$TUNHIN= 0
##$TUNHOUT= 0
##$TUNXOUT= 0
##$USERA1= <user>
##$USERA2= <user>
##$USERA3= <user>
##$USERA4= <user>
##$USERA5= <user>
##$V9= 5
##$VALIST= <valist>
##$VCLIST= <CCCCCCCCCCCCCCC>
##$VD= 0
##$VDLIST= <DDDDDDDDDDDDDDD>
##$VPLIST= <PPPPPPPPPPPPPPP>
##$VTLIST= <TTTTTTTTTTTTTTT>
##$WBST= 1024
##$WBSW= 4
##$XGAIN= (0..3)
0 0 0 0 
##$XL= 0
##$YL= 0
##$YMAX_a= 36567
##$YMIN_a= -33642
##$ZGOPTNS= <>
##$ZL1= 120
##$ZL2= 120
##$ZL3= 120
##$ZL4= 120
##$ABSF1= 10
##$ABSF2= 0
##$ABSG= 5
##$ABSL= 3
##$ALPHA= 0
##$AQORDER= 0
##$ASSFAC= 0
##$ASSFACI= 0
##$ASSFACX= 0
##$ASSWID= 0
##$AUNMP= <proc_1d>
##$AZFE= 0.1
##$AZFW= 0.1
##$BCFW= 1
##$BC_mod= 2
##$BYTORDP= 1
##$COROFFS= 0
##$CY= 11.3945322036743
##$DATMOD= 1
##$DC= 2
##$DFILT= <>
##$DTYPP= 0
##$F1P= 2.36226072786647
##$F2P= -0.459571619588291
##$FCOR= 0.5
##$FTSIZE= 0
##$FT_mod= 4
##$GAMMA= 1
##$GB= 0.15
##$INTBC= 1
##$INTSCL= 1
##$ISEN= 128
##$LB= 0.24
##$LEV0= 0
##$LPBIN= 0
##$MAXI= 10000
##$MC2= 0
##$MEAN= 0
##$ME_mod= 0
##$MI= 1.114404
##$NCOEF= 0
##$NC_proc= 0
##$NLEV= 6
##$NOISF1= 3.799351
##$NOISF2= 2.8
##$NSP= 1
##$NTH_PI= 0
##$NZP= 0
##$OFFSET= 15.70392
##$PC= 1
##$PHC0= -16388.36
##$PHC1= 12.20078
##$PH_mod= 1
##$PKNL= yes
##$PPARMOD= 0
##$PSCAL= 0
##$PSIGN= 0
##$REVERSE= no
##$SF= 200.130013532006
##$SI= 16384
##$SIGF1= 3
##$SIGF2= 2
##$SINO= 400
##$SIOLD= 16384
##$SREGLST= <1H.CDCl3>
##$SSB= 0
##$STSI= 0
##$STSR= 0
##$SW_p= 3612.71676300578
##$SYMM= 0
##$S_DEV= 0
##$TDeff= 0
##$TDoff= 0
##$TI= <>
##$TILT= no
##$TM1= 0
##$TM2= 0
##$TOPLEV= 0
##$USERP1= <user>
##$USERP2= <user>
##$USERP3= <user>
##$USERP4= <user>
##$USERP5= <user>
##$WDW= 1
##$XDIM= 8192
##$YMAX_p= 0
##$YMIN_p= 0
$$ End of Bruker specific parameters
$$ ---------------------------------
##NTUPLES= NMR FID
##VAR_NAME=  TIME,          FID/REAL,        FID/IMAG
##SYMBOL=    X,             R,               I
##VAR_TYPE=  INDEPENDENT,   DEPENDENT,       DEPENDENT
##VAR_FORM=  AFFN,          ASDF,            ASDF
##VAR_DIM=   8192,          8192,            8192
##UNITS=     SECONDS,       ARBITRARY UNITS, ARBITRARY UNITS
##FACTOR=    0.0002768,     1,               1
##FIRST=     0,             0,               0
##LAST=      2.2672688,     0,               0
##MIN=       0,             -33642,          0
##MAX=       2.2672688,     36567,           0
$$ Real data points
##PAGE= N=1
##DATA TABLE= (X++(R..R)), XYDATA
$$ [...]
180B284n841O4N899J417m210l305L713J933j254l38j193j46M81K328k32l638M17
197a621K445J329k402j920K385R34q92j622J335J291k115J07J284N34j622p00
213a250K209k39q67p19P55J348j450m34M82R73n15j216J098N0l34J1J22N8n98
232e16R46m87k58R92p49n62J56J964o67k893J169K617J18l301q28L544P95k292
250b52j716J901J402j438k41K38n4j80P76M34j798M44J248m81o60K34Q35j327
268f35qJ842n62j743K1K415j24k489L18J924M3k201M33K080j114j298Q36J503
286A241j150j440J573M34p53j36K92k31k39J319n14j651O88J870k96k480N26K178
304A231l31j833j41K093l80j531P75P87o27r90J170O86j444n0R44l8o76L28M81
$$ y = [2284, -3557, -3493, 2406, 3823, -387, -3692, 21, 1954, 700, 362, -831, -977, -496, 1832, 1600, -2038, -1621, 824, 2153, -249, -2169, 216, 1150, 258, -1364, -29, 1262, -853, -746, 538, 1072, -550, -1250, 959, 720, -147, -866, -111, 1237, -213, -647, -165, 808, 293, -923, 175, 225, -109, -98, 24, 82, -516, 430, -57, -315, 677, -72, -634, -478, 1486, 819, -2074, -905, 1712, 1830, -1471, -2299, 1245, 2040, -252, -1968, -67, 1335, -103, -344, -106, -160, -340, 436, 870, -928, -484, 764, 283, -377, -143, 692, -635, -643, 1199, 637, -1106, -1085, 1330, 1206, -1283, -965, 959, 1002, -1199, -766, 1314, 200, -1098, -262, 1241, 91, -1349, 224, 658, -95, -231, 61, -170, -409, 910, 396, -1255, -567, 1303, 1007, -1473, -947, 1231, 900, -933, -1074, 1019, 639, -892, -117, 670, 43, -947, 223, 909, -535, -585, 359, 321, -355, -27, 454]
323D54r31J89R37l21j164K69J621p25j223M61J147j61j369N79Q84n91o41N42P27
342F84r11l46J017q6o94Q1O78m64m22P96j77n49J32Q54k91j049N98O92k59p38
362d54J24Q37m70l91L83L04m03m40Q22J81p74p4M36K15m63L09j13n12N45N25l78
383B09q83L04R98k38n85k28K97L58p9J6k41k12R5O50J77r65k81N19N55j43n54
404b31r5n3P27M00r53n17M51Q94k85p99J37L48K08k63k5J51q0k56R5O49j69q10
426d76O5N25M00l15n86oL67N62m04n19K25J95N9k2J00l37j83N09K16k52m61J38
448b00L09J2p8j26Q4j39j96O09K86n95p80N71J061l81r65l0O79L52l67k03j73
469b70J98M8L17Q8o02m00M95Q04j73j083R5P84O4m26j0L24n52l67R86P67r62j564
$$ y = [454, -477, -288, 649, 328, -836, -567, 1054, 329, -894, -433, 714, 553, -816, -237, 647, 56, -585, -43, 684, -227, -573, 444, 358, -336, -255, 423, -41, -463, 333, 156, -393, -261, 593, 302, -747, -149, 543, 284, -454, -330, 507, 37, -354, 29, 333, -70, -510, 312, 493, -281, -355, 81, 296, -167, 142, 29, -483, 62, 587, 209, -674, -370, 628, 390, -195, -423, -126, 232, 153, 169, -72, -284, -189, 461, 638, -327, -608, -89, 466, 323, -231, -326, -379, 348, 748, -205, -722, -271, 623, 338, -461, -324, 24, 232, -31, -56, 95, 15, -241, -146, 503, 334, -476, -411, 114, 514, 199, -387, -393, -26, 536, 132, -387, -162, 33, 92, 70, 170, -167, -350, 159, 375, 123, -338, -200, 109, 121, 43, -83, 1, -138, -334, 275, 561, -34, -814, -243, 818, 437, -528, -558, 121, 473, 106, -97, -270, -72, -24, 293, 381, -221, -621, -126, 678, 505, -578, -483, 301, 365, -61, -71, 253, -299, -666, 320, 1087, 125, -1439]
491a439O71K061K55k262j186J858J731q02j968j78J471Q36m63j039m58P22P43
508E53L25q09r87J87J294O35j302j023P50J246j43j078j58M29M41j98l30J41o3
527i0r5K50K94k34n44J49N65l5k99l35K51M16p5n41o5P41K04p95m92Q17P06o31
549A62r36K72J006L48r71o57L71P45L77m05r25m30J251J222r29j811J37J884Q00
568A511j320j658M50J953M12j581j047P93J163J7n99n47r1N72N07J4p50p42N55
587c88J295l3j627l61J379P86j010o82O30J26k39L03J69n26m20P24O56o85p74
606f77K53J008q7r08j68P79K51n51k20L36J87n7k24q5J49J68j5l18R2J55o8Q0
628H0mj93j15M38K71n52m98M72P07l48p27J92N27Qm00J79Mk56J11L92ro00j13
$$ y = [-1439, -768, 1293, 1548, -714, -1900, -42, 1689, 887, -1081, -1259, 212, 1048, 585, -454, -912, -190, 553, 878, 69, -918, -731, 563, 1198, -104, -1127, -377, 869, 726, -352, -510, -81, 360, 162, -168, -27, -90, -185, 65, 359, 125, -419, -270, 295, 260, -39, -374, -123, 293, 218, -323, -388, 353, 557, -238, -730, 87, 793, 162, -774, -502, 504, 852, -119, -776, -405, 340, 717, 312, -613, -1043, 208, 1430, 501, -1310, -1173, 711, 1511, 191, -1467, -1017, 936, 1348, -233, -1280, -487, 676, 693, 94, -453, -544, 28, 535, 549, -201, -943, -388, 907, 874, -753, -1114, 265, 1051, 41, -641, -11, 115, -124, 179, 348, -178, -598, 126, 782, 97, -677, -424, 584, 497, -411, -579, 200, 451, -100, -320, 16, 203, 146, -78, -163, -14, 154, 139, -179, -87, 68, 0, 80, 76, -117, -232, 206, 477, -75, -573, -101, 606, 258, -469, -277, 250, 258, -142, 37, 41, -215, -104, 288, 279, -321, -434]
651d34O74K41n52l22K30L42Q1j20k83j85L13L84k74m28J40L58k1j68n4M1j04J34
673gK40j00l57K2L44J67l78o3J33%m1K15j22k51N3L07O7l32j20J87J22M4j30j79
697a79O5K06J23k14k52J77L65j20m03Q0L08m6k54N3K16j45n0J73n6m4j9M5L2j56
721i5R8N4J1p4k2O2l2m6N3Q7r0q8J28k4o1m3J51n3r0J60n9k19K05J19j19j56j5
748a58K08Q7j45r6N4J30M3j70m2P6lM7l3p1O6J33r2o2m5J04m1J8L8m7OJ5lL5q0
777b8O9j8K5Qj32R7K0k6q3J39p8q6J20P5j01m3P0Jk1j5J2q2N6J08p3l2nR4mr5
807b8l0M6P8o2m1N7L6q0K6P7o5q7P3N2r5pR0M4j22K5P1l8l8J7rO3k3m7K2JO1k8
839C9Op6k5R0N0j53QJ10m2m2O4J3k9q0J03Qp9L0k8L3k4RJ0L4j28P7MJ0l5L9M7
$$ y = [-434, 240, 481, -71, -393, -163, 179, 260, 140, -143, -328, -15, 369, 95, -333, -193, 165, 144, -24, -78, -37, -141, -7, 233, 133, -224, -202, 142, 309, -69, -132, 1, 1, -40, 175, 53, -198, -145, 162, 229, -103, -223, -36, 86, 130, 0, -179, -114, 92, 215, 1, -251, -74, 291, 171, -232, -152, 156, 110, -144, -91, 125, -20, -70, 103, 47, 3, -16, 29, 61, -95, 3, 57, 68, -6, -28, 34, 2, -44, 9, 96, 6, -82, 46, 22, -39, -82, 69, 16, -74, 86, 27, -192, 13, 132, 13, -143, -158, 50, 137, -8, -104, -50, 80, 123, -47, -89, -13, -16, 31, -2, -73, -7, 126, 34, -28, -73, 31, -10, 8, 46, -1, 5, 20, 17, 52, -28, 41, 23, 48, 56, -76, 21, 41, 15, -68, 71, -7, -93, 27, 102, 1, -42, 28, 29, 8, -7, 5, -77, -21, 87, 14, -18, -23, 71, 67, -28, -58, -12, 66, 4, -37, 20, 56, -24, 2, 79, 14, -73, 0, 52, -43, -50, 40, 84, -38, -13, 58, 20, -18, -1, -10, 53, 30, -17, 5, 6, 67, 39, 45, -31, -56, 34, 84, -69, -61, 49, 7, -35, 29, 42, 13, -67, 36, 44, -35, -5, -33, 0, -24, -15, -5, 29, -99, -22, -18, -8, -43, -4, 43]
870D3o5QN1n9o7J36Ln1j6M2L3m9l3K7m6k7J73J1j37j40J06K53q5k05LQ4P2l3N2
899H4j18p3J07K18k78j89J47K66n2k23O3N2N2n3P6j16ol6J67L6j76p0J14M5Nr
925C3p4j00R9K50j11l26J97J09n8k4OJ7n3M3J40l0k77N9J83N5j94r0K20J5j78
950h9P1J45j78r1J93P4q0j27O7n7J18J28k00j19J57J13p9j51RJ81r2o2J19P0j32
975a2j28J80J53k37j66K31J22j69l2J30n2k08J20L40j79l62J31L16N6l92rJ75
997HQ7pq0q8KJ50m8O3j88RJ11R2j4j17j38J92J36K3k69j49K30K25k40j31J25J22
1023A06j77M7R6j13j38K06J89j97k71J35L26k2l21j1L02o9j26o4P3qJ6O7l4j13
1047a01J10L6o7K0L6J6K1n9p7R1Qj8j1j1k8L8J03j46j68K22J28r4j72J30R0n9
$$ y = [43, -22, -14, 37, -22, -89, 47, 50, -1, -17, 25, 58, 9, -24, 3, -43, -70, 103, 114, -23, -163, -57, 196, 111, -94, -91, -7, 65, 32, 84, -34, -107, 0, 218, -60, -249, -102, 164, 112, -111, -48, 4, 56, 3, 79, -37, -43, -79, 88, 124, -52, -122, -8, 37, 42, 33, -41, -141, -42, 208, 97, -229, -32, 77, 19, -5, 1, 18, -35, 8, 148, 118, -159, -100, 83, 138, -56, -146, 74, 89, -89, -18, 127, -51, -142, 51, 125, 45, -82, -15, -72, 46, 174, -26, -145, 12, 125, 46, -105, -96, 85, -7, -69, 50, 120, -12, -140, 40, 193, -44, -210, 21, 143, -26, -58, 72, 20, -188, -68, 272, 93, -269, -138, 178, 234, -158, -167, 8, 95, 88, 8, -80, -78, 72, 24, 87, -101, -92, 19, 111, 97, -20, -158, 34, 170, 193, -76, -225, 5, 230, -10, -141, -16, 106, -71, -24, 72, -41, -179, 27, 216, 19, -252, -117, 209, 187, -134, -145, 157, 88, -38, -102, -29, -37, -21, 46, 12, -101, 9, 45, -22, -2, 34, 50, 71, 12, -65, 26, 34, 16, 5, -6, -34, 4, 107, -39, -207, 15, 143, 49, -123, 7, 97, 38]
1073C8j37J04k6q2J58M4j03j47J3K71M2k09o3J31K3r%p8j05J22J32j18j24M6J35
1098E8jq4k9j2K1Q7Mr0%N0J31m2k52J04J86q8j60J25J11j60r9K73Nl11K8K37m7
1125D5j36K2J27oj14O0P2j01k6R7Rj27o5K50p3j01K3J33l0j87P2J57j38k7R2M2
1151G0j14K4J17o2j58O3J81j07j18J11P1j44J2R2j2j03K7J76p7j24P2P1m8j12
1175i2J36oj15l8K47l5k07N8J87j11p9Q6O7j35n0K08r4j28K6J66rk17N9J88p3
1200C9j58J05Q3q4m6J10M4j60qK15j35j40J50L6qj36R4Q8j17k6J13j2l6j05J70
1225G6p0r2M3J32q7o7P8N3q2j02K09Mj90N5J27p3o6P7K7o4k0Q9l3p4J5J02Kj44
1253g5J2J55pj08J7P9o3q8R5L0p5l3J33k4j71J12L1K1j28P7N5k7m3N5Jo9K7L5
$$ y = [38, -99, 5, -21, -103, 55, 99, -4, -151, -138, 133, 175, -34, -97, 34, 57, 48, 48, -30, -135, -13, 119, 1, -123, -77, 58, 57, -27, -56, -68, -47, 40, 44, -46, -46, 4, 135, 93, -159, -55, 131, 43, -117, 8, 119, -41, -140, 133, 138, -173, -145, 92, 45, -91, -69, 58, 52, -62, -2, 70, -31, -57, 40, 49, -78, -143, 107, 34, -67, -44, 89, 59, -128, -56, 101, -37, -64, 28, 70, -44, -20, 97, 35, -123, -60, 121, 14, -104, 7, 78, -66, -54, 38, 26, -77, -50, 126, 49, -75, -3, 68, 20, -92, 44, 38, -77, -115, 132, 97, -110, -52, 135, 24, -55, 31, 98, -37, -87, 121, 27, -101, -75, 91, 82, -135, -76, 112, 39, -119, -14, 69, -15, -61, 49, 93, -67, -75, 140, 5, -135, 15, 51, 43, -93, 1, 89, -28, -54, 59, 47, 11, -94, 76, 6, -86, -43, 89, 2, -65, 13, 66, -16, -118, 91, 95, -95, -40, 87, 14, -52, 25, 52, -12, -32, 57, 24, -50, -35, 67, 69, -75, -63, 92, 85, -23, -6, 73, 10, -78, 17, 47, -28, -61, 72, 48, -123, -11, 20, 41, -87, -10, 45, 18, -25, 30, 31, -38, -11, 24]
1281B4l0l4l0J52m4j12O7M7l4l3RN7q9N9N6n0n9O1M5q3j5K9P4j10O5M0k9j27M7
1310d7P2Jn5k5J13n1r5P3J1O3r4M7J9j00J9N8k8K5r7J08L8q5L3J6L4q7M6k1K2
1339A3n1N3K8o1K1K6j8o2K8J09q1p1L7J4M4l4k3N3Lp4O6J7k8l4L7N5p3k4M9j0
1369Ij3m5M3m7N2J7K1k9jO7m1nJ4l5K3q9O2M2n4m0J03l5j13J02L7q4J1L7L8r8
1399e1l2R8K0q3N5l6jQN6Mm1m6J9N9l8LMM0nk5NJ5m6K7L7%j27J35N0q5k1J4L7
1432D9p2N8j2nk2k6Q6l8m9J2j2M8j1K5m3l7%O8Pm4k3mK5K9K2j1p2O6jK9j4m9P7
1465E6n8Km7N8k8qL5J7l9%N3j5n4PNM5o3m6J20q7K3kJ0O9l8l6O0p0O5k1l4j1N3
1498B1m7N4l6K7l7QN6m9j4n4J16j4q0j7J05j0m8k5N4l8L0k5j3L7m3M4j3O4q6J
$$ y = [24, -6, -40, -70, 82, 38, -74, -7, 40, 6, -27, -18, 39, -50, 9, 65, 15, -44, 17, 62, -21, -36, -7, 67, -43, 22, 62, 33, -94, -47, 25, 26, -29, -54, 59, 8, -87, -14, -3, 60, -34, 13, 32, -68, -49, 9, -19, 6, -91, 17, 55, -30, 3, 19, 53, -34, 12, -9, 13, -38, 15, 43, -18, 3, 29, 11, -51, -23, 86, 5, -66, -29, -15, 29, -5, -28, 25, 28, -46, 20, 37, 9, -25, 12, 67, -6, -30, 19, 9, -4, -49, -6, -53, -1, 16, 37, 8, 7, 74, 33, 28, 42, 7, 30, -59, 3, 45, -9, -49, 54, 19, -94, 8, 45, -39, -28, 9, 47, -51, -83, 15, 35, -48, 7, -29, -30, -22, 34, 38, -3, -49, -30, 29, -9, -6, -2, 38, 33, 8, 13, 28, -18, 9, 46, 46, -81, 54, 104, 19, -2, 12, 49, -23, 35, 23, 18, -4, -30, 56, 18, -31, -19, -31, 17, 6, 31, -12, -49, -49, 19, 26, -18, -41, -45, -20, 9, 31, 20, -52, 14, 13, 42, 28, -21, 56, -2, 0, -47, 11, -17, -25, 10, 27, -12, -12, 41, 26, -28, -21, -16, 29, -34, -80, 40, -47, -24, -26, -16, 53, 15, -21, 39, -31, 34, 13, -21, -32, 21, -26, 28, -8, 19, -18, -10, 46, -3, -17, -71, 45, 31, -49, -66, 39, 29, -19, -44, 10, -28, 2, -23, -36, 1, -42, 2, -11, 53, -33, -32]
1528c2J0P9p6RK8k5l5O6m3J4lJ9j5pO8n5m8M4L6q5M2K0j4K5o3M1lK1j3n2K3L8
1560A4n8M1nk5Q7o4K1p2L7L8n8N4o5L9L3j7j6L0l2k9R2j1l0J4J7pl1qK6N2p8P
1592dJ3m0N1n7NO2m3k4JP3j8k1Lm0O8or4J8J02m4j8mP7p7R7p5jk3J2%M7Rn9k4
1626c4pK7J0J1j2qK6j1ol3P1kn4l9J18j5m5JK9l5L6o9NJ3oJ3K6j7M4J4r1L2j8
1659b6L3n5L4Q3p0j2M5j6L1o6j3M3Qo2L9j2M2n4moM6J9l1mmO1m8j8N9J7j06JL1
1692a5N6o3Pj3L0L7r9M4kO6p9M9Mk5j6N2j1K7j2l9mL3o3M1K5Jk2pjK0m3R2j22
1725e2K6MJ2k7LN5k3Nj3K9k3N6n4JL9m1k9J8L4L5ln9L5l2L4n5QR6o3n7J8K1jL2
1759B9o8M0Mj3k1mK5M6o3J8M3j5j4l2j2N5kn9M8O1m3m0l6mP8k6kj0K5pk9K4K2
$$ y = [-32, -22, 57, -19, -10, 18, -7, -42, 24, -19, -5, -8, 11, -4, -11, 57, 2, -46, -2, 34, -51, -9, 11, -3, 22, -41, 0, -3, 18, 5, -47, -24, 14, -44, -3, -8, -33, 54, -10, 11, -61, -24, 14, -44, 10, -55, -16, 17, 0, -16, 14, -18, -47, 45, 34, 4, 18, 35, 28, -3, -11, 15, 67, -11, -4, 9, -31, 20, -37, -32, 30, -13, -37, -36, 37, 19, -2, 1, -39, 29, 23, -71, -53, 49, 5, -13, -17, 60, -17, 80, 5, 4, -19, -7, -7, 40, 49, -10, -34, -41, -14, -4, 7, -5, -13, 13, 2, -4, -37, 34, 32, -22, -61, 57, 42, -3, -2, 27, -8, 28, -41, -36, -23, -29, -16, 10, -7, 37, 51, -40, -8, -26, 7, -48, -14, 69, -1, -13, 32, 16, 47, -19, -32, 11, 19, -43, -4, -16, 26, -28, -32, -38, 8, 27, -4, -8, -12, 49, 1, -17, 42, 59, -47, -46, -15, 41, -22, -15, -28, 2, 39, -60, -16, -18, 48, -31, 18, 22, -3, -19, 33, 22, 49, 37, -2, -6, 27, -36, 5, 30, 31, 9, 2, 1, 21, -22, 70, -52, -26, -22, -10, -37, -34, 21, -2, 3, -10, 19, -4, 52, -2, -1, 38, -3, -32, -14, 20, 55, 52, -7, 28, -4, 30, -25, -17, 79, 16, -41, -23, -2, -3, 29, -39, 1, 5, -8, -29, -33, -8, 38, -25, -7, 36, 21, 7, -25, -37, 18, 16, -43, 5, 66, 23, -17, -53, -57, 21, -5, -7, -17, 8, 1, -28, -4, 18]
1792A8l6J2KN6m3k7K2j3O9o0L%K8l5oMJJ0L0j8Ppo3ML6J8k5kJ4Nk1J3l2M8J4l5
1828ik1j0M0K3o0J05k0p4L8j3L3m0L0m3LN3n3QJ6N7Ql0m4k3N4k8nLL3o4L2K7q
1861A8k9j3lM5Jm7J7Q5k0r1NL5O8q6j1J9N3o6J6J3M2o3n0O0k4O6j2o6N1M9q9L1
1893DjK0N5j01kM7j3r2M0N9J4o9J3Rk4N7Jl3P2j3m4kL8m4km2M1L9K3o4oL2K1k3
1927A0o2O7J6n2K1K5j5M1j50O0L6nKl6O2l0RK5l0K4J3m5K3Lk1j8K2K1%m4K2j0
1959a6L1k0j6J3N5o6K1m2P7q8M0lM1j5n0L3L2m1j7M5k6L2K5k3j5J8L8n5l4Q2L
1990E9m0k4J07j29J8L9k4J0M2o6M2k0J4n6N4Oj9M3j19O9K5P3j11p8J13K2p0J3
2018gQJ3j0k0Ok5K3k9mN0K2Qn0L1K4k1m8M6j6K1r8Q1J7j3Mm3R9rq8jNO5n1l6J09
$$ y = [18, -18, -6, -4, 52, 9, -18, 4, -9, 60, 0, 3, 3, 31, -4, -10, -6, -5, 5, 35, 17, 24, 17, -46, -42, -6, 12, -13, -15, -1, 4, -17, -4, -36, 12, 26, -9, -30, -40, 0, 23, -37, 68, 48, -26, 12, -1, 32, -8, 22, -21, -18, 35, -18, -10, 6, 63, 71, 41, -3, -26, 28, 0, -5, -2, 31, -33, -1, 26, 18, -11, -24, -27, 18, 19, -28, -11, 74, 54, -37, -32, 3, 71, -15, -26, -7, 46, -20, -4, 9, 51, -12, -62, -2, -26, 40, 28, -38, 13, 62, -27, 4, 3, 23, 78, -23, -25, 22, 9, -83, -43, 16, 30, -39, -26, -17, -41, 16, 17, -16, 56, 43, -1, -3, 35, -9, -11, -53, -12, 27, 50, -14, -20, 12, 33, 10, -52, 15, 31, -21, 0, 25, 10, 51, -99, -39, -3, -8, -6, -42, 20, -10, -1, 24, -6, 18, 31, -14, 9, 12, -9, -27, -5, 16, 16, -28, -6, -16, 15, -5, -21, -8, 47, -19, 2, -40, 37, -51, -11, -14, 27, 12, -38, -5, 27, -14, -31, 14, -12, 20, 45, 22, 7, 25, 63, 8, -26, 56, 59, 19, -5, 102, -27, -9, 30, 6, 16, 58, -8, 34, 14, 28, -28, 26, 32, 13, 56, -63, 6, 31, 104, -7, -85, 28, 50, -20, -7, 1, 14, 4, -16, -10, -35, -12, -41, -45, 5, 27, 35, -15, 16, 40, 19, -29, 17, 1, 22, -76, 5, 22, 9, 13, -30, 69, 60, -28, -29, -24, 41, -10, -46, 63]
2053F3l2n5j7j0J21o1M4j00N0qJ2l2QPl1J8M0O0q5L2r6Q5lQo8N0Rl3L3k6M4n6
2085b9J2K9K6j8K3n9KL0k5%n6J03J6r7J0N2J3l2k2J2N8m8lL8n5J8K9n9O0j2j9
2116cmmM2n9L5NL6q1MN9kk7Mn6J07k3n0L2N0j3j13K8J3N1n6j9K4M7J2k3l7POL0
2150B2l6oL0Qk7k6R2n3m1M8lO4j11K4L7k8m2P6m0K9%p3N5MK1m3M4l4o1O3m0O7
2182B0RppJ7l0L5j6k8M4J1n0j1M0k6L6n6L3m2L6PL9l8jK2n0pqN5m9j3L5M6k1l5
2216a0RO9m7q7P6j4J2m5K4N8n1K4j2n1L8J7%mK3k5lM3k5L3m1M0K0n7K4p4K9L4
2248B7o3QN2KK0p4J2N5n5M4j9j1N9k9q6N0N6l3j6J8l8J3K1o2Q0J8k1k7qj0P9r2
2280c0L7QJ0n5K9mmj7PK1qM7r7Q8l0nL4K0on1%K0Ol6J6p4J0N1Rj8LMJ7k6L7kk5
$$ y = [63, 31, -24, -41, -51, 70, 9, 53, -47, 3, -5, 7, -25, -17, -10, -41, -23, 17, 77, -8, 24, -72, 13, 10, 18, -50, 0, 9, -24, 9, -17, 27, -29, -17, 12, 38, 20, 43, -16, -14, 16, -9, -9, -65, 38, 54, -43, -33, 19, 32, 0, -22, -10, 48, 0, -3, 35, -20, -2, 27, -32, 28, 16, -3, -7, -11, 31, -28, 7, 12, 48, -33, -29, 30, 28, 1, 5, -51, 56, 33, -17, 15, 65, 52, -61, -33, -20, 31, -25, -44, -20, 27, 39, 16, -21, -14, -8, 22, -14, -20, 10, 18, -9, -35, 57, 4, -37, 11, 8, 72, -39, -15, 22, -6, -48, 28, -12, 17, 17, -56, -1, 3, 24, -19, 25, -9, -70, -7, -47, 20, 29, 22, 15, 32, 2, 37, 21, -7, 37, 48, -2, -13, 27, 1, 37, -19, 14, -28, 8, 15, 54, 16, 15, 37, -13, -20, -28, 27, -22, -35, 0, 46, 25, -10, -1, 68, 21, -66, 10, -4, 8, -37, -13, 45, -6, 18, 6, -45, -7, 10, 10, 6, 29, 4, 1, 44, 19, 52, 11, 51, 71, 14, 38, -36, -7, 27, -36, -28, 24, 26, 46, -28, -16, 39, -16, 28, 9, -2, 57, 28, -58, -8, 48, 15, -1, 17, -21, -8, 13, -49, 31, 49, 28, 1, -7, -17, 62, -30, 7, 15, 25, -30, -1, -5, -9, -26, -19, 2, -6, 41, -56, 32, 2, -3, 31, 51, 45, -6, -6, 14, 20, -16, 0, -74, -64, -13, -4, -22, -19, -15, 2, -24, 13, 11, -14]
2317a4j6P8k9j2Mqk8N6Ln3N5LK5o8k9J4k3P1l4L0J2m3j4qO5m4J3J2m9K7lN8p6
2350b5K6lJ9k4N1k4lm8L3L4k8J1J1J7j1m3K5l4N2n4J5J3l2j8Q3m9kLL6l9j0J0
2382hRl2J07q0K1l1M7m5koj1P6o6K1K1Pk5J4K3p1N3n4M6K0k4mqk3K2L6k9m9O3
2415A8J2j1K4l0l9MP2p1j2L4k2kj1N4k6Pk8J9qL0j0m3M9j4j3J3J3q1Q0j0Nk1K7
2448IKj6Nj7M5l9K4J7p0M7pj0L4p7J6P8k6Nj5NJ7kk8k9k1J05r1j2QL5Pj9o1N3
2482b8M0k4K2l8N9K4o1j4L5j7RMq7N9P1j7j2n0K4N6l0j12M9K9N9p0mJ1j3K8J6
2513A8j1k9J5PK6n2O8j9j6N9o2l2M4J0m1O0l3p0R1%k5L1m2Rk6K4KJ0rJ6M2j00
2545c5O1Nl3K9j4j5Rk3J3k4L3rJ2nm0L5N1q1N6k0j2M1o6N3j6J2n9M8Ok7K5J0n7
$$ y = [-14, -30, 48, 19, 7, 11, 3, -25, 31, 34, -19, 36, 39, 64, -4, -33, -19, -42, 29, -5, 25, 37, -6, -20, -28, 37, -7, 6, 18, -31, -4, -7, 51, -25, 1, -2, 17, -7, 44, 20, 17, -31, 2, 36, 8, 19, 30, 47, 36, -7, 18, -16, 36, -18, -3, 10, -22, -40, 43, -6, -8, -5, 31, -8, -18, -8, 1, -31, 76, -4, 17, -14, 33, -12, -14, -20, -31, 45, -21, 0, 21, 28, 3, 17, 40, -31, 22, -32, 14, 34, 10, 6, -2, -25, -3, 33, 4, -45, 18, 30, 19, 43, 13, -26, -22, 50, -21, -33, 1, -21, -23, -34, 20, -6, 1, -27, -8, -16, 14, 4, -39, 10, -4, -17, -4, 9, -72, 8, -2, 3, -18, 9, 11, -5, 0, -17, 28, -11, 13, 30, -40, 7, 0, -10, 24, -53, -37, 41, 15, 20, 5, 10, 27, 25, -3, -32, -53, 52, -39, -51, -43, -8, -1, -20, -81, -28, 12, -12, 10, -28, 31, 55, -6, -20, 15, -2, 7, 11, -76, -17, 54, 37, 25, -25, -1, 55, 25, -87, -38, -9, 50, -20, -24, -13, -26, 2, 18, 7, -22, -7, 0, 26, -26, 42, 23, 7, 66, 4, -28, 16, 26, -15, 45, 12, -58, 33, 33, 8, 39, -3, 6, -20, 4, 6, 16, 7, 23, 65, -35, 26, 31, -2, 27, 13, -2, 7, -16, -3, -27, 6, -3, 9, 4, -36, -1, 50, -31, 25, 5, -7, 34, -32, 21, 5, 17, -42, 6, 12, -15, 10, 20, -37]
2578c7N5NJ1o2L5L8m5j4k2M7m7O2k1o6O1k1ml6L1Lj6M1Rl6K3M0J5p2M2q1O3N8
2610E9k2o7LN5k7m8P2jk3J1J0qj1Ql2k8K4P1l7K2%l3J1o3O1K5J0n5J1m2QJ8K7
2643Ik9k3N4k0L0K1n4M4NL8j04N1k3l0K7Pj0K2k1k5L0K3rk8O4p1P6l2j7j7K2m4
2675c4oM7j6MN3n8M2l7RJ0j4J2l3J2j0M0o6O3jL8o7J2K7l6k7N5o5N1J9J0j3Pm7
2708a9oL7NK2o5L2O0r7M3%k6L6o2N7M1o9Rl2L7p3L7N7l6K1qRMnLrk6K5J8l8jN0
2744C1p6J2l7M6K6k8QL3Kj3MJ8j3j9OM4j5L4o9J4L1jo0J3J8k0L8m7L3jL1k7k9
2777a3N8l5m2O1k3K7l6l2M6Nn4K3M1p8L9J1N0o8mQPQJ9K4k8k5k7Q0m1k%j1jM1
2811B8p1K5J5k7K1K5J5Lk9K2k1QJ4l4jK1j7K5pk6M3k5j7J2%J0j6Mj0J5l1M0Nm5
$$ y = [-37, 18, 23, 34, -28, 7, 45, 0, -14, -36, 11, -36, 26, 5, -61, 0, -21, -25, -61, -30, -27, -43, -2, 7, -29, -6, 34, 49, -23, 19, -62, 1, 59, 37, -30, -27, 28, 1, -47, 25, 24, 1, 12, 22, 14, 3, 11, -21, -49, -25, 46, 9, 31, 31, -2, 9, -54, 7, 32, 42, -13, -2, -44, -36, -18, 9, -20, -43, 11, -9, 21, 42, -12, 32, 37, 75, -29, 22, -1, -31, -4, 3, -7, 15, -6, -31, -1, 22, 13, -15, 49, -22, 54, 22, 5, -12, 10, -34, -40, 7, -9, -5, 48, -10, 32, -5, 4, 14, 0, 12, -21, -9, -19, 21, -45, 18, 17, 55, -12, 0, 27, -9, -36, 19, -46, 5, 24, 34, 21, 28, -19, -25, 12, 17, 39, -26, 6, 66, -31, 12, 12, -14, 22, -40, 17, 58, -11, -2, -34, 3, -70, -33, 24, -12, 9, 1, 10, 14, 9, 12, 3, -23, 2, 20, -18, -19, 31, -45, -33, -70, -24, 2, -26, -18, 15, 17, 4, 8, 26, 13, -6, 0, 44, 29, 63, -6, 8, 39, 38, -22, -9, 9, -11, 27, -20, 13, 12, 43, 16, -13, 45, 10, -32, 29, 6, 33, -3, -35, 11, 16, -38, -15, 26, -52, -13, -2, 48, -20, -24, -16, -9, -1, 18, 42, 14, -11, -38, 42, 1, -1, -1, -12, -13, 28, -43, -18, -3, -30, -9, 16, 31, 34, 5, 27, 6, 14, 28, -6, -7, 14, -3, 22, 15, -11, 32, 7, -10, 2, 2, 12, -4, 0, -10, 5, -26, 14, 19, -26]
2845b6k4P5o3kM0pj0OJ4Rj7K6Km0K3K5l2poR5o1l5l8L2OK2O3q8M2l8J4rL5j7j8
2880ipJ3qL1nm5NN7K5o4Mk5j2N6k4j3M5k8K2l1N8r6M6O6n6j4J6k5L6%nRj3o2Q2
2915B9n2P0q7N9j4J7K2k8k1%k5M5k4J9k0j3N0n6K4k2M4k1l1P4p4l6P3l8L9J8o8
2946d7J02m0K2%j03J8LM2%LJ9k5Mj0k5J4j7N2j0k1pK8K2p2O6m2Lk0N5m2j1K8J3
2979BmmM2Mk3k9N4Nl2K4m9Lj5j9P8n0l1M1J7n8O1r4K9%J00o9J6kj7l0M6JKj3j1
3014b5k0OO4K0J4q1O4l0L9m4mJ4m4O7m7L9Jj5pPk0pL0l3J8l9lN0k0K7oRL6l2n1
3049b3j8M7J9n4M7L0q0K4K5L2pm0M9n6J0m2k7O9L6m6N8m7N8r4J2nM2k3L1o5O6
3080B8n2OK2m5M7J1l4J0j7nP2o4L5Lq0Q1j1n3L4L0o0k3Q2j8Qn9Q9mOm0p5J20n8
$$ y = [-26, -50, 25, -38, -40, 0, -7, -17, -11, 3, 12, -5, 21, 23, -17, 6, 31, -1, -8, -14, 81, 20, -15, -53, -21, -15, 7, 70, -18, 24, -14, 0, -9, 26, 9, -9, -16, -3, -11, 20, 15, -30, -25, 32, 57, -7, -3, -28, -40, 16, -8, -21, 24, -4, 18, -13, 45, -51, -5, 61, 5, -9, 7, -18, 18, 18, 13, 22, 9, -53, 29, -23, 47, -40, 19, 5, 22, 44, 16, -5, -5, -30, 15, -9, 10, -10, -23, 27, -29, -5, -27, 17, -4, -35, 39, -35, -71, 2, -36, 3, 21, -47, 55, 15, 37, 37, -66, -48, -45, -3, -3, 0, 19, -6, -2, -12, -37, -23, -40, 12, 2, -19, -26, 2, 24, -48, 18, -24, -21, -41, 14, -28, -39, -11, 2, -2, -6, 36, 40, 17, -12, 42, 47, 15, 39, -10, -7, -22, -41, 37, -13, -44, -3, 14, -44, 17, -77, -48, -48, 52, -17, -1, -3, -20, -50, -4, -3, -1, -14, -25, -45, -39, 25, 45, 59, -22, 42, 12, 51, 7, 3, 17, -27, 40, -7, 32, 33, 18, 11, 18, -2, -9, 21, -12, 6, -33, -36, 14, -6, 21, 15, 24, 60, 28, -23, -41, 6, 25, -29, 18, 48, -32, -8, 17, 49, 42, 2, 51, -5, 5, -37, -64, 5, 41, -5, 53, 6, 64, -30, -18, -23, 19, -4, 27, -38, 28, -24, -18, 4, -41, 6, 17, -17, -7, -24, -29, 43, -21, 14, 17, -63, 18, 7, -46, -12, 18, -42, -65, 17, -1, 7, -52, 37, 33, 39, -1, -76, 44, -14]
3113a4LJ2j4Q3q6M5k7J1km4N3L4r7L7Nm5M7J1l4M9l6j3N1p8j8R7o3J1N0n1J4L3
3145B4l0PK5k3J2RQJ2mn3k3j7P9o1N3l4k9O9%k5j9K3n2k3K7K5QJ4j3rK5m4L3J9
3179A3j9j1K4Rk0qR7n4j0L6o4Nj8L4l6M8k7j1JLk1L7M2q2K0N3M9j00j3rLL0M0
3212D1n3%mmKL6l2RQJ6l0L4J2l9pJ8l0j0N5pmn2N4rKJ9J9l6J7qk0lj7k9J6K6o
3249a6K1Q%J5k6K9l3J6K2p2Nj1M0m5L3L5K1l1k0lM6no7rO9k4l4M0p6J37j15Q1
3281C1j6j5J0r8Q2oOJ3j6k5Q9j18pJ4N6O7r3MM2o1J9M7J8m7oQl2K3n8J01n0k6
3313d4K2jj4K1P3n4Rl0P0n6j2P3l9N2j27L4L8p7K0L5q1R3J5k9L0K2q4N3m0R6o6
3344BL0k4n7M2Olqk5L3k7M5j2J7m1K9k1jK6p8N9J8j0l4l0%M9mJ1K6k0j3m0O6k2
$$ y = [-14, -11, 1, -13, 70, -16, 29, 2, 13, 11, -33, 20, 54, -43, -6, -1, -46, 1, 12, -22, 27, -9, -22, 29, -49, -67, 30, -33, -22, 28, -23, -9, 24, -6, 1, 26, 3, 15, 24, 32, 44, 40, -13, -36, -53, 26, -35, 18, -16, -45, 24, 24, -1, -20, 3, -49, -72, -45, -20, -12, 2, -11, -20, 5, -39, -6, 13, -6, -17, 7, 16, -4, -12, 85, 31, 21, 57, -7, -2, -20, 14, -22, 26, -1, -12, -11, -8, -29, 8, 50, -32, -12, 41, 90, -10, -23, -32, -29, 1, 41, -12, -12, -16, -20, -18, 18, -14, -5, 3, 19, -11, 23, 35, -4, -11, 7, -23, -33, 22, 15, 11, -41, 13, 4, 6, 25, 44, 8, 25, 17, -3, -6, -23, -52, -36, -10, -16, 5, 13, 13, 28, 2, 31, -2, 14, 36, -36, -31, -42, -2, -47, -14, 21, 42, 11, -9, -12, 34, 29, -38, -47, 22, -2, -36, 4, -72, 65, -50, 31, 15, 0, 10, -88, -6, -12, -6, 7, -9, -34, 55, -63, -70, -56, 0, 67, -26, -22, 20, -41, -22, 25, 43, -4, -10, -2, -34, -11, -69, 32, -18, -44, -22, -23, -37, -16, 57, 3, 12, -18, 52, -4, -16, 57, 18, 70, -57, -23, 15, -62, -42, -7, -88, 5, 20, -9, 21, 43, -41, 12, -28, 68, 2, 32, 8, -49, -7, -1, -4, -12, -37, -4, -31, 14, 2, 19, -22, 7, -14, -15, 11, -67, -8, 10, 0, -34, -64, -64, -15, -19, -8, 18, -2, -15, -55, 11, -11]
3378a1L5m1jK6Qm9KM1j4j3J0l1K9j8K1j2J0LK7M2o4L0kj7L5k8N7j01Pk7Q8k1K5
3411D6l4l3k4nmK2J2k6N6l9N5m9pK9j6l1O0l9kK2L9l9Oj3M5rk8O0m3Pm2J7M0o2
3445b9%P0j9j8J9q1LJ05o1k3k3P6rk3m3O7j7j6O2l4n9N4m5j2N2M3m3MK8n7mkN8
3478B3m9O1o2kQ6p1j2J02r0KJ2J0rk7K8Kl0L1j5Pm5M3k0N9n4L6l1M9J4l5Ml6O9
3511E0k8k0pl0Q8m1M9r5L6L3n6P9p5j1R8j39M4L2l3N9m8L7k7M9m3k5qnP7n5nN7
3543C7k7OJ3k4k1K6ooK7j7Oj9k6Q1o1k1L5JmL2rj1n3O6KJ7lm2L2ok6j1PMj2PL4
3580B8po5QJ3%k4N1L0mL8p0j0l%mj9L7PNj5n7O9L7j7l1nrk0O5m0K1mk8N5JNk5
3617A3l9J7N4p7N9J4J4l7n0J6J4k7lJM3l6M0l8O8q0K9k3qM5K1l0J4k5k8J0nO9
$$ y = [-11, 24, -17, -18, 8, 16, -33, -31, 10, -4, -17, -7, -38, -9, -27, -6, -18, -8, -5, 22, 64, 0, 30, 28, 11, 46, 18, 75, -26, -19, -46, 42, 21, 46, 12, -21, -45, -50, -54, -32, -20, -46, 10, -29, 26, -23, -30, -1, -17, -48, 12, -27, -29, -7, 32, -7, -1, -14, 31, 22, -6, 54, 11, 18, -24, -7, 33, -29, -29, 41, 22, 4, 23, -58, -55, 50, -11, -34, -57, 19, 10, -13, -56, 11, -6, -22, 40, 6, -53, 1, -44, -56, -4, 39, -4, 0, 28, -29, -33, -35, 23, -26, 35, -27, -29, 57, -14, -26, 76, -14, -12, 0, 10, 1, -26, 2, 4, -26, 5, -10, -3, -48, -5, -25, 34, -20, 16, -15, 34, 48, 13, 17, -19, 50, 22, 2, -5, -35, 53, 12, 61, -34, 2, 35, -21, 58, -17, -28, 70, -69, -25, 7, -26, 33, -15, 22, -5, 44, 1, -24, -32, -37, 40, -15, -20, 37, 10, 16, 29, 5, -16, 10, 4, -2, 25, 8, 14, -5, -31, 50, -11, -32, 3, 4, 0, 32, 23, 12, -41, 25, 27, 44, 41, -1, 31, 25, -1, -12, -5, -1, -13, -6, 28, 21, -44, -36, -23, -23, -47, 4, 34, 30, 68, -2, -12, -15, -15, -19, -38, -1, 6, 11, -4, -61, 8, 45, 28, -3, -8, -17, -37, 28, -12, 9, 5, -23, 32, 33, 38, 13, -26, -9, 45, -32, 27, 41, 55, 18, -32, -16, -2, -29, -32, -31, 12, -24, 16, -22, 46, -34, -5, -28, -36, 9, 30, 0, 14, -11, -39, -29, -34, 35]
3649C5m5K0oJ8n3N3n0j2O8M7n0k1o5O5j7L2j2k1mM8q6M7K5l1K1Nn8O0m2M8No1
3681c7L6J9n5J47j52P0mm9N2KK1k0k0k3J4j8O3n8K4n0J1PP6o3K3j2j9mM6l9KK5
3713A5m3k7P3Ml6kK9L9o1k0L9LJ6p0Q2l2k5J2pJ8M0jm0k8k3P3m6%LL2J3k6k8M
3747b0j3L8JJ6mj8PLL5q5J5lj8M1o5R8n6J02q1J2k9PN7l4k6O2l5j2Kl3N8K5j1
3780C6o9N9J1j3j5J5j4mjl6N4ooN7m5k7j7L2k1L1nM5k6m9Ml7K9L2m4N1q0R3m0
3813flM8j8k6L3j1k6M9r0O8j2l5LRO2n5qN8n5j7L4Pl1J3K5l1J2J0%k8N6j9rl1
3847b4Q9q2J7j5M5m6K6K3qm4%QJ06q1k7J6k2L8J7K1m3n0oP6n3k0JO1oL1n3J6l2
3880b1J7K6j9j9k3L1Jj6N2l4l1P2n8M6J6k4Lk5J8J0Ok1qPK5J4n4P3j02L7K4l1
$$ y = [35, -10, 10, 4, 22, -31, 22, -28, -40, 28, 75, 25, 4, -61, 4, -13, 19, 7, -14, -18, 30, -56, -9, 16, -15, 6, 11, -47, 13, -29, 19, 24, -37, -1, 18, -37, 110, -42, 28, 24, -25, 27, 29, 50, 30, 10, -13, 1, -17, 46, -12, 12, -38, -27, -20, 56, -7, 16, 4, -15, -19, 27, -12, -10, 15, -28, -55, 18, 22, -14, -16, 13, 52, -9, -29, 10, 13, 29, -41, 41, 9, -16, -4, -11, 7, 47, 46, 6, -22, -45, 28, -18, -18, -15, 17, 30, 4, -24, -20, -33, 5, 6, 22, 18, 0, 7, 10, 45, -40, -25, -28, -46, -5, -70, 28, -28, 74, -7, 5, -24, -17, 40, 6, -20, 42, 7, -5, -3, -36, 22, 47, 36, -33, 26, 37, 24, 9, 24, 10, 6, 5, -31, 23, 17, 11, 68, 23, -4, -21, 11, -10, 21, 16, 61, 35, -14, -10, -47, -18, 14, -30, 21, -59, 34, -6, -9, 39, 21, -5, 28, 17, -9, 40, -50, 18, 6, -29, -26, -17, 45, -10, -18, 40, -15, -32, 2, 9, -22, -9, 16, -15, -3, 7, 7, -21, 35, 16, 7, -24, 65, -17, 0, -15, 30, -16, 10, 33, 25, -19, -19, -11, 95, 14, -13, 3, -19, 19, 36, 57, 14, -36, -42, 34, -19, -39, -38, 23, 17, 48, -5, 11, -21, -4, 22, 3, -16, -39, -8, -7, -23, 29, -5, -36, 36, -22, 24, 40, 16, 19, -6, 12, 22, 28, 7, -1, 6, 31, 45, -9, 64, -38, -1, 23, -8]
3912hj4J6NJ3l8L4M9m4L2jk2%J2Nj3n4J01p4rL9p9O8j5k9K8J1l6M5n2N0j1j4o
3945a1M8p3M4Oj1n7K6PN0q3N8O2o7J2LK3k0n6RJ8N2l9j0lM9l1K9po4N8l3JJ1L1
3979C2Ko7J7j2j6N9Qk9k1J2qNL0m8Q3k5Mj7rk7O1q7K0O3m8J9J3mL4l1L9o5k8P1
4013C0l2L1j02N8O6k7n8N9j0o1L4k9M3K6n6L4k5O6n0P7q7l6P1qj9k0R2p7pM6l4
4044eK9k3J3oK1J5n4K2p1O6ML5p3O5L0n6J3j6o1M2k0L0l5N0j4m2m2J05l1k7K9
4075gM1j7j9j5m3M0M9j7oqN2p2l1P3m3kN7k5K4m6N8j1rnLl0O0m4j6k3K0J%pm5
4110f3M9J5J0l8M7n8M7k5J7j4Nl5N0qnk3O5l4rj9jQO9Kj01Q8k2j9j8J9OL0l9J8
4144A4k6J5L4o1K8JK1p4M1M5o1J2K7j3lN7m2oL5p9J7QJ3k8K3OJ1PM5j15J9M9J1
$$ y = [-8, -22, -6, -1, 12, -26, 8, 57, 13, 45, 44, 22, 22, 34, 39, 26, -28, 73, -1, -10, 29, -50, 18, 3, -26, 2, 13, -23, 22, -30, 20, 9, -5, -11, 37, -36, 8, 14, 3, -54, -28, -21, 29, -54, 4, 66, -1, 11, 14, 37, 17, -39, -30, -12, 40, 1, -9, -12, 37, 6, 35, 28, -36, 22, -11, -10, 1, 32, 34, -33, -16, -28, -44, 15, 23, -6, -27, -15, -23, -18, 12, -36, 47, 22, 26, 9, 0, -27, 34, -53, -33, 30, -18, 1, 14, 10, 44, 13, 52, -13, -41, 30, -2, 29, -73, -15, 51, 24, -34, 25, 15, -46, -12, -41, 2, 28, -28, 6, -19, 47, -3, 74, -13, -49, 22, 14, -5, -25, 67, -10, -17, 29, -5, 24, 1, 14, 8, 29, 44, -10, 12, -59, 7, 11, 46, -27, 38, 68, 12, 25, 9, -52, -10, -30, 0, -35, 15, 1, -41, -83, 22, -9, -36, -7, 34, 17, -2, -17, -60, -20, 29, 12, 6, -2, 50, -22, -53, 20, -23, -25, 32, 7, 31, -15, 43, 32, 23, 18, 21, -9, 51, 7, -9, -32, -12, -11, -11, -18, -63, -14, 1, 11, -27, 20, -38, 9, -16, 1, -13, -8, -43, 7, -1, -6, -29, 36, 2, -7, -26, -27, -19, 50, 52, -49, 39, 17, -2, -20, -1, 5, 35, -4, 14, -12, 3, 37, -24, 4, 5, 26, -48, -7, 38, -23, -11, 16, 3, 0, 57, 15, 9, 44, -35, -18, -10, 3, -25, -2, 4, 15, 22, 67, -48, -29, 20, 31]
4177C1j7k2k7OL3jK8k3L0p3RPk3L2K4k7K1o9M5J0m9N8Np6P4l0j2M4No6N4K6k2
4210E%LJ1J4n4M9n0n4R9mK8l8l9Q3m7n2L6qJ7Jk6rK0J8n2K7L4Mj0k6KPL6J5o5
4245b5L0o4N1j1RJ2QLl8N3o0K6o5O8k5J0O2j06L3M9jL1k2ok1j8N4k5k4K7mk9k0
4278c8N0Po4L7J7k2K4m3kN0k1j0mJ2JOJ0K1m1mJ6k4L8n6K7pMO5l3l9pKK2m7M7
4313fN6k6n4k2N3o0P3J6m4R2n8l9M5k3k0J2L6K3o4Mk3J3K3J3ml4j2J6J0KJ0k9
4345b1K9k9R3p5M1p1rM3n6O5K4p9N0Ml2k0K2j4j2R7p4RM7m2O7r6K4j1RLj2K7m8
4378d7j9Q4k5QK2j9J0Oj4oJ8K1l9j0Ok8nN6j7j8L0O3p8lM5j0n6K1lPjk0Nl2Q5
4413C7n4N9J3n4JRj6J0k1L6o7R1l7Lj2j8%j1J%Pmj6K9qj5M7J0l7K1M7n8j6OM2
$$ y = [31, 14, -8, -35, -29, 4, 3, 31, 8, 38, -35, -26, -19, -42, -10, 14, -13, 8, -61, -16, -6, -55, 3, 8, -68, 6, -24, -36, 8, 13, -53, 1, 27, 5, 5, 8, 19, 33, -21, 28, -22, -76, 23, 19, 47, 9, -30, 53, 6, -46, -10, -18, -1, 0, -26, -35, -15, 3, -49, -22, 12, 16, 6, -20, -18, -11, 25, 40, -25, 5, -59, -8, -19, -10, 2, 10, 13, -25, 28, -32, -6, -71, -3, -28, -18, 44, -62, -29, 20, 19, 50, 28, 22, 1, -17, 37, 12, -12, 15, 11, -18, -38, 12, 19, -45, -8, 9, -13, 11, -32, -34, 16, -5, -15, -19, -7, -6, 0, 10, 31, -10, -14, 2, -22, 16, -40, -13, -20, -16, 49, 16, -23, -30, -28, -6, -53, -6, 50, 24, -30, -52, 1, -59, 14, 30, -14, 78, 20, -19, 26, 3, -17, -5, 31, 54, -10, -6, -29, -16, 7, 20, 16, -18, -30, -14, -4, -2, 8, -21, 8, -21, 72, -3, 38, -33, -42, 1, -55, 10, 34, -45, 5, 9, -23, -43, -21, -35, -47, 50, -24, -15, 32, -10, 57, -39, -15, -26, -17, -14, -26, 1, -47, -66, 18, -7, 1, 23, 4, 14, 20, 6, 0, 18, 39, 0, -10, -4, -32, -37, 19, 2, -16, 14, 77, -1, -4, 41, 31, -25, -4, -7, 0, -1, -21, -16, -48, 37, -17, 42, 55, 1, 2, 11, -5, 5, -16, 20, -47, 44, 7, 10, -2, -20, -20, -31, -30, -30, -23, -27, -43, -14, -22, -37, 10, 20, -17, 4, 51, -7, -23, -17, 25]
4448B5j3Pj5k1N0n3o5N8K8QPJ4M0r4k1L2LM3K3r3N7k3J2m3pN7j9M2Rkn2M2k9R
4482A6%J4rokk5K0k5nJ3oK4K2p9O0l8lL3L1o5K9nJ4N7o6K3jl0K8K9o9O7o6M5l6
4517a1N7l9k8rN9K2m6k4qKJ04q2mN0p8N2l3J3K0%NlMk9K4lrl1P0n8K1k8K4k0k
4552a8PL3jn2M9J2ok9m7N1j4j5L5M1n5j5K9ll8j6M9J4nK6Jo1%M3j7K7J2l5M1p4
4586c1R3j04lJ6O8j9n6N6qm9N9l1j9J9j0mO6n1L7k9k9l4R6K0n4PPJ4k6JOL0o9
4619c1j2K9OnlJ7L0j4K9n6L0l1jj2J2J9l0j5nN5on3N5K7j0l5L1k9j9K9l6LRkr
4654c3KJ0L9m1L3m9rO4j5J7jo8N6M4l6L7Ol3k4%K7m5O0n7k5M7pm7J7JJ8j4K4N
4688Ck0PJ7j2k3L0k9M6j9l0J0M9n0M2o7M8l7M7j0M6n4j3O0oKJ0mk9nk4mK1j7O5
$$ y = [25, 12, 19, 4, -17, 33, -20, -85, -27, 1, 9, 16, 30, 70, -24, -45, -13, -10, 33, 56, -37, 20, -3, 9, -34, -41, 16, -3, 39, 48, 46, -6, 36, 7, 16, 16, 30, 21, 15, 13, -12, 8, -17, -22, -9, -15, 9, 31, -48, 12, -26, -29, 4, 35, -30, -1, -6, 8, 65, -1, 22, 21, -9, 19, 48, -21, 46, -20, 25, -11, 46, 7, -21, -30, 29, 51, 5, -19, -27, -25, 79, -3, -7, 43, -35, 17, -16, -3, 17, 17, 22, 19, 23, -6, 18, 15, 6, -25, 45, -13, 8, -20, 4, -16, -18, -11, 22, 21, -31, 18, 30, 24, -5, -52, -1, -15, -30, 5, 46, -9, -24, 5, 2, -36, -52, -3, 11, 6, 32, 33, -28, -28, 15, -2, 25, 37, 2, 43, -31, 62, -42, -45, -29, 39, 20, -36, 20, 12, -37, 22, -9, -28, -9, -19, -23, 43, -8, 29, 0, -29, -63, 33, 53, -1, 6, 13, 27, 1, 2, 8, 38, -31, -43, -14, -8, -13, -16, 1, 31, 17, 46, -10, 20, -11, -12, -24, -12, 7, -23, -38, -43, 12, 6, -47, 8, 35, 25, -10, 21, -8, -27, 2, -34, -31, -22, -24, -33, -31, -21, 18, -23, 10, -39, -48, 16, 1, 18, 17, -51, 5, 49, 13, 50, 56, 23, -1, -1, 26, -19, 41, -16, -41, 6, -1, -48, -31, -30, -12, -26, -2, 3, -17, -10, 7, -5, -28, 2, -27, 19, 0, -30, -20, 29, -21, 21, -46, 2, -35, 12, 2, 48, -6, -19, 41, 35, 37, 47, 43, 14, 9, -15, -19, 2, -15, 50]
4722E0m7%K2l0k6L7k9J2Om9L9QJ8j5m8mR2n7Ml2K9n1J26Lo9K2Pm3K6OK5n8J12
4755H6q4Ol2pN2rk9K8k8L5k6l4N7q4N3O4q7Q8o1M0m8qM3q5N1L5J1m3M2n4nj9L9
4788a3k9L1Kj9O9j5l6JJ9n5N4j3l0N9Qo8M5k5J2m5J6J9L3o3J1J00j02K2oK5m4
4819c7j7N6l2K3OKj2j8P6k6jM5p0J5Kn9J45j28O9p1K2rK9J1l4Jjk3pJ4JK0J7j6
4853grM4k8Lj5qjrJ0M3l8M5j4KJ7k4j4K0N5n8l0J6J4lo6N4J9k8rN6p9O9l1L5k9
4888Bjk7RK2Kj4k3L5k4M6q1M9l1N0l4l8R0o6lO3l4j2K3M4o3N0o9O8o2L2L5k3k0
4921eJ7J2j8L0J8o1QOk3lK8k6J9L5m9M0m9K2k5K8J9l0j5K0j4KJ5l3N5m5L3k5j5
4954b9L2lJ1k5k2M4Jl1k6M4L2q2K3KPN2m2J4Lp2Q5r5Q9j5j1kK8Nm3L7%o9P6Rk4
$$ y = [50, 3, 3, 25, -5, -31, 6, -23, -11, -5, -54, -15, -7, 11, -4, -52, -56, 36, -21, -17, -49, -20, -71, 55, 58, -11, 11, 18, -25, 1, 7, 32, -26, 86, 2, 8, -24, -31, 21, 12, -17, 11, -17, 18, -8, -42, 15, -69, -16, 48, -39, 49, -12, 28, -20, -28, 15, -70, -19, 16, 27, -16, 26, -28, -33, -52, -13, -42, -11, -9, -28, 41, 26, -10, -9, 10, -45, 9, -4, -34, 25, 33, -35, 10, -15, -3, -48, -32, -13, 20, -43, -32, 68, -34, -12, -18, 7, -37, -54, 2, -30, -7, -1, 1, -11, -29, 47, 21, 20, 65, -5, 10, 12, -47, 98, -30, 39, -32, -10, -19, 10, 21, -13, -12, -13, -36, -43, -29, -28, -8, 9, -7, -16, 28, 0, 3, -12, -20, -21, -30, -20, 23, -15, 30, 16, 18, 35, 11, -3, 17, 72, 14, -16, 0, 14, 11, -55, -1, 18, -10, -19, 37, -42, 27, -4, 31, 2, 1, -26, -17, 5, 7, -7, -30, 5, -19, 27, -54, -5, -36, 14, -20, -58, 32, -34, -37, 26, -8, -20, 3, 47, -16, 34, -35, 33, -29, 3, 38, 15, -5, 12, 24, 6, 36, 54, -7, 1, 7, -16, -19, 9, -17, 2, 37, -12, 28, -21, 1, -24, 4, 23, -7, -22, -2, -16, -14, 1, -32, 23, -22, 11, -14, -29, 3, 0, 11, -14, -36, 8, 9, -22, -48, -4, 28, -54, -31, -29, -22, 30, -12, 2, 5, -67, 18, -77, 12, -3, -14, -16, 12, 17, -26, 11, 11, -58, 18, 27, 3]
4989Cj4j2J9j1K7JJ7m0k5PL2L7qj0m0N6n3j2J1L1k4j8J2m5M8L0K2n8qL1L9k6q3
5022f4O7J0l5mK1OJ8j9L5m6j4Q2q3J6N7r6L2M2Qm7j3N4k4L9k3r7O5J6m2K3Mj9
5054c1J4J1J2J5m0K5K1l6k0k0M7J3o3JR3r4O9nL7r8O7J2l6Om5P7n6O7q2Q4n0l4
5086c9L0n6Q4Pk5N9l2p8R4q1oP2k1j8k6L1n6K3RqK2mL5%j3j0K2k1j0Lj4Pj0L2
5120BK0l5L7o0N9l0J4O1n1k6K3k8K8j6J6lp0L6O8j1m1RJ6m5N3j06O1K8k1mj2M9
5152B1n3Q3j19P3K3o4L6NM4o1J7l1Q3m3rK6k5%k7J2L6k8L0p0J9jJ0k8K4J4J2l0
5184b1j8M1j0k2Q7j4l5pl0L8m4k4O3K2j1jl9MJ3JK5Ln8K1Lj4M8j5j2K5n2O3oj0
5218A4j5k5j2K4k4NM1J8p5J1L3Ol4L8k7O0n6m1N7L6k7Q1j04j1K7L4l5n1M6j1p
$$ y = [3, -11, -23, -4, -15, 12, 13, 30, -10, -35, -28, 4, 41, 33, 23, -17, 39, -14, -26, -15, 16, -8, -26, -14, -59, -11, 19, 41, -17, -25, 6, 45, 19, -64, 3, 13, -22, -26, -5, 1, 19, 0, 35, -11, -25, 57, -26, -10, 47, -49, -17, 25, 33, -14, -27, 27, 3, 42, 19, -78, -13, 3, -39, -16, -12, -31, -17, -6, 6, 21, -19, 6, 27, -9, -29, -49, -2, 11, -52, -51, 42, -52, 17, 12, 49, -49, 18, 30, -6, 0, -45, 32, -24, 43, -39, 45, -5, -39, -9, -65, 19, 26, 1, 60, 28, -50, 44, -37, -43, 29, 8, -10, -36, -5, -61, -38, -29, -37, -15, -19, 16, 16, 3, -7, 15, -6, -16, -13, -27, -20, -30, 2, 22, -13, 24, -36, 23, -7, 7, 68, 17, -9, 14, -14, 14, -2, 14, 11, -59, -23, 45, 34, -7, 2, 18, -27, 26, -80, -19, 9, -12, -16, -28, 21, -32, 51, -68, 5, 28, -36, 0, 5, 49, -12, 5, -26, 57, 14, 5, 31, 6, 6, -21, -9, 27, -1, 29, -41, -22, -23, -13, -41, -17, -3, 9, -21, -39, 2, -8, -30, 57, 43, 8, 1, -29, 9, -35, -59, 4, 26, 15, 14, -25, -21, -8, -7, 18, 21, -37, -16, -13, -27, 21, 6, -6, 19, -33, 30, 24, 14, -1, -26, -38, -14, -38, -33, 8, 26, -49, -38, -5, 1, -33, 5, -22, 38, -18, -59, -2, 34, 7, 88, -16, -27, 0, 34, -1, -52, -6, -17, -24]
5249b4P0rl0k2MM1l0J6P5o3l8j7K3n3P3j6l3O1J0j4o0K4M3j6nj1n6J4L5l5M9m0
5281c4K5j2J1L3p5P4L6n9K7k8J8L1m5rJ4nj4J2k7J5Q%L8o2L6n8M0O3q8n3J04J8
5313C4j8m1K0j0K8O1r4M7l3m2L8K7J0Jn1NJ3R0j07J8j5N3n1k9P3k7l7O9J2l5j7
5344hl8N5k6QN3j7jrk3JoP1o8n3Q8j5L1l3J9om0J6J1l4M7k9K2l1KL4j1J6j7l8
5378b9K9k8M4k0k9Jrk1M6L7m3L5l1j4JJ1L9L5k6k1m3O5Ln4L3kJ8j23J11l3pnJ9
5411a1%k7M0k3L7l1L2mj5j9j8K9pK2J2k7K2n9P9q2N6K3k1ll1j1l6P4j3j4O6r4
5443e4O1j5J9n2NN0K9n6M8j3m7M0o8L3PJ4j6OL3p8OP0Pn3PrQ0l2m8M8j0j3JJ0
5477A0o2P6kp1K5O4q6P2l6L5Pn8K2J2lj9KRJ0oQn2J8J5K5m0rL9K3k2j1L3o5N2
$$ y = [-24, 46, 37, 7, -15, -11, 30, 0, 16, 91, 28, -10, -27, -4, -57, 16, 0, -33, 28, 38, 24, -36, -12, 31, 15, 10, -1, -57, -43, -8, -43, 6, -34, -9, -21, -10, 23, -52, 22, 58, -1, 26, -2, 16, 47, 2, -7, 7, 2, -12, 0, -27, -12, -4, -4, 34, -28, 8, -50, -10, 53, -35, -88, 16, 34, 16, -25, -5, -15, 13, 74, -20, 27, -6, -48, -10, 17, 27, 28, -23, -18, -5, 85, -22, -4, -19, 34, -17, -46, 27, 0, -37, 32, 44, 9, -8, -46, 9, -17, -9, 44, 27, 26, 17, -6, -5, -11, 60, -8, -61, 27, 12, 43, 10, 29, 23, -17, -1, 10, -24, 23, -6, 16, -15, -13, 21, 10, 26, 9, -29, 0, -28, 16, -4, -33, -32, -41, -62, -16, 21, -22, 13, -18, -32, -31, -20, 19, 54, 28, 7, -36, 29, 32, -22, 11, 9, 27, -96, 15, -18, -25, -30, -11, -11, -38, 2, -21, 16, -15, 17, 13, -2, -21, -39, -10, -17, 5, 17, -10, 12, -47, 32, -50, 6, 29, 8, 5, -26, -37, -73, 1, -12, -26, 40, -54, 7, -8, 11, -41, -36, 14, 43, -13, 35, 22, -25, 15, -53, -20, -13, 1, -15, -9, 24, -54, -48, 22, 29, -24, -17, -26, 54, 22, -26, 22, 12, -1, 0, 10, -52, 24, 22, -49, -24, 40, -46, 26, -10, 25, 32, -26, -4, 8, 5, -14, -12, -3, 7, 1, 9, -43, -25, -10, 15, -25, -34, 5, 28, 6, -5, 28, -37, 15]
5511A5Qrp7N8J7m7J8j9M1k1%M4lj7Pl3kL1K9Qm3k2jM2J9l2m2pM8jl6L9rl2N2l9
5547a6K0j1M7l8Ol2k4P9j9m3k3O6k5kM6ll2K3n2K7K7k9K9J5rnJ6l5j4K2n5N8M3
5580E7n9M3k6Jqk5L9k0NJ1k4Nk4P1o7k6O4L5r3j2P2j7M2m7JK2n2l%L7L5m3pN9
5614D6n9j0J4l6N7r9J18rPn0J2K7n3K7L1j1qJ0j1j9K2l8ML5N3l0Nj7k6K8m4K6
5646Bj7J9l2LL9n1L5Oo5Q0K1n6L3n6l1N4O1l3j4PRl5JK8K8o8PJ%M4J6k6L0j1j2
5681A7p1N0j3K9l9L5J2n5L1MPj3N1m8J8j8J9np0L4K4OJL2j9n5P6k0m4L6Okmm7
5715c5M8PJ2l4p0J03n6nM4qLn0N5p5N0K9j0k9Jj3K0j4MK9j3J7l3N3m4j0K6l3M5
5748A4j7M3p8NL3k4O5l7l5J9J8j8j5k2K8j1K8l1K2J9J1j8K0l6N4p8M7j0Ql7L2
$$ y = [15, 23, 14, -63, -5, 12, -35, -17, -36, 5, -16, -16, 28, 25, 8, 15, -18, -20, 11, 40, 48, 5, -17, -18, 24, 43, 11, -31, -38, 10, 9, -27, 12, 3, -29, 23, -16, 4, -7, 40, 2, 8, -24, -48, 31, 12, -31, -54, 12, -13, -15, 31, 28, -4, 19, -33, -6, 21, -8, 21, 36, 27, 22, 38, 3, -11, 11, -44, 14, 57, -2, 41, 15, 16, 8, -17, 22, 2, 7, 18, -6, -1, -25, 46, -21, -47, 17, 52, -41, -53, 19, 2, 44, -3, -2, 20, -32, -35, -35, 2, 37, -6, -13, 46, -13, -23, -9, -45, 12, -87, 31, 22, 29, -21, -9, 18, -35, -8, 23, 12, 4, 14, 3, -16, 6, -32, -28, 7, 60, 30, 35, 18, -8, 20, -24, 2, -15, 4, -28, -25, 14, -37, -2, 4, -61, 19, 40, -16, 17, -39, -70, -16, 45, 12, -2, 5, 14, -21, -20, 8, 36, -32, -25, -24, -24, 20, 36, 10, 40, 29, 17, -54, -4, -17, 12, -27, 8, 20, -35, -4, 0, 7, -6, 45, -3, 15, -3, 16, 11, -59, -25, -1, 5, 6, 38, 19, -36, 40, 20, -24, 12, 18, 16, 12, -35, 13, 20, 32, -2, -72, 31, -25, -30, 14, 6, 9, -41, 14, -61, -11, 18, 8, -21, -20, -33, -13, -27, -23, 6, -7, 10, -23, 30, -14, -24, 2, -31, 14, -3, 40, -38, -33, 0, -24, 41, 4, -31, -12, 6, -12, -27, -49, -21, -32, -4, -35, -13, 6, 17, -1, 19, -17, 37, -41, 6, -4, 4, -33, -1]
5779aqJK0rN9n5jK6J1Kl9j7K8K2o6K8m3N2O0q7J4M2n5J4p2O2M4m6jnL4L8l8J7
5813C1pk3L4l5j1L7l4J7n7O7k9K8k6j2M1oo0L8L3q8J34p4jJK4m0PLJ7J2m8K7l9
5846c9N3l0LK6j5L3j12M8j1M5l4M1j5L6j4k1k6M9k5J8m8M1m7nM9o8N7LLl0Q3r7
5878d9O5kp9R9q9P5k1j4j5L4n9P7j9M2m6m3J06r9QPL9l9Rm4L6k7N7rM4l9O6m8
5910B3m9J0K8j8J8Kj2qk5nj3K6K2Om3Q0j5%j3l7kJnM0k1L7n2K2rk4J11j02K2N5
5944E0J8r2N5q1Q3lpKj9Qj7j3JL8j3kjj2J2J5j1m5K9l6J2LMM7n4O8K4r7j1M8k1
5979a8L4kL7l5m6P1n5L2K1q3O2j9jl5M7NJm0N5m6jJ1M9m1L1l9j8M2l3JNL4Lkm5
6014a8l4J05n7kj8N4l9mK3j8L0j0j4nJ7pJ2l7P0q3mRM6J0m2K1nK3l1k6j9P2qj0
$$ y = [-1, -9, -8, 12, 3, 62, 7, 6, 32, 43, 45, 6, -11, 17, 39, -27, 1, -42, 10, 70, -17, -3, 39, -16, -2, -74, -12, 32, -14, -15, -20, 14, 52, 14, 31, 24, 1, 35, 0, -11, 26, -8, 9, -48, 19, -10, 18, -8, -20, 21, 15, -45, -7, 26, -62, 72, -2, -3, -2, 22, -18, -11, -8, 9, 21, -27, 0, -39, 14, -16, -13, 13, -2, 31, -81, -33, -44, 1, -33, 8, -7, 29, 15, -6, -32, 17, -8, 10, -38, 3, -44, -49, 0, -68, -11, -8, -5, -35, 48, -49, 16, 14, -65, 34, -55, 20, -1, -15, -30, 4, -55, 22, 3, 45, -1, -44, 62, -37, -29, -22, 17, -22, -13, -57, -21, -48, 9, 0, 44, 5, 71, 23, -26, -16, 12, -6, 12, 14, 2, -6, -31, -36, -49, -23, -1, 5, -38, 42, 27, 27, 14, -23, -25, -24, -29, 11, -10, 27, -25, -3, -12, -36, 75, -27, -5, 50, 68, -24, 31, -50, 33, 30, 23, 25, 6, 14, -3, -16, -15, 23, 10, 8, 7, -5, 7, 22, 11, -34, -5, -41, -29, -26, -22, 25, -29, 39, 63, -34, -45, 3, -18, 16, 14, 51, 16, -30, 41, -14, 18, 39, -44, 18, -1, -2, -37, 10, 15, 16, -24, 31, -15, -16, -5, 44, 3, 34, -5, -23, 19, -14, -13, -8, 26, 29, 27, -18, -52, 53, -4, -6, -24, 30, -9, -13, 10, -8, 22, 12, -2, -7, 10, 3, 15, -22, 48, -35, -39, -30, 16, 26, -16, 5, 0, 23, -8, -34, -53, 19, 11, 1]
6048AK7q0N4k1M1p4N0n1QO1L4K5o3L0j17P9q1O0L0jpJ4kl4k0J4rK5l5J7joO5k0
6082A3ml2M8j6%k2K5Ln6L7j3qO2m9K6rkql2QJ6J1N8r3N3m8N7Nm6j0OO7n2N5o5
6117a5Pm4O4k2Pm5N0p9N6k1K8K4Jm7J2o0L9O3J8o0K0k7O0m2PJ0qkk3k3O7On3N5
6151B3n5jJ8K4lJ4QJn9k7N5j3kQK5k3n3Q8J6Mm4k7L7Mm6K3j1P6n1j3J9p2P0j4
6185aJ7p6L4O4l8Kk7J8j2JkJ7j5LP7m6n3L9k6Nlj2Q8n9MK3Lm3K7jMM4r8K3j6M7
6221A2k7J2j9L1j08R4K0l8J0l2J6L3J3j1J8Kk9J4kK1l6prO0j6o7O8k4J5j8OJ9
6253B1mo6L0K0K7n9M9J1l3qJ7k5M6n9k8M9K0j8J3J4m7j7K7k9M6Lj2J6qnnj5J9
6286a0K9K3l2k0qK1l7NK6k5QJ8m6K0qP0l2l6M0k7L9o0M7J2L2k5l6k7L8k4k2K8
$$ y = [1, 28, -52, 2, -19, 22, -52, -2, -53, -45, 16, 50, 75, 12, 42, -75, 4, -77, -17, 13, 12, 5, 19, 17, -17, -37, -23, -32, -7, -42, -25, -26, -32, 33, 13, 9, -23, 25, 9, 9, -13, 12, 15, -41, -4, -17, -25, 37, -12, 14, 5, 3, -5, -37, -29, -13, -2, 56, -37, 16, -32, 25, 30, -16, -26, -20, 47, -5, 50, -15, -8, -52, 12, -10, -3, -48, 2, -77, -21, -42, -14, 10, 11, -36, -24, -84, -45, 18, 36, -24, -4, -31, 29, -13, -6, 4, -4, -6, -29, -52, 15, 21, -32, 23, -32, -33, -15, 9, 6, 20, 28, 29, -30, -57, -2, -15, -17, -9, 16, -7, -60, 28, 44, 48, 4, -23, 14, 18, -28, -5, -16, 60, 9, -4, 15, -57, 13, -1, 16, -60, -26, 38, 0, 2, -25, -7, -19, -18, -20, -3, -18, -15, 62, 16, -37, 2, -24, -19, -22, -34, 54, -5, -1, 22, 25, -18, 9, 8, 12, 56, -42, -19, -35, 12, -15, -3, -22, 9, -99, -5, 15, -23, -13, -45, -29, 4, 17, 6, 24, 26, -3, 11, 9, 30, -6, -13, -22, 38, 22, -45, 23, -1, 14, -4, 2, 21, 17, -49, -19, 1, 28, -31, 18, 29, -4, -12, 5, -20, 26, -33, -61, -12, 8, -10, 3, 17, -30, -47, -20, -49, -3, 0, -12, 4, -4, -9, -14, -29, -10, 19, 42, 10, -10, -18, 3, -34, -29, -3, -28, -20, -2, -48, -28, -36, 34, 2, -34, 6, -21, 18, -42, 5, 17, 49, 24, -12, -39, -1, -25, -47, -19]
6318a9k7Nk1N1K2k3M7l4L8k5%J6j6n0K5j6K0j0k0L5Nm6O1k1PL4k8NJ2o7l5L2L5
6351hqJ6k8M8j7M2ko1LQN3q2K2J0L9j0k4m9K7j1K3L9l8N8k6nm8M7L6j05N3n6O9
6384A5m1L4o6Q1n9R4n5j4LN1q6J3J4K2Oj9L0m2l4QM1k5K6K4j0k4J8j4J9j0J0k3
6416a3mnM7m7j2O2j9l2K1k8K6L5l7J6j3%mO3p4KK9j6m2K6j7LO5J1n0K9j9k4M2
6449B1nK1n1jj5J0O6p5m3R9n2K1J1Jj1Pj0l0j4L1P1j09J13m1l6J4j5NM1%oJ3q5
6482e4M1j6L4N0q5Q9l2l8M0j4n2P5m0qk0K9j2K2o7P2p2J02m7k6j1K4Q4j01l4P4
6512GK3kr1O2N7qm7qnL0m8K4OPL3l6J8m0K4j5qmJ0Mm3K6jM2l5PJ9rQj3M1j2m0
6549a7kjj9P7l9k3M8n1m0M2K1K3k2L1l8J7j6rRml0L9kK0k%k7n4O9l9K9K4j4n2
$$ y = [-19, -46, -41, -62, -11, 11, -12, 35, 1, 39, 14, 14, 30, 14, -36, -11, -27, -7, -17, -37, -2, 3, -43, 18, -3, 4, 38, 10, 15, 27, -40, -75, -43, -8, -16, 0, -28, 20, 3, 45, 43, -18, -15, -7, 46, -36, -14, -4, 35, 25, 1, -48, -21, -32, -9, 30, -8, 50, 24, 19, -29, 18, 54, -51, 2, -54, 15, -26, 8, -58, 23, -36, 58, 3, -11, -8, 43, -43, -30, -16, 6, 12, -7, 23, -19, -53, -45, -4, -29, -3, 21, 11, -13, 5, -9, 10, 0, 10, -13, -17, -22, 25, -22, -34, 28, 9, -23, -2, -30, -4, 31, -6, 10, -3, -3, -7, 56, -18, -16, 13, -3, -45, -19, -36, -33, 32, 43, -7, 22, 3, -21, 21, 16, 37, -14, -15, -30, -20, 46, -29, -72, 27, -25, -4, 7, 8, -3, 4, -6, -36, -50, -19, 52, -57, 56, 15, -21, -7, -22, -17, 24, 24, 18, 31, -54, -13, -29, 5, 55, -30, 59, 27, -11, 29, 15, -37, 38, -2, -10, -30, -1, -13, 9, -58, 14, -58, 44, -3, -29, -40, -16, 68, -33, -67, 7, 30, 28, -63, -1, 56, 48, 1, -7, -12, 18, -30, -6, 0, 7, 40, 4, 22, -18, 6, -9, -17, -21, -11, -7, -50, -24, -25, 17, -18, -11, 8, -1, 7, -6, 35, 23, -17, -19, -20, -39, 38, -1, -24, 24, -27, -67, -25, -4, 19, -3, 28, -10, 7, -9, -18, -9, -13, -43, -4, -6, 14, 12, 12, -15, -69, 0, -39, -10, 14, 0, -52]
6583e2M7J%ml9L3j3L7K6%p3j4N5%K2p5M2J0j3OLn9M3P2o4j0L7j2rM1m6nK9J8j1
6618B3j9Rmj3l2Q8n2l4J6J1J2J4M6p5N4o3K0k4k9N4Pl3K6L0l1l9J5l4R8l6JJ3
6650A9j1m7J8J6pJ6p%j3RK1l1L5p1M0k3L2L0j0PNj8mn4J5J0%M5K3o3qL9kpJ4p1
6686e3M3m1N2P5j18qO0k5LL0oo5O7k7k4J5J1K6m3L4J0l4O1l9Kk8J7k1P0n3L9l3
6718cJ6K9o5j8jj3L1K9qK5l1K8m5J6M3m5j1K4j8J3j2l4MN8l8M8n7P9o5M2K5p2
6750b6P5j7m4Kk0pL2j2K2k1J7k2M0l4l6R5r1K8k3K1N6n9N5o2J5L3m0K0%J9l8k1
6782d3L7j3j1qO7n9K3M0j6j0l1M2j0j6NK1Mo4k9O7JJ0Pm3Q6n6n8N8rM5p8L0O6
6815E5m6M4n2K7L5n3M4l3Lk0k5PN8n4jM5l3n4J2RK8J7K1j2nj0L6rk6J0k8M2o1
$$ y = [-52, -5, -4, -4, -8, -47, -14, -27, 10, 36, 36, -37, -51, 4, 4, 26, -49, -7, 3, -10, -4, -1, -60, -17, 55, -9, -19, 18, 6, -3, 38, -8, -13, 16, 34, 23, 4, 13, 9, -4, -36, 52, 0, -34, -18, -7, 5, 19, 65, -10, 44, -19, 1, -23, -52, 2, 9, -24, 2, 32, 1, -38, -23, -57, 41, 5, 6, 19, 8, -39, -21, -5, -12, 4, -3, -3, -16, -7, 14, -17, 18, -53, -13, -36, -4, 26, 16, 23, 28, 10, 6, -48, -33, -23, -23, 22, 45, -18, -26, 13, 11, 4, 18, -53, -10, -51, 1, 76, -42, -50, 10, -15, -12, 18, 12, -53, 14, -13, -37, -22, -11, 15, -28, 6, 16, -18, 43, 4, 6, -22, -5, -26, 44, -9, 30, -3, 13, 42, -23, -41, -42, -55, -24, 5, -3, 22, -9, 19, -26, -10, 33, -12, -23, 1, -17, -4, -16, -50, -46, 12, -26, 22, -35, 44, -21, 21, 46, -26, 49, 32, -12, -10, -30, -37, -5, -17, 5, -16, 1, -21, 19, -15, -51, 44, -47, -19, -42, -21, 35, -24, 31, -31, -16, 17, -23, -3, -3, 16, -22, -43, -6, -19, -30, -38, 29, -30, -7, 33, 17, 7, -24, 18, 8, -8, -3, 18, 22, -42, -71, -4, -3, 7, 14, -29, 57, 1, -57, 1, -8, 37, -41, -11, 55, 9, 53, 1, 28, 63, 10, 54, 21, 24, 4, -21, -14, 44, -10, -11, 34, 1, -53, -41, -32, -4, 13, 34, 22, 17, 7, 43, 34, 8, 18, -10, 32, -29]
6848b9N6J4qm0j3L9l3RQJ9k0J6J9q8P8l1K3Om1L0Lk6K5nM8l8m2K0k3L7l6nL6R
6882A7oJ8l4l0M6k9k7JJ5qM7K1l0m4K5%qK0j3j8J0J0j7%J0K7ol3N9k8K9qj3k9
6916b6L0L2M1m0n7oj9N8j9k2ML1l4Q1p5J2j9JL0Ro2M2k8m3O6j7P2j02Q7J0k0j4
6948CP2l8m7k4k6N5qK8N2m6pl4K8m7J3K7j6l8O6Rm3L6k7k1K1Pn1Q3M8j58P1M1
6980B9Rj5n8N8l2Rjk5nM6J0l2P7q5j4K1J8j3j4N9o9K4j8NK0ll9oO0k4k9LNO6l4
7015CJ6n8L0PK8ml4l2K7L7l1qM0o6RO7l8j3K8k3L5n0N0k4K6k8J0qM1j5m1J4MP1
7049G0o4l1Q7p9M6k1j5kJ6K8o0K1M5o6M5k5jJ3m6KN7l2L3lL7k2k7J1pm5PK7k9
7082c0K6L0l4L1m3J4K9k1K9j9l1L1Lj2M6m5j3k1K3NN6k7o2K7NK6l4J4m3M3n7M2
$$ y = [-29, 27, 41, 33, -7, -20, 19, -14, -5, 3, 22, 2, 18, 37, -51, 27, -4, 19, 25, -16, 14, 17, -9, 16, 11, 59, 21, -21, -1, -24, 13, -23, -28, 8, 17, 11, 29, -5, -35, 11, -18, -45, -44, -29, -37, 10, 31, 1, -43, -18, -18, -26, -6, -19, -37, -27, -17, -34, -34, -24, 3, -3, -36, 23, -5, 24, 16, 3, -26, 4, 36, 77, 37, -20, -26, -45, 13, -6, -28, -24, 7, -27, 54, -21, -9, -28, -27, 3, 12, -50, -8, -36, -79, -13, -30, 42, -60, 27, 37, 17, 3, 75, 37, -10, -34, -60, -5, -13, 15, 67, 21, 14, -20, 8, -39, -26, 1, -15, -53, 13, 22, -21, 15, -12, -33, -12, -5, -56, 27, 75, -83, -12, 29, 38, 23, -35, 23, -9, 0, -1, -26, -31, 15, 25, -7, 70, -15, -29, -8, 10, -3, -17, 42, -27, -3, -21, -16, 4, 1, -38, -44, 16, -8, -37, -34, -29, 37, 3, 19, -39, -9, -2, 26, 22, -12, -44, -17, 20, -11, -19, 21, -45, -36, 31, -7, -20, 8, -15, 20, -30, 20, -4, 22, -6, 4, -4, 37, 22, -19, -5, -1, 70, 6, -25, 62, -17, 29, 8, -7, -9, 7, 35, -25, -4, 41, -25, 20, -5, -6, 7, -39, -37, 20, -12, 21, 18, 55, 33, 6, 17, 10, -35, -28, -1, -30, -4, 26, -8, 23, -20, -6, 23, 2, 31, 12, -19, 12, 15, 3, 49, 4, -9, -30, -7, -2, 54, 27, -35, -8, -3, 23, -11, 3, -40, 3, -54, -12]
7114a2J3k0K7j8qlJ1j6J09p8j4jJ0k3L8m6K9j4lJ9j7L9k2RKl8N6j4J3l8Onj6N4
7148B9oj0k1k4K9k8L0Jj4K3j3l5N1l0mM2j6Kk3j5n1N6O5o2k2O8k8n2K3j6N8j5
7180hK7rl3Q2n1l1%J5m5K8qJ2PPm2M7k4PN0%n0L0K6q6L3O4J5o7qK2j2O0m5K3p6
7215d0P3m2K0k3MK3l4nl3J17j49J15L3n2j4k5N1Kl0j4j5J7O2l1oJ8o3PM3mo4M6
7247a3J7j8nN0m4L1ll8J7l1K1J0J8k3O4p6O2n0N8k9rJ6O2q6l1J1J8OJ3j8Rj9N1
7280D1m8m4N8Oj3l2L1Nk6kN4q6O7k7M6kj12J22o2K2K1k8J8N0k4kl1J6j3Q3p5k5
7312a2P3p9L4j5j8jO3m5M9o2m0L7Rkj6J7M1m7K3J3o4P0m0k9P4o3M7n9M6J1j9j9
7344b3kK6J8m8j1P4n6M0moJ2k4j1l9K2NnR8n5j3qj3l4Q8nq1O7j8L4l7LJ6J1p2
$$ y = [-12, 1, -19, 8, -10, -18, -21, -10, -26, 83, 5, -9, -10, 0, -23, 15, -31, -2, -16, -19, 0, -17, 22, 0, 9, 11, -27, 29, 15, 28, -10, -4, -9, -25, 29, 23, 13, -8, -32, -3, -31, -1, 0, -14, 9, -4, -39, 12, -18, -22, 20, 4, 6, -17, -32, -83, -27, 38, -24, -46, 22, -6, -58, -35, -51, 7, -8, 19, 10, -23, 59, 8, -23, -23, -8, -53, -25, -33, -21, -14, -7, -49, -2, -26, -19, 31, 31, -19, 11, 37, -49, -16, 48, 63, -4, -12, 10, -2, 58, 13, 36, -40, 33, -9, 11, -12, -8, 15, -19, -24, -57, 60, -89, 26, 59, 7, -7, -32, 19, 21, -9, -23, -38, -21, 41, 10, 4, 22, -41, -34, 9, 5, -59, -13, 4, -14, -19, 31, -13, 18, 15, -23, -6, -37, -16, -6, 12, -11, 53, -23, 39, -11, 47, 18, 9, 25, 87, 1, -30, -19, -1, 5, 18, 0, 9, -10, 41, -7, -51, 7, 13, 0, -32, -1, 4, -22, -24, 30, -56, 11, -16, 30, 28, -84, 38, -24, -2, 19, -9, 9, 59, 35, 33, 2, 18, 5, 88, 13, -12, 61, -18, 16, 1, -17, -18, 45, 0, 49, -13, -53, -16, -7, -9, -25, -8, 33, -14, 9, 22, -42, 28, -12, -41, 33, -30, 17, -42, 4, 15, -4, -23, -25, 1, 19, -29, -40, 34, -22, 18, 14, 8, 20, -4, -15, -54, -32, -27, -32, 66, 11, -2, -10, -23, -57, 31, 26, -55, 12, -6, 28, -9, -6, 10, 21, -51]
7378e1lJ8M5J5OJ3n7Kk4J3j1L7k6M2lj7l8K0j3P2ok0nn0K1J6J0l2J0K1j4K8k9
7411a0K4n1L5l4k4O6k7N6o4J0j0N4m0Pl5L7n3M4J3m9O1k2LN4l4Qk8Lm1O1N4q4
7443a6%MLL4l8O0l4k1J4o8K6Q1m1nmNJ4J4p4K4K3Qjl1k0P1kn2J7l8oN5OJ3k5j0
7479a4K2n0K0K6p2R0j9RJ0N2m8p0M2Lj1K6Nl1Q3o2pkm0J8K6L3k2jk4l0O6l3J5
7512A0K7k1j4J5Kj3Pm1K0Rm8O5L0k7rl8O4n6N2q3O4l0N8l8o3K0J4l9O8m1K9k2
7544b9mL7P4r4l2J8K7N7r1P2j0k0kJ7n6M2l8N7l5j6P6l8k9mjmO2k8K1k2k0L9k9
7577cQJK3m8j7N5j9k8L9L1Nk9k4j9O8j0J1k0o3N9Nj6l5M6m2N0o4L5J8L0p1J8j5
7610b1j5N4m2Nj3M2l8m5N4K6N4k3k2j2QqPk6K8J2k2k0oP9n5L2o4J9J2k0L7j0r
$$ y = [-51, -54, -36, 9, 24, 30, 43, -14, -12, -36, -23, -34, 3, -23, 19, 16, -1, -39, -19, -32, 40, 34, 14, 9, -41, -20, -4, 6, -26, -16, 5, -9, 19, -10, 14, -37, -2, -36, -60, 6, -21, 35, -29, -19, -29, 25, -15, -8, -43, -6, -59, -15, -2, -51, 10, -12, -9, 45, 11, 19, -9, -6, -47, 14, 68, -16, -16, -12, -9, 25, -13, 47, 13, -8, 6, -62, -36, 45, 4, -1, -5, 0, 14, 28, -46, -22, 1, 9, 8, -23, -43, 28, 26, -26, -9, -47, -53, 2, 8, 21, -4, -14, 8, -42, -22, 4, -68, 22, 3, 12, 22, 74, 26, -44, -2, 1, -10, 16, 21, -10, 73, 11, 4, 2, -38, -20, 6, 39, 17, 16, -8, -38, 28, -5, 10, 37, 16, 2, 17, 19, 6, 13, -28, -8, 1, -47, 18, 48, 21, 12, -26, 38, -18, 34, -49, 15, -15, 43, 5, -58, -38, -24, -63, 5, -36, -7, -29, -33, 4, 78, -16, -48, -30, -3, 54, -37, 35, 25, 5, 3, 20, -36, 6, -32, 25, -10, -26, 50, 12, -17, -21, -22, -26, 36, 8, 29, 7, -13, 26, -3, 5, 6, 29, -19, -36, 19, 0, -28, 11, 42, 47, 18, -6, -25, 43, 33, 44, 24, -39, 20, 25, 9, -26, 20, -22, 28, -36, -1, 17, 47, -24, -6, -21, -36, 18, -24, -19, -32, 10, -28, -73, -19, 7, 61, 38, 16, 4, 12, 4, 11, -15, 13, 25, 3, -17, -23, 56, 1, 33, -31, -12, 0, -20, 17, 7, -2]
7643bn4Q8l2K7o0L8l4N3%n0K7j7o6J04k0k0lk6O7l1J8K1j5Ko7M2M9j7j0k9j1M0
7675A2k2j7P6n5%K4nj2nj4K1o1J04o3Opj4QM4J0mm9mL2m8J1N3J9m8K0k4j4j7O9
7709B6j3m4N0m4N8m4J7l8Q5m7j8J1jJ0k6K1Ol1M2j6j9L9j0L6o2J4m4J4pQ3q1L7
7741DK4o4oM7Ol6jM2k8K8J0o3M8j9OM4p5JP5L3p9L0k3j7K1l7O7m5J7l6mK2m2M5
7775eK3n7O6m3O7l3m3O6o9J6Qn7Q0J9k3nm4PL8k7Q8o8j8O0rj8l3N0l8Ml8K3J1
7808bj0Q5o0K1o8n3J12n3J9mpJ4Kk6N4j5r0M3K4qO6k2j1Pj5m7M1RRk4J2O3o7k
7842coK9Ljo5R7o6K0Rj7l5J5Pj7K7M0q4K7nkMkMK8mJ1pl5JMN1K1o7j1L9rL2pk4
7881BJ1pJ4m0K0L6p4L4pJ6KL7pn2K5j0K4Om2K0j5K2k2m6M8k4j6R4o4N2l4j2J5
$$ y = [-2, -56, 32, 0, 27, -33, 5, -29, 24, 24, -26, 1, -16, -82, 22, 2, -18, -21, -47, 20, -11, 7, 28, 13, 15, -52, -10, 39, 22, 12, -17, -28, 12, -10, -27, 49, -6, -6, 18, 13, 1, -4, -18, 3, -58, 46, -17, -11, -18, -32, -24, 20, 30, 26, -23, -27, 5, -43, -32, 21, 40, -8, 12, -12, -26, -43, 26, 13, -31, 19, -25, 33, -11, 6, -32, 53, 6, -12, -1, -2, 8, -18, 3, 9, -22, 20, 4, -15, 24, 14, 50, -12, 2, -42, -28, -35, 48, -33, 4, 28, -36, -42, 5, 11, -25, -26, 16, -12, 16, 26, -37, 11, -8, -2, 42, -33, -32, 43, 76, -3, 27, 4, -13, 8, -29, 38, -7, 10, -26, -30, -8, -50, -5, 18, -39, 27, -16, 51, 18, -25, 41, -28, -12, -4, -61, 19, 38, 15, 10, -34, -27, 11, -16, 72, 4, -14, 46, 37, 19, -14, 36, -2, 2, -36, -13, -2, -12, 73, 13, 34, -34, -87, 25, -28, -9, -13, -20, -6, -4, -30, 24, 9, -81, -38, -14, -22, 44, 22, 11, 18, 3, -44, -3, 6, 15, -9, 3, 66, -1, -3, -9, 20, 23, 22, -43, 54, -12, 8, 17, 0, -35, -20, -13, -30, -3, 37, -47, -20, -25, -27, -23, -25, -21, 7, 3, 14, 7, -28, -27, -23, 28, 49, -18, -29, 10, 1, 33, 26, 2, 13, 6, 20, -20, 0, 36, -38, -4, -11, 5, 7, 44, 37, -15, 10, 0, 24, 30, -12, 8, -7, 15, -7, -53, -5, -29, -45, 49, -15, 37, 3, -9, 6]
7914FK2p3J9KJ8j9L7L9q6R9q4K5k9O3l5N9jj8o4mL5pj2mN5j11L1M6j0J4l7Q5m8
7947A3Kj1n2RK2omN9j5l9L5l6K4o5N4j0J7J2j7K5j8j4j0O4l2l2P4q5J6j6N5nK6
7980D0o5N9J3m4j6Q2o0j0lQL7m6j6k7K3%L0K9Mj1rM4p5J5jOK0n6L4Lk4O8o6KK4
8015A2p6Q4l3j5J09l7j9oj7l2M8%m4N6o2N2k6Pk8l3N1m1M2j2P4k9l2J8J3n7M3
8046A0L2o2k0N2Jnk9K6J5j1Pj3m5M8Rl4K3jj4k8QK8j4K0Om4J8k7L7n0L7N0m6J0
8080fkOJ2j1m5O2m3%L5J7k1l6K5K4j1N5p1K6k8L7q3K8P2q5N3J0m2K5Om3K0rL7
8113A4j7M3%J3p2M8Jj8M3p4L0Pm7L9pK1l5K3jj1J1rJ2l8L2n8N9m0J1k9O2m0K5
8146bPK7n1k1P2l4J3qj2J5k9K4L1p6L2N7p4L3l1O5o7L0kK2K3n9k5J03o5J4J0o1
$$ y = [6, 28, -45, -26, -24, -6, -25, 12, 51, -35, 64, -20, 5, -24, 39, 4, 63, 62, 44, -20, -24, 11, 4, -8, -12, 43, -68, -37, 9, -1, 13, -24, 61, 13, 15, 4, -48, -39, -17, -23, -27, 32, 17, -22, 13, -23, 1, -64, -10, -20, -3, 9, -8, 17, -1, -15, -25, 39, 7, -25, 49, -36, -20, -36, 19, 14, 40, -25, 34, 47, 3, -13, 69, 9, -1, -4, 4, 41, -5, -21, -48, -25, -25, 5, 34, 38, 27, 18, 62, -13, 2, 1, 7, 27, -29, 5, 8, -16, 52, -14, -12, 12, -64, 20, -13, -28, 81, 44, 25, 19, 2, -30, 18, 18, -26, 30, -32, 20, -6, 1, -27, -60, -9, -50, -8, -20, 54, 25, -7, 11, 24, -33, 10, 42, -20, -40, 12, 13, 8, -21, 5, 20, 9, 16, 3, -42, 6, 15, -19, 4, 3, -11, -39, -31, -3, -17, 3, 9, -35, -17, -44, -7, -57, -20, 30, -16, -6, -8, -2, 10, -1, -46, 16, -27, -27, 8, 25, 4, -32, -7, 17, 6, 61, -10, 16, -12, 25, -58, -30, 42, -43, 10, 20, -22, 3, 9, -34, -14, -23, 14, -3, 40, 40, 53, -19, 29, 30, 12, 55, -19, 11, 18, -29, 10, 3, 24, -11, 12, 11, 0, 11, 2, 14, -24, 8, -50, 9, -31, -20, -49, 13, -27, -2, 5, 32, -19, -40, 32, -2, 11, 3, -9, 6, -23, 1, 32, -44, -12, 45, -29, 4, -27, 38, -29, 1, -1, 21, 44, -15, -40, 63, -2, 12, 22, -39]
8178c9QM3k2k9J4M1L5n1o5R6n0L0n1
$$ y = [-39, -31, 12, -10, -39, -25, 16, 51, 0, -65, 31, -19, 11, -40]
8191d0
$$ Imaginary data points
##PAGE= N=2
##DATA TABLE= (X++(I..I)), XYDATA
0@%%%%%%%%%%%%%%%%%%%%%%%%%%%%%%%%%%KnOpJ1j5J6j6J6j7K0k2K2k3K8l3L6
51A9l8M0m6N1n5O1o8P4q1R0r8J07j17J24j26J11l0l40L304L3585k4903m5306J8143
74a5499L1694n383j9491r69P889j862P359N424j3800p714J2226J5614j1905j3526
88i943R501P396l897m341M628k696o368R193K892r868m089J1024K222j4290M284
103d352J2216o610j2527Q073J5989j1873j3244J1099J1829p545j1728Q439O860
116F626o094k008K687p53l800P081K658j3242j322J4518M365j7745o288J8397
130E080N615j2718p635Q434O458m209k18j816l371L393P826j343j2779R44J2184
145E845J501r632m209P885J669l433M50o5j629r70N358J11o301R40M014K69l609
$$ y = [0, 0, 0, 0, 0, 0, 0, 0, 0, 0, 0, 0, 0, 0, 0, 0, 0, 0, 0, 0, 0, 0, 0, 0, 0, 0, 0, 0, 0, 0, 0, 0, 0, 0, 0, 2, -3, 3, -4, 7, -8, 8, -8, 8, -9, 11, -11, 11, -12, 16, -17, 19, -19, 21, -25, 26, -29, 32, -36, 38, -43, 47, -51, 56, -61, 63, -63, 48, 18, -322, 2982, 36567, 11664, -33642, -15499, 16195, 10812, -8679, -9648, -1759, -3621, 3738, 9162, -4638, -12352, -126, 15488, 3583, -9943, -442, 6954, 3057, -1284, 3344, 648, -5720, 3473, 6365, -3503, -7592, 3432, 5654, -8636, -4352, 7864, 1254, -11273, -3200, 12789, 916, -12328, -1229, 10600, 3055, -8673, -234, 6626, 532, -1476, 1211, 458, -3342, 3739, 6397, -6845, -8167, 6351, 10716, -7029, -13317, 5080, 10695, -2023, -9658, -1224, 5234, 1025, 807, -1009, -4380, -987, 6839, 5496, -7283, -6339, 5845, 7346, -2286, -6495, 1390, 3059, -374, 76, 11, -1618, -2588, 2770, 2881, -3420, -2480, 1534, 1803, -1806]
162a806J497K932m176j013M151K458m468l742M255K661q46k843j095J286R95K909
178C155k194m645J002M966J861o015k084M212K035j287k223O83q9N27K202j477
194F29k025l54L130R57l286o79J479K023j598j956J975N37j035r56J486R79k328
211a022K18J295M96j339r03J794J57o36r77O45J478j314m24M07O08k40p60R76
229D59o35q7N71l58Rn0L64q98K38J787j118j769M75K879k36l615L04K724J320
248B364k888j735K683R74j165j121P29M94p89J005j46j189J81J205J44j551P46
265e9N97r36l2R70L22k063L06K313n47j864k22K374Rk362N47J567l44j757Q07
284c74J788j476j035J038J068j027o48R38m30O4O80l69j081J22K257o91k316O73
$$ y = [-1806, -309, 2623, -1553, -2566, 1585, 4043, -425, -4167, 88, 2749, 1903, -940, -2035, -749, 246, 3155, 961, -3684, -2682, 2284, 4145, -1870, -3954, 258, 2293, 1006, -1217, -534, -623, -96, 2106, 629, -1396, -1750, 1380, 2337, -949, -1628, -149, 1874, 276, -1680, 295, 832, -203, -1159, 327, 1306, -1022, -804, 491, 987, -352, -1255, 539, 696, 60, -917, -272, 1206, -108, -532, -125, 483, 243, -517, 459, -176, -263, 308, -50, -41, -91, 273, -625, -387, 1400, 282, -1487, -1012, 1867, 1631, -1984, -1680, 1044, 2364, -524, -2259, 424, 1398, 233, -888, -159, 335, -454, 551, 405, -784, -603, 602, 746, -805, -59, 538, -398, -430, 540, 862, -1201, -895, 1418, 871, -993, -1215, 1159, 1168, -1194, -647, 920, 576, -1181, -374, 1414, -62, -1097, -59, 1009, -18, -666, 272, -158, -94, 586, 217, -864, -742, 1515, 824, -1492, -819]
302h19J945P3k411K15K009l66j424K49J408p25j070J210M34r98n45J245J85j260
320f45O86L07n52r6Q31J2j450N63J261m98j271K28J539n04j194N05R62l42j144
339h02Q56O40r12k23O49L63j037P9R16n31l06L52K95o94K9R77m72q01L62Q65k75
360C30r35M36N61j52n82J85N98o20k49P34J24o42l41Q32J30n22J67j29j94K50
380a9O17n27q39N73P99j54q13j59O76R9Ol54r2J6lO63r4p20k19O57O25o33m41
403c36qK48N09L5o33n88P41Q02n26o57PO74J5l05n3K7J18k40O4N15k59n30qO34
427B46L24o05l63MN32L42l89n39J75O14j87j20J5k36l0L28L42m40m58M09K10O2
449B36k17j67J02o4J6K76K62n92o05P53Q02l38j193J53R76O5m51l67J54J98Q5
$$ y = [-819, 1126, 1199, -1212, -997, 1012, 646, -778, -529, 879, 154, -916, 294, 728, -270, -815, 430, 615, -645, 41, 348, -204, -300, 531, 543, -907, -344, 917, 419, -852, -624, 915, 411, -783, -278, 684, 342, -802, 54, 694, -218, -441, 208, 571, -466, -387, 529, -2, -308, 44, 339, -355, -326, 651, 179, -622, -260, 605, 330, -605, -169, 392, 240, -342, -157, 441, -179, -428, 306, 430, -212, -553, 279, 409, -113, 54, -75, -269, -19, 598, 71, -768, -195, 604, 450, -363, -522, 154, 253, 259, -95, -187, -171, -174, 489, 395, -325, -544, 113, 738, 105, -336, -344, -96, 413, 448, -185, -773, -32, 770, 244, -413, -406, 268, 283, -22, -75, -48, 70, -170, -106, 409, 150, -380, -388, 246, 570, -35, -398, -394, 138, 480, 91, -448, -273, 341, 154, 34, 49, -187, -217, 111, 453, 13, -445, -36, 174, 236, 19, -148, -46, -110, -94, 182, 444, -148, -753, 0, 802, 464, -729, -576, 400, 465, 14, -353, -199, -1, 84]
470H4K31j37m50k36M77P61m34r56J21Q90J21o36j9L16j92l29O75O13j013j177
490a290Q54J822j26k383o07K073J500j278k060L97J730N48r46j014M1P20Q09j71
508F19q79o95M89J310J55j355q27Q92J342m74j167PO64M06k87l72%J25o1K25J77
529B94l43l68J89N65O2n31j35K31L68p3o07MO61J38p54l61Q77M84o70q18M82R38
551F33N7r99n82P28P84o9n73o87K5J177P01j009j609N86J922K61j558j319R19
570f12J847N1j790q48J182J180l51r56l58L39N02M51l44p59k16N41J102l52j428
589h19k49J489P58j303p20P64M16l05L4J49m47k64O80M63o32p65N36R32k18r29
609d30j46Q53K70o48k48L53K64j45l03J7J61K16j35k75Q9K33n2j48J24j83J6L01
$$ y = [84, 315, 178, -272, -508, -31, 730, 296, -660, -539, 351, 472, -164, -183, 133, -59, -388, 287, 900, -113, -1290, -436, 1386, 1260, -1123, -1730, 343, 1843, 565, -1495, -1098, 632, 1180, 234, -780, -739, -19, 790, 619, -260, -955, -466, 844, 999, -356, -1183, -291, 1051, 577, -590, -583, 81, 487, 200, -172, -172, -47, -108, 117, 294, -49, -417, -228, 337, 399, -132, -267, -36, 332, 259, -348, -344, 317, 455, -299, -660, 217, 701, 31, -787, -305, 633, 690, -309, -891, -163, 621, 552, -21, -708, -683, 494, 1195, 186, -1423, -837, 1085, 1346, -212, -1531, -612, 1235, 1286, -504, -1352, -170, 1010, 659, -297, -655, -316, 186, 637, 293, -466, -682, -141, 961, 609, -819, -1068, 421, 1179, -124, -844, -80, 336, 31, 65, 214, -233, -497, 183, 646, 14, -751, -215, 717, 499, -430, -576, 277, 547, -101, -349, 4, 268, 123, -180, -163, -2, 214, 79, -196, -107, 126, 74, -74, 50, -133, -117, 184]
631A84J53m22m61N56O33n50o44K20P11o7n28O3K27j37N2K74j33n28R4O17J69o56
653a73k08L81K97k8k52k36O5K23K60k99m33K82L59j03j94j04J18N0kJ76j18l15
675b54Q1L58Q8l48j19K12K9o4P9L5k39M5K71O0l32j15L06O5p8r2j88J04K79ok76
700i9q6K24K33p5l98M8K99K6l61Q1K51r6j19J32rj55P5J56j52k2L9N5m9l8K8K1
726IK5l7lO1r6l0R2Ol8j9P5k0j7L9mj59R5J42m8j99K7J78Q5j84p4O0J27Nj05j01
756a08J29Qk2J5q9L8J04qj66L7J32L4j58O3l5p1J10J9j7o1M4N9J5p9l6RJ14q1
784ar8R5Jq3J02Nm6j9M1N7op4J8j9K3Q1j57k9J25M5m9m2m3J21K6l3j23Q3J0j9
814hJ6K6kn9Q4L4q0K6Mm5j12J31M8m5pK4j9M4n7on4P2l8P5k8m4o3J72ok05mJ86
$$ y = [184, 337, -85, -546, 10, 643, 93, -551, -331, 380, 313, -215, -152, 75, -62, -10, 264, 131, -397, -303, 314, 483, -173, -381, 0, 297, 269, 17, -219, -154, 69, 329, 30, -403, -121, 238, 135, -59, -163, -45, 5, 3, 179, 61, -254, -173, 185, 273, -75, -194, 18, 47, -17, 62, 97, -142, -97, 174, 234, -98, -213, 93, 158, 80, -12, -200, -96, 183, 177, -99, -185, 39, 272, 197, -201, -153, 146, 172, -189, -108, 143, 47, -72, 60, 51, -104, -29, 127, -25, -47, -8, 47, -2, -40, -12, 9, 34, -3, -6, 55, -41, -71, 21, 27, -11, -30, 45, 25, 8, 47, 43, -116, -21, 121, 73, -126, -99, 79, 164, -20, -94, -34, 93, 98, -7, -108, 21, 29, 7, 22, -67, -29, 75, 67, -99, -62, 70, 104, -54, 9, -26, -97, 13, 32, 15, -46, -2, 57, 72, -7, -43, -34, 80, -1, -99, -4, -3, -86, 16, 21, -25, -44, -3, 54, 48, -26, -8, -27, -4, 77, -80, -109, 16, 61, 12, -30, -73, 48, 74, 41, -82, 1, 11, -8, 8, 34, 32, -27, 57, 91, 11, 37, 41, -4, -116, 15, 63, 18, 11, 35, 16, 60, 3, -3, -57, 15, -23, 52, 24, -20, -83, 89, 83, -122, -126, 60]
846F0k4r8M9N2n1n8J44Qk9m7J9J3j0m7K1J5kj2P2m3m2J8R4j31m1J26o7m7J06J4
876F2j23l3R7L0Kn1O5j7n7Q0N4r9j55J04J70m4k36K0J98K0q9k4km1J00J75j67
903C9k88K90K09j73k28K2J78Pk8M0r3m3R0N6k7j15k8J22P7q3k2k7q6M4K23j33
929B3k74K24J55j17q9K2N3Rm0J62p7j82P0J94K9k17l9J49L6k04O2K02k51lJ58
954E5J07j28j60P8J01j8j0o6j64J89J87j67j70P1J63k5j25N1R2j05q8J52J69k11
978b2j94K30J63j73j18K07n0j70J23K39j59l45J79L25n0l26m7K33J17j50j15j7
1000a20J57O7o5j14J2k6Q9R3m0j39l8K07J13p9k55l5K26K18k83j95K08J00j24
1023b3nJ20m2j84J90J41j81j82N7L00k3l72J6L92n6j77o5P7Q1j20O8Kj36N1J64
$$ y = [60, 36, -62, -13, 39, -12, -70, 74, 82, 53, 6, 25, 38, 28, -19, 2, 17, 15, 3, 75, 32, -10, 8, 102, -29, -70, 56, -11, -58, 48, 62, -61, -94, 3, 33, 35, -16, 49, 32, -25, 55, 109, 10, -145, -41, 129, 85, -151, -131, 67, 87, -2, -26, -28, -69, 31, 206, 39, -249, 41, 250, 77, -151, -129, 49, 56, 28, 68, -25, -68, 22, 78, 51, -64, -92, 30, 107, 24, 2, -25, -111, -67, 156, 23, -251, -27, 128, 11, -78, -56, -3, 6, -34, 128, 51, -131, -61, 133, 162, -55, -94, 55, 91, -113, -51, 151, -100, -103, 55, 162, 34, -126, -48, 53, 35, 25, -41, -205, -16, 171, 4, -166, -95, 68, 43, -82, -31, 61, -44, -132, 20, 189, -22, -216, 14, 177, 4, -114, 93, 43, -127, -4, 235, 76, -269, -90, 235, 185, -141, -188, 45, 162, 12, -103, -120, 37, 104, 39, -75, -63, -89, 0, 93, 53, -86, -124, 83, 196, 117, -138, -173, 53, 271, -12, -207, 1, 101, -23, -28, 92, 50, -134, 56, 197, 16, -166, -109, 191, 168, -204, -188, 204, 148, -29, -94, -17, 64, -56, 12, 14, -122, -71, 93]
1048I3j05j01O4J40p1p3KJ03L8l2j33Q2k2K2O5j02p8J16J78j56j62J41J19j18
1072A0j8P7r3oR1K4q0j15j0K57J3k50k1K07K0q6Oo9k5P1J23q3k50J24J16lj6m
1100A0onM8Kj36K3P2J22n4j86N4K44j38j36R0J54j62j50K46L8k67l6K90p1p5l9
1126f8R8J0j07J1J40j02o6J16K3r8qJ18K9k01K4K16m3j95R5M6l0o5J06k5m9m3
1152f8J54o7j20L9J68k6k34J85nm9k7J08m8j23M3J55p7j69J25R0n1j07J39L5q3
1177a3j50K38lk01K9K44m5k23O1J55p0j50J40P1j64mJ52j7j80N5J51Rj77O8J26
1202A02p1j30J04R9k25lJ91k0r6N1P4r0j61J89Q2j29n1J11N0j24K6J25k0j17p
1227d0J49n2j47Q7P2j20QP6O3j67K6J84j32l8JJ36p0j04J07k7j6lJ04q8m4j5J32
$$ y = [93, -12, -113, -49, 91, 20, -53, -51, 52, 90, 58, -75, 7, -15, 7, 72, -30, -108, 8, 186, 30, -132, 9, 128, 10, -8, 69, -24, -30, 61, 85, 5, -110, -120, 137, 150, -100, -121, 86, 106, 20, 26, -43, -68, 3, 126, 43, -207, -83, 33, 30, 14, 10, 4, -1, 47, 49, -87, -64, 8, 130, 76, -110, -56, 188, 50, -86, 4, 158, -4, -154, 92, 130, -137, -173, 117, 46, -29, -68, 30, 40, -67, -56, 84, -18, -84, 32, 55, -43, -51, 67, 96, -105, -81, 135, 92, -103, -8, 38, 8, -57, 49, 24, -25, -68, 86, 19, -101, -62, 106, 80, -154, 31, 26, -23, -50, 58, 10, -113, -70, 85, 8, -161, -36, 54, 3, -104, 35, 70, -13, -163, 75, 72, -129, -100, 144, 99, -124, -63, 92, 22, -128, 12, 83, -81, -85, 67, 50, -130, -75, 76, 85, -92, -24, 102, 31, -99, 5, 104, -121, -124, 67, 47, -49, 2, 76, -14, -175, 14, 96, -33, -84, 27, 77, -47, -21, 104, 84, -33, -40, 109, 57, -90, -3, 69, -51, -43, 33, 96, -71, -45, 139, 7, -31, -30, 106, 36, -68, 39, 12, -4, -7, 97, 9, -35, -50, 82]
1254H2o2j34K1J36kr7P1rl4m7J61n3j15J00M4k2n2n4J03n5m0Q0K2r7K3O6j6o0
1282d0M6R9j20j3K7K4n7%O5K6j03L9N6k2r8R1LJ7m3K7J9J9p9K4ok6N2N3n4o6L1
1313iJO2q1O4K2j18K3P7L0r9K6J8m6J8lm3N8j0M3pj8o8J9J06m2p8K5K9o3Q7J0
1344C3l9JP0m5K5j22P3K3nk6L4j5k0KL7J5k8q2J10pk7j6Ql3l1J02l3o2N3M8l3
1375A0o8P1J2l9RJ5M0j43Q4pM5n9j7O2J0j4j1M0Jo0K2Q5q6n9M9J5No0Q6qk8jl3
1408c2RJ3L4o6nL2J3J9j9K2n5N8r0N7M3q1J5L6L1q5P4Ql6onO1j2l9KO1l6ln7M9
1442A0J8k4j3K6l7QL6M3n7OL1r8K5J8j4l9O3J1r3O8KL3l0M1l2J0k1j3Ml6J9K1
1474a4M4k5l2R3n1l5M0J9l1L1p7J02o1LorJ0L0q4Q0k6Rjpk1lK4J8j4m4N2J9Ll8
$$ y = [82, 20, -114, -93, 43, 41, -56, 15, 6, -28, -75, 86, 33, -82, 18, 62, 40, -12, -66, 37, -18, -58, 22, 44, -53, -30, 36, 20, -40, 6, 105, -15, -28, -1, 23, -34, -34, 31, 57, -46, -7, 49, 27, -71, 20, 23, 40, -3, 24, 43, 62, -17, 7, 1, -25, 27, 80, 26, -40, -9, -8, 54, -27, 37, 59, -59, -36, 41, 71, -28, -2, 16, -30, -12, -15, -58, 0, -10, 33, 26, 8, -60, -41, 65, 23, -55, -30, -1, -64, 23, 33, -6, -5, 65, 20, 45, -77, -4, 19, 14, -12, 22, 7, -13, -11, 26, 41, 13, -69, 41, 34, 7, -9, -1, -34, -65, 37, 4, -58, -5, 43, 10, -58, 13, 25, -14, -5, 10, 50, -93, -9, -16, 29, -30, -47, 15, 25, 11, 0, 40, 41, -19, 3, 88, 2, -57, -8, 7, 12, -48, 38, 30, 2, 1, -32, -23, -10, 24, -42, -47, -15, -2, 17, -2, 20, -35, 23, -67, -10, 33, -48, -33, 3, 34, -51, 23, 31, -5, -11, -16, 45, 33, -6, -4, 57, 21, 18, -39, 10, 28, 4, -9, 17, -20, -12, 24, 67, 10, 16, 47, -51, -26, -8, -22, -61, 2, 13, -80, -12, -10, 23, -7, 34, 2, 12, -9, -22, -18, -54, -35, -14, 30, 5, -27, 66, 15, -20, 20, 39, 8, 39, -38, 64, 3, 6, 0, -9, 1, 31, -53, 27, 1, 10, 9, 2, -19, -22, 2, 20, 6, -38, 14, 33, 36, -2]
1508bQ9j90Q6L7J9k7n4M1L5m9k4M1j8o2J15Jj03O8nk6Q1n6n0M0O1k9o2R1k0o6
1538c8nkJ4O5k3l2K5RPk3m3M4m0L6N6pj9l7m9P2J9K2n5K2RJj3l0M0kj5j1o4N1
1572a6L5o8k7Q1J9mk3k3L8l8L4l3kLn1J21m5n3K1KN8K2o6ON9m9k5K1K1PK6olo6
1606b4K8k9L7K7l3k5L1Jn8PL5J3j5J1J3l6J9mj1j7L3l7J7K2m1N9j3Jj1k5O3p2
1638c4qN1kj6L1j4K1q0P6Nj9p3Q2j0L4j1k1m2j6O0l6oK7J2mp6M6L9j4k4mRL9k4
1672bm6RN9j9M3n7N0n4k4Q1l5KO0o6k5M1l3j7M1mj8lkO5qj08J00l9L0rj0K5Pm9
1706a5j0K2kM5p7J6NL0Nn1N3K9r9N7o6N7PJ1j1N8k3p0J7K4k8qRJ6%M6Lj16J00
1739C4l8L3rm6N8o7l0R5l3pJ8l9P5p8k8O1K6J5p8RL7N6o0j2j3K9J6r2O5K8J5n9
$$ y = [-2, 87, -103, -17, 20, 39, 12, -42, -1, 34, -15, -39, 2, -16, -78, 37, 38, -65, 3, -2, -28, 53, -3, -53, -13, 48, 19, -43, 48, 28, -38, -43, -45, -31, 34, 11, -21, 4, 13, 20, -3, -46, -2, -42, -6, 50, 43, 24, -13, -62, 10, 29, 51, -4, 18, 27, 28, 15, -15, 25, 23, 8, -3, -67, -16, 19, -49, -76, 5, 24, 20, -3, -26, 12, -26, 8, -25, -27, -24, -75, 46, 1, -52, -31, -29, 29, 51, -15, -9, 50, 1, -24, -3, 18, 25, 51, 45, 42, -24, 4, -25, 12, 39, 6, -19, 12, 13, -45, -38, -3, 10, -5, 6, 19, -17, 2, -2, -13, -30, 3, -34, -17, 5, -36, 23, 10, 11, 0, -25, 38, -34, -42, 9, 7, -9, 22, 8, 29, -51, 25, 30, 11, -62, 20, 10, 44, 33, 12, -30, -46, 14, -22, -28, -1, 11, 7, -69, -23, 16, 2, -22, -26, -17, 22, -2, -48, -39, 20, 1, 44, -13, 37, -17, -41, 40, 5, 7, 67, 1, -24, 17, -16, -33, 8, 4, -14, -17, -19, 46, 38, -70, 30, -9, 21, 12, 2, 27, 34, -15, -25, -3, -5, 40, -37, -21, -16, 14, 19, -32, 21, 50, -49, 8, -58, -1, 6, 17, 6, 64, 41, -29, -12, 12, -16, -24, -15, 1, 1, 47, 50, -66, 34, -4, 29, 20, -26, 32, -35, -65, 30, -3, -10, 8, -31, 44, -34, -62, -1, 25, 40, -38, -29, 8, 64, 4, -8, -21, 8, 24, -68, -3, 25, 40, -19]
1771a9j9N0M6o4n6J00k0j2n8L0K2m7L6M4m2l6k7J02m8J9m2O1l3J1J9n6kP2J3o9
1801b5N5N5l7p1K2J8k4K0m3pN9l6K2J3m4L8Oj5%J1k3Rj0M5j6p8L2P3k1l1k9lm3
1834g8P3l8K6O4p5k3J1P0k9m4L2L3L3q4M9j8j4L2Mo8R5k8j10R4j6M1r7M8J3l6
1864d0M4MKLN7r6m1N2N9m3o3R0j2j3j4rN3or5RJ13Lk7j4o2J11o9j2nM5O1j19J5
1897a9N6J1o6K4j6L6m3j8O1m4L7j9K4o4N0p3M4J2L6J2o5N7p8N9j8M0l9%p2O8K0
1928A3%l1lO2j0m3k8N3pK3qn5J24p5m5R3m5Kl3K4J0j4rn8P4Pl3j8OM0m4Ro4R6
1962A3J4m0K5j2K3K7p6M4M2k8Om1L6%k2km1K3K4qK2LL2q3L3K2j8o2K1QO7j13Q4
1995B3l2N8q5m6M5O5kl5K2K2k2J9n6P7j4l1l5J7N8m4Jn4K6J8j7j0M1J4Ll3l0O7
$$ y = [-19, -38, 12, 58, -6, -62, 38, 18, 6, -52, -22, 0, -47, -11, 33, -9, -45, -72, 30, -18, 1, -41, 20, -13, -2, 17, -39, -41, 31, 44, -25, 30, 85, 48, -23, -1, 17, -7, 13, -30, -37, 22, -14, 8, 21, -23, 15, 21, 6, 6, 17, -6, 3, -7, 38, 22, -56, -24, 49, 28, -3, -32, -35, -78, -5, -43, -17, 47, -28, -51, -40, 30, 1, -43, -11, 22, 55, -29, 20, 2, -12, 20, 24, -44, 51, 23, -87, 7, -9, 32, -65, -17, -4, -40, 4, 8, 10, 13, 70, -26, -67, -15, 44, 1, -62, 28, 16, 3, -11, -20, 33, 27, -68, -59, 54, 57, 30, 16, -46, 65, -4, -16, -21, 24, 85, -34, -19, 37, 48, -18, 6, -10, 26, -17, -35, 26, -18, 19, 0, 24, -40, 10, -63, -19, -7, 29, 41, -24, 33, -45, 14, -4, 36, -3, -3, -75, -7, 13, 13, -18, -21, 41, 31, -12, -40, 13, 6, 29, 21, -34, 90, 15, -30, 63, 18, 20, -13, 11, 21, 7, -2, -60, 14, 21, -12, -30, -24, 16, -28, -19, -83, 13, 27, -13, 12, 0, 23, 50, -26, 18, 60, 32, 38, -3, 33, 33, 11, 9, -32, -9, 15, 7, 29, 32, 64, -19, 14, 36, 18, -44, -23, -15, 52, -61, 23, -9, 49, -36, -82, -37, 28, 26, -9, 13, 35, 13, 32, -24, 53, 39, 8, -27, -10, 48, 4, 5, -49, -23, -5, -22, -32, 9, 23, 26, -7, -37, 30]
2027C0Kp0J1j1RLM0j9L4qj7M8n3kk7KON6J2n5M8m4N3m6l0M8K9j21R7Qo9QJ2N8
2061D2j5k1k9P8k9K1n6p3P6n2RQ0j5L1n7lm8kQ0m4O0On5M5n8M2J6l3j0J2L5Jj4
2094B0KK5j4pL0m8J4J9p5L7N8r7O8rk2J6k5n2Q2k7m3Q3m4M7p8K2N4l8K9n5K8J8
2126A8pl0L0L6mkp3N4k9j1K1j7J15o8j1Pm9O1m5j9P4m8J0qm1L9k9n7L1Q5j4o0
2158d1%N0kk7j9N8lrMj4JM3k5L4ok0m8j4Q0k4qj4J6M8k5k1l7O9l5j0l4L8jPPL
2194B1J9l8n2P7jno7M8J6n4O2pm3L3L4k2k0K0%m0P2k8j2k6J3N1j0q2O7oK9Qo1
2227dM6m0ML5ok4m2N9m4kjK3k2K1K1o6M0rL2o7M6p9P1k7M5PM7n4l5N3l2KO7l6
2261B9k1j7RK3l0J1J0jo0ON7l7j9N0n4L9J1j3J0L6q8L8n0O5k0k7L6K1k5K1K0j
$$ y = [30, 32, -38, -27, -38, -29, -26, 14, -5, 29, 21, 4, 52, -1, -3, -30, -28, -22, 34, 46, -9, 39, -5, 48, 2, -28, 20, 49, -72, 25, 33, -36, -28, -16, 42, 27, 6, -23, 55, 26, 47, -9, -82, -6, -58, -49, 31, 16, 47, -10, -13, -61, -63, 17, -27, 33, 39, -16, 29, -29, 13, 29, -4, -14, -2, 33, 34, 20, 22, 47, 33, 26, 56, 8, 22, 41, -34, 3, 61, -36, 32, 23, 1, 17, -8, -60, 22, -5, -48, 35, -9, 38, -40, -18, 36, -2, 27, -28, 0, 18, 11, -19, 11, 47, 43, 41, -32, 22, -7, -18, 3, -14, 101, 33, 22, 29, -20, 41, -4, -23, 51, 3, 13, 5, -36, 3, -26, -83, -52, 33, 19, -41, -41, 9, 7, -20, -39, 19, 16, 7, 11, -3, -2, 41, 16, 50, 44, 24, -24, -38, 42, 18, 10, -4, 12, 60, 35, 14, -23, 46, 11, 1, -33, 5, 4, 11, 18, 21, 40, 2, -50, 27, 26, 21, -46, 2, 18, -36, 26, 19, -24, 9, 43, 21, 1, 21, 21, -19, 53, 25, 13, -13, 0, 51, 41, -41, 26, 20, 49, 57, -4, 42, 2, 6, 41, 35, 11, -31, 28, -16, -18, -19, 4, -18, 3, 24, -42, -2, -11, 21, -46, 0, -79, -8, -35, 10, 17, 64, 10, -25, 28, -4, -2, 65, 29, 8, -9, 0, 23, -7, 4, 14, 13, -47, -41, 16, -21, -40, 10, -44, -5, 6, -7, 3, 39, -49, -11, -61, 4, -16, -43, -7, 14, -11, 10, 30, 29]
2293B9n2P5jo1M4nn7M7j6Jk2K5J1p3R8o2qN1k4m6O1kq0K5O2k1j8P5j04M1L4k0
2325GL1m2K3m2O0m8JO1o4rJ2K6NoK9pm5K9n9K1J6J2kN0k1p5L2j2PJ5j5RL4l2K0
2360B1m8lP4o9k0M1R%%J7nn5J1LM9n6J0k0K7LJ3l1M2j0n1Q1M5n8k4J6L6Nm2Kj3
2395@j2J0k7J6N3n6M0l6L5l0KK3oM9p2KL2p3K6M9k2JK1j8k7L4K4n3j7nJ03l0n3
2428a7O7l9n8Q4Jk0m7L6M5j3k3nj1K7k8LJ3N8j05n1R6K5j1m0K6l6mL5j8N1l8j1
2460hK6j4k7Q1j8mm4j0J4j9R7j4r2K6l0J1oL3K6o9LP9k2l2j4J00p6l1M9j8Mk0
2492a9Q1r9N1M5o2K9l4k2N5k4nL0j5NlK4n0j4NM0L%n5%k4N7M7p5M5k4KRqm9O0
2527Fnl1J7K6kj9nj2L7j1L2l7L8o1J8QJ7J2o9O1Ol0m4J06p2K8M7k8Mj4j0l0K2
$$ y = [29, -23, 52, 51, -10, 34, 29, -28, 19, 3, 4, -18, 7, 18, -55, 43, -19, -27, 24, 0, -46, 15, 13, -67, -42, 20, -1, -19, 56, -48, -7, 27, 7, 38, -4, 19, -23, 37, -11, -10, 51, -13, -22, -10, 16, 21, 15, 44, 37, -8, 21, -38, -17, -1, 11, 9, 59, 38, -37, -5, -17, -10, 5, -10, -1, 33, 1, 21, -27, -30, 44, -25, -45, -4, 5, 5, 5, 22, 17, -38, -27, -24, 25, -31, -21, -41, -14, -11, 2, -29, 13, 3, -48, 33, 78, 20, -4, 12, 48, 53, 11, 13, 0, -12, -2, -29, -13, 40, -16, 24, -12, 23, -7, -5, 18, 12, 61, -11, -9, 23, -50, -24, 25, 3, 4, 25, 7, -20, 14, 38, -15, -32, -37, 66, 36, -17, 50, 11, -47, 37, 38, 18, -29, 7, 52, 39, 16, 11, 0, 27, -1, 2, 15, 73, -32, -83, 13, 38, 27, -13, 13, -23, -27, 8, -10, 41, 3, -8, 18, 4, -23, 58, 40, 36, -8, -18, -4, -23, 74, 60, -32, -6, -36, -25, -31, 2, 28, -41, -38, 41, 19, -13, -27, 73, -3, -34, 15, -3, 1, -19, 62, -37, 14, 59, -3, 26, -8, -30, 25, 1, -4, 26, 11, 16, 13, 37, -13, -27, -22, 18, 21, 21, -34, -34, -58, -1, 46, -29, 16, -8, -6, 3, -5, -54, 6, 1, -30, -13, 13, 11, -8, -13, -25, 12, 1, 33, -4, 34, -27, -9, -1, 16, 28, -41, 20, 26, -4, -48, 58, -14, 14, 61, 33, 37, 23, 13, -17, 5]
2560EJj0Mj7j1O8n6J9jk3M3l0l6M8opO2np1MoM2K8k1k2j3NL9k8MqL1k1L4m2K4
2596B7k5qN0l5j9L8l9pL7m1Kj5K1J0k9L0L9p6K0M8k5l9noQ6ko9OL6k7M8M0q3J1
2630aK7lk9M1o0M5ol4l6J06k6J3Rk1k7K3J1o2J3J8k1K3J2K7k8Ll5J2j6m5Q3M8
2662F4p3PK2kk0%J4L2m5k8K3L6l4NN3q2KK9M3m6j0LK6m6J9k0pK3pJ8k9j7N8o5
2696e4L9J2j2k1J5K0mj9J6k1MM4nk1J5J7l9M1m7K9mmK3n6oN3m4oL9l8L8l0M6j9
2730Al6J3%L9o4K0J2JM4k8j1L6j7o1M0J5l1K5N0j60Q6J9K3l3K4K9q2J9P2j3l8
2761fK9km4J8M3m0k1L3qL1k5k3L3l0Qqk2k7Q2p7KL6M6k9j6L5m4K4L4k4O0o0J3
2794B1n3O3j8m0k6J00m9jM3n3L3jpm2Q6l2j5KPj9K2o2J6L5k3K4m1N4j3J8o0M9
$$ y = [5, 6, -4, 0, -17, -28, 40, -16, 3, 2, -21, 22, -8, -44, 4, -2, -9, 53, 48, -23, -19, -25, 17, 45, 24, 2, -11, -6, 33, 5, 9, 1, 32, 11, 45, 3, 27, 2, -6, 44, 9, -10, 28, -11, -18, 19, -22, -20, -35, -14, -4, -33, -3, 36, -40, -20, 28, 3, -36, -41, -47, 39, 37, -32, -26, 10, -17, 31, 71, -12, -1, 26, 23, -6, 35, -25, 20, 14, -20, -56, 50, 24, 37, 46, 25, -2, 21, 32, -30, -17, 1, -20, 3, 15, 42, 14, 17, -18, -6, -22, -67, 16, 64, -9, -2, 20, 18, -2, -2, 12, 44, -1, -29, -6, 30, -4, 1, 54, -28, -26, 3, 46, 0, -10, -7, 19, -27, -8, -28, -35, -12, -19, -1, -30, -47, 11, -54, -15, -3, -15, -36, -21, -1, -5, -24, -8, -29, -25, 19, 14, -7, 8, 25, -14, 27, -20, 9, 5, 1, 24, -32, -38, 15, -29, -35, 4, -34, 4, -26, 20, 1, -35, -22, -22, 17, -47, -27, -15, -14, 30, 2, -9, 27, 10, -51, -11, 4, -27, -2, 48, -112, -26, -7, 16, -17, 7, 36, -46, -27, 45, 32, -6, 23, 21, -23, -5, 38, -2, -23, 10, 2, 33, 8, -15, 18, -12, -4, -12, -34, -61, 21, -56, -54, -18, 28, -1, -17, 18, -26, -2, 32, 8, 68, 8, 21, -32, 31, 13, -27, -53, 47, -2, -3, 40, -13, 20, 19, 12, -30, 56, 24, 9, 11, 18, -1, 21, -41, -25, 10, -13, 11, -30, 24, 11, 29, -31, 18]
2826A8p7K7N6L%m3O5j9Ln7M9M0o2K9j7m8J9N2ll4M6o7Qj5%J9J6qqRo9P3k7j3N5
2861B0j7j1Ll0L6l6QK2j7K0j6K4m6O4L0k1pl7P0q1mj3J9J8N0m1j1o9R9o0L3j8
2893a9pM5q4J00j01L8kM2on8j5J0M2n0Q3km2M9m0M1l9Q9p7JJ5lK4MOKl2m4oM8
2927A2k5O3j01L9mj8P0rl8J8k8J1k8L3M3n4K7k0o5Q8l3PLj0O6pn7L6pk2J1j0M
2960eML9o9qQ9l7j4l1P5l8k6k9j4N0J2j2k3L2L6q7N1MQJ7k1Jl1K1L4j6L4q4M6
2993Hl3P4k2o0L8n7P7k2L7k7mK5k4nj3J9J1k5m5L1P9j05JL4j2J3j3n6M0P8p5L5
3025Bl0L2J2RL1l5o8R1Nl2m7Q3q7PO4l4OK9n7L2K7k1kn6K4RKkqN0n0pM8l1J3R
3061A8j9k5M7l1m7L6k1L8L6m6PK9m7L5mOK2l2QQqj7L6l4j8Jo3Q4pP0j7l9K2kl2
$$ y = [18, -59, -32, 24, 27, 27, -16, 49, 30, 33, -24, 25, 65, 3, 32, 15, -33, -14, 38, 35, 1, 47, -20, -12, -27, -27, -8, 8, 0, -8, 1, -68, 5, -22, -35, 20, 3, -8, -5, -35, 1, -35, -27, -5, -22, -2, -18, 6, -40, 24, 54, 33, 26, -11, 59, -22, -26, -39, -20, -2, 48, 7, -4, -73, 26, -34, -1, -19, -26, 19, -65, 35, -66, -28, -30, 12, 6, -52, -67, -57, -15, -65, 18, 16, -26, 23, -17, 24, -15, 74, -3, -2, 13, 10, 34, 38, 44, 46, 14, -30, -36, 12, -13, 50, -51, -12, -16, -34, 36, 27, -11, 7, -21, -10, -38, -5, 38, -16, 11, -9, -74, 14, -19, -12, -9, -19, 47, 40, -17, 19, 12, -10, 1, -9, -5, -1, 38, -31, -39, 50, 13, -1, -32, 43, 5, -21, -50, -64, -14, -2, -14, -37, -5, 31, -56, -5, -1, 7, 24, 3, 4, -27, -6, 28, 12, 46, -38, 8, -25, 49, 27, -33, 5, -52, 25, 3, 40, 13, 9, 34, 10, 5, -8, 11, 22, -3, -48, -17, 62, -43, -42, -8, -20, -7, -20, -76, -36, 42, -33, 2, -28, 4, 16, 25, 56, 21, -47, 44, 49, 17, -30, 53, -34, -27, 37, 3, 9, 38, -19, 13, 40, 19, 17, -39, -15, -6, -4, -6, -14, 36, -14, -21, 27, -4, 9, 18, -1, -26, 21, -10, -57, -21, -42, -4, 32, -14, -7, 22, -25, 10, 6, 12, 34, 2, 10, 18, 10, -7, 29, -5, -23, -22, -85, -1, -8, 62, 45, 6, 28, 26, -6]
3096fn9O6Ln5L6J2n4J03j6l8mk0P0ql7K7j7J2pk0l0O2L0q2R8k5m9L8k5k2M5k6
3128Bj0J8o8K2M6N5l0k2p7J13q5N8m8K1M4o8J1K1k2M6m3J9on9M6l6ML8k2M9k8
3159a1P1q5K8rj8lOP2K0q7QJ9Rk3j1O3n4K6l0%Kjn6J31m9m5K6mk0j5L6K5l5J4
3193@m0L1J4M1m4k1k7M8j1J4K2jj8Ml3L0J5K3m0J2l4k0K3J0mm4M4L6m7mJ3JL2
3226B5k8j5K3mM9j05L5K9K4k1n4L2NJ6j9P6m7J0k4pPJ9K2l9k4J3J1j4M8n9L6O
3258B6k6j7j6NL5qj7L6p0L2K1j1l1M9n0K4J9m2K3k5M4Rj6JO1n2j8J8J2J6l4k5
3290b7rM7L0n3NL3o8l3O7K4k9QL9j9rK4p0K8Oj4L4J1k4L6l1Rj5J1k8J3ok5K0K9
3324A4J7l8jN2j4J7o6M5J3Mk0j03R1j2J8Mk4rK4m5NQ5n7J8m3J0J0n3P8Rrl1J4
$$ y = [-6, -65, 1, 4, -51, -15, -3, -57, 46, 30, -8, -12, -32, 38, 30, -7, 20, 3, 15, 8, -12, -42, 20, 50, -32, 66, 41, -8, 30, 5, -17, 28, 2, -8, 10, -58, -36, 10, 65, 35, 13, -64, 49, -36, 22, -26, -5, 39, -29, -18, 3, -19, 27, -16, 3, -3, -62, -16, -52, -48, -10, -32, 17, -11, 60, -25, 3, -6, -24, -27, -21, 51, 71, -16, -8, 11, 20, -3, -14, 49, -5, 21, -9, -9, -7, -8, -64, 67, 18, -27, -1, -5, -25, -40, -4, 21, -14, 0, -40, -9, 5, 46, 2, -19, -46, 2, -9, 5, 27, 26, 8, 12, -21, 9, 24, 47, 7, 19, -15, -35, -12, -2, -6, -50, -6, 30, -17, -21, -8, -7, 25, -3, -18, 5, 1, 50, -55, -20, 9, 33, 12, -42, -10, -5, 11, -8, 68, 21, 31, 7, 0, 7, 26, 48, 9, -15, -2, 9, -5, 43, -16, 20, 26, 0, -17, -33, -28, 7, -1, -18, 18, -52, -20, 1, -10, -41, 8, -42, -18, 1, -41, -18, -43, 1, 10, -6, -5, 56, 4, -14, 4, 16, 32, -2, -27, -36, 11, 41, -12, -7, 26, -42, -75, -8, 16, -13, -5, 34, 15, 6, 30, -40, -12, -6, -20, 14, 25, 1, 37, 6, 15, 0, 11, -17, -4, -10, -35, -15, 14, 31, -7, -8, 44, 30, 47, -19, 26, 39, 43, 23, -80, 11, -1, 17, 21, -3, -12, 12, -33, -28, 57, 0, 18, -25, -15, -5, -58, 20, 29, 20, -11, 3]
3357CJ1m4L7M0l2k2j9L0j1k9O4k1L1lom6mJ6K4N9n6j7PK5m5Nj2O6n1ok9M4nrJ6
3392A1mk3L5o2J3j5N2J3mrl6L9k1j7L7J2QO2r4O5p4j0MJ8jN2n2llm5L9M4n7RJ5
3427bM4p5N8m4%L4nj4l1K9KP0m0n9M5K8qqMJ4q6L2jLJ4Ll4J2J1M1o6pM0J4K5k3
3463B0k9K1j0Jn9O5j3j6L7oJj4j9L1jl8M0pK5j8ql4O4j1j4m1J5n6J7J4Q9k5k4
3496cj3j2L9k6L9oqMPj3J4k8k8P5k2m8M8pJ0j3J7m0K1LJ7rl8pK3K3k7J1K6j4%
3531A5m%K5j8l2l1L2K9j7j0O0j3k4rJ8m5P5p3O7n2k4PM3m3O1j37N0L9%K2p0O1
3563BK7m2j9L1k1N3q6K0Q1m3J7Rk1j5R6p3m2k2N7J2J7J7m4K5j5k2M9l6J4l8Mj4
3595b2k2pL3KoL3J9j3n3M8J9l1o1O7K2n4K7MNk4o0P6J8Nqll0j0N1k4J3P3r7p6
$$ y = [3, 14, -30, 7, 47, 15, -7, -26, 4, -7, -36, 28, 7, 38, 35, 29, -17, -21, -5, 19, 78, 22, 5, 12, 37, -8, -3, -15, 51, 0, -6, -35, 9, 4, -5, 11, 7, -16, 19, -43, -30, -45, 7, 20, 16, 7, -29, 10, -11, -28, 9, 21, 29, 91, -3, 62, -12, -22, -18, 0, -1, 51, -1, -4, -7, -52, -13, 31, -26, -17, -2, 42, -33, 25, -19, -19, 15, 10, -4, -35, -6, -4, 66, 26, -33, 12, 40, 32, 24, 28, 42, -44, -12, -13, -10, 4, 7, -27, -15, -4, 37, -29, -36, 4, 18, 43, 20, -9, 12, 2, 3, -56, 9, -4, -20, 17, 11, 12, -2, -21, 10, 9, -29, 11, 4, 29, 11, 3, -31, 33, 22, 8, -33, -18, -74, -57, -43, 46, 21, -3, -16, -28, 11, -15, 24, 18, 10, 14, 21, 8, 22, -6, -34, 41, 19, -29, 19, 12, 22, 9, 26, -14, 7, 10, 27, 18, -20, -27, -4, 19, -8, 3, 29, 15, 15, 11, 11, 36, 18, -14, -45, -13, 16, -1, -11, 49, 36, 12, 3, 21, -24, 51, -22, 45, -7, -31, -24, 19, -24, 37, -100, -50, -11, -11, 11, -59, 2, 29, -13, -32, -1, -22, 31, -55, -35, 46, 3, 20, 29, 8, -7, 89, 16, -26, -48, 9, 21, 38, 55, 11, 36, 21, -1, 48, 12, 26, -12, -8, -22, -44, -51, -18, -16, -22, 11, 30, 17, -36, 12, 31, 0, -61, 6, 28, -26, 1, 5, 10, -14, -74, 2, 20, 25, 17, 14, -16, -26, 25, 1, 14, 87, -10, -86]
3629h6J01OPl8O7r2M1lk9K8n3P6o1M1J7k2m1R3k8J0l7J1k2RR6q1L3r2M4k0M5k4
3661dM7K9m6nk0j5PL3pm6j1K3j3K5N1o3rmQKL9k4l0R3j11O2kl3M2l6RMJ4OnK0
3697C0K6K0l9j4J1j9M2j03O3J7nJ0l3rJ7l6mM6k2P0q7k5Q7o8J0J7j5OL3j5j3j
3729cJ1L2o5M5Ol2L7o1L5j1K8J6n5oO1j0k2Nk8J2J2l3P4j5l9qP6n0J1n4j4M0l2
3762c7N0l1oj8L8K4l1K9l4l3N4lMj3J9k7J7M7m5oj2L3Jk1L5k3NOl5M3o1O1j8R
3796B1oo3K6O9o6K6lj1j0j4M3j5j6mL2k9rJ1j0Q2o2J2K6lj9j1jnM9l7k0K2%L2
3830C7J1k2K3n6pP1r2L2l7L8Rl7PML1j7M4n8J5l7M8J1l2m0O4nMk8Q3r3N1j7J5
3863B0k5J2l8P7j3Pl5M9k0J1j2Kj9k6Jm8M6j5N1m7J1J6Qj8k2J0J8j9PM6l5K6j2
$$ y = [-86, 15, 21, 28, -10, 57, -35, 6, 3, -26, 2, -51, 25, -36, 5, 22, 0, -41, 52, 24, 34, -3, 8, -14, -5, 91, 10, 43, -49, -5, -25, 20, -4, 43, 72, 26, 21, 1, -14, -7, 26, 19, -27, -38, -15, -28, -3, 48, -15, -24, -28, -20, -18, 21, -3, -33, 60, -51, 11, 9, -24, 18, -18, -9, -5, 9, 15, 10, 30, 56, 76, 37, 23, 34, 15, 57, -46, 17, 34, 29, 39, 6, -3, 14, -22, -26, 20, -2, 68, -19, -44, 43, -25, -15, 2, -13, -7, 26, 11, -2, -3, 8, 40, -25, 20, 26, -6, 31, -30, 5, -6, 22, 38, -17, -23, 38, 28, 6, 11, -17, -5, 7, -26, 48, 33, -6, -14, 62, 12, 23, -31, -45, -5, -37, 13, -18, -24, -42, -4, 20, -11, 18, -16, -49, 5, 2, 6, -7, 12, -15, 2, 49, 4, -2, -14, 19, 20, -1, 34, 11, 16, 22, -13, 30, -31, 30, 12, 21, 15, -48, -22, 47, -19, 7, 4, -7, -17, -31, 12, -3, -19, -23, 9, -20, -29, -18, -28, 54, -8, 4, 30, 27, 8, -3, -4, -9, 40, 3, -17, 5, 5, 37, 48, 26, 49, -7, -14, 57, -35, -3, -40, -2, 7, -30, -23, -19, 12, -5, 39, -19, -4, -41, 7, 18, -14, -54, 10, 5, 9, -19, 64, -29, 22, 5, 20, -5, 7, -31, 46, 33, 40, 5, 54, 34, 45, 33, 35, 16, -10, -9, -57, -11, -26, 25, -22, -11, 5, 13, -5, -27, -17, 1, -18, -11, 35, 0, 26, 14]
3896A4j0qK0QJ3p8N2J9l2jm1J5P6n5K4k3J0j8J0J9m6L2rjL4n0j7O4n9N7j9oj0
3929a6J5n1O7o0R7j02J9PRJ3j1j4K7o5J22m5l8L3nm0J11o6j0N9o7M0l7l3lQ0m5
3960imOl2JK0L0j00J18j1q8O3L4n7l0Q1ok1K3j6Pj7j2J0L6k7lO9q0KM1Ll7pj6
3994b9rJ9L7j2LL1n1P9m3o2O3l5k3K9mK0k8O7J3n7j0Lk9k1M2k5Q5l5l1PQk5jJ
4028b3L9QQOm2J1j3MJ2pO5p1j0pJ1rK5mrJm6M5N9l9l2PN5o7N0n8j0J7Kj9L6Q1
4064G6q5j1O3l7L8kl2j2RK0K3n7qJ4J9K4q9N8r6L9O4k3j0k2n4N2M1K9j4%n4M8
4096A1k0kJ3j8Q8o5l4L1L4k9Pj1J6lM9n8mK2n1L1k2K0J8k6J5l8Q3o3Nn0J5K1o
4129b1N0Jj4l4N7j15M8N0k5n8N8nO1p8MM8j1j4q1N6M8j2k3JN9r7Q5Kq3P1pk7J4
$$ y = [14, 4, -4, 16, 24, 37, -41, 11, 30, -2, -3, -44, -29, 47, -8, 16, -7, 3, -15, -5, 14, -32, 0, -9, -10, 24, -26, -43, 21, -38, 19, 0, -6, -16, -1, -52, 15, -45, 52, -50, -31, -24, -15, -2, -13, -27, 0, -65, 57, 12, -26, 7, 2, -38, 73, 7, -3, 56, -11, 29, -8, -41, -44, 36, -9, -13, -7, -39, -38, -18, 12, -88, 30, 19, -69, -6, 28, -29, -59, 22, 16, -5, 18, 2, 9, -8, -20, -10, 26, -1, -4, 65, -15, -13, 28, 31, -6, -13, -29, -38, -19, 18, 6, 9, 40, -11, 68, 25, -37, 26, -9, -32, -3, -7, 13, -15, 52, 65, 8, -2, 1, -28, -49, -7, -32, 53, 18, -13, -6, 2, -23, -24, -23, 16, 24, 32, 38, -4, 7, -6, -2, 10, 3, 68, -3, -13, -20, -9, -18, 7, 3, -6, -5, -51, -6, 53, 14, -18, -11, 44, -23, 27, -31, -41, -24, -22, -41, -5, 76, -9, -20, 43, 6, 44, 42, 10, -2, 7, 27, 50, -7, -15, -1, 18, 42, -47, 11, -85, -46, 18, -5, -15, -37, -91, -39, 2, 31, 17, 17, -37, 11, -9, -11, 2, -16, 72, 7, -27, 4, 38, 9, 16, 5, 21, 18, 67, 9, 5, 27, -24, 7, -15, 5, 23, -3, 12, -26, 57, -6, -1, -51, -36, -15, -21, 29, 30, 16, -18, 39, -76, -28, 22, -3, -61, -3, -8, 53, -25, -21, 27, 16, 2, -79, -23, 25, 13, -10, -9, 50, -47, 38, 40, -43, 28, 21, -6, 8]
4162HJ5MK8l7n9PL6oj2J1l7pN7m5kON2m0JKM5o8P2nm7K4N9m6n0N7k2LM2k4o5O2
4198A9n3N5l3k0J8j3L7MN9l1j10L1J3m5O4k7l1J08l9j4m1R7o8K5RL9p7N0%Nk3
4229Hqk9L0Qj4NK1n8P6o3K1O1o5Jq5P3L6j21J10j0j3j8L4l8L5n5M5j7K1QQl2r
4262c4M2j1m4O2O1r3j4K1K3J1kj1K5rL6o2L6m3K1j0k4J1Kj3M6k4rk8J5M9mj2j6
4295bk9M3J4p9K1NK0Nl2N7m0J0RJ1k2M2k7j5M1l7M9m8K6k5M5m4M0p8J7RM7k9K7
4328C1j7o2Q0l3j9O5n2KJ3k2J1oj8mJ1L3l2L1j2m0L0k0K9N9n4j9K9rL6j4j1m5
4360b9Q0m0j1LK3kpL1k4Jm5M9o7L1m8L3j5M2m3O8k1n7J8J9M0j9Om3J9Kj8j9R5
4393E2k3n0Pj0O3l1K2j4l4M2l3K7j3J4J9l6J8m8L5m4k7P5j3Lk4J4j1J9K9n5%R
$$ y = [8, 23, 27, 55, 18, -41, -34, 2, -4, -16, -5, -42, -49, 8, -37, -39, -33, 19, -21, -20, -18, 27, -41, 31, 26, -21, 3, 62, 16, -34, 23, 1, 4, 46, 22, -43, 19, -34, 21, -12, -32, -14, -27, 10, 14, 73, 42, -68, -37, -24, -69, -5, -32, -63, 45, 6, -8, -49, 48, -20, 5, 14, 53, -24, 26, 26, 31, 8, 0, -29, 1, 9, -5, 0, 21, -37, 39, -24, -3, 58, -7, -6, -91, -18, 18, -103, 7, -3, -16, -34, 0, -38, -3, -58, -13, -30, -9, -1, 7, -25, -34, 8, -3, -47, 15, 76, -17, -31, -10, 13, 24, 22, 11, 36, 27, 63, 1, 37, -6, 15, 5, -19, -8, -6, -19, 27, 3, -6, -34, -19, 30, 26, 14, -2, -31, 12, 26, -53, -32, -27, -7, -2, -34, 23, -17, -7, 2, 13, -9, 33, 6, -9, 32, -5, 44, -4, 22, -3, 42, -2, 38, -40, -23, -14, 33, 4, 31, 14, -48, 32, -1, -20, 45, -7, -5, 8, -14, -3, -9, -27, -31, -20, 13, -19, 12, 0, -40, -10, -30, -1, 58, 4, -15, 14, 5, 41, 27, 16, -29, 51, 11, 0, 3, 26, 24, 17, 48, 24, 25, -20, 29, -38, -7, -55, -22, -37, 5, -38, 30, 9, -48, -30, -11, 29, 10, 16, -27, -8, -6, -24, -43, 52, 29, -21, -14, -24, 39, 8, 30, 16, -18, 24, -9, 18, 5, 19, 38, 2, 20, -28, 7, -37, -64, 11, -2, 1, -23, -9, -20, -1, 28, -27, -27, -18]
4425a8j2K0m7N6J8Pm7K7j1J2k1N2K5n0On9RM2k1J5L4j8Qk7L8k4n7M9m6L8k9qM3
4458Dl2K7k2MKK5kj5K6mk1j4k2P7k2kj6K3k3L1M3o1Jj2O3r8J8M5pl5m5Q7k8l5
4492d0L7m2Q3k2m6N7l5j4%J4j5J2K6J4l6%o0K2N0ml1J4K4j6j1L5j4k6P0n5J9k5
4524a5j1j2K4L4p6L0PM6m7M5K9m8m3O1J3p0L1m2O6k2J0J2l0M2m3L7j5J1l9nlK7
4556Dm3K5K5j6k8Q4n0Oj5J9L8j8l6MJ5J0k3K3Mm0K8j1j5J1k2%K4kn9K5L5Qm8j4
4590e2J5M4m1O9k5m4L6n2O3%Rpj5K1k6K9k4J3m5l3P7kjj5Jm8O7o0K2K4K8pj0O
4624A7k4qjK9K1q4K6L0m1O6m9lj6J3L4n0K8K4j6J7p%K1k7M7n4L4l8j1J7M3j5j6
4657GJJ7oq1R4J2m8JJ2k4j6O7q6J8L8j1qK2mK3o1JL4k5k5K9M6k3lN3m3oj1L0k9
$$ y = [-18, -30, -10, -57, -1, 17, 24, -23, 4, -7, 5, -16, 36, 61, 11, 17, -42, -33, 9, -12, 3, 37, 19, 27, 0, 38, 14, -43, 6, -40, -2, -31, -39, 4, -28, -1, -23, -19, -17, 8, 6, -9, 17, 13, -8, -22, -44, 33, 11, 9, -7, 16, -7, 24, 67, 6, 7, -5, 58, -40, -22, 23, 16, -19, -64, 23, -5, -40, -3, -45, 38, 16, -30, 27, -8, -22, -22, -8, -23, -11, 15, 29, -7, -7, -67, -45, 5, 1, -30, -16, 8, -8, -19, 16, 2, -24, 46, -9, 10, -15, -26, -38, -14, 20, -56, -26, -19, 27, -20, 25, 54, 6, -37, 24, 37, -33, -2, -44, 22, 0, 10, 22, -8, 34, -9, 28, 13, 24, -15, -20, -23, 4, -39, -14, 11, -5, -33, 51, 1, 7, -8, 11, 49, 31, -5, -1, 14, 24, 1, 24, 28, -12, 16, 5, -10, 1, -21, -21, 3, 1, -58, -33, 2, 10, -38, -52, -37, 7, -34, 35, 10, -34, 2, -50, 13, 13, 22, 15, 0, 21, -5, 24, 0, 13, -32, -65, 12, 10, 9, -6, -5, -53, 14, -46, -24, 0, 28, 21, 11, 17, -7, -15, -16, 13, 34, -50, -24, 6, -35, 31, -18, -21, -37, -24, 10, -40, -12, 12, -4, 13, 6, 6, 27, 0, 47, -7, 27, -11, -22, -5, 38, 23, 7, 8, 25, 19, -62, 32, 44, -4, -3, 9, -15, -31, 36, -50, -32, 6, -5, -13, 9, 5, 28, -33, -32, 2, -23, -48, -19, 27, 4, 1, 54, 11, 5, -6, 24, -5]
4692eM7l6N2o6K6k5mMj2K3l4rK5L4J6j7l1l5M3K2j1l4L3j9o1K6M0J2m1O1lk0o5
4725f4M1L0J1o5M6J0M1o0N2j0q1N5K0n6R1j00K4M1j3o3M6M6n4lrlk4J6K1j5rP2
4757C4L4n2l9oRJ4%j0j9O2j2Ln6K6M2m2pK2J7J0Mm4Jk2%lJ9K8j5Lq4L9K3J8K1
4792A8j7k5J3j5N6OJ1p6QN8j9Pl8M5k3K7m8O6q7R2J5Lo9Jl0J2MK8K4n8J1J7k1
4825dmjK1oJ4j7n5O5rmj6Jm5J2N2l2O6p8j7Q9j5Qm1K2j5K4MrPj0j8kL3j2N4o9
4861gp9P8pJ4j9P0Jm1l6O7k0o3m5N2K9plK9q4L6N8p2Q5L7%o0n4QkO9Ko8j8K7j3
4896c6Q2l8lqk1J1jk2M9qn2N0nj6k2K2J9Lqn0P0m1l0M0M8k2K7k6pL3o1L0k2P8
4930F3k0l8rk5O5k0m8K5l6K4Q4k4Njm5J1j4kjL3j5Po9N7o2J7M4l3J3LK6n0L2J1
$$ y = [-5, 42, 6, 58, -8, 18, -7, -11, -7, -19, 4, -30, -39, -14, 20, 36, 19, -12, -47, -4, 18, 7, -27, 6, -13, -74, -48, -8, 4, -37, 24, 21, 1, -64, -23, 7, 18, -47, -1, 9, 50, -10, 42, 32, -49, 6, 26, -30, 61, -39, -15, 26, 13, -50, -4, 42, -12, -15, -24, -27, -51, -35, -14, -29, -38, 34, 68, 16, -23, -29, -20, -6, -6, -16, -35, 27, 15, 18, -38, -12, 30, -12, -19, 3, 20, 30, 34, -10, -9, -31, -31, -34, -15, 13, -2, 1, -83, -44, -21, -3, 18, 1, -24, -11, -26, 30, 36, 47, -29, -21, 37, 18, 25, -13, 32, 9, 36, -12, 54, -33, 59, 74, 77, 8, 9, -21, -9, -5, 23, 47, -11, 0, 17, -4, -8, -9, 12, 6, 20, 3, -52, 13, 4, 0, -16, -15, -60, -48, 4, -28, 38, -40, -57, 32, 17, 25, -16, 6, -9, 15, 19, 10, 17, 7, -11, -13, 20, 8, 62, -7, -86, -8, -15, -1, -20, 50, 51, 10, -26, 41, 21, -42, -87, -35, -6, -13, -16, 13, -71, -35, 23, -49, 36, 73, 73, 13, -41, -33, -35, 34, 36, -32, -50, -23, -36, 46, 8, 5, -3, -24, -13, -14, -36, 13, 5, -47, 3, -2, -18, -40, -18, 1, 4, -4, -54, 16, -25, -55, -15, 33, 11, 38, 12, 5, 38, -23, 7, -15, 63, 43, 5, -4, -29, 36, 16, -32, -7, -43, -19, 65, 41, 46, 45, 0, 11, -3, -5, -6, 27, 12, 19, -50, 7, -55, -38, 6, -27, -14, -11, 15, -35, -3, 8]
4964Hpj6L9m0K6q9N2L1J7K6o5J2j1JL2m2j1P0j3j5j4k2mKN7l2n2k7Q2J9l1Qn9
4997f8O6j4knl7M2l8N7Jk4Nl9N4KnMqO0m4o1J4J7O1lm5J0k5K5k0%MK5m3lR0j7
5033C6l5k2K9l1K9k0j4NN2l9N2m0j9PL5Kp1N7m1J0K3J3Oql8N8j4qJ0l1QN7q2M8
5067B4J7j1rk9J6Mj9OMj1K9m0J6m7O4j1q4K5j5J20m7l3k6J3L2k0L6M5o2RQRM8
5100F1k2q4K9KJ8J5j8K3k4n0J9K1nj4QO8o5K1J0m1L0MJp1M9K0l3J4j3MR1p5K5
5133A8L2o9k9K4M7k1j0O3l6ok1Oqj1PL2l4K1J7m6K3NJ5Lj9j1OK1n5N9Mm5kk3K3
5168b0J6k4ON3j9K8m1L4n6L7jl0J9j1K9k0j8K4LJ0J2nrj3N4m8J4Jj00R8n1mM2
5201A0K7p4M0j0K3Lk5nK3Qq7P4k3K3j8N6j4k4L6q1L0L6O3q6L0q9L8M4m0J3k8L3
$$ y = [8, 1, -15, 24, -16, 10, -79, -27, 4, 21, 47, -18, -6, -17, -16, 16, -26, -37, 33, 20, 5, -9, -31, -35, -33, 24, -8, -60, -87, -5, 14, -17, -9, -68, -2, -16, -18, -23, -60, -18, -56, 1, 2, -22, -17, -56, -2, 0, -5, -1, -9, 51, 7, -54, -40, -23, 38, 35, -10, 0, -25, 0, -20, -20, -16, 9, -34, -37, 53, 36, 1, -21, 8, -23, 6, -14, -28, -23, 29, -10, 42, 2, -17, -10, 25, 27, -44, 13, -28, -18, 5, 18, 24, 16, -22, 36, 22, 14, 24, -7, 1, 58, -24, 24, 41, 30, 21, -8, 8, 12, -7, -1, 3, -8, 21, -19, -3, -50, 14, 3, -81, -56, -71, 49, 2, -31, -57, -44, -12, -32, 4, 49, -13, -4, 4, 13, 61, 39, -45, -16, -14, 4, 19, 1, 24, 0, -50, -31, -10, -15, -29, -21, 47, -18, 3, 13, -28, 2, 6, 7, -64, -15, 5, -28, -14, -27, -23, 68, -7, 18, 50, -19, -48, -24, 23, 2, -8, 55, 19, 13, -8, -2, -10, -21, -14, 18, -16, 5, 22, -24, -1, 4, 19, 22, 3, -8, -2, 19, -36, 23, 27, -18, -20, -43, -20, -4, -28, -22, 31, 12, 40, -1, 33, -23, 14, 13, -17, 2, -9, 20, 0, -18, 6, 9, 19, 31, 26, 17, 4, 58, 10, 24, 25, -75, 23, -28, -32, 10, 37, -37, 3, -7, 16, 19, -6, -11, 12, 20, -67, 7, -16, 7, -11, 45, 31, 7, 43, -38, -8, 28, 91, 5, 35, -54, -16, 28, -12, 1, -27, 6]
5233Fj1mj3L2j7Mp1KP4m0J9oqJ4K1j6NK6l1J9j5J1m0kN5qJ5nk9P4l9J4o9j9O9
5268A7J8j4pj9Q6r2L7M4p3j4O0m8J2qJ0%pnj3K0Jll4M3Nk9M9%m0O0l2mk4j1R6
5303H1o7n2KP6l9J2%JN5q8J7l8L4j1Lm3N8Ml8M0%l8L1L5qj0l2Nj2QRl5O3j2J3
5338B4lk2MJ8o5M2M0p8O3p9L3j7K3M0k8k8M4k9J2J6lqnKK1l2nJj1O4p0OJ1j6O4
5373B9rm9Q0n2j8L2J9K8n4p3N0N9q1N5l0MK2k2J8K3k5m2M9Ol8MOj7j1K7rqJ5j0
5407b2KJ5rnL7j2L2m3m1P0J4Rp5O0j9k4K4rj6L6M2q3QL3pL2L3o9k7Jk4N7j7N7
5441F0n0jl8O3p9K3J7Oj5J0oj3k0RP1o2J0k2N8j6kJ2m3K4LN0m5Nl4O0l2J1j6J0
5475Hj7M5Rqm2k4J7%P5r2M3loJ3J6lkn2Q0o3Qok0M0pl4K8j2K3l2J6N6J3o8o0N0
$$ y = [6, -5, -9, -22, 10, -7, -3, -74, -72, 2, -38, -19, -25, -33, -19, 2, -14, -9, 17, -14, 5, -10, 1, -39, -41, 14, 6, 21, 16, -13, 61, 22, 36, -33, -52, 17, 35, 21, 14, -5, 81, -11, 26, 70, -3, -17, 43, -5, 7, -1, 9, 9, 2, -3, -16, 4, 5, 2, -32, 11, 16, -13, 36, 36, -4, 56, 24, 20, -4, -15, 81, 14, -38, -36, 40, 1, 13, 13, 14, 69, -19, -2, -40, -6, -17, -14, -57, 1, 5, -33, 7, 7, -31, 0, 35, 27, 17, -15, -10, -22, -14, -5, -40, 23, 11, 24, 21, -1, 3, 21, -44, -2, 38, -40, 23, -56, -23, -40, -17, 23, -5, -33, 11, -18, -6, 10, 7, -1, -6, -4, 17, -15, -20, -19, -30, 34, -36, -30, -19, -35, 29, 20, -29, 51, -1, -19, 13, 32, 60, 6, -67, -17, 42, -39, 16, -14, -10, 12, -10, 8, 31, 6, -36, 13, 19, -19, -15, -9, -26, -37, -10, -19, -27, -12, -22, -20, -5, -14, -19, 18, 6, 38, -5, -46, 24, 38, 47, -28, 32, 13, -11, 13, 4, -12, 24, 66, -17, -9, 24, 17, 49, 82, 13, -14, -13, -37, 20, 3, 60, 10, 9, -29, 34, -45, -22, -5, 1, -14, -4, -10, -23, -43, -34, 37, -25, -15, -37, 21, 5, 3, 15, -28, -4, -1, 49, 4, 9, -25, 35, 3, 14, -2, 8, -9, 36, 45, 37, -5, -29, -12, -12, 63, -29, 14, 11, 5, 18, 34, 31, 29, -23, 57, -6, 2, -4, -24, 16, 9, -25, 3, -9, 14, -18, -2, 54, 67, -1, -61, -11]
5511a1%J7o5M5L6l6j5J7mK5O0r2O0l3K3j1n6M2rOj6L3RmJq7Q5o7M5J2QM2p5L8
5545B3r0O2NL4kll9L0j9k3l3%Q6Qk1J4L1n9k3J2lMK9jQk3O3p1N7p2N5n1J7No0
5580e0P5j2L5l9pl1N7n6L8K2m7J6MqM5l7nJ6J1m5j2M9Lln4L9n2O3k7pM1k2k5M0
5614A5OMQk6m0J7L5m0N1k8j8K7k1NL1qlm9Q6j9n1Q4j14J0J16p8R5o3l6K5l7k5
5646d1J6N3l3K0k9l3M6p3J07q7O9k9K8J8n9O1l2l1N1k9M3J3n6j9K0K2J8p8O5K8
5676D9J6l9m7L2J2m0L6p9M7M9j8k2J9j9J9p0O0k2k8LJ4Lk3J5L1Loj5N7k7jk2j9
5709c2mL5J5m7R4p2K9j6K5nl2oj1L8qopk1N1k6K5o0L8Lk2KM8qp4J3O1m6K1J3n
5744CP1o6O5q1M6Pm5Om7N3kpL6k5j4j3L9oJn0N4j2q6M0L2j3k8O5n3L8J9j7p7M1
$$ y = [-11, -11, 6, -59, -14, 22, -14, -29, -12, -16, 9, 69, -23, 37, 4, 27, 16, -40, 2, -7, -1, -17, 16, 25, 21, 22, -65, 20, -47, -2, 10, 18, 60, -15, 23, -67, -5, 0, 34, 32, 29, -10, 20, 1, -22, -55, -55, 31, 39, 18, 32, 63, 4, -19, -7, -10, -6, 23, 22, 30, 7, 70, -1, 56, -16, 39, -12, 5, 10, -50, 25, 13, 48, 9, 2, -29, 28, -28, 10, 32, -15, 1, 5, -3, 42, 5, 0, 16, 27, -18, -30, 19, 22, 19, -35, 4, -48, 15, -12, -19, 22, 0, -25, 15, 21, 25, 33, 7, -33, -16, 19, -21, 30, 2, -16, 11, -10, -5, 26, 18, 15, -34, 52, 33, -18, 66, -48, -38, 78, 0, 95, 32, -4, 21, -16, -41, -25, 28, -5, 15, -14, -47, -1, -74, 33, -54, 15, -14, 14, 32, -27, 34, 2, -29, 22, -7, 36, 49, -7, -26, -6, 16, 34, -44, 21, 49, 65, 26, -21, 11, 23, -17, 19, -60, -13, 36, 18, -4, 15, -4, 15, -55, 5, -17, -45, -42, -28, -25, -48, -33, -2, 1, -5, -20, 37, 10, 9, -13, -32, -36, -1, 14, -33, 61, -11, 18, 2, 27, 22, -10, -16, -27, 11, 3, -3, -10, -31, 20, -6, 19, -41, -3, 0, -22, -20, 28, 20, -54, -41, 20, -26, -5, 8, 3, 74, 8, 73, -8, 38, 45, 0, 6, -41, 12, 10, 3, 39, 14, 0, -13, 26, 20, 21, -29, 25, 13, -73, -33, -1, -14, -42, 23, -30, 8, 27, 10, -67, -26]
5778b6j7J2J4K0R7j23J2rpLO2j0mJ7m7N5j3k3K9k8Lk3jJ4K4L9p0kj3O6o9kRJ0
5812aL5l0K2j5L8o5OL6m4L8j1ll7M1J0n3k2M2L4On8k4O0J1l0L3l2%O8q2L7J9m7
5845a8Mj7%L6Ok7M8p0pL1J2J0j4j5j1RJ8M3j12L4K7N0o1L8j4MrO1k1j8L0o6O1
5878D2p6L9L1j8l1L2l4L6l5K0o0K8L5J0o0L9k6oN6j5Kk2KN1r9L3M2oL7m6k0J0
5910ilk5L9l9k1O5L9l3l8k4N8K4lpN1r5L0k2k6K2kN4l5j6k7R3o2kj3k4O5j5j1
5943a2M1j5j7K7o6J9L7K0m5m7N3L1n6LO0l5k3J1J0K4kk4J0kJ0J3j6qON6j6l0l7
5976b0M0m2K0N9p3L3ljp7J17m0m8R7r8J2RL2J6l5K1jK2l5K2n4J7mQM4m0N5p6Q3
6009F0j09M2L0m4J8q1O8K8nMRl1KL2l0j0J1k3J6k0N1j5n9L4K9j5j0L5K5p8Q7k7
$$ y = [-26, -43, -31, -17, 3, 100, -23, -11, -20, -27, -24, 38, 28, 24, 41, -6, 49, 36, 13, 42, 14, 17, -6, -7, 7, 31, 70, 0, -2, -15, 51, -18, -20, -11, -1, 34, 4, 26, 11, 49, -16, -10, 26, -18, 20, 9, 6, -31, 10, 20, -33, -55, -13, 21, 27, -31, -55, 5, 16, -14, 19, -13, -13, 55, -27, 10, 29, -18, -14, -31, -31, 5, 11, -16, 32, -38, -45, -14, -2, 8, -6, -21, -32, -23, -5, 38, -74, -40, -13, 37, -24, 14, 0, 4, -5, 56, 35, 17, 47, -19, 42, -34, 5, 36, 18, -13, 19, -15, 21, -14, 6, -54, -26, 9, 19, -41, -2, -28, -34, 22, 7, 9, -13, -11, 40, -59, -26, 16, 10, 47, 1, -19, -9, -12, -37, 2, -37, -58, 7, 46, 13, -25, -49, 9, 33, 30, 23, 74, -21, 9, -13, -39, -17, -19, 35, 0, -16, -43, 50, -12, -14, -27, -51, 14, -1, -12, 29, 14, -3, 24, -42, -23, 14, 34, -11, -58, -5, 26, -30, -27, 33, -2, -25, -14, -4, 20, 18, -6, 4, 2, 12, 25, 9, 1, 7, 63, 47, 17, -20, 20, -22, -2, 57, -16, 17, 14, 13, -64, 53, 13, -35, 62, -36, -24, -15, 17, 33, -2, 19, 18, 40, 5, 27, -27, -10, -14, -6, 38, -2, 53, -23, 60, -49, -7, 23, -21, -3, -84, -16, 12, 7, 11, 20, -11, -9, 23, -7, -17, -6, -29, -13, -33, 18, 3, -56, -22, 7, -8, -18, 17, 42, -36, 51, 24]
6041B4j4Kj3Jk8N4m2M2Pj7j5KL0L8m8qo4Q3n3J9K8NRm2K8qk3j6L6m6RK5j5j6K5
6076aM3k0o4R8n0L9nm8J1k0M6j2nl8M1j8J3ol4K6N5m3Jl8k4Q9l7JK3p7K1mmQ8
6110D7r3L5L1l6M2J2m2J5mJ5J5m6L1j9J6qj2k0M4kll2L5kj9k4N5rj4J6rJ2o0l9
6144g2R1o9M4jK8jj6l4N7p6J9M7Kpm0L1j2J2J3Rj5j7l3M5qK4k2O9n1m4O4m1k9
6177c3M2k2M0L6r0N7j1l4mpM2o1kK3j5L1j8kJ3L5Mm5lmoO5o3L%Q1k2m3Q8j17P6
6212C4%j0J4k6oJ5n2N4o7O8k5jl4kj6L7%K8j5j7J6pm2J8K7J9l4RKKQj5M4j00P1
6247cQL3j9pp2R1l0j1j8J9K6rNQJl9k3K5j0k2M8L3k8Qm3L9n8P5Mj1Lrnn4M9Pj2
6284aL1K5j11Q1L6q1L5l3k4RQ5n5KL0o9P8m5j0K6rN1n1J6l2j5J8QO8p7l9K2RJ6
$$ y = [24, 10, 12, -1, 0, -28, 26, -16, 26, 33, 16, 1, 3, 33, 71, 23, 15, -49, 34, -19, 0, 28, 33, 42, 0, 28, 20, -3, -19, 17, -29, -20, 5, -10, -26, -1, 42, 22, -42, 56, 6, 45, 40, -8, 3, -17, 29, 17, 12, -26, 15, -3, 10, 4, -30, -4, 51, 8, 9, -29, -53, 36, -1, 0, 23, -54, -33, -37, -41, 47, -46, -11, 20, -16, 26, 38, -4, 11, 7, 22, 37, -9, 22, 3, 19, 11, -1, -21, 23, 21, 18, -14, 21, 19, 0, -24, 31, 22, 8, 24, 15, 27, -33, -72, 19, -50, -6, -7, 21, 20, 4, -30, 27, -49, -30, 17, 19, 12, -28, 3, -9, 3, 16, 25, 10, -7, -40, 5, -3, 21, -1, 68, 17, -27, 37, -4, -33, 9, -13, 27, 63, -27, 30, 19, -15, -19, -26, 16, -45, -47, -24, -39, -8, -26, -28, -15, 20, 24, -21, -24, -28, -34, 31, -32, -29, -29, 52, 30, -13, 75, -42, 34, 34, 24, 38, 12, 6, 21, -31, 23, -44, 24, -1, -2, -36, -38, -54, -17, -17, 11, -4, -21, -5, -12, -54, -36, -9, 10, -24, -15, -13, -11, -3, -18, 26, -74, -3, 5, 38, 19, 12, -60, 31, 1, -10, -28, -9, 17, 8, 13, 21, 22, -17, -40, -15, -25, -47, 1, 34, 6, 14, -29, 10, -48, 27, 31, 20, 23, 14, 9, -45, 4, 11, -1, 30, 55, -56, 25, 61, -20, 15, -18, -42, -33, 52, -3, -1, 29, -40, 38, -7, -17, 9, 0, 51, 0, 16, -16, -31, -13, -5, 63, -14, -53, -31, -22, -6]
6317fNk6LN1j4n6M0l6N4J1j9k2K9L1k8k0Kj1K3k9kk9Q9l8j7J1j1P2j02K7N0pk
6350B3jo9O0k3KJ3m0J7K4Po0P2p3L9J0Lk3K0J0m0K4N0n0J9n6L9J0nNLj9M3k0k3
6384ij9L7k2Oj1L8j9J7m2J1Kk0O4k0nl9m6L4J1K9M0p2L6J1n7K1P4m1K3n2K0o0
6416f0P1j7K7OmrPn1nM1jnNj5ON7n0l1kL0n8N9nm6KOL3Lj1J4LL4o3K3J3j7M0n5
6454b5K3K3K5n6M7J5n0Qj2nJ6j5J2k0L6p3K0MN1n5k3P4l0K9o5QkL8L0q7O5K1n0
6487b3K5Jk6J0M9lk9l0K2L4m5J2L5n6L6lJ7j2jr0Q3l0O6k0m7K8n5O9k5J5k1J7
6519Cpk7J7KM7p2LO2m4N1m4j9N9o1L4j0O2k6J4n0M8q9K8J1KL5j7j5m5N2kNk1Q5
6553G1n0o7P8q0K8J3L0n8O5K1n3Kn4K0R5m3k2pPp0P9Pj0%ok1M0n5L5KJ6K2o8M8
$$ y = [-6, -1, -27, -24, 27, 13, -43, -3, -39, 15, 26, 7, -15, 14, 45, 17, -3, -1, -12, 11, -18, -20, -49, 40, 2, -15, -4, -15, 57, -45, -18, 32, 25, 23, 22, -47, 13, -10, -8, 5, -35, -18, 6, 13, -47, 25, -48, -9, 1, 4, -19, 1, 11, -29, -5, 45, -5, 14, -42, -3, 7, 2, 7, 10, -9, 34, 14, -9, -28, 9, -13, -7, -18, 20, 1, 18, -24, -13, -11, -31, 33, 13, 8, -31, -77, -43, -32, -3, 37, -35, 1, 12, -45, -24, 50, 9, 32, -20, 0, -60, 11, -6, 21, 27, 23, 14, 21, -30, -35, 6, 5, 0, 5, -10, -4, 53, 3, -28, -30, 0, -58, 1, -4, -50, -48, -42, -9, -6, -17, -3, 0, 34, -29, -6, 7, -10, 30, -25, -2, 21, 46, -10, 37, 52, 2, 10, -2, -7, 9, -6, 6, -14, 22, -51, -31, -27, 24, -31, -54, 20, -10, 19, -46, -38, -40, -2, 28, -59, 6, 27, -23, 2, 3, -23, -13, 36, 33, 4, -26, -4, 30, -15, -3, 32, -24, 12, 9, 26, 14, 13, -77, 6, -24, 42, 22, -25, 3, -52, 17, -8, 7, -14, 3, -4, -31, -14, -12, 35, -37, -34, 28, -16, 35, -9, -28, 31, -30, 4, -6, 56, 30, 44, -6, 42, -47, -19, -8, -6, 29, 12, -3, -48, 4, 2, 7, -14, 71, 21, -46, 32, -48, -20, -7, 23, -35, 30, 51, -2, 0, -54, -34, 61, 18, -4, -11, -4, -74, 5, 12, 2, 2, -4, -25, 15, -40, -5, -3, 13, 35, -33, 15]
6587A5k8kl5M0J0km7K8k0M8%l6Qk5N1kl0L1pQnj2jL6k8oN8l8PJ0k9M3m2k7Q5q7
6623c1K9k7M0K1k0j5K0k2jML8km2m6L1J3l8RJ6K1K8m7m9O5Ml0K9j4m1Q7J3l9l6
6656c2N0mj7N6j7l4J1n7O5m3K2k9Q2j2l4K2l1m6mJ3J5M1j0J6o0P3j10O5J00j18
6686b7M3k9lK7m9N2m3MJ6J0J2k3n8N3kL0l9QM0K5j08P3K1l0J8K2o9M2o0O9n3k
6718c0PK8k7NJ3mN4p2k9L3L3j5M3l9j1N3k1l6M1N4%n2k7OJ7j8J7J5o7N9j6j2m2
6751d0L5N3m1K7l9m8Q5q6N5qJ1k4L2m7K3K2m0L6rl5K8l2O1n9N1opm4J0N0k4N2
6783D2Pm2qk7K7M6j4n0mM7j6k1M3o4P4o4M7l9J0J1j2%Rk4M8n0L4m2J7JMP3q1L4
6817A6l7K7K7m8k8O0J1j2nO1j06L9l5L2JK2r5R1p%k2j4K8nJ3k5K7k4P2p8K3j6
$$ y = [15, -13, -15, -50, -10, 0, -2, -49, -21, -41, 7, 7, -29, -21, -46, 5, 3, -27, 4, -3, 5, 0, -12, -13, 23, -5, -11, 47, 9, 16, 26, -3, 40, -2, -29, 56, -31, -2, -29, 11, 32, 12, -3, 17, -5, -6, -2, 36, 34, -8, -54, -23, -10, -48, -39, -23, -2, 26, -21, -70, -5, -1, -31, -2, -16, -57, 30, 43, 4, -32, 18, 14, -3, 53, 36, 2, 13, -44, 21, -22, 0, -29, 53, 41, 7, 29, -2, -48, -52, -39, -24, 17, 7, 23, -37, 36, -74, -9, 91, -27, 16, -13, -16, 11, -38, 14, -29, -25, -9, 1, 13, -10, -68, -15, -17, 13, -26, -18, 22, 47, -61, 12, 33, 3, 21, 43, -26, 16, -44, 25, -28, -30, -23, 5, -22, -17, -4, -8, 46, -26, -55, -22, 11, -4, 39, 0, -11, 42, 21, -15, 26, 80, 80, 28, 1, 7, 24, 6, 23, 38, -29, 30, 14, 2, -40, -5, 48, 7, 34, -5, -53, 32, -54, 1, -7, 4, -20, 12, -35, -12, 10, -30, 6, -3, -38, -10, -42, 19, -40, 11, 5, -2, -46, -36, 14, -10, 42, 49, 7, -1, -28, -1, 45, 31, -19, -23, 24, 8, -13, 30, -34, 40, -24, 23, -16, -6, 5, -7, -7, 2, -22, 26, -24, 10, -32, -15, -14, -10, 63, -18, 16, -21, 6, 33, -15, -43, 17, 28, 16, 11, 72, -34, 5, -30, 2, 3, 25, -70, 21, 14, 14, -8, -22, 6, 1, 14, -11, 16, -8, 64, -14, 9, -7]
6849gJ7m8k4K8K4K5J5J2k3Ok6KJ9KrJ1m4M1m4O5m1K6J6qj3r2P2j4N6o3J9N3m6
6882Gl7J7L6p0P7k0k7J0l7L2Q7j23K8L7L1j5j6K2n2M1LJ6J2p3L5pl7J7N3p6P1
6913D2l7qK8j0%nm0k0N8J3k8o3J28p8N0k1qrQK8k8k4K0m1N0kK4n6kL7j5J8l7K4
6947drL4j4J7j7oM0j6L6p7M6m7J3n0M1NK2k5K2j6Jk9PJ1NJ1P1q9PJ1jJ9L4p0J7
6982@j7nM6k5Qk9K6L2j0K4k2j6nlM9m9J2n1M3kl1L2k8PK5l1rK9ml0M9LJ0l3M2
7017C7n3J7J3j5rRkL1lp7O0l5J6j2K3lL3k7L2k2L5j0K8p1l7k5M2k0j3kP2Mn0J
7051c3N7J5l5p8O3mJ8M3l2o1K4J8k0jj1J1LM4m8K1j2lJ7O0m3m6N0j8oM6q9L4k
7084a8M9l5j0J5l5J2%PNK6l6M5l1n0M5l5L7L4k0lk%K9l9KpN1J3o7O7m2j0O4r8
$$ y = [-7, 10, -38, -62, -34, -10, 15, 30, 42, 19, 25, -1, 1, 20, 22, 13, 24, -20, 21, -23, 42, 1, 27, 43, 35, 22, -70, 2, -12, 44, -19, 0, 53, 7, -30, -13, 23, -47, 30, 10, -17, -7, -44, -12, 75, -48, -20, 17, 48, 33, 17, 39, -13, 28, 31, 47, 59, -14, 21, 14, -23, -6, 47, -29, 42, 5, -3, 25, 15, 15, 10, -30, -50, 8, 21, -7, -70, 58, -20, 30, 9, 1, -8, 0, 28, 0, -24, -4, -45, 5, 3, 27, -29, -31, 6, -9, 9, -28, -4, -13, 21, 7, 24, 7, 1, 41, 25, 61, -16, 30, -17, -4, -54, -13, -8, 14, -11, 11, -5, -4, -33, -26, -15, -10, 1, 72, -17, -10, 1, 0, 19, 53, -17, 0, -17, -22, 24, -1, 7, -22, 4, 36, 26, 50, 28, 12, 7, 4, 53, 4, 16, -35, 8, 6, -25, 7, -21, -14, 11, -20, -29, 0, -4, -34, 15, 18, 28, -5, 37, -16, 1, 14, -1, -10, -1, -3, 28, 25, -52, 8, -27, -11, -23, 0, -3, 30, 3, 35, 13, 48, 38, 66, -5, -42, -67, -25, -45, -58, -60, 12, 16, -34, -33, 24, 39, 4, -74, -11, -15, 3, 46, 14, -47, -23, -5, -25, -26, -37, -26, -23, 21, -27, -6, -18, -21, -4, 56, 13, -33, 17, -1, -7, 39, -50, -16, -18, 31, -4, -14, 1, -34, -22, -22, -15, -10, 16, -20, 25, -6, -56, -11, -46, -9, 25, 5, 2, 0, 0, 29, -10, -8, -15, 36, 49, -18, 49, 7, -3, 61, -37]
7118c7L0J2nnK7j3k8M2m5K2L0n2k9N5j8qL2rlRl1%k7K6J6LK3m7M2lk9j4N0K2J3
7153E1l8M3n3N4Lm2l1L3j8mK8j0k1nK9k3L7n6pJ04r9O9J2q9mK7O3n8l5O2n6J7
7185a7j9M9Km7M6k2rM0j9o6O5JM0p7L5L7j3j4J9m2Qk0O7n9M5n3M8P5j35Q0l0k7
7217a2K6nM4k4n6N0rj6K1m0j8L0%J7k8K6j6J1Lk3K8l7L1m1K3L1o0M0L4l0J0j3
7249ckK2K0j4lk9L5m8k8m5J28p2L9M2j00J25n2M7p1k4L2j3L8n2O8j00Q5Lk2oR
7280IM5p6LN4l0L1m6NJ5l6M1L5m7n2L2M9o3M5q7P4j0j4J3j4J9qL3mm9K4J9m0M5
7313A5PNLm5NkJ4MKk3NRj2J3nJ3Lp1L7J7m4M5j2O9r8K3J8noM4m3k7N3Mn2M4n2
7350d5L7oRJ4l3Q4n0nQ7p9k3K3jNJJ6k9N5k7n1j0M2n5R2m5j3mOJ0OMJ4j1m0j5
$$ y = [-37, -7, 5, 0, -5, 22, 9, -19, 23, -22, 0, 30, -22, -51, 4, -14, -22, 10, 1, -2, 7, -24, -24, -51, -25, -9, -6, 17, -30, 12, 9, -20, -34, 16, 38, 51, 13, 56, 3, 57, 60, 18, -13, 20, 2, -2, 26, 16, -5, -10, 19, -4, 33, -23, -30, 74, -25, 44, 56, -33, -37, -10, 53, -5, -40, 22, -34, -17, -36, 13, 15, -32, 14, -8, -17, 23, 4, -62, 3, 4, 44, -33, 2, 39, 26, 12, 31, -11, -3, -23, 44, -15, 30, -23, 25, 100, -35, 45, 15, -12, 14, 9, 53, 29, -27, 23, 14, -2, 19, -21, -39, -9, -9, 8, -20, 6, -10, 1, 4, -19, 9, -28, 3, -38, -15, 16, -44, -4, 30, 0, 10, -3, -5, 17, 37, 23, 20, -9, 26, -22, -50, -95, 33, -39, 0, 42, -58, 67, 15, 62, -9, -33, -1, -14, 24, -28, 40, -60, 25, 28, 6, 0, 9, 54, -22, -19, 35, 5, 36, -10, -5, 10, -26, 15, 50, 3, -49, -17, 32, -31, 14, -73, 1, -9, -23, -10, -24, -5, -13, 20, 16, -33, -9, 10, -30, 15, 22, 27, 30, -15, -10, -12, 2, 6, 8, -15, -10, -1, -13, 0, -5, 8, 11, -60, -23, -6, -50, -5, -17, 52, -46, -23, -5, -10, -16, 28, -15, -42, 11, 15, -37, 7, -45, -8, -14, -5, 9, -24, 60, 10, 5, 92, 13, -10, 13, 12, 17, 18, 34, 5, 60, 33, -18, -28, 14, -41, 51, 6, -7, -11, -5, 5, 11, 15, 29, 18, -22, -37]
7385c7nJ8j6k7N4j1QMl6R2p8L4j2L5L7Ok6k3k6K2%m5JK7nJ5p6Q6on7N6k2q6Q4
7419a5K2m5N2n7M6n3Q0n5JNj9L8j3L7J4o2pP1j8m5L8K8pk5lJ4j32J14j2l9Q0m7
7451a4K2M3o3m2Q1ql7N2KMl4Nl5K4j9k7M6m6R4l8j7qj9O3j7moO1o7K6j0JK1k2
7485A2pj7NK1m2J0l4P9l7RM1q2N9m4P2l4qk8OOOPj6j0MmJ6K5j1J8k5K3J2m0Nk
7521ej2K2M3m7lm9P9j0pL1n8MN8j17P1MJ1k2J0K1j9J3k5J9k0L2m3L4q0O7J3on6
7554d7K8k4M7J1L3l0k0k2L4J9J5m9KQ1r4jN4k9%mJ7L1r9M7N6p2L0j4k7kj7%N2
7587FpJ5k8J4oL2p2QO2lk9J0pL3m3K9k6KM4l3L0m8L2n6L4M2Pl5j3k5M8qOKRj0
7623A6J0qn2N7ll6rOkQK1J8l7j3mk3N5M0n4J2J8JM8n0Lnk9j4K4M3k1mk8K1m7K0
$$ y = [-37, -42, -24, -40, -67, -13, -24, -16, -12, -48, 44, -34, 0, -12, 23, 60, 66, 40, 17, -9, 13, 13, -32, -31, -4, -9, 6, -70, 16, 10, -47, 9, -13, -99, -15, 7, -38, 14, -43, 3, -50, 30, -25, -24, -19, -38, 0, -13, 24, 38, -24, -31, 40, 22, -23, 15, 43, 36, 11, 8, 22, -110, 4, -8, -47, 33, -14, 8, 51, -12, -54, 27, 19, -18, 34, 36, 40, 6, 11, -24, 0, -19, -46, 0, -46, 48, 10, -7, -15, -34, 29, 12, 8, 2, 63, -4, 22, 12, 13, 34, 12, 5, -12, -7, 14, -28, -18, -52, 27, -10, -1, 40, -42, 17, -27, 45, 11, 3, -25, -19, -13, -7, 0, -16, -26, -22, -26, -10, 15, 4, 22, -3, 20, 32, -8, -3, -5, -17, 5, 48, 1, -2, -51, 28, 18, 11, 42, -16, -12, 46, -71, 0, 4, 15, -7, 3, 24, 5, 18, -7, 12, -8, 24, -19, 15, -65, 2, 15, 9, -47, -19, -43, 4, 15, 48, 18, -2, -24, 10, 29, 44, -5, -3, 78, -16, -17, 37, 8, 8, 4, 21, 52, -47, 0, 56, -16, 14, 0, -27, -29, -46, -46, 6, -1, 14, -14, 0, -6, 26, -46, -38, 24, 21, -8, 2, -5, 28, -15, 14, -12, -10, 34, 1, 31, -17, 15, -41, -7, 35, 42, 7, -6, -31, 17, 9, 15, 17, 26, 16, 26, 18, -34, 23, 20, -16, -25, -19, -21, -13, 8, 26, -11, -24, -28, -51, 4, 44, -10, 2, 20, 21, 69, 19, 22, 17, -12, -26, -2, 41, 20, 16, -12, 9, -38, -18]
7659a8L0nj1L6qk0j9j6P2p7K4oK7m4K9N2m2K1l5lj8KM7K2k1k9L8j1l4J8j3J0%
7692bM7ql3J4l7K7K4J3k4K8o8JL9J4j4k0K1p3lP5k6PNP5j14lL6O7o2k8K4l0l7
7725f5O2N2k2j9j0k4J1O7q0M1j2Qk5J1Ll0L5qmk0l5N2j6NJ6K9k9l1L7m4jmj3R7
7759C4m0l4M5rn5O1m5M1L0Pj9j5jl4L3m6M3J3N7%n1Nk3n6O8K6Mn4J5k9k1N8no7
7793f4P8L3p9OMK7k3rL1m4K6J6k3K1Jk3RL9p6J2J09j04OK7K0J1K7r5NRk3J1rK7
7827a7K4l8jP3j01Q2l8J6k6K2K2l1M2l0l7R3p0j0L5nMl9P8l4k5J1J9m1L5k0J5
7858Hm1M2k0J3nk9J8N3n4L2k5k8M1k4nKM1k8L1p1J6K9MJ4r0Q7m4nM3m4MM8N9j13
7892d1L6l3RM0K7j8j4j6QK5m3J5pJ6k7L9qL7j8jk8K2j5k9JNM5p6N4J5K1o2k5L0
$$ y = [-18, 12, 7, -4, 32, 24, 4, -15, -31, 41, -36, -12, -18, 9, -35, -6, 46, 4, 25, -10, -13, -31, -29, 18, 40, 19, -10, 28, 17, -17, 1, -12, -2, -2, 45, 37, 4, 18, -19, 8, 32, 45, 21, 49, -19, -18, 21, 35, 21, 1, 22, -51, -54, 21, -5, 2, 7, 82, -32, -35, 1, 68, 6, -22, 2, -28, -65, -3, 49, 27, 8, -2, -26, -15, 52, -28, 13, 1, 9, -16, -5, -2, -32, 3, -5, -9, -29, -64, -12, -28, -23, -7, 22, -7, -38, -1, -45, -46, -50, -63, 34, -6, -40, 5, -4, -59, 2, -43, -2, 28, 35, 16, 1, 0, -34, -1, -47, -4, 9, 66, 66, 15, 20, -3, -59, 9, 35, 39, -15, 0, -29, -50, 8, 3, -64, 14, 47, -32, -26, -22, 5, -18, -27, 4, -40, -14, 2, -21, 0, 1, -22, -13, 26, -50, -38, 71, -33, -27, 0, 20, 31, 58, -37, -32, -23, -46, -35, -44, -17, 7, -31, -32, 41, -60, 22, -16, 0, -26, -4, 18, -13, 29, -1, -38, 55, -15, -25, 10, 5, 9, -30, 48, 14, -11, 0, 19, -22, 13, -7, 8, -33, 9, -11, 2, -3, -32, -14, 39, -15, 17, -8, -36, 5, -19, -24, -22, 19, -9, 22, -49, -33, -4, 0, 14, -76, 11, -33, -38, 5, -39, -35, 13, 72, -41, -5, -38, -29, 11, 38, 20, 6, -10, -2, 23, -20, -5, -12, 4, -23, 16, 8, 45, 27, 26, -2, 20, 5, -24, -23, -18, 27, -49, 5, 20, 41, -21, -46, -16]
7926a6L2l0M8m2K9m0K8k8j3O5l6nJ9l1j6M5j9O8o8j0M9n9M7o0M4JJ9K5l4j6m2
7957d6K3J0l6N4ok1J8Ok2%k5O1j7O9r0NN4j01M6O8n4l4L2QQM0m9%K0p2P2j1kj
7991GKorOOPn6P3k3l0jN5j1J9k5Jn4L8K8o0J3K2mqL0mjK8o3K2nj1J4k9M2mk2L4
8029B1jkm1O0m1L1m0M2Op9L9m2M1Krl9M0j0N7m3k5L0l4QLrN3mn4J8j3L3k7K4K8
8064B3j3k2QM6l8m7O7m7M6j4j8J3M9k5l1J4l8L6l1j1O0p6M2K3l1J3k9L9Nk8K5
8095A0J1k5J4n1J6L0Km3N6l6J2l9M6k6Q1l0ll2L2m6K7l6KO7l1l1l1O2j5J9%K5
8127C7j04J08l7m%l5L9k1J8J0o0O6Lm8oO0m9pK4j8J1OJ8j2k4j1K7l0Q6q1L2l3
8159c5J6n2L1QL5j1J3N1n3l6K3J1jL6l1pN1m8jL5p8O5oJ5Jl2L5j7l8l1R0n4
$$ y = [-16, 16, -14, 34, -8, 21, -19, 9, -19, -32, 33, -3, -8, 11, -20, -36, 9, -10, 58, -10, -20, 29, -30, 17, -43, 1, 2, 21, 46, 12, -4, -46, -23, -13, -49, 5, -1, -22, -4, 2, -20, -20, -45, 16, -1, 68, -22, -17, 37, -64, -18, 50, -4, -38, -6, 2, 10, 50, 1, 1, 21, -51, 21, 10, 8, 7, 9, 3, -6, 0, 6, 13, -43, 30, 7, -23, -24, 31, 20, 39, 14, 15, -39, -1, 27, -33, -20, 2, -2, -10, 20, 16, 15, 43, -20, 2, -3, -14, 0, -29, 13, 9, -13, 21, 20, 18, -23, 37, -4, 27, -13, 29, 35, -44, -5, -47, -6, -4, -13, -52, -12, -22, 35, -8, -33, -3, -37, -29, -26, -35, 18, 14, -40, -22, -35, -2, -29, -5, 23, 10, -12, -4, 42, 4, -43, 24, -23, 23, 9, -9, 4, 53, 28, -3, 11, -27, 9, -22, -33, 27, -49, -7, 16, -15, -2, -31, 8, 13, -15, 10, 21, -4, 10, -41, -25, 5, 7, -36, 20, -16, -4, -43, 3, -23, 58, 28, 25, -7, 25, -21, 6, -30, -28, 39, 8, -23, -54, 8, -7, 12, 12, 37, -67, 41, 4, 0, 0, -35, 4, -17, 1, 11, -49, 17, 20, -28, -34, 26, -23, -30, -6, -24, -13, -7, 11, -1, -25, -36, -9, -39, 47, -34, -2, -35, -19, -71, -40, -32, 3, -8, 5, 56, 3, -33, -10, 1, 0, 36, 5, -2, 49, 1, 0, 35, -43, 22, 16, 31, 32, 0, 35, 18, -20, -51, 39, -15]
8191a5
##END NTUPLES=NMR FID
##END=
