##TITLE=1H_Pr DMSO-S
 CCl4
 8 sc, 
 9.06.2022
##JCAMPDX= 6.0         $$ Bruker NMR JCAMP-DX V2.0
##DATA TYPE= NMR FID
##DATA CLASS= NTUPLES
##ORIGIN= UXNMR, Bruker Analytische Messtechnik GmbH
##OWNER= root
$$ XWIN-NMR		Version 3.5
$$ Thu Jun  9 14:15:52 2022 Russian Standard Time (UT+4h)  she@DPX200
##.OBSERVE FREQUENCY= 200.131
##.OBSERVE NUCLEUS= ^1H
##.DELAY= (6, 6)
##.ACQUISITION MODE= SIMULTANEOUS
##.ACQUISITION SCHEME= undefined
##.AVERAGES= 8
##.DIGITISER RES= 18
##SPECTROMETER/DATA SYSTEM= spect
##.PULSE SEQUENCE= zg30
##.SOLVENT NAME= DMSO
##.SHIFT REFERENCE= (INTERNAL, DMSO, 0, 15.7039)
##AUDIT TRAIL= $$ (NUMBER, WHEN, WHO, WHERE, WHAT)
$$ ##TITLE= Audit trail, XWIN-NMR		Version 3.5
$$ ##JCAMPDX= 5.01
$$ ##ORIGIN= Bruker BioSpin GmbH
$$ ##OWNER= she
$$ F:/spectra/data/she/nmr/H-F/1/audita.txt
$$ ##AUDIT TRAIL=  $$ (NUMBER, WHEN, WHO, WHERE, WHAT)
(   1,<2022-06-09 14:14:41.76 +0400>,<she>,<DPX200>,
      <created by zg, POWCHK disabled, PULCHK disabled
       configuration hash MD5:
       00 E9 B6 7A A2 85 ED C7 34 08 36 98 17 FE 4E 26
       data hash MD5: 16K
       8A FD 8E D0 66 9D AB E5 58 76 E4 E7 0A 4C 30 57>)
$$ ##END=
$$ 
$$ hash MD5
$$ F9 B3 4B 79 F3 A7 E5 70 CE D2 68 8C 8B AD 48 C1
##$RELAX= 
##$RELAX= 
##$RELAX= 
##$RELAX= 
##$RELAX= 
##$RELAX= 
$$ Bruker specific parameters
$$ --------------------------
##$DU= <F:/spectra>
##$EXPNO= 1
##$NAME= <H-F>
##$PROCNO= 1
##$TYPE= <nmr>
##$USER= <she>
##$AMP= (0..31)
100 100 100 100 100 100 100 100 100 100 100 100 100 100 100 100 100 100 
100 100 100 100 100 100 100 100 100 100 100 100 100 100 
##$AQSEQ= 0
##$AQ_mod= 1
##$AUNM= <au_zg>
##$AUTOPOS= <>
##$BF1= 200.13
##$BF2= 200.13
##$BF3= 200.13
##$BF4= 200.13
##$BF5= 200.13
##$BF6= 200.13
##$BF7= 200.13
##$BF8= 200.13
##$BYTORDA= 1
##$CFDGTYP= 0
##$CFRGTYP= 5
##$CHEMSTR= <none>
##$CNST= (0..31)
1 1 145 1 1 1 1 1 1 1 1 1 1 1 1 1 1 1 1 1 1 1 1 1 1 1 1 1 1 1 1 1 
##$CPDPRG= <>
##$CPDPRG1= <>
##$CPDPRG2= <>
##$CPDPRG3= <>
##$CPDPRG4= <mlev>
##$CPDPRG5= <mlev>
##$CPDPRG6= <mlev>
##$CPDPRG7= <mlev>
##$CPDPRG8= <mlev>
##$CPDPRGB= <>
##$CPDPRGT= <>
##$D= (0..31)
0 1.2 0 0 0 0 0 0 0 0.06 0 0.03 0 0 0 0 0.0002 0 0 0 0 0 0 0 0 0 0 0 0 
0 0 0 
##$DATE= 1654769681
##$DBL= (0..7)
120 120 120 120 120 120 120 120 
##$DBP= (0..7)
150 150 150 150 150 150 150 150 
##$DBP07= 0
##$DBPNAM0= <>
##$DBPNAM1= <>
##$DBPNAM2= <>
##$DBPNAM3= <>
##$DBPNAM4= <>
##$DBPNAM5= <>
##$DBPNAM6= <>
##$DBPNAM7= <>
##$DBPOAL= (0..7)
0.5 0.5 0.5 0.5 0.5 0.5 0.5 0.5 
##$DBPOFFS= (0..7)
0 0 0 0 0 0 0 0 
##$DE= 6
##$DECBNUC= <off>
##$DECIM= 32
##$DECNUC= <off>
##$DECSTAT= 4
##$DIGMOD= 1
##$DIGTYP= 9
##$DL= (0..7)
0 120 120 120 120 120 120 120 
##$DP= (0..7)
150 150 150 150 150 150 150 150 
##$DP07= 0
##$DPNAME0= <>
##$DPNAME1= <>
##$DPNAME2= <>
##$DPNAME3= <>
##$DPNAME4= <>
##$DPNAME5= <>
##$DPNAME6= <>
##$DPNAME7= <>
##$DPOAL= (0..7)
0.5 0.5 0.5 0.5 0.5 0.5 0.5 0.5 
##$DPOFFS= (0..7)
0 0 0 0 0 0 0 0 
##$DQDMODE= 0
##$DR= 18
##$DS= 0
##$DSLIST= <SSSSSSSSSSSSSSS>
$$ [...]
##$SUBNAM2= <"">
##$SUBNAM3= <"">
##$SUBNAM4= <"">
##$SUBNAM5= <"">
##$SUBNAM6= <"">
##$SUBNAM7= <"">
##$SUBNAM8= <"">
##$SUBNAM9= <"">
##$SW= 18.0517599122864
##$SWIBOX= (0..15)
0 0 2 0 0 0 0 0 0 0 0 0 0 0 0 0 
##$SW_h= 3612.71676300578
##$TD= 16384
##$TD0= 1
##$TE= 0
##$TE2= 300
##$TE3= 300
##$TEG= 300
##$TL= (0..7)
0 120 120 120 120 120 120 120 
##$TP= (0..7)
150 150 150 150 150 150 150 150 
##$TP07= 0
##$TPNAME0= <>
##$TPNAME1= <>
##$TPNAME2= <>
##$TPNAME3= <>
##$TPNAME4= <>
##$TPNAME5= <>
##$TPNAME6= <>
##$TPNAME7= <>
##$TPOAL= (0..7)
0.5 0.5 0.5 0.5 0.5 0.5 0.5 0.5 
##$TPOFFS= (0..7)
0 0 0 0 0 0 0 0 
##$TUNHIN= 0
##$TUNHOUT= 0
##$TUNXOUT= 0
##$USERA1= <user>
##$USERA2= <user>
##$USERA3= <user>
##$USERA4= <user>
##$USERA5= <user>
##$V9= 5
##$VALIST= <valist>
##$VCLIST= <CCCCCCCCCCCCCCC>
##$VD= 0
##$VDLIST= <DDDDDDDDDDDDDDD>
##$VPLIST= <PPPPPPPPPPPPPPP>
##$VTLIST= <TTTTTTTTTTTTTTT>
##$WBST= 1024
##$WBSW= 4
##$XGAIN= (0..3)
0 0 0 0 
##$XL= 0
##$YL= 0
##$YMAX_a= 27738
##$YMIN_a= -102690
##$ZGOPTNS= <>
##$ZL1= 120
##$ZL2= 120
##$ZL3= 120
##$ZL4= 120
##$ABSF1= 10
##$ABSF2= 0
##$ABSG= 5
##$ABSL= 3
##$ALPHA= 0
##$AQORDER= 0
##$ASSFAC= 0
##$ASSFACI= 0
##$ASSFACX= 0
##$ASSWID= 0
##$AUNMP= <proc_1d>
##$AZFE= 0.1
##$AZFW= 0.1
##$BCFW= 1
##$BC_mod= 2
##$BYTORDP= 1
##$COROFFS= 0
##$CY= 11.3945322036743
##$DATMOD= 1
##$DC= 2
##$DFILT= <>
##$DTYPP= 0
##$F1P= 2.36226072786647
##$F2P= -0.459571619588291
##$FCOR= 0.5
##$FTSIZE= 0
##$FT_mod= 4
##$GAMMA= 1
##$GB= 0.15
##$INTBC= 1
##$INTSCL= 1
##$ISEN= 128
##$LB= 0.24
##$LEV0= 0
##$LPBIN= 0
##$MAXI= 10000
##$MC2= 0
##$MEAN= 0
##$ME_mod= 0
##$MI= 1.114404
##$NCOEF= 0
##$NC_proc= 0
##$NLEV= 6
##$NOISF1= 3.799351
##$NOISF2= 2.8
##$NSP= 1
##$NTH_PI= 0
##$NZP= 0
##$OFFSET= 15.70392
##$PC= 1
##$PHC0= -18169.04
##$PHC1= 145.4007
##$PH_mod= 1
##$PKNL= yes
##$PPARMOD= 0
##$PSCAL= 0
##$PSIGN= 0
##$REVERSE= no
##$SF= 200.130013532006
##$SI= 16384
##$SIGF1= 3
##$SIGF2= 2
##$SINO= 400
##$SIOLD= 16384
##$SREGLST= <1H.CDCl3>
##$SSB= 0
##$STSI= 0
##$STSR= 0
##$SW_p= 3612.71676300578
##$SYMM= 0
##$S_DEV= 0
##$TDeff= 0
##$TDoff= 0
##$TI= <>
##$TILT= no
##$TM1= 0
##$TM2= 0
##$TOPLEV= 0
##$USERP1= <user>
##$USERP2= <user>
##$USERP3= <user>
##$USERP4= <user>
##$USERP5= <user>
##$WDW= 1
##$XDIM= 8192
##$YMAX_p= 0
##$YMIN_p= 0
$$ End of Bruker specific parameters
$$ ---------------------------------
##NTUPLES= NMR FID
##VAR_NAME=  TIME,          FID/REAL,        FID/IMAG
##SYMBOL=    X,             R,               I
##VAR_TYPE=  INDEPENDENT,   DEPENDENT,       DEPENDENT
##VAR_FORM=  AFFN,          ASDF,            ASDF
##VAR_DIM=   8192,          8192,            8192
##UNITS=     SECONDS,       ARBITRARY UNITS, ARBITRARY UNITS
##FACTOR=    0.0002768,     1,               1
##FIRST=     0,             0,               0
##LAST=      2.2672688,     0,               0
##MIN=       0,             -102690,         0
##MAX=       2.2672688,     27738,           0
$$ Real data points
##PAGE= N=1
##DATA TABLE= (X++(R..R)), XYDATA
0@%%%%%%%%%%%qJ6j6J6j7K5l3M1m9N7p2Q8j04J20j38J63j94K22k51K87l30L78
33B01m27M81n42O11o84P62q50R48j057J175j300J437j590J756j934K130k348K587
51A356k851L142l462L822m231M692n216N823o538P389q418R697j1340J3531j6605
66i209K1243k9043M4747o8884J9062L6879k5559J9287j5129J2261j0539Q921p595
79c558P080o487N529m714M322m118L884l424L094k841K240j836J670j447J274
94F68j779J891j508J290j141J143q83Q38p96M43m75M53k70L27n96N01j35L86p36
113c79L93nJ16m2j74K33j03P6o4O1p6m36N37k29J37J5j91L48p5R5m09J99j4k24
137b11M7lL32k9l08k1J17L39j78m4J84j37k98R7K24M2j02r9R7o0P4K24l42J94
$$ y = [0, 0, 0, 0, 0, 0, 0, 0, 0, 0, 0, 0, -8, 8, -8, 8, -9, 16, -17, 24, -25, 32, -40, 48, -56, 64, -74, 89, -105, 117, -134, 153, -177, 201, -226, 255, -287, 324, -360, 402, -448, 500, -557, 618, -682, 755, -835, 921, -1013, 1117, -1231, 1356, -1495, 1647, -1815, 2007, -2224, 2468, -2748, 3075, -3463, 3926, -4492, 5205, -6135, 7396, -9209, 12034, -17009, 27738, -41146, -22084, 14795, -10764, 8523, -6606, 5655, -4884, 4037, -3558, 3522, -2965, 2564, -2150, 2172, -1946, 1938, -1486, 1608, -1233, 1007, -829, 841, -606, 668, -1111, 780, -728, 562, -579, 564, -319, 519, -277, 166, -309, 144, -126, 201, -395, 106, -29, 357, -379, 14, 9, 125, 83, -91, 142, 39, 115, 51, 112, 36, -400, 137, -92, 45, 60, -131, 217, 142, 237, -172, 27, 13, -211, -164, -167, 165, 136, -172, -193, -76, 263, 85, 41, 225, 88, -210, -113, 111, 153, 51, -48, 49, -11, 63, 287, -55, 139]
161A39J63j23j6l47L09l28J69j9L7Q2j14M3J14j87Q0o2J57o6K29k60P2j79K26
184A19K3k12J74k87K00j92j0K69k84M13k50L8J73m58M28l63J07RL28l5k17J03
206G6p7Q3mj30p5l0n9j17N40q2j67J83j55n1K96l80O5J21j31l9K84k22K50l67
230a88L35R6j79J22j78N5R6l8Q3j46j13K19k73P0j15j5P5K64n27O17l04o9J04
253io5J47j08L72M1k72J06l56K3J24l0J01j68K34k89K02q1j13O3OL50m78L26j11
277A5Q5p5Q8k09L1K9j92K13J0J58k15j14L90j08N3r0k04k0Q7J38Q5m9n2k94M09
302A69l58K40J0j07P1J90l32O8P0r9j14p7K16K84k40j26LO3n3K39k23J20o3M5
326dp9J62m8J01k63LK62k33M02l19J60o2j10J22m0o1M0J38r3q0k14J99O6p6J10
$$ y = [139, 302, 179, 163, -184, 125, -203, -34, -53, -16, 66, -48, -5, 109, -78, 2, -60, 97, 31, 260, 0, 72, -107, 119, 142, -70, 104, -183, 17, -175, -185, 84, -200, 213, -37, 1, 174, -284, 144, -219, -112, -103, 225, 190, -27, 76, -1, 82, 78, -52, -127, -157, -216, -333, 207, 125, -42, 141, -14, -65, 231, -149, -84, 37, -94, -133, 151, -71, 179, -188, 147, 243, 64, 186, 8, 63, 159, 121, 204, 58, -55, 164, -109, -39, -154, -169, -94, 170, -357, 260, -44, -113, -9, -74, 73, -35, 337, 378, 106, 212, -144, -121, 3, -27, 74, -94, 140, -149, 53, -28, -141, -78, -72, 278, -200, 126, 15, 100, 25, 113, -96, -65, -36, -228, -15, -5, 153, -62, -176, 214, 106, 159, 69, -135, -155, -68, 70, 155, 106, 54, -240, 169, -189, 51, 61, -46, 25, 215, -117, -49, 21, -78, -192, -269, -53, 231, -9, -135, -132, -69, -122, 117, -106, 14, -49, -4, -83, 79, 31, 132, -131, -128, 134, -99, 303, -16, 144, 82, -28, 94, 54, -7, 33, 171, 78, -2, -216, -17, 49, -27, 83]
351H3k5j43K47k62j17K53p7o5r2J80j83K44j47L02l14L9K55k31J18rj80j60N32
374B48k02K2QP4l0q2k43L64k86J35l34L25j26L80k16q4k5J00J54q9L0k53K71o8
398G3J60j54M7k19J94k24L42j71l01L6J25K58m06K34m3q4K29J2L7k18L11k33k3
421a8J08l1J07k7J61o14L63J95j32k74J09R3j79J07K9N2p2J07p5P5N3K85o30Q0
445a28K64j60p5L7K01l09P04n14o9J52J53l71K36p5Oj15K46j37k39K36K06l76
467a27M7nJ43lj99K19Q7L2j83q9K50j45k75J32O9L2J22J7q5J42p0k23K13O3k07
492d3m7m6j04L20k10O8J48l96K68N8N1o9j16J91l80K20J6j94N14j31k21P6J40
515A13k20j11K74j07R0q7K17P3jj35j34K56k42K9k0l1K04j23j95K84J3k47J09
$$ y = [83, 58, -85, 162, -100, -217, 36, -41, -106, -198, -18, -201, 43, -104, 198, -116, -77, 178, -53, 65, 56, -124, -284, 248, 46, 68, 76, 150, 120, 38, -205, 159, -127, 8, -326, -1, -127, 253, 37, -47, -72, 28, 182, 93, 123, -130, 141, 73, 233, 79, 126, -93, 101, -123, 219, 48, -253, -217, -92, 166, -240, -6, -49, -133, 96, 108, 145, -73, 238, 5, -18, 90, 59, 166, 139, 300, -314, 49, 244, 112, -162, -53, 40, -139, -32, -3, 49, -23, 84, 9, 84, 137, 422, -208, -128, 136, -24, -99, -62, 139, -170, 534, 20, -49, 103, 256, -115, 121, 46, 52, -63, 183, 46, -193, 43, 249, -127, -80, -85, 58, 55, -144, 75, 162, 194, 11, -78, 172, 27, -248, -116, -47, -15, 107, 124, 39, 181, 111, -112, 101, 164, -43, -90, -136, -240, 80, -130, -62, 86, -310, -42, 16, 67, -2, -118, 73, -307, -87, -71, -265, 249, 118, -103, -27, 113, -107, -218, 56, -51, 39, -48, 169, 242, 241, 106, -28, 228, -14, 15, -5, -36, 168, 45, -150, 134, 147, -100, 9]
538IRq9J16j6J69j55j10j05J86K3M3Q3Q5o0N4l64J86Q6K7r7m1J24l34L48j20m4
564A3Q8j55K02l00M69q6j20m41J78K27j69K38M7m08K83k42M53O4k52j29J0J61
586A31n5j19K36l24J69l3l8o0J94n3o6K70n27L78k5r7R2J06j34K4k92L12j70K45
610A64R1l70q8K39QJ36j81r3Q1N1k8K9k86J85Q1j63N5J29q3o7K40j18k66L20k3
635D3l56L45J14l21J00M56m21O2j41J39m5J2j51O1j0K13Ok04m1k5K35j04J06k40
659a67J97L5j93R4J02Mj03lK02k51K10j38K0j97K76k01Q2M8n9j79K08r5J80j3
683E9p6K81k35O6m0J95l45R0M3j07m6R0R5P6j35q2J14j15J69mL3rj65J68j67L
709d4RL7j5K81J22m26j01J63j24K9K4L3J7k4J47m1q2j21M9m3K81l29J83O4j78
$$ y = [9, 18, -71, 45, 29, 198, 43, -67, -172, 14, 37, 80, 163, 248, 188, 242, -122, 64, 150, 177, 80, 39, 163, -171, 177, 57, 13, 101, -54, 148, -152, 317, 231, 111, -330, -152, 75, -94, 144, 191, -217, 66, -176, 277, 341, 89, -40, -30, 131, 76, -43, 193, -131, 38, 5, -33, -93, 101, 48, -18, 252, -275, 103, 78, -19, 73, 179, 45, 69, -223, 89, -81, 164, 255, -115, -203, 36, 44, 180, -1, -94, -13, 38, 10, 39, -247, -62, 19, -144, -89, 40, -43, -110, 130, 12, -254, 66, 43, -313, 32, 146, -175, -75, 381, -40, 22, -119, 20, -25, -13, -164, -103, -113, 100, 106, -98, -139, -164, 71, -33, 73, -167, 30, 65, -128, -34, 68, 72, -31, -34, 168, -83, 127, -11, 9, -188, 88, -113, -31, 17, -42, -221, -13, -108, 72, 59, -17, 264, 29, 95, 55, 250, -95, -5, 38, -69, -115, -25, 70, 146, 11, -71, 43, -72, 97, 93, 126, 117, -48, 120, -47, -44, -35, 2, -13, 268, 390, -36, -137, 26, -98, -69, -45, -12, 5, -19, 128, 87, 5, -116, -67, -110, 171, -158, 25, 89, -89]
734h9L7m7M6R1Pn6n3m3J6K10l4p0RL5M1k12J41J03l19J69J14j04j52K86K7j66
760a3j08N8L9J82j80L09k62j30P6J68k58K99l54RN4J85p9J27j6J24k60j18L09
783A61k6k63J4K6j07L23o2o4m6Q3q0m3j44J99J64k19K86k58J30J9L0jk09N6K9
808bj58K24j65nJ64Q4j91L33l01j7L0L0k80M03L8l53j62M41m9Jm3O7Mk84J36P1
834A6J20l16K84j96k4K11J75l10m5Q3m8K10j84J55k73K93l52J3M48k64J81m38
856b61L98J17l26J07k9N6M5k94J38K11J10m71K42P4r6J3J20m18J37J55k07M69
878B90m39oM0J72j32L8J33l07J02L3l9J6J93j94j3K80l49K24o1l73M91K9m52L41
902A7O7L81n48j5l4j84M34r3N9k16K70k28J7MO2j11K03p0j50P0p2Q5k3N8n5K10
$$ y = [-89, -52, -99, -53, 38, 45, -11, -64, -107, -91, 119, 85, 15, 24, 59, 100, -112, 29, 132, -187, -18, 96, -8, -160, 126, 153, -13, -121, -63, -24, 158, -22, 287, 25, -105, -29, 139, -119, 180, -174, -165, -111, 74, -5, 122, 106, 230, -30, -148, 161, 135, -128, -114, -88, -195, 128, 66, 2, -44, 39, -41, -84, -228, -29, 135, -84, 202, -56, 74, 93, 123, 122, -87, -31, -2, -160, 64, -101, -106, 58, 142, -49, 284, -17, -34, -4, 26, -254, 149, 187, -166, -328, 113, 64, 65, 22, 89, 93, -191, -55, 16, 136, -180, 104, -92, -116, 95, 270, -40, -85, -2, -50, 160, -24, 131, -142, 151, -201, -188, 260, -4, 177, -261, 137, 254, -72, 35, 6, 62, 107, -187, -49, 162, 272, -199, 43, 117, 21, 34, 154, -264, -127, 28, -179, 290, -149, -155, -115, 57, -75, -37, 96, -211, -109, -76, -115, -99, 94, -100, -113, 167, -182, 42, -19, -392, 99, 128, -324, 17, 84, 465, -83, -98, -132, -316, 118, 25, 84, -132, 138, -90, -73, -69, -7, -118, 85, 15, -135, -65, -137, -52, -75, -17, -72, 138]
928A38j82pr4K78n8k1k23l2K54j5j9k02Q0LN1Q6J5r4K02j80k06N02k15N3j6J08
954B06k69K43j22J4K66l44q8J37j43O4P8nj86NK74J77m27J25j7J75j49J24l52
977b14L38j1j82K84j67j88L04j75pr6J26j21J02R6l34K38J39j92j14K51N2o1j98
1000a30L98l83K09j37K6J69k46J63p1o8j25J64J38j45j80L77k02k36L14l24K56
1021c3j28M1K10q8J08j91M7Lk18K40k04K30J11k52J81Q4J32k06K26l77N1J13j35
1044e5n5q9L67J08l68j5K16J64m46J18J0j6K22j96K3O2j21p1L76k21q9K3K61j63
1068D5K8K03k36k9j57P9m9J72j53J73K3r4J62k4k23k32L80j34K65j48Q4Q5n61
1091c41L88m4J80j26K05j46l02J54k6j22J12p6K44k6J03J71P8m00j63O3oK37j76
$$ y = [138, -44, -51, -145, 133, 75, 54, -169, -201, 53, 38, 19, -183, -103, -100, -49, 37, 52, -42, 160, -20, -226, 276, 61, 114, 98, 206, -63, 180, 58, 72, 338, -6, -94, 43, -100, -36, 42, 37, -149, -144, 130, 307, -120, 5, -12, 163, 14, 138, -214, 124, 113, -69, 215, 48, -140, 164, -11, -18, -114, 12, -109, -7, 89, -245, -7, 132, -60, -174, 77, 129, 68, -130, 268, -115, 94, -43, -17, 152, -94, 69, -2, -70, -195, -31, 107, -38, -218, 159, -43, -279, 35, -289, -33, -161, -120, 90, 2, 110, -81, -34, -31, -249, -9, -213, 17, 128, -124, 57, 141, 273, 67, 293, -84, -33, 80, -55, -110, -199, 168, 276, -92, -107, 109, 273, -173, -55, -45, -61, 161, -35, -12, 50, -71, -142, 234, 13, -76, -53, 208, 45, 73, 276, 40, 11, -146, -67, -116, 56, -97, 76, 99, 5, 167, 143, -80, -312, 68, -66, 199, 51, 135, 220, -341, 47, 3, 183, 57, 262, 116, -186, -32, -58, -180, -68, -144, 100, 74, 177, 348, 426, 26, -137, -74, -80, 157, -19]
1114a9j00K09j96J35j2J88N8m61K21O6q6J60k00K04m13L31j97J9J94j50Q0l6P
1137BO3p8j5k03R3L60j57j34k17J89Q8L7K9j65K65K27n88J54M2J65k68N8J02r4
1161d5Q7k42R9J07N1M3l04J06L15l19M03j58JM3k67j53K95J2j92k18N61J59j58
1184B26j46k4l9r7m2J44R0j32p2L06j54j36j95K57J06j08ONj31J24l46L07K26
1207A75m6j47k5J49j10j21L18m6k26J31J2M2K10m52J14J7J19j71o3Q1J97l58L63
1230A63j83K62m58O0o2J10L0n9L05k79J58K71k92j90Q9Q0k55M73j22j88K19k8
1252A04N9k16J71O9l45P4J48k56K94j33L3J04J50j88J65k80J50l6J33j97J91j34
1274F0P9k33K19j85j47L15N2j25j9j28K25l9j70r8m1J49R3j7r2K02j05L75m09
$$ y = [-19, -119, 90, -106, 29, 17, 205, 263, -198, 23, 89, 3, 163, -37, 167, -246, 85, -112, -93, 101, -49, 31, -5, 2, 65, -13, -28, -231, -138, 222, 65, -69, -286, -97, -9, 28, 57, -108, 157, 384, -204, -50, -8, 157, -111, -53, 49, -45, 42, -200, -101, 6, 57, 100, -204, -98, 217, -102, 301, 143, 144, 187, -80, -233, 62, 74, -118, -336, 225, 384, 226, 80, 56, 17, -80, -122, 22, 112, -20, -92, 214, 60, -76, -271, -14, 92, -16, -10, -5, -136, -12, -358, -51, 175, 129, -18, -43, 106, -4, -125, 193, 147, -79, 52, 64, 106, 316, -136, -22, -5, 114, -57, -120, -39, 158, -200, 163, -20, 242, -216, -156, -218, -108, -78, -137, 168, -111, 47, 318, 26, -164, -75, 5, -250, 223, 101, -87, 132, 104, 163, -53, 118, 187, -158, -84, 64, -192, 102, -31, 2, 106, 256, 68, 233, -47, 103, 67, 200, 3, 194, 60, 139, -94, 125, -60, -207, 108, 160, 35, 16, -112, 113, 74, -96, -194, -235, -86, 7, -10, -102, 100, -5, 370, -39]
1297c9J07k47R5J16q5K37j92K0j93L52k32P6nN2k29j1J53qJ53j29j02R9MP2R2
1322A56j60J22p3J85k67K24j98j25NK99j04L4j83R8k1j20J92r2M4J2p9p5Q9m7
1346h4QJ9O5K32j94K09j1j04r1m1J51k85k3L1J28q3J12k01J03j48J80q7qo7K76
1371H7RLk03j38K24O7R5j43M1Q5j86j01L47k40J67k61L54k27m2J12o5K14n17P09
1395C91l91QJ84j14r6Q6J08l15J24LO0J97J6j55j81n6J92m7L5k8j9J0j94J84r0
1420h8J00j06m9K56pK70j79j65q8NP2K5M0k64K5L74j98J84k01M8j02J7O8r7K58
1445A98j29l1l4l9Q8mn0O7k90L18k86J43J77m4J15k29n9K6o9j3p9J19J91r3J1
1470Dn3M26l30Q3m28K54J13Oq4N0j10J6J21k49J7K06k5k5j14K7J66n5j83M9K24
$$ y = [-39, 68, -179, -84, 32, -53, 184, -8, 12, -181, 171, -61, 15, 10, 62, -167, -178, -25, -33, 120, -9, -111, -12, -8, 64, 156, -4, 118, 45, 230, -37, 187, -11, -136, -131, 168, 64, 98, -85, 13, -8, -128, 64, -28, 16, 28, -51, -126, -37, -84, -76, -57, 8, 240, 46, 255, 244, 140, 49, 8, 159, -126, -149, -118, 10, -73, 39, -162, -59, -207, -27, -114, -122, -189, 87, 96, 99, -104, -242, -18, 49, 144, 1, 42, 127, -59, -160, 187, -53, 114, -147, 207, -20, -62, 50, -15, 199, -318, 391, 0, 8, 192, 78, -18, 68, 176, -139, -15, -12, 48, 245, 261, 106, -75, -131, 61, 14, 49, 21, 2, 12, -182, 2, -88, 12, -94, -143, 113, 106, 376, 197, 32, -56, -51, 21, 46, 86, -178, -153, 221, 23, 207, 6, 54, -48, -31, 37, -60, 198, 69, 38, 4, -35, 53, 49, -1, 66, -224, 94, -192, -49, 128, 84, 199, -30, -89, -63, -132, -145, -224, -105, 86, -7, 4, -49, 377, 47, 130, -298, -44, 69, 75, -9, 41, -69, -53, 68, -181, -164, 42, 17, -8, -122, -95, 71, 16, -167, -118, 106]
1495A06j20L21k58J25j68Qp8K20m6n1q6r1J13j38N4R2o8K54k2J12j98J15jj71
1519B4O2j62P2K03p2q2p8m2J66j4k19K96n59L54L01k65j36P8j39J92M8mj07r9
1543a82J49P6j43J42o6J4M2L5J6JJ3j00k24J40L88l85L27k94K08O7K7k59K60k26
1567B6j88r7K41l9J49l4j78K8L27j12j99jJ79j40r2l7K94m5k28K01m6k26M85j73
1591I5J03n08O17k95k3j00K20Q7l00J74n6P3j47r0j47L60p4J79k78q9J25j3M7
1614d0K22k4j67k72K05K69k69R3P6L01m29q1J50J1j36M0L59n94M30l02K13k08
1636a53J5M64m74K12k64K89P8j04L8j75j05J91k6p7M8J13j1j26k3O8OJ54j40J28
1660A26j91J64r6j65L10k98O1N7J8M8k9l5R8k23k3K98k10j65M72k04J5mm6k36
$$ y = [106, -14, 307, 49, 174, 6, 14, -64, 156, 110, 59, -27, -118, -5, -143, -89, 3, -65, 189, 167, 279, 81, 196, 195, 24, 86, -76, -4, 199, 127, 45, -33, -75, 91, 77, -142, 154, -405, -51, 250, -15, -151, -73, -212, -20, 28, 24, -83, -182, -33, 43, -100, 42, -24, -10, 32, 67, 83, 84, 97, -3, -227, -87, 301, -84, 243, -51, 157, 224, 251, -8, 252, 26, -162, -259, -18, -57, 92, 58, -120, -92, 235, 123, -76, -77, 102, -38, -130, -167, 127, 82, -146, 55, 9, -217, 268, 95, 198, -310, 307, 12, -11, -111, 109, 196, -104, 70, 14, 87, -60, -150, -297, 63, -11, 168, -110, -199, -74, -87, -40, 182, 158, -9, -281, -76, 193, -76, 17, 93, 394, -35, -116, 34, 45, -91, -51, 308, -286, 144, -158, 55, -153, -138, 326, -148, 64, -200, 89, 167, 63, 101, -74, -179, 12, -14, -91, -43, 70, 59, -67, -90, -22, -16, 138, -2, 126, -65, 99, 3, -162, 148, -150, -89, -32, -14, 34, 5, -30, 68, -155, -178, 120, -90, -255, 217, 13, 28, 24, -22, -258]
1684b58J48J14J52l89J6J39K99mj53j15O3q8K30l0j42m8L61j05j49M7Jp4j2J30
1708A33n03K85L7j10P8J68k12Q5Q0k0N5j7j12j35L5O0J31pk68M4J26o8J85L71
1732D21m22mP8k03K03j56M4N0J11j05J55M3j37k9j42o3J94r1M3J9M7j4q0rN5k14
1758b06J67J95k76K1jJ92j2j86J93J5k63K08K9j25J22kk9m9K19l86K11K77j64
1781A50q1n0n0J59l38J0L30r3n8P1J7J7k41L8K70l41J41m4K23m21M45q6Pk26J92
1806D1J8j56K60j59O1j86J70K4r9K4K8K06l23J29O0k23K33K0n9j98K5J67l9J93
1830B17m63L49r7K74m27J51l36K53K23k23l6K45J9k9j38J82L4l38J99J2O1j39
1852gL3j90J04J5j5K43j18J03j2J29m27K37jM0R4k28K06k32qJ98k47K08Q3j17
$$ y = [-258, -110, 4, 156, -233, -217, -78, 221, 217, 64, -51, 12, -76, 154, 124, -18, -66, 295, 190, 41, 88, 89, 15, 3, 133, -370, -85, -48, -158, -80, 88, -124, -39, 41, 21, 76, 59, -53, -188, -153, -93, 38, 31, -237, -193, -67, -135, 50, 421, -1, -5, 73, -130, 73, -83, -39, 11, 122, 17, 172, 215, 78, 49, -93, -156, 38, -53, -10, 9, 56, 42, -38, -47, 8, -206, -39, 156, -120, -99, -100, 92, 80, -106, 87, 102, -161, 47, 76, -49, 73, 71, 42, -7, 212, -174, 37, 314, 150, 69, 19, -31, 128, -210, -200, 130, 37, -21, 50, 67, 84, -157, -119, 151, -190, -49, -93, 130, -291, 154, 68, 75, -151, 41, 59, -97, 163, 4, 65, -121, 49, 73, -26, -2, 26, 232, -91, 38, 98, -125, 108, 128, 69, -129, -104, 63, 24, 217, -246, 103, 6, 280, -147, 4, -332, -79, 144, -79, -115, 130, 149, 120, -18, 164, 198, -140, 59, 71, 132, -7, 26, -164, -60, -45, -60, 183, 65, 168, 156, 285, -142, 95, 94, 134, 228, 0, 206, -26, -34, 164, -83, 125, 208, 91]
1876I1O9p4p3j79J42j07K63r3j24Q1lP5n8Q6k22q8KJ15J22K09q5j54k88L29Q0
1901A16p5j09Q4l7k11J28J84J08k43O3R8j33L28l93m2K27k2l0j26ML0j56N9J73
1925B5j68N0J36o7J85K1lm03M64k45j76J5K63j59J0r3J6j9P6K88m65L02N8l52
1949b41J67L0K62l2r6j07J61k74LK36j7p7J6J35Rr4n9K27j92p1R9r7%O8Kj61J10
1976G%j14O2O2l3k55L14J20k19J41l30J60O1q0p0K32q9j0J80j40kj10k0J68j8
2001A7k48M34m00J43J07O6q5j7K1k56K57M7R1q3J32j06k41L14j56K41l40J55M1
2024A34k38K65j36P6Q4k46L7k6N2QJ2J1q6o7J04k9j2J98oq6Rj25J57K57k15j70
2050c8J92j74m3n1m6M15k13k16J00N7m2q5p1J08J95K44k81k63J47J13j80j6J55
$$ y = [91, 160, 86, 13, -166, -24, -131, 132, 39, -85, -4, -7, 68, 10, 96, -126, -214, -212, -97, 25, 234, 149, -5, -293, 36, 116, 41, -68, 16, -21, -232, -104, 80, 188, -55, 8, 106, -27, 301, -92, -134, 93, 71, 41, -85, -81, -51, -207, -148, 25, -143, -93, 43, -24, 161, 182, 179, -224, 240, -5, -181, -166, 97, -62, -52, -145, -129, -148, -72, 216, -249, 53, 111, -241, -74, -44, 218, 186, 90, -17, 144, -130, -127, 109, 92, 15, 31, 166, 175, 81, 22, 249, 57, -14, 85, -12, -12, 56, 58, -103, 7, 7, -107, -45, 17, -16, -271, 43, 163, -56, 85, -245, -85, -24, -104, -174, 58, -31, -41, 139, -1, -3, -113, -133, 35, 17, -231, 203, -197, -54, 53, 119, 34, 17, 38, -218, 39, 86, 177, 94, 226, 120, -121, 193, 37, 278, -62, 93, 134, -104, 161, 25, 101, 185, -61, -24, -50, 2, 10, 22, 33, -53, -120, -16, -45, -57, 141, 135, 49, 58, -67, 90, 347, 132, -38, 154, -20, -63, -114, -160, 255, 42, -174, -74, -17, -59, -144, -215, -107, 88, 332, 51, -212, -65, 48, -132, -148, 7]
2073Gn7pM57k01Pj03q7m8J00j12l4J42q5j16j1J09m9N3j05J44j12K32n3p2K22
2098B21l33m1j15J7L4K43k25o4J17Q2K87j91mN9L1j26k37M71k12K29l11k0P7j06
2122a17Pl2J39P5Mkj06j2k33J25M51j26l58J50j11J47J09j29O8J00n1k24J94q7
2146a9m9k32K63j67l4N45m45K60o9n0J4j14K24k69k5L41N2j56j4k60L01j66K55
2169A86l35K31j05p5K26k70J16kJ58j48j77J07N5k6jP6k43K75Jk00K63r3j00Q1
2193@j32J38L1k22Q1N0J70k37J72Mj27n4m5J08NK00k75r1R2R1J66k28L14l48K15
2218G8kl9J08l7j89K80k20J3K30m60L40k09K56m7k65R6k7J56j77J27j45J79q0
2241c4j95O10l09m6p1j06K30J1jp7P2k37K09k41R8k8Q9J13O3l10J56j27J61k22
$$ y = [7, -50, -57, 400, 199, 206, 103, 16, -32, 68, -44, -78, 64, -21, -137, -148, -39, -88, -35, -140, 4, -108, 124, 71, -1, 221, -112, -153, -268, -251, -217, 26, -199, -263, -146, -64, 223, 32, 28, 87, 118, -8, -245, 226, 14, 243, -68, -88, -11, -117, -110, -142, -3, 72, 76, 74, -32, -44, -277, -152, 299, 173, -185, -35, -146, 1, 110, -19, 49, 149, 98, -126, 68, -19, -68, -300, -37, -204, -238, 307, -138, 122, 53, 3, 17, -97, 127, -142, -167, 174, 226, 70, 56, -204, 97, -69, 186, -149, 82, -23, -98, 128, -142, -26, -28, 130, -18, -195, -88, -33, -59, -60, 16, -227, 48, 49, -151, 112, 19, -81, 0, -132, 6, 37, -185, -104, -54, 116, -121, 51, 55, -72, -126, -171, -63, -58, 142, -133, -224, -132, -41, 125, -103, 211, -137, 78, 76, 37, 145, 108, -81, 199, -21, -8, 222, -238, 102, -107, 149, 102, -163, -67, -94, 62, -115, 12, -133, 46, -34, -229, 381, 72, 26, -45, -151, 79, 90, 89, 12, 84, -153, 56, -185, -87, -115, -26, 87, 150, -160, -4, -131, 30, -192]
2265a92L34p1j95j3L2J40N0j63oO6mO4M4M7k88K37j82K26n8l19K90K03l00O0K
2290DpQ2k16O6k4M1p8J90K01k02m7J56J7p8J6J38k19j06J60k49J43%J29k6q5j09
2316a03K97j94Mk1kn8K09q2j57m8K30k03P3J54J08l70K05Q5l9P6l36J89q1J87
2340A23j18j08r3J91J03j5j09p7K52Q5j43j71OL68l43L51k79M7J52k29j85O2o
2363a36J92R7j50p3J19j18m3J30J57k31j14L21j53J85k44K5j36J3K61l15m6O67
2385D08r2l03K35k17P6K5l2r2J63j53Q4J73j40l5q1K20j52k43L94l02j68K15q2
2408i9M4M8M7j08L08l08j13j19N24n44K46j4p4K08J63j14k71J88L60m38k88J41
2430b13L21j33l2o3p7J42J11j30K96k82j4R5R4m27M01j64J13J84l70kK86j52K8
$$ y = [-192, 142, 71, -124, -137, -105, 35, 85, -78, -84, -18, -22, 42, 86, 133, -155, 82, -100, 126, 68, -251, 39, 242, -58, 2, 4, -3, 79, -137, -71, -95, -54, -132, 58, 259, 57, 10, 166, 183, 105, 121, 259, 40, -66, 94, -155, -12, -12, 117, 91, 6, -103, 194, 0, 4, -17, -19, -77, 132, 50, -107, -155, 75, -128, -55, 99, 207, -163, 42, 127, 88, 164, -172, 17, -64, 123, 5, -103, -196, -5, 98, 83, -26, -103, 149, 234, 91, -80, -74, 294, -49, 302, 23, 70, 222, -7, -192, -130, -136, 56, 153, 3, -70, 49, -69, -112, 18, 175, -56, -170, 151, -2, 183, -61, -36, -172, -159, 102, -213, -259, 408, 316, 13, 248, 31, 107, 132, 100, 8, 171, 18, 102, 275, 135, 100, 19, 239, 87, -156, 238, -64, -232, -17, -99, -55, -7, 40, -68, 240, -68, -181, -300, 224, -320, -74, -88, -162, 46, 209, 95, -176, 12, 372, -66, -354, -213, 108, -25, -57, -120, -197, -55, 56, -74, 222, -60, -74, 21, 115, -312, 89, -75, 38, 222, -148, -150, 136, -16, 12]
2453A2j01Jp8J53Q6k07J75k16j4J17O1k9l8pq0K91j73K30k51k16K74L6M6j61J82
2478I3j77J68K0k65J6J25P6r4J1J33j21m6Q8o8K03oj97R4R4k48J05m4j3M5j46
2503a54K68P5Q2j97j83L2J68L0j77K05K1k22J85k63K73j99J97k45J81O2p1m1k8
2526aj77J66L3jK55m05J69M9q0qO4k57JJ93l0R5KJ4j07J4j14J73L3j13Q3K8o7
2553A2k8L7K09l58J80Q6n5l5L32k68M3LPJ75m07J54j8j76J40J26k52K00k22L56
2577B41k5m09J73J24k35M0J13L0O1k61J61O9j54l0K61l68n5L28k33J72L2j66L10
2600A79k32P3j61L78p1n0m8j0J47k84n9J38n3K66j33k33J25j67J38M7P4k51J02
2623h5o5K22j17j96L83j04j68J63J36l35L41o7l43L54J03k59j20O2J12j29K87
$$ y = [12, -89, -88, -166, -13, 73, -134, 41, -175, -189, -72, -11, -40, -78, -85, -165, 126, -47, 183, -68, -284, -10, 26, 72, -89, 93, -84, 84, 104, -161, -145, -20, 56, -38, -27, 106, -15, -61, 27, -41, 162, 156, -41, 53, 147, -101, 4, -40, -53, -8, -154, 114, 189, 271, 74, -109, -77, 91, 121, -56, 149, 170, -52, 133, -130, 143, -56, 141, -104, 77, 139, 68, 27, -1, -178, -12, 21, 20, 275, -130, 39, 88, 8, 0, 64, -193, -192, 1, -29, 66, 68, 82, -25, -11, -125, 48, 81, -32, 51, 79, 12, -16, 21, 230, -128, 52, 138, 83, 48, 380, 112, 155, 158, 165, 340, -67, 87, 69, -107, 33, 159, -93, 107, -115, 241, 216, -193, -20, 104, -131, -91, 22, 52, 113, -148, 13, 82, -72, -102, 159, -209, -264, 64, -169, 3, 35, -131, 179, -53, 20, -141, 237, 166, 116, 68, 58, 205, -79, -138, 0, -53, 213, 80, -153, -28, -195, -57, -10, 64, -187, -85, -150, 72, -45, -241, 142, 38, -130, 33, 169, -166, 175, 108, -235, 119, 222, -37, -157, -95, 17, -112, 175]
2644A75k62K6k6Q8n6L61l09j34lN6J03J51k69P8j06K19n1m9PJ01J46k79k15N3
2668a95K6N7j5j71L26K3q4j4R2l90M53l41K88q7L0j11J86k36J55J9j50J68J22
2691A51j78j81O0J74p0l0q7p5L27j50K31k61K70J6m45J51K05q9k87L00j42K5K13
2714A28j6j83J04j57J35K5m1k3J90k49L85n0l21J16n6p8j0P0j24J46J05l38K46
2737DP4n1qL30n38J44J33m1J62mj88Kj12K64J29l35J61n1j68LK60j13J09j70N6
2762E2N3j27L5l7L18r0j81R1oK7j58o7M2Q8m1J56k08Q5j53O4j21K64J53m11J50
2787b2J11k53J41m9J33J69j37j32N0K3N7j17m5Nj87K99q3L8j67K41r9j59J98j2
2811Co5J82q6j34J04N1Q9j3l57K40J84J4k14o3K75l58K21j05J1j0l3j5J82K89
$$ y = [175, -87, -61, -87, 1, -55, 306, -3, -137, -140, -84, 19, 170, -99, -21, -127, 92, 41, -8, -1, 100, 246, -33, -248, -195, -169, -112, -127, -298, 28, 51, -33, -47, 45, -345, 108, -233, 55, -32, -2, -113, 73, -163, -8, 11, -139, 29, 151, -27, -208, -148, 26, -44, -74, -161, -236, 91, -59, 172, -89, 181, 197, -248, -97, 108, 19, -268, 32, -110, -85, 128, 112, -71, 33, -124, 11, 36, -5, -28, 162, -87, 298, 248, -73, 43, -13, -91, -101, -31, -155, -9, 96, -242, 4, 78, 27, 19, 349, -189, -45, 88, 47, 209, 205, 17, 19, -93, 171, 300, -35, 126, 75, -93, -90, 170, 57, 166, -4, 52, 105, -22, 13, -24, 294, 204, 23, 114, 108, 135, -23, -90, -48, 40, -1, 155, -53, 32, -121, -57, -178, 86, 239, -172, -22, 89, -164, -23, -72, 61, 230, 93, -39, 11, 34, 91, -26, -71, -66, -253, 46, -37, 1, -166, 75, -24, -183, 15, 3, -62, 120, 34, -100, 4, 55, 144, 131, -226, 14, 198, 212, -2, -65, 210, -148, 73, -32, -21, -31, -64, -79, 103, 392]
2835C92m06j06q7L85j23k14K01m0p7o2N7J39m0j70K40k01Q3k97L30L5j23N7n1
2858g8K2%J95k35J33K02m45L97o9j76l6j03L37j17o1p9J74N9j61k7J60M3k35O3
2882c7j35J85j78R0p1o0qL59n6j77l5j4l5J58k6J85kj23M2j93Q8J09J03j49J74
2907A94j83J63l82O2J64M8j13lK20m3k7pk5j23Q5N9r7P2n1j37L74p6j52r0K64
2932A96k03l8O2j10p3K78k6m6j49K94Q4j56k95K82O5r6K50k15r6j3k0K2K8K34
2956B59r1J4l40J51J32m41M59R5k38j80J9R4R6j21j1L53l77m5J28nK6MJ24Q6k16
2981b5k00L5P6qK13J66j78j24p6P0q8L53k46K25j75P2J7n1Q6r9j30J8p7J84j04
3006f6J77mj38n4J08k08J77K2L4j47K07PpJ8k30K42j26J89j93K6k62M88l35J32
$$ y = [392, -14, -120, -207, 178, 55, -159, 42, 2, -75, -137, -80, 59, 19, -151, 89, -112, -29, -326, 4, 39, -84, -27, -78, -56, -56, 139, -96, 37, 239, -206, 191, 122, -54, -90, -193, 144, 27, -34, -113, 61, 120, -41, -68, 92, 135, -100, -37, -172, 13, -165, -75, -146, -206, -214, 145, 89, -88, -123, -137, -172, -14, -40, 145, 143, 20, 62, -131, -43, 66, 169, 20, 194, 11, 174, -208, -146, 18, 66, -47, -50, 170, 127, 100, 93, 68, -55, 30, 89, -8, 64, 13, -124, 250, 174, 22, -68, 196, -7, -45, 17, -93, -166, 112, 86, 40, -109, 185, 269, 113, -182, 100, 165, 69, 319, 104, 8, -5, -25, -3, 25, 259, 168, 182, -158, -7, 125, -316, 143, 238, 0, -180, -161, -67, 29, -92, -103, 250, -127, -172, -44, -49, -23, -19, 105, 191, -25, -225, -190, -114, -122, 91, 257, 79, -45, -121, -51, -139, 214, -32, 193, 18, 90, 107, 56, 142, 43, -87, -69, -146, 38, -66, 111, 107, -31, -85, 23, -185, -8, 14, 48, -99, 108, 115, 108, 126, -104, 138, 12, 201, 8, 34, -228, 260, -75, 57]
3030E7Mo7p5Or7K78J3m6J17m82J93J62k8k08K46k6p0J21j0%j7j32M40n07K46j32
3056a4M8Q6j38P4k69M03k17r2K46m57N58k2k84J33k46O5K72l02Q0J28j61k9K03
3079F5K6P9J7k76J61j46N4mq8J44l10K29M02k84j55J86m61M63k17jl0P3K23k54
3103a04K24k16J67j15m8M8p1R3o6Q4RJ24l28J94q9Q5R1n9p9J21R0k72J83r2J24
3128I8j73Q4j21J63O8l56J76K37O1k41M7k42J36m5K17j18j17J29K6j02L29k79
3150b3k88P1L77k47o9J30Q8J89n27M67j81o1K2l8K74j93R%N0M8j99M5J56r5n2
3175d7r4K67k22K1l2K05k16J22Q7k68J90K0J18j27R4k54J91Q6j13o5O6q9K27o4
3199A03J14R3m3j56j88K44k5l48J60N4n4LN6L5L8p4J8J4J34k02K8J0p1J09k71
$$ y = [57, 61, -6, -81, -75, -172, 106, 119, 73, 190, -292, -99, 63, 35, -173, 73, 47, -23, 98, 88, 88, 71, -61, 379, -128, 118, -14, 34, 120, -18, 56, -213, 190, -27, -119, 127, -330, 228, 206, -78, 55, -191, -126, 146, -156, -76, 52, -109, -138, 65, 91, 170, 187, -89, 72, -74, -20, -24, -112, 32, -278, -49, 353, 69, -86, 100, -361, 102, -115, -116, -146, -73, 150, -104, 120, -96, 71, -44, -92, -44, -115, -22, -88, -4, 5, 129, -199, -5, -94, -9, 82, 23, -56, 65, 155, -117, 66, -26, 98, -75, 9, -112, 51, 119, -237, -61, 176, 237, -4, 43, -199, -63, -108, 109, -9, -126, 3, 29, -73, 256, -23, -311, -240, 137, -110, -179, -49, 39, 228, -299, 168, -13, -74, -52, -90, 184, -9, 0, 0, 50, 98, -101, -56, 100, 5, -47, -141, 126, -96, -75, -107, 98, -118, 4, 91, -177, 13, 33, 151, 24, 118, -136, 55, 141, 28, -37, 29, -60, 167, 103, 217, 310, 267, 111, -77, 167, 142, -206, -46, 8, -46, -43, 13, 48, 86, 12, 30, 44, 178, -24, 4, 14, -57, 52, -219]
3224b19L38P3l05O2M7L27k57q0j06K28j32R4j65N2O1K02k15j24J56J04k18J7p0
3247a30J0J22M6j48K9J36k29p5L21Q1k56J07j12J34j43J47q4J28m11N29j23l1
3269D8K01k13P8m4j4j36j6J28l07K27L3M1L05m49lm6L0R2O4M5N0J58o4m44L18
3294H2L50n23N7J31N2k4l85L49q2p1j02J68K6m0o0n9J11O9N1K3k60J50k1J5L3
3319D0N0J32m1l38O3l1r0K28p8K41l24J10J7l1J60j18J34l37J41RK45k49j08L20
3343A45j77%p9L30j57p3J95j91o1j58N6J30N0Q8k84J69p7K18j04Rj57J24rm3J30
3368G4p3o5J43J14p7k75K19K1J8j85L1J70j05j96M0n9K16j1j97J31L2L2K10j0
3392A98N2p3k73L32j59j17l4j75M2K55o5n8q3L03j20j65L96j98j09k36J77J17
$$ y = [-219, 119, 192, -113, -51, -4, 323, 66, -14, -120, 108, -24, 70, -95, -43, 18, 220, 5, -119, 37, 141, -77, -60, -130, -120, 2, 48, -100, -71, 65, -164, -239, 82, 163, -93, 14, -98, 36, -107, 40, -44, 84, -327, 202, 79, 48, 249, 36, 114, 70, 56, -80, -96, 32, -275, -48, -15, 26, 331, -118, -121, -167, -137, -45, 19, 64, 114, 272, 208, -236, 82, 432, -91, -34, 97, 149, 125, -260, 89, 7, -64, -166, 2, 28, -12, -72, -131, -20, 49, 100, 123, -137, 13, -8, 7, 40, 90, 222, 181, -157, -94, -125, -215, 13, -65, 176, -148, -38, -21, -52, 108, -10, 124, -213, -72, -63, 182, -67, -175, 145, -32, -32, -111, 219, 62, -11, 184, -7, -68, -226, -170, -40, 10, 98, -186, -17, -94, 124, 20, 29, -128, -4, -13, -56, 74, 1, -64, 79, 193, 116, -159, 60, 81, 99, -86, -55, 115, 10, -186, -146, -205, 11, 0, -197, -66, -34, -2, 208, 198, 250, 177, -96, 236, 77, -40, -74, -249, -207, 48, -17, -75, -158, 145, 25, -140, 256, 58, -51, -287, -110, 7]
3414GO3K27l10J10j73L04l5J20n69L57k1r8j11O33l86o5J84o51J86L39Ml75L96
3437A36o6k11K54j84Q8j74l2K17k7M5K4q8k18L43L9m32L73Ro6P6m0k42K89J38
3461B51k46M0J77q8j12J08j67O6j61J88r6o1K66k47p9J84k11L45k13j24J34M2
3483dn4K2nJ83o6m19L32K53k38j49J40j53L97j22l18K60j12r4M6N5JJ08k30K36
3507F9l05K63K9j79q5L93m43R9M0N4j10J52Ql69N52j63O9m4k02J67K2M9m8j3K96
3532C01k88j93L1K74p6K19k41n6k23M92j47m9r8j31J39k06L92j39j52J63O1j88
3554a15J68O2j57Q2k7kj6J08j93J7K46l18J12J69j81J17j4J32j97j27Q9K07k65
3577a03K05k9k0lJ08J3k21j14J49N5j78M6j00L35k4p8j43L34n0N4n4l46J48K29
$$ y = [7, 70, 297, -13, 97, -76, 228, 193, 313, -256, 101, 80, -18, -129, 504, 118, 53, 237, -414, -228, 111, 115, -260, 136, 70, -141, 113, -71, 17, -157, -189, 28, 1, 46, 70, -18, -236, 107, 146, -286, 87, 96, 30, 106, 66, -176, 113, 251, 5, 45, 222, 134, 22, 130, -37, 29, -132, 56, -40, -101, 165, -82, -161, 23, -188, 157, -56, -180, -46, -4, -58, -36, -41, 142, 76, -343, -11, 242, 4, -145, -5, -158, 239, 117, -201, 59, -53, -147, -101, -46, -45, 63, -167, 69, -236, 27, 56, -123, -208, 185, -258, -159, -119, -65, -175, -23, -15, -384, 168, 5, 74, 30, -172, -5, 17, 66, 18, 5, 301, 13, -180, -149, 125, 49, 268, 27, -29, -252, 240, 93, 44, -54, -185, -46, -252, 140, 1, -151, 12, 73, -115, 53, 115, -42, 40, 13, 11, -5, 103, -90, -73, 173, -145, -33, 136, -45, 72, 58, 190, -7, -134, -45, 162, -103, 102, 73, 53, 50, 158, 171, -50, -164, -15, 40, -138, -92, -192, 143, 119, 41, -102, 232, 182, 236, 182, -164, -16, 213]
3601B13K5k4k39j46k3K48k11J25M6l4J87j04k02J24j66K32m4j72K67l49K86o3
3623b4j28K36k31K95j37qp9R5Pk28K86k47K96j67P2j92j50N12k3j44n8J19o1k99
3647b58L38O5j50r0n6K04R4k55P9R7j50p8p6K69K58k68O5j66l4l9R8L98l96l6
3671h7oJ90m44L10J26J7J53p13L67J39pp3L05l49n8R2oP8o4RP1j86K85k19q6K74
3697A18l7r0P8l41K16K03p2P3m88M12l4l11L03r5K1j42J43qO7j74JM3P5J94j32
3722B3Q3J9J51j25p1k00l7K33j77K4P9p1M3j43N8K44j67K61j74j97K03j13J17
3745F3L7l33K70j1P5Mj5L1l42M22k14J28l17K7J36J40lm14K67K59k63n2M1r5M0
3770a19P5P9K9n8k8J69p1O2k9L7k22K60r9j65O3m6N4j8r8O8O8K01j56j93L28l14
$$ y = [213, 238, 214, -25, -171, -194, 54, -157, -32, 14, -20, 167, 63, -139, -15, -181, 51, 7, -165, 102, -247, 39, -24, -152, 84, -147, 148, 11, 3, -76, 19, 26, -202, 84, -163, 133, -34, 38, -154, -304, 208, 185, 41, -17, 102, 41, -258, 80, 145, -5, -95, -151, 53, 147, -108, -29, 68, -82, -160, -236, 33, 291, 23, 88, -78, -112, -151, -53, 345, -51, -87, -93, 97, -347, -37, 89, 106, 259, -454, -87, 52, 45, -28, 277, -72, -130, -38, -44, 34, -30, -21, 50, -136, 149, -70, -156, 118, 81, -9, 69, -272, -56, 147, 75, 148, -340, 72, 38, -273, 30, -65, -44, -186, -43, -51, 16, -158, -157, -114, -39, 155, 23, 106, 125, 276, 151, 80, -120, -157, 76, -101, -77, 2, -69, -26, -169, -111, 133, -34, 227, 53, -144, 59, -54, 63, 100, -233, 37, 26, 101, 105, 90, 121, -221, 201, -13, 115, -202, -175, -39, 101, 98, -316, -49, 210, -53, -105, -64, -159, -119, -44, 35, 64, 6, -22, 147, 76, 138, 109, 146, -76, 184, 85, -80, -17, -63, -9, -27, -125, -57, 11, 212, 56, -137, 191, -123]
3796a23L7J59j75J22J04Jl25K61k3j30N3j41J09qj6O4j63K46j30J45k05N75l94
3819D3j83K21k00L81l91n2J84J15j00J8l6j50J63k62J33N3K7K5j6q2M4J84j85
3842f6P5pJ03l9j36j07k9K95q1j27K94m81M06k33L9J35J1J21k54n0L81j57J5j15
3866gn9R5l7J72j04j34J63n7n7K50k18j13K84jl55K13P0p2P4K7p1J99k79K3p7
3891g1k4M3L6k56M16N0k97M5jJ96o3j1j1R4r2j30j8J08r4J68N8j46L7k3j20L39
3917B33k01K5j71L3L12j75P9k21J12k2J66n6J07l44J03q5Q4J2J13k50K47q1p8
3940e8O4N5l21J9M09k82J23O1j4j51J44K8j82J03m4J05k84L45n8n0J67p0n6k4
3964B9J0j05J34r4Q9r2Q7Q8j04l0k24Q1J16q9P3J39J19l82K05J6l6J2j23M7j37
$$ y = [-123, -86, 73, -102, 20, 124, 125, -200, 61, 38, -92, -39, -180, -71, -79, -95, -31, -194, 52, -78, 67, -138, 437, 43, -140, 81, -119, 262, -129, -181, 3, 118, 18, 36, 0, -150, 13, -249, -116, -63, -36, -11, -27, -109, -65, 119, -66, 9, 2, 105, 66, -70, -177, -206, 89, 8, -119, 175, -306, 100, -133, -94, 41, 52, 173, -81, -131, 250, 93, 108, -7, -66, 29, -8, 164, 60, -74, 89, 32, -25, 225, 7, -106, 178, 177, -178, 35, 105, 33, 107, 134, 63, 262, -17, 6, -71, -95, -52, -16, -272, 144, 194, -103, -58, -59, 137, 74, 63, 52, 146, 54, -76, -94, 14, -80, 88, 146, 0, 37, 14, -106, 233, 32, 57, -114, -81, 231, 56, 135, -86, 26, 4, 170, 114, 221, -123, -20, -105, -21, -9, 104, -146, 101, 20, -58, 6, 61, -260, -241, 168, -114, 9, 70, 56, -95, 49, 77, -105, -2, -46, 59, -225, 120, 62, 12, 179, 109, 53, 29, 39, -66, 68, -26, 63, -29, 58, 146, 42, 12, -212, -131, -15, -104, -31, 108, 227, -155, 50, 66, 30, 42, -81, -34, -171]
3989a71K65P8k57J09k06L35k74%Q4M2M3J27J56n33J58J04l49K62j6o3J1M9m2K08
4013A20r1rN4q8j9o6J04j51J73R2m7j81N5Q4JK0m6l01M45j26L0K46m22J01J4L9
4039C1J2j27J82K1l75M39k48K28r4p3J82p8P3k57J72p1P3m9k06l7L33l09K36k00
4063a42K53k27P6m8O9j8J45n56M90j2k1M9O5k04j50M32J35l59J0M3k51P7R5N8
4087IJ31j02l6N0j33o9L35q1k59j9M92n13L38k48J63j20K2J63k50J97l9j19o8
4110a56N4L7N6q3q7k1L44q7m6J09l19M4K22J86j63j49k51K65J00j87l1O09l62
4133H4J44l77K33K29k18r4K91l29J47p8L9j86K69k1j68K2j98L16k30L17J01l83
4155i0L48j36O5k70O3J86l42J47J14j4K1j44J81N5j40j30O1K00j67l9j27J00K6
$$ y = [-171, 94, 172, -85, 24, -182, 153, -121, -121, -37, 5, 48, 175, 331, -202, -44, 60, -289, -27, -43, -106, -95, -46, -88, 120, 29, 20, 74, -14, -33, -99, 5, -146, 27, 119, 72, -109, -54, 30, 31, 51, 5, -296, 149, 23, 53, 299, -123, -22, -8, 31, 43, -84, 98, 119, -256, 183, -65, 163, 69, -4, 178, 100, 173, -84, 88, 17, 90, 41, -165, -202, 131, -178, 58, -142, 111, -116, -40, -88, -19, -37, 108, -448, 42, 30, 9, 58, 123, -81, -231, 201, 336, -23, -13, 30, -221, -144, -49, 9, 140, 38, 2, 52, -81, -150, 185, 104, -155, -174, 318, -195, 143, -105, 58, -62, -40, 123, -127, 70, 31, -88, -156, -102, -65, -9, -92, -179, -200, 144, 57, 11, 120, -199, -155, 67, 253, 90, -59, -310, -45, 55, -132, -163, 446, 84, 228, -149, 84, 313, 95, 1, 292, -37, 110, 32, 71, -115, 154, 133, -35, -13, -211, 105, -125, 192, 293, -90, 258, 122, 187, -83, -20, 166, -176, -29, 85, 71, 92, -52, 129, 184, 44, -86, -25, 175, 8, -31, -158, -58, -32]
4178c2k0po3R0P0J04k51oK64j36l3r0j33J26O3J85k32J42k11J19l2J0J18Ml16
4203b67O44l58k01J45J33j39j38J68P5l05K81j12R1K8p3J46k57J19J02r2n4J2
4225e2O4j07n4o3r4M03k25M5L8R4l63K96q9r6K49Q4K4j84j38K94k22q2M46j94
4249G4j0K61k23l9j22J96R9k07j2M4j51o5J65Lo3J07r1K67j95Mj53J40J20j47
4273BN5Rj60K12N0K4k05j20R5JK42n6l13Jk4R5Rl7J81k21j0L34k58K15P2j72N9
4300H0k08L48o0k50R4q6P3K7j58M7N4k89K86K63l75L08l98J79J97o2j13o5jJ08
4324am2r8N1J55l35K29P5R3q5Q0j41o9P1l1l44L25J29L61j84j75P8m7o2j12J50
4349G1N9J25k11K6N9Nj63J27K2p7mj33J65p1n5L3J17L5j36M4j68k5J3M1M4R4l23
$$ y = [-32, -52, -59, -122, -32, 38, 142, -109, -115, 149, 13, -20, -110, -243, -117, -54, 131, -101, 41, -170, -51, -83, -73, 45, 49, -267, 377, 19, -182, -37, 96, -43, -181, -13, 62, -243, 38, -74, 17, 45, -28, 118, -139, -20, 82, -10, -64, -52, 12, -95, -149, -212, -306, 97, -128, -83, -45, 49, -314, -18, -107, -203, 46, 130, 154, -30, -168, 126, -96, -178, 268, 74, 64, 325, 102, 63, -59, 137, 236, 29, 17, 61, -90, -155, 10, 13, -50, 57, -34, 233, 38, 42, -111, 29, 149, 2, 57, 66, -94, 118, 168, 192, -13, -133, -38, -37, 205, 149, -164, -163, -187, -92, -83, -120, 61, -160, -170, 164, -94, 121, 193, 21, 80, -128, 220, 160, -90, 4, -82, -9, 18, -140, -93, -39, -328, -42, 221, -154, 154, -244, -65, 132, 70, -43, -108, -109, -1, -43, -141, -90, 65, -270, -41, 34, 127, 42, 122, -19, -88, -17, -48, -392, -67, 62, 423, 239, 64, 142, 95, 33, -79, 71, 130, 255, 44, 70, 129, 134, -29, 98, 120, 43, 39, -94, 71, 0, -55, -22, 95, 130, -6, 38, -130, -155, -142, -101, -57, 37, -286]
4376b86R2J57q1J37j11O9J13q4J12l6j33N7J52k58j08M44k46j75K03J10r3j18
4398h3j16O8J49m7K0n2J14r1K62p5j23L6k40K19P1p2J71k54J74j62J15k50J38
4421b8n1J95k15rK51j21j71K92l07J90J37r7j41N1J01n7Q4K3l54J94nO0p7Q2n4
4446b7j18k6j14M72l39oN1KO6j43J85j20J00O0k18NJ81j77J04l7J36Q8j28J2k5
4471a6j5r7N1J76k2m2j69J84q0J14m6O5n36K29L39j05J32l36k28L77J9J98q8k74
4495a70M37k14R7l76K46l43K09J73p2j16K00pq0K94l20K27j33J87j99k40K11R4
4517A05k5k27J20J79m5p3J69o3l36L57k51N4l4pJ57j97J26oj20MJ05j56J31j40
4541a73L14j54R8qj40J8L28m76J67J73n04L92n1j46K34J30j57lj78P2j30K77k41
$$ y = [-286, -194, -37, -118, 19, -92, -23, 90, 6, 118, 82, -51, 6, 158, -100, -208, 236, -10, -185, 18, 128, 35, -83, -199, -131, 18, -29, -9, -61, 53, -38, 224, 149, 26, 62, -178, 41, 112, 40, 211, -43, 131, -31, 84, -166, -28, -79, 116, -99, -108, 143, 22, -149, 143, -164, 26, 163, 66, -75, -24, 77, 20, 104, 127, -227, -33, -38, 22, -55, 27, -27, -145, -171, -285, 187, -152, -158, -107, -105, -39, -182, 3, -117, -17, 43, -175, -170, 11, -166, -62, -99, 37, 125, -3, 9, -16, -31, -128, -77, 99, 77, 35, -134, 50, -30, 84, 38, 103, -433, -204, 135, 30, 162, -174, -402, -25, -6, 192, 104, -170, 267, 53, 150, -226, 20, -323, -114, 59, -13, -129, 71, 64, -16, 278, -42, 185, 52, 239, 40, -200, 11, 105, 80, -147, -27, 152, 107, 34, 203, 140, -196, 161, -90, -36, -70, -77, 80, -117, 9, 3, -117, -113, -8, -164, -33, -173, 141, -13, 85, 77, -63, -45, 283, -193, -26, 147, -357, 35, -16, -162, 72, 202, 45, 42, -136, -64, -194, 83, -158]
4564a58J55j54j30r0L82J0j15Q4n7L37m15o8J59J9k9Q1n4J15j42J35J25l64P5
4587i9L74k05q4L35j90j96j04J07J20P2j58l37J98J22K62k39o1M2o3L44k40J04
4609A04k23J59J2j12J96K0l20K03J30l73M9L40l19q3K07o4P4O9J1J86j99j16j7
4632f6o2K25J3jL0l92J76K08q9p1j12P6J73j04j4L3R3j67Q7J15k20K53j30m3j57
4657a46K89%m37L08n5j58J96j2j05K11p6k19J34L2J79K0k78M01k90j38K41J38
4679B35k54J32o3j98K05o5r9K43j17J00l3M1k7l49M98m20K16J41k48j8q5J00n1
4702a16L0j1J48j46K13j63J62l16L38k52q2Q9Qj96M21p1k25J79K51m58J67M6J10
4725A26j33o5L56l25K93j95j33o0nK99j34M4J3K3m7j51J83j15L74l40m16K73r
$$ y = [-158, -3, -157, -287, -377, 5, 15, -100, -16, -73, 264, -151, -219, -60, -41, -70, 11, -43, 72, -70, 65, 190, -174, -99, 275, 70, -14, 321, 131, -65, -169, -62, 58, 130, -28, -365, -167, -45, 217, -22, -83, -41, -104, 240, 0, 104, -119, 40, 52, -60, 136, 156, -164, 39, 169, -204, -155, 185, -134, -217, -10, -74, 0, 69, 80, 266, 67, -49, -66, -128, 97, 110, 109, 139, -253, -77, 131, 42, -29, -141, -65, 108, 4, -10, 23, 116, -51, 36, 151, -69, 184, 54, 11, -146, 143, 143, -294, 14, -41, -199, -3, -15, -120, 91, 15, -204, -70, -38, 141, 161, -117, 284, -6, -144, 97, 235, -19, 113, 50, -148, 57, -8, -107, 136, 19, 119, 86, 127, 100, -249, 249, -171, 45, 186, -62, -80, -165, -65, -116, -86, -97, 51, -95, 118, -45, 117, -199, 139, -113, -195, -106, -98, -294, 127, 56, -169, 10, 261, -197, -30, 16, 126, -7, -72, 284, -41, 252, 57, -76, -136, -141, 158, 24, 68, 81, 104, 57, -94, 89, -26, 348, 8, -408, -135, -144]
4748a44m1K31J41j36o0k40M46k49R0k47M04k80n1K51j66r2K82k4n9k11M5j9M24
4771B95l09k6k8M3l7r5L44k22K86m30O6P0J45j69L1J72j72P1p4L4L5p2K22r4o4
4796B2N0k11L47k13j44J35J63l41J90K40l02J72j43l0q0J67K5n1j85L44j40Q0
4818I5j13K19J49k73o9J72q6J1j10j66j30M37J4l30K48J35j27l3J00l54J16o7
4840a62J4L10k41k71J41O1Q1p0P8n2P9k35J38j33N42j30j15r6j20K30nJ8P9k89
4864a48R9K36k84K43k72K71k92p8J06R0P8j14j43K02o5K74m33K39pj32M27l52
4886e5K35j24J5j24PL35k34j22qk37K03K65j99R7q0L07m03J27j21k2K85k68P6
4909d5j2J61j40OM8q0J11k13K35O9k68n0J39L48ml63p5n3P0j15J63J96j37L7k77
$$ y = [-144, -185, 46, 187, 51, -9, -249, 197, -52, 38, -209, 195, -85, -136, 115, -51, -143, 139, 115, 56, -155, -110, -129, 295, -14, -40, -68, -25, -62, -157, 187, -35, 251, -179, -113, -43, 102, -67, -36, 136, -36, 35, -39, -5, 30, -42, 180, 86, 22, 72, -139, 208, -5, -149, -14, 149, -192, -2, 238, -64, 108, -35, -65, -145, 22, 47, -4, -189, 155, 15, 95, -18, 201, 350, 77, 8, 180, 94, 105, -5, -171, -301, 136, 150, -180, 68, 203, 76, 43, 143, -211, -95, -162, -148, 162, -79, -350, -209, -148, -67, -137, -59, -111, -32, -267, -129, -262, 280, 150, 35, -61, -181, 49, 44, 62, 141, -148, -49, 187, -97, 146, -126, 145, -147, -225, -119, -29, 49, -65, -208, -6, -71, 203, -230, 9, 2, -130, 297, -55, 180, 56, 71, -53, -46, 289, 55, -67, -75, -312, -109, 156, -43, 54, -26, 281, -122, 5, -116, -138, 147, -121, -45, -57, 104, -36, -30, 18, -62, 49, -164, 71, 140, -128, -178, -39, 309, 305, -58, -133, -186, -116, -231, -68, 128, -9, 28, -249]
4934b49J78K01m5Oj75q1l26O12j48j84M00r3Ok79K49l19L15M20l96J0n5q8m8J1
4958g8J41j92k0K37k58K27J39m54K54J39j92Q4l70N65l10L21l15l5J37J59l03
4979a24J27p0J1j5p1K45PL5p8J01l39K34R2k35J55K04j32p6p5o6J56p8j13J76
5003G1k38J1K36k72P6J71k10pR4n6K9j2R7q9J05Q3K47m12L42k14J36l02q7L15
5027A14j74J50k00j9j75K16J27l0k83N54l71K14J0N9m5Kkq2k77K61r4K23r3j69
5051h4K19k65n4K77l47K13J45r3j12R1R6m1k74L32j58j04K23p3O1P1j52K24k61
5074f6K2Km4j0k25L19K6J10j23K35o9m21N14l35J92k26K44q4K70k36j25oJ07m0
5098C1j84K71K48o01JJ91J03P6k62J48lj78M01j44j41p8J26J22l57K58k02J11
$$ y = [-249, -71, 130, 85, 91, -84, -165, -491, 121, -27, -211, 189, 96, 102, -177, 72, -247, 68, 488, 92, 102, 47, -41, -89, -78, 63, -129, -149, 88, -170, 57, 196, -258, -4, 135, -57, 27, -343, 222, -88, 233, -82, -117, 20, 179, -124, 3, -67, -56, -71, -142, 103, 110, 145, 67, 168, -171, 63, 155, -80, 75, 279, 147, 71, -4, -70, 86, 8, -105, 71, -167, -156, 80, -192, -116, 55, -155, -162, -68, -124, -95, -107, -10, -99, 6, 89, 336, -76, 266, 52, 188, -114, -201, 114, -60, 90, -110, -129, -304, -88, 39, 9, -274, 280, -91, 123, 133, 192, 147, 149, 147, 65, -212, 49, -45, 178, 85, -84, 135, -130, -184, 93, -254, -41, 104, 11, -101, -10, 86, 45, -229, 103, -55, -159, 64, -9, 52, 123, -29, 195, -66, -44, -42, -86, -96, -321, -2, 24, 134, 11, 246, 177, -244, 270, -65, 127, -99, 145, 61, 331, 95, -30, -36, 71, 31, -153, 118, 366, -235, -234, -43, 60, 136, -126, 22, 19, -159, 242, 98, -43, -121, 5, 127, -230, 28, -174, -63]
5120f3j43L41m52M43K1j49Q8p5n1Q4j01k9Q3j18K47q1k90JL58l2k00J45l3j13
5144a19K58j42j87R2J47R8n3J27m19L34j48N0Pj34R9J42l67J14K9K87k69J12j3
5167D5J1j04K3J2l0m8P8K9J06k82Q1N4p9m4R6J49O3l33r5M58q6n5j66J92k65J90
5193@j32K68j52N3k0m0k26M28n0j4j84k10L41j0m9j52J27J17J15k94N0K07l85
5216b12J83M1j16P3J94j18k00L16j43J54k39K3j54L05j82m8J14J25J7j4n1p4%
5239fk38K87Jk1O2l4L17l48j72K5K10k44K06l9r6J42k05J77p5Q1j62L5P5N6J15
5264A49l53L23j00Q9l6M7k84J96Q0k68Q0J76m0pq5K6L8Rj8j9K24k71J4n7n4k6
5290a67J35L6J69j06j57j13Q1k48N47j42m29L99k14J53K15j42O7n2J26k69J11
$$ y = [-63, -206, 135, -317, 126, 147, -2, 86, 11, -40, 44, -57, -86, -3, -121, 126, 45, -245, -244, 114, 82, -118, 27, -6, -119, 139, -3, -190, -98, 49, 147, 94, 221, -198, 136, -12, 38, 45, -89, 10, 152, -215, -101, -72, 215, -54, 58, 45, 56, -48, -25, -13, -43, -91, -13, 16, 122, -160, -79, -25, -104, -148, -52, 97, 160, -173, -268, 190, 104, 49, -117, 75, -190, 0, -132, 136, -16, 37, 17, -23, -249, 179, 129, 115, -69, -279, 62, 52, 3, -149, -22, 95, 210, -84, -34, 173, -212, -29, 12, -104, -31, 163, 45, -155, 161, 18, 172, -67, -44, -198, 107, -75, -123, -9, 116, 133, 119, 68, -6, -6, -244, 43, 44, 23, 85, 51, 368, 20, -152, -127, 83, -161, 45, 6, -90, 52, -153, 24, -51, 30, -132, -97, -22, 34, 149, -204, 119, 19, 108, 72, 119, -165, 31, 111, -157, -77, 99, 59, 52, -33, -7, 31, 40, 22, 3, 227, -44, -30, -87, -141, -167, -32, 4, 173, 67, -90, -203, -122, -370, 177, 35, -394, 5, -209, -56, 159, 17, 84, 32, 158, -111, 0]
5311@K8K2J6J02p7q4M1M4p9J53k12%J36j32o9J2LQq1N31l68N0J5j21J06J17j04
5338E7J31j41m8K2K0P3m8q6j30L86l99L37l49J57M0L9j84OJ37nk99M50p0o1l7
5363bo1j43L31j64n4K26l10J42J0K76l22J07J4N9m8P8j47L9j46K51J48o00J60
5386a56K48O6l27J88%j21k5n7L54p1l8J93k59o4MJ25J19j08k15q7J89J34J09j58
5410D3Q2k26K24m02K15K44k14K6J16J4J68l87J02L6K25q2J2j63k7j35K95kj09
5433E5J47j81Mo5q8R1K73k20L55m32J24J68j21j29k7J01J66j45J17k46R2l1P1
5456G9o6j66j81K14J84n2j11M7K30l64K32J0J05k05J17j97K60k49K94l60J10L62
5478B93k21k48K39r6j54L70j36Kl14L43j37R3N2R4j70j29J96r8R5L12o20J19J16
$$ y = [0, 28, 50, 66, 168, 91, 7, 48, 92, 13, 166, -46, -46, 90, -42, -111, -99, -96, -88, -169, 362, -6, 44, 59, -62, 44, 161, 57, 188, 47, -1, 21, 41, 114, 66, -20, -150, 236, -163, 174, -175, -18, 22, 61, -123, -117, 20, 15, -284, 166, 96, 35, -2, -63, -206, 125, -39, -93, 133, -177, -35, -25, 251, -71, 36, 50, 109, 61, 139, -8, 31, -115, 136, 284, -316, -156, 92, 158, -169, 19, 19, -102, -127, -184, 170, 99, 61, 254, -5, -69, -65, 60, 179, 71, -144, -231, -42, 92, 201, 43, 125, -101, 123, -279, -64, 180, -34, -8, 108, 122, 290, -97, 5, 41, 266, 184, 196, 33, 6, -129, 166, 164, 55, 202, 21, 25, -40, -128, -37, 236, 16, 371, -61, 63, 231, 110, -19, -46, 55, 221, 76, 193, -53, 39, 8, 79, 13, -153, -334, -120, 64, 12, -99, -52, 178, -186, 46, 56, 161, -44, 73, -124, 136, -113, 181, -179, -69, 293, 72, -176, 63, -33, -187, 183, 47, 49, -265, 78, -59, 34, 86, 180, 10, -119, 77, -21, 74, 386, -234, -115, 1]
5501AR6J43j58j35l8P8Q2J17Opj89j3j7J33k77O6P9J13j57kl6J72J4R3k70J27
5527B1j27J17k29K38J13O3k79J08j7j58M5K60k23L3J3j80O4q0K12J76Rk41J55
5550I3Ll11L25Rk72K6J99k01J47R6J97n24K58J23M7j72R9j60j61J75j74J55P1
5573D8J8q9M0k06Q0K80j63J57N2j33j48q9O7o7Q3J23l3K9J2p5Q6N7o6Q2q5J08
5599A68l35J27J99k77J91p2K01k42j22M12l52q1J55j14J35M8J4k8j03J1M0J88
5621A63j02j11J55k6j05J0L8P5r2J58j77j5J97l40L13j77J33J47j54n5M4r7NJ79
5645A66j79p7J50j65K17j24r7K74k22J16q8K49l32j14L59m9j03J53j88L23k73
5666dj16n4M56n55L60J53j96J38j39p6K2J6K18q3j9J38k00j5k10L34j08j41k59
$$ y = [1, 97, 240, 82, -53, -91, -13, 69, 186, 192, 185, -4, -17, -34, 99, -178, -112, -33, 80, -77, -79, -115, 57, 71, 164, -106, 21, -106, 11, -218, 20, 133, 196, -83, 25, 8, -150, -105, 155, -68, -35, -22, -202, -138, -218, -6, 170, 179, -62, 93, 96, -215, 110, 119, -153, -127, 72, -129, 18, 114, 311, -213, 45, 168, 215, 43, 142, -18, -179, -4, -178, -23, 48, 66, -23, 17, -189, -109, 171, 8, 165, 217, 84, -64, -153, -86, -153, -70, 53, 20, 49, 61, -14, 72, 129, 63, 145, 60, 168, -167, -40, 159, -118, 73, 1, 202, -40, -162, 250, -102, -183, -28, -142, -7, 41, 55, 27, -76, -65, -25, 163, 61, -50, 105, 79, -26, -16, 22, 97, 5, 163, -14, -29, 168, -172, 141, -36, 97, 244, 90, 35, 79, -18, -13, 166, -13, -90, 60, -105, 112, -12, -109, 165, -57, 59, -29, 220, -112, -226, 133, 84, -19, 134, -54, 269, -4, -120, -174, 282, -273, 87, 240, 44, 182, 43, -33, -11, 5, 223, 140, 121, 259, 59, 44, -166, 168, 60, -81, -340]
5689c40M24k1J83j47q2r3J38j4N6k64L0J25j49j05J79J2k2J62J88k69k54K33K93
5712B63j33l45K39P5j92J97rk11J50k04J11j43J83r6J04L65n23K51j81N7M6j19
5734a15J17M1O8K99j61j34k89R3j37L52k74R0K81j77k6Q4j13O5j61J42k67K18
5756dq3L22r7j70J21j43Q4j48J36J31j3j22j63J1K3K48N7l52J43J80j21L18m71
5779a13P0K1OJ27M4k20J40qj52J0K74j16k23k0J94j80K74k07L18l16M77n44K80
5802A36j27J09p6J09k01%K15j71K0k39K31K59l43M9j58M1RL16K12n04O3L56l62
5825e6qM8r6j1L6P2m4J7n7Q8Q1o6J87j46J8L9k71J80K4J4j74J47j14K89o5k90
5851a58L09k4m21L28j27K4Q2j96Q9p4L41o3r3o8K21l36L8q0n2K95j1j59j31K52
$$ y = [-340, 84, 63, 246, 99, 17, -76, 62, 48, 104, -160, -130, -5, -154, -259, -80, -68, -90, 72, 260, -9, -263, -30, 263, 130, -215, 24, 99, -93, 104, 95, -116, 34, -170, -59, -202, -19, -115, -11, 354, -169, 82, -99, -42, 4, -115, 2, 43, 111, 410, 249, 115, -174, -81, -218, 134, -140, -50, 231, 54, 28, 112, -1, 64, -97, 45, -222, -4, -87, 235, 138, -32, 89, -54, 30, -118, 18, 149, 136, 14, -149, -138, -115, 133, 190, -162, -19, 161, 40, 358, -113, -43, -22, -16, 111, 155, -65, 75, 67, -85, -75, 199, 83, -140, -160, 34, -146, 128, -79, 239, -77, 400, -144, 136, 9, 118, 42, 151, -50, -50, 165, -6, 14, -225, 6, 265, -78, -29, -187, -146, -137, 179, 391, -113, -50, 306, -56, -64, -16, -112, -123, -87, -15, -59, -42, -99, -11, 70, 4, 191, 45, 63, 102, -169, 11, 35, 49, -125, 22, -92, 197, 132, -158, 151, 127, -294, 34, -93, -69, 13, -183, -94, -168, 173, 110, 17, -51, 170, -166, -128, -208, -260, 35, 24, -135, -266, -14]
5875a4j3p1j3n8J21lm8K63J22n21K72l9q2J38k44K54p4J3j62N8K01P4q8Q1Q4m16
5901a65K63j05kj1Nk32K18j26J26p8L38l25j28L58j94kK21k5j71j81j7J1K41j20
5925a01J27J9l7J14l18J94o9P3O6M5k6J49k54m8o2J99o2N9n3J46l93K20J96k09
5949b5K00n0k94Q9J50J26m7O6q3k31j19J53J72j34o5P8n9K44k81J2OK34k11o3
5973a32R0K48n10N53j23l01L41r1j4J46k30n8J39q5J50j74K5J63J97k07o3q1K72
5996B55J6l52N3n6j68J94K22o7k03O5l8J50Kl07J71J49n0j45J17j87OK92k3j66
6020g0n4J91j98J55j74K5P1K38l0j99K7K5k8R5j93L66k59K74k65o3K06k50K08
6043I8R5m00L88j63j73P8J94J05l53j04J47J14P9j3j96J60j47k2Q5k06L84l0k61
$$ y = [-14, -27, -98, -111, -169, -48, -51, -99, 164, 286, -235, 37, -2, -84, 54, -190, 64, -10, 3, -159, -101, 100, 174, 86, 167, 251, -165, 98, -7, -9, -20, -15, -247, -29, -155, -29, -107, 231, -94, -222, 136, -58, -60, 161, 136, -35, -216, -233, -222, 19, -101, 26, 45, 8, 122, -196, -2, -71, 2, 68, 113, 87, 236, -18, -66, -128, 71, 9, 68, 15, 161, -232, -12, 184, -25, 175, 125, -169, -80, 70, 196, 149, 215, 132, -99, -218, -65, 107, -27, -92, -14, -73, 171, -110, -98, -92, 142, -69, -132, -42, 206, -304, 249, 126, -175, 166, 75, 61, 207, -23, -81, 58, -27, 123, -51, -26, 137, 334, 127, 64, -17, 255, 271, -81, -28, -84, -252, -58, 164, 97, -106, -41, -79, 71, 73, -234, -63, 86, 36, -109, 8, -179, -173, 119, 96, -70, -124, 67, -131, 24, -150, -125, -54, 184, 154, -45, -18, 7, -21, 74, -119, 247, -12, 262, -3, -66, 140, -110, 98, 193, -207, 181, 18, -155, -77, 117, 222, -131, -235, -88, 26, 105, 92, -104, 56, -91, -113, -28, -234, 150, 120, -141]
6066a41J0J50m5j7J67r1j55L02L5k64J11J8j51j07J13j86L41k80o3K19P9j19K68
6089A94j99K78j73k88M75l29j28K25J44J48m36L47m44L91l63P0k2J11n0J37j60
6110g2P4qL2l11J94R5Jn5q3p9K95l3m6m9j71J67KJ87j99rL2J6j23L9mJ94k8j2
6138D6N8Kp2o3K7j0P1Q3k68J65r1N8j16M5K07j04k02L67l92LJ42P3m8p6N0O3K04
6165B22k09K03m90N54l46j88L31p9j7K21l75J23J97j40J26l47m7J35K58O4J9l17
6187a02J02J08j75J15p4K31l4j03j25J69j56m0jr2K45p8J59k9N1j71K4l9o6L6
6211d5j46J00m3L2k6O4R4r8n6J59J68l23J97j75J32j56K86l37J09J45J34l86k11
6234c82K95O0K50j07j05j73K26j69R8J17n6j06j02j6J93m2l1L2R6j9j00L10m60
$$ y = [-141, -131, 19, -26, -43, 124, 33, -122, 180, 215, -49, 62, 80, -71, -178, -65, -251, 90, -190, -253, -34, 45, -74, 194, -5, 273, 100, -188, 287, -42, -170, 55, 199, 347, -89, 258, -186, 205, -158, -88, -110, 1, -49, 88, -72, 2, -6, 26, -285, -91, 4, 5, -50, -133, -212, 83, 50, 4, -45, -216, -49, -47, 140, -59, -68, -36, -20, -143, -104, -108, 86, 58, 46, 104, 106, 34, -29, -2, -12, 59, 142, -126, 39, -52, 6, -110, -65, 142, 38, -164, 203, -189, -186, -44, 29, -19, -95, -45, 18, 222, 13, 216, -274, 280, -66, -254, 77, -2, -19, 202, -173, -50, 147, 7, 133, -214, -261, -126, 132, 196, 215, -102, 0, 108, -67, 48, -26, 205, 171, 68, -57, 112, -44, -84, -85, -177, 68, -10, 149, 120, 171, 0, 24, -15, -81, -45, -191, -91, -134, -102, -128, -64, 30, -68, -124, 35, 203, -120, 77, -98, 34, -122, 164, -173, -64, 81, 215, -171, -382, -87, -27, 223, 116, 11, -162, 64, -105, -7, 110, 54, -52, -154, -170, 23, -19, -50, -18, 78, 59, -41, 269, -191]
6257a91J73j08M8q1M09j65j30j83K26nk57N48j31k04J37j62R3N5j8q3l8j24K59
6280F8k78K72q4k7K38k45K03k33K2P7j74L16m6k27M46l10k01K68r1r5J67J08j58
6303A6j18Q8j83L83j73J35k54L29k06k19K26k14L09j30R3j14J61j55J07m52K48
6324a23N1K79k36j95L18k91J56lL05m4k30N6j2O3j15L0o4o1K35k41L67j84J06
6347A67j60LL7j45K6O9J08P3m62L65p7m6K80k56J31l92K47j28K94p8j11K4KK2
6371gJ78K00l71n5O2q1K96j01r7j98K14N0j17j77M5L34M7l90L57j03k21P6K0j56
6395a95L13o8o5P5j27p8L58j30j09J54J43l45j32K09k23K05Q8m4j24n6K85j06
6417B8j38k2J96K89m09k03L96k57L95k56j62N5o0K39k16J21j28J62J51j46k49
$$ y = [-191, -18, -126, -78, -159, 250, 85, -45, -228, -2, -7, -264, 284, 153, -51, 86, -76, 17, 72, 54, -29, -67, -191, 68, -210, 62, -22, -49, 189, -56, 147, -86, -64, 13, -161, 155, 109, -118, 328, 18, -183, 85, -6, -101, 66, 174, 16, -102, -14, -197, 186, 13, 148, -106, 223, 17, -202, 24, -190, 119, -11, 82, -32, 129, -26, 81, -371, -123, -72, 207, -29, -224, 94, -197, -41, -44, 261, 217, -13, 43, 31, 94, -21, 9, -55, -116, 119, -122, 245, 61, 167, 7, 10, 47, -98, -72, -3, 105, 178, -284, 81, 4, -42, 238, -18, 113, -279, -32, -160, 134, 56, -55, -31, -29, -7, 171, 371, 0, -55, 7, -74, 222, 121, 24, -174, 40, 90, -27, -204, -159, 175, 222, -168, 189, 86, -135, -59, -39, -195, 118, 50, -15, 60, -67, -145, 213, 83, -26, 128, 271, -74, -206, 3, -220, -15, 73, 29, -95, -151, 134, 28, -110, -132, 64, 353, -56, -259, 137, -120, 275, 19, -143, -88, -148, 91, -125, -4, -132, 30, 181, 35, -214]
6438b14K81j87J28l1L8K31k58j58J75l3o5k9J37J73l15K10j71K45k3k65J58O5
6460I2l57R6K60N5k1K4q0j06k5J4J83j43m3l6N9k82L83k48K49J10l04J09J17k51
6484a45L98j93k0R3j2l7K03l71O1r7k5N5J41J43j94j4N3q7J1K09k14o4P7k7M75
6509D19l35k5J42k53l5L15K7m40J59K86l33J66j36J63n5rM7k12J47j53K17j97
6531i5Q7q6j73K15O0K29m48J54o4K57m7l94M45k35J01r5JK9K26m36J88K35j46
6554HL8p9K11l04J72o5J32j60l1K22j88J9j38N4P2L9j0J07o0o1j11K29k9j05j9
6579e7M8Q6j07nJ40k4Lj12N0k00J89j99k1M61j65l9l5J65m6k7l38J11R7j09R8
6604c6R5J74k45O3k49J73J10J34K25m36j89Q6J5P3R9k96J36j83K97LP9l43J8O2
$$ y = [-214, 67, -120, 8, -23, 15, 246, -12, -170, 5, -28, -93, -122, 15, 188, -127, 83, -88, 157, 134, -131, 27, 92, -265, -169, 91, 146, 125, 149, 69, -37, -62, -48, 135, -8, -51, -87, -28, -310, 73, -175, 74, 184, -120, -11, 106, -145, 253, 60, 40, 133, 121, 84, 287, -84, -23, -120, -145, -90, 51, 194, 0, -14, 39, -48, -37, 172, -42, -106, -29, -56, 419, 84, 59, 201, -52, -87, 228, 255, -185, -26, 260, -73, 93, -43, 120, 65, 56, 103, -109, 38, -115, 102, -95, -8, -94, -267, -52, 8, 237, -211, -57, -121, 136, 89, -305, 140, -95, 6, -89, -88, -59, 167, -269, -81, 154, 8, 46, -33, 178, -126, 46, -19, 113, -47, -78, 144, -44, -25, -163, -109, -37, 2, -8, 99, 39, -22, -133, 96, 67, -38, -57, -9, 77, -30, -35, 105, 81, 84, -28, 22, -178, 11, -188, -209, 252, 87, 48, 13, 178, 132, 105, -233, -122, -25, -134, -36, 59, 233, -12, 51, -198, -25, 85, 219, 444, 8, -181, -95, -80, -7, 92, -204, -68, -251, 46, 49, 128, -215, -197, -135]
6628a35J93k82J50K29j55J8J8N8R9l14O1J05J43k79O4k53K14M9O7P1o9K43k27
6651F8k75L20r9R8l7k42K34k26K82j48k37J82J8r0J52J0j98L00O8k42P0j23J24
6674IJ44j67J69o0J67k29j40l0M0J37RO3j27J51k11N5O1m7K4r2K24q0j23J18l49
6699b84J85Qj47L11k00k2J78o4j56K11n6Q0n9r9N8J37n8J39l47L6K88j05J10M2
6723A86o5r1l4J47k16k7j24Q9M5J58J74j96j06K48k26L3l3l6o3j3L08j86P4p8
6747c2K28J4j24J59k3m00m1K46j25j02J76K8J27j92N8j08K19L8k08J3j18K42r4
6770a9J04k19J55j7pJ26j28j05L59j94j00J7K26o9k95J47q1L0K73j47o6k0j96
6793b26N58k12m56M33N9j20J5P0k33m18P20j24K67l97K33j04k44J05N0JJ42j98
$$ y = [-135, 58, -224, -74, 155, 0, 18, 36, 94, 193, -121, -60, 45, 188, -91, -27, -280, -66, -17, 50, 121, 52, 295, 68, -207, 113, 14, 112, 75, -167, 67, -159, 123, -25, -262, -80, -62, -152, 0, 10, -188, 112, 180, -62, 8, -115, 9, 153, -14, 155, 95, 262, 33, -107, -137, -97, 40, 49, 112, -15, 136, -75, -20, 41, -6, 18, -74, 150, 70, -53, 65, -284, -99, -91, -238, 73, -127, -149, 29, -35, -191, 20, -36, 44, -15, -114, -56, 81, 23, 162, -185, -149, 139, 34, 144, 186, 121, 30, -4, 143, -73, -100, -224, -135, -90, 68, 242, 46, -60, 188, -38, -5, -38, -74, -137, -150, 158, -28, 46, -32, 196, 210, 86, 245, 222, -178, -219, 27, -98, -200, -24, 4, 131, -61, -3, -111, 108, 146, -62, -49, -167, 75, -19, 85, -134, 21, 4, -3, 123, -5, -110, 249, 55, -45, -28, 198, 129, -166, -19, -100, -70, 203, 56, -10, -30, -226, 332, 120, -336, 97, 156, 36, 51, 121, -112, -530, 190, 66, 333, -64, 169, 65, -179, -74, -24, -23, 119, -79]
6815g9j21K07N8k23K99j79K04l80L91n4j82j70L22k04j46K62K08j36Q2j51j10
6836a02K6j73J60N8j58J11J89j24j2J3k83K01m4K19km1J99j87k7M4o2J38l55J45
6860f7P0k51L81j29r4J73J23k59j71K40O2J08o1k35J47j25Q3J66j80J62k30r0
6882a77K19k8L12m10J55j89J30o2K9rJ73M3j67N6L6mO9J17j62j75jq3J95q0j69
6907a82K89j69Q4K9l3P6k13K10m3j5n3j8Q0n8o8NJ92j71j3p3J55j68O3R6k55P1
6933a82K21J62k33J13j90J65L2n4p0O6K47l41m3J14J44j74K38j01m91K29L9o1
6955a70K18L2Q9k51J07J75l19J34q5J10q1K80j08j48j73r9M36j51l1K21j04k15
6977a33J73J13k39P6K20l19K29j26M8r8N5Q1l09L33j47J29n6Pm27M01j78K06J36
$$ y = [-79, -200, 7, 65, -158, 141, -38, 166, -214, 177, 123, -59, -229, 93, -111, -257, 5, 213, 77, 159, 8, -102, -76, -249, -89, -31, -189, -78, 111, -13, -25, -12, -295, -94, -138, 81, 79, 38, 237, 50, 23, 67, 5, 143, -212, -67, 3, -248, 133, 4, -90, 83, 206, -53, -224, 16, 78, 186, 125, -110, 37, -88, -5, 161, -19, 143, -87, -177, 42, 14, 326, -84, 71, -118, 12, -50, -21, -30, 143, 186, 19, 75, 111, 107, 176, 293, 131, -44, -45, -128, 67, -13, -182, 107, -62, 22, 51, 18, 94, -119, 91, 48, 33, -20, -38, 42, -16, -84, -79, 113, -58, -71, -144, 11, -157, -94, 2, -253, -182, 39, 201, -32, 81, -109, 56, 88, 34, -36, 30, 277, -64, -107, 7, 151, -23, 215, 114, -377, -148, -109, -170, 48, 80, 169, -82, 25, 200, -119, 15, -70, 40, -41, 239, 131, -17, -190, -289, 147, -4, -35, 186, 82, -133, 40, 153, -86, -10, 210, -109, 120, -6, 42, -56, -1, 80, -229, 104, -43, 86, 30, 37, -390, 11, -167, 39, 175]
7000A75k00K55n10L21k47K62m9j67M28j19k36R9l28L83jj7j66q7L65k16R7K04
7022B46l62J75K6o9K6rl52L87j52j8J89n4j65L01j21k69K78j23M4J72q8j47o6
7045a51J55j60J94k65j10O36k48p6k51K07P3j04J10J16Mk40R7L6K31k63j93J68
7067c4J75j98P3J04O8k23O5J19k29%J22l48M01j23l4J49m5r7l24K99r8J98j85
7090a65K36O9k73K49l19K48p4j5j96K55L34l11q8N3q4O6j55J72R7k84p9R3J55
7113a6J10k05L01j57n1RJ59k25O6O8J13L4j61O7k05L96l65J79k07P9Qn0o6q3K47
7138D5J7M3K5j10l3J96k06m1p7O4J04j3R6m3J75n36K99k4j15m8K42k0m2j34m5
7163a81J18K36k44J47j50N1J11k28M5oJ39Q3j88N2J94Q1l23J00Q4j54j55J18M2
$$ y = [175, -25, 230, -280, 41, -206, 56, 7, -160, 268, 149, -87, 12, -316, 67, 66, 49, -117, -204, 161, -55, 42, 246, -116, 59, 85, 16, 42, 33, -319, 68, -84, -102, 87, 33, -132, 169, 48, -221, 57, -66, -22, 150, 62, -85, -151, 4, -156, 38, -227, -337, 299, 51, -25, -276, -69, 4, -100, 10, 126, 130, -110, -13, 23, 254, -9, -202, -34, 141, -57, 16, 120, 188, -35, 30, 149, -80, -80, 42, -306, 95, -28, -62, 87, 42, -55, -379, -80, -178, 20, -165, 71, 140, -133, 116, -203, 45, -29, -44, -240, 15, 349, 38, -50, 3, -81, -15, -170, 2, 99, -185, -264, -171, -16, 94, -111, 190, 33, -18, -9, 150, -75, -9, 59, 172, 206, 45, 112, -93, 303, -62, 117, -90, -11, -3, -53, -119, -202, 45, 62, 105, 130, 20, -13, 183, -23, -64, -141, -77, 27, 14, 110, 67, 242, -294, 5, -19, -134, -182, 60, 40, -2, -136, -181, -63, 173, -71, 76, -74, -23, 88, -140, -95, -101, 38, 121, -67, -15, 179, 260, -63, 37, 121, -33, -188, -70, -28]
7186b8o7K58j36Q7Pj29J5J75j10k0J42k86K47l4k04L8O0j00m5J61l65L96l87L92
7210F7j4P9j72M5J21j72j70K68l3J06k30O2r5K60j11k7j6Kr4L49r6k78J82J32
7234A65k05J87j49k03K96r0j22J14j69J01N9K1J17pl31P1L65j26P0l63K62j84
7256a21J08M1q5R3k26O2k8mn5R6K09M1k64J9J86j25K07R3k40O8O7j56N8j45K1
7281h0J3l0O6M5N3k6j05o7J16R6k9j61k47N98q5j78K24rl25J98k28J90k5j80J04
7306g2L49k72j59L71l56J16j80J85K17l21P3R1j45k99N21k25O6L5J05k34jQ7K20
7329A72J51k69nj75K65n0K9Q2L1j51n4P2l56K96k66Q8O6j65L41r8J28j51mK78
7353B55m54J6K56j31q8K19j08j97L19l76K44J85q5m1j18m4M7P2J15n1J50k08M3
$$ y = [-28, -95, 163, 27, 114, 121, -8, 7, 182, 72, 52, 194, -92, 155, 121, -83, -45, 15, -85, -130, 31, -334, 62, -325, 67, 53, 132, -40, 5, 126, -46, -216, 52, 19, 125, -105, -43, -138, 122, 11, -16, -32, -30, -124, 225, 129, -149, 33, 165, -40, 147, -2, -205, 91, 1, -121, -7, -176, -75, -16, 5, 122, 115, -216, -145, 220, 94, 164, -199, 63, -121, -13, 28, -57, 36, -190, -128, -156, -160, -215, -119, 90, 131, -133, -114, 72, -53, 154, 247, 7, 75, 142, -14, 44, -101, -80, -67, -97, -31, 14, 67, 41, -64, -131, -15, 81, 52, -109, -356, 242, 157, -21, 203, 194, -131, 67, -161, 29, 4, -176, -72, 277, 5, -154, 217, -139, -23, -203, -18, 199, -122, -49, 42, -103, -402, 119, -106, -40, -5, 100, -134, -135, -48, 172, 323, 54, 49, -126, 139, 89, 118, 200, 231, 80, 26, 98, -258, 38, -228, -140, -74, -239, 102, 4, 132, -19, -23, 255, -199, -183, 73, -58, -146, 73, -35, -232, 87, -289, -45, 140, 55, 14, -104, -148, -101, -29, 86, 35, 185, -23, 20]
7376B0K50n39J69o0J58J59Q0k44R3r1J8L1j17J34J54l00L36j55j30j07P0K36L6
7399B01k69q7K21N0J8R5j01j88P3K71k12j80R8J07k65R8K22j08K6j21J97j40l2
7422b6k05L0J30M5J29l9p4j49K96r8K1j06Q0m5J96k42J81Q1n56J57K02k46K72
7445C4o5M0p0L24k38j31r0J03L9j63K90k55J77l4M4J08j63K95j94l8J53k51K7
7468e8J33J1j47N6j20O6M29k44P8j46j58J79l30L76k22Q2R4j82q3K00M8j3Pj82
7492a26J78m0k2j18l4K46J40l38J03M7j23qK18j36j17K78kj90Q1j43J72l6J53
7515A83k72j24M9J53J08m68N35o7l3J25k47J33O4j35O2j45R7J1N0k31j0L35j50
7538B3j32j27J42J83q3P7O1J1k75J82N7j02N8l61L93j78J93k55L0j0K74n5l29
$$ y = [20, 270, -269, -100, -160, -2, 157, 237, -7, 86, -5, 13, 44, -73, 61, 215, -85, 251, 96, -34, -141, -71, 165, 201, -68, -155, 66, 116, 134, 229, 128, -60, 13, 284, 72, -108, -10, 97, -168, -70, 152, 44, 70, -51, 146, 6, -26, -231, -201, -71, -26, 103, 64, -10, -159, 137, 39, 60, -46, 34, -11, 185, -57, 124, 205, -351, -194, 8, -238, 34, -31, 9, -61, 263, 25, -106, -196, -93, -54, -217, 73, -182, -5, -39, 5, 113, -50, 245, 51, 13, 166, -85, -58, 75, 86, -61, -5, -125, -59, 370, 126, 204, 58, -100, 79, -251, 125, -97, -15, 79, -103, -186, 14, 62, 49, 56, -126, 52, 12, -10, -128, -162, 84, 224, -114, -11, 36, -87, -95, 123, -13, -130, 148, 146, -44, 37, -106, 66, 30, 183, -89, -213, -164, -11, 97, -371, 164, 97, 64, 189, -58, 75, 139, 4, 66, -79, 18, 29, 79, -152, -162, 173, 23, -109, -236, -94, 89, 6, 83, 144, 155, -120, 62, 119, 17, 75, -286, 107, -71, 122, -133, -103, -113, 161, 106, -223]
7561b23j08K15K76k30J2J56k08J75Q3%k03J21j76k76N63K0M6l51n0J74O3k17L30
7584A92j93Q6m3j6L8p0j32J04K80k12J13m3J44l01m1k0K46m4M6l52R1R9K94n8
7608B08j89j45J93p2L7k83J98RJ16k37J44j44K03J19NJ11l68J04R8p2j94P5N8
7631b6R2q7P5J55j49P8NJ29j98p8K6k90L06L8k17J44J89o2k03K72k29M7J14j09
7655B2j52q0O8J02O0N1k9j84L48m34J01r4Q0L48l18O1K09m78K96J13l62J87P9
7678fN1j72J85l36J91l3J02J03ol9k37L07l10J83K47k05Rj19L35k79j00M6N9J02
7702G8J8l2J3l3k6L3L9j44K3k85M06k2L35m95J12k1L04n92K17J87k22K87R7k41
7726C6p5J64k46P6M9N9J4k94K89k23J50J92m7j40o6R8k3J48l73J7K81k47J4J22
$$ y = [-223, -331, -116, 160, -70, -58, 98, -110, 65, 148, 148, -55, 66, -110, -386, 177, 197, 243, -108, -158, 16, 79, -138, 192, -1, 85, 42, 26, 64, -6, -138, -34, 246, 34, 147, 104, 248, -53, -94, -114, 132, 88, 134, -218, -127, -28, 266, 208, 19, -126, 67, -5, 32, -251, -53, -44, 72, -165, -21, -165, 38, 157, 162, 273, -95, 9, 107, 35, -159, -84, -26, 66, -21, 54, 209, 60, 138, 143, 272, 74, -4, 22, -268, 38, 76, -141, 3, 192, 130, -73, 199, -30, 17, 131, 22, -130, -210, -142, -40, 20, 71, 42, -142, 206, -228, -127, -221, -141, 207, -111, -50, 159, -319, -23, 90, -272, -85, -6, 45, -127, 58, -278, -87, -120, -18, 85, 79, 40, -197, 110, -200, -17, 230, 25, 34, -85, 250, -29, -129, -83, -24, 78, 96, 64, 77, 44, 18, 51, 90, -54, -31, -316, 90, 68, 403, -92, 20, -1, 303, -289, -72, 115, -107, 180, 277, 36, -39, 125, -121, -45, 4, 63, 77, -217, 72, -151, -1, 191, 144, 4, -62, 36, 13, 161, -212, -195, 86, -161, -147, -25]
7750b5K40m06K56j3J31k25O1M4k15lJ77K3j36J92k60J32K07J6k74M09k92J36k04
7773b9Q7J28k04j25K39J33m9j71k6K74j59j9j08K34o6nk81M55l18p5m4Q9M3k49
7797b46J91L56l47K7J59m2q8Q7q0kl9K52j41n6n2j52K94M9k61M26l29J6ol61J53
7822a92K04k35K44k24J37J42j19L39k08j09j19k6n5M05k83M8m1L7L6L8j62K79
7844A36j14m0N7j15K05l00Q3O3k71K01K58k42M97l82o9L04k76m5L49k74o1j09
7866a45M8L02j23j02L1j84K84rj87M9j55K45M7m3Q5l32n8L11k74K4j04L01o2J85
7890A34o0j00k78J53P1k4J9J56J03j22k54K43Q9k63R4j88J61J27j05j45K01p7
7912f5j34J66n2j1K4p8J46O5l45K96J45j04j61q1J90J16q8m8J4p4j6J47j33k0
$$ y = [-25, 215, -191, 65, 52, 183, -42, 19, 63, -152, -155, 22, 45, -91, 101, -159, -27, 180, 196, -78, 331, 39, 175, -29, 58, 186, -18, -143, 96, 229, 180, 9, -17, 257, 98, 79, -29, 205, 139, 134, -147, 308, -10, -85, -129, -40, 3, -246, -55, 301, -46, -19, 140, 98, 10, 97, 17, 15, -24, 228, 87, 31, -21, -173, 121, 170, -91, 335, 6, 22, 16, -345, -192, 12, -223, 21, -203, -66, 76, -43, 296, 88, -21, -140, -166, -221, 184, -99, -51, -92, -55, -19, 19, -143, 136, 22, -18, 39, -76, 129, -171, -88, -25, -296, -95, 163, -79, 418, 36, -33, 271, -5, -50, 299, 25, -36, -145, -97, 205, 82, -20, 11, -173, 111, 102, -85, -36, -191, 54, 101, 58, 143, -189, -247, 64, -210, -186, -290, 11, -51, 134, 74, -26, -304, -151, -80, -104, -85, 71, 174, 52, -202, 41, 130, -133, -39, -227, -66, 61, -44, -189, 12, -65, -199, -33, -85, -96, -72, -150, -4, 61, -284, 12, 157, 53, -108, -189, 1, 117, 29, -19, -5, -79, -95, 52, -81, -101]
7936a01J35j16p5P0n7Q4j39K69P1J19k84J73q3m9o9J64k35o3J62P9p0K31k67p5
7960a26k2L61j23K6J54j21k79J73k37K93J23k68L9P8P5j76k5K19l56K70O0k34
7982i6L43k03N5q7J05p3l18M26j19O3j97J62k44K28j60J25j51L26p7j12m4k42
8004b90K77l4o7J79M7l92M41j40L6J39l51K04j55Q4K31m7j47n1K68l58J35j11
8026a02J26p4J13N3q9mp8P5n0j73L65q6j17lOj26J82l3J33m3m0k7l50L30j78J97
8052GP0j30k52L89o6j39m1P1o1L45J2L9m30L00j21j04J90j91K9K04p3P1k60k3
8076a64R2j38J18O5l1J68j93J0j16K5L08j2n1k25R5m5L67l11kJ15J37k57JN1k98
8101b91K99p6K8q7O1p2R1R5r9j0r4L3K50r7K3R4l55K06N7j96J98J39j45M2J58
$$ y = [-101, 34, -82, -157, -87, -144, -60, -199, 70, 141, 260, -24, 149, 66, 17, -52, 112, -123, -186, -24, 55, -15, 216, -51, -126, -148, 213, 90, 116, 270, 149, -130, 43, -194, 99, 222, -46, -7, 71, 146, -30, -55, 164, -192, 78, 138, -96, 247, 44, 99, 12, 117, 44, -274, 152, 33, 96, -101, 61, -183, 45, -115, 10, -141, 185, 108, -4, -48, -290, -13, -47, -114, 65, 112, -280, 161, 21, 57, 196, -155, 49, -106, -22, 209, 162, 15, -36, 232, -126, 9, -102, 24, -50, 63, 116, 27, 23, -55, 20, -30, -203, 162, 76, -41, -44, -38, -164, 18, -15, 118, 75, 35, 8, -342, -12, -190, 7, 77, -53, -305, 84, 18, -121, -162, -91, -152, 193, 205, 244, -186, 114, -7, -111, 79, -112, -83, 121, 48, 119, -141, -164, -72, -210, -92, -27, -58, 110, -83, -73, -189, -164, 144, 132, 81, -144, -49, -94, 273, -38, -40, 75, 212, -45, -44, 7, -291, 8, -68, -40, -127, -66, -138, -47, 48, -51, -61, -155, -122, 128, 31, 54, 148, -207, -1, 56, -140, 58, 197, 52, 94, 252]
8126B52k54K7j80K17K5R6N5k33O1k04J20O6p0J31l5j56J57q4M1q3r6J2j14J2J33
8151a04K05k4J51k66L43l69J80k40J27j5Q2K7j09J71P1n06J76K00n3q6k8Kj33
8174a98L4J02J1n2L09j22k7k07M20k40Q6J33l65K9M6N0r2
$$ y = [252, -2, 25, -155, 62, 87, 183, 238, 5, 66, -138, -18, 48, -22, 109, 74, -82, 75, -9, 32, -51, -147, -135, -249, -237, -104, 101, 77, 228, -38, 305, -64, 116, -124, 3, -12, 70, 97, -12, 159, 230, -276, -100, 100, 47, -39, -67, -65, -198, -164, -62, -51, -103, 206, 84, 57, -150, 270, 30, 116, 249, -116, -87, -41, 9, -83]
8191h3
$$ Imaginary data points
##PAGE= N=2
##DATA TABLE= (X++(I..I)), XYDATA
0@%%%%%%%%%%%%%%%%%%%%%%%LoOj0J5j6J6j9K6l3L9m4M9n6O6p7Q6r5J07j23J38
44G2j52J70j92K15k37K59k85L15l46L78m12M48m87N27n65O02o32O52o50N93m36
65a63O6Q32l256J1879j12048J21234k6917J3438q602O198m522L480l020K797k453
80a057K211k197J837j620J255r13Q09l64K61n41M19m48Q69q45O66m56K00m8L6
99G4p0j20MK95k3J03m14L75l19L4j23J24n6J85p1q9J87J27j42j08M1J81k67L81
123C09m10J52j38m2J85j81L23m23K52J04k41K13q2k3J65k94J40j63L25l35J15
144d9j7j28L63l59J92j08J8J27rrj08L04k98J98P9j06Km03M97j79P4j65l6J06
168a4k8J58o2Ml1k1P6j13J3nN6m5j94R6j38K19K6Q5oQ6m17L18K02k85n8Q1j68
$$ y = [0, 0, 0, 0, 0, 0, 0, 0, 0, 0, 0, 0, 0, 0, 0, 0, 0, 0, 0, 0, 0, 0, 0, 0, 3, -3, 3, -7, 8, -8, 8, -11, 15, -18, 21, -23, 26, -30, 36, -41, 45, -50, 57, -66, 72, -80, 90, -102, 113, -124, 135, -150, 165, -181, 197, -215, 233, -254, 273, -292, 310, -322, 330, -320, 273, -163, -97, 735, -2521, 9358, -102690, 18544, -8373, 5065, -3537, 2661, -1861, 1619, -1401, 1396, -1057, 1154, -1043, 794, -826, 429, -484, 325, -39, 222, -319, 100, -348, 521, -324, 342, -114, 86, 38, 74, 4, -116, -112, 183, 160, 263, -151, 224, -95, -61, -184, -60, -116, 69, -2, -91, 96, 223, 81, -27, 14, 195, -72, 309, -101, 51, -87, -129, 56, -125, 198, -225, 27, 131, -110, 103, 21, -2, 163, -131, 9, -154, 171, -164, -49, -66, -194, 169, -190, 2, -106, -88, 39, 30, 21, -87, 217, -81, 117, 196, 90, 92, -311, 186, 7, 81, -84, -120, -14, -42, 116, 54, 58, 27, 6, 82, -31, -18, -23, 33, -12, -206, -110, -248, -29, -3, 82, 76, 162, -255, 63, 265, -20, -78, 3, -165]
195a65K0n1K34j65K56j01j03J72L0m6j46j1j37J15J45l5k95M34r2L7j10q5l2o2
219a93K9M0JJ45j65n5J21J70l29M08k97J70j81L35j55j14M8l4r6J04J29j7J93
242B57j91p7K37k09J0K95o44J26J58q5J56J85l21K7j7K3J90N9Qn39L90j36n1K86
266A37j74nK09k45k6m6J69k2Ol4J07R8k45K56n7J04m87J13M0j3L27rj10J34k72
291d5K48j53k29K20nk3O3J48l84J54K6j22K71k80K09m5K5K23k47L8j08m3k8J68
315H1k94J78n3L9K90l90K77Ml00M9L7P2o0K1J99j98L11l21j4k35K90j31j88M16
339H0j3J04m25K86n6ro0K64m3k21m0L17j09l09J39j96M35r7J16j89L2J20r0mJ06
364A38J9l02O0J52Q2l86LK93j52K20k15J63J79j60j13R1j13q5J60J1l13J95j36
$$ y = [-165, -145, -196, 38, -127, 129, 28, -75, 97, 127, 81, -65, -76, -213, -98, 47, 12, -283, 151, 59, 96, -14, -99, -131, -193, -164, -124, -123, 22, -143, -198, -77, 93, -236, 172, -125, 45, -136, 199, 44, -70, -22, -56, -152, -48, 81, 64, 257, 66, -11, 226, 17, 27, 322, -322, -196, -38, -123, 33, 218, -103, -76, -93, -70, 120, 179, 187, -352, 38, -98, -149, 137, -37, -42, 167, -78, -104, -150, 19, -3, 3, -31, 76, 174, -71, 185, 128, 232, -255, -142, -102, -115, 212, 203, 93, 227, -45, 203, 50, -179, 41, 36, 13, 76, 224, -160, -6, 20, -102, 169, -111, 98, 53, 78, 301, 54, 92, -16, -59, -87, 81, -213, -35, -88, -49, 241, -149, 128, 132, -168, -119, -82, -10, -70, -49, 150, -48, 263, -58, -72, -307, -17, -148, -336, 80, 67, 171, -254, 32, -24, -33, -93, 171, 128, -93, -133, 184, 75, -234, -95, -291, 144, 47, 163, -26, 6, 126, 36, 32, 138, 157, -145, -85, 67, 149, -237, -234, 59, -93, 127, -88, 75, 254, 94, -19, 72, -41, -126, 34, 45, -268, -73, -209]
387b09L94k78Q3J12Q2j03j1Pk10p5J95j68J38n0J39J15k2k36M04n3l19jLK00J16
412B53j91p8L5R7j43j44L15j71J57l05K54K7o6Nm4L7K8o2o7K20j17K40k35m9M3
437C9j31nJ73j43J6K31j21k27L52k47Oj6K8R8R2q9q2k46M12j89M06l82l33K35
461a23K22J0k70M25k91m3L21l44N8j97M26k02R1N3k30J81j2K02k55r2Q3j57J48
484DJ24n8j70K05oj90k11K51J01K58k12j61Nq2Q1K32l08K76q4p8K02Ok14M08n41
509a62L94k76q7J56k14Q6Q9J54k54L40k24M1j58oJ2L94k22j73J33n7j36J25J68
532A23p3p4k15L80l1k90N2J73l7j97J77J4k88L02J32j32j14L6mJ0l2J60L1k7N4
557A30%j36p1Q1J56l51J66l2j20J84J07L7l75K34J31k97K17J06r9k7r2J14JJ01
$$ y = [-209, 185, -93, -10, 102, 184, 81, 70, 77, -133, -208, -13, -181, -43, -93, 46, 161, 139, -97, 307, 254, -65, -66, -63, 137, 253, 62, -16, 19, 116, -27, -171, 144, -27, 130, -175, 79, 106, 40, 45, 1, 38, 66, 4, -63, 157, 40, 280, 45, -4, 39, -92, -97, 76, -67, -51, 180, 59, -168, 184, -63, -57, -73, -45, 53, 145, 56, -26, -272, 140, -49, 357, -25, -358, -123, 99, 109, -161, 264, -27, -70, 251, -93, -35, -232, 194, -8, 83, 136, -94, 87, 75, 277, 22, -70, 13, -144, 4, 128, 70, -100, 105, 99, -91, -302, -51, 50, 308, 96, -65, -60, -142, -61, 171, -137, 139, 55, -23, 179, 185, -29, 379, -162, 232, -44, -131, 25, -189, -103, -14, 140, -114, 226, 2, 43, -115, -121, -109, 285, 63, -110, 23, -34, -170, -45, 123, 50, -24, -239, 141, 110, -180, -128, 45, 8, -189, -12, 2, -286, 16, 148, 16, -98, -62, -66, -56, -88, 72, 103, 76, 130, 130, -6, -77, 4, 160, -191, -25, -57, -177, 7, 114, 151, -224, 10, 141, -156, 61, 167, 68, 41, -51, 63, 64, 165]
581A65m03L01j16k86J80L17j52n2J0J37J09j14k05K31j22k5q9j22K29K9L8J01
603A61j83OK13l56q8R0L33n7n5j77K90kJ10j09o4r1j23M5J21L8J3k28l1K39j85
628i0K66k89K26O4j26J8J05k21K5J08j17J35j43N5N6j56J45l05R4K00k02K6J87
651F1J56r5k69L26l10k6k1P4L13l59M60k07p5n7L6o7K46n25N40K0k90j11k0K35
675C5L2k51j04M09k54J65k81K53N1j10J20j85J84k52qj10J27L36l44P2P4n5J08
698A2k94L38O2k33J9j52L29K0j6j95p7J02J46R5j84r8L4M4o8R8K0j17J74j25L4
723c2ON8J02j82K53l25j50L43M3j91R4J78k92K86r2K5qj71J20o5k10K39j81K52
747A00j87j61J87K06k94O1J8J33L0j07K75k68j74L1J94p8N6K69k62l1M2Q8J36
$$ y = [165, -238, 63, -53, -339, -159, 158, 6, -46, -36, 101, 210, 96, -109, 122, 0, -25, -114, -236, -7, 22, 60, 161, -22, -16, 197, -159, -247, -157, 176, 119, 64, -113, 177, 175, 285, 176, 112, 21, -102, -57, 64, 102, 115, -113, -144, 95, -90, 176, -113, 113, 177, 51, 69, 174, -47, -22, 86, -31, 104, -39, 16, 72, -84, 61, -244, -150, 50, -152, -126, 61, 217, 122, -147, 179, -131, -157, -178, -104, 209, -150, 310, 103, 28, -29, 7, -60, 186, -339, 201, 221, -69, -180, -200, 35, 67, -184, -288, 121, -133, 32, -249, 4, 55, -55, 65, -120, 64, -188, -196, -306, -179, 157, -187, -115, -41, -96, 12, -282, 56, 118, -115, -96, -248, 81, 101, 85, -110, -187, -85, 61, 156, -28, -126, -92, -48, -116, -18, 2, -115, 59, -66, -32, -26, 32, 134, -48, 205, -120, -270, 73, 116, -75, 19, 197, -95, 191, 99, 124, 116, -55, 65, 0, -210, 29, -152, 100, -87, -248, -61, 145, -149, -88, -70, 63, 93, -14, 261, -7, -181, -150, 44, -34, 22, 291, 29, -2, 40, 128, 264]
770B64m09P8J7n7rm7K83k14J04J16m07M70l16L47l84j1Q2j17J63K85j01j42j27
793a32K0Ko4K18j0k43K04k24M83l58L5J93j38J84m6l47K22KJ40k20n4J05OJ19
817I7j98l8J03J06q7K21l34J84k47J36K68k31q3q0J71J64l05J24M5J2k7Q8l48
840b59P9J05j4R5nn3j6n2K18k17J22J14J94k10n7l1j41J29J50j75o4j97L40j79
864a24M36k94O6j23P8j8J23j54j10%J31J72k21j45J69j38K33K49j43j19j8Q2m56
887c24J91Q2M4q0M9J29j03j9j72J58j3j7M0QJ07j57L13k4j66J11j44P8o7l8j19
912a33L2J14J0j57q8j16J53K79N3k42n9J41k02K36J81q2r9k1K6j53Q3M6j07l5
936a40K89Q7j41J39k22K35m11L69j71p3O7N2No8K49l18J35l19K88j23K89q7k78
$$ y = [264, -145, -67, -50, -107, -116, -163, 120, -94, 10, 126, -281, 189, -127, 220, -164, -175, -93, -210, -47, 238, 137, -5, -132, -112, -110, -174, 44, 34, -209, -5, -229, 254, -104, -69, 124, -14, 170, 124, -223, -1, 1, 141, -79, -133, -28, -22, 97, -101, -139, -36, 70, -17, 204, -130, 54, -193, -57, 211, -20, -103, -183, -12, 152, -153, -29, 16, 28, 1, 89, -259, -180, -75, -89, 6, 1, -52, -68, -120, 98, -119, 3, 117, 311, 101, 44, 13, -128, 1, 151, -24, -88, -285, 55, -124, 312, 18, 84, -39, 39, 21, 144, -10, -120, -120, 11, 183, -38, -183, -14, -152, 81, 330, 187, 68, 50, 132, -324, -133, -51, -7, -87, -38, 91, -12, -31, -203, -45, -58, -75, -35, -27, 80, -77, 236, 212, 46, 157, 13, 91, 24, -14, -133, -101, 13, 23, -134, -222, -338, -185, 94, 147, -95, -154, -13, -215, 21, 202, 120, 21, 0, 26, -127, -44, 2, -105, -140, 149, 236, 95, 234, 12, 247, -164, 205, 34, -39, 28, 80, 85, 17, 266, -52, 83, -236, 52, -71, 218, 131, -147]
959a47nL50m04J65K71k97j01J31J59m93M39k02R1L19L1j89r9o9p3K35k88M55l08
982b9J68j25K4J13k02K39o9k8l0p5Kmj75L91j41k22L08j22O2k44J51j68M30m54
1006b00K30J10l51N64l92j77M96k51rL5R6m4l1K3l1J80j52lk06J57j35J33J64
1029B06k92L3Q9j04J44k30m0J39k10M21k79l2J97j57L9j46L22j32J13OP9j22l8
1052Fj18K28l1o3r%k0O0J93k01j9m1p7k3lP4L9Q8q8N6K1j42pJ91j61p5q2J94o2
1081g2J86j51r2K33J01j68j16K33m38L04%p6K21k65J85o8rK9O8j52m5j09lK54
1105E0l6j1p7k42K85J89j39j60K80l05K24p6q4K65k13J96m29J82J35N5j21p4p6
1128a82K62j55M4J87j51k3o0J86k58M7j26M16j45N2k87K31Mp3k22K35K0K2O4j6
$$ y = [-147, -152, 198, -206, -41, 230, -67, -168, -37, 122, -371, 68, -134, -43, 276, 307, 118, 19, -50, -123, 112, -176, 279, -29, 139, 14, 38, 151, -51, 188, 119, 91, 61, -14, -12, -16, -191, 200, 59, -163, 145, 23, 85, -159, -8, -176, 254, -200, 30, 140, -211, 353, -39, -216, 280, 29, 20, 55, 151, 107, 76, 99, 68, 248, 96, 93, -113, 44, -91, 42, 206, -86, -53, 36, -68, 76, -154, -194, -55, -265, 156, -123, -155, 42, -115, -76, -222, 100, -32, 81, 87, 166, 44, 6, -112, 116, 85, 22, 13, 13, -7, 53, 246, 45, 26, -15, -92, -115, -118, -44, -5, 83, -5, 51, 72, -70, -77, 114, -47, -122, -204, -10, -72, 114, -37, -129, 104, 205, 37, -79, 154, -284, 20, 20, -56, 165, -100, 85, 17, 8, 37, 105, -47, -92, -201, -204, 50, 14, 3, -74, -316, -31, 158, 19, -141, 139, -166, 58, -18, -102, 163, -50, 146, -283, -101, 34, 89, -32, -106, -182, 80, -75, -31, 156, 5, -18, -78, 108, -150, -103, -229, 187, 42, 94, -193, 38, 42, -31, -253, -18, 2, 24, 88, 72]
1152G2P0n1j22J80J61k54j11JL56j02m4P3l58l4K22l42K48Q4N6q9o5j6J54j17
1176b8m0m8J5Q5j1J89j3k59J88J01j39j42K06j78k96M63Pq1L50m37K6qK94m17
1200a73N6L02j68j57J84J1j44p9L98r0j86N3j20J5R9k9j25M9N8l3j76K28k69J1
1224b85K66O9J3m5R5m6m0n9K2j07J37j32l51M23Q8j75M7K47j74L4R8l7j17p5K51
1249A47N8k49p4p8j36L09J52k67q0p5L84j65Oq1J04O1L0M8l08M79o9j62l45J09
1273b02j92L96J13j87O4N2l74N80l62K06p0r8R6j48m7J63j73l5L62r5j31o5M39
1296B92l79K10r2rj2j70j0J20L33m32J27r3J2J95q2K42j3l77Q8M5K34k74K45k36
1320c6j13k1J59r6P4L7J0J18l11J48J79o5o1r6Q4q7O3Jj74J4K44j9j15K28jJ1
$$ y = [72, 142, 91, -31, 149, 310, 56, -55, -54, 302, 200, 156, 229, -129, -163, 59, -283, -35, 49, 105, 16, -49, -65, 89, -28, -68, -116, -101, -16, -27, 162, 149, -110, 78, 179, 40, -102, 104, -74, -370, 93, 100, 19, 369, -68, -42, -50, 244, -173, -117, 185, 17, -140, 44, 55, -89, -168, 230, 140, -46, 7, -113, -98, 1, -28, -153, -104, -46, -79, -255, -27, -296, -285, -19, 50, 63, 18, 113, 67, 27, -32, -10, -117, 20, -112, -463, -40, 48, -127, -80, 167, -7, 27, 125, 88, -29, -104, 147, 205, -44, -118, -196, -332, -23, 129, -138, -218, -293, 91, -74, -68, -149, -45, 16, 46, 94, -214, 265, 196, 34, -311, -202, -394, 2, 115, -72, -8, 44, -330, 250, -112, 94, 24, -74, 22, -126, -173, -10, -183, -218, 144, 49, -82, -147, 292, -87, 123, 31, 22, 10, -160, -170, -50, 283, -149, -22, -115, -103, 92, 10, 252, 239, -138, -50, -5, 229, -45, 200, -36, -149, -170, -11, -107, -33, 4, 14, 132, -179, -31, 148, 83, 22, -74, 10, -77, -14, -13, -187, -173, 71, 52, -63, 165, 164, 175]
1346A75j59N2j03J0M6J8j20J02J01K0l68K73nO0M6q3%j16K25j69P2j03L6J03k05
1371i2J91k58K14Nl50L05K20j33k33N4J77P5K0j32kl18M72J74l30j7j22J28mm3
1395AM9J90k74J3N6N6l43K59J29k06J38k24K34j23j55Q0n8K22k8K55j91l1J45
1418A94j95K5O9j20J27J27j25m6J2r3OQPl3J22k59J93n7p6N5jL96n46J36L2j31
1444a73K33M7J1k38N3J2j22J14Mj06K01O4j94L7j18L82l29o9J62J16o6J04k00
1467g5J09k9R8r1j00Q5Q9P2j09L16j14m85L07J52k47J68j44j62J91J21j38k20
1489b06j7J72K26p4j53n7J23K23M7l22q4k02L72K22k01K6j52k55M37l18J68K7
1511Bj50L07l40J42J66j42J80l13J05J69o6J82k37J07j23jq5J44lN4L2j99O1J37
$$ y = [175, 16, 68, -35, -25, 21, 39, -81, 21, 122, 142, -226, 47, 42, 102, 148, 65, 65, -51, 174, 5, 77, -26, 10, 113, -92, 99, -159, 55, 60, -290, 15, 235, 102, -131, -77, 100, 175, 195, 63, 61, -257, 215, 389, 59, 42, -80, 48, 44, 1, 50, 240, -34, -21, 35, 91, -252, 7, 136, -70, 68, -156, 78, -45, -200, -120, -178, 44, 16, 271, 80, 49, 194, -1, 24, 93, -27, 100, 227, 102, 56, 68, -25, -19, -11, -4, -37, 85, -174, 19, -38, -114, -59, -60, 336, -210, -74, -42, -173, 60, 107, 118, -120, -67, -55, -177, -63, -59, -165, 36, 100, -94, -57, -175, 207, -122, -191, -29, 87, 21, 125, -75, 34, 5, 103, 12, -88, -3, 86, 158, 49, 365, 251, -234, 73, 225, -22, 146, 2, -160, 31, 152, 14, -206, -223, -51, 175, 101, -52, -109, 14, 237, 284, -38, -122, -324, 48, 270, 69, 95, -57, -312, 125, -193, -25, 2, -148, 159, -181, -39, 127, -15, 165, -148, -43, 126, 60, 242, 5, 112, -11, -12, -97, 47, 44, 98, 130, -69, -8, 129]
1535A29nq4J4J35j28j27K26j83j45M69n25N94k74k5K20k21l63K39J28j04l3j28
1557a91M28j07Ql43RJ4K61k39J49J0o2m4K45q6k40J82k20K35j2p8L90k81m6l7
1581e5J03j32r8K92j67N5q6J84P2l24J20kK7K34k79j00L30j07j80K90qj30l0K48
1605B57j92l08K08j47P1J04PNK31j24J27l16K14j66j4j5J44J17j52l48N1J25j63
1628b84J16Q5O5k7K62k95J00n6N5q1PJ38k44J53k70M07l3j0j09K06M0k81J37j52
1652g1J5k46M32k73K37r8J45l15j19Q0J84J9j43K25n2M0n3j97Q7J69K4k67M99
1675C22k32k84J62O6J94j54k61m8%K31M0o8j6K34k03k7K33M7j6j88p6r6K45j47
1699d2k8k1K69m43K70J16k47J23J27k61J42J1k94L85k13j6K6J77k87K60k96K56
$$ y = [129, 124, 40, 54, 189, 61, -66, 160, -23, -168, 301, -224, 370, 96, 71, 291, 70, -293, -54, 74, -30, -63, -191, 237, 130, 138, -205, -196, -182, 79, -160, -11, -1, -63, -107, 138, 52, -188, -6, -226, 9, -3, -81, 309, 28, -18, -55, 48, -84, -182, 110, -57, -2, -88, 96, 168, -156, -36, -38, -11, 223, -56, -156, 174, 67, -113, 177, 169, 39, 9, 257, 65, -243, -35, -182, -111, -7, 0, 5, 236, 112, 239, -77, 137, -29, -43, -58, 86, 203, 51, -297, -246, -121, -284, -168, -83, -18, -45, 217, -78, 22, -34, 21, -60, -53, 85, -159, -6, -276, 131, 98, 88, -21, 185, 225, -56, 81, -71, -56, -302, 130, -143, 94, -4, 141, -174, -293, -213, -29, -10, -153, 72, 20, 60, 7, -190, -103, 66, 90, -177, 322, 90, -194, -32, 34, 228, 74, -187, -235, -235, -4, 36, -32, -48, 186, -17, -44, 189, 236, 220, 32, -44, -140, 105, -42, -70, -91, 178, -265, 5, 121, -126, -3, 124, -137, 5, 16, -278, 107, -106, -122, -96, 81, -206, 54, -242, 14]
1721A4m1l6O8M1n1J5j77R4j68PL40r2k03K32Q5m63J69L24j59o2M34m76Q3l46M27
1746E9k59M53J10j45j87J00j05j21L13k46Q5j17J28n7N8r9Q3j50j16L38o8j84
1768a27Q7M7m8Q3j86L44k37m06M77q8K77k66P1j88M66k47o0q9O0j33K96k70K08
1791G1J30m60L05k48L83q2j77J03j80N2J94Q3q8k05M6o0J02J65m24K63J95p9N2
1814A41m04LL44j99J24r4k72L01K42k75l1J12k23J60L37m49R4j34K91p6N0k75
1836b33L00j45m9K24l68L23L9q9k52L64j06J10o1L2o2k21L80l88o6M50j05J85
1858B62k73M4K7l09K31k19L64j96N5j25Q5j3J00k2k2k9L4J77n49L24J29j0j61
1881i6J19p9J39N4k09Q9N8J22l33P0j15J66K18K1q6j54O4r1R1j54L32k47p3q9
$$ y = [14, -27, -63, 5, 46, -5, 10, -167, -73, -241, -234, 106, 14, -189, 43, 128, -335, -166, 158, -1, -63, 371, -105, -22, -368, 59, -200, 253, 363, 218, 31, 131, 26, -95, 218, -28, 57, -60, 68, 11, 69, -30, 53, -97, -213, 125, 57, -127, -40, 7, -41, 42, -144, 200, -37, -443, 34, -54, 223, -43, 28, -160, 306, 59, -1, -90, -30, -163, 133, -137, 71, 201, -259, 46, -202, 181, 99, -78, 25, -155, -103, 91, 174, 86, -119, -73, -133, -31, 134, -290, -27, 168, 89, 141, -263, -260, 84, -115, 9, -85, -357, -56, 186, -89, -120, -8, -231, -71, 266, -183, -89, -223, 68, -8, 42, -233, 67, -78, -127, 97, -271, 52, 91, 2, -250, 114, 8, 118, 57, 89, 27, -194, 186, -202, -268, 182, 77, 262, -11, 33, 60, -249, -18, -237, 127, -69, -14, -139, -54, -67, 33, 11, -11, -40, -6, 171, -378, -54, 75, 65, -96, 23, -56, 83, 137, -72, 17, 75, 197, -136, -66, -181, -15, 203, 224, 138, -16, 48, -43, 48, -106, 226, -21, -94, -183]
1905a83Q1p6K5J38k59K18k17L19j58j3R6oK16j86K28m66J51Qq6J04J92lk9k44
1929a50K40l2k4PJ29l05N9NJ61j02r3J26N8j99J96Q3q6j6l45L12j39K52l26R3
1953i6J16l23K42J72qk31R2n4O3J36q7J17j20j16J46q4k57L18k5K7K79j61j02
1976D4R8l33J67J02j38L0p3K24j34J2n0l0J44q3J74j50Q2j77j45L09j82O5m2k01
2000b87L00j6N4o1J03j37J12k9Q5k46M3M8Q5j21K40k26M7J01J17m06j34J73K15
2023F0j21N6k32N68m83J98J02k19J72k59J23K15k35j25J66K5K66m19J46l31L90
2044F3m12L80k33J24O2R9l11L11q1J49Rm93M29j59O8k83L75p4l7J03q0l57M56
2067A08Jl72J97K47k91J3j38L02J49l65J50P2j59J91k9%j47j20j02L56j12R9j53
$$ y = [-183, -102, -178, -153, -15, -274, -56, -273, 46, -112, -125, -29, -35, 181, -5, 223, -243, -92, -84, -170, -66, 126, 123, 94, -150, 90, 58, 34, 41, 170, -135, -76, -71, 90, -12, -105, 21, 79, -120, 76, 159, 73, 57, -288, 24, -115, 137, -189, -96, 20, -303, -61, 111, 103, -128, -36, -90, -27, 109, 22, 139, 19, -97, 49, -35, -292, 26, 1, 28, 307, 146, 44, 142, -191, -24, 78, -60, -30, -103, 121, -13, -1, -51, -81, 63, -20, 154, 4, 86, -91, -236, 73, -109, -44, -86, -287, 13, -3, 51, -10, 93, -44, 68, 39, 124, -122, -79, -31, 54, -67, 173, -53, -6, 95, 212, -194, -328, -155, 60, -61, -5, -237, 331, -152, 46, 148, -71, 101, -158, -35, 180, -55, -180, -14, 11, 277, -142, 4, -327, 63, -349, 31, -202, -78, -16, 83, -228, 83, 2, 151, 160, -333, 96, -63, 5, -278, 97, 23, -14, 89, 9, -348, 108, 109, -263, -66, 181, -110, -97, -235, 67, 216, -149, 1, 73, -86, 105, 76, 76, -71, -191, -293, 63, -49, 50, -103]
2090a03J7O9r2J89nl2l8J23k18r3Q9K25k46o7K06J01j12n8QJ79k44J88j02k10
2114b26K54JM8q6j29p0K79k52J4K84k0j66o8L43kp9P7l23J61j24K40%j74J49j03
2139B8n3J38j7k34M37k56q8J3l4K6p8Q9k3J65j08Q5l84M00P2j7q1l9K88m61J64
2164C2j45P9l1RL85m39J00p3Q2r8K59o3l25L39k78L07l8j46j69K47Pm2n3M8m9
2189e5J48j20O7m6O4m6k01K50k26Q7r2J79n2J59k11j40L51k13RP8j77o9K68J45
2213A57j5P9P1j97N9l43J96J04N6J28m28M5J88m0l7K50K9l20R1k02J15m6J6rP2
2238A9M1n3j9j31K83p5k51K09J23k65J06j97L17l7k70L39L1J44l73J74j27K09
2260A97l32q0J55J50L9q4J32l17J76r6J36J0K22n67M29p5j39N8oP4k00J13R3j36
$$ y = [-103, -86, -17, -109, 80, 75, 43, 5, 128, -90, -183, -94, 131, -115, -182, 24, 125, 13, -45, -37, 142, -102, 86, -16, -226, 28, 29, 77, -9, -138, -208, 71, -181, -167, 117, 97, -69, -137, 206, 204, 125, 202, -121, 40, -84, 156, 156, -18, 131, 28, -25, 113, 96, -138, 299, 43, -45, -32, -66, -40, -118, -29, -52, 113, 5, 90, -294, 106, 178, 161, 80, 41, 329, -132, 32, -113, -34, -65, -56, 329, -110, -10, -83, -1, -99, 160, 97, -228, 111, -167, 140, 102, -44, -213, 34, 41, -1, -54, -6, -55, 93, -27, 40, -6, 58, 12, -189, 61, -165, -78, -170, 9, -43, 116, -95, -235, 116, -97, -88, -10, -187, -256, 12, 157, 142, 221, 292, 95, 154, -189, 7, 111, 167, 295, -133, -88, 100, 60, 23, 273, 302, -18, 73, -129, -14, -60, -44, -53, 19, 60, 7, -12, -143, 140, 65, -186, 23, 146, -119, -13, -210, 107, 70, -200, 139, 170, 314, -59, 115, -12, 197, -135, -215, -60, 90, 129, 45, 177, -140, 36, -60, 76, 86, 308, -259, 170, 95, -44, 14, 8, 82, -118, -5, 88, -48]
2284d8j31J01J61J5j50n6K6k7p5J54J17o9j9j51J89J97l10M3j95M45k81K75r1
2307A20k15K27l51K26j4K47j17j20kO6m86N00k72J34j07J87Q7j39K9k6k2O7k80
2330b61J92Q4j38K07o3r7K11Jj21m04M29k96K53kj44J84K38l93M0J23J77k27q1
2353h8J31j56k3O4nn6j84L17m4KO7L20j06m35M38l88J58Q1k8r0J92j50J39o0j69
2378g3n0J29o2m0j33J31J43j21K61m25J26J49j5L4k26J3J89l04J84J38j00M0m1
2401e3l5P5n1M7J04k04j1P7J13j01J94l49J17J23j23O5K55m83K94p0o8J22j18
2424h0L18k79J31j32j23J36J16j83J01J15m9j19L57k86j28O5Q4j33J56Q8l3k77
2446a55J65R3j87J64J21p6o5j85n2L64l24l6lL28j56J0P9J7r4l9L9J9j10%J70
$$ y = [-48, -179, -78, 83, 98, -52, -108, -82, -109, -184, -30, 87, 18, -1, -152, 37, 234, -76, -33, -228, 217, -64, 211, 120, -95, 132, -219, 7, -7, 240, 123, 3, 1, 67, -419, 81, -191, -57, -164, 23, 110, -29, 0, -26, -48, 19, -261, -69, 15, -123, 84, 21, -76, 135, 136, 15, -389, 40, -256, -3, -5, -149, 35, 273, -120, -80, 43, 220, -7, -88, 43, -113, -136, -72, -77, -133, -317, 0, -44, -42, 25, 345, 239, -196, 242, -146, 12, 93, 65, -25, 167, 17, 156, 96, -73, -123, 6, -56, -96, -229, -98, 45, -76, 185, -240, -114, 35, 20, 54, -172, -159, 30, -274, -90, 48, -52, -12, -53, -88, -13, -64, -17, 87, -117, -128, -51, 62, -39, 155, -194, -77, 46, -77, -12, 243, -240, 54, -16, -84, 38, -80, 238, -41, 90, -42, -165, -29, 87, -96, 5, 120, 71, -48, 309, 23, -105, -40, 44, -89, 67, 155, 122, -155, 10, 103, -84, 80, 201, 125, 60, -125, -177, 187, -137, -173, -176, 152, -4, 6, 85, 102, 8, -31, 8, 27, -83, -83, 87]
2471H7j65K27p6n6J8J05j76j57K21l8j2q5K44k44K29j2m2l1r0J52k32J38r9n1
2495a45p6K75kp4j79K47J0JK87k99J22R1k64N4N7k87J25j74J62K6n2L08j87Kn1
2520b3o5rL1M1k00K47J02k09O3J65l86J76k9q9J32R4J3j06O1K59J0l63r5J7j2
2545a75Q6R3k23K97k8q9JJ00qL56n44k27L43m0K02j75j40J72J7j86l1J88%L10
2569B99l43J19q4j88K30J8p4J81j43l83K02nK89k92K75r8Q8J24m61J88Q1M1q9
2592b5n7J15k28L66l18j32K68Q0r9r3k9J42l8M2P3j21j69J74r4K57J7k54P9P1
2616B7m5O9Jk22J28q3K92j20J90l19j4K88k72R4J40j06r2M30m89l7L25j91K42
2639B36j47M6j43L5J15k48L28p9J94m99J41n7L6O9j8J94p5j78Jn7M5J53n1J33
$$ y = [87, -78, 149, 73, 17, 35, 140, -36, -193, 28, -10, -22, -107, 137, -107, 122, 110, 68, 37, -53, 99, -133, 5, -94, -145, -221, 54, 52, -22, -201, 46, 56, 57, 344, 45, 167, 258, -6, 48, 105, -182, -57, -231, -69, -43, -95, 213, 26, 28, -23, -88, -97, -66, -25, -225, 22, 124, -85, -22, 143, -243, -67, -96, -185, -53, 41, 54, -52, 9, 268, 278, -85, -180, -163, -175, -89, 4, -219, 78, 50, -39, -38, 62, 54, 410, -134, -361, -18, -58, 144, -31, -171, 1, 18, -168, -199, -11, -11, 299, -44, 75, -9, -197, 33, 51, -23, 158, 15, -368, -166, -171, 118, -174, 101, 3, 91, 215, -246, -58, 23, 64, -25, -82, 33, -195, 171, -147, -279, -11, 69, -30, -123, -152, -10, -48, -6, 67, -54, -223, -49, -143, 114, 131, -123, -44, 27, -18, 51, 52, -170, -42, -125, 167, 47, 237, -82, -96, 192, -80, 14, 154, 48, -44, 386, -103, -140, 185, -6, 236, 89, 135, -8, 27, 142, -106, 222, 143, 337, -162, -21, -78, -42, 27, 9, 203, 128, -50, -49, -106, -61, 92, 41, 174]
2663A74j96j14J38M0j43J97J4j13J60k89M4L28j11J6m08L76j09k9N6O4k66K58
2685H7L2j83M3k58J49K20m60N32k21r8J00J05j70J18J61j61R9j8k2j53P0M8K35
2708B55K7k97j91J89P8k4K2R6J43m17J17j02K54m4q0K07k44j56L83k02M0q5L0
2731aJ51rk00M7J5l4M47k84M5k64K63j59R5k73M0J09J70j22R3k76J52j53J50o4
2755f2oJ46l04K12p2O4oJ77o8k62J02Q9r7K37l04J17J21R7j97j37K98q9K1P8r9
2780E6O2N9q0p7r0j2j66J87J59J6j08R6O4j7j23R4k2O9j75J41j27n6K22j24J57
2805B05j46K5k99J45L30j93J02K1k52L00k56r1N0l2O9q5K82j52P9j31j05J44j8
2828hj58j03J39J47Q4l75K46r9K15k1j66R6O1j32J70P4J9p4k23rR1j08J26Oj87
$$ y = [174, -22, -136, 2, 42, -101, 96, 110, -3, 157, -132, -88, 240, 129, 145, -263, 113, 4, -25, 31, 95, -171, 87, 119, -64, -21, -279, -130, 90, -370, 162, -59, -157, -57, 48, -122, -4, 157, -4, 95, 77, 55, -98, -28, 20, 255, 282, -15, -206, -17, 61, 37, 59, 155, 298, -119, -2, -104, 150, 106, 26, 233, -11, -167, 216, 14, 54, -31, -1, 150, 141, -59, -12, 3, -31, 416, 132, 177, -87, 176, 17, 112, -161, -121, -12, 158, 36, 129, -147, 5, -148, 2, -62, -68, 78, -226, -14, -86, -22, -28, 149, 81, -181, -79, 10, -87, 150, -154, -37, 84, 181, -16, -153, 145, 56, 77, 155, 56, 118, 177, 97, 20, -70, -82, -248, -61, 98, 114, 6, 102, 166, 149, 26, 120, 98, 167, -8, 133, 6, -50, 172, 48, 205, 59, 84, -215, -70, 260, 67, 169, 190, -62, 238, -18, -109, -59, -91, -22, -107, 175, 23, 102, -29, -134, 10, -8, -166, -269, -130, 17, 101, -274, -28, -127, 88, 67, -99, -3, 58, -74, 96, 170, 189, 115, -108, -117, -26, -134, -8, -2, -189]
2853a89K73m1j74j27L12l13M76l37J76j83J05j99K11q9r1K98j20J06K39n12J96
2874A7Q7O5j77j2K68j07K8l31K13k41K65P1Q8k27k8r1K16j94J10j40j07K19j42
2897a50M0Q6L17M3l78n0J58p8R9krk0j27o1N2P3j03L25l73L56l41o9K93J30k37
2922b6Qq6J02n00N09l3K4j13J61Nk35M63m60L50Qq9k24L18P0j11n9k07R8K54k13
2947A4O0m9R3k86J61M9Pq3J30j96P0l7n0K56o51O75l1q1N6P5m03L12J51l21o7
2972a46K13j48LJ53j41J18r0j3J90k52L14k05M2o4N4j66K90j12j40mR0J55j27
2995A4k0n3K32q9k05J68J6J68l14k7m3K88m6R8l59K29p6J40K7L3r4M6J89l47J3
3020a2LM9l18M03k82L17l66K59j1j79L55r9k97M3j05L92mj57K70j31j39J42j07
$$ y = [-189, 84, 43, -131, -258, 54, -259, 217, -120, 56, -127, -22, -221, -10, -99, -190, 108, -12, 94, 333, -179, 17, 104, 169, -8, -20, 248, 141, 169, -162, 51, -190, 75, 146, 234, 7, -21, -112, 104, -90, 20, -120, -227, -8, -150, -110, -24, 293, 336, -42, -92, 66, -12, 87, 85, 76, 56, -71, -132, -80, -7, -110, 215, -158, 198, -143, -212, 81, 211, -26, -18, -104, -2, -502, 7, -26, -2, -115, 46, 51, -184, 279, -181, 169, 177, 88, -136, 182, 252, 141, 82, -125, -27, 227, 14, 74, 25, 118, -168, -7, 42, 49, -34, 96, -100, -30, -67, -117, 139, -512, 163, 132, 51, 107, 182, -221, 91, 242, -79, -146, 67, -81, -78, 75, -66, 52, -38, -51, 139, -113, 201, -4, 38, -26, 28, -138, 152, 40, -100, -104, -14, 141, 14, -6, -59, 173, 84, -121, 47, 63, 231, -83, -110, -153, 135, 89, 187, -172, 57, -19, 121, 148, 181, 87, 133, 322, -25, -12, -9, 40, -278, 125, -157, 160, -206, 53, 42, -137, 218, 119, -178, -135, -240, 152, 148, -9, 261, 130, -9, 133, 26]
3043B6o8j13K73J2J38k41j89J36J71k19J09J37j27J33m11L05r6p0j08k4LK32j03
3066i4K02k54M6O9K18k90J57J20j27j91K44J78k12j32J22P7p0j51Rj39M16j70
3088B8j87J45o3K57m41M11j68O6j22J16O3J09k25J00O6m98L85q1J78l56L71N4
3110B08j03q4J7l34M45P9m42K87j24K7P3j70J37J12l6j11J75k8l44J41K3j22K46
3133G2j46J72k02j26J86j09K88j29J44j54K09k52R8n3m6M9j43J53j57K4K96k47
3155g3K0Q0L8m7j72L8P0PM08l76j3K20l46J59L5o0K8J7K0l3J33k13O3k56Q0Q8
3181h5K93p4j8k3N4j96o9J45J89k68J18R1k45K69k39M1j06K91k57L35k10J98k91
3204e7j91O19l02k95J57J32j44j8J62l72L62K01k00j58J07O1j6PQ1l1o3Q8N7j21
$$ y = [26, -42, -155, 118, 130, 268, 27, -162, -26, 145, -74, 35, 172, 45, 178, -233, 72, -24, -94, -202, -226, -223, 9, -94, 108, -146, -100, -31, 187, -103, 54, 174, 47, -144, 100, 278, 66, -66, 56, 133, 63, -88, -79, -218, 198, 28, -159, -14, -77, 180, -261, 150, -18, 48, -74, 42, 105, 214, -11, 89, 155, -343, 42, -39, 139, -217, 154, 208, 105, 21, 38, -296, 149, 228, -214, 73, -51, -24, 49, -121, 16, 128, 92, -19, 156, 128, -216, -75, -52, -174, 72, -74, 98, -104, -230, -44, -153, 135, 6, 150, -4, 205, -47, 51, -2, -48, 1, -142, 11, -146, -122, 174, -73, -53, 27, 65, 18, -154, -116, -46, -39, 369, -7, -20, 200, -146, 13, 48, -12, 16, 33, 53, 20, 153, -60, 3, -253, -173, -85, 208, 134, 116, 93, 147, -49, -118, 27, 216, -52, 66, 157, -88, 181, -58, -17, -123, 168, -89, 246, 36, 234, -57, -248, 371, 69, -226, -69, 63, -81, -99, 63, -309, 53, 254, 54, -104, 3, 64, 48, 55, 136, 105, 42, 130, 187, 66]
3228F6R9l07L67k13q3P5K1O6j55N0j0J45j08J1k7j43N8j06P2nJ77M4JK6j66J50
3254A05j48j9q8j13K44j59k23M70k99K15j55K90k90j50J54K87j25l60L96K36k14
3275E4n5Ql4j20J93p0j1R4r2J71p9l55K55J13j09M3j01J33n8K06j90J28m90K22
3299a44P2k7n9np0J41k29J77L84m49Q3L41k42j7J78l35J64p0J44k47J24OJ05J68
3323A93k74K0j6j22O2J62k54K64k38L59m4j34J20k88K21Q7O3m57L40P8n7j07K7
3346Ej7j78K79j12J06J2j68K14m5k7p1n8Q5j79K37kj23K9k4J07m8L9J56k82Q3
3371A8L8N8j56n1J06K3M6k28K75m5j66L8m9m3L58k86j7K6n7R7k55L99j80J90m4
3396I5j53Q0R8j59J23J59k98j2J43o4N3R5k24j20J61K61kl61J95p7r6L9QJ55m
$$ y = [66, 165, -142, 225, 12, -71, 4, 25, 91, -64, -14, -24, 121, 13, 24, -3, -146, -88, -194, -122, -127, 50, 94, 95, 121, -45, 105, -43, -62, -150, -263, -19, -178, -401, 69, -230, -15, -170, 120, -170, -320, -166, 121, -4, -364, 32, 268, 54, -1, 7, -27, -147, 46, -24, -35, 59, -33, 138, 59, -296, -41, 72, -37, 6, -95, 38, -20, 186, -4, 124, -366, -144, -72, -99, -158, -163, -233, -92, -321, -144, 240, -209, -126, 215, -27, -44, 134, -201, -37, -107, 37, -210, -86, -80, 25, 193, -81, -61, -77, -199, -137, 25, -229, 35, -203, 156, 112, -22, 98, -190, 31, 118, 181, -276, 64, 142, 85, -22, 5, -12, -190, 89, -23, 83, 95, -73, 141, 96, 69, -2, -60, 25, -154, 83, 81, -42, -13, -37, 70, 22, 61, 217, -65, 18, 56, 114, -42, -93, 13, 36, 82, -146, 129, 84, -82, -44, -93, -136, 222, -64, -81, -55, -112, -15, -270, 129, -51, 139, 95, -58, 22, 120, -39, 84, 243, -55, -67, 76, 12, 65, 160, -64, -184, -23, 238, 236, -125, 70, -7, -103, -64, -56, 99, 95]
3421I5LJ87j43q3qk76L67j96j57J96q7rj1j23L88j82O2Q8Q4m11J56r6K58l50J33
3446a15J14q0J52J11j23Mj79J21O1%k2J53r2J38j56j30l1J9K17p0n5k56K83l63
3470b99K63J8l3J07N3o3l8j54K02l63J23J66jM6J02k31n4M2K4R6j13J06J49k06
3494e8J18K18l65L33k01m7%J14j21l0J71o3PL0J3j53k37M14k07K03j05k03R2L69
3518B92j72j55M7J27m0p2K0K51k29J76k67r1q6N07j37o7j4k99K2J13K57j89j60
3541a66K16Oj38q5J56q7l8L51l77K52o4rj77K81l04M01l26o7K20o4k45M21l73
3564b16%J83LJ74j96j5k69K74J03Oj56R5O7j42l7L15K2l74L86j55q9K07j45N9
3588A00j58k74L3M52m19J59J31K11k92K28l4k66K80k28j75J64N8J13k60J73K1
$$ y = [95, 98, 285, 142, 59, 51, -225, 142, -54, -211, -15, -102, -111, -122, -245, 143, -39, 23, 111, 195, -216, -60, -156, 102, -248, -115, -1, -81, 71, 182, 59, 63, -116, 5, 66, 66, 44, 197, 105, 243, 87, -43, -74, -55, 162, 92, 37, -219, 64, -299, -36, -18, -51, 56, 109, 46, 8, -146, 56, -307, -184, -18, -19, 27, 129, -102, -156, -114, -90, 6, -107, -1, 148, -58, 60, 278, -87, 246, 45, -2, -2, 112, -9, -39, 132, 69, 76, 106, 119, -34, -271, 143, -64, 139, 34, -169, -77, 292, 120, -35, 12, 139, 99, 27, 47, 298, 69, 245, -22, -113, -199, 308, 171, 104, 90, -209, -187, -74, 183, -6, -166, 50, 56, -82, -167, -11, -98, -136, 215, -162, 90, 26, 17, -160, 121, -183, 218, -108, -175, 45, -19, -264, 157, -216, -216, -33, -30, 144, -52, -67, -336, -62, 41, 47, -109, -14, 53, -89, -126, 189, 211, -163, 223, 68, -21, 186, 41, 100, -58, -332, -299, 153, -266, -107, 24, 235, -57, 171, 137, -129, 151, -77, -252, -88, -30, 83, -177, -4, 17]
3609A7l7Q5k06L06m7l27J3O0K56j85J62J6j99L4j55M20j11J28k07J80k18M1O6
3632I2k13P3m9K01j10rK27Ok88O0j31p1N27l82J42Q0j19k2R7o2j09RL9K92j86
3657I4q3J31k22J96l86J16K66l8k8O1j16pK10k56J05r2O1Q3k14J37Q3j90J59j8
3681E2o4J40j22r9P5k2j84K26k08N31n19L05p0K29k34r6J4k6l6n0M30n41J81l4
3705a22J00K47j31j8j85J06K3j83J2o9L7K64j9m7j59K09J9l4j1J18mj66oR0j49
3730g8J39J9J09K63l77j05L5J7J36j00J9r7J23j72N9j31o9K1J24p8k8K90j68K49
3754B00l81Q0O7n5K47o6N6j37K6o3J16k64K97r1K48j19k54J47j05j22Q2J00J08
3777A17K4l42J26N4L31j80j45m4o5j29J63M3L02m08mJ69qM6n1j22%L48k60R9j47
$$ y = [17, -20, 65, -141, 165, 118, -209, -196, -136, 120, -65, 97, 113, -86, -52, -207, 213, 102, 230, 23, 203, -15, 26, 92, -121, -48, -97, 104, -6, -15, 212, 218, -70, -10, -141, -212, 315, -67, 75, 155, 36, 14, 111, 49, -60, -51, -12, 280, 94, 11, 142, -80, 116, -270, -154, 112, 74, 46, 107, -9, -16, 194, -62, 43, -49, 12, 95, -119, 18, 101, -89, 70, 52, -12, 128, 6, -93, -18, -40, -224, 2, -206, 325, -194, 111, 41, 270, 36, -60, -46, -72, -108, -158, 272, -269, -88, -122, -22, 225, 94, 76, -109, -3, 20, -163, -151, -220, -183, 81, 62, 15, -144, 65, 84, 50, 39, 157, 153, -13, -19, 71, -78, 61, 80, 189, 452, 75, -30, 5, 22, 158, 58, 77, -20, 103, -69, -10, -141, -210, -189, -65, -143, -171, 119, -49, 200, -181, -101, -34, -89, 158, 92, 148, 11, 37, -26, 90, -174, 123, 32, 280, 161, -93, 54, -51, -173, -91, 9, 117, 141, -201, -75, -21, 310, 130, -15, -59, -124, -253, -90, -47, 255, -153, -157, 12, 4, 50, -1, -123, -123, 225, -35, 64, -83]
3802h3l9J4Q3j02P2L7Q1J00k30k74K32j06J31L68l59m5O4L5J65q3J16k42QJ50
3826I3k4M8k64P9J20n2K1k02K65j78j0L16l8K4k24K54n1k26o8J07No7L2j73p1
3851b84M83j3%m09M25j37KR2l44K49j39l8L4nm7J49K5J50k05P1J89j23j03j03
3875h1k10L05k29J9L52j35M9o3j19l5M6J84L8j04j75J17J35k71J58k19L04J6k51
3898a69r0M21J58l40L7K3j58k08J03J09O6J05j28J49J9r7J57j97J31j33L01m88
3920b29J41J95k60L23j63o1N6k54L71j50j68K43P5k17J82k00Q0K8p5K17m51L38
3942B1K05j88j04J05j4N2k10%K68p7j79J78j2O5j03RlJ18j02K00n29J80J92o0
3966A2K57o5j11K27k93P4j88K81k35J2j28J43K05j36K3K8k84J51J24p8O1k60K27
$$ y = [-83, -122, -108, -25, -127, -55, -18, 63, 163, -67, -341, -109, -215, -84, 284, -75, -120, -56, -21, 144, 61, 177, -65, -57, 93, 69, 117, -147, -68, 52, 0, 21, -181, 84, -94, -104, 212, 174, 198, -26, 228, 177, -49, -117, -10, -5, -72, -40, -213, -284, 199, 186, 186, -223, 202, 65, 67, 159, -185, 64, -75, -113, -79, -84, -131, 18, 43, 193, -12, 59, 248, 125, 22, -81, -291, 14, -215, -196, 156, 21, 70, 7, -112, -147, -101, 83, 121, 17, -158, -41, 94, -177, -19, -238, 66, 82, -169, -259, 162, 320, -20, 17, 40, -118, -326, -223, -114, -48, 57, -71, 78, 97, 0, 157, -40, 91, -42, 259, -229, -88, 107, -153, 170, 7, -54, 2, -252, 119, -31, -199, 44, 119, -98, 84, -116, -36, -8, -83, 134, -317, 21, 226, 38, -66, 39, 25, 77, -133, -133, 135, 58, -121, 57, 45, 110, 7, 16, 13, 131, 29, 229, -300, -120, 72, 12, 269, 204, 93, 320, 27, 101, -87, 194, -41, -29, -157, -14, 191, 55, 78, 106, -178, -27, 97, 19, 80, -180, 47]
3989D7j27P4j07K35l9j42OJ1K3l97M71j26k9K23q5m5K57K5m11K50N6j09J04m54
4013b89K19J11r8j41K19J82k47j59L67q7KR8pj80m8M7J44k75R6P8j78J45N9j92
4037a34Q8k1K80j88j68N0K29N8j50k50K88J02r2j9k68L57k79M37m66K18O2l93
4059b59K72N1k73N5K44pj61K13k60L35k54j79K38k03N4K25J04k19J41j50J19k53
4081a67m5J18p6K2K40l27K82J37k97j4K34k16K03Q5j43Mj31J84o4j44J42oR8o4
4105E5p7J4N2J13n12L07P9L5J9j82K16k04J47p2p4K90j76Jk22L80L9ql17RM8m
4131d4J05M1p8k37L85k27J25q3K35o7k03K13o7k8P4l21Q4Q3K18k68J50k75K34
4154D9j77J60J65l40K13J43j51n0k04L13R7k43k66K66J71j27lJ5P2k80O7l9K58
$$ y = [47, -80, -6, -113, 122, 83, -59, -53, -42, -19, -416, 55, -71, -100, 123, 38, -7, 250, 275, -136, 114, 170, 61, 165, -289, -70, 41, -57, -198, 21, 203, -44, -203, 164, 77, 79, 177, 170, -10, -58, -11, 133, -142, -46, 32, -146, -1, 58, -134, -46, -67, 213, 25, -143, -93, 136, 194, 44, -206, 82, 184, 92, 73, -195, 162, -117, 320, -146, 72, 134, -259, 13, 64, -209, -154, 90, 83, -78, 135, -125, 210, -44, -223, 15, -188, -134, 91, 195, -24, 117, -33, 86, -167, -212, -94, -170, -148, 92, -235, 47, 184, -113, -127, 107, -109, 94, 179, 36, 40, -91, 93, 29, -115, 27, 21, 119, 55, -22, -8, 44, 157, -355, -48, 31, 66, 85, -97, 119, -85, 62, -10, -84, 206, 30, 31, -191, 189, 228, 220, -97, -88, -40, -44, 61, 102, 24, -213, 172, -55, 70, -13, 222, 155, -48, 165, 98, 70, 144, -177, -93, -10, 208, -60, 90, -185, 49, -128, 32, 197, -143, 70, 213, 62, 12, -192, 121, 218, -25, -291, -25, 146, 19, 16, 31, 103, -177, -110, -149, 109]
4177A09nj42j1R5j38J35m5j65R8L7L48l80R9o2J14R6j92k1jj61Q5L7J49p8p5K0
4203e4K48q2j75K35k6k07r3J6J47L1m6j72L38K0k47J43k53P5K33j16J45j01j43
4226h4K16q6J01q6K42k99j9K05j92j09J82j35K26k45j35N9L27M2k9m34K76Rk39
4249b07J70J44M1j49J7j58K86j65J00mK3j72j61L46j17N0O6o4j8k23P9N2n9J88
4273F5j43Q3k0m4K02j5J26M6j41k74J89k49K43q5L5K77l83j26K36L4o5P0Q7l5
4297A13k32Q4J96k32Q9J56l71j2K83Mk30j41K14L2q4J24o9M6J82k59K31r2o7l
4321c8L0j3J54j5K7l81J35P0j03R2K2l04J93K53k58J72l91L14R9k52K36p5RK38
4345B14O8l44K4j01J42j92K68n0q3n1j7J38p5J45K2j79Q8J54j01k2l4l0k62J81
$$ y = [109, 104, -38, -49, 46, -92, 43, -2, -167, -69, -32, 316, -64, 35, -27, 87, 183, -9, -30, -31, -192, -107, -70, 79, 1, -74, -54, 194, 112, -63, 172, 146, -61, -154, -138, 9, 40, -6, -178, 160, 180, -67, 76, -177, -102, 131, 15, 160, 59, -84, 132, 46, 147, 61, 303, 4, -15, 190, -2, -111, 71, -64, 162, -83, -218, -159, 168, 210, 181, -253, 23, 32, -207, -37, 107, 148, -1, 16, -142, 144, -21, 79, 75, 98, -74, -235, 111, -6, 44, 110, 46, 28, -195, -116, -64, -123, 65, -78, 5, -15, -59, 143, 128, 254, 300, 159, -115, 74, -175, 68, -17, 18, 295, -88, -214, 22, 56, -9, 61, 148, 113, -119, -35, 161, -71, 18, 174, -197, -209, 74, 78, -152, -293, -79, -47, -131, -7, -76, -30, 152, -107, 124, 32, -35, -38, -8, -21, 133, 118, 145, -236, -101, -31, -134, -42, -20, -324, -131, 122, -136, 36, -355, -41, 58, -194, 42, -33, -24, 214, 282, -62, -38, -139, 3, -189, 79, 29, -54, -105, -122, 16, -59, 86, 108, -71, 17, 171, 70, 48, 14, -16, -278, -97]
4369i7J9K84m00J94k4j27K04k00J27O7p2J2J09k04J74k04M97l44O2q7j6j2j45
4392a83J73Pr8Q0j53K16j29M26j68j96N3K6K57l32k1p2L42l25N8m3K79n5k00K51
4416A93j26k18K21j71L65k37j66L81k30j27J64k32L73j61m2K14j04k06M76n34
4436a67J27K23o6j20K40j66L10j65l34K33n8J12r8j52M3m2n4K94k09J25j93J27
4458A0N0L7k74j29M52l57L05j69J83k10K48k27P9p2J16j54J7K94J07l36K5j91
4480a96R8J97j41L5J41j90J01J12l98L33Rk15N9n8L00k21k5N7J04l58N33m81K
4503b02K47j48K04k19J56K7n9j06K43m13L12rP2m20L11nj53J64n8K8k9rK5j01
4527a42k8MK4J87J33j08L2l28J97k9k4K6K97j51j40J05j0J06k92J77m9j44o0J58
$$ y = [-97, -78, 206, -194, 0, -24, -151, 53, -147, -20, 47, -25, -13, 96, -108, 66, -138, 359, 15, 77, -10, -26, -38, -183, -10, -3, -101, -21, -174, 42, -87, 339, 171, -25, 28, 54, 311, -21, -42, -114, 228, -97, -39, -82, 197, 142, -58, 193, 67, -151, 70, -101, 264, 27, -139, 242, 12, -115, 49, -183, 190, 29, -13, 201, 97, -109, 367, -167, -40, 183, 117, -3, 237, 71, 381, 216, -118, 115, 57, 169, 71, -81, -38, -80, -134, 160, -49, 76, -117, 10, 60, 97, -177, -306, 146, -211, 94, -75, 108, -102, 146, -81, -2, -74, 42, -112, -95, 199, 306, -30, -5, -196, -98, 99, -42, -7, 134, -56, 45, 157, -241, 92, 101, -114, -55, -113, 187, -34, -59, -2, 102, -256, 277, -204, -202, 45, -103, 101, -118, 38, 65, 6, -100, 143, -270, 42, 33, 105, -315, -4, -9, -162, 2, -56, -28, -57, -66, -41, -142, -170, -166, -142, 45, 178, 70, 102, -226, -29, -58, -82, -56, 241, 90, -50, 55, 45, 151, -141, 36, -13, -157, -217, -59]
4551e9m3j12L80m39N78m83L8J43mo0l4j49J11l1K4J27M6k14r6J47J23j14J06k10
4575b25J75N7n0J68j39r3K6K65m17N09n76N7M18R4j19K22l83j50K63lk40J74m0
4598gk3K14l53J33L9O7j61K01j37PJ48J46k47O3j61r1k5K67j06K13l83L34p3q9
4622b4n4J04Q1l50L69Qj05P5R0k34K02m57M96m03J14M02m88J14K41j51J61j80
4644A1k9J32n4k33M68j55m28K37O2K6k4k01M12j48k33K93l3k02nJ24k25J73k54
4667b86M8N09k45M7k93J79o2K01K4J14k92Q3Q0J54j48k44j0J4l4M2J83N6o2l83
4691c25L21j63M72k24J01n1M6k11p0n3J8K52k04j0P0K08j78J72k84L1ln6l5K68
4715I2k42L11L1l53M23j69o4k55J34K93Qj77j00J97L1l18L30k1k67K8J23j77O2
$$ y = [-59, -102, -214, 166, -273, 305, -178, -140, 3, -1, -61, -95, -244, -133, -164, -140, -13, 33, -181, -277, -130, -7, -121, -15, -225, -50, 7, -43, 125, -14, -107, -81, 184, -233, 276, -300, -243, 175, 269, 150, 372, -11, -161, 102, 99, -141, 33, -7, -30, 184, -169, -36, 3, 70, -91, 110, -27, -20, 128, 274, 27, 90, -71, -162, -187, 80, -26, 187, -196, 138, 65, -24, -78, 26, 107, -243, 126, 134, 29, 104, 194, -40, 162, -295, 201, -202, -88, 314, -174, -60, 181, 30, 191, 11, -18, 114, 60, -173, 295, 140, -288, -51, 11, 37, 13, -188, 224, 76, -157, 136, 103, -99, -104, 20, -205, -32, -286, -238, 271, 26, 73, -220, -41, -103, 98, 122, 236, -56, 27, 107, 261, 113, -131, -141, -127, -161, -119, 64, 120, 58, -325, -4, -167, 305, 81, 182, 131, 177, -34, -104, -157, -139, 113, -91, -101, -31, 177, -1, 171, -113, -82, -85, -141, -176, 92, -150, 161, 192, -161, 262, 93, 29, -226, -92, 201, 209, 32, -68, 129, 160, -158, 172, 151, -116, -88, 35, -142, -80]
4738h0j37R9Q0K81m28L7J06m8J26r4n5J52j91M14j1j14q8k28K36J0n5K72k74j28
4762a18K19o6l2j30K47j28K0P5l6R4J62j95j14K22J75l88J02j18J54Q2l07K95
4784B15j76J53p2k5q0k1N8J5k6k48J62L6R6r4K60j53n3k15J92J98k85k27J72m
4808a22J21R2R5J5k27J22j00O9J20l66PK40P1L7l58K29N2K9k93M52n52N71m61
4831a57Q4J20J0J06j9o2j09L57l99P7J2J33k83R6j0Q2J52j79p4K16k59J05O6k16
4855a51M34k33q3j6J61k84p8L29J1K62k59K33m24Q7j3P3m7R3n0m2R2j10J17k50
4879a48J64k40L56k18m7L34j57L2k9n8j05j37K76J25j73O1P6k2l21L60n6p3k30
4902b30N41l13L48k61k50J58l5R3j4J94k38j3j41J52k10J61j4p2J16O3J9j6j77
$$ y = [-80, -217, -118, -38, 243, -185, -148, -42, -90, 36, -58, -113, 39, -152, 262, 251, 137, 49, -179, 57, 67, 12, 284, 10, -118, 101, 35, 3, -127, 120, -8, 12, 87, 51, 145, 307, 112, -2, 220, 395, 7, 109, -9, 145, 227, -80, 215, 39, 192, 120, 95, 15, -6, 52, 67, 41, -207, -45, -9, 87, -7, 253, 100, 47, -168, 24, 222, -63, -290, -118, -122, -1, 91, 186, 201, -26, 96, -4, 65, 185, -181, -174, 66, 137, 174, -184, 45, 97, 126, -167, 285, -267, 304, -157, -73, 47, 57, 163, 144, 82, -27, 330, -69, 8, 20, 153, -130, -34, -44, 38, 190, 11, -63, 153, -106, -1, 65, -151, 283, 50, -33, -49, 112, -172, -250, 79, 90, 352, 93, 326, -98, -11, -24, 49, 2, 95, 45, 3, 95, -15, 102, -148, 16, -224, 132, -86, -133, 201, 44, 76, 47, -11, -116, -253, 23, 148, -25, 36, 112, 90, -231, 129, 73, 0, -230, 311, -2, 346, 85, -165, -7, -42, 51, 37, 231, -7, -20, -161, -9, -219, -58, -72, -144, -28, 35, 54, 38, -139]
4925a39K00j58J6J51Q9n2l32m6M44j79K2L9k37K30j29J55j66j2J60Q2j18j16J28
4948C2j5L4k55Q9L35j88j06jn3m2K2K40l8j17J25k08K37J45k06j80q4M17q3l3
$$ y = [-139, 61, -97, -81, 70, 159, 107, -225, -271, 173, -6, 16, 55, -182, 48, -81, 74, -92, -104, 56, 138, 20, -96, 32, 17, 51, -204, -115, 220, 32, -74, -75, -128, -170, -148, 92, 54, -63, 62, -146, 91, 236, 30, -150, -234, 183, 100, 67]
$$ [...]
8191a72
##END NTUPLES=NMR FID
##END=
