##TITLE=1H_Pr DMSO-O
 CCl4
 8 sc, 
 7.06.2022
##JCAMPDX= 6.0         $$ Bruker NMR JCAMP-DX V2.0
##DATA TYPE= NMR FID
##DATA CLASS= NTUPLES
##ORIGIN= UXNMR, Bruker Analytische Messtechnik GmbH
##OWNER= root
$$ XWIN-NMR		Version 3.5
$$ Tue Jun  7 15:53:02 2022 Russian Standard Time (UT+4h)  she@DPX200
##.OBSERVE FREQUENCY= 200.131
##.OBSERVE NUCLEUS= ^1H
##.DELAY= (6, 6)
##.ACQUISITION MODE= SIMULTANEOUS
##.ACQUISITION SCHEME= undefined
##.AVERAGES= 8
##.DIGITISER RES= 18
##SPECTROMETER/DATA SYSTEM= spect
##.PULSE SEQUENCE= zg30
##.SOLVENT NAME= DMSO
##.SHIFT REFERENCE= (INTERNAL, DMSO, 0, 15.7039)
##AUDIT TRAIL= $$ (NUMBER, WHEN, WHO, WHERE, WHAT)
$$ ##TITLE= Audit trail, XWIN-NMR		Version 3.5
$$ ##JCAMPDX= 5.01
$$ ##ORIGIN= Bruker BioSpin GmbH
$$ ##OWNER= she
$$ F:/spectra/data/she/nmr/H-F/1/audita.txt
$$ ##AUDIT TRAIL=  $$ (NUMBER, WHEN, WHO, WHERE, WHAT)
(   1,<2022-06-07 15:50:13.00 +0400>,<she>,<DPX200>,
      <created by zg, POWCHK disabled, PULCHK disabled
       configuration hash MD5:
       00 E9 B6 7A A2 85 ED C7 34 08 36 98 17 FE 4E 26
       data hash MD5: 16K
       17 45 5B A0 E7 0F 01 9B F7 71 15 35 58 61 C3 DC>)
$$ ##END=
$$ 
$$ hash MD5
$$ 9A 12 BA 50 30 9A D1 49 9C D8 51 0E C8 2D 9F 39
##$RELAX= 
##$RELAX= 
##$RELAX= 
##$RELAX= 
##$RELAX= 
##$RELAX= 
$$ Bruker specific parameters
$$ --------------------------
##$DU= <F:/spectra>
##$EXPNO= 1
##$NAME= <H-F>
##$PROCNO= 1
##$TYPE= <nmr>
##$USER= <she>
##$AMP= (0..31)
100 100 100 100 100 100 100 100 100 100 100 100 100 100 100 100 100 100 
100 100 100 100 100 100 100 100 100 100 100 100 100 100 
##$AQSEQ= 0
##$AQ_mod= 1
##$AUNM= <au_zg>
##$AUTOPOS= <>
##$BF1= 200.13
##$BF2= 200.13
##$BF3= 200.13
##$BF4= 200.13
##$BF5= 200.13
##$BF6= 200.13
##$BF7= 200.13
##$BF8= 200.13
##$BYTORDA= 1
##$CFDGTYP= 0
##$CFRGTYP= 5
##$CHEMSTR= <none>
##$CNST= (0..31)
1 1 145 1 1 1 1 1 1 1 1 1 1 1 1 1 1 1 1 1 1 1 1 1 1 1 1 1 1 1 1 1 
##$CPDPRG= <>
##$CPDPRG1= <>
##$CPDPRG2= <>
##$CPDPRG3= <>
##$CPDPRG4= <mlev>
##$CPDPRG5= <mlev>
##$CPDPRG6= <mlev>
##$CPDPRG7= <mlev>
##$CPDPRG8= <mlev>
##$CPDPRGB= <>
##$CPDPRGT= <>
##$D= (0..31)
0 1.2 0 0 0 0 0 0 0 0.06 0 0.03 0 0 0 0 0.0002 0 0 0 0 0 0 0 0 0 0 0 0 
0 0 0 
##$DATE= 1654602612
##$DBL= (0..7)
120 120 120 120 120 120 120 120 
##$DBP= (0..7)
150 150 150 150 150 150 150 150 
##$DBP07= 0
##$DBPNAM0= <>
##$DBPNAM1= <>
##$DBPNAM2= <>
##$DBPNAM3= <>
##$DBPNAM4= <>
##$DBPNAM5= <>
##$DBPNAM6= <>
##$DBPNAM7= <>
##$DBPOAL= (0..7)
0.5 0.5 0.5 0.5 0.5 0.5 0.5 0.5 
##$DBPOFFS= (0..7)
0 0 0 0 0 0 0 0 
##$DE= 6
##$DECBNUC= <off>
##$DECIM= 32
##$DECNUC= <off>
##$DECSTAT= 4
##$DIGMOD= 1
##$DIGTYP= 9
##$DL= (0..7)
0 120 120 120 120 120 120 120 
##$DP= (0..7)
150 150 150 150 150 150 150 150 
##$DP07= 0
##$DPNAME0= <>
##$DPNAME1= <>
##$DPNAME2= <>
##$DPNAME3= <>
##$DPNAME4= <>
##$DPNAME5= <>
##$DPNAME6= <>
##$DPNAME7= <>
##$DPOAL= (0..7)
0.5 0.5 0.5 0.5 0.5 0.5 0.5 0.5 
##$DPOFFS= (0..7)
0 0 0 0 0 0 0 0 
##$DQDMODE= 0
##$DR= 18
##$DS= 0
##$DSLIST= <SSSSSSSSSSSSSSS>
$$ [...]
##$SUBNAM2= <"">
##$SUBNAM3= <"">
##$SUBNAM4= <"">
##$SUBNAM5= <"">
##$SUBNAM6= <"">
##$SUBNAM7= <"">
##$SUBNAM8= <"">
##$SUBNAM9= <"">
##$SW= 18.0517599122864
##$SWIBOX= (0..15)
0 0 2 0 0 0 0 0 0 0 0 0 0 0 0 0 
##$SW_h= 3612.71676300578
##$TD= 16384
##$TD0= 1
##$TE= 0
##$TE2= 300
##$TE3= 300
##$TEG= 300
##$TL= (0..7)
0 120 120 120 120 120 120 120 
##$TP= (0..7)
150 150 150 150 150 150 150 150 
##$TP07= 0
##$TPNAME0= <>
##$TPNAME1= <>
##$TPNAME2= <>
##$TPNAME3= <>
##$TPNAME4= <>
##$TPNAME5= <>
##$TPNAME6= <>
##$TPNAME7= <>
##$TPOAL= (0..7)
0.5 0.5 0.5 0.5 0.5 0.5 0.5 0.5 
##$TPOFFS= (0..7)
0 0 0 0 0 0 0 0 
##$TUNHIN= 0
##$TUNHOUT= 0
##$TUNXOUT= 0
##$USERA1= <user>
##$USERA2= <user>
##$USERA3= <user>
##$USERA4= <user>
##$USERA5= <user>
##$V9= 5
##$VALIST= <valist>
##$VCLIST= <CCCCCCCCCCCCCCC>
##$VD= 0
##$VDLIST= <DDDDDDDDDDDDDDD>
##$VPLIST= <PPPPPPPPPPPPPPP>
##$VTLIST= <TTTTTTTTTTTTTTT>
##$WBST= 1024
##$WBSW= 4
##$XGAIN= (0..3)
0 0 0 0 
##$XL= 0
##$YL= 0
##$YMAX_a= 518467
##$YMIN_a= -537457
##$ZGOPTNS= <>
##$ZL1= 120
##$ZL2= 120
##$ZL3= 120
##$ZL4= 120
##$ABSF1= 10
##$ABSF2= 0
##$ABSG= 5
##$ABSL= 3
##$ALPHA= 0
##$AQORDER= 0
##$ASSFAC= 0
##$ASSFACI= 0
##$ASSFACX= 0
##$ASSWID= 0
##$AUNMP= <proc_1d>
##$AZFE= 0.1
##$AZFW= 0.1
##$BCFW= 1
##$BC_mod= 2
##$BYTORDP= 1
##$COROFFS= 0
##$CY= 11.3945322036743
##$DATMOD= 1
##$DC= 2
##$DFILT= <>
##$DTYPP= 0
##$F1P= 2.36226072786647
##$F2P= -0.459571619588291
##$FCOR= 0.5
##$FTSIZE= 0
##$FT_mod= 4
##$GAMMA= 1
##$GB= 0.15
##$INTBC= 1
##$INTSCL= 1
##$ISEN= 128
##$LB= 0.24
##$LEV0= 0
##$LPBIN= 0
##$MAXI= 10000
##$MC2= 0
##$MEAN= 0
##$ME_mod= 0
##$MI= 1.114404
##$NCOEF= 0
##$NC_proc= 0
##$NLEV= 6
##$NOISF1= 3.799351
##$NOISF2= 2.8
##$NSP= 1
##$NTH_PI= 0
##$NZP= 0
##$OFFSET= 15.70392
##$PC= 1
##$PHC0= -18029.86
##$PHC1= 9.00074
##$PH_mod= 1
##$PKNL= yes
##$PPARMOD= 0
##$PSCAL= 0
##$PSIGN= 0
##$REVERSE= no
##$SF= 200.130013532006
##$SI= 16384
##$SIGF1= 3
##$SIGF2= 2
##$SINO= 400
##$SIOLD= 16384
##$SREGLST= <1H.CDCl3>
##$SSB= 0
##$STSI= 0
##$STSR= 0
##$SW_p= 3612.71676300578
##$SYMM= 0
##$S_DEV= 0
##$TDeff= 0
##$TDoff= 0
##$TI= <>
##$TILT= no
##$TM1= 0
##$TM2= 0
##$TOPLEV= 0
##$USERP1= <user>
##$USERP2= <user>
##$USERP3= <user>
##$USERP4= <user>
##$USERP5= <user>
##$WDW= 1
##$XDIM= 8192
##$YMAX_p= 0
##$YMIN_p= 0
$$ End of Bruker specific parameters
$$ ---------------------------------
##NTUPLES= NMR FID
##VAR_NAME=  TIME,          FID/REAL,        FID/IMAG
##SYMBOL=    X,             R,               I
##VAR_TYPE=  INDEPENDENT,   DEPENDENT,       DEPENDENT
##VAR_FORM=  AFFN,          ASDF,            ASDF
##VAR_DIM=   8192,          8192,            8192
##UNITS=     SECONDS,       ARBITRARY UNITS, ARBITRARY UNITS
##FACTOR=    0.0002768,     1,               1
##FIRST=     0,             0,               0
##LAST=      2.2672688,     0,               0
##MIN=       0,             -537457,         0
##MAX=       2.2672688,     518467,          0
$$ Real data points
##PAGE= N=1
##DATA TABLE= (X++(R..R)), XYDATA
$$ [...]
3330h758J2980L929j3993J82J0168K336j2117k064J5005k551j2037K492J0343
3343E915k08j3881M359J2685o975q636L723J0875n349j2160R600P983p836p528
3357g433O140J0803j0721p865J2016L850q148o840J0808O325j3951j496J0793
3370D281J910r588m338J3813J99j3005K579R386L16j2085R80J3705n589r382M062
3385b756R323k646j2789P262J0035q398o929N479R639p673r671J1347M839q159
3399a097n964Q003P834j1996m268J1676J791q483m971J1644L152j3360R14R872
3413D747O17j0541j056J3438k843j1286L917Q678j639j1598M275J1862p636p422
3427f487M973Q475m873j0876R495O938q802n389O425Q142r401o674J1463K609
$$ y = [-8758, 4222, 8151, -5842, -5660, 4508, 6844, -5273, -7337, 7668, 5117, -6920, -4428, 5915, 5707, -8174, -3815, 8870, 1895, -6741, -3018, 7857, 2508, -9652, -52, 7931, 95, -7433, -1293, 9510, -1211, -9076, 2940, 6790, -1358, -8198, 2610, 8935, -5016, -6512, 4281, 6191, -3397, -7735, 6078, 6277, -6728, -4149, 5237, 5553, -6532, -5552, 8153, 2564, -6818, -2756, 6567, 3921, -8868, -1606, 8429, 31, -6898, -1419, 8220, 547, -9124, 2223, 7062, -1097, -7061, 942, 8776, -3220, -7488, 4188, 5979, -2504, -7475, 4169, 7321, -6039, -5125, 4747, 5364, -5177, -6233, 7205, 4362, -6924, -3007, 5671, 4032, -7566, -3291, 8571, 935, -6487, -1514, 6961, 2088, -8788, 707, 7645, -1157, -6546, -121, 8021, -1380, -8054, 3409, 6018]
3441F018q180m611R533M878j2688p50J0741N1q728k766J2198k52j2067L456Q518
3456E351j122r881J189J2369n922q822N109P650l161j0763O806R405q988n613
3470f393O194P280p000q303J0442M577r100l683P164O223j0889l332J1238K19
3484D637p812k488R589K363j2213J696R617j533q345m76J1836l406j0458M925
3498b068P346k298r800M279J0480p646o599O016O345m851r117Q717O297r115l738
3513e752O955N492q372n660J1036J535q461k110Q054L885j1268o15J0347j338
3527C728p779r60J0204l51j1456M167P872k557q362K142J0276n355q427O424O009
3542E575l768q740O303Q355r019m657O368N744o707o799R722L833r199j992O890
$$ y = [6018, -2162, -6773, 2760, 7638, -5050, -5800, 4941, 4992, -3736, -6502, 5696, 5444, -6623, -3167, 5351, 4229, -5652, -4463, 7906, 1984, -6838, -1729, 5921, 2760, -8003, -1197, 8208, -780, -6393, -199, 7081, 81, -8222, 2220, 6797, -2303, -5986, 1178, 7401, -3488, -6820, 4418, 4637, -3175, -5663, 3926, 6289, -5924, -4228, 5389, 3856, -4489, -4965, 6871, 3465, -6993, -2068, 5278, 2980, -6820, -2541, 7939, 293, -6306, -290, 6055, 1204, -7913, 804, 7101, -2014, -5752, 1203, 6695, -1677, -7337, 3699, 5234, -3227, -5337, 2717, 6602, -4666, -5281, 5066, 3728, -4051, -5011, 5193, 4842, -6614, -2447, 5425, 2868, -5494, -3352, 6924, 1569, -6858, -434, 5575, 1807, -6933, -630, 7725, -1294, -5951, 417, 6161, -546, -7345, 2377, 6210, -2989, -4981, 1909]
3557A909M343r596k726J0924n53q088p49Q219J806j1063K085R084l060o971M72
3572c964R858l212r592N781O341l453p685M151Q943p423n829O697M932n189o972
3587f616P575N987r355k845O831M107p479m796J0444J096q575n75P167K725j0240
3602d549J12R837k493p186O04Q596j256r890M267P324l624o759K616Q789n257
3617A131p637O881N070m773o326N517P005q301l991P088L341o016n466Q969L058
3632E550r014n98O655K327q302k061J0283j325p715O48P260Q10j0101K838P967
3647E222l485o194J924P859l136q723O230N631m440n954L552Q042p102n399P345
3662A372L409n216n061O985M421q823j482O570K331o689l273R129L73q128N89
$$ y = [1909, 6252, -3344, -6070, 4854, 4301, -3787, -4536, 3683, 5489, -5574, -3489, 5595, 2535, -4436, -3964, 5894, 2682, -6910, -1129, 5212, 1759, -5926, -1775, 7168, -255, -6084, 613, 5545, 356, -6616, 959, 6946, -2409, -5254, 1577, 5684, -1795, -6591, 3853, 4949, -3626, -4201, 2966, 5691, -4549, -4437, 5400, 2907, -4279, -3675, 4921, 3665, -6225, -1958, 5366, 1742, -5017, -2401, 6388, 1131, -6506, 375, 5445, 672, -5654, -137, 6868, -1433, -5424, 1664, 5005, -1011, -6477, 2492, 5550, -3464, -4062, 2593, 4920, -3382, -5443, 4840, 3515, -4200, -3552, 3708, 4518, -5583, -2745, 5222, 1737, -4457, -2533, 5326, 2190, -6533, -303, 5328, 888, -5066, -1514, 6528, -574, -5973, 1372, 4781, -435, -5496, 1489, 5910, -2913, -4395, 2175, 4506, -2183, -5456, 3673, 4046, -4082, -3493]
3677c493O511J094q363L40Q782k537o781J999O746j170q853M172P041m867m986
3692d365L006O782m738o813O861L986n172m214M847N868p821l344P226J994n711
3707a608l617P593K427q408J73O278R25o963j150Q895j778o972J953N900k09q420
3723d981K498Q017m468n337K752O346l082p588N772N327n642l859L662O178o416
3738h21m655P246K340n269l309O035L745q448o83O488P87n753k029Q073k12p736
3754d201J711N834k71p008P90Q274l612n795K829N485j868p263M119O297n459
3769a38m019L694N170m362n932O931K920n160l160M689M745p720k056P128Q33
3784C563n308k472O686J866q265Q22O331q6o083l98P500j622p119L041M916j117
$$ y = [-3493, 3018, 4112, -4251, -3911, 4871, 2334, -4447, -2448, 4298, 3128, -5725, -1553, 5488, 621, -4365, -1359, 5423, 685, -6128, 733, 4719, -453, -4667, 180, 6048, -1773, -5117, 2109, 4103, -1608, -5225, 2368, 4795, -3613, -3440, 2838, 3763, -3200, -4350, 4545, 2767, -4205, -2252, 3648, 3439, -4981, -2483, 5534, 1066, -4271, -1519, 4827, 1745, -5843, -71, 5256, -386, -4245, -583, 5595, -821, -5476, 1770, 4110, -1159, -4468, 1567, 5312, -3136, -3819, 2669, 3456, -2297, -4326, 3747, 3535, -4201, -2490, 3344, 3073, -3935, -3145, 5129, 1517, -4278, -1449, 4036, 2168, -5095, -976, 5321, -138, -4157, -463, 4707, 345, -5587, 1344, 4264, -896, -4056, 633, 5378, -2342, -4398, 2730, 3563, -1745, -4217, 2469, 4335, -3930, -3108, 3223, 3137, -2946, -3344, 4156, 2534, -4585, -1544, 3372, 2255]
3800B255o751K456P161m666m566L453M728k919o507N734M278n743k912M090M709
3815D800n683m015O962J649n415j865N292L041p830n34O702m57m854j296O774
3830C271K6p586K403N225j196n607R55P324l759n147L389M242k096o180M314N071
3846D649n185l225M017L575l872m855O499K420n484j953M404L201o165k113O856
3861B769Q4m989j248N986R29p302J579N269j329m782M07O603j782o581L522M355
3877C490j987n344K520N994m639l933L784L443l065m564N047L581n528k041M063
3892H21L078n295k884O650P51n200q04M610J868o345l71O422j221m626j31N809
3908C132l79o801K789M639j932m712J540N847l190m825L554L818k887m835L905
$$ y = [2255, -4496, -2040, 5121, 455, -4111, -658, 4070, 1151, -5356, 378, 4656, -1087, -3999, 91, 4800, -883, -4898, 2064, 3713, -1702, -3567, 1725, 4766, -3064, -3598, 3104, 2647, -2207, -3503, 3271, 3297, -4289, -1886, 3339, 2143, -3464, -2509, 4815, 1056, -4091, -702, 3540, 1444, -4736, -422, 4649, -536, -3761, 256, 3831, -41, -4896, 1603, 4023, -1461, -3414, 990, 4191, -1974, -4087, 2769, 2853, -2136, -3384, 2602, 3531, -3771, -2192, 3077, 1748, -3034, -2627, 3976, 2194, -4387, -865, 3490, 1503, -3841, -1321, 4673, 34, -3899, -115, 3328, 263, -4301, 746, 4327, -1201, -3242, 821, 3899, -1396, -4280, 2370, 3121, -2079, -2883, 1727, 3595, -2750, -3121, 3301, 2080, -2546, -2677, 3132, 2753, -4048, -1259, 3380, 1448, -3264, -1724, 4123, 933, -3892, -338, 3480, 593, -4242, -337]
3923c37M632n072k732M150K882m264l612N856J932n763n08M030K440n531j645
3938c542O556p51m606o0M916O42o692J658N346j902m197Q20N144k049n342L678
3954c81L646k672m116K492N228m585k838L768K587l226l848M690L161n455j468
3969c017M266K012m523k141N921J43n099J52M046J215n749M03N791j804m064Q16
3985a632M339n22n876K658M578k506l917J854M678l195m093M234K686l333l328
4000c375L234M147n258j749M128J741l608k845N352J503n478JM075N95m318j025
4016b880N683q38m308O41L858O1n283J435M645k451k909R80M419k024m751L744
4032B2L179l212l127L023L874m073k882M196J489l044k402L880K557n126q11L830
$$ y = [-337, 4295, -777, -3509, 641, 3523, -741, -4353, 1503, 3435, -2328, -2836, 1194, 3634, -1897, -3542, 3014, 2263, -2343, -2403, 2513, 3155, -3537, -1879, 3467, 1565, -2632, -1812, 3332, 1283, -4059, -381, 3265, 593, -3523, -1031, 4197, -388, -3226, 542, 3129, -97, -3945, 745, 3906, -1549, -3017, 1249, 3261, -1262, -3403, 2518, 2661, -2438, -2286, 1760, 2975, -2774, -2371, 3420, 1616, -2448, -1632, 2707, 2185, -3691, -1033, 3545, 1039, -2878, -1024, 3654, 459, -3634, 600, 3286, -47, -3375, -141, 4006, -1252, -3001, 1127, 2868, -740, -3585, 1767, 3270, -2208, -2207, 1868, 2463, -1855, -2880, 2803, 1965, -2343, -1702, 2156, 2217, -3066, -1631, 3014, 563, -2346, -1366, 3053, 1029, -3722, 22, 3201, -11, -3138, -115, 3759, -314, -3196, 1000, 2489, -555, -2957, 923, 3480, -1646, -2457, 1373]
4048A373J009l870j313N089m2m960J213L499r4m204L03N153k203l691J807L788
4064B857j502m730K785L895l455k660K131L792l150l478M308J531k585k364L030
4079D05L221m936j319L920Q99l090j943M618R31n091M58L768k3l604k83M909j014
4096A826m426J435L546n18m783J826M162k671k854J886L068j636m133L245L027
4111C000l574k043K771K965m045j972M304Q55l164j604L495J818m633k89L709
4126A593J8l094j076M684j85m545J569K823m32l575P93M281j956l271J752K840
4142B219j422l873K817L280l268k229K398K577k356l199M087J353l272j135K593
4157E70K153l939j337M170J48k821j062L881O55m765R72L574r22l272K68M095
$$ y = [1373, 2382, -1488, -2801, 2288, 2246, -2714, -1501, 1998, 1904, -2300, -1997, 3156, 953, -2738, -931, 2857, 1355, -3375, -590, 3305, -150, -2810, -679, 3113, -37, -3515, 793, 2324, -261, -2625, 405, 3626, -1310, -2629, 1291, 2190, -900, -2843, 1775, 2706, -2385, -1927, 1841, 1818, -1786, -2069, 2840, 1826, -2600, -1165, 2381, 1863, -2920, -1094, 3068, 397, -2457, -571, 2497, 861, -3272, -27, 3000, -574, -2617, 154, 3119, -926, -2898, 1406, 2261, -903, -2507, 988, 2806, -1827, -2116, 1593, 1611, -1483, -2559, 2125, 1940, -2605, -1036, 1787, 1355, -2220, -1427, 2854, 898, -2373, -621, 2219, 797, -3076, -259, 3021, -247, -2476, -78, 2499, 143, -3056, 1031, 2384, -888, -2023, 570, 2723, -1216, -2553, 1617, 1765, -1056, -2118, 1763, 2418, -2347, -1375, 2199, 1277, -1995, -1727, 2368]
4173B368j179l743J993K646r43l779J635L989k937k195K145K293j815l328L348
4188D98K387l446j488K545J897l374j496L849L53k910o12K827J476m368P0L752
4204A960n15k752l39L447l79l737J406K770r20k940R48L678k067l067K468K140
4220B101j632k851K186L005l314j911K660J871k229k521L563J301l431l95K156
4235E59J512l372q87M048n20k895l4K895P54m321J260K988j239k221J20L761j590
4252H18l118K201J848j111k829J540L094k462k287K632J601j848k768L296J838
4267B445l557o19K311J432k783j376L642J72l116j77K708Q05l538K89L218q98
4283I58k613L07L056m98l525J756K531j591k360J162L117k062k321K354J474j670
$$ y = [2368, 1189, -2554, -561, 2085, 1142, -2637, -1002, 2987, 50, -2145, 0, 2293, 478, -2850, 498, 2885, -561, -2049, 496, 2393, -981, -2477, 1372, 1725, -1185, -1797, 1030, 2506, -1862, -1792, 1960, 1445, -1307, -1646, 1801, 1422, -2315, -909, 1861, 941, -1999, -1051, 2627, 560, -2507, -39, 2101, 469, -2382, -196, 2809, -505, -2416, 244, 2115, -114, -2635, 928, 2229, -1202, -1597, 559, 2071, -1301, -2188, 1860, 1340, -1555, -1589, 1306, 2060, -2261, -1001, 1987, 748, -1473, -1353, 2408, 818, -2300, -99, 1749, 638, -2191, -651, 2443, -19, -2306, 326, 1927, 79, -2689, 607, 2445, -1112, -1731, 580, 2012, -771, -2147, 1495, 1667, -1449, -1626, 1082, 1887, -1651, -1362, 1856, 958, -1655, -1348, 1708, 1210, -2315, -559, 1972, 381, -1979, -817, 2300, 238, -2083, 271, 1745, 75]
4299G5k171K030K384l131j196K772R03k068j600L210P81l181j31K139R16l022
4315a290m49L372m09k818N64K597k31l230P81L167j785k025Q60K716j398k788
4331b366K515J613j601j878J306K684k704j679K753O94j450j776K431J466l175
4346a167j07J922P66k212j021L264o3k892N48K037K37k951L53L102j249k206Q20
4363h19K246n36k905J640K464k284j345J089K349j922k146K523J244j742j749
4378a893K100J965l030r35K813K63j915j160K736L32k872M02K462lk279l26L180
4395A840r88k310R69J789j21k917Q32K816j849j478R89J820q55k733K095J671
4411A570j982j053J745J633k231j416K612L57j762j025K116J195k873k21K134
$$ y = [75, -2096, -66, 2318, -813, -2009, 763, 1666, -402, -2002, 1208, 1989, -1192, -1323, 816, 1732, -1290, -1739, 1633, 1224, -1594, -1030, 1567, 1336, -1894, -1113, 2054, 269, -1756, -896, 1820, 422, -2366, 149, 1762, 161, -1717, -411, 2273, -431, -2110, 643, 1337, -113, -1889, 542, 2008, -1167, -1274, 648, 1414, -798, -1819, 1445, 1382, -1510, -962, 1075, 1312, -1639, -1286, 1816, 567, -1639, -819, 1427, 891, -2014, -374, 2090, -194, -1539, -450, 1899, -23, -2169, 354, 1598, -144, -1893, 207, 2172, -858, -1793, 1020, 1283, -632, -1792, 944, 1276, -1596, -1194, 1268, 1265, -1014, -1340, 1840, 852, -1458, -489, 1300, 1179, -1738, -906, 1910, 61, -1417, -428, 1392, 537, -2196, -101, 1570, -412, -1465, 280, 1913, -318, -1734, 878, 1235, -527, -1552, 564, 1759, -1114, -1335, 799]
4426G99K09k092l84K855J22k992Q81J688J83k564M00K434r35j973J248J666p82
4443G63k740J948J585j845q51J081J589j586j640K166Q93j608j137J512J588k496
4459g78m87K343O8j725p49K288N97k761M52J746j89j999J24K519n14k583J209
4476d39J456n20j712P68K141j854j247J262J311r83j679J667J257j821o13J019
4492A3J580j959j057K325j37j305p98J942Q52k731L40J980l26j566k38K191k49
4509H57k199R16J604n52j571L34K261j458j406J133J209o94j944J622J492k063
4525d59p33J266J162j382j262J970N71j737l42J504R06k007o64J727M69j917O
4542i22J734K60k230N69J709o96j388J90J965o94j818J366R21n74j319N39J813
$$ y = [799, 1008, -1084, -1468, 1387, 1509, -1483, -602, 1086, 1269, -1295, -895, 1539, 604, -1369, -121, 1545, 763, -1977, -29, 1556, -289, -1140, -59, 1530, -56, -1696, 470, 1363, -245, -1382, 130, 1718, -778, -1265, 1078, 1146, -579, -1328, 960, 1557, -1204, -752, 994, 805, -1194, -1070, 1449, 935, -1648, -439, 1017, 497, -1215, -447, 1694, -160, -1407, -145, 1166, 183, -1496, 171, 1428, -393, -1006, 13, 1593, -366, -1423, 902, 765, -540, -1338, 604, 1456, -1275, -935, 1045, 719, -847, -1085, 1106, 857, -1342, -426, 1178, 626, -945, -611, 1650, 192, -1214, -81, 1128, 434, -1510, 112, 1604, -459, -1192, 74, 1236, -146, -1408, 562, 1133, -604, -946, 558, 1464, -543, -1207, 520, 989, -928, -922, 812, 1072, -1158, -589, 1120, 424, -964, -774, 1191, 497, -1321, 45, 966, 392, -927, -388, 1425]
4559A425j603j148J593R76j035j802J957O38j570j64R75R48j524r83K028J79j741
4576h51j09J552L65k066L19J771l78j292n2J565p9k037J048J283o50j002R9J818
4594A304j136j226J362P07q97j412J331J490j836p92J366R06j184r70J602M28
4610A043j479m22J520L21j400o54K079n48j102L7J266O9j767O96J374q20q18Q8
4628e17J734j061j430J186R28p68j045Q74J271j215r95J509M55p21j245J266O70
4645H96j474k12J340J10j049o58J596K18j437M0J140J81j493K60J516o95j157
4662h78O78J097n01j463P88R67o12p66M57J341r17j350J341P59r60r51J021R87
4680A038j333m75J249J83q00p75J318K68j836N49J107M5j202o8J609m50j144L75
$$ y = [1425, -178, -1326, 267, 1243, 208, -1594, 363, 1001, -569, -733, 242, 1190, -334, -1317, 711, 890, -851, -960, 592, 957, -1109, -790, 981, 603, -689, -741, 824, 745, -1292, -244, 1039, 389, -613, -514, 1304, 168, -1058, 304, 1011, 114, -1298, 33, 1523, -313, -1105, 261, 1167, -17, -987, 615, 1043, -436, -858, 662, 983, -417, -1071, 1008, 460, -642, -605, 661, 730, -1037, -341, 1033, 213, -605, -517, 1217, 156, -1274, -88, 840, 72, -973, -99, 1172, -43, -1038, 471, 926, 205, -1040, 226, 896, -578, -790, 550, 660, -389, -1047, 549, 767, -670, -630, 510, 691, -802, -542, 974, 279, -878, -200, 897, 396, -1067, -279, 688, 76, -690, -233, 1108, 191, -1159, 182, 941, -19, -970, 51, 1038, -295, -770, 479, 662, -138, -913, 405, 673, -1163, -614, 493, 538, -664, -732, 877, 427, -717, -342]
4698c42P09O9j018J41J446p82q26L84Q51n86j181J124O80o61q30P38Q13q64p68
4717i03J250j6m66m17R33L88j259O5R15Rj018j97J169j54r90N04O12l9p90k36
4737f40J234m13q73L20Q87k54r30P14P79q67m98M74P90r35p48J181K42o88n53
4756g78J015O22j118l15R73J2p59l27R54M9r51L12P47P2q39m25J480n47p51M34
4776a40P23k42r30K43J062q70k75L71M41m24q63J136L93m99r11P50O42o27n75
4795e95Q96J34m73n59J078L07j298M3J189l6r94l08J202j23j378O08R37l23q99
4814e92M15P38m42m63K93M42J7r25M57O45q38m4M36J54l40l75P93K08p07k47Q59
4835D84K30q92l47P86L6m09l54J46M50n21M38M56m16p13L37P46l93m73L70J97
$$ y = [-342, 367, 436, -582, -441, 1005, 223, -603, -219, 632, 46, -1135, -11, 669, 8, -822, -84, 729, -135, -903, 347, 331, -135, -552, 381, 769, -490, -425, 490, 499, -519, -716, 453, 299, -691, -187, 425, 386, -404, -640, 594, 181, -692, -372, 515, 261, -669, 45, 824, -43, -541, -67, 723, -212, -960, 221, 463, -225, -778, 237, 859, -259, -574, 399, 411, -348, -675, 279, 328, -623, -311, 436, 508, -331, -756, 724, 177, -574, -140, 583, 341, -589, -346, 716, -154, -429, -58, 383, -41, -904, 232, 625, 126, -785, -35, 607, -20, -595, 301, 435, -38, -597, 481, 788, -510, -467, 722, 686, -308, -616, 586, 463, -915, -307, 630, 307, -592, -177, 561, 119, -344, -51, 391, 408, -517, -60, 585, -253, -297, 139, 293, -47, -422, 371, 579, -128, -375, 484, 714, -178, -525, 261, 297, -112, -466, -320, 130, -391, 47, 503, 87, -626, -289, 457, 64, -409, -39, 158]
4855A58l9o21N46M99n57k96K87N58n20m06N21L91q25J14M72K30p85l83R60j31
4875A73m04J21K68L36n97k95P70m3p30K66M14j11m56J63L75o8m21N30J09l51n03
4896d54N32J69m26l92N33M08n06K15r7K56l69k32M14p6k67J86K87p1k82j79P35
4917C84k46m34j1M31j05m89M76L82j67l66k37N61q7m71L69K91l29n35M33N83o73
4938b40J64K89Q9m33l18O67R6n27q7N56j41k76J39J16n2m12L86k7J40k18pL83
4960B87l11m6j2L88m65p9K42L90p47J64K0L95k69k09J78L38m57r1L26M8j92J9
4982h3K44J26l47k16M3N31n21M39K7l70j2j42K82K11o27K97J65L49n41K88P8k99
5004g8K70j61om4p0j6M34l50lL9N0m5o6QL5p7n2J70j6j33J00M5k10J49J2J84m27
$$ y = [158, 119, -502, 44, 543, -14, -310, -23, 535, 15, -391, 130, 521, -304, -190, 282, 512, -273, -656, 304, 173, -231, -110, 158, 494, -103, -398, 372, 329, -401, -135, 279, 168, -288, -125, 250, 182, -239, 291, 400, 49, -454, 78, 247, -179, -571, -38, 370, -136, 79, -18, 238, -131, -363, 51, -25, -292, -106, 181, 110, -172, -351, 384, 138, -296, -307, 124, 19, -470, 6, 388, 221, -145, -382, 179, 92, -379, -10, 281, -48, -583, -150, 433, -240, -76, 213, 302, -131, -449, 218, 314, -213, -300, 256, 115, -161, -22, 94, 42, -370, 16, -11, 129, -89, -96, 287, -24, -70, -82, 306, -159, -238, 4, 394, -353, -189, -169, 226, -43, -252, -74, 264, -193, -284, 42, 90, -102, -83, 161, 287, -60, -276, -233, 298, -223, 216, 243, -127, -139, -281, 1, 212, -415, -118, 47, 396, -145, 143, 221, -78, 192, 31, 25, -19, -89, -105, 329, -21, -24, 15, 65, 20, -46, -38, -3, -80, -132, 38, 22, -111, -11, 34, -176, -27, -15, 169, -258]
5031b58j32M43k14K53j25j47L15j12n2J44j52R1j06J53j26o3oJ07l21K36LR2j49
5054a26j45M35j24J00l08L11k02J88j27R8J34j05K0r9j36j46K03L12k80p8M1N5
5076B1J27j91j47L01j96LK73j62m8KK52l67K36k49L57j48j71J28J15R8l31K10
5098A13o3j48L79k12l2j13j57J33J80j19j7k0J52n4j43M40j28j13k38L74j85n0
5120b1ML08m13N0M6K74j1l19r1L52p3k55J36J26m10J20L09o7or0m2K63l76J22
5144f4K25o9m4J01J78l48j88Q3K14L6N4l35N28l57l26J42L57j19k84M15L7l61
5166a25j13P9N59l92l39K20K60l48K25QM91m89m56L85L49m51j15N15J2n47K83
5187A1M58l10l72l1K17K08m62L51n9j24lo2O37n93k52L29P6ol29M16K26k78n83
$$ y = [-258, -390, 53, -161, 92, -33, -180, 135, 23, -29, 115, -37, 54, -52, 101, -25, -88, -94, 13, -308, -72, -69, 23, -126, -271, 164, 40, 140, -168, 143, -59, 129, 2, 100, 234, 129, 149, 50, -86, -232, -29, 283, 3, -75, -34, 21, 148, -43, -190, 111, -85, -82, 191, 29, -19, -17, 235, -132, 104, -145, 212, 64, -107, 21, 136, 234, -97, 113, 50, -98, 281, 69, 37, -76, -233, -100, 80, -39, -56, -76, 76, 22, -121, 319, 191, 78, -160, 214, 29, -21, -17, 291, -122, -72, -26, 248, 237, -82, -173, 179, 106, -149, -13, 113, -297, -177, 132, 65, 59, -31, -73, 190, -186, -64, 161, 92, 48, 149, 327, -21, -209, -126, 88, 124, 178, -157, 371, 14, -312, -170, 187, 68, -216, 199, 236, -125, -238, -159, 400, 8, -331, -111, 149, -199, 26, 34, 525, 36, -420, -35, 314, -137, -252, 263, 275, -272, 11, 469, 159, -213, -244, -27, 181, -281, 70, 11, -113, -116, -178, 459, -134, -386, -57, 19, 13, -316, 100, 326, 48, -535]
5210e35M57N98n78k40L26L64n53k31O73L23q98o6N67j55p5k65N28j50p28M33N59
5231C54j56n08K4O78l87m78N28N60m24n84L86M10m77l59P90M4n49l42P51J44o26
5252b21j59L95M75p48l99J075r7p33J00P63J30r53m3R07o2r29K99O48l43p20N29
5273h6L68j88l96K82N43l99m70N01L35n54k73L68L34o63O9M98K07n27m12O75L60
5294E72r30j58J012j8p50j14O02R8n81q3P26j82q20M01P09m39n50K35P80j66r58
5315f14P04L22o17m07O35O92j004l10R16K51o10m53Q13K16r96k3P98J35n57l30
5335d39Q98K59j378L35P47j26r21l9J233k66q56KQ35k3q11L02Q22o86m32O16P17
5356G89r21r41J415J55o81l32M78N58r10m13J173J77q64l36J222q5q61L7P14o5
$$ y = [-535, -78, 520, -58, -298, 28, 392, -161, -392, 281, 604, -294, -360, 207, 52, -23, -288, 240, 90, -638, -205, 354, 198, -310, -286, 392, 5, -473, 55, 615, 191, -393, -7, 403, -74, -433, 357, 401, -148, -490, 261, 405, -221, -380, 15, 490, -258, -657, 418, 321, -412, -312, 451, 581, -372, -415, 492, 430, -499, -200, 448, 105, -615, -86, 282, 94, -302, -20, 523, 124, -346, 155, 490, -64, -337, 31, 365, -298, -229, 269, 476, -51, -463, 212, 572, -358, -516, 496, 478, -272, -386, 216, 314, -267, -350, 376, 194, -626, -225, 484, 45, -505, -270, 510, 344, -614, 90, 412, -205, -612, 23, 715, -289, -599, 317, 568, -42, -495, 318, 534, -462, -485, 313, 448, -109, -439, 459, 718, -660, -325, 422, 296, -625, -664, 569, 303, -553, -551, 284, 261, -550, -248, 574, -112, -544, 72, 789, -132, -1073, 342, 497, -184, -516, -38, 520, -390, -803, 370, 547, -317, -653, 569, 484, -377, -340, 374, 309]
5376C09o66j06J041p8j277N39N21j02p98K81J265j000n03N82N76l26j027R15O50
5395G96j142k9N20N45p68p24J317kp85j78O29M61j080k1J041k57q41j63J395j87
5415E27j272N11J032o70q52L77R88l41q96L60J019o86r28R68P44j206l90R62M40
5434F87r38l66Q96M59j338j07O84O41j041k99J300j03p45l22Q80K73j249M18R76
5453G06n20p96L9J493n03j243O73Q51l70j091M96R30o44p06R34O26r28q49J034
5472A32O12j009m55R22P77j090n99J143Q2p64l10J101J55j372J04J295n55q95
5490g26J38J363j59j529O68J212q16q92O22P28n84j012J198L71n25r09P44J039
5508I31j001n20O89O91j072p67J397M79j432M8Q85N21j408k58J699l46j159m2
$$ y = [309, -357, -463, 578, 500, -777, -238, 283, 181, -617, -336, 929, -71, -574, 8, 584, 258, -769, 146, 796, -346, -375, 145, 690, -78, -802, 515, 513, -272, -450, 179, 640, -440, -461, 580, 323, -518, -681, 714, 527, -745, -234, 798, 128, -724, -347, 641, 300, -596, -236, 783, 97, -831, 137, 881, -325, -715, 247, 687, -251, -617, 279, 738, -600, -707, -23, 618, -423, -722, 578, 475, -270, -592, 288, 561, -688, -270, 706, 186, -610, -571, 922, 419, -824, -151, 700, 330, -761, -265, 665, 21, -685, 249, 875, -53, -902, 132, 744, -265, -720, 202, 979, -111, -710, 433, 515, -249, -559, 542, 697, -675, -571, 724, 169, -726, -588, 775, 616, -913, -245, 967, 151, -741, -119, 609, 25, -987, 211, 582, 57, -852, -108, 931, -70, -590, 99, 790, -282, -1049, 348, 827, -605, -557, 328, 849, -559, -817, 882, 536, -623, -665]
5526f65J243Kj396K17J302k18j099M09P80l65j025Q08P86o38j188R02J135j063
5544g3q81J163N98p88j012J333M62j092m96R07N03j117l41J493q8j227m9R57M33
5563F85j331K3J402l90j014K16J335n43j593Q90J114n46q29N5J478n54j377J099
5581A20O90o15j191J080J015j363p41J449J70q56p30J674K10j700K19Q70P4r69
5599e94l59J689J25j729M16J106M5j598N88J378r00j175O92J199n05j551J139
5616c4R41q65r45P21J330j302p83J128O19q69j016J285O82j448k91J440K76j344
5634d75m34J531Oj352K5J277J34j453r3J933n42j368O48J305q75j604J191J143
5652I97p89r77P01J318j334r48J263Q59j283n67Q86J012j851j85J528M67j611
$$ y = [-665, 578, 580, -816, -599, 703, 485, -614, -205, 575, 210, -815, -7, 779, 141, -1047, -145, 990, -73, -954, 209, 807, 19, -993, 340, 802, -290, -786, 121, 624, -493, -834, 659, 571, -656, -705, 252, 685, -646, -623, 779, 389, -625, -409, 926, 383, -1210, -320, 794, 248, -581, -526, 952, 398, -979, 120, 810, 195, -996, 84, 1099, -264, -1005, 444, 614, -242, -972, 702, 912, -788, -569, 301, 375, -594, -953, 736, 861, -868, -452, 654, 699, -899, -311, 1067, 167, -1008, -316, 883, 378, -1173, -34, 907, 42, -903, -182, 1148, -154, -937, 191, 810, -59, -1075, 210, 892, -556, -847, 593, 869, -475, -909, 622, 628, -724, -699, 578, 712, -741, -834, 1099, 557, -811, -163, 1142, 267, -1337, -146, 997, 208, -769, -68, 1250, -84, -1032, 231, 1090, -193, -760, 126, 1138, -713, -898, 630, 1097, -514]
5669e14m69J621L47j804J35J384j88j126l84K024p17j231M87J187j23j632O79
5686c24J781j221j364J074J170j118j462J552J255j433p59O78J270j353j112J603
5702B37N13j095n51J385N23j922K0J712J3j557q7J604J48k157O99J334j85j611
5720i77L01K090j017j382P32J293p65j675J290J319j287q61R50J091r87j268J643
5737D90P57j828o57J460N59j267m77J533J00j281k03J669O9j897L54J597j9j738
5755g79j91K075n61j917J075R87l07j823R44J924j523q46P07J340j140j464J690
5772A91J038j618n76P92J395j541j035K029L41j619l01J437M68j926M2J825m10
5789E32j153l06J725J03j824N00J292m19j394L57J992r84j822J318J149o82j796
$$ y = [-514, -983, 638, 985, -819, -684, 700, 512, -614, -998, 1026, 309, -922, -435, 752, 629, -1003, -324, 1457, 236, -1128, -54, 1116, -2, -1464, 88, 1343, -90, -849, -171, 1099, -254, -1366, 237, 750, -345, -896, 489, 1012, -910, -890, 822, 835, -722, -809, 795, 943, -1214, -515, 819, 634, -977, -676, 1414, 397, -985, -253, 1040, 275, -1400, -110, 1209, -78, -939, 11, 1102, 115, -1153, 490, 1247, -581, -1238, 222, 781, -486, -963, 570, 670, -611, -814, 855, 924, -973, -619, 978, 959, -779, -970, 1105, 544, -1373, -298, 689, 382, -1441, -497, 1427, -96, -942, -235, 1105, -35, -1499, 191, 1229, -389, -965, -173, 1222, -319, -1354, 675, 1016, -603, -904, 533, 1001, -925, -883, 942, 532, -621, -927, 798, 901, -923, -423, 869, 450, -944, -587, 1405, 421, -1401, -83, 1066, 384, -1412]
5806a412J342J410j514r29J314P89j115j055J749O18j743n44J486R05j920j77
5822g96J621j55j249K8J403L9k016J95J876m79j587M96J946n95j878R85J339n14
5840F59j831J106J558j496j176J324J114r69j702J642J236j933o28J325R56j546
5856c61r93K115L06j630m21J401P69j902m02K154k56j473j52K068n73j971Q12
5873e09J672q02j642Q23J913j497j435J486J403j119j799J300J638j684j079J769
5889D38O43j333j341K274N56j975l49J623N82j921n72K422k03j808Q2J874r0k024
5907a122M70J929r16j506M86J989r06j903J070J847j150j631R65J826j362j645
5923a559J914P77j105j366J657J075j888o98J589Q59j505j026J906K97j788K27
$$ y = [-1412, -70, 1340, -174, -1103, 211, 1000, -115, -1170, 579, 1197, -546, -1090, 396, 1301, -619, -796, 825, 670, -579, -551, 852, 891, -1125, -930, 946, 467, -1120, -624, 1322, 727, -1151, -166, 1173, 659, -1172, -66, 1492, -4, -1180, 144, 1258, 289, -1413, 229, 1465, -468, -1096, 229, 1185, -361, -1354, 761, 1067, -563, -984, 417, 1186, -716, -1118, 1036, 780, -693, -845, 1223, 650, -1321, -509, 1163, 361, -1281, -458, 1455, -42, -1477, 9, 1412, 293, -1506, -206, 1432, -252, -1331, 438, 1081, -252, -1593, 681, 1237, -738, -1087, 536, 1118, -803, -1375, 1047, 844, -964, -882, 992, 902, -1122, -652, 1277, 361, -1145, -659, 1330, 424, -1479, -409, 1438, 288, -1343, -378, 1448, 86, -1559, 355, 1132, 27, -1339, 318, 1393, -495, -1193, 396, 1255, -250, -1276, 630, 927, -861, -634]
5939f34J647j91k016K20K157o98j652P26J798p28k063R54K151j455j407P05J969
5956A483j144j865J636J122j237j142J050J335k024n29J763O41j546j043K084
5971E84O40k246J46J752K7j804k87K452l81j867L01J527K27k367P40J904r88j547
5989a187R05J686j113j864J704J322j463j115J103J530j926r57J797Q68j709q91
6005a310J577J038k136l50K038N6j634o06K369n7k363P88J510j37k162L36K455
6022A412r74j485M10J742l70k301J207J845j311j285J197J110j060j703J669J368
6038A471j859j050J779J091j948q36K077M27j795o98K074M76k307L17J811j39
6054H91j600k98K223j58k445P17J672l72k082Q08K192j651j399J200J495p47k319
$$ y = [-634, 1013, 822, -1194, -974, 1183, 485, -1167, -441, 1357, 629, -1434, -480, 1671, 216, -1191, -486, 1483, 339, -1526, 110, 1232, -5, -1147, -97, 1238, -786, -1315, 448, 1089, -457, -1500, 584, 1224, -1022, -876, 876, 903, -901, -1188, 1264, 883, -984, -683, 844, 1071, -1296, -556, 1348, 360, -1187, -282, 1404, 291, -1573, 131, 1453, -10, -1125, -22, 1508, -418, -1375, 422, 1290, -419, -1310, 267, 1305, -831, -1181, 857, 913, -721, -1327, 1042, 985, -1378, -590, 920, 783, -1379, -1043, 1412, 438, -1047, -637, 1105, 735, -1566, -359, 1486, 175, -1110, 87, 1197, 137, -1566, 103, 1471, -388, -1438, 341, 1432, -516, -1352, 725, 1152, -643, -1341, 733, 1209, -1098, -781, 1030, 891, -709, -1007, 1216, 1058, -1387, -670, 1002, 630, -1452, -644, 1548, -103, -1502, -302, 1193, 446, -1873]
6071a873J717J593j740j008J536J094j546j420K198K98j648n56J877J044k455
6086h89m55K154J08j551m83K162J60k574O61J685l35j853M43K319r64j978J087
6103c03J692q90j963J011K229k044j084J487J141j137j862K207R14k029m97J424
6119B96J333k451k68J947K37k080k22K232L02k683O01J999m06j754k92K383m85
6136F89j926Q33J937j043j901J048K173j873j346J478J126j021k029K037J167
6151A349j771q97J588J336j803j547K423P81k162m02J810N36k124m23K484l12
6167H66j939P3K010m2k591Q59J963p21j957Q00K045q40k053J597J279j155j841
6184a647J503J890k118r00J499J125j655j330J921J152k147m29J470Q23j973p56
$$ y = [-1873, -156, 1437, -303, -1311, 225, 1319, -227, -1647, 551, 849, -799, -1355, 522, 1566, -889, -1344, 810, 918, -633, -1116, 1046, 1206, -1368, -707, 978, 643, -1210, -767, 1552, 588, -1390, -303, 1389, 499, -1464, -453, 1776, -268, -1352, 135, 1276, 139, -1723, 484, 1398, -631, -1128, 296, 1629, -822, -1090, 857, 1094, -986, -1208, 1024, 1326, -1357, -756, 1243, 837, -917, -1209, 1174, 689, -1237, -404, 1533, 490, -1411, -363, 1810, -63, -1409, 69, 1195, 174, -1855, 182, 1349, -422, -1319, 269, 1605, -198, -1745, 678, 1459, -703, -1105, 705, 1241, -883, -1306, 1178, 866, -1073, -1000, 1010, 968, -1623, -764, 1199, 478, -1479, -679, 1366, 526, -1527, 70, 1349, 194, -1647, -144, 1746, -372, -1272, 227, 1352, -303, -1633, 288, 1440, -707, -1136, 334, 1157, -816, -1572]
6200a572K645r8j852k32K108M03k779N67K122o12j737K05K104o04k233J128J712
6217A275j263j264R32K129j748j499J596J106j127j672J919J016k018o80J681
6232C83Q64j876o23J942O28k241j20J722J69j851m1K489p94j825K56K438n16k277
6250a273N21K118j046j519O29K341j638j673J639J016j095j400J444J535k058
6265d59j085K025P39j420j356K299Q57k565R3J628N43k353m77K789j06k334K82
6282i00J926Q2k366L85K363j090j733O26K222q99k324J560J710j470j227P78J933
6299A576j653j687K155R43j770r10J630J417k362n33J848O41j862j208K561O78
6315A464k650K28J752M18k416P1K613p78j841K47K019l31k166J035J814j252j539
$$ y = [-1572, 1073, 975, -877, -1109, 999, 1402, -1377, -810, 1312, 700, -1037, -832, 1272, 668, -1565, -437, 1275, 12, -1252, -320, 1809, 61, -1438, 158, 1264, 137, -1535, 384, 1400, -618, -1298, 383, 1247, -629, -1252, 690, 1318, -923, -1043, 679, 848, -1003, -1044, 1445, 651, -1174, -918, 1520, 1004, -1273, -752, 1366, 320, -1199, -570, 1771, 133, -1540, 99, 1115, 20, -1380, 64, 1599, -459, -1544, 481, 1220, -200, -1556, 743, 1600, -965, -872, 756, 1299, -1054, -1531, 1258, 1152, -1182, -900, 1026, 1108, -1258, -873, 1490, 400, -1333, -707, 1515, 616, -1708, -148, 1562, 92, -1135, -357, 1576, -77, -1764, 391, 1334, -436, -1346, 284, 1701, -661, -1194, 654, 1295, -567, -1775, 786, 1464, -1186, -958, 794, 1212, -1204, -1133, 1480, 702, -1139, -892, 1127, 796, -1370, -335, 1479, 227, -1312]
6332a312P34K247j614j930J973J283j472j271J320J862k501n50J727N90j634q57
6348a405K012P25k417j50K324j94j681j05K077j55k408O26J694k2k344P31K350
6365A658j034k056Q34J993j010k060J834J233j527j304J279J707j852j286K061
6380D70N14j643o75J713J256k356l35J778O1j401p57K251N82k594J04J789J68
6397I25j955J3K249n92j959J131J302n87j946J167J879j653j359J447J443j313
6413A92j642J680J372j984j009J501J374k024p14K284q8j664p90K102R58k733
6429a185Q1J987J07j950jK461o98k315J170J509l94k374R33K388j591j459R39
6446c92J962j275j884J685J390j824q67J109J592j456j840K375N44j745p49J733
$$ y = [-1312, -578, 1669, 55, -1875, 98, 1381, -91, -1362, -42, 1820, -681, -1231, 496, 1086, -548, -1405, 607, 1332, -1085, -1235, 1089, 895, -786, -891, 1186, 1031, -1377, -751, 943, 921, -1423, -692, 1658, 624, -1432, -598, 1395, 385, -1675, 159, 1392, -135, -1439, -160, 1547, -305, -1591, 470, 984, -659, -1334, 379, 1635, -721, -1056, 722, 783, -618, -1375, 876, 1458, -1136, -1032, 757, 925, -1030, -1017, 1232, 640, -1319, -188, 1114, 527, -1419, -252, 1627, -26, -1385, 62, 1505, 192, -1450, 230, 1602, -382, -1391, 110, 1484, -540, -1254, 1030, 942, -722, -1512, 590, 1548, -1185, -1104, 883, 990, -960, -961, 1500, 802, -1513, -343, 1166, 772, -1602, -669, 1719, 128, -1331, -392, 1570, 295, -1589, 96, 1486, -338, -1205, -96, 1496, 40, -1800, 575, 1119, -626, -1375, 358]
6462C58J021k435j66K105j21j843j14K253R9k396P21J825n24j892L42K326j122
6479D37j742J130J511j064j701R61K036j696j268J524J034j201j577K002R91k074
6495f97o34J853R88k059q96K406m0j647k76J694O24k704M90K101l20j969J38K257
6513A309m90k469J227J773p17k156Q12K389j566j567J358J276j011j753J827J422
6529A664k425m97J531J210j818j355K568N41k187l83J648R35k195m28K594p68
6545F35j606N6J954J58k820R26J957p38j527L71K210r80k269J666J281j061j597
6562a384J410J672k015j339J930J272j596j212J758J208k480m81J572J034k124
6577g75n97K642m15j718k38K173J20k565N26K345j004j881P02K071n86k499J324
$$ y = [358, 1379, -1056, -1222, 883, 762, -1081, -1195, 1058, 1157, -1239, -518, 1307, 783, -1109, -767, 1559, 437, -1305, -175, 1336, 272, -1429, -468, 1568, -128, -1396, 128, 1162, -39, -1616, 386, 1377, -697, -1331, 522, 1510, -549, -1445, 961, 921, -726, -1002, 692, 1316, -1388, -898, 1203, 883, -1086, -948, 1309, 819, -1650, -423, 1350, 633, -1523, -711, 1678, 112, -1455, -97, 1179, 168, -1585, 242, 1664, -761, -1258, 273, 1483, -335, -1690, 878, 1419, -768, -1151, 497, 1432, -763, -1191, 1403, 635, -971, -915, 1039, 1197, -1623, -697, 1260, 522, -1005, -634, 1576, 596, -1673, -7, 1274, 213, -1384, 26, 1698, -317, -1656, 274, 1546, -50, -1262, 496, 1704, -776, -1257, 315, 1349, -775, -1372, 1270, 855, -863, -1101, 1072, 1192, -1373, -847, 1498, 494, -1387, -685, 1386, 800, -1699, -375]
6594c75J711j051j506R35J991j877j446J711J075j105j433J604J371k341n19J794
6610E39O67j670j052K435J67k010j91J818N45k290j09K589o20k215N14K116k98
6627I35k758J244J829r38j271N36K011j287j753J612J165j020j719J519J427j960
6643d28j235K039O73j350j448K284R64k542k3J634N67j973n61K711j82k551R04
6660e17J418K55k651P25K326j109j667O33J902j030j870J435J476j106j583J117
6676b46J982j951j192J926O38j381j157J603J293k310l13J666O52j694q11K197
6692I02M78k545K83J823J8j999n6K631j107j685Q61J560l51k286R03J862j071
6709B21j517J086J732j421j858K097Q84j363j198J709J501k310j084K300M60j641
$$ y = [-375, 1336, 285, -1221, -286, 1705, -172, -1618, 93, 1168, 63, -1370, 234, 1605, -736, -1255, 539, 1206, -464, -1516, 919, 1086, -924, -1115, 703, 1248, -1042, -1151, 1438, 818, -1397, -883, 1233, 935, -1823, -579, 1250, 312, -959, -423, 1588, 301, -1452, 160, 1325, 305, -1414, 105, 1532, -428, -1663, 376, 1049, -301, -1749, 535, 1499, -1043, -1066, 568, 1135, -838, -1399, 1312, 1130, -1421, -517, 901, 1156, -1495, -770, 1556, 447, -1220, -587, 1315, 285, -1585, -150, 1326, 220, -1363, -246, 1736, -215, -1407, 519, 1157, -224, -1381, 222, 1515, -795, -1108, 558, 1210, -484, -1295, 902, 1380, -1165, -882, 941, 959, -1040, -1096, 1535, 428, -1257, -396, 1164, 813, -1473, -570, 1292, 221, -1296, -210, 1522, 101, -1757, 340, 1224, -139, -1337, 372, 1873, -437, -1521, 779, 1239, -402]
6725d02q40J863P57k470K01J857J26j845k09K391p54k049O01J959k22k238M86
6742g88K193q47j896R81J816j015k370K142J307j654j309J492J527j684j528K309
6758F76N32j635o35J332J280k359l10K281j67j702k00K119l80k160N96J670l48
6775E90j758L22K396r36j902R54J722o50k411J493J687j526j516J506J252j064
6791A59j895K301O81j727q46J615J212j990j033K232L96j899n26K123O02k666
6807a261M31K027m53j513k26K362p34k000J098J586q75j653M10K554j895j237
6823a379J472J208q57k085J601J452j665j071J444J195j495j301K160N41j869
6838f49n54K076M50k327L6K202k43j935K31J647P9k463N67K163n19j866J80K279
$$ y = [-402, -1242, 621, 1378, -1092, -891, 966, 1092, -753, -962, 1429, 675, -1374, -773, 1186, 964, -1274, -788, 1405, 558, -1338, -357, 1459, 444, -1926, 216, 1523, -131, -1440, 52, 1579, -105, -1633, 676, 1208, -427, -1062, 270, 1550, -809, -1119, 1162, 995, -707, -907, 1212, 832, -1328, -732, 938, 590, -1168, -846, 1550, 614, -1288, -334, 1388, 738, -1673, -180, 1507, -19, -1535, -29, 1223, 159, -1736, 565, 1246, -481, -1327, 288, 1500, -490, -1523, 709, 1105, -794, -1320, 803, 1405, -1261, -830, 1197, 744, -769, -995, 1367, 633, -1367, -269, 1317, 442, -1211, -801, 1753, -142, -1379, 93, 1301, 444, -1641, -40, 1412, -253, -1324, 120, 1315, -180, -1481, 679, 1220, -649, -1203, 873, 1323, -1004, -968, 1234, 991, -944, -713, 934, 1013, -1450, -883, 1280, 761, -1105, -925, 1354]
6856A354q98j891J465J340r81j898J495J489j703j093J717J000j473j396K001
6871E28Q83k376o5J473P73j817o26K115q1j445m25J939K62k533M55K224p70j533
6889a019K85K209p72k295J550J191j022j337R48J922j672j417J436J012j196j320
6905a497J774J196k005q20J802R65j990o72K126O26k504K90J485N14k385p4K618
6922A449p63j966O29J632Q4k397J017J746j156j365N39K003j101j914J646J021
6938A104r95j416J338J442k140n59J755N00r66j612K056R21k141k59J474O07k170
6955a061k99K476n3k120K53J650K59k445N59K346j009j745N09J932q39k352J798
6972a41J449j146j201R22K154k007j438J674J019j445j248J627J420k459k72J970
$$ y = [1354, 456, -1435, 30, 1370, 389, -1509, -14, 1475, -228, -1321, 396, 1396, -77, -1473, 528, 1411, -965, -1030, 443, 1216, -601, -1227, 888, 807, -638, -1063, 876, 1138, -1395, -940, 1284, 514, -1019, -734, 1475, 703, -1592, -42, 1149, 127, -1210, -262, 1660, -12, -1429, 7, 1019, -177, -1497, 277, 1473, -532, -1352, 450, 1415, -575, -1247, 879, 1505, -999, -709, 776, 1290, -1095, -1169, 1449, 686, -1280, -651, 981, 1065, -1332, -315, 1431, 275, -1090, -551, 1452, 351, -1563, 83, 1104, 109, -1307, 31, 1473, -667, -1226, 529, 1029, 63, -1549, 507, 1428, -713, -972, 502, 1109, -1061, -1360, 1116, 1063, -1057, -804, 846, 1105, -1340, -781, 1565, 556, -1189, -680, 1252, 413, -1939, -141, 1308, 162, -1039, -117, 2037, 30, -1408, 266, 1285, -160, -1408, 219, 1639, -820, -1092, 878]
6988H78K83j690p90K565M0k499L29J674L57k079j81K743j243j338J73J613M9k522
7006a638J353J843j529j386J080J789j409j583J618J277j301j353J413J620k197
7021d03q06J753M64j367j117K365M87k392j8J997J56j967k31K326o16j985O92
7038f62J581k46j738O40J818r14j720R92J538p81k077J409J673j818r43J110J578
7055A440j549j194K040N48j765q15J802Q60k298j55K067Q5j555r74K627k55k259
7072a350R45J342q1k170L50K595j289j345P39J532p90j905J099K041j630j369
7088a286J150J556j349j729K176O13j515p22J388J071j990o04J834N15j786m30
7104a108J784R21k909O66J766n5j932k83K427n09k297J274J333o74j696P72K130
$$ y = [878, 1161, -529, -1319, 1246, 1286, -1213, -884, 790, 1147, -932, -1113, 1630, 387, -951, -778, 835, 884, -1638, -285, 1558, 29, -1357, -277, 1512, 103, -1480, 138, 1415, 114, -1239, 174, 1794, -403, -1209, 544, 1008, -359, -1476, 889, 1376, -1016, -1034, 963, 1119, -848, -1079, 1247, 631, -1354, -662, 919, 673, -1065, -425, 1393, 479, -1241, -249, 1289, 508, -1569, -160, 1513, -305, -1248, -138, 1440, -109, -1303, 737, 1285, -480, -1295, 507, 1367, -931, -1086, 981, 1066, -489, -1463, 1164, 909, -1350, -405, 937, 856, -1314, -964, 1631, 342, -1003, -264, 1268, 478, -1427, -328, 1713, 83, -1286, -136, 1420, 71, -1658, 518, 1131, -384, -1106, 282, 1353, -637, -1241, 593, 1108, -678, -1108, 676, 1597, -1312, -646, 1120, 1065, -867, -1150, 1277, 768, -1529, -255, 1078, 404, -1292, -520, 1610]
7121A610j628j162Q65J273p94j921J968J217j867o74J324J058j829r11K279L84
7137A192j824n33J680P65k151j06J978j28j349m31J831l4k271Q87J584m39j620
7154i69K06K116p93j775J153J240p41j815J072K024j945q95J431J104j414j763
7170a764K088J153k064o48J637J058k087o63K087L87j948r5J572N73k689O48K071
7187A316p06j761J86K454r27k125J257J189l98j753J005J946j788j249J387J164
7203A197p00j950J561J406k170n83J472J048j613j179K318J89j843j94J870O03
7219A432k342k94K344p04j411L4J970k03k149P39J625n75j581O18J767j166j622
7236a518J615J094q88j500J321J433j920p16J317Q13j281j264K193M97k008j69
$$ y = [1610, -18, -1180, -315, 958, 164, -1757, 211, 1428, -439, -1113, 211, 1269, -560, -1471, 808, 1192, -632, -1165, 515, 1280, -871, -977, 1001, 873, -476, -907, 924, 890, -1381, -494, 1090, 651, -969, -763, 1353, 560, -1215, -62, 1178, 437, -1378, -306, 1718, -227, -1122, 309, 1413, -1, -1764, 324, 1477, -587, -1235, 402, 1460, -627, -1290, 797, 1184, -764, -859, 713, 1286, -1403, -755, 1316, 610, -1151, -965, 1489, 562, -1563, -306, 883, 485, -1268, -263, 1683, -105, -1354, 33, 1197, 497, -1453, 108, 1514, -656, -1239, 233, 1281, -332, -1511, 807, 996, -847, -1041, 829, 1432, -910, -1204, 1140, 436, -975, -941, 1029, 826, -1323, -584, 1041, 466, -1115, -497, 1270, 104, -1518, 97, 1191, 303, -1197, 124, 1557, -363, -1079, 238, 1051, -230, -1494, 699, 1196, -812, -981]
7252i81J735N49k387J12K272n57j660R2J711P3k143N79J786n47j765M14J789o38
7270D34k014J293J272r43j247Q45J953j635j195J571J036j706j037J551J362k265
7286g25m19J793M93j755p96K541q0j932K97J411J13j946K78J864n45j618J95J722
7304H91k47j930R17J834j310j208O72J856j428j364J519J083j624q75J408J442
7320A636k207m99J480O13j464q36K083L86k318K20J714k8j519n48K574q13j702
7337a228P77J286j65k147Q10K193j361j343P85J496p21j891J440J291j173j311
7353a262J227J623j828j299K069N23j417r45J675J225k525o4J624L67j559o03
7369a169K156n0k004L22J687n1j959n7K502j009j692R15J440n76k027J504J315
$$ y = [-981, 754, 1303, -1084, -972, 1300, 743, -917, -825, 886, 959, -1184, -605, 1181, 634, -1131, -717, 1072, 434, -1580, -287, 985, 42, -1205, -360, 1593, -42, -1237, 334, 1370, -336, -1373, 178, 1540, -725, -1144, 649, 1142, -613, -1409, 1132, 1052, -880, -583, 828, 941, -1005, -727, 1137, 592, -1026, -831, 891, 644, -1286, -369, 1465, 155, -1053, -381, 1475, 47, -1317, 202, 1285, -339, -1214, 194, 1636, -571, -1070, 410, 1023, -441, -1277, 806, 1192, -1126, -906, 808, 780, -739, -1287, 1287, 474, -1228, -451, 835, 670, -1477, -667, 1526, 165, -1178, -393, 1103, 382, -1509, -69, 1222, 49, -1262, -35, 1588, -240, -1539, 530, 1053, -364, -1309, 366, 1591, -934, -998, 626, 993, -566, -1169, 987, 937, -1067, -745, 942, 891, -1068, -1125, 1377, 368, -1324, -409, 1031, 455, -1572, -68, 1247]
7386A247j604p28J049J379j288j621J895P63j340r78J456J307k147p80K102J75
7402H87j781m84K350K69k420L75J674k48j725M4K236o16j930Q64J670m06j995
7419a236N37K210j451j419J369J335j087k039J827J401j721r30J255J395j724
7434b78j169J970P35j876p86J908N20k189J66K034k49j655m09K427l39j984P32
7451d42J474l55j898N67K235j220j556R27J274n69j903J296J615j555r94J196
7467I2J145j241j293J998K38j243n20J355Q19j898o67K190k44j232m70J529N91
7484A149k411O64J638q17r61q6J963m64j748R32J050m05j713O69K098j581j492
7501a515J690J103j044j773J884P52j671p14J484J036j322j230J992M05k074Q9
$$ y = [1247, -357, -1085, -36, 1343, 55, -1566, 329, 1092, -248, -1226, 230, 1537, -610, -1390, 712, 887, -894, -1378, 972, 1241, -1179, -804, 870, 622, -1103, -1059, 1177, 561, -1369, -505, 1165, 759, -1236, -699, 1511, 60, -1359, 10, 1345, 258, -1781, 46, 1447, -274, -1204, 51, 1446, -278, -1447, 523, 1258, -618, -1404, 504, 1024, -1165, -999, 1035, 786, -869, -1278, 1149, 810, -1174, -442, 1032, 677, -1221, -654, 1581, 361, -1195, -268, 1006, 437, -1466, -170, 1445, -110, -1104, 92, 1237, -4, -1297, 701, 939, -304, -824, 531, 1350, -548, -1215, 975, 731, -501, -971, 558, 1149, -1262, -598, 1040, 223, -738, -824, 1139, 675, -1073, -141, 909, 504, -1209, -540, 1558, -23, -1515, 175, 1278, 234, -1539, 345, 1097, -574, -1288, 196, 1232, -90, -1320, 672, 1077, -997, -908]
7517i08J462P00k129k04K268m88j687J93J804r6k273J035J421o45j710Q22J863
7534A428j017j738J112J445j074j346J112J677k136p00J647Q19j728j106K274
7549F69L84j690j56J068P59j894m61K189r5j529q7J666K62k238O41J812r45j203
7567h48J04J995p06j855J321J145q89j525J025J714j511j303J671J100j456j435
7583a453J924R13j859n54J624L80j522r27K332Q5j981R2J628M83k262K52K077
7600A232m90j734M21J535l40k119J022J586q12j313L70K125j178j914J461J378
7616A230j446j148J411J519k072m84J454P13j509j137K134L88j903o2J635J62
7632H85j704j97K281q12j517O21J259J42j988N15J878j067j439O61J900r29j947
$$ y = [-908, 554, 1254, -875, -1079, 1189, 701, -986, -793, 1011, 915, -1358, -323, 1098, 453, -1257, -435, 1428, 411, -1327, -215, 1230, 156, -1190, -78, 1599, -537, -1237, 410, 1229, -499, -1605, 669, 1053, -637, -793, 275, 1034, -860, -1321, 868, 773, -756, -843, 823, 1085, -1153, -512, 1300, 355, -848, -744, 1251, 545, -1310, 11, 1156, 267, -1258, -233, 1481, -30, -1333, 338, 1438, -18, -1453, 471, 1384, -475, -1029, 595, 975, -547, -1474, 858, 943, -1038, -946, 682, 1165, -1097, -845, 1232, 742, -992, -571, 964, 624, -1495, -473, 1113, 301, -1012, -642, 1483, 305, -1609, -148, 1230, -216, -1364, 47, 1566, -506, -990, 464, 1177, -332, -1469, 665, 1053, -850, -912, 723, 885, -819, -1016, 1265, 453, -1064, -443, 816, 958, -1030, -515, 1363, 296, -1143, -482, 1418, 489, -1458]
7649a458J688J106j539q85J014J688k135p88K015N11j540q90J481J050k209L9
7665h52J241M74j425n38K028q4j941L55J452P6j893J78K228p76j532O54J409l55
7683F99j897J087J340j302r05O54J818j422j532K022N78j252j210J475J463k264
7699f48p21K063M07j390q90J686P75k450L70J599l5j473k03K083o56j649L58J606
7717H32j24k300J314J745j420j078P27J328p75j521J345J200j632q25J085J750
7733A651k167q76K020K82j433p66J769P38j939M3J705j66j370o37K490m59k118
7750a233N46J542k69j539%K470j346j349R82J086n25j768J335J209j220j007R28
7767a58J390j302j482K050Q20j826l85J291J195k453k93J882J83j233n73J797
$$ y = [-1458, 230, 1336, -203, -1088, -74, 1614, -521, -1309, 706, 1217, -323, -1213, 268, 1318, -891, -852, 389, 863, -562, -1100, 928, 844, -1097, -742, 710, 786, -1107, -929, 1299, 523, -1009, -355, 1054, 699, -1198, -111, 1229, -73, -978, -324, 1494, 72, -1460, 562, 1140, -112, -1322, 153, 1616, -648, -1369, 694, 1101, -289, -1179, 507, 1282, -1168, -798, 801, 766, -707, -910, 1173, 517, -1132, -774, 832, 708, -1592, -278, 1467, 47, -1031, -304, 1024, 249, -1272, 73, 1273, -359, -1184, -99, 1651, -516, -1392, 628, 910, -523, -1289, 480, 1218, -721, -678, 1027, 861, -509, -1146, 1344, 885, -1233, -687, 855, 586, -953, -953, 1517, 171, -1178, -196, 890, 365, -1403, -68, 1141, -79, -1086, -158, 1232, -70, -1552, 498, 1318, -508, -893, 398, 1593, -860, -1153, 729, 912, -321, -894, 903]
7783I03K64k068l6J977m82j679K67K149q24j692J139J087l93k002J005J872j663
7800a76q64J095J006j058j367J440J343j846n07J151J153j830p18J697K92j369
7816e58j90J361P36k359J70K064m57j478r0K152m17k216P00J517l43j709M29K116
7834A428j314j302J058J183p64j394J017J597j758q60J449P17j065j438K066O39
7850A259j724l43J170Q74j936m86K478n45j592j46J771p5j784M82J715m87j562
7867i31J58K129r86j826J246J142n02j839J114J713j552j091J298O35p46j165
7883a203J620J011k149j73J274P36j568p62K008J43j592k32J521O44k386K11K042
7900A145o08j305J93J835o53k258J539J177j052j168O79J752j319j052J398P71
$$ y = [903, 1167, -901, -937, 1040, 558, -1121, -854, 1295, 471, -1221, -82, 1005, 612, -1390, -385, 1487, -176, -1040, 55, 1061, 3, -1364, 76, 1419, -427, -934, 217, 1370, -460, -1178, 519, 811, -558, -748, 613, 1349, -1010, -840, 1224, 767, -711, -801, 1351, 934, -1282, -582, 935, 592, -1117, -688, 1428, 114, -1188, -130, 1053, 289, -1105, -88, 1509, -249, -1109, 340, 1057, -8, -1446, 620, 1259, -465, -808, 362, 1236, -700, -1186, 1292, 747, -845, -991, 780, 705, -1079, -597, 1118, 631, -931, -773, 1356, 370, -1456, -210, 932, 430, -1409, -295, 1418, -134, -1225, 73, 708, -38, -1203, 417, 1428, -721, -894, 380, 1116, -452, -1214, 794, 937, -655, -887, 634, 1278, -1108, -897, 1145, 537, -768, -575, 1260, 607, -1651, -112, 1065, 13, -1155, -476, 1276, -43, -1095, 303, 1074]
7916A074j044j068J234J177j695p21J404N21j175j224K393J50j757J8J305O33
7932A225j907j22K004n76j581K67J528j2k062J009J345p47j558N12J998r82j809
7949a468J567P02p26j403J214J826j692j638K067N93j241j079J716O02j772l55
7965a087J536L93j419n92K098r1j754J86J493L68k258L31J921p91j282L18J588
7982I58n47j753J250J342j125j204M48J962j132j354J491P83j083j397J351J410
7998A400j888n58J515L50j211q14J819O52k309M17J214L72j602k35K230q42j289
8015g79L08J061M4j700O31J737j334j038R28J452j041j785J807P81j187r63P97
8032b81J686j774q12J806K44j392o32J675O46j925j27J461K61j590j22J724p4
$$ y = [1074, 30, -1038, 196, 1373, -322, -1043, 361, 882, -293, -1517, 876, 1026, -731, -713, 592, 1225, -682, -804, 1200, 624, -957, -690, 838, 826, -1236, -227, 1118, 371, -1187, -675, 1323, 341, -1468, 99, 801, 75, -1328, -114, 1712, 20, -1618, 449, 1042, -199, -1278, 438, 1040, -732, -1087, 449, 842, -577, -1169, 929, 838, -916, -730, 763, 1131, -1127, -796, 1125, 334, -948, -630, 958, 411, -1342, -92, 1250, 125, -1079, -631, 1331, 199, -1155, 336, 1119, 36, -1361, -10, 1400, -488, -1046, 469, 819, -392, -1206, 613, 1265, -1044, -627, 587, 959, -643, -878, 1352, 510, -779, -471, 590, 634, -1066, -435, 1302, -32, -1070, -142, 1310, 269, -1516, 291, 1072, -115, -1078, -281, 1405, -369, -1181, 625, 869, -523, -1155, 520, 1166, -759, -886, 575, 836, -754, -876, 848, 774]
8049G74j595K89J376J22j898K30K043r88j753J087J296n37j882J408J345j463
8065a46q99R69J438j451j303J805O52j182q72J269R47j944m15J782J89j435m84
8082a080J929P5k064L47J635n2j493j75K007p97j494Q85J389n96j962R30K047
8099A531j500j146Q48J251p49j602J521J053j389o88Q68J191j499p85J705L26
8115I36j386n27J404P69k195K54J725l12j275k93K115n01j870O50J304k66j530
8132i98M59J815j029j262J128Q37o13j873J542J302j511q18R53R93j214r11J594
8149C94J006j991l34J427O58j899m64K097q7j418j64J487K88k210L34J493j57
8166D60j516K83J833p20j718J214J016n96j346R02J529j442q55Q23J191j175j291
$$ y = [774, -821, -532, 844, 966, -932, -702, 1341, 353, -1400, -313, 983, 446, -1436, -28, 1317, -146, -1045, -76, 1362, -89, -1392, 413, 1065, -117, -989, 280, 1227, -717, -1132, 650, 839, -596, -1080, 849, 924, -1140, -793, 842, 790, -703, -878, 1129, 332, -1162, -277, 1112, 516, -1446, -516, 1531, 31, -1115, -267, 984, 235, -1367, 154, 1207, -182, -870, -2, 1189, -310, -1095, 610, 936, -450, -977, 427, 1196, -999, -745, 980, 668, -607, -900, 1215, 714, -1156, -506, 798, 532, -998, -539, 1276, 247, -1015, 113, 950, 337, -1536, 6, 1308, -203, -1021, -68, 925, -289, -1200, 394, 1400, -591, -925, 502, 1160, -739, -1203, 894, 807, -611, -775, 712, 1000, -1210, -876, 617, 460, -1056, -773, 1060, 340, -1378, -164, 852, 256, -1090, -188, 1341, -101, -956, -133, 1058, -117, -1408]
8183a408J787Q17j777l40J320O88j732n20
8191a165
$$ y = [-1408, 379, 1196, -581, -921, 399, 1087, -645, -1165]
$$ Imaginary data points
##PAGE= N=2
##DATA TABLE= (X++(I..I)), XYDATA
0@%%%%%%%%%%Qj6J6j6J7k5L2l2M0n3O1p2Q8j04J17j33J57j83K07k34K69l07L46
33A83l90M42m99N56o20O95p75Q59r50J052j165J286j416J562j723J896k086K298
51A205k533K793l083L410l783M207m698N277n965O800p836R162j0926J3378j7011
66i603K2924l4058O1597k42169l36148Q09214J49284o21063k77859P38696K28567
77D89382q65485P784P13666m195o57548q5579Q38597j29821p63597K45335N94521
88C83060j24730o99591K07756P51972m16215n46795L42857N30019k95774o52046
98e19487M98479N12535n40281l63873M11331M72285n23542m46189O63280K37756
108D02294n43694k53193N23852L27501o99110j43687O59861L7770n32110j42749
$$ y = [0, 0, 0, 0, 0, 0, 0, 0, 0, 0, 0, 8, -8, 8, -8, 9, -16, 16, -16, 24, -29, 32, -40, 48, -56, 61, -72, 85, -98, 109, -125, 144, -163, 183, -207, 235, -264, 292, -328, 367, -408, 451, -499, 553, -612, 674, -742, 820, -903, 993, -1093, 1205, -1328, 1465, -1618, 1792, -1991, 2216, -2482, 2795, -3170, 3630, -4206, 4956, -5970, 7408, -9603, 13321, -20737, 40860, -201309, -537457, 271757, 421041, -200022, -477881, 260815, 489382, -376103, -368319, 345347, 341152, -316396, -401975, 436622, 306801, -456796, -211461, 383060, 258330, -441261, -233505, 518467, 102252, -444543, -101686, 428333, 132559, -519487, -21008, 491527, -48754, -412627, -1296, 470989, -52553, -498742, 164538, 402294, -141400, -394593, 129259, 456760, -242350, -386037, 273824, 311594, -220516, -363265]
118c63265O49944O0331p13164J28088N52653p2897n55448M1637O80731k34901
128A73709n68935K80434M52165j76638n63106K90911N49501m28113l72305L32150
138c0227L98380l31276m70591N00981L13300m78400k28472L82320L26583n04310
148a21712k55023N75318R2466m51979j42688M74334J67929o02635M351N22005
158B62366m6690m39703l6893N54978p3028n57838K00719M19330j27115m58444
168c02318J39856N34684l02749m06436K94931L42491k23896m39048L48860L80570
178C66945m25321k40274L26344K93338l63103l17584M91870J62453m28894j28414
188b62640L68428K05467m87883j03216N01427j3878l86030n5058M38219L7718
$$ y = [-363265, 286679, 347010, -366154, -238066, 314587, 241690, -313758, -272121, 408610, 173709, -395226, -114792, 337373, 160735, -402371, -111460, 438041, 9928, -362377, -30227, 368153, 36877, -433714, 67267, 380567, -97833, -326305, 56015, 382598, -121712, -376735, 198583, 291049, -160930, -303618, 170716, 338645, -263990, -259639, 262366, 215676, -224027, -260920, 294058, 221030, -336808, -136089, 283241, 156126, -302318, -162462, 372222, 69473, -336963, -42032, 300459, 76563, -362485, -13625, 366945, -58376, -298650, 27694, 321032, -42071, -359655, 132215, 294668, -134226, -262640, 105788, 311255, -176628, -279844, 221583, 207705, -178325, -233383, 204836, 242554]
198B42554n19186J14594M13207j09257l70521N1953M72336j75321m28618K50762
208e7497L14480j70700l75296K17635M05463l46044k73594L01081K52587k62482
218E633l27723L86039K37668m10114j37476L21861K01291l84375j84226M70506
228A79084M4837l86295m9860L61881R8520m67033J9621M35680r0897l42118K1339
239a75241M09775p2410m45268J96539L30227j57898l22232J30764M00734k55610
249C9380l21299K83108K36569k08463l06311K80411K94600l70790j68408K99876
259E8673J81959k92774k29512M04310J19696l85856n6632L13260J22171l91930
269a56635p0990M36466m6090l42607J2635L49619N815m32965J15323L69829j46831
$$ y = [242554, -276632, -162038, 251169, 141912, -228609, -176656, 295680, 120359, -308259, -57497, 256983, 86283, -289013, -71378, 334085, -11959, -285553, 15528, 268115, 5633, -322090, 63949, 301617, -108497, -245973, 75888, 277179, -107196, -291422, 179084, 223921, -162374, -212234, 149647, 248167, -218866, -199245, 236435, 145538, -196580, -175241, 234534, 162124, -283144, -86605, 243622, 85724, -236508, -105744, 294990, 39380, -281919, 1189, 237758, 29295, -277016, 3395, 297995, -72795, -241203, 58673, 240632, -52142, -281654, 122656, 242352, -143504, -200136, 113124, 235295, -156635, -227625, 208841, 162751, -179856, -167221, 182398, 188213, -244752, -129429, 240400, 93569]
280I3569l02487Q6164L75951j61837l70241K51246K62201j94717k81097J97573
290d3675L29692l09669k31314K99578J77976k41598k42763L25125J96184l74648
300a15112q9452K95655J24313l14384j41233M02938K6146l51694J568L00478N4342
311A93565l82870K1612L87725j09352k96021N9005L27244o9567l83187J83357
321f8489K98558j79632k59369J34630L29098k24440k90167K79003J97140k15423
331I09k35291K44662K53493l37012j48732K98623J26310k62823j77624L48114
341A10629J06452l60315k5833K84829P1708l23598n8891L82687m7986l12097M5547
352a26868K86039q577l58476R7074L28937j51220k50974R6615K96473j32719l18996
$$ y = [93569, -208918, -122754, 253197, 91360, -278881, -27635, 234566, 39849, -241248, -43675, 286017, -23652, -254966, 44612, 222588, -19010, -261773, 63352, 259536, -115112, -204564, 91091, 215404, -98980, -240213, 162725, 188871, -162823, -161255, 139223, 193565, -189305, -167693, 220032, 110680, -185341, -126336, 200908, 131341, -251846, -68489, 230069, 50437, -208932, -74302, 254796, 30356, -259811, 19192, 216332, 909, -234382, 10280, 263773, -73239, -221971, 76652, 202962, -59861, -237485, 110629, 217081, -143234, -169067, 115762, 187470, -136128, -195019, 187668, 139682, -172415, -126868, 159171, 150594, -207882, -110808, 218129, 66909, -184065, -87450, 209023, 76304, -242692]
363b42692K25127K28088j95805k15195J71476K70404k63328k06302K83013J35821
373A90607k22199j84305K72012J72411l37816p2557K80787P6901k68344j10927
383b03430L48192K4197l28135K7686K64161K1541l17036J7349L45373j08019k66315
394a74436Q2468K64100o6927l20974J57978K65986j79928k07271J29524K57998
404B08518j83264k50156K50084J61821k03195j71639K00931K05564k83427j26682
414a91445K71895Q2439k22629j30089K82914R2927l18423q029K53508L2171k62671
425a17432m4199L27054m6740k81950O8968K36824k5781k95016Q4424K93626j52839
436D6939k16257J12800K34118j18897k71271K04548J99295j98072j63622J59116
$$ y = [-242692, -17565, 210523, 14718, -200477, -29001, 241403, -21925, -228227, 54786, 190607, -31592, -215897, 56115, 228526, -109290, -181847, 98940, 175841, -92503, -203430, 144762, 168959, -159176, -131490, 132671, 154212, -162824, -145475, 199898, 91879, -174436, -91968, 172132, 105205, -215769, -57791, 208195, 28267, -179004, -49480, 208518, 25254, -224902, 25182, 187003, -16192, -187831, 13100, 218664, -64763, -191445, 80450, 162889, -59740, -189829, 93085, 186012, -132411, -140440, 113068, 145239, -117432, -161631, 165423, 118683, -163267, -94299, 142525, 116744, -178272, -93848, 199778, 46939, -169318, -56518, 177600, 58703, -212568, -8020, 191275, -6797, -170419, -11303]
446a1303K12920k24758j78080K63095J00571k07777j27217K25487J38208k91901
456a00755n3763K55805L4362k21717p4111K84048J7417k88901M6503K24962j0848
467A13002k50435K0964K92409j05011k31934J02435K06371p1692k60012J40583
477d3320K32720j82654j65580J36781J97341j62845k10890K33884J32807k05433
487c7189j19754J82470J60182k51836j04677K62139M5069k07802q1485K41965
497H9082O9476k88253J2894K35097r538k18524j8279K76843n1411k54713R2434
508f4892J97143n0879k34532Q0901K51818j51832j82617J28210J76522j12873
518C6969k18973J84239J70414j99239j19140J55240J56997j96041j46881K46085
$$ y = [-11303, 201617, -23141, -201221, 61874, 162445, -45332, -172549, 52938, 191146, -100755, -154518, 101287, 135649, -86068, -160179, 123869, 141286, -147615, -101112, 123850, 113002, -137433, -116469, 175940, 70929, -161005, -58570, 147801, 76109, -183903, -43320, 189400, 6746, -158834, -22053, 175288, 12443, -198447, 35437, 168244, -37189, -156943, 25527, 185709, -66127, -170804, 91335, 136404, -71398, -152883, 89082, 158558, -129695, -116801, 118296, 108758, -109766, -128045, 148798, 97387, -157326, -64892, 132251, 81372, -153160, -72259, 179559, 27727, -154890, -26680, 149842, 36969, -182004, 2235, 172649, -26590, -145730, 9510, 166507, -29534, -176415, 69670]
528F9670P1960k03677p7735J98358J02745k61091l6097K47371k633k01676l4595
539a27400K45595K524k68113O7357K08501m7044k10408L7291K56213j10009k13673
550a59166J27125J70059q8799k12351J34411K04598j86209j35992J48928J46535
560A49139j50083j73260K16485J10189k06353p7423J69364J15677k19517q4286
570a50068K46006J8890j95677l9285K05975M7243k57030K4380K21941m0471j89335
581a07431P770K36699n5631k35036J07906J77049p7412j93512Q5080K22681j53415
592A4748j67109J48412J41819j20718j80915J74783J52386k04270r3411J62454
602B8179J15795j79869j23024K33426N5037k04568m1493J80230P2897k31677k5714
$$ y = [69670, 141630, -62047, -139782, 58576, 161321, -99770, -135867, 111504, 108871, -92805, -127400, 118195, 120719, -147394, -80037, 128464, 81420, -128988, -91697, 164516, 54507, -159166, -32041, 138018, 49219, -163132, -28721, 175877, -10332, -146324, 2604, 149139, -944, -174204, 42281, 152470, -53883, -131306, 38058, 153735, -65782, -150068, 95938, 114828, -80849, -120134, 85841, 133084, -123946, -99566, 122375, 81904, -107431, -99661, 137038, 81407, -153629, -45723, 131326, 53914, -139598, -54518, 168163, 14748, -152361, -3949, 137870, 17152, -163763, 11020, 163406, -40864, -134275, 28179, 143974, -35895, -158919, 74507, 129544, -75024, -116517, 63713, 136610, -95067, -120781]
613a20781K34449k4316j83829n786K07721m706k41240P2721J92075o8557j74764
624a17013M5268K18726j02629j95064J34364J44095r8680j71866J22634J81899
634A61734j79636j20537J57641J11747j42179j43551J98900R9064k07215n3590
644a17622J66644Q3001j97352p1384K34527O177j93469r810J83848K9731k31323
655a17032K7402K13404n8913j70052K6846K02041n3369k15410J10776J60344r1690
666C4347j57524Q0710J92653j40192j52168J50584J12889j15842j45681J52375
676A2151J35760j93151p4924J58073Q2424j56551j03041K09889M7199j97279j8116
687i7566J62633M9477k02257k0618K20332l5819j73134J7885J78458j2060k16707
$$ y = [-120781, 113668, 89352, -94477, -100263, 107458, 102752, -138488, -65767, 126308, 57751, -117013, -71745, 146981, 44352, -150712, -16348, 127747, 29067, -142799, -20165, 161734, -17902, -138439, 19202, 130949, -11230, -154781, 44119, 143183, -64032, -117622, 49022, 132023, -65329, -136713, 97814, 103991, -89478, -99288, 84560, 114291, -117032, -89630, 123774, 64861, -105191, -78345, 123696, 70327, -145083, -34307, 126037, 34347, -123177, -42467, 150186, 9994, -142174, 8410, 121299, 5457, -140224, 12151, 147911, -45240, -120164, 37909, 120333, -36218, -139259, 70630, 117829, -79450, -97566, 65067, 114544, -87713, -108331, 112001, 76182, -96952, -79067, 99391, 87331, -129376]
698a29376P2604J82071q4925j50435N6361J85935r5470j79933J37851J25624j08253
709A2054j36334J11878J58102j67271j06709J58874Q2119j30890j13603J73682
719D1902Q6863j95102l4589J54867N3055j66329n8207K08345o70j79363J1892
730g7336J54977J5232j96353K6080J94736o8619j47181M1138J65423n0542j90103
741a32548J07933J43863j02400j25916Q0963J60517j28641j36432J53451Q8556
751A09346j18571j10332J36307J16138j82311n9723J58269N1002j40654p7020
761a17549J85557L6341j87528L870J47323K1822j69652j1737J97080m3758j57071
772i5302L9042J45410k1262j82423O9592J62099r4088j21593O4275J46580q5910
$$ y = [-129376, -56772, 125299, 40374, -110061, -53700, 132235, 36765, -143168, -5317, 120307, 12054, -124280, -12402, 145700, -21571, -128280, 30594, 112713, -18177, -131780, 41902, 128765, -66337, -100926, 53941, 106996, -59333, -117540, 90805, 90135, -89228, -77336, 77641, 92873, -103480, -77400, 117336, 48717, -98464, -57326, 108097, 57555, -132548, -24615, 119248, 16848, -109068, -28105, 132412, 3771, -132661, 20790, 109346, -9225, -119557, 16750, 132888, -49423, -109146, 49123, 100125, -40529, -117549, 68008, 104349, -83179, -79309, 68014, 89836, -79816, -91553, 105527, 61769, -95302, -56260, 89150, 67888, -114535, -44943, 117156, 23068, -98525, -34250, 112330, 26420]
783B6420j54506J32815J04175j13413r9939J02386J27546j51785q9336J57266
793D1629N3553j23749q0871J52917P0056j84283j5771J49471K1382j44233l8225
804i8124J86607j1686j70351L6138J36026q052j66378L2609J77059q0092j31138
815i7382O2062J32197n5183j61727J05767J27086j13138r6067Q4403J25050j16315
826c247j16403J49606O6918j20088p5062J20624R1257j64759m4955J53256K3571
837H0718j26293n0010J60596K5349j74923K0197J36493m087j43305j18J76643
848A01260n2158j46062O0134J21755l5633j54925P1431J48812j06413j03624Q0303
859a5120J16030q5995j34000J33214Q9741j24214p1829J01982R9929j40667p5606
$$ y = [26420, -128086, 4729, 108904, -4509, -104448, -2062, 125484, -26301, -115637, 41629, 95182, -28567, -109438, 43479, 113535, -70748, -86519, 62952, 84334, -59899, -98124, 88483, 76797, -93554, -57416, 78610, 70558, -95820, -63211, 113848, 33756, -97382, -35320, 96877, 41694, -120033, -14266, 112820, -318, -96385, -11982, 113068, -3247, -119650, 29956, 96874, -23214, -98276, 22348, 113605, -51154, -96109, 57147, 80718, -45575, -95585, 65011, 90360, -84563, -64366, 72127, 68040, -75265, -75383, 101260, 49102, -96960, -36826, 84929, 49296, -105629, -34198, 114614, 8201, -95423, -15120, 100910, 14915, -119085, 14129, 103870, -20344, -92173, 9809, 109738, -30929, -106535]
870a06535J57432L2439j22961n0122J34805N3521j70302l752J44661l070j26255
881f0139j9782J62600j6693j59436N0531J20701k6550j38089L5387J58363q3026
892B3867j19521P6993J06623n9783j36551J01001J15743j20884p7294R2285R7000
903I9479j09039j00928J47453N3876j26311m9503J14388P1268j54381l5427J54801
914F5676L286j21693k6410J43767J5485j66542L2044J31094k5240j24079J0819
925f1793J56986n3639j38337P3031J04608m6375j28875O7457J34413j06639r1182
936i0345Q7864R0744q0834j13872J23351Q0426j26443n2031R9121P6221j25619
947c1417o5621J51074K0866j21738k7900J20731M0484j56884K055J42309k1045
$$ y = [-106535, 50897, 83336, -39625, -89747, 45058, 98579, -71723, -75475, 69186, 66116, -60139, -79921, 82679, 65986, -93450, -42919, 77782, 51232, -86857, -51470, 106893, 23867, -95654, -18661, 87962, 28179, -108372, -7371, 108372, -12512, -89806, 2479, 99479, -9560, -110488, 36965, 90841, -35470, -84973, 29415, 100683, -53698, -89125, 65676, 68962, -52731, -79141, 64626, 80111, -86431, -54387, 76707, 51467, -72612, -61793, 95193, 41554, -96783, -23752, 80856, 34481, -94394, -26937, 107476, 837, -90345, -2481, 88263, 7429, -106443, 16908, 97334, -29109, -81140, 17981, 94202, -31417, -97038, 54036, 74902, -46836, -74736, 45995, 86479, -70405, -68350, 73959, 52914]
958E2914j15052k697J43191k0376j51293N9952J12982m3802j16217L9389J41915
969A00906q3905j11252Q8426Q7444o4905j13890R4655J04581j22012o2404R5026
980A2670P2917r8541q5862J37060M4917j25497k8612J02998N2634j34717k9571
991g9604J45762q274j12370q494J21851R787j49521L4562J22929l9472j04920
1002f7764J9313J34514n1450j27885P9549R1156n6942j04425O4493J19121j05033
1013e353q1349R6447O8256p9583r2369J13897P0725j27012l5625R8333N3013j11828
1025c2448n3879J41924J0753j18577p641J05401K6510j37668O120J33309l3328
1036D0476j00929J1370J18538k1111j35087O2169J00528n4069r2855M0829J19841
$$ y = [52914, -62138, -64835, 78356, 57980, -93313, -33361, 79621, 35819, -80398, -41009, 100906, 17001, -94251, -5825, 81619, 16714, -97176, -2521, 102060, -19952, -82356, 12670, 85587, -12954, -98816, 38244, 83161, -42336, -70948, 32050, 84684, -50033, -79604, 66158, 57884, -54486, -62980, 58871, 68658, -80863, -46301, 76628, 37156, -67764, -48451, 86063, 34613, -93272, -13723, 77433, 20491, -83934, -19441, 99680, -5353, -86702, 9745, 78001, -1582, -93951, 19946, 90671, -36341, -71966, 26367, 79380, -32448, -86327, 55597, 66350, -52227, -59868, 45533, 72043, -65625, -59505, 73804, 40476, -60453, -49083, 69455, 48344, -86743, -24574, 75954, 21885, -70970, -30141, 89700]
1047H9700p8337r9282R2067O8601o7333q8595Q5166R0549j17751m9779R7941M8676
1059G1623q9734o7653J25470L5422j24209j0311R7487L1230j18728k0370J37827
1070F8054j9907j07511J2381J04074j477j32599L9129J15369n3815q8548L1381
1081c3469J10893n0976j14703Q4066P7845o6746p9703O1588R9661r8886o9781
1092h0211R9661M7512p6570o9987J01547N9676j22788k1512R6558L0039r7597
1103c3672m0435J29210K983j15167J0791R3472J0084j19886J2001J25546m5125
1114B9802r2592K9208R8994k7765j20750O6837R2914o8455p4990M9199R9031p6708
1126D725q9671R9148N4582p5848o5527Q0988P5591j14131l9885J02528K8489q5292
$$ y = [89700, 11363, -87919, 4148, 72749, 5416, -83179, 1987, 92536, -25215, -74994, 22947, 71623, -18111, -85764, 39706, 75128, -49081, -59392, 38095, 69325, -49403, -69773, 68054, 48147, -59364, -46983, 57091, 55614, -76985, -37856, 77513, 23698, -64850, -33469, 77424, 26448, -88255, -4189, 73656, 6910, -72793, -11205, 88456, -10430, -80211, 19450, 66962, -9608, -79595, 21952, 81628, -41160, -62672, 33886, 63925, -33672, -74107, 55103, 58086, -57081, -46290, 47182, 57266, -62620, -50619, 74927, 29802, -62790, -33582, 65412, 37647, -83103, -16266, 76648, 8193, -66797, -17598, 81433, 4725, -84946, 14202, 68784, -7064, -72591, 8397, 83988, -30143, -70028, 32500, 60989, -24303]
1138b4303m8926J13703K7548j21508L755R2837J2271j02834j2401J26557k6106
1149D0593j02799K8018Q9298j1230j15905M0528J08389o3078p7507M2793R1185
1160G0285n1236j03006Q6307O9718p7109o0770O3867Q2710r5858o1747J05444
1171B8605L2975q0938m9943R5225M9028j20649j1775R9638J1100r0727k6398J19363
1183E5504l264j14218K5074Q7453n573j04396J5879J17276n0283q7620M2286Q2683
1195F0801l1907j05781O4665Q7297p5263o2583N4613Q0497p1309q0821R8094M6854
1207F5157q0929m7399P5568O3198j07054l4471J04631J4317q2274l3264J03154
1218D0634K1399j18190J2563R2019m404r1928l328J16801l0015j00741M0895P9621
$$ y = [-24303, -73229, 40474, 68022, -53486, -49731, 43106, 55377, -47457, -59858, 66699, 40593, -62206, -34188, 55110, 43880, -72025, -31497, 76892, 13814, -63693, -20900, 70285, 19049, -83957, 2350, 72068, -5041, -65811, -1944, 80766, -15092, -76839, 28605, 61580, -19358, -69301, 25924, 74952, -45697, -57472, 42166, 53266, -37461, -63859, 55504, 52240, -61978, -36904, 50549, 44976, -59420, -43541, 73735, 23452, -64168, -21882, 60801, 28894, -76887, -12222, 75075, -188, -62771, -8158, 72339, 1030, -79791, 18303, 65157, -15772, -63171, 12397, 75595, -31459, -65930, 38701, 53018, -29256, -62520, 40634, 62033, -56157, -43594, 48425, 44021, -47907, -51235, 65566, 35551, -65190, -24295, 55326]
1230E5326k2112j00580M1594J01727o8884p0263N2835P4598n1266r0658Q3686
1241F003O4033q3146m6601O4128O6366q6802n6131J03871K4503q1416l3120Q4262
1253B5950M0750j11085q329R8291j647q1852j5459J04959m615j08436L1350Q1651
1265E1528j7782q8652J8270J06376n1287q2537N1676O9457l6851r0237O1831Q0978
1277G2770p9674n2353O0448O2793o7145p0555R5553L9402q4255l1715P1569M9209
1289F6047r7481k9219J02490L851p8850j8027Q9838J5564j08639J6297Q7951j6069
1301C3753p8662K988J01434k8989r3773M6705O9374k9905q2426L9091R0618o7472
1313B736o3159N9254N7519m9879p5325P7278N7314q4521l4436O4636M8922p8419
$$ y = [55326, 33214, -67366, -25772, 75955, 7071, -63192, -10357, 64241, 12975, -77683, 6003, 70036, -13110, -59711, 4417, 70783, -16019, -72150, 31721, 56224, -25192, -58312, 25950, 66700, -44385, -52714, 45577, 43930, -37922, -53381, 51578, 46963, -61473, -30123, 51528, 33746, -54906, -36636, 69740, 18453, -64084, -12408, 57049, 20198, -70039, -8208, 72770, -6904, -59257, 1191, 63984, -3161, -73716, 21837, 61239, -23016, -54731, 16838, 66047, -31434, -60653, 41837, 45688, -33162, -51189, 38649, 54213, -54426, -38129, 49822, 33753, -44909, -41921, 59513, 30524, -63249, -16544, 52830, 22925, -59501, -20410, 70208, 2736, -60423, -1169, 56350, 6471, -68854, 8424, 65738, -18783, -53219, 11417, 60339, -18080]
1325a8080m6870R9392J5923q1694j6824P6378K8548j00923k530R5260j4154p4292
1337c9866j786R0241q504j00357L7410P4964k9314p3035K2145R2068n0657p5575
1349f2266N8300N6213m1129p2337N6601P1649p8614m2709O3157M5233o0912n8086
1361f4900Q7740L3187q4279j7773O7116L3498q5247k3006R7157m938p5789k468
1373c9702P7252P818r7669K0276Q4026k8446o7959J3812Q5696l0936q6262N3186
1385h908O0928m0222o5644M0312P8389o7478n5721O5962M2910n1965n9179P2365
1397A1749M8786q4855k3174O5774L2359p0886l6636R2629Q931q0542k231O7942
1409B9846J6510q8247J654R0073k2953o7933J0274P5698j2690r0015M0641O9650
$$ y = [-18080, -64950, 34442, 50365, -31329, -48153, 28225, 56773, -44150, -46680, 48580, 34426, -39866, -41652, 48589, 40085, -60272, -22862, 52102, 22788, -50247, -28102, 63966, 13309, -62266, -3966, 52247, 11118, -61219, -4618, 67031, -11583, -54292, 8865, 54098, -6814, -64900, 22840, 56027, -28252, -46025, 21091, 54589, -30658, -53664, 43493, 38555, -37234, -39702, 37550, 45368, -52301, -32025, 52001, 23555, -44404, -30592, 55104, 24168, -62094, -8908, 52020, 11798, -53846, -13534, 64855, -2623, -58344, 7618, 50528, -1437, -60616, 11749, 60535, -24320, -47494, 18280, 50639, -20247, -56883, 35746, 44677, -35865, -38096, 29846, 46356, -41891, -40237, 49836, 26883, -41050, -30776, 44922, 32232, -57783, -17142, 52508]
1421E2508l9599o0070K8138P7785n0551o8621O4392M5562m8246n5668N5613O0479
1433F1722p8711l4631O9050K9531o0232m3093Q2264K5443q5367n569O6696J7400
1445D4503p7019j4012R1764j2533p4027J1366O7824j330q6959K3791P9416l7379
1457A5405n9803K3484P1483l2130p7707N5786N4122m7414n1680M1452O6043o5030
1469e989m9357O9461L1789n3904m4509O7039M1175q3772j5490O8612J7072o5255
1481b3128k6055Q5749M074q0925R022O4724L597p8596O651Q5958l0136o5031K2832
1494b1264O4760j8388q0393M2777O5484m7757n0720L4804O4199m9222o1765O6255
1506H770L8601n3213m2173N3055N0900p4624k9822P0986J8647n7908l1259P3819
$$ y = [52508, 12909, -47161, -19023, 58762, 8211, -60410, 3982, 49544, 1298, -54370, 1243, 61722, -16989, -51620, 17430, 46961, -13271, -56364, 25900, 51343, -34024, -39593, 27103, 44503, -32516, -46528, 45236, 32703, -41324, -29958, 37866, 36536, -50423, -26632, 52784, 15405, -44398, -20914, 50569, 18439, -59268, -3482, 50640, 3226, -48454, -7002, 59041, -5989, -55346, 14115, 45904, -8000, -52509, 14530, 55705, -28067, -43557, 25055, 42127, -23128, -49183, 36566, 40640, -40285, -31263, 33461, 37058, -41538, -34887, 51071, 20935, -44096, -21264, 43496, 25108, -55285, -12508, 52976, 5219, -45501, -10697, 53502, 4280, -57485, 8770, 47371, -5842, -48015, 5040, 55940, -18684, -48506, 22480, 41127, -16781, -48040, 25779]
1518B5779K1015q2746J296O5114O125o8442q471Q4384j5206p2107K0583O0105
1530C7429q865p5991K5432P4723m2991n3942L1241N9749l3697o8997N6199M9589
1542D9879n3847m0411M3334N4248o1967m3634P1090K3566n6191l1388O1633L3808
1554E0120p9136j0788O8688O398o0114j7107P7216J107p7356J5585N9771n261
1566B9123o7221Q311P8121l1301o0932K9464N4908k1494o9119M0638O0315n0792
1578B1m2831L8521N1898m6340n4743O5102L2918n6244l0117N0524M0809o9612
1590b0094k4615P1057R328n6488j9441O6641J5025p8321P150O3228n445n9590
1602c1565j656P5724j8198o8251K8095N2869j6413o3879K5696O7549m4665m8046
$$ y = [25779, 46794, -35952, -34656, 30458, 36583, -31859, -40330, 44054, 28848, -43259, -22676, 37429, 28564, -47427, -21995, 52728, 9737, -44205, -12964, 46785, 13088, -55909, 290, 49879, -3968, -44379, -1045, 53203, -8764, -52398, 18692, 42258, -13933, -45321, 16312, 50120, -29016, -39804, 28884, 35282, -24832, -41939, 35277, 36384, -40972, -25387, 34384, 29123, -38098, -29787, 48334, 17033, -43899, -14435, 40473, 18979, -50140, -9502, 50813, 21, -42810, -4289, 47609, 1269, -53474, 11628, 44546, -11698, -41815, 8709, 49518, -20094, -44709, 26348, 35676, -20812, -40253, 26388, 41413, -36908, -29758, 33470, 28025, -31565, -33221, 42503, 24305, -43946, -15851, 37018, 20605, -43274, -17578, 49971, 5306, -42740]
1614d2740L6962M7356l3653n8200N3170M4084n6189l0490M4203M1451n6135l7585
1626d7766O8895J6707n6323j9131N5338K5481p2530o159O7146l297n4540p475
1638c3654O7351k641p2750K2104N5526j5465n6731J3270O9156l4043n5946L7230
1650f593M4868k6933n6840M0517N3303n3871l4300M2545L8574m4217m4967O2392
1662A4478K6655n8031j8929M8582K9355o2781j9552O8930J642n4438q030N7962
1674B5843R493p1530J0900O0417j3981n1913M783O5510j9548o3413L3309M6805
1686C6675k3694n2551K7148N9615m6268m2716M3632L5944l5714m7399N1792L8067
1698D4531n9219k1397M6439K8542n1933k9913O6990J0290n7677p177N0956J6130
$$ y = [-42740, -5778, 41578, 7925, -50275, 2895, 46979, -9210, -39700, 4503, 45954, -10181, -47766, 21129, 37836, -18487, -37618, 17720, 43201, -29329, -35488, 31658, 28361, -26179, -33654, 33697, 31056, -41694, -19590, 35936, 20471, -36260, -22990, 46166, 12123, -43823, -6593, 38275, 11342, -45498, -4981, 48322, -5549, -39849, 2696, 41270, -2947, -47914, 14478, 41133, -16898, -35827, 12755, 42110, -20671, -40223, 28707, 30349, -24089, -32119, 25843, 35336, -36194, -25294, 35123, 21142, -30771, -25988, 39522, 19974, -43439, -10130, 36675, 12981, -39570, -12422, 47193, 925, -41791, 1841, 37785, 2071, -45328, 6464, 44531, -14688, -36085, 10354, 38896, -13037, -42950, 24040, 34330, -23347, -30524, 20432, 36562]
1710C6562o6558j021O5381j1742n1157K476N8870o793o7106K6053N1771k3321
1722A3415m7872J7306O0489l4681n1795M1898L7673l1117m6398L9300M7193n4509
1734i098k8715M6371K7713m2612l6660N9547K1968n9883r868M7907J8968n7709
1746b2071j4054O7281m878n3993K363N2254K426o5479J4685N8680k2680m6233
1758c1699J3041N5920k1393n8872L7586M2068l0576m2423K8369N1956m5985l8640
1770d0648M7312K8116l7352l7872M8645L3787n9598j5529M7795J8998m8304k3833
1782c8483O3489O278n7502N20M7491Q829n9697J218O3208j7268m8376J0814N0806
1795C1327r984o1354K8253M9499l0464m0564K1789N1585l4243m8068M5851L1231
$$ y = [36562, -29996, -31017, 34364, 22622, -28535, -26059, 32811, 26018, -41088, -15035, 36736, 13415, -34457, -17151, 43338, 8657, -43138, -1240, 36433, 5316, -41082, -1782, 45411, -9098, -37813, 8558, 36271, -6341, -43001, 16546, 38514, -21369, -31237, 16670, 35638, -22071, -36125, 31156, 26278, -27715, -25352, 26902, 29328, -36151, -21466, 37214, 14534, -31699, -18658, 37262, 15869, -43003, -5417, 36651, 6075, -36348, -7979, 43977, -2008, -40648, 6664, 34780, -2572, -40444, 8201, 41988, -17610, -33139, 14656, 33654, -14650, -38483, 25006, 31284, -26218, -25698, 21793, 30622, -29075, -27857, 35351, 18083, -30293, -19479, 31327, 21343, -40011, -11758, 37741, 7277, -33287, -11498, 40087, 5844, -42224, 3627, 34858]
1807C4858l5425l6020L7980M1139n4231k4688M9848J8687m2006k7733N4905J8358
1819C5672n9718l080M6768R987n1559j0230O3335q095n2402R334M6198j670n8745
1832c4205J5464N6049k7059m1671J7934M7541k1499n3694L8434L8509l4861l4380
1844c3438K9386M3920m4067l4631M9532K1142l8686k8411M5389K8391n8125j0980
1856c0578M8978R799m4615j6985N8198L610n6866P546M4406R56n2346L721N9209
1869C5033k0701m5224J7248M3216j2699n3971K8286M5759l4153l4046K4560M2482
1881C5790l2499m3253M6262K6647l8201k6729L5638L4546n0957k1042N0163J1250
1893B7615m0087j9841M9766J4837n7958K280M5248J788m5561n293N7689j0715
$$ y = [34858, -567, -36587, 1393, 42532, -11699, -36387, 13461, 32148, -9858, -37591, 17314, 35672, -24046, -27126, 19642, 29629, -21930, -32160, 31175, 23080, -29322, -19988, 26210, 24540, -34205, -18741, 37308, 10249, -31422, -13488, 34053, 12554, -41140, -2706, 35803, 942, -33438, -4052, 39868, -4199, -38830, 10702, 31844, -6842, -35253, 10136, 38527, -19598, -30578, 18400, 28199, -16416, -33401, 24797, 28407, -28459, -20913, 23493, 24449, -27897, -24176, 35033, 14332, -30892, -13644, 29572, 16873, -37098, -8812, 36947, 2794, -31252, -6692, 35790, 3291, -39962, 6300, 32947, -5254, -31983, 3655, 38201, -12756, -33798, 16365, 27615, -12472, -32313, 17453, 32290, -25668, -23388, 21860, 23648, -21913, -27206, 30483, 19768]
1905A9768n0501J6356M0464p803n0231J6837N1773l0512l7132K3845L8527k2773
1917H618m6654L8591L3907l8635k5637K9960L5222m1223l0605N0238J4859l9498
1929a0857j8947M1042K2940n4425p144M8435J774m0227j0209N1676O66n3974J2656
1942a6594M1092n894m4832O361N3618k2916m2218K3274L5744j5899m6121K8550
1954e835M1714l7808k7345K8134L2803l1474l7099M6249K1715m1096j7700L4568
1966F826K6355m7637j6708N0765L860l9060j0853M4205J0592n4530O009M4515
1978B4339o018m0108j59N1104j2474m7980K1915L5262j2903m2427J7432M7170
1990C5153l2528l2634K7871L0461k3548l9538L7201L0807m1441j8730L1395K6442
$$ y = [19768, -30733, -14377, 26087, 18284, -31947, -15110, 36663, 6151, -30981, -7136, 31391, 8618, -38036, 555, 34462, -4173, -29810, 150, 35372, -5851, -36456, 13782, 28641, -10857, -29804, 11238, 34178, -20247, -27391, 21044, 22818, -17409, -27618, 24058, 24724, -29250, -16594, 24498, 18604, -26228, -19867, 33751, 10835, -31383, -8109, 27635, 11736, -34385, -5835, 35879, -1929, -29274, -1140, 31663, 189, -36910, 9339, 31054, -10042, -27742, 6826, 33181, -14456, -31164, 19601, 23461, -15599, -26452, 17753, 28345, -26185, -20176, 24339, 18321, -21787, -21946, 29158, 16684, -31296, -9381, 25881, 12978, -29449, -12017, 35153, 2625, -30009, -2138, 28323, 4775, -34763, 2438, 33245, -8196, -26926, 4469, 30911]
2002C0911l8339k5754M9126J0156m0518j0201L7526J6689n0602l379M8257n670
2014A8202l7425l024M5909k523n0908J7026L8599j3369l7559R877M7654k4420
2026H039l9386K8577K9400j9923l8009K7896L7877l9512k3209L1730K4484l0428
2038b464l0924M3912J8388m2403j0455L3396J9295m3316j3825M9797o01l9100
2050a8300l080L9423O315n0564Q732M3239j2582l5321M817M5216j4123m5403K5750
2063e881L2362j8908l4908J8677M2136l3110l0483L2699K3438k5146l2184L6054
2075D746K6955m3284j3309L3164J8490l6171k1048M7944O700m1609l283L5032
2087A4327J0945m6035j499M7272r921l5677L135M0033m265m7933J9473L7021j8664
$$ y = [30911, -7428, -33182, 15944, 26100, -14418, -24619, 12907, 29596, -21006, -24385, 23872, 18202, -19223, -22247, 23662, 21139, -29769, -12743, 25856, 12487, -25072, -15195, 32459, 8039, -31347, -2770, 26630, 6707, -31302, -3406, 34471, -5041, -28250, 3480, 27964, -2464, -33388, 10524, 28912, -13491, -23946, 9450, 28745, -14571, -28396, 21401, 20800, -18300, -21380, 18043, 24358, -26206, -17474, 25765, 13183, -22138, -17321, 27895, 13772, -31631, -5881, 26481, 7573, -27335, -8658, 33478, 368, -30115, 2584, 26022, 876, -31308, 4746, 31701, -11583, -24892, 8272, 26762, -9409, -30457, 17487, 24187, -17422, -20705, 14327, 25272, -20763, -22262, 25010, 15089, -20588, -17453, 22580, 18315, -29618, -10145, 26876, 8212]
2100H212l1977J2427M1505k4100l7155L1442K5126k2747l0957K6815L4033l9587
2112f963j9953L4180J7499k9600k5289M1747J6149m4216m982L3565J1987l9422
2124a5298j0187M7894m090l8506L366L5337K007m5884J0047M2080j7459l1339
2136b2032R375L8299j4410m2029K7515K9266k2660k7945J9106L6453l2265k7771
2148b9098L4740J8286k5803k5829L3249K4019m2579j0214L4412J1469l2538j7090
2160b6976M4330M695m1839K736L2629N161m0725J27M5186j3546l3409R231L3832
2173B1432o215m3272K0084L4797k2884k6668J5128L4874k3160l4034L3250K1050
2185B4382k5754k3512K5494K9269l8331j6981L5605J1247k8187j9427L7894J3609
$$ y = [8212, -23765, -11338, 30167, 6067, -31088, 354, 25480, 2733, -28224, -1409, 32624, -6963, -26916, 7264, 24763, -4837, -30126, 11621, 27770, -16446, -21428, 12137, 24124, -15298, -25485, 22409, 18319, -20187, -16821, 18516, 20523, -25361, -15314, 26766, 9307, -22032, -12657, 25642, 11232, -30797, -3282, 25984, 3324, -24621, -5515, 30938, -1327, -29098, 5642, 23928, -1875, -27704, 5545, 29564, -13015, -23229, 11183, 22652, -9886, -26976, 17354, 22049, -19790, -17054, 15575, 20736, -19989, -19862, 25324, 11778, -21631, -12400, 21432, 15217, -28055, -7971, 26826, 3942, -22726, -7598, 27276, 4116, -29918, 3332, 24382, -1372, -24884, 610, 29879, -8452, -25433, 10172, 21419, -6768, -26195, 11699, 25308]
2197B5308m2844j095L2683N334l4188p755M4752o474l7031Q936L0539j746m0390
2210b3971J1053L9804k0695k8015J3514L1477j4483l7508K7727K6433k5938k1604
2222b2206J9724L0115l0754k4637L6564J2952k7231j8159L0490K0043m1181o920
2234b1200L5071M664k9617j1485L9723K877m0775P145L0304m48l5298K072M1908
2247B4941j5393l1672J3984K8122q479l7623K0008L2654k5736k2473J7927K8199
2259B4459k2223l0621L3577J7816k7976j6734K4728K3804l6164j4623L6656N910
2271A8609k7761j2493L3849J0803m1621K487L2386j032l0474l715M0604p824l6588
2284b2770J4089K7160o388l4129J1334L7048k2969k5507J8250K5402j5916l2467
$$ y = [25308, -17536, -18631, 14052, 19386, -14802, -22557, 22195, 15721, -21310, -12374, 18165, 16419, -23971, -12918, 26886, 6191, -21824, -8310, 23167, 8684, -28824, -1097, 25336, -602, -22206, -2482, 27633, -3121, -27758, 8806, 21758, -5473, -23632, 6858, 26901, -14280, -21200, 13871, 18535, -11082, -22567, 17156, 20033, -20742, -13597, 16707, 16259, -19039, -16967, 24941, 9548, -22124, -8140, 19982, 11503, -26120, -6112, 26542, 806, -21667, -3740, 24459, 2236, -28385, 5192, 23008, -4968, -21702, 3026, 26830, -9334, -23957, 12699, 18609, -9152, -21645, 12204, 23007, -18614, -16127, 16259, 15227, -15247, -18962, 21642, 13818, -22770, -8681, 18479, 12091, -22038, -10704, 26344, 3375, -22132, -3882, 21520, 5604, -26863]
2296b6863K7360K4456k8780j6726K1117K3846k8533k1861L6397R738k8700j1674
2308b0223K8193J5970l8651m696L5568p97k7976o297L6134M93l9321J0434K9077
2321A7908n776l0235M067L8405j6975l0428J8414K4070j1690l1853J9665L0586
2333B6158k7990j9173K0856K2065k1771k6325L3028J5585l0611j0694K3964J8300
2345B3392l3141j2912L7463K049k8602o054L0148Q055l9187M143L2793o261k7698
2358a5812N19L6035q592l5159J6759K5061j0164k9260J1884L4251k3876k3796
2370b2150K1596K0508j6640k8139K6415K3036l1275j2468K2844J7867k6346j9374
2382b4126L6045O895l0161n615K5973J2083l5884l252L5549m665k6773j769L2065
$$ y = [-26863, 497, 24953, -3827, -20553, 564, 24410, -4123, -25984, 10413, 20151, -8549, -20223, 7970, 23940, -14711, -19407, 16161, 15364, -12612, -18909, 17225, 17718, -21603, -11169, 17908, 12132, -18103, -14036, 24369, 7394, -23034, -4620, 19450, 7760, -24093, -4428, 26158, -1832, -21005, -149, 21916, 145, -26180, 6848, 22433, -8178, -18872, 5092, 23392, -9749, -22661, 14802, 16851, -11751, -17805, 12343, 20398, -18789, -14646, 18147, 11886, -15812, -15293, 20742, 12150, -23009, -6250, 18811, 8647, -20613, -8729, 25522, 1646, -22150, -554, 19954, 3314, -24825, 1590, 24626, -6649, -19117, 3727, 21594, -4752, -24126, 11919, 18814, -11347, -16962, 9011, 21094, -14790, -18042, 17507, 12842, -13931, -15700, 16365]
2395A6365p32l7419J2625K8001j0271k6267O589L3887j6731k9100K1277K0580
2407A8804j4192k6377J8757K7940k8414j7057K3372J6389k0609k2560L1109J4283
2419B1445l1704o864K3877J3454l0154j0858L6469p04k8358j707K7531N145l6023
2432a8451N323L2128r911k4720L636L1412q980l3442J8904K2926j3784k4071J2537
2445f493L0413k3490k2351K3971J6315j7751k2542K4376K0547l1031r857K4044
2457F151J2524k4187j6285L3712N713l0510j740K4507P726l1737k354L4498p159
2470A0859k5659K721K7225j729l4208J2646K7596j3957k2013Q431K9014j6004
2482D922k7428K2685J8050j6775k0590J7645K4200k7283j5315K5606J1497k0477
$$ y = [16365, 15633, -21786, -9161, 18840, 8569, -17698, -11109, 22778, 6047, -23053, -1776, 18804, 4612, -21765, -3008, 24932, -3482, -20539, 2833, 19222, -1387, -23947, 7162, 21445, -10259, -17123, 6754, 20208, -9946, -20804, 15665, 14961, -13397, -15104, 12427, 17572, -18451, -13128, 19000, 9089, -15631, -11995, 19417, 10437, -23005, -4101, 18825, 5041, -19030, -6493, 23920, 430, -21921, 2050, 18365, 614, -21928, 2448, 22995, -8036, -17893, 6151, 18675, -5512, -21797, 11915, 17628, -12882, -14622, 9885, 17611, -14126, -16480, 18018, 10859, -14800, -12079, 15146, 13417, -20791, -8145, 19451, 5494, -16519, -8088, 20926, 4922, -22506, 179, 18229, 1454, -19136, -1491, 22709, -4574, -19889, 5717, 17214, -3263]
2494c263j7638K8680J2486l1843l533K4024P834k6816q467L4192j999k8323L074
2507a1592K4185K042l1932O009L0729j2893k2057O757K6456r133l0317J9008K1414
2520A8676j6808j9185J3175K5831k2152k0614K5443J2415j8679j7204K2439J8021
2532B1358l0419p877K5322O952k2238j1918L0832M111l0490K648K2853L192k8030
2545a3704n15L2263r290k4460P447K2873m099l0013J3429K5512j6957j8449J0849
2558e114K3909j5336k4857K3471J5309j8910j5821J7765K0409k6236j3071K6169
2570G687P582k0352j3134K6261J0358l0949o92K3889K824k3760n498L1227l563
2583A1880k7562O921K1782j639k7819O760K8839j4631k0699J0625K1914r972k6830
$$ y = [-3263, -20901, 7779, 20265, -11578, -15111, 8913, 16747, -10069, -18536, 15656, 13657, -14666, -11592, 12593, 14635, -17297, -11288, 19441, 6548, -15509, -8752, 17704, 8571, -21746, -2738, 18676, 1868, -17317, -4142, 21689, -463, -21077, 4366, 16781, -1898, -19102, 3337, 21358, -9061, -16938, 8384, 15336, -6902, -18820, 12012, 16123, -14367, -11719, 11134, 14326, -13704, -14219, 18044, 8754, -15706, -8259, 14614, 10515, -19498, -6069, 19443, 2486, -15963, -5114, 18795, 3459, -21398, 2073, 17382, -1528, -17349, 416, 20825, -5411, -18482, 7687, 15269, -5083, -18217, 8044, 18402, -12547, -13239, 10650, 13474, -10286, -15784, 15443, 11880, -15682, -8761, 13021, 11382, -16437, -9677, 19162, 4531, -16168, -5543, 16371, 6399, -20431]
2596b0431J9367J9827j9858j4768J4101K0806k0288j8987K6240R800k0285j1912
2608a6388K0953J4364k8756n823K5860K902k1143q199K8137K643k9433M822K2371
2621A2310j168k4487J306K9764j0375k3524J0703J9685o124k6263J3384K3958
2633A9169j8600j6218J3503J9241j5179k1866K3199J4019k1214j1238J7296J6216
2645A8328k4426j1349K7107L779k0394q414K3609Q253k9433Q95K4157j257k1653
2658a0798k590K8298m475k6888R989J9832n090k3489P203K6649j5543j9576J3810
2671b668J7850j0960k3267J8597J8742k1163j2217J5645J6438j9437j6326K5769
2683G003P586k0823p771J9447J1698k7221m562K6453m60k0762l747K4814J428
$$ y = [-20431, -1064, 18763, -1095, -15863, -1762, 19044, -1244, -20231, 6009, 15809, -4476, -16388, 4565, 18929, -9827, -15650, 10210, 13112, -8031, -16230, 11907, 14550, -14883, -10061, 12310, 11142, -13345, -12039, 17725, 7350, -16174, -5471, 14214, 8090, -18173, -4789, 19169, 569, -15649, -2146, 17095, 1916, -19950, 3249, 17268, -3946, -15184, 2112, 18328, -6098, -17447, 9660, 13439, -6955, -15369, 8240, 16493, -12940, -12045, 12112, 10855, -10798, -13388, 14910, 10435, -16453, -6464, 13368, 8278, -15211, -8008, 18641, 3098, -16478, -2668, 15182, 4222, -19045, -448, 18294, -2869, -15086, 559, 16997, -2440, -18766, 7003, 14589, -6234, -14005, 5442, 17140, -10081, -14643, 11810, 11350, -9412, -13159, 11655, 13083]
2696A3083k8276O744K1294m754k0815K653K7032j0813k2419J3107J7009q668k1557
2709a6380J2761K2265j9411j4496J5395J5284j4788j8770K2250J2027k2010p791
2721a3664J7366J2648k2817r863K6277K058k0418m120K0942N756k7119J856K4174
2734A3076m594j9263K53K4386m607k5551J1678J8335q031j9740P770K3944j5845
2747A811j7839J5923J3899j1631j9136J7539J6734k1626r481J6583J2006j8160
2759c378j3645K4753O083k1699l867J8016Q116k4051l154K5039l130j9092n46
2772a0555K1345L49k5861P466K1075p977j7939M177K3825j0647k1796J5025J4915
2785A3402j0334j8168J2704J9908j9516j2776J7199J0831j4161j5491K0968J0847
$$ y = [13083, -15193, -8449, 12845, 8091, -12724, -10071, 16961, 6148, -16271, -3164, 13845, 5177, -16380, -3619, 18646, -765, -15261, 134, 15418, 630, -18140, 4110, 16137, -5873, -13664, 3702, 16350, -6467, -16330, 9947, 12005, -8413, -12533, 8409, 14165, -12954, -11098, 13076, 8482, -10781, -10528, 13858, 9251, -16300, -4622, 13713, 5682, -14058, -6288, 17656, 1811, -16028, -105, 13794, 2163, -16973, 566, 17300, -4326, -13807, 2776, 14782, -3378, -17023, 7730, 13813, -7886, -11753, 6263, 14379, -9672, -12826, 12213, 9083, -10009, -10555, 10790, 11139, -14722, -7256, 13819, 5842, -12097, -7920, 15905, 5258, -16538, -1513, 13402, 3068, -15100, -2396, 17512, -2004, -14780, 2419, 13250, -911, -16402, 4566, 15413]
2797A5413k2517m828J6935Q852k0382q124K5151L30k0559n8J8532L359k4482K646
2811i732K3333p424j7062K740K1230n387k3528J2583J6967j0400j6522Q622K0701
2824A6121j5286j6344J6950J1409j2514j5170J5974J5204k1837p686J7801P894
2836A2516j6246j1336K3108M726k1727j195J7250M899k1452k408K4513m891j8368
2849a0611K842J8327j005k3854Q587J9411j0073j5179O266J9640j0569j9526J5910
2862A66J3030j2492j4033J2140J7043j8518j1417J7813Q065j4110j1924J9094
2874D857R444k2497k585J7450M533j7863o343K3658r91k0310K783J6733J242k1914
2888a1803L490K2210q951j6010N522J7486n777k1350J2892J5862j2434j2941Q987
$$ y = [15413, -7104, -11932, 5003, 13855, -6527, -14651, 10500, 10830, -9729, -9787, 8745, 12104, -12378, -9732, 13601, 6177, -10885, -8145, 13085, 7698, -15830, -3247, 13720, 3320, -13202, -4580, 16121, 835, -15509, 1441, 12850, 336, -14834, 1140, 16344, -5493, -13179, 4622, 12516, -3730, -15066, 8042, 12768, -8959, -10154, 7096, 11995, -9457, -11865, 12648, 7757, -10611, -7769, 10558, 9553, -14301, -5714, 13697, 3624, -11555, -5289, 14351, 3782, -15744, 166, 13196, 704, -13329, -1189, 15854, -2664, -14081, 3732, 11797, -2313, -14237, 4857, 14301, -8196, -10781, 6669, 11202, -6661, -13004, 10654, 9663, -10647, -7864, 8869, 10111, -11803, -8313, 13897, 4946, -11064, -5542, 11944, 6167, -15183, -2291, 13571, 1137, -11804, -2817]
2901b817J7689j4759j4913J7862R072j3491j1792J5198J2963k1192n665J8102
2913F257M435j5654p995K0998L522k1665J560J6393J599j8336j450K3034o200
2926F498j7762N551J5878k831k0590Q603J8806j2214j3317P976J6267j0067j8057
2939a5259J6616J1427j4141j0391J2083J4444j8158j0375J9128N414j4180q626
2951a2018J7080Q226k1997j175J7529J589j6197m598K1898j395k0046M958J5325
2964I179j240j8922L362K1407j0387j4864Q152J4449o287j9004J2656J5049j4092
2977e42j0737R794J4565j3538j3631J8226P112j4299q208J3939J0875j9790n097
2990a1331J8508J892j4461n630J8942L085k1442L252J5914r65j6605J09K0861
$$ y = [-2817, 14872, 113, -14800, 3062, 12134, -1357, -13149, 2049, 15012, -6180, -11845, 6257, 10692, -4962, -12957, 8041, 11563, -10102, -8542, 7851, 9450, -8886, -10336, 12698, 6498, -11264, -5713, 10165, 7334, -13256, -4653, 14153, 1939, -11378, -3402, 12865, 2798, -15259, 1357, 12784, -1357, -11748, 335, 14779, -3379, -13754, 5374, 10788, -3392, -12018, 5062, 13288, -8709, -9884, 7645, 9234, -6963, -11561, 10337, 8942, -11104, -6146, 9179, 7939, -10983, -7621, 13786, 3399, -11465, -3313, 11136, 4849, -14155, -1499, 13550, -542, -11279, -1485, 13080, -458, -14089, 4137, 11249, -3050, -11258, 2681, 13556, -6234, -11331, 7177, 9069, -5392, -11022, 7920, 11005, -10437, -7185, 8729, 7764, -8841, -8732, 12129]
3003A2129o479j7303P639J3600m071j8012Q595J7558j3009j1717R642J2742r453
3016A861j5895J5786J0377j5172p392J1638J1574j6456r101J9179L510j4863n311
3029a0265J5534O535k0612j95J7687j276j4488k361J9412k003j9547O694J4083
3042I198l442j5873M319J8813j0307j4055R390J2267o853j6406J2057J3863j4930
3055a959q221J0306J1384j2688j1915J7626N907j4651n324J2824Q454j8287l942
3068a0486J8581m24j3751k977J6529J952j9790M137J5504l793j3978J300J8400
3081A1204o480j6325R295J1785n669j4652P685J6000j3303j0146J0602J0047r134
3094I09j3596J5120R280j5663n264J1453Q717j4550p972J8506J437j4167k636
$$ y = [12129, 5650, -11653, -4014, 9586, 5515, -12497, -3902, 13656, 647, -11070, -1428, 11314, 1861, -14034, 1752, 12129, -3043, -10435, 1203, 12777, -3679, -12780, 6399, 9909, -4954, -10265, 5269, 11804, -8808, -9003, 8684, 7408, -7080, -9441, 9971, 7968, -11579, -4885, 9198, 5756, -10117, -5798, 13015, 2708, -11347, -1957, 10310, 3457, -12949, -892, 12971, -1959, -10180, 126, 11510, -1178, -13093, 4533, 10440, -4211, -9535, 3289, 11743, -6544, -10486, 8095, 7671, -6080, -9057, 7472, 9424, -10366, -6229, 9275, 5482, -8496, -7196, 11204, 4724, -11601, -2306, 9479, 3810, -10842, -3157, 12843, -460, -10606, -4, 10043, 909, -12687, 2433, 11713, -3950, -9214, 2239, 10956, -3594, -11566, 6940, 8377, -5790, -8426]
3107h426J3815M931j8737N69J6806l255j2677k74J6362k324j7993P922J2569n157
3121D131j3202M394J6848j0517j2992J1085R709p984j2774J1197J2443j5041p121
3134i824J1921P523j1091j0167J6522M967j5450k160J1868N519j5592l672J8220
3147H584k157j3255k38J3958J184j8137M727J4872n991j1527K596J5790o517j5635
3161a1746J0747J0089p184j1563P387J4236j3033r311J2136P137r062j0982J3870
3174B721Q085j5825l234J1994N373j2967o680J7741M30j4403N1J2187L068j6738
3188h197J056J6339m779j2053K248J3640k557j6507Q086J2058p194j0853N447
3201c266J4172r784j2230J2629P115q280j0293J0074J0971j4789n369J2544M887
$$ y = [-8426, 5389, 10320, -8417, -7848, 8958, 5703, -6974, -7248, 9114, 6790, -11203, -3281, 9288, 4131, -9071, -4677, 12171, 1654, -11338, -253, 9456, 1472, -11302, -105, 12338, -2703, -9824, 2097, 9620, -1471, -11638, 4884, 9851, -5599, -7759, 4109, 9628, -5964, -9636, 8584, 6427, -6828, -7066, 6892, 8076, -10061, -5334, 9538, 3547, -7980, -5384, 10406, 3889, -11746, -999, 9090, 1906, -9657, -2270, 11966, -1067, -10378, 1758, 8895, -167, -11149, 2721, 10806, -5019, -8253, 3741, 9114, -3853, -10533, 7208, 7638, -6765, -6714, 5473, 8541, -8197, -7141, 9198, 4419, -7634, -5386, 8254, 5697, -10810, -2724, 9334, 2140, -8713, -3266, 10906, 1122, -11108, 1521, 8636, 356, -9937, 137, 11108, -3681, -9050, 3494, 8381]
3214H381j0527q425J5720L988j5511l09J1527L349j4157k420J6958l055j2869
3227g350K115J2164k71j6077M808J4001o865j0452M113J3085o157j4060J1106
3240A60Q736q717q619P348J2145j2630q509J2918N388r648q005J2168P384j5793
3254e674j673J1763L102j1435n396J6186J50j4452K045J1070J129j4622J824J5526
3268I543o414j0640L559J1603l066j4681Q412J1149q802q630N883J1570q984j0999
3282a0497J2488O226r182p338R271R181j4006m563J2743K614r712o201J3836L454
3296H314j5071J040J0805J365j2203j570J5662l541j2524L995J0305j135j4209
3309h767N205J3196q306q936N327J0406n726j2753J0477Q660r741o597P151R825
$$ y = [8381, -2146, -10571, 5149, 9137, -6374, -6683, 4844, 8193, -5964, -8384, 8574, 5519, -7350, -5235, 6929, 6658, -9419, -4611, 9390, 2525, -7927, -3814, 9271, 3114, -10946, 160, 8896, 179, -8440, -1092, 11053, -1577, -10086, 2832, 8220, -1428, -9433, 2735, 10119, -5674, -7347, 4416, 7518, -3917, -9313, 6873, 7023, -7429, -5384, 5686, 6815, -7807, -5983, 9543, 3129, -7511, -3952, 7651, 4585, -10096, -1684, 9465, 663, -7967, -2084, 9486, 502, -10497, 1991, 8217, -965, -8303, 968, 10149, -3857, -8420, 4323, 6937, -2775, -8976, 4860, 8314, -6757, -5717, 5088, 6453, -5750, -7320, 8342, 4801, -7723, -3728, 6577, 5442, -8767, -3562, 9634, 1328, -7608, -2281, 8125, 2399, -10354, 123, 8783, -958, -7555, -404, 9421]
3323I421j1258p684J3071L550r443n673J1195N989j4670j343J2078P06j0092l597
3337g750J4272m2j4082L513R740m63j2070J470J4418o402j0567N543R386l452
3351C514j2682P765J0432r506o689O478R341q472r677J2087M840r395n385Q866
3365A517P504j2832l970J2622J099r572l688J1928K622j4214K307J0544r25j0495
3379e553n30J3940l907j1517N222Q420k423j1376M631J2158q189q249O606P929
3393G162n424j0882R951P547j0305m810P384P576j0069o599J2706K202r647l229
3407f437R415M856j3260o00J1445q01q873j672J2131n55j3302M524R096k463r712
3422f208J828J2632o407r402O792P144l952j0534O955R843r951n204O900O836
$$ y = [9421, -1837, -9521, 3550, 7100, -2343, -8016, 3179, 9168, -5502, -6845, 5233, 5939, -4153, -7750, 6522, 6480, -7602, -4089, 5651, 5188, -6882, -5412, 9006, 2604, -7963, -2420, 6966, 3514, -9168, -1403, 9029, -477, -7166, -688, 8653, 181, -9496, 2591, 7431, -1964, -7349, 1517, 9021, -3811, -7781, 4841, 5940, -3632, -7320, 4608, 7230, -6984, -4677, 5867, 4942, -5553, -6083, 7857, 3950, -7567, -2345, 6075, 3652, -7724, -3093, 9065, 876, -7373, -767, 7162, 1738, -9144, 807, 8354, -1951, -6761, 623, 8199, -1870, -8469, 4237, 6439, -3208, -6437, 2978, 7834, -5426, -6026, 5419, 4618, -4255, -5927, 6204, 5649, -7653, -3129, 5967, 3504, -6208, -4380, 8252, 1845, -7557, -765, 6379, 2427, -8107, -1152, 8691, -1260, -6464, 436, 7272]
3436G272p406q530J1641M089j0314k639P870N627j1233l428J2350l37r010j668
3450e716R950K125j3163K585J0358k727q552N53J1653l744j1207O426P688l698
3464B531r167M249J0974q700o907P534N902n940q782R602O448j0425l123P601
3478A797M931q991n338J2182J147r910r81Q311L371j1891j76J1693k719q335L69
3493d540J0075j179j1585N122Q363m109p755K520J0677o227q595P265N876m930
3507I78q101O696Q294r432m625P744M616p035o520J0435L552j0158j411P590L600
3522F223r761k588J1546j471q580K94Q657J064j1757K517J0059l729p441J530
3536c437R647l330j0235O602O657n094o754M346R127q055o325Q089M438n576p037
$$ y = [7272, -134, -8664, 2977, 7066, -3248, -5887, 1983, 7610, -3623, -7051, 5299, 4962, -4048, -5716, 4234, 6359, -6804, -4219, 6139, 3412, -5140, -4587, 7066, 3322, -7885, -1459, 6229, 2531, -6636, -2387, 8587, -113, -7020, 514, 6416, 476, -8306, 1296, 7744, -2681, -5804, 1797, 6728, -2263, -7601, 4581, 5728, -4182, -5163, 3148, 6519, -5372, -5548, 6145, 3426, -4909, -4540, 5535, 4356, -7229, -2107, 6256, 2147, -5608, -3088, 7589, 1362, -7233, 32, 5908, 978, -7123, -427, 7867, -1565, -6190, 1554, 6170, -865, -7385, 3050, 6602, -3556, -4967, 2623, 6223, -3538, -6126, 5420, 3949, -4631, -4337, 4320, 5384, -6373, -3856, 6203, 2474, -4967, -3437, 6210, 2880, -7355, -753, 5904, 810, -5944, -1598, 7529, -526, -6851, 1238, 5676, 100, -6937]
3551f937Q355N778j0210k360P811L364q234m120J0961P67r663L41P632J905j0304
3566d914K65J0771l475p497J662Q266j098j0666M844Q220n263o237K869R036n895
3581H88q119P881M821n306o327O493O710r262l338P825K679o387m721R257K884
3596E978j0115J06P135J853q336k089J0781j904q283K053O953q8r564K701R106
3611F287m773o429K593P873l448q804O497O284n922n470M407P728p589n554Q228
3626A908L064n964m862P523M682r483j607P518J644o746l265R680N08r231J442
3641c189O644N08q562O52R996l882p139K677O855j626r067M908P059n363n258
3656d787L425P002n081p020P600M006n990m507N791N800q621k977Q190J279n815
$$ y = [-6937, 1418, 7196, -3014, -5374, 2437, 5801, -2433, -6553, 4408, 5175, -4488, -4147, 3485, 5390, -4914, -4649, 6122, 2647, -4850, -3188, 5078, 3980, -6686, -1842, 6378, 1115, -5122, -2253, 6783, 888, -7231, 650, 5471, 165, -6162, 331, 7041, -2221, -5559, 2266, 4945, -1442, -6163, 3094, 5978, -4137, -4031, 3104, 4957, -3379, -5468, 5313, 3409, -4874, -2821, 4132, 4044, -5520, -2819, 6287, 1514, -4915, -2322, 5551, 2103, -6701, -204, 6080, 158, -5312, -905, 6823, -766, -6320, 1908, 4972, -992, -5854, 1669, 6351, -3132, -4739, 2779, 4423, -2323, -5588, 4092, 4600, -4631, -3189, 3455, 3963, -4599, -3947, 6049, 2167, -4972, -2295, 4560, 2934, -6133, -1225, 5834, 471, -4787, -1362, 5640, 559, -6461, 1139, 5145, -845, -5352, 439, 6239, -2382, -5359, 2831, 4110, -1705]
3671a705l716Q135K410r227P33O825J96p035j187R594j875q130K854O296j049
3686C119q324K763Q286n290n264L380O257l645p606O580N001n828l980M440N805
3701E694o704m818P976K286o267k895O717L261q741o74P640M2o205j789Q367J30
$$ y = [-1705, -5421, 2714, 5124, -4103, -3370, 3455, 3651, -3384, -4571, 5023, 3148, -4982, -2128, 4168, 3119, -5205, -2442, 5844, 554, -4710, -1330, 4927, 1282, -6324, 256, 5257, -571, -4551, -111, 5694, -1010, -5828, 2148, 4434, -1833, -4728, 1989, 5250, -3491, -4165, 3475, 3517, -2688, -4477, 3890, 4020]
$$ [...]
8191G84
##END NTUPLES=NMR FID
##END=
