##TITLE=1H_Pr DMSO-N
 CCl4
 8 sc, 
 7.06.2022
##JCAMPDX= 6.0         $$ Bruker NMR JCAMP-DX V2.0
##DATA TYPE= NMR FID
##DATA CLASS= NTUPLES
##ORIGIN= UXNMR, Bruker Analytische Messtechnik GmbH
##OWNER= root
$$ XWIN-NMR		Version 3.5
$$ Tue Jun  7 15:57:00 2022 Russian Standard Time (UT+4h)  she@DPX200
##.OBSERVE FREQUENCY= 200.131
##.OBSERVE NUCLEUS= ^1H
##.DELAY= (6, 6)
##.ACQUISITION MODE= SIMULTANEOUS
##.ACQUISITION SCHEME= undefined
##.AVERAGES= 8
##.DIGITISER RES= 18
##SPECTROMETER/DATA SYSTEM= spect
##.PULSE SEQUENCE= zg30
##.SOLVENT NAME= DMSO
##.SHIFT REFERENCE= (INTERNAL, DMSO, 0, 15.7039)
##AUDIT TRAIL= $$ (NUMBER, WHEN, WHO, WHERE, WHAT)
$$ ##TITLE= Audit trail, XWIN-NMR		Version 3.5
$$ ##JCAMPDX= 5.01
$$ ##ORIGIN= Bruker BioSpin GmbH
$$ ##OWNER= she
$$ F:/spectra/data/she/nmr/H-F/1/audita.txt
$$ ##AUDIT TRAIL=  $$ (NUMBER, WHEN, WHO, WHERE, WHAT)
(   1,<2022-06-07 15:55:50.29 +0400>,<she>,<DPX200>,
      <created by zg, POWCHK disabled, PULCHK disabled
       configuration hash MD5:
       00 E9 B6 7A A2 85 ED C7 34 08 36 98 17 FE 4E 26
       data hash MD5: 16K
       64 61 24 78 0A 78 A6 47 EB 36 C6 D5 D6 2F FB 4C>)
$$ ##END=
$$ 
$$ hash MD5
$$ 03 80 30 F9 68 58 91 86 C4 F3 0F FB 2B 48 3F B9
##$RELAX= 
##$RELAX= 
##$RELAX= 
##$RELAX= 
##$RELAX= 
##$RELAX= 
$$ Bruker specific parameters
$$ --------------------------
##$DU= <F:/spectra>
##$EXPNO= 1
##$NAME= <H-F>
##$PROCNO= 1
##$TYPE= <nmr>
##$USER= <she>
##$AMP= (0..31)
100 100 100 100 100 100 100 100 100 100 100 100 100 100 100 100 100 100 
100 100 100 100 100 100 100 100 100 100 100 100 100 100 
##$AQSEQ= 0
##$AQ_mod= 1
##$AUNM= <au_zg>
##$AUTOPOS= <>
##$BF1= 200.13
##$BF2= 200.13
##$BF3= 200.13
##$BF4= 200.13
##$BF5= 200.13
##$BF6= 200.13
##$BF7= 200.13
##$BF8= 200.13
##$BYTORDA= 1
##$CFDGTYP= 0
##$CFRGTYP= 5
##$CHEMSTR= <none>
##$CNST= (0..31)
1 1 145 1 1 1 1 1 1 1 1 1 1 1 1 1 1 1 1 1 1 1 1 1 1 1 1 1 1 1 1 1 
##$CPDPRG= <>
##$CPDPRG1= <>
##$CPDPRG2= <>
##$CPDPRG3= <>
##$CPDPRG4= <mlev>
##$CPDPRG5= <mlev>
##$CPDPRG6= <mlev>
##$CPDPRG7= <mlev>
##$CPDPRG8= <mlev>
##$CPDPRGB= <>
##$CPDPRGT= <>
##$D= (0..31)
0 1.2 0 0 0 0 0 0 0 0.06 0 0.03 0 0 0 0 0.0002 0 0 0 0 0 0 0 0 0 0 0 0 
0 0 0 
##$DATE= 1654602949
##$DBL= (0..7)
120 120 120 120 120 120 120 120 
##$DBP= (0..7)
150 150 150 150 150 150 150 150 
##$DBP07= 0
##$DBPNAM0= <>
##$DBPNAM1= <>
##$DBPNAM2= <>
##$DBPNAM3= <>
##$DBPNAM4= <>
##$DBPNAM5= <>
##$DBPNAM6= <>
##$DBPNAM7= <>
##$DBPOAL= (0..7)
0.5 0.5 0.5 0.5 0.5 0.5 0.5 0.5 
##$DBPOFFS= (0..7)
0 0 0 0 0 0 0 0 
##$DE= 6
##$DECBNUC= <off>
##$DECIM= 32
##$DECNUC= <off>
##$DECSTAT= 4
##$DIGMOD= 1
##$DIGTYP= 9
##$DL= (0..7)
0 120 120 120 120 120 120 120 
##$DP= (0..7)
150 150 150 150 150 150 150 150 
##$DP07= 0
##$DPNAME0= <>
##$DPNAME1= <>
##$DPNAME2= <>
##$DPNAME3= <>
##$DPNAME4= <>
##$DPNAME5= <>
##$DPNAME6= <>
##$DPNAME7= <>
##$DPOAL= (0..7)
0.5 0.5 0.5 0.5 0.5 0.5 0.5 0.5 
##$DPOFFS= (0..7)
0 0 0 0 0 0 0 0 
##$DQDMODE= 0
##$DR= 18
##$DS= 0
##$DSLIST= <SSSSSSSSSSSSSSS>
$$ [...]
##$SUBNAM2= <"">
##$SUBNAM3= <"">
##$SUBNAM4= <"">
##$SUBNAM5= <"">
##$SUBNAM6= <"">
##$SUBNAM7= <"">
##$SUBNAM8= <"">
##$SUBNAM9= <"">
##$SW= 18.0517599122864
##$SWIBOX= (0..15)
0 0 2 0 0 0 0 0 0 0 0 0 0 0 0 0 
##$SW_h= 3612.71676300578
##$TD= 16384
##$TD0= 1
##$TE= 0
##$TE2= 300
##$TE3= 300
##$TEG= 300
##$TL= (0..7)
0 120 120 120 120 120 120 120 
##$TP= (0..7)
150 150 150 150 150 150 150 150 
##$TP07= 0
##$TPNAME0= <>
##$TPNAME1= <>
##$TPNAME2= <>
##$TPNAME3= <>
##$TPNAME4= <>
##$TPNAME5= <>
##$TPNAME6= <>
##$TPNAME7= <>
##$TPOAL= (0..7)
0.5 0.5 0.5 0.5 0.5 0.5 0.5 0.5 
##$TPOFFS= (0..7)
0 0 0 0 0 0 0 0 
##$TUNHIN= 0
##$TUNHOUT= 0
##$TUNXOUT= 0
##$USERA1= <user>
##$USERA2= <user>
##$USERA3= <user>
##$USERA4= <user>
##$USERA5= <user>
##$V9= 5
##$VALIST= <valist>
##$VCLIST= <CCCCCCCCCCCCCCC>
##$VD= 0
##$VDLIST= <DDDDDDDDDDDDDDD>
##$VPLIST= <PPPPPPPPPPPPPPP>
##$VTLIST= <TTTTTTTTTTTTTTT>
##$WBST= 1024
##$WBSW= 4
##$XGAIN= (0..3)
0 0 0 0 
##$XL= 0
##$YL= 0
##$YMAX_a= 515281
##$YMIN_a= -552743
##$ZGOPTNS= <>
##$ZL1= 120
##$ZL2= 120
##$ZL3= 120
##$ZL4= 120
##$ABSF1= 10
##$ABSF2= 0
##$ABSG= 5
##$ABSL= 3
##$ALPHA= 0
##$AQORDER= 0
##$ASSFAC= 0
##$ASSFACI= 0
##$ASSFACX= 0
##$ASSWID= 0
##$AUNMP= <proc_1d>
##$AZFE= 0.1
##$AZFW= 0.1
##$BCFW= 1
##$BC_mod= 2
##$BYTORDP= 1
##$COROFFS= 0
##$CY= 11.3945322036743
##$DATMOD= 1
##$DC= 2
##$DFILT= <>
##$DTYPP= 0
##$F1P= 2.36226072786647
##$F2P= -0.459571619588291
##$FCOR= 0.5
##$FTSIZE= 0
##$FT_mod= 4
##$GAMMA= 1
##$GB= 0.15
##$INTBC= 1
##$INTSCL= 1
##$ISEN= 128
##$LB= 0.24
##$LEV0= 0
##$LPBIN= 0
##$MAXI= 10000
##$MC2= 0
##$MEAN= 0
##$ME_mod= 0
##$MI= 1.114404
##$NCOEF= 0
##$NC_proc= 0
##$NLEV= 6
##$NOISF1= 3.799351
##$NOISF2= 2.8
##$NSP= 1
##$NTH_PI= 0
##$NZP= 0
##$OFFSET= 15.70392
##$PC= 1
##$PHC0= -18027.82
##$PHC1= 6.400741
##$PH_mod= 1
##$PKNL= yes
##$PPARMOD= 0
##$PSCAL= 0
##$PSIGN= 0
##$REVERSE= no
##$SF= 200.130013532006
##$SI= 16384
##$SIGF1= 3
##$SIGF2= 2
##$SINO= 400
##$SIOLD= 16384
##$SREGLST= <1H.CDCl3>
##$SSB= 0
##$STSI= 0
##$STSR= 0
##$SW_p= 3612.71676300578
##$SYMM= 0
##$S_DEV= 0
##$TDeff= 0
##$TDoff= 0
##$TI= <>
##$TILT= no
##$TM1= 0
##$TM2= 0
##$TOPLEV= 0
##$USERP1= <user>
##$USERP2= <user>
##$USERP3= <user>
##$USERP4= <user>
##$USERP5= <user>
##$WDW= 1
##$XDIM= 8192
##$YMAX_p= 0
##$YMIN_p= 0
$$ End of Bruker specific parameters
$$ ---------------------------------
##NTUPLES= NMR FID
##VAR_NAME=  TIME,          FID/REAL,        FID/IMAG
##SYMBOL=    X,             R,               I
##VAR_TYPE=  INDEPENDENT,   DEPENDENT,       DEPENDENT
##VAR_FORM=  AFFN,          ASDF,            ASDF
##VAR_DIM=   8192,          8192,            8192
##UNITS=     SECONDS,       ARBITRARY UNITS, ARBITRARY UNITS
##FACTOR=    0.0002768,     1,               1
##FIRST=     0,             0,               0
##LAST=      2.2672688,     0,               0
##MIN=       0,             -552743,         0
##MAX=       2.2672688,     515281,          0
$$ Real data points
##PAGE= N=1
##DATA TABLE= (X++(R..R)), XYDATA
$$ [...]
320 232763 -149660 -196678 146829 189201 -150772 -198846 189105 167686 -200099 -138820 188039
331 188039 146132 -211456 -131167 236376 89540 -221414 -82074 222607 81830 -250223
341 -250223 -42684 244143 17247 -225726 -22301 243408 -1753 -251181 40328 224486
351 224486 -41988 -222254 47586 237971 -87009 -216923 103402 194471 -96207 -207162
361 -207162 123191 199804 -153703 -165673 147302 162607 -154305 -167220 188658 135008 -193072
372 -193072 -112043 182836 119609 -207506 -99960 224921 62937 -208718 -60356 214274
382 214274 55974 -237968 -17584 226967 -1401 -211968 -2821 230254 -23914 -231186
392 -231186 56759 205488 -55394 -206850 64651 216968 -101001 -193046 110891 174904
402 174904 -105354 -185730 132828 172575 -155866 -141528 147162 141429 -156779 -140862 186337
413 186337 108433 -184324 -90888 176995 96691 -201225 -73722 211874 41597 -195487
423 -195487 -41864 203696 33130 -222459 3180 208265 -16372 -197430 13842 214953
433 214953 -43070 -210793 70080 186392 -66450 -191228 79632 196937 -112864 -170377
443 -170377 117117 157166 -114482 -166524 142161 148929 -158874 -120481 148728 122690 -160982
454 -160982 -117282 185233 84965 -178150 -72634 173832 76023 -196220 -50246 199729
464 199729 23460 -183470 -25573 193461 13205 -206914 20170 189745 -28362 -182938
474 -182938 28335 198056 -57760 -189109 78652 167759 -74363 -174135 90317 175178
484 175178 -119553 -149099 120208 140171 -120401 -147297 147837 126054 -158554 -101626 148803
495 148803 105273 -163707 -95907 183017 64299 -173085 -56309 170550 57292 -191184
505 -191184 -29579 189125 7692 -173615 -10910 184536 -4846 -192517 34928 173342
515 173342 -38640 -168850 40676 181489 -69750 -167742 85045 149206 -80132 -156396
525 -156396 98331 153211 -122842 -127173 119892 122001 -123065 -126187 148977 102942 -154386
536 -154386 -82763 145788 86853 -162308 -73908 177095 44799 -165445 -40404 166146
546 166146 38094 -184199 -9980 177484 -7273 -163845 3777 175750 -22007 -178120
556 -178120 48661 157948 -48567 -156054 53435 165227 -80896 -148265 90643 131857
566 131857 -85878 -139436 105154 131521 -124523 -106469 118397 104673 -124335 -105515 146820
577 146820 81155 -147430 -65267 140672 69158 -157437 -53238 166960 27231 -154352
587 -154352 -25636 158183 20299 -172884 7272 163089 -19890 -152379 17431 164257
597 164257 -37354 -162346 59734 142373 -57598 -143641 65301 149051 -90771 -129208 95949
608 95949 116214 -92148 -123233 111681 110848 -126051 -87891 117704 88423 -125364 -85888
619 -85888 145059 60644 -141005 -49039 134916 52298 -151651 -33754 156182 11348 -142845
630 -142845 -12190 148583 4637 -159908 22254 147226 -30122 -139365 28984 150513
640 150513 -50638 -144685 68663 126548 -64877 -129744 74849 131819 -98317 -111045 99576
651 99576 101507 -97783 -106847 117443 91645 -127055 -71171 118705 72773 -127568 -67096
662 -67096 143149 42515 -135762 -34246 131485 36212 -146528 -15943 146471 -2592
672 -2592 -133243 227 140438 -10764 -147786 35291 132501 -39331 -126773 39260 136903
683 136903 -61450 -127304 75087 110264 -70706 -115072 83054 113941 -103050 -92874 101495
694 101495 86140 -101623 -90038 120774 72341 -126107 -54813 117914 57307 -128648 -48397
705 -48397 140545 25049 -131028 -19763 129068 19972 -142815 1570 138047 -16510
715 -16510 -125987 13509 133056 -26070 -136305 47572 119663 -48404 -116284 50375
725 50375 123909 -71531 -110837 80652 96413 -75762 -101298 89496 96679 -105692 -75831
736 -75831 101209 72105 -103211 -73941 121513 54951 -122717 -40533 115070 43246 -127124
747 -127124 -31476 135525 9659 -124364 -7516 124755 5151 -136586 16692 128728
757 128728 -27820 -117964 25164 126186 -39770 -125100 57967 108484 -56844 -106683 60339
768 60339 111791 -80762 -96544 85469 84198 -81001 -89258 94976 80662 -107614 -61170
779 -61170 100844 59645 -104623 -58782 120435 38878 -117852 -27739 111442 30499 -123617
790 -123617 -16598 128116 -2825 -116226 2835 119058 -7676 -128164 28977 117762
800 117762 -36776 -108982 34571 117083 -50618 -112960 66275 96356 -62830 -97536 68908
811 68908 99792 -87776 -82984 88959 73117 -85478 -77194 100022 66147 -108502 -47915
822 -47915 100524 48506 -105977 -45061 118899 25107 -113265 -16832 107831 18950 -119674
833 -119674 -3388 120357 -12923 -108029 11288 112217 -18148 -118487 37946 106448
843 106448 -42608 -100169 41689 107208 -58429 -100096 70528 84998 -66420 -87331 74960
854 74960 86863 -91714 -68776 90036 62253 -88152 -65416 102949 52035 -107865 -36087
865 -36087 99598 37548 -106740 -31776 116723 12357 -108441 -7019 104950 7827 -115821
876 -115821 8915 112364 -22142 -101152 19211 106119 -28297 -109441 46304 95443 -47803
887 -47803 -90914 48120 97132 -65081 -87068 73374 74010 -68921 -77114 78512 73986 -92398
899 -92398 -56261 88717 51855 -88976 -53534 103080 38255 -104716 -25139 97111 27496
910 27496 -105422 -19151 112422 540 -102615 1920 101236 -2772 -110674 20501
920 20501 104375 -30412 -93907 27292 100025 -38078 -99927 53918 85417 -52404 -83046
931 -83046 54356 87876 -70578 -75004 75285 63525 -70320 -67590 81156 61541 -92079
942 -92079 -44559 86499 42571 -88135 -42423 101069 26149 -99301 -15632 92979 18181
953 18181 -101641 -7566 105910 -9365 -95813 9797 96313 -12531 -103762 30164 95196
964 95196 -37069 -86411 34371 92486 -46505 -89612 60057 74937 -56809 -74408 60590
975 60590 76771 -75763 -62831 76887 53859 -72628 -57055 83898 48671 -91606 -32934
986 -32934 84326 32549 -87365 -31073 98530 14353 -93854 -6788 88192 8867 -97416
997 -97416 3261 98263 -17880 -87553 16511 89683 -21165 -95378 37987 84737 -41987
1008 -41987 -77823 40319 83848 -53254 -78293 64108 64601 -60035 -65442 64933 65544 -78708
1020 -78708 -50752 77513 43822 -74618 -47111 85960 36532 -90460 -22460 82431 23344
1031 23344 -86508 -19774 95760 3263 -88546 1740 84095 -38 -92734 13353 90592
1042 90592 -25160 -79977 22695 83238 -28838 -86424 44383 74479 -45666 -69568 44906
1053 44906 74763 -58386 -66684 65832 54196 -61325 -56482 67831 54279 -79968 -39288
1064 -39288 76434 34428 -75148 -36555 86313 24305 -87506 -12179 80031 14505 -85327
1075 -85327 -8271 91626 -7284 -83019 9741 80580 -9516 -87791 23470 82880 -32240
1086 -32240 -72808 29421 76979 -36996 -77305 50539 64706 -49489 -61735 49489 65808
1097 65808 -62667 -55619 67288 44777 -62394 -47732 69986 43313 -79644 -28764 74327
1108 74327 25960 -74278 -26773 84920 13326 -83268 -3433 76577 5831 -82917 1983
1119 1983 86725 -16538 -77156 17244 76061 -18108 -82203 32530 75390 -38735 -66288
1130 -66288 35716 70773 -44560 -68793 55861 56011 -53092 -54484 54860 56742 -67177
1141 -67177 -44989 68454 36448 -64032 -39323 72115 32825 -78965 -18950 72628 18257
1152 18257 -73900 -17199 82755 3166 -78932 3943 72739 -1686 -79582 11312 80598 -24124
1164 -24124 -70999 23078 71134 -26116 -75691 39784 66995 -43763 -59932 41235 64320
1175 64320 -51280 -59641 60222 47265 -56271 -47348 59418 47825 -70503 -35314 69193
1186 69193 28450 -65603 -30934 74155 22648 -78155 -10263 70922 10621 -73169 -8423
1197 -8423 80338 -5451 -74670 10567 69770 -8785 -76077 19116 74491 -29475 -64571 27620
1209 27620 66466 -31891 -69044 45050 59105 -46434 -53633 45056 57359 -55428 -51001 62182
1221 62182 39611 -57756 -40379 62148 38986 -72027 -26052 69266 20734 -66443 -22645
1232 -22645 74944 12674 -76198 -2201 68981 3571 -72351 903 77614 -13879 -70247 16844
1244 16844 66513 -15701 -72172 26959 68431 -35145 -59184 32309 61588 -37945 -62140 49542
1256 49542 51278 -49003 -47348 48279 50453 -58763 -42079 63115 32380 -58504 -33761 63877
1268 63877 30441 -71668 -17728 67152 14527 -66182 -15440 74275 4134 -73233 4615 66636
1280 66636 -2938 -70724 8698 73715 -21126 -65123 22102 63129 -22276 -67846 33715 61838
1292 61838 -39668 -53765 36632 56630 -42994 -55118 52982 44108 -50627 -41734 50978 43838
1304 43838 -61071 -34014 62681 25599 -58181 -27657 64441 22783 -70058 -10677 64499 9162
1316 9162 -64732 -8658 71989 -2737 -68853 9882 62950 -7949 -67595 15229 68349 -26587
1328 -26587 -59926 25984 59024 -27520 -62619 38901 55008 -42728 -48280 40090 51370 -47476
1340 -47476 -47789 55310 37000 -52031 -35718 53494 36451 -62680 -26090 62180 19613 -58118
1352 -58118 -21549 64648 15003 -68368 -4064 62106 3597 -62792 -2009 68881 -9361 -64136
1364 -64136 14139 58803 -12802 -63835 21411 62724 -30428 -54136 29112 54287 -31949 -56744
1376 -56744 42491 47992 -44416 -42560 42627 45233 -50616 -40181 56465 30046 -52308 -29915
1388 -29915 55293 28924 -63119 -18127 60993 13384 -57795 -14687 64377 7065 -65638 2733
1400 2733 59221 -1610 -61093 4768 65308 -16099 -59163 18544 55074 -17739 -59547 26563
1412 26563 56598 -33882 -48169 31930 49510 -35632 -50140 45354 40787 -45373 -36618 44247
1424 44247 39050 -52432 -32404 56206 23027 -52034 -23610 55748 21394 -62010 -10770 58416
1436 58416 7163 -56631 -8119 62445 -692 -61734 8503 55761 -7572 -58299 11623 60889
1448 60889 -21677 -53768 23201 50959 -22894 -54772 31931 50213 -36971 -42547 34717 44082
1460 44082 -39319 -43229 47480 33725 -46069 -31071 45494 32630 -53203 -24861 55269 16928
1472 16928 -51064 -18321 55267 14284 -60127 -4040 55830 2126 -54592 -1761 60165 -7524
1484 -7524 -57736 13642 52196 -12423 -54935 17887 55916 -26753 -48337 27200 46706 -27497
1496 -27497 -49336 36363 43377 -39930 -36572 37257 38551 -42946 -36077 49208 26682 -46720 -25396
1509 -25396 47144 25750 -54357 -17400 54088 11313 -50289 -12597 54803 7663 -57813 1813
1521 1813 52398 -2700 -52247 3640 56976 -13157 -53030 17930 48075 -16445 -51597 22480
1533 22480 50641 -30550 -43002 29496 42434 -31122 -44319 39717 37101 -41494 -31566 39506
1545 39506 33395 -45331 -29336 50378 20601 -47006 -19863 48114 19327 -54580 -10674 52420
1557 52420 5719 -49580 -6985 54181 1049 -55387 7410 49583 -7033 -50424 9068 53646
1569 53646 -17977 -48433 20795 44629 -20096 -47677 26676 45296 -33407 -37987 31830 38434
1581 38434 -34126 -38498 41927 31120 -42520 -26510 40815 28245 -46867 -23002 50426 14809
1593 14809 -46346 -14779 48680 13034 -53963 -4126 50952 736 -48340 -1527 52810 -5231
1605 -5231 -52246 12373 46907 -11598 -47971 14718 50277 -22873 -44061 24578 40800 -24032
1617 -24032 -43898 30880 40095 -35687 -33479 33551 34079 -36712 -33322 43596 25246 -42695 -22017
1630 -22017 41832 23228 -47807 -16924 49432 9918 -45800 -10642 48689 7612 -52369 1069
1642 1069 48517 -3542 -46920 3423 51272 -10805 -49120 16349 43695 -15197 -45591 19282
1654 19282 46519 -26969 -40036 27253 37903 -27232 -39907 34373 34949 -37621 -28764 35046
1666 35046 29975 -39032 -28182 44750 19893 -42693 -18126 42454 18276 -47826 -11653 48349
1678 48349 5789 -44481 -6423 47735 2598 -50395 5489 46082 -6734 -44805 7397 48551
1690 48551 -14746 -45565 19370 40506 -18445 -42377 22896 42239 -30024 -35899 29367 34111
1702 34111 -29934 -35473 36943 29916 -38698 -24461 36313 25928 -40779 -22526 45216 14838
1714 14838 -42182 -14030 42512 13623 -47826 -6250 46435 1540 -43413 -2575 46523 -2031
1726 -2031 -47955 9281 43142 -9443 -42625 10761 45535 -18621 -41665 21459 37156 -20324
1738 -20324 -39513 25772 37952 -31681 -31283 30293 30530 -32015 -31233 38028 24641 -38788 -20363
1751 -20363 36712 21468 -41289 -17655 44819 10360 -41283 -9929 41869 9077 -46797 -1349
1763 -1349 44237 -2017 -41625 1371 45151 -6658 -44947 13203 39888 -12415 -40572 14370
1775 14370 42188 -21661 -37269 23430 33902 -22583 -36202 28415 33111 -32603 -27022 30679
1787 30679 27127 -33020 -26677 38725 20037 -38209 -16407 36948 18034 -41532 -12621 43228
1799 43228 6331 -39597 -6403 41504 4393 -44855 2927 41766 -5475 -39552 5236 42894
1811 42894 -11222 -41588 16225 36597 -15234 -37615 17942 38837 -24492 -33045 25046 30405
1823 30405 -24714 -32294 30583 28527 -33254 -22828 31163 23415 -34031 -22199 38998 15130
1835 15130 -37322 -12826 36226 13571 -41208 -7661 41580 2470 -37798 -3123 40020 -3
1847 -3 -42818 6949 38842 -8393 -37238 8307 40236 -14865 -37668 18766 33099 -17416 -34565
1860 -34565 20576 34380 -26984 -28622 26492 26545 -26535 -28333 32041 23501 -34017 -18297 31642
1873 31642 19370 -34946 -17244 38683 10673 -36292 -9323 35786 9277 -40073 -3234 39502
1885 39502 -1249 -36025 52 38531 -3569 -40068 10374 35559 -11124 -34599 11302 37178
1897 37178 -17607 -33779 20613 29714 -19269 -31301 23279 30109 -28855 -24175 27104 23391 -27803
1910 -27803 -24120 33324 18805 -34161 -14380 31777 15547 -35327 -12173 38065 5854 -35221
1922 -35221 -5598 35428 5026 -39062 1430 37114 -4647 -33995 3817 36632 -7876 -37010
1934 -37010 13842 32572 -13017 -32397 14393 34068 -20637 -29758 22233 26368 -21225 -28001
1946 -28001 25465 25801 -29398 -19951 27716 20082 -28817 -19848 33972 14204 -33391 -10698 31587
1959 31587 11969 -35265 -7763 36862 1976 -33576 -2109 34417 954 -37411 5202 34685
1971 34685 -7670 -31951 6912 34797 -11644 -33936 16440 29377 -15387 -29875 17436 30793
1983 30793 -22794 -25939 23544 23178 -22637 -24848 27154 21718 -30023 -16543 27683 16638 -29681
1996 -29681 -16407 34141 9795 -32563 -7398 31029 8165 -34845 -3758 35426 -1358 -31931
2008 -31931 940 33296 -2641 -35618 8838 31850 -10152 -30159 9907 32746 -14889 -30826
2020 -30826 18700 26172 -17188 -27347 19933 27501 -25264 -22563 24837 19889 -24198 -21534 28853
2033 28853 17884 -30487 -12672 27969 13729 -30330 -12318 33911 6294 -31553 -4464 30583
2045 30583 4954 -34119 -119 33530 -4368 -30225 3220 31910 -5947 -33501 11676 29235
2057 29235 -12145 -27960 12014 30441 -17547 -27567 19817 23350 -18772 -24493 21655 23960
2069 23960 -26318 -18607 24956 17145 -24806 -18092 29689 13520 -30103 -9636 27701 10703
2081 10703 -30389 -8372 33150 2710 -30510 -1979 29901 2043 -32835 3289 31346 -6714
2093 -6714 -28392 5592 30381 -8627 -30852 13715 26742 -13680 -25950 14281 27498 -19199
2105 -19199 -24118 21285 20550 -19479 -21982 22959 20452 -26735 -15276 25164 14462 -25670 -15017
2118 -15017 29650 10245 -29550 -6905 27349 7593 -30326 -4506 31808 -529 -28462 604
2130 604 28820 -1311 -31428 6452 29254 -8923 -26272 7877 28729 -11248 -28278 15834
2142 15834 23811 -15139 -23856 15867 24626 -20983 -20826 21578 17635 -20160 -19302 24005 17323 -26569
2156 -26569 -12198 24689 12000 -25550 -11765 29338 6723 -28140 -4385 26588 5061 -29336
2168 -29336 -1497 29932 -3048 -26889 2648 27644 -3664 -29638 9178 26504 -10526 -24399
2180 -24399 9790 26524 -14098 -25087 17129 20684 -16006 -21335 17599 21979 -21983 -17573 22031
2193 22031 15151 -20898 -16568 24704 13473 -26405 -9168 24144 9734 -25531 -8699 28551
2205 28551 3685 -26774 -2223 25384 2636 -28235 1684 28275 -5585 -24954 4383 26021
2217 26021 -6540 -27542 11260 24057 -11951 -22266 11645 24405 -15857 -22098 18332 18426 -17069
2230 -17069 -19145 19225 18754 -22899 -14279 21989 12622 -21364 -13562 25037 10276 -25814 -6309
2243 -6309 23472 7118 -25492 -5458 28013 493 -25423 291 24780 8 -27336 4251
2255 4251 26515 -7408 -23097 6382 24362 -8984 -25175 13075 21210 -13024 -20384 13169
2267 13169 22018 -17273 -19161 19056 15827 -17341 -16682 19737 15629 -23299 -11094 21732 10217
2280 10217 -21720 -10874 25368 6584 -25158 -3521 22978 4546 -25073 -2221 26460 -2263
2292 -2263 -23541 2399 23512 -2625 -25895 6970 23848 -9013 -21230 8195 22928 -11157
2304 -11157 -22713 14851 18822 -14039 -18672 14546 19354 -18767 -16085 19546 13131 -18166 -14323
2317 -14323 20781 12420 -23244 -8052 21314 8174 -21730 -7899 25034 3715 -23985 -1256
2329 -1256 22245 2431 -24295 530 25014 -4825 -21923 4269 22271 -5362 -24182 9401
2341 9401 21479 -10853 -19271 10033 21226 -13112 -20084 16167 15956 -15138 -16438 15828 16973
2354 16973 -19588 -12914 19682 10707 -18576 -12056 21471 9566 -23098 -5589 20848 5893
2366 5893 -21719 -5242 24215 1172 -22824 786 21304 74 -23613 3206 23390 -6595
2378 -6595 -20539 6357 21169 -7265 -22621 11489 19229 -11931 -17342 11273 18875 -14720 -17226
2391 -17226 17131 13696 -15737 -14244 17116 14002 -20312 -10180 19680 8811 -18686 -9724 21984
2404 21984 6653 -22607 -3118 20090 3883 -21536 -2530 23399 -1353 -21349 2644 20349
2416 20349 -2080 -22478 5649 21807 -8333 -18782 7652 19562 -9463 -20409 13308 17108
2428 17108 -13142 -15713 12640 17304 -16012 -14860 17814 11674 -16338 -12159 18138 11776 -20734
2441 -20734 -7724 19483 6665 -19194 -7012 21712 3990 -21872 -1022 19902 1836 -21365
2453 -21365 -106 22516 -4179 -20103 4079 19322 -4140 -21620 7964 19996 -10074 -17259
2465 -17259 9024 18202 -11093 -17815 14363 14874 -13842 -13988 13959 14792 -17259 -12213 18061 9537
2479 9537 -16635 -10212 18554 9120 -20828 -5414 19097 4602 -18902 -4879 21761 1181
2491 1181 -21016 1368 19037 -275 -20811 2466 21382 -5666 -18661 5899 18576 -6324
2503 -6324 -19710 9631 18208 -11123 -15584 10322 16959 -12654 -16268 15358 12716 -14354 -12697
2516 -12697 14843 12911 -18145 -10112 18095 7804 -16797 -8315 19054 6752 -20572 -3041
2528 -3041 18606 3042 -19022 -2583 21221 -953 -19472 2851 18376 -1872 -20091 4412
2540 4412 20210 -7346 -17188 6979 17392 -7906 -18395 11439 15854 -11864 -14068 11028 15260
2553 15260 -13592 -13992 15892 10890 -14944 -10721 15628 10675 -18294 -7528 17997 5898 -16807
2566 -16807 -6698 18992 4278 -20000 -1240 17843 1423 -18590 -923 20055 -2886 -18436
2578 -18436 3775 17406 -3451 -18977 6148 18320 -8651 -15633 8032 16172 -9266 -16415
2590 -16415 12456 13971 -12524 -12584 12217 13265 -14892 -11923 15929 9090 -14907 -8943 16092
2603 16092 8659 -18356 -5503 17479 4291 -16845 -4725 18792 2394 -19052 620 16946
2615 16946 24 -17868 1140 19379 -4522 -17109 5123 16419 -4807 -17893 7929 16539
2627 16539 -9516 -13920 8979 14864 -10501 -14684 13302 11747 -12771 -11012 12635 11910 -15219
2640 -15219 -9590 16082 6966 -14795 -7533 16407 6389 -18033 -3274 16614 2474 -16635
2652 -16635 -2581 18351 15 -17628 2123 15930 -1274 -17205 3069 17689 -6122 -15628
2664 -15628 6463 15366 -6470 -16481 8875 14890 -10453 -12748 9845 13499 -11693 -13045 13812
2677 13812 10031 -12816 -9577 13263 10016 -15599 -7284 15918 5550 -14712 -6147 16281 4644
2690 4644 -17792 -1265 16111 1394 -15833 -994 17778 -1680 -16808 3247 15146 -2765
2702 -2765 -16392 4829 16454 -7572 -14109 7190 13822 -7536 -14922 10275 12860 -11155 -10979
2715 -10979 10492 11898 -12455 -10931 13955 8040 -13237 -7794 13613 8013 -15877 -5323 15496
2728 15496 3823 -14676 -4239 16192 2569 -17186 -96 15251 -101 -15527 608 16996
2740 16996 -3526 -15387 4740 14232 -4057 -15476 6344 14967 -8447 -12661 8003 12641 -8527
2753 -8527 -13110 11248 11146 -11748 -9409 10900 10500 -12887 -8700 14285 6417 -13481 -6621 14052
2767 14052 6472 -15981 -3717 15021 2302 -14146 -2562 15989 208 -16007 1783 14372
2779 14372 -1485 -14910 2316 16039 -4928 -14248 5805 13118 -5399 -14506 7660 13483 -9448
2792 -9448 -11183 8672 11575 -9530 -11764 11949 9318 -11981 -8234 11539 8915 -13553 -7057
2805 -7057 14357 4741 -13074 -5108 14456 4532 -15622 -1601 14698 1181 -13949 -1050 15310
2818 15310 -903 -15391 3202 13622 -2464 -14547 3691 15075 -6431 -12946 6463 12403
2830 12403 -6263 -13219 8885 11955 -10205 -9742 9377 10593 -10447 -10323 12430 7612 -11991
2843 -11991 -6907 11653 7524 -13668 -5146 14129 3460 -13107 -3935 14047 2828 -15154 -194
2856 -194 13972 -221 -13538 244 14896 -2445 -14179 4105 12693 -3419 -13595 5007
2868 5007 13768 -7387 -11970 7109 11436 -7165 -12075 9818 10382 -10308 -8678 9553 9194 -11051
2882 -11051 -8663 12707 6588 -11900 -5912 12140 5986 -13720 -3806 13904 2194 -12845 -2799
2895 -2799 14050 1289 -14562 1170 13176 -1066 -13327 1328 14409 -3766 -13305 4997
2907 4997 11803 -4518 -13085 6132 12752 -8010 -10380 7487 10271 -8007 -10709 10194 8868
2920 8868 -10489 -7591 10056 8077 -11500 -7036 12601 4791 -11647 -4735 12180 4692 -13754
2933 -13754 -2519 13289 1070 -12209 -1640 13577 117 -14027 2246 12210 -2312 -12595
2945 -12595 2684 13446 -4949 -12051 5662 10883 -5248 -11657 7240 11253 -8681 -9244 8018
2958 8018 9369 -8756 -9432 10881 7417 -10921 -6213 10102 7181 -11962 -5480 12530 3269 -11394
2972 -11394 -3645 12221 3352 -13510 -832 12738 54 -11970 -365 13113 -1622 -13127
2984 -13127 3400 11604 -2820 -11930 3737 12258 -6136 -10793 6007 9973 -6010 -11004 7922
2997 7922 9842 -9316 -8123 8478 8258 -9411 -8123 10914 6021 -10613 -5470 10038 5607 -12090
3011 -12090 -3875 12325 2411 -11152 -2579 11975 1486 -13089 562 11935 -1059 -11512
3023 -11512 758 12772 -2436 -11994 4236 10649 -3537 -10873 4732 11350 -6558 -9560 6916
3036 6916 9229 -6680 -9733 8420 8665 -9331 -6809 8527 7428 -9396 -6829 11310 4516 -10271
3050 -10271 -4432 10433 4619 -12008 -2707 11741 1239 -10752 -1522 11658 680 -12452 1560
3063 1560 10885 -1694 -10978 1693 11900 -3918 -11022 4788 9598 -4119 -10313 5273 10319
3076 10319 -7287 -8459 7253 7960 -7221 -8801 9314 7052 -9196 -5886 8605 6391 -9911
3089 -9911 -5505 11407 3493 -10147 -3065 10343 3362 -11504 -1255 11358 -16 -10093 -572
3102 -572 11346 -380 -11432 2392 10342 -2503 -10267 2820 10855 -4404 -9795 5588 8651
3115 8651 -4900 -9457 6412 9053 -8099 -7384 7213 7155 -7514 -7385 9436 5876 -9348 -4704
3129 -4704 8810 5158 -9799 -4035 10734 2263 -9902 -2119 10052 2156 -11377 -215 10425
3142 10425 -846 -9725 313 10665 -1775 -10740 3717 9518 -3016 -9642 3401 10081 -5665
3155 -5665 -8618 6097 7905 -5605 -8766 6864 7774 -8199 -6047 7518 6440 -7712 -6234 9626
3169 9626 4432 -9547 -3659 8698 4363 -10101 -2970 10584 862 -9375 -1343 9913 1035
3182 1035 -11060 1169 9898 -1569 -9246 1459 10146 -2923 -9959 4116 8401 -3674 -8960
3195 -8960 4480 9078 -6204 -7523 6143 6813 -5869 -7590 7473 6611 -8247 -5305 7544 5591
3209 5591 -8359 -5148 9672 3200 -8915 -2746 8595 3100 -10299 -1611 10053 18 -9031
3222 -9031 -665 9630 -327 -9915 1894 8951 -2197 -8898 2080 9612 -3606 -9043 4563
3235 4563 7602 -4059 -8178 5376 8321 -6586 -6637 6395 6134 -6305 -6514 7845 5340 -8131
3249 -8131 -3928 7503 4537 -8366 -3893 9605 2140 -8631 -1927 8329 2184 -9718 -565
3262 -565 9537 -735 -8316 357 9396 -938 -9638 2598 8639 -2745 -8613 2745 8752 -4333
3276 -4333 -8186 5289 6755 -4550 -7498 5827 7501 -7070 -5399 6571 5370 -6597 -5462
3289 -5462 8089 4405 -8336 -3185 7410 3832 -8356 -2858 9249 1404 -8321 -1152 8397 1169
3303 1169 -9493 522 8734 -1573 -8053 1088 8876 -2206 -8939 3686 7773 -3054 -7592
3316 -7592 3601 8210 -5256 -7106 5328 6335 -4998 -6625 6283 6144 -7101 -4616 6639
3329 6639 4826 -6782 -4789 8458 3083 -8064 -2522 7447 2872 -8477 -1724 9061 402 -7910
3343 -7910 -512 8092 698 -9134 1550 7973 -1865 -7781 1580 8641 -2747 -8103 3918 6989
3357 6989 -3558 -6983 4073 7331 -5455 -6192 5750 5568 -5193 -6084 6818 5402 -7323 -3922
3371 -3922 6420 4060 -6965 -3651 8139 2451 -7674 -1754 7357 2097 -8636 -942 8465 -414
3385 -414 -7589 103 7758 -732 -8301 2196 7482 -2214 -7074 2479 7895 -3444 -7394 4333
3399 4333 6128 -3982 -6550 4444 6569 -5817 -5296 5787 4605 -5435 -5382 6727 4186 -7138
3413 -7138 -2959 6373 3508 -6987 -3166 8016 1402 -7250 -1159 7343 1534 -7954 -131 7715
3427 7715 -897 -6932 705 7636 -1033 -8060 2947 6885 -2771 -6458 2558 7224 -3901 -6505
3441 -6505 4802 5534 -4060 -5572 4579 5697 -6313 -4238 5674 3994 -5775 -4416 6714 3253
3455 3253 -6938 -2423 6151 2630 -7038 -2225 7965 783 -7032 -542 6847 636 -7655 837
3469 837 7415 -1436 -6553 1227 7341 -1771 -7315 3415 6314 -3152 -5986 3135 6518 -4585 -5553
3484 -5553 4856 4968 -4501 -5066 5341 4748 -6047 -3428 5801 3272 -5945 -3339 7013 2427 -7027
3499 -7027 -1386 6260 1751 -7036 -971 7493 -162 -6531 337 6657 -42 -7460 1483 6801 -2191
3514 -2191 -5927 1642 6770 -2634 -6448 3733 5505 -3431 -5531 3771 5884 -4831 -4528 4841 4178
3529 4178 -4637 -4591 5520 4020 -5958 -2845 5716 2892 -5864 -2754 6998 1592 -6552 -1017 6056
3544 6056 1253 -6841 -487 7223 -912 -6180 729 6343 -694 -6870 2018 6126 -2342 -5546 2135
3559 2135 6331 -3062 -6077 4135 4894 -3889 -4872 3941 5025 -5231 -4088 5178 3497 -4937 -3897
3574 -3897 5772 3195 -6275 -2158 5632 2054 -5984 -1810 6855 780 -6125 -393 5999 814 -6618
3589 -6618 373 6411 -1248 -5904 1195 6229 -1427 -6703 2401 5400 -2653 -5207 2572 5668 -3631
3604 -3631 -5115 4301 4139 -3857 -4520 4207 4410 -5247 -3264 5059 2765 -5008 -3184 5565 2224 -5949
3620 -5949 -1237 5452 1530 -5992 -1454 6655 -90 -5690 246 5533 395 -6352 994 6223 -1812
3635 -1812 -5376 1334 5470 -2055 -5735 3050 4917 -3083 -4565 2994 4956 -3978 -4318 4522 3544
3650 3544 -3945 -3665 4600 3704 -5392 -2730 5080 2324 -5125 -2556 5948 1854 -5671 -778 5369
3665 5369 1189 -5855 -536 5886 -665 -5491 527 5512 -619 -5737 1379 5481 -2342 -4919 2182
3680 2182 5208 -2700 -5232 3473 4614 -3069 -4235 3263 4683 -4431 -3796 4386 3138 -4041 -3391
3695 -3391 4827 3089 -5352 -1995 4709 1870 -5015 -1947 5848 909 -5673 -503 5075 368 -5732
3710 -5732 -154 5927 -1056 -5162 969 5157 -1071 -5410 2179 5075 -2472 -4516 2175 4832 -3021
3725 -3021 -4706 3519 3777 -3487 -3604 3604 3959 -4506 -2912 4483 2572 -4202 -2811 4778 2581 -5214
3741 -5214 -1417 4760 1543 -4887 -1241 5464 302 -5597 164 4780 174 -5195 785 5674 -1319
3756 -1319 -4769 1327 4753 -1441 -5004 2604 4600 -2466 -4055 2587 4472 -3186 -3994 3862 3124
3771 3124 -3499 -3262 3646 3632 -4619 -2422 4590 1962 -4291 -2253 4781 1484 -5036 -981 4542 911
3787 911 -4921 -847 5246 -92 -5011 194 4628 -453 -5160 1419 5013 -1777 -4401 1449 4437
3802 4437 -2009 -4837 2811 3961 -3038 -3567 2854 3852 -3725 -3526 3618 2650 -3635 -2950 3896 2581
3818 2581 -4602 -2016 4534 1784 -4114 -1648 4875 978 -4838 -289 4443 549 -4833 67 4954
3833 4954 -724 -4521 976 4220 -975 -4879 1548 4318 -2257 -3981 1833 4117 -2324 -4273 3003
3848 3003 3385 -2998 -3404 2982 3470 -3748 -2718 3721 2270 -3840 -2289 4080 2169 -4340 -1612 4311
3864 4311 1175 -4204 -1471 4771 688 -4625 165 4157 326 -4599 415 4714 -1172 -4208 1266
3879 1266 4103 -1147 -4481 1865 3870 -2407 -3358 2102 3873 -2756 -3833 3238 2815 -3003 -2613 3158
3895 3158 2977 -3564 -2400 4021 1852 -3679 -1898 4206 1576 -4479 -814 4003 862 -4111 -675
3910 -675 4781 -167 -4235 675 3884 -233 -4636 755 4404 -1524 -3758 1416 3659 -1681 -3962
3925 -3962 2254 3571 -2357 -3346 2290 3316 -3007 -3221 3325 2582 -2747 -2501 3467 2504 -3966 -1950
3941 -1950 3663 1318 -3708 -1579 4116 1387 -4304 -288 3900 523 -4030 -520 4330 -642 -3986
3956 -3986 930 3901 -393 -4203 1055 4150 -1770 -3503 1533 3575 -1717 -3589 2678 2914 -2682
3971 -2682 -2722 2374 2843 -2946 -2788 3570 2064 -2975 -2310 3474 2213 -3837 -1264 3944 1132 -3758
3987 -3758 -1407 3985 392 -3986 -17 3857 58 -3693 113 3858 -957 -3640 1024 3365 -1160
4002 -1160 -3768 1814 3656 -1783 -3153 1799 3068 -2150 -3222 2748 2584 -2659 -2462 2522 2641 -3307
4018 -3307 -2348 3592 1659 -2960 -1782 3533 1671 -3847 -597 3653 608 -3489 -949 3860 44
4033 44 -3897 532 3399 -244 -3811 497 3720 -1183 -3686 1108 3389 -1151 -3707 1846 2977
4048 2977 -2054 -2822 2042 2975 -2697 -2613 2941 2266 -2877 -2301 2807 2349 -3099 -1761 3298 1375 -2873
4065 -2873 -1440 3690 1519 -3739 -453 3393 658 -3270 -504 3882 -159 -3641 421 3319 -322
4080 -322 -3680 798 3844 -1590 -3009 1262 2904 -1319 -3336 2012 2671 -2348 -2418 1938 2766 -2372
4096 -2372 -2370 3059 1873 -2747 -1667 2551 1938 -3261 -1473 3200 832 -3172 -986 3267 842 -3739
4112 -3739 -177 3364 357 -3240 -111 3747 -541 -3235 1005 3240 -868 -3505 881 3423 -1669
4127 -1669 -2954 1544 2798 -1624 -3131 2240 2251 -2352 -2197 2228 2451 -2583 -1962 2940 1417 -2788
4143 -2788 -1296 3013 1447 -3063 -927 3126 822 -2804 -909 3446 230 -3195 -151 2915 -81
4158 -81 -3198 77 3493 -764 -3086 994 2891 -792 -2762 1266 2831 -1567 -2718 1490 2487 -1846
4174 -1846 -2560 2072 2198 -2362 -2098 2321 1983 -2602 -1613 2857 1265 -2628 -1185 2954 1060 -3366
4190 -3366 -743 3063 308 -2730 -633 3233 50 -3164 599 2875 -348 -3086 299 3134 -1260
4205 -1260 -2696 1055 2792 -981 -3165 1336 2482 -1911 -2037 1730 2213 -1994 -2293 2388 1823 -2490
4221 -2490 -1850 2232 1803 -2895 -1305 3009 989 -2474 -1183 2855 668 -2954 -326 2907 94
4236 94 -2750 -418 3076 -329 -2836 600 2840 -704 -2727 664 2814 -1193 -2581 893 2510
4251 2510 -1269 -2559 1864 2449 -2168 -1814 1637 1965 -2112 -1846 2580 1445 -2404 -1263 2428 1219
4267 1219 -2680 -766 2732 483 -2405 -830 2529 690 -3041 163 2717 -88 -2666 17 2929
4282 2929 -355 -3005 810 2362 -878 -2875 1096 3051 -1609 -2414 1090 2223 -1420 -2225 2033
4297 2033 1973 -1862 -1480 1699 1859 -2140 -1429 2791 1025 -2076 -1038 2443 1140 -3087 -460 2464
4313 2464 281 -2218 -607 2777 316 -2770 182 2449 -372 -2447 503 2793 -874 -2486 1275
4328 1275 2198 -711 -2462 1128 2201 -1648 -1772 1156 1917 -1465 -2108 2063 1673 -2184 -1404 1971
4344 1971 1659 -2374 -1318 2416 1075 -2251 -1059 2258 840 -2825 -339 2399 -186 -2276 -272
4359 -272 2701 -124 -2507 608 2450 -554 -2399 601 2598 -970 -2065 1155 1983 -1025 -2472
4374 -2472 1521 2043 -1655 -1575 1691 1961 -1588 -2092 1974 1369 -1866 -880 1851 1147 -2141 -983 2627
4391 2627 556 -2289 -792 2542 546 -2493 57 2039 94 -2436 -163 2480 -214 -2401 736
4406 736 1879 -253 -2138 710 2346 -1258 -1998 1048 1826 -1371 -2055 1645 1795 -1630 -1248 1495
4422 1495 1593 -1832 -1677 1786 992 -1845 -918 1837 1123 -2080 -912 2366 106 -1821 -592 2214
4438 2214 236 -2328 169 1981 -69 -2069 -49 2232 -528 -1953 782 1932 -588 -2114 835
4453 835 1992 -1165 -1652 1270 1652 -1102 -1851 1812 1687 -1588 -1157 1488 1509 -1595 -1100 2123 788
4470 788 -1938 -813 1714 838 -2320 -458 2014 127 -1844 -462 2063 76 -2072 357 1955
4485 1955 -399 -1520 397 2159 -499 -2073 692 1905 -875 -2052 679 1814 -1487 -1306 985
4500 985 1361 -1316 -1674 1657 800 -1522 -938 1304 1265 -1633 -1049 2008 418 -2092 -686 1935 507
4517 507 -2153 -234 1974 -102 -1799 64 1806 -51 -2081 499 2003 -499 -1646 419 2195
4532 2195 -676 -1573 1055 1368 -818 -1428 1345 1524 -1513 -1188 1097 1253 -1375 -1381 1801 1055 -1583
4549 -1583 -576 1429 955 -1732 -509 1859 468 -1541 -401 1709 251 -2026 22 1614 -247
4564 -247 -1708 -113 1817 -379 -1873 824 1464 -553 -1670 695 1649 -1057 -1526 1025 1035 -1094
4580 -1094 -1525 994 1388 -1504 -1086 1188 918 -1368 -1072 1812 774 -1577 -794 1382 757 -1845 -327
4597 -327 1680 394 -1593 -275 1811 180 -1837 544 1611 -198 -1525 142 1601 -439 -1935
4612 -1935 629 1350 -547 -1526 731 1754 -964 -1480 735 1096 -968 -1139 1039 1022 -1121 -637 1265
4629 1265 919 -1280 -909 1514 594 -1580 -132 1224 613 -1519 -346 1361 -73 -1430 -251 1949
4645 1949 146 -1740 180 1434 -436 -1477 250 1531 -630 -1752 924 1258 -756 -1608 821
4660 821 1233 -1129 -1025 1096 1184 -965 -1102 1270 1018 -1332 -669 1209 472 -1162 -785 1394 298
4677 298 -1212 -704 1459 5 -1446 -83 1309 25 -1384 144 1161 -219 -1711 419 1254 -444
4693 -444 -1561 328 1675 -478 -1384 732 1224 -664 -1154 677 1218 -1247 -782 894 986 -904 -1027
4710 -1027 1353 727 -1265 -712 1127 620 -1304 -411 1203 232 -1281 -262 1399 355 -1436 117
4726 117 1247 -318 -1250 -11 1639 -192 -1204 210 1238 -529 -1468 499 1052 -759 -915 869
4742 869 1231 -759 -871 902 953 -1179 -653 1089 804 -926 -548 1452 653 -1055 -470 1051 462 -1406
4760 -1406 -598 1343 198 -1397 -124 1250 75 -1619 122 1199 -541 -865 169 1289 -27
4775 -27 -1147 623 1204 -390 -1119 410 1139 -839 -1029 666 564 -840 -1094 1081 809 -1045 -445
4792 -445 760 523 -1243 -765 1131 388 -906 -21 882 329 -1229 -308 1232 -150 -1139 -256 1227
4809 1227 -160 -1188 79 996 -302 -1134 96 1150 -463 -1224 709 814 -627 -942 380 1113
4825 1113 -753 -577 902 783 -693 -820 957 547 -1014 -670 830 494 -1062 -314 1440 11 -939
4842 -939 -271 974 300 -1202 102 1183 -177 -858 -149 1096 -196 -905 490 900 -413 -699 271
4859 271 864 -369 -1137 834 605 -476 -816 474 715 -581 -572 978 789 -776 -579 1063 484 -719
4877 -719 -180 707 357 -1146 -555 996 135 -1067 -169 734 148 -1254 472 982 -303 -921 21 929
4895 929 -265 -992 474 677 -493 -808 472 913 -887 -700 669 810 -402 -685 602 821 -826
4912 -826 -338 536 455 -657 -582 856 201 -865 -349 868 318 -1057 31 1056 11 -835 -132 1060
4930 1060 -122 -867 143 756 -440 -1014 229 806 -113 -1162 418 644 -527 -869 345 926 -541
4947 -541 -430 626 582 -392 -430 680 777 -522 -509 597 412 -879 -553 780 255 -879 -273 784 -240
4966 -240 -796 -154 645 -9 -567 -72 649 11 -852 312 818 -437 -871 102 576 -164 -652 366 527
4985 527 -213 -649 631 672 -649 -598 245 546 -437 -532 627 336 -746 -226 651 135 -711 -390 876
5004 876 64 -628 -31 519 -2 -831 405 950 -246 -465 -69 831 2 -896 339 470 -377 -718 455
5023 455 721 -266 -453 475 407 -403 -539 423 525 -433 -199 421 306 -279 -222 712 180 -770 -157 633 128
5044 128 -650 -267 794 -68 -723 -296 816 -172 -856 235 546 -381 -504 239 633 -159 -898 64 653
5063 653 40 -562 330 611 -458 -540 273 369 -463 -449 520 410 -703 -314 555 126 -568 -216 474 205
5083 205 -530 -62 460 -21 -729 -58 759 111 -638 122 620 267 -660 222 769 -251 -446 166 819 -328
5103 -328 -506 379 433 -149 -696 625 434 -285 -563 352 558 -419 -329 387 291 -655 -251 433 12 18 -159
5124 -159 476 299 -606 52 444 -79 -654 -223 495 -41 -478 25 477 -125 -768 392 504 -353 -317 225
5144 225 358 -290 -311 400 362 -303 -353 340 503 -503 -218 541 176 -446 -269 468 153 -563 -215 268 383
5165 383 -432 -88 519 53 -442 -127 476 243 -482 -155 559 -53 -400 -48 358 -10 -550 159 465 -215
5185 -215 -71 218 328 -360 -758 186 271 -332 -266 349 493 -256 -168 468 230 -109 -234 527 212 -350 -84
5206 -84 314 264 -550 -128 386 -193 -305 101 508 -58 -554 198 515 -286 -442 -191 396 -121 -437 350 440
5227 440 -277 -249 237 621 -237 -314 343 146 -528 -372 191 358 -238 -162 95 117 -402 7 666 246 -556
5248 -556 53 379 151 -420 -172 266 -52 -306 -43 385 -202 -433 -227 245 -77 -527 236 438 -472 -667
5268 -667 411 412 -149 -166 175 503 -468 -517 75 -75 -126 -418 333 252 20 -305 195 179 -566 -337 411 6
5290 6 -615 92 -15 61 -264 67 394 162 -275 26 307 247 -566 141 194 -320 -245 104 163 -154 -247 195 370
5313 370 -68 10 288 545 -335 -63 188 60 -111 -243 373 202 -177 -33 432 300 -276 -164 422 -48
5333 -48 -217 115 347 -101 -320 18 362 -53 -395 0 145 -131 -356 249 280 -252 -421 -155 110 -179 -214
5354 -214 156 100 -348 -288 218 119 -261 -58 223 175 -306 -108 223 -6 -378 -113 221 -170 -41 -65 428 -126
5376 -126 -131 -128 236 103 -225 21 209 58 -389 153 179 -45 -320 178 285 -301 -198 365 262 -131 -163 435
5398 435 104 -46 -67 165 131 -208 -156 114 119 -129 -175 225 32 -265 -265 332 137 -230 -30 185 105 -333 281
5421 281 336 -32 -314 162 341 -26 -324 267 306 -145 -232 517 337 -155 -260 -102 -33 -39 -251 133 408 -93
5443 -93 -231 62 238 -9 -142 156 -29 -68 -145 308 127 -538 -193 129 55 -326 179 266 11 -620 -41 458
5465 458 -78 -87 17 -65 51 -64 112 198 -69 -41 -88 177 -13 -233 130 224 -123 -126 206 21 -139 -265 -23
5488 -23 -143 23 -169 252 236 -193 192 157 41 -395 -201 232 174 40 3 193 153 -262 -122 82 -30 -350
5510 -350 16 301 -274 98 150 62 -155 -186 243 -52 89 -421 171 -31 17 96 31 93 -332 -60 150 51 46
5533 46 178 199 -29 -310 85 364 60 -139 -34 297 -31 -337 0 -153 -4 -373 69 227 80 -247 -35
5554 -35 176 -230 -253 -19 31 109 -79 59 -114 -86 24 -39 230 113 -47 -78 112 -255 -290 -33 228 -139 -226
5577 -226 181 -77 -156 -174 -38 95 45 36 243 144 -225 -122 212 -49 26 -159 350 68 -260 242 308 36 -15
5600 -15 -1 214 -141 -144 -1 141 207 -29 -98 220 -189 127 172 50 -110 -50 163 -30 129 -127 191 120 -191
5623 -191 -225 2 -61 -39 -198 51 146 -399 83 236 -274 217 -276 -91 -63 -395 -68 -107 -1 -146 199 273
5645 273 -3 -130 29 87 -48 152 215 143 -28 -110 -1 54 -236 101 -168 149 71 -380 41 398 19 -124
5667 -124 95 47 -39 -22 -120 276 -21 143 -39 65 -176 -162 -7 223 -21 186 28 -47 98 -38 -157 -43
5689 -43 -59 40 142 -238 -72 2 70 133 -233 -49 -2 29 -141 -197 162 -112 -148 -34 220 -42 108 2 261
5712 261 54 -1 146 -46 -60 -201 173 -62 -95 -214 -102 425 -273 66 16 157 121 -134 7 -15 -174 -76
5734 -76 109 67 -88 18 142 190 -126 56 35 0 22 285 169 -54 -183 -174 32 -42 -300 137 155 14 41 290
5758 290 126 -26 -148 348 11 148 -263 305 208 -151 275 117 351 -222 57 172 -101 -223 5 -12 18
5779 18 -45 -172 -64 -156 -259 -124 -17 99 -262 120 196 58 29 -53 -20 -4 -78 149 141 -150 -38 37 327 -60
5803 -60 -99 74 152 -35 -34 72 -13 -87 -225 -62 -25 36 -8 196 11 -76 73 362 118 -255 151 115 59 -109
5827 -109 176 141 154 -93 -44 0 -181 2 92 40 -186 40 12 179 110 -127 -103 57 11 -270 210 123 -286 184
5851 184 -238 311 3 -92 -62 143 -35 -191 234 17 -258 -79 -41 -143 65 2 268 59 -108 159 316
5872 316 -226 -167 85 144 38 -194 10 189 -254 -318 296 10 -268 -61 228 -132 -166 19 23 88 -186 -260 -57
5895 -57 -13 -144 -80 197 113 66 1 209 242 -158 -181 126 215 -367 171 227 -99 -270 78 230 -39 -214 18
5918 18 -4 -214 -127 12 185 50 -219 60 295 -192 -291 179 -28 -76 -138 -33 227 -44 -292 149 -44 14
5940 14 -120 66 -40 -126 -73 67 241 251 -79 121 270 27 -87 34 45 129 -54 20 -38 -59 230 60 -77
5963 -77 -136 -312 198 -213 82 52 254 -33 67 247 85 12 29 253 221 -109 -288 242 278 -244 46 113 6
5986 6 -204 -419 141 65 -252 -244 -67 19 51 -30 -39 43 -94 146 403 160 -112 -43 48 -166 -103 147 119 86 -51
6011 -51 8 -195 118 -126 185 143 70 -274 110 18 -253 -22 332 226 -112 -221 -81 27 -38 35 195 -7
6033 -7 -63 -20 397 123 -345 -122 -62 69 -94 180 192 -22 -504 35 135 -95 -237 -73 179 -6 -237 119
6055 119 241 -281 -70 321 204 36 -75 32 210 205 55 287 -171 -516 56 -79 -33 -262 92 48 -134
6076 -134 -211 -18 299 -38 -66 -322 285 -168 -328 -20 285 -63 -184 -99 -52 -195 -164 250 -53 -114 -173 329
6098 329 89 22 -104 303 249 -195 91 -78 31 -443 -1 177 107 27 176 243 206 -39 -312 379 -28 -218
6120 -218 78 54 96 -12 231 335 -158 48 85 309 -118 -171 72 -2 -63 64 -24 67 -13 -157 306 274 -138
6143 -138 -306 137 56 -61 0 366 83 -293 -414 304 62 -166 -167 102 -161 -306 -23 -125 62 -25 -56 266
6165 266 147 -522 194 25 -91 -132 -137 302 44 -222 151 126 -217 -350 2 -41 -19 -235 168 137 -61 132
6187 132 -25 229 -97 -13 169 128 -141 -191 74 71 -245 -43 279 122 -145 -74 257 -94 18 -77 120 142 -429
6210 -429 -43 171 -66 -92 136 301 -70 -248 266 234 46 -265 -98 128 -242 -167 -15 251 -278 -339 174
6231 174 -1 -256 -172 515 325 -177 -177 124 204 -436 -8 14 187 -266 -2 60 -210 -150 44 264 -82 -308
6253 -308 215 330 40 -281 -142 332 -314 -31 146 337 46 112 -4 192 -65 -163 296 28 -151 -256 46
6274 46 32 -138 -96 132 -69 -265 -208 20 72 -255 169 -177 -91 -376 -204 322 -152 -217 -29 222 -190 -6
6296 -6 32 4 -166 -193 42 290 -79 -180 359 259 32 116 417 150 -106 -83 -88 66 -257 -452 203 382 -121
6319 -121 -160 197 251 -330 105 298 1 -217 -110 170 -7 -284 11 283 -105 -243 47 -47 -30 -364 -145
6340 -145 108 188 -181 134 190 -182 -12 28 179 -91 -107 80 213 -289 -70 29 232 -484 46 214 224 -57
6362 -57 -13 210 122 -292 -229 27 42 -184 13 112 192 -135 113 -20 -116 -126 196 46 -132 -135 277 57 91 -143
6386 -143 -117 190 -130 -96 239 330 -368 -113 131 238 84 -289 186 144 -108 -128 251 128 195 105 26 113 -344
6409 -344 93 442 89 -318 100 145 -6 -580 68 325 -174 -190 -52 204 -131 -184 32 295 4 -193 99
6430 99 434 -149 9 154 -91 -295 -125 -55 -34 -189 -8 187 -112 -112 -283 375 260 -286 -157 242 24 -258
6452 -258 -140 290 -276 -139 115 338 -67 -28 -8 135 -192 -321 200 77 -25 -70 74 -19 -248 60 294
6473 294 286 -365 20 109 -72 -198 -23 229 -60 -479 171 371 157 -90 2 127 -43 -325 -109 479 -95
6494 -95 -480 180 137 -81 -100 172 239 -200 -245 215 285 -245 -124 84 279 36 -195 111 282 -65 -127 445
6516 445 307 -171 94 48 185 -137 -383 369 73 -325 74 237 -265 -165 -96 159 88 -347 126 -77 31
6537 31 -277 -83 268 -139 -149 289 384 -307 -156 194 286 -116 -330 152 208 -163 1 13 394 -251 -187 257
6559 257 32 -328 -112 192 182 52 42 419 109 -223 -163 308 -88 -386 232 187 -134 -311 203 388 260
6580 260 -506 311 320 15 -74 -41 401 -140 -343 19 92 56 -84 188 286 -192 -162 -36 -59 -292 46 253 -302
6603 -302 -249 -91 39 -131 -264 -12 252 9 -325 251 141 -224 -267 -175 174 212 -188 44 300 115 -163
6624 -163 16 327 -216 -94 -10 114 -50 18 268 338 -278 -194 480 -4 36 -16 159 95 -299 -142 135 69 -247
6647 -247 -167 167 -129 -435 -73 336 -107 -65 -163 177 -206 -160 42 175 -76 -215 41 -103 -108 -83 20 418
6669 418 8 -159 137 -16 -179 -43 85 -6 -193 -331 393 -166 -317 -26 190 -4 -357 19 182 -184
6689 -184 -212 67 171 27 -240 -99 265 -165 -112 299 129 60 -45 197 234 -237 -153 145 283 -162 -51 82
6711 82 -15 -168 -121 301 177 -165 -140 170 -57 -166 40 279 -5 -203 305 208 13 -343 -185 285 -57 -27
6733 -27 44 434 7 -71 278 63 99 -28 -240 29 -118 -251 537 171 -125 -237 -7 144 -182 -188 331 -35
6755 -35 -549 -63 160 105 -46 57 200 -401 -129 -12 137 -305 -215 114 279 -169 -206 261 124 9 -301
6776 -301 81 101 82 -202 26 -203 -374 -111 66 153 -56 -214 151 -109 -275 -118 238 -52 -178 -303 322
6797 322 24 -182 -23 219 -43 15 -51 263 -52 -271 221 102 -161 -205 -7 35 104 -293 -85 208 -103 -117
6819 -117 159 199 -206 -147 100 -42 -53 -49 132 287 -164 -75 670 39 -341 40 263 58 -177 91 153 186 -325
6842 -325 63 -58 -113 -245 50 446 -23 40 -13 270 27 -64 64 51 -306 -245 -25 -2 82 -151 189 108 -81
6865 -81 -501 120 179 -10 -138 23 511 -290 -329 316 146 -276 -127 282 113 -126 -155 108 17 -260 -50 315
6887 315 -59 -198 -87 102 21 101 -51 -90 -22 -324 282 -11 -37 104 28 192 -258 -189 -111 -111 -186 -159 242 127
6911 127 -280 -147 195 -93 -183 32 217 201 -332 -190 -25 78 -294 194 295 -106 -224 -5 55 89 -186
6932 -186 167 -71 16 -76 -44 172 -47 119 38 144 -257 -219 -31 112 -336 -28 139 80 -44 -157 34 -198
6954 -198 -108 -7 371 384 -184 -38 -14 -286 -33 76 250 -95 -71 -22 204 -218 -255 38 165 -107 -102 -2 101
6977 101 -31 -207 97 57 -306 -72 -4 -44 -218 -91 268 250 -81 -222 100 -119 -341 42 365 91 -204
6998 -204 -60 234 -270 -166 95 102 -109 -318 -144 24 2 -62 26 66 33 -200 136 68 -322 -263 17 202 -267
7021 -267 29 228 192 -136 -129 -43 -113 -168 161 65 -6 -572 -138 5 104 -165 119 356 -30 -222 215 76 89
7044 89 24 -137 100 93 48 47 396 -62 -196 104 -15 -165 -259 -20 227 -163 -78 214 252 -200 34 234 203 -336
7068 -336 -263 -5 29 -531 150 -35 155 -25 29 60 258 -334 61 380 35 61 -53 -51 -347 -238 300 45
7090 45 -342 -67 8 173 -200 -36 -23 59 -244 188 218 118 -348 28 126 94 -216 -221 202 154 -111 -309 72
7113 72 -166 -11 57 275 21 -130 -274 256 146 -253 429 187 -142 -105 87 65 -278 -272 -63 26 -119 -44 149
7136 149 62 -80 -273 -53 -6 -224 -102 38 138 148 240 26 260 -114 -140 306 38 -184 -6 80 -146 -110
7158 -110 -132 47 132 38 221 341 -135 -287 314 -134 -135 -87 158 172 -237 -263 141 64 -126 55 232 232 -153 -268
7182 -268 246 326 -154 -106 107 131 -254 14 161 -73 -21 75 106 -24 -165 116 103 -164 -41 24 70 -109 -226
7205 -226 -1 134 -28 -169 182 -15 56 -118 24 174 -159 -221 12 -186 -54 113 24 -30 -165 -182 296 114
7227 114 -434 -32 270 -203 -92 70 416 35 -277 335 60 -120 -167 365 47 42 -251 -108 -73 84 -313
7248 -313 141 141 50 -98 115 -39 51 -185 174 39 -7 -25 145 80 -72 -57 -300 128 -300 40 101 -137 -177
7271 -177 272 86 64 -171 157 -66 114 -198 56 278 -242 -104 22 -235 -79 -52 122 115 -302 -68 181
7292 181 113 98 -227 255 -189 -204 -367 335 22 69 -285 200 -148 84 -121 180 -62 -181 -22 220 8
7313 8 -79 28 193 -240 36 -50 146 -238 -147 86 85 84 -207 181 99 -187 32 22 177 -379 -49 276 -17 -153
7337 -153 -51 263 151 -326 -63 75 254 -42 111 442 98 -249 59 157 -100 -17 101 238 158 -321 54
7358 54 149 -109 -181 200 397 47 -188 210 40 -201 94 87 291 -28 -226 214 254 -106 -348 65 141 -246
7380 -246 -24 391 196 -91 -123 96 -57 89 -83 43 -11 -93 -55 224 -133 15 259 181 220 -199 277 98
7402 98 -234 226 123 -2 -103 -179 82 29 -19 -49 109 -147 -77 -81 25 7 -74 21 171 -10 -361 128 272 -150
7426 -150 -308 42 49 16 -232 172 165 -202 9 45 -130 -62 -333 286 76 -64 -138 60 -42 113 21 367 -88
7449 -88 -122 -358 338 56 -103 47 311 167 -142 195 126 -38 -219 -49 77 -80 -247 67 170 -17 -390
7470 -390 170 -252 -258 -211 81 -45 -217 -384 119 244 -141 -79 115 139 -10 -153 169 100 -334 -153 444 111
7492 111 -186 -153 123 -20 -144 66 127 -77 -68 95 182 -59 -78 -10 322 -119 -360 -62 237 -88 -313 141
7514 141 -67 -241 -251 77 346 -259 -218 81 122 -295 -125 482 300 -330 -32 194 279 -306 47 251 67
7535 67 -380 -96 269 -95 -134 280 330 -64 -503 153 79 -177 -175 220 607 97 -9 142 256 -122 -170 318
7557 318 194 -74 -300 93 -57 -340 -214 160 222 -272 -212 149 137 -89 30 113 -3 -113 26 199 192 -414
7579 -414 -84 124 -12 -37 -218 161 -96 -296 -174 190 -280 -246 387 70 -41 -222 33 360 -155 -6 203
7600 203 176 -149 27 251 -23 -91 -15 50 -31 -288 -266 419 -119 -235 -31 85 218 -363 -102 142 -144 -113
7622 -113 67 509 -44 -286 261 363 -70 -428 133 333 -266 -102 235 219 -148 -212 210 203 -272 144 83 136
7644 136 -536 -195 263 97 -346 92 211 159 -86 -241 155 0 -210 -52 534 -36 -410 61 85 4 -240
7665 -240 212 270 -10 -352 107 337 75 -273 220 180 -344 -296 357 89 -176 -130 258 215 -236 -158 332 77
7687 77 -405 -396 96 108 -484 -88 410 -216 -550 105 362 -402 -137 111 548 -50 -230 215 266 -49 -301 -16
7709 -16 -33 -140 -186 384 188 -159 -129 92 138 -487 -303 476 35 -269 -205 328 -5 -41 -269 258 437 -461
7731 -461 -121 337 195 -136 67 471 46 -180 261 407 -88 -179 41 237 -49 -244 136 370 -287 -178
7751 -178 252 160 -191 -339 225 356 -415 -242 302 259 -299 137 190 369 -213 -193 275 72 -164 -102 642 74
7773 74 -426 -96 485 115 -450 -54 195 -283 -204 200 389 -148 -512 -79 329 -60 -568 480 174 -512
7793 -512 -331 107 202 -385 -18 247 108 -337 -344 197 164 -242 -15 162 215 -342 -401 591 -37 -261 -178 506
7815 506 82 -444 402 488 -116 -521 146 285 -158 -110 27 395 -89 -158 19 608 -457 -198 272 283 -550
7836 -550 -378 407 108 -187 -395 141 26 -512 -31 619 176 -261 -66 266 101 -260 28 514 -146 -771
7856 -771 -78 513 -130 -266 196 285 -292 -227 178 182 -356 -105 186 244 -226 -65 81 135 -245 -253 32 440 -190
7879 -190 -157 167 374 -475 -290 498 286 -374 30 632 -22 -481 140 556 144 -461 -11 420 -254 -407
7899 -407 -148 448 -155 -351 297 281 -275 -421 109 265 -316 -505 141 237 -327 -214 236 266 -369 -67 386
7920 386 257 -394 -308 303 184 -259 -394 457 -77 -132 56 534 -134 -431 102 400 -33 -422 -66 440 -336
7941 -336 -591 216 383 77 -360 197 418 -318 -246 293 336 -388 -245 406 165 -125 -279 145 120 -231 -173
7962 -173 286 202 -505 -292 397 321 -368 110 436 -99 -394 126 337 -14 -199 -60 532 215 -288 -13 368
7983 368 -346 -310 99 199 -183 -732 209 196 12 -308 201 340 -453 -304 360 -5 -86 -166 166 241 -495 -114
8005 -114 148 182 -562 -89 499 -261 -395 -193 470 120 -530 -57 328 87 -367 122 467 -92 -470 67
8025 67 446 -278 -233 34 599 -247 -362 372 586 -362 -192 248 206 -270 -202 312 372 -408 -25 491 244 -405
8047 -405 -46 472 52 -327 3 545 -6 -404 239 716 -137 -392 164 492 -126 -530 -68 511 -334 -248
8067 -248 247 363 -340 -285 426 610 -206 -306 249 250 -686 -288 454 295 -92 -329 559 243 -467 -171 459
8088 459 27 -427 161 722 -5 -622 112 471 -68 -426 56 341 -18 -520 156 497 -28 -431 65 423
8108 423 -419 -437 384 165 -160 -292 420 390 -387 -308 574 155 -483 -48 472 284 -627 -92 413 175 -536
8129 -536 -316 568 169 -484 -240 220 -97 -420 -71 170 7 -503 9 575 -184 -547 227 438 -171 -183
8149 -183 76 427 175 -205 452 495 -44 -282 250 163 -429 -382 405 178 -393 -259 556 140 -404 155 297
8170 297 -162 -538 -19 597 -263 -888 159 721 -86 -392 -9 751 -114 -338 51 391 -338 -401 163 593
8190 593 73
8191G3
$$ Imaginary data points
##PAGE= N=2
##DATA TABLE= (X++(I..I)), XYDATA
0 0 0 0 0 0 0 0 0 0 0 0 8 -8 8 -8 8 -16 16 -16 24 -24 32 -35 45 -51 56 -67 80 -93 103 -119 138 -155 174
33 174 -196 225 -250 279 -311 349 -389 428 -475 529 -585 644 -709 784 -863 949 -1045 1151
51 1151 -1272 1401 -1547 1713 -1903 2120 -2371 2670 -3028 3463 -4010 4720 -5684 7049 -9135
66 -9135 12678 -19781 39253 -196773 -552743 260266 472174 -232298 -497662 284672 490146
77 490146 -360657 -412682 359889 381543 -353370 -403066 432870 334864 -455089 -265455 422892
88 422892 274177 -459165 -247573 510892 157044 -475865 -137348 467774 139199 -521816
98 -521816 -62825 511806 2559 -466045 -13952 495195 -28829 -513211 109645 457897
108 457897 -116823 -444913 121629 476547 -198342 -435978 236752 383020 -219990 -401416
118 -401416 265246 389786 -327053 -317980 313670 302999 -317818 -312540 381234 249856 -390177
129 -390177 -196818 362208 207755 -400024 -174742 432905 100437 -397908 -91139 396527
139 396527 87020 -438885 -17273 418594 -23238 -382282 12979 410094 -55815 -414745
149 -414745 119241 364389 -117271 -360252 127646 381811 -192915 -339781 214946 301057
159 301057 -201775 -318854 245638 300137 -290744 -241152 274834 235885 -285775 -238494 337900
170 337900 180557 -336833 -143525 317106 153387 -353504 -116909 373393 57214 -340892
180 -340892 -54685 346289 45059 -378371 17378 352914 -43962 -325354 35912 350885
190 350885 -79052 -345744 127881 300059 -120700 -301791 135232 314013 -191111 -270510
200 -270510 201257 241876 -191225 -257916 233412 232861 -264814 -183108 246827 183792 -261904
211 -261904 -179849 304503 126374 -296100 -100996 282764 108734 -317766 -70056 327452
221 327452 22218 -298266 -23964 309014 8825 -332379 46574 303727 -63430 -285351
231 -285351 58837 307750 -102100 -294859 139100 254943 -129982 -260346 148726 264463
241 264463 -196162 -221060 197301 200384 -191137 -212494 231226 182421 -250547 -139557 231972
252 231972 143648 -249678 -133306 282802 83087 -267597 -66878 259043 71803 -290719
262 -290719 -31254 291069 -7029 -264228 1816 278471 -21678 -294109 71031 263738
272 263738 -79507 -252122 78802 271756 -121920 -252694 149000 219089 -139365 -227163
282 -227163 161879 224147 -200751 -182033 196544 168846 -194433 -176645 231385 142849 -241373
293 -241373 -107352 223858 112888 -243079 -96848 266719 51058 -247406 -41090 242800
303 242800 42289 -270138 -1824 262204 -27992 -237714 21450 253174 -44941 -261086
313 -261086 87642 229564 -89399 -222972 92833 239041 -133762 -215341 152833 186908
323 186908 -143075 -196727 168892 188178 -201042 -148109 192362 140750 -195130 -144549 228862
334 228862 108825 -231878 -80690 216349 85913 -237046 -65264 252881 24195 -231683
344 -231683 -19432 230906 16171 -252449 23884 238613 -45498 -217771 39803 232609
354 232609 -65674 -232083 101038 201471 -98316 -198748 105059 209249 -142857 -181971
364 -181971 153097 159116 -145429 -168608 171822 154522 -196370 -118356 184765 115323 -191552
375 -191552 -115254 221380 79040 -218532 -57513 205999 62879 -227745 -38381 237417
385 237417 2543 -215707 -1332 218882 -5922 -236010 44420 218076 -59172 -201359
395 -201359 54983 215292 -82617 -208370 110916 179377 -105902 -179583 115550 184244
405 184244 -148752 -155370 152967 137361 -147077 -145110 172858 126500 -189836 -94634 177201
416 177201 94334 -186722 -89828 211440 54385 -203476 -38550 194525 42457 -215945
426 -215945 -15339 219010 -14896 -198466 13154 205454 -24905 -218060 60580 197042
436 197042 -70073 -184934 68271 197815 -97175 -186275 119565 159249 -112756 -162406
446 -162406 125868 162499 -155310 -132301 153842 118337 -150421 -124757 175267 102324 -185502
457 -185502 -74083 172109 76143 -183694 -66757 202818 33311 -190673 -22688 184662
467 184662 23903 -203439 4187 200707 -28358 -182069 25303 190699 -40339 -198026
477 -198026 72468 175985 -77322 -167992 77816 178751 -106985 -163601 123562 140047
487 140047 -116694 -144914 132809 140702 -157720 -110633 152983 101523 -152142 -105006 176328
498 176328 79596 -180609 -56430 167672 59256 -181091 -46318 194613 14742 -179612
508 -179612 -8302 176074 7607 -192438 21369 183948 -40351 -166745 36420 176200
518 176200 -53651 -178468 81704 155555 -82364 -150599 85336 159007 -113016 -140271 123989
529 123989 120769 -117795 -126071 135675 117469 -155876 -89292 148711 84244 -150763 -84294
540 -84294 173311 58137 -172630 -39125 161834 42500 -176023 -25856 184284 -2559
550 -2559 -167936 5186 167829 -9070 -180501 37706 168312 -51275 -153275 47253
560 47253 163129 -66472 -159659 90275 136645 -86875 -134602 92301 139623 -117682 -118125
571 -118125 123327 102281 -117353 -107798 136167 95188 -151106 -69352 141830 67258 -146561
582 -146561 -64562 165878 38219 -161080 -23672 152575 26392 -167167 -7460 171273
592 171273 -17455 -154754 17526 157085 -24339 -167221 51678 151939 -60573 -139552
602 -139552 57764 148879 -78422 -141110 97044 119155 -91796 -119858 99774 120635 -122380
613 -122380 -97923 122609 85231 -118078 -90432 136500 74414 -146255 -51349 135522 51588
624 51588 -141952 -46333 157748 20086 -149200 -9997 142222 11868 -156858 8977
634 8977 155901 -29758 -139982 28038 144670 -37117 -151459 62570 134548 -67796
644 -67796 -125465 66757 133730 -87431 -122654 102123 102785 -96186 -104641 106120 102410 -125622
656 -125622 -79372 122629 69945 -119507 -73556 137510 55461 -141861 -35030 130857 36830
667 36830 -138756 -28575 150230 3595 -138632 2595 134031 -2085 -146763 23672
677 23672 141767 -40508 -126430 36997 132379 -48745 -135163 71696 116940 -73015 -111090
688 -111090 73359 117577 -94845 -103704 104684 86101 -98545 -89471 110442 83812 -126949
699 -126949 -61141 121276 55083 -120653 -56382 137180 36352 -137334 -19619 126921
709 126921 22045 -136157 -10937 143388 -12147 -130200 15338 127205 -16701 -137645
719 -137645 38074 128578 -50412 -114918 46647 121348 -59952 -120119 79636 101511 -77378
730 -77378 -97759 79672 102400 -100060 -85698 105245 70918 -99065 -75045 112538 66510
741 66510 -125008 -44600 117511 41352 -119020 -40748 134393 19629 -130928 -6177 121418
752 121418 8632 -131776 4591 135568 -25410 -121446 26061 120679 -29848 -128583
762 -128583 51139 116741 -59227 -104872 55631 111431 -70391 -106010 85895 87590 -81918
773 -81918 -86208 85963 87960 -104164 -69702 105173 58025 -99646 -61516 113409 50346
784 50346 -122004 -30354 112679 29554 -115907 -26513 128755 5309 -122465 4464 114777
795 114777 -2182 -125070 18017 125575 -35911 -111094 34484 112797 -40490 -118093
805 -118093 61052 104083 -65640 -94352 63174 100807 -78716 -92673 91066 75057 -85435
816 -85435 -75388 91259 74494 -107145 -55493 104801 46373 -100717 -49378 113917 35716
827 35716 -118483 -18257 108500 18987 -113228 -13486 122953 -6974 -113652 12996
837 12996 107851 -12211 -117361 28655 114263 -43023 -100646 40599 103545 -48238 -106529
848 -106529 67134 91342 -69146 -84284 67827 89793 -84257 -78670 93034 63089 -86831
859 -86831 -64900 94686 61355 -108504 -41903 103369 35664 -100952 -37662 113581 21894
870 21894 -114315 -6969 104301 8911 -110401 -1180 116785 -17972 -105664 21401
880 21401 101583 -21249 -109978 38279 103112 -49483 -90514 45746 94953 -55484 -94569
891 -94569 71657 78588 -71085 -74403 71218 78171 -87209 -65207 92338 51576 -86587
902 -86587 -54078 95668 47770 -106553 -29318 99829 25587 -99071 -25846 111124 9030
913 9030 -108854 3214 99429 -502 -106460 10471 110113 -27687 -97650 28677 95355
924 95355 -30075 -102317 47477 92685 -54940 -81730 50952 86272 -61737 -83265 75600
935 75600 66849 -71774 -65058 73995 67132 -88999 -52243 90564 41253 -84923 -44386 95136
947 95136 35776 -102959 -18464 94700 16793 -96044 -15402 106462 -2126 -101404 11339
958 11339 93324 -8833 -101174 20762 101552 -35861 -88650 35168 88489 -38500 -93815
969 -93815 55254 81842 -59646 -72700 56301 77252 -68207 -71223 78768 55851 -73585
980 -73585 -55471 76928 55489 -90182 -39476 88466 31194 -83504 -34238 94112 23461
991 23461 -98243 -7970 89148 8313 -91979 -5018 100306 -12531 -92679 18433 86046
1002 86046 -16745 -93867 29833 91555 -42522 -79119 40063 80727 -45060 -83420 60688
1013 60688 70463 -62464 -63481 59956 67793 -72677 -59164 80338 45050 -74512 -45819
1024 -45819 79287 43644 -90515 -27566 86306 21687 -82525 -24099 92650 11527 -93665
1035 -93665 1740 84259 -177 -88223 4981 93958 -21264 -84506 24600 79647 -23324
1046 -23324 -86798 37205 81184 -47283 -69427 43879 72507 -50503 -73048 64238 59324
1057 59324 -63518 -54179 62665 57656 -75356 -47083 79757 34762 -73723 -36734 80090
1068 80090 32209 -89090 -16457 83155 12422 -81018 -13538 90291 110 -88651 10738
1079 10738 79573 -8325 -84234 15305 87209 -30062 -76641 30955 73430 -30945 -79312
1090 -79312 44876 71603 -51484 -61067 47708 64572 -55612 -62540 67022 48626 -64236
1101 -64236 -45720 64278 47992 -76492 -35890 78232 25186 -72238 -27602 79735 21201
1112 21201 -86507 -6336 78887 4414 -78491 -3943 86900 -10048 -82428 18528 74406
1123 74406 -15889 -79917 24782 80393 -37627 -69381 36899 67780 -38226 -72069 51857
1134 51857 62397 -55898 -53283 52022 56571 -60866 -52214 69893 39055 -65262 -37435
1145 -37435 66416 38090 -77528 -25145 76361 16922 -71189 -19217 78952 11175 -82759
1156 -82759 2463 74473 -2923 -75407 4706 82343 -19007 -75926 24829 69119 -22592
1167 -22592 -74706 32912 72723 -43759 -61541 41640 61839 -44708 -64029 57427 53073
1178 53073 -58998 -45963 55851 49133 -65325 -42306 71649 29909 -66182 -29997 68974
1189 68974 28702 -78077 -15065 74663 9167 -70415 -11297 77777 1734 -79119 10186 70462
1201 70462 -9060 -72497 12542 77648 -26084 -69181 29589 63977 -28285 -69239 38653
1212 38653 65088 -47780 -54282 44819 55426 -49067 -55878 60948 44363 -60123 -38641
1223 -38641 58056 41317 -68199 -32716 71854 21542 -66460 -22679 70423 19514 -77965
1234 -77965 -5868 72243 1988 -69347 -3133 76636 -7494 -74883 17340 66453 -15018 -69492
1246 -69492 20253 72228 -32604 -62605 34325 58932 -33557 -63762 44278 57488 -50602
1257 -50602 -47527 47231 49448 -52687 -47714 62781 35816 -60617 -32195 59499 33933 -68996
1269 -68996 -23981 70580 14320 -65056 -16075 69896 10865 -75268 1677 69222 -4130 -67247
1281 -67247 3958 73939 -15627 -70316 23282 62266 -20811 -65944 27228 66566 -38594 -56472
1293 -56472 38078 54416 -38143 -57735 49155 49622 -52841 -41164 49331 43745 -55964 -40460
1305 -40460 63767 28509 -59993 -26186 60091 27100 -68575 -16200 67920 8259 -62879 -10060
1317 -10060 68430 3680 -71844 7927 65054 -8949 -64152 10072 69809 -21899 -64470 27523
1329 27523 57775 -25300 -61569 32959 60333 -42649 -50214 40765 49057 -42314 -51023 53031
1341 53031 42251 -54282 -34912 50952 37323 -58430 -32120 63967 21150 -59539 -20484 60474
1353 60474 19539 -68137 -8569 65078 2868 -60727 -4370 66876 -3071 -67460 13571 60302
1365 60302 -13197 -60961 15449 64982 -27232 -58308 30401 52865 -28828 -56502 37393 53367
1377 53367 -44979 -43617 42564 44130 -45515 -44263 55006 34473 -54786 -28704 52266 30774
1389 30774 -59647 -24114 63318 14316 -57948 -14417 60470 12065 -66385 -1126 62064 -3129
1401 -3129 -58605 1989 63897 -10365 -63257 18702 55787 -17566 -57341 21186 59495 -31811
1413 -31811 -51673 33144 47682 -32327 -51004 40984 45932 -46553 -37302 43869 37827 -47383
1425 -47383 -36861 55858 26967 -54155 -22902 52443 24131 -59901 -16379 61535 7507 -56415
1437 -56415 -8278 59496 4753 -63826 5978 58207 -8553 -55881 7858 60660 -17017 -57965
1449 -57965 23832 50967 -21987 -52822 26869 53681 -35972 -45420 35994 42378 -35837 -45064
1461 -45064 44106 38671 -47795 -31101 44845 32369 -48947 -29510 55764 19559 -52572 -17003
1473 -17003 52309 17671 -59069 -8909 58513 1841 -53599 -3089 57266 -1947 -60188 11964
1485 11964 54068 -13399 -52697 13631 56819 -22932 -52639 27995 46144 -26193 -48563 31806
1497 31806 47563 -39836 -38890 38162 37173 -38919 -38669 46972 31197 -48597 -24795 45512 26299
1510 26299 -50517 -22588 55482 13363 -51150 -11720 51649 11382 -57489 -2349 55580 -3219
1522 -3219 -51255 2108 55266 -7985 -56349 16655 49497 -16767 -49249 18177 52573 -27655
1534 -27655 -46975 30665 41422 -29132 -43761 35257 41439 -42025 -32978 39859 32464 -41293
1546 -41293 -32809 48644 24624 -48949 -19291 46213 21071 -51531 -15572 54898 6780 -49929
1558 -49929 -6351 51313 5306 -55891 3908 52601 -8175 -48645 7014 52750 -13410 -52091
1570 -52091 20903 45479 -20124 -45797 22805 47913 -31039 -41327 33102 37253 -31760 -39640
1582 -39640 38317 35513 -43511 -27508 40751 27459 -43042 -26788 49797 18295 -48406 -14111
1594 -14111 46324 15394 -52115 -9021 53362 1293 -48644 -1357 50084 -1105 -53864 9799
1606 9799 49305 -12362 -46141 11820 50011 -18843 -48128 25029 41322 -23571 -42393 26668
1618 26668 43264 -34675 -35992 34935 33066 -34062 -34746 40810 29684 -44206 -22636 41239 23052
1631 23052 -44220 -21261 49955 12610 -47345 -9797 46033 10235 -51457 -3167 51222 -3538
1643 -3538 -46595 2837 48965 -6120 -51233 14766 45864 -16068 -43675 16019 46705 -23474
1655 -23474 -43769 28175 37606 -26162 -39137 30337 38481 -37099 -31136 36083 28753 -36470 -30016
1668 -30016 42602 23996 -44453 -17968 41387 18796 -45209 -16001 49123 7351 -45795 -5755
1680 -5755 45335 5834 -50082 1822 48483 -6938 -44166 6115 47113 -10382 -48062 18397
1692 18397 42361 -18712 -41167 19461 43650 -27006 -39141 30420 33351 -28718 -35313 33108
1704 33108 33676 -38748 -26035 37183 24696 -37883 -25238 43882 18578 -44055 -13500 41396
1716 41396 14402 -45520 -10320 48352 2978 -44128 -1905 44184 1471 -48388 6733 45652
1728 45652 -10237 -41887 9398 44559 -14335 -44358 21067 38644 -20608 -37882 22123 39920
1740 39920 -29461 -34316 31279 29989 -30043 -31906 34957 28874 -39248 -21553 37247 20950 -38680
1753 -38680 -20551 44107 13580 -43267 -9324 40977 10399 -45003 -5549 46631 -1483 -42251
1765 -42251 1385 42889 -2921 -45993 10486 42376 -13014 -39233 12637 42000 -18270 -40607
1777 -40607 23501 34658 -22513 -34636 24379 35743 -31379 -29774 31862 26178 -31127 -27861
1789 -27861 36282 23628 -39204 -17165 36736 17250 -38509 -15945 43400 9153 -41504 -5866
1801 -5866 39384 6224 -43802 -761 44043 -5331 -39613 4874 40873 -7328 -42949 14345
1813 14345 38683 -16146 -36000 15636 38876 -21644 -36245 25606 30671 -24086 -31480 26777
1825 26777 31275 -33000 -25160 32293 22466 -31735 -23681 37025 18781 -38982 -12887 35927 13321
1838 13321 -38314 -11395 42610 4046 -39411 -2484 38190 2519 -42148 3376 41203 -8377
1850 -8377 -36835 7652 38743 -11189 -39759 17443 34910 -18128 -33324 18424 35379 -24106
1862 -24106 -31742 27538 26983 -25602 -27831 29254 26871 -34001 -20293 32420 18525 -32582 -19173
1875 -19173 37155 14150 -38057 -9095 35187 9708 -37955 -6842 40733 43 -37173 850
1887 850 36721 -1094 -39935 7278 38027 -11474 -34218 10405 36215 -14033 -36351 20066
1899 20066 31201 -20014 -30011 20513 31876 -26594 -27137 28282 22866 -26591 -24289 30624 21834
1912 21834 -34445 -15534 32494 14919 -32970 -14914 37755 8852 -36759 -4901 34284 6031
1924 6031 -37262 -2218 38847 -4014 -35158 4119 35275 -4963 -37822 11303 34694 -13809
1936 -13809 -31276 12760 33480 -17327 -32531 22477 27395 -21229 -26986 22385 28310 -28306
1948 -28306 -22746 29178 19367 -27406 -20789 31757 17554 -34307 -11731 31819 11606 -32930
1960 -32930 -10545 37189 4724 -35366 -1473 33347 2311 -36186 2088 36729 -7833 -32768
1972 -32768 7188 33294 -8307 -35517 14842 31220 -16463 -28750 15371 30720 -19977 -28680
1984 -28680 23999 23649 -22558 -24358 24136 24092 -29347 -18570 29039 15919 -28002 -17408 32096
1997 32096 13427 -34065 -7934 30918 8106 -32696 -6946 35878 457 -33662 1435 32026
2009 32026 -853 -35278 5813 34659 -10442 -30204 9756 31486 -11653 -32445 17681 28108
2021 28108 -18128 -26123 17722 27906 -22691 -25128 25840 20303 -23597 -20950 25855 20120 -30377
2034 -30377 -14699 29134 12968 -28259 -13758 32602 9362 -33281 -4771 30015 5324 -32108
2046 -32108 -3187 34724 -2632 -31656 4001 30507 -3867 -33547 8839 31837 -12583 -27744
2058 -27744 11654 29490 -14133 -29747 19658 25054 -19234 -23543 19191 25002 -24323 -21456 26049
2071 26049 17105 -24134 -18270 27195 16569 -30630 -10754 28913 9814 -28278 -10416 32458
2083 32458 5222 -31871 -1615 29053 2514 -31686 380 33008 -5805 -29660 6249 28909
2095 28909 -6543 -31420 11850 28821 -14371 -25440 13251 27069 -16628 -26382 21227 21730
2107 21730 -20152 -20899 20773 22193 -25221 -17671 26039 14123 -24519 -15206 27807 13181 -30364
2120 -30364 -7561 27907 7211 -28278 -6775 31842 1488 -30455 1392 27794 -143 -30465
2132 -30465 3631 30929 -8510 -27256 8064 27173 -9011 -28828 14591 25782 -15986 -23122
2144 -23122 14822 24830 -18374 -23291 22018 18423 -20607 -18385 21693 18948 -25958 -14218 25954
2157 25954 11454 -24424 -12450 27563 9605 -29251 -4716 26900 4819 -27580 -3814 30310
2169 30310 -1236 -28630 3344 26664 -2394 -28978 6448 28485 -10625 -24926 9896 25654
2181 25654 -11137 -26654 16126 22927 -16771 -20378 15974 22343 -19964 -20016 22584 15786 -20651
2194 -20651 -15979 22422 15776 -26449 -11161 25515 8829 -23900 -10194 27730 6387 -28468
2206 -28468 -1961 25446 2387 -26643 -1247 29129 -4184 -26530 5243 24716 -4664 -27099
2218 -27099 9179 26057 -12306 -22358 11391 23468 -13243 -23993 17812 19704 -17627 -18284
2230 -18284 17280 19706 -21163 -16678 23106 12584 -21128 -13200 23090 12425 -26247 -7440
2242 -7440 24420 6210 -23725 -7005 27078 2831 -26957 546 24246 136 -25762 1845
2254 1845 27547 -6606 -24465 6937 23344 -6767 -25461 11333 23301 -13578 -20064 12464
2266 12464 21587 -14988 -21160 18922 16977 -18088 -16081 18347 16993 -22105 -13385 22839 10021
2279 10021 -21019 -11261 23257 9358 -25700 -4284 23861 3969 -23395 -4180 26153 -271
2291 -271 -25431 3004 23001 -1790 -24661 4407 25683 -8859 -22127 8571 21616 -8967
2303 -8967 -23296 13449 21113 -14807 -17659 13782 19111 -16396 -18107 19644 13633 -18512 -13652
2316 -13652 18893 14241 -22573 -10223 22414 7215 -21012 -8515 23437 6225 -24823 -1730
2328 -1730 22588 1911 -22946 -1347 25404 -2886 -23775 5088 21529 -4201 -23383 7009
2340 7009 23206 -11042 -19750 10233 20020 -10741 -21199 15092 18054 -16066 -15709 14760 16909
2353 16909 -17978 -15267 20114 11403 -18923 -11292 19403 11759 -22908 -7155 22197 5320 -20725
2366 -20725 -6197 23363 3195 -24136 596 21408 -29 -22031 1276 24172 -5585 -21741
2378 -21741 6869 19927 -6024 -21918 9689 21067 -12453 -17851 11473 18271 -12752 -18630
2390 -18630 16383 15459 -16272 -13596 15660 14625 -19001 -12301 20605 9032 -18598 -9309 20195
2403 20195 8560 -22854 -4436 21378 3266 -20367 -3727 23077 724 -22874 2845 20126
2415 20126 -2053 -21334 3439 22658 -7555 -19724 8077 18939 -7864 -20604 11457 18879
2427 18879 -13519 -15892 12355 16684 -14037 -16419 17317 12818 -16855 -11840 16556 12491 -19810
2440 -19810 -9609 20700 6355 -18991 -7335 20189 5948 -22406 -1862 20434 1128 -20066
2452 -20066 -1430 22100 -1976 -21568 4709 19256 -3787 -20658 5886 21216 -9377 -18209
2464 -18209 9476 17455 -9687 -18753 13193 16441 -14477 -13858 13206 14905 -15447 -13889 18297
2477 18297 10793 -17074 -9721 17328 10346 -20045 -7060 20172 4258 -18890 -5144 20436
2489 20436 3254 -21901 149 19622 -443 -19399 713 21435 -4392 -20294 6304 18021
2501 18021 -5668 -19589 7816 19251 -10902 -16353 10534 15937 -10796 -17073 14288 14453 -15201
2514 -15201 -12380 14177 13172 -16350 -11968 18519 8410 -16929 -7820 17283 7878 -20129 -4448
2527 -4448 19667 2723 -18198 -3495 20255 888 -20846 2253 18556 -1861 -18958 2775
2539 2775 20381 -6287 -18715 7615 16964 -6966 -18073 9450 17696 -12184 -14523 11269 14563
2552 14563 -11993 -15077 15123 12054 -15351 -10431 14765 11125 -17084 -9432 18433 6354 -16930
2565 -16930 -6326 17880 5790 -19806 -2535 18698 1037 -17568 -1485 19687 -967 -19720
2577 -19720 3867 17479 -3373 -17941 4341 19007 -7658 -16925 8557 15567 -8300 -16910
2589 -16910 10970 15642 -12980 -12661 11864 12884 -12943 -13013 15910 9727 -15788 -8585 14941 9233
2603 9233 -17168 -6989 18151 4326 -16353 -4394 17903 3981 -19323 -227 18104 -459
2615 -459 -17283 415 18811 -2980 -18407 5292 16150 -4587 -16901 6005 17718 -9316
2627 -9316 -15107 9260 14241 -9100 -15208 11942 13419 -13488 -11206 12311 11554 -13965 -10842 16106
2641 16106 7726 -15308 -6940 15317 7600 -17386 -4786 17474 2598 -16148 -3093 17525
2653 17525 1487 -18670 1526 16886 -1878 -16233 1834 18043 -4879 -16821 6356 14779
2665 14779 -5837 -15667 7859 15969 -10433 -13365 10036 12827 -10346 -13391 12849 11487 -13617
2678 -13617 -9320 12761 9883 -14289 -8907 16185 6072 -15151 -5570 15387 5776 -17074 -2826
2691 -2826 17018 1053 -15602 -1362 16908 -178 -17685 3059 16004 -3114 -15532 3126
2703 3126 16868 -6312 -15214 7257 13576 -6611 -14686 9124 14409 -11197 -11372 10543 11652
2716 11652 -10986 -11910 13751 9526 -13828 -7732 12945 8478 -14804 -6768 16104 4389 -14635
2729 -14635 -4131 15159 4058 -17034 -821 16278 -486 -14820 43 16308 -1792 -16742
2741 -16742 4620 14749 -4248 -14530 4641 15410 -7898 -13652 8402 12255 -8062 -13251
2753 -13251 9919 12303 -11828 -10047 11159 10142 -11555 -10430 14017 7530 -13937 -6380 12995
2766 12995 6878 -15141 -4792 15711 2429 -14182 -2342 14798 1924 -16547 767 15348
2778 15348 -1574 -14158 1384 15768 -3526 -15258 5823 13299 -5531 -13785 6241 14218
2790 14218 -8835 -12086 8954 11119 -8910 -12122 10999 10661 -12328 -8287 11239 8698 -12267
2803 -12267 -8429 14325 5749 -13696 -4892 13032 5295 -14962 -3064 15224 1042 -13932 -1205
2816 -1205 14732 513 -15714 2366 14260 -2929 -13606 2471 14718 -5049 -14138 6656
2828 6656 12108 -6387 -12993 7528 13005 -10100 -10630 9751 10237 -9430 -10539 11759 9205 -12318
2842 -12318 -7042 11662 7472 -12580 -6746 14165 3961 -13631 -3468 13242 3789 -14674 -1586
2855 -1586 14498 -278 -13160 -101 14151 -931 -14921 3608 13374 -3819 -12800 3691
2867 3691 14214 -6348 -12770 7340 11267 -6899 -11841 8501 11542 -10296 -9233 9806 8955
2880 8955 -9795 -9335 12211 7635 -12712 -5881 11528 6122 -12935 -5365 14190 2643 -13022
2893 -13022 -2412 13159 2226 -14605 -184 14063 -1389 -12767 1009 13849 -2512 -14020
2905 -14020 4869 12372 -4524 -12144 4900 13138 -7302 -11545 8183 10170 -7403 -10885 9183
2918 9183 10242 -10844 -7897 10103 7857 -10562 -7978 12457 5817 -12342 -4341 11551 4833
2931 4833 -13000 -3457 13797 1330 -12579 -1385 12750 997 -14085 1401 13093 -2443
2943 -2443 -11944 1921 13179 -3720 -13013 5733 11286 -5257 -11532 5832 11870 -8136 -10376
2956 -10376 8426 9128 -7897 -9728 9895 8673 -11233 -6590 10155 6651 -10775 -6800 12398
2969 12398 4356 -12383 -3270 11438 3610 -13027 -2299 13278 230 -11981 -331 12422
2981 12422 -111 -13481 2613 12073 -3293 -11299 2991 12490 -4893 -12073 6567 10035 -5845
2994 -5845 -10370 6704 10657 -8893 -8646 8998 8117 -8161 -8434 10263 7021 -11330 -5618 10163
3008 10163 5764 -11061 -4980 12591 2805 -11534 -2287 11464 2403 -12755 -507 12606 -1217
3021 -1217 -11400 431 12032 -1524 -12673 3736 11271 -3920 -10496 3927 11551 -5963 -10939
3034 -10939 6926 9027 -6476 -9390 7535 9580 -9253 -7595 8793 6781 -8917 -7443 10550
3047 10550 5781 -11260 -4172 10091 4380 -11191 -3890 12505 1629 -11192 -1248 11093 1532
3060 1532 -12305 745 11752 -2103 -10641 1283 11514 -2537 -11895 4496 10155 -4590 -9857
3073 -9857 4656 10624 -6691 -9467 7314 7966 -6954 -8702 8123 8229 -9722 -6265 9118 5854
3087 5854 -9019 -6059 10713 4411 -10796 -3235 9941 3471 -11045 -2723 11740 505 -10720
3100 -10720 -366 10754 288 -11867 1821 10934 -2663 -9935 2312 10981 -3540 -10717 5407
3113 5407 8879 -5176 -9202 5634 9574 -7264 -8139 7608 7104 -7062 -7654 8445 6622 -9595
3127 -9595 -4951 8937 4734 -9415 -4926 10931 2980 -10263 -2020 9316 2377 -10825 -1151
3140 -1151 11205 -680 -9946 474 10221 -734 -11181 2706 10109 -3361 -9384 3072 10140
3153 10140 -4810 -9716 5909 8134 -5670 -8275 5980 8320 -7842 -6774 7906 5906 -7353
3166 -7353 -6552 8878 5723 -9397 -3644 8550 4042 -9313 -3824 10676 1706 -10063 -1028 9090
3180 9090 1486 -10556 -241 10602 -1451 -9126 1291 9665 -1708 -10373 3627 9330 -4138
3193 -4138 -8507 3947 9281 -5283 -8527 6743 7206 -5892 -7471 6545 7604 -8014 -5460 8026
3207 8026 5026 -7574 -5630 8842 4346 -9519 -2832 8654 3031 -9547 -2419 10305 696
3220 696 -9517 -360 9153 373 -10243 1054 9845 -2623 -8485 2023 9259 -2452 -9644 4717
3234 4717 8067 -4334 -7758 4443 8491 -5872 -7429 6778 5948 -6303 -6527 7132 6468 -8060
3248 -8060 -4478 8058 4213 -7804 -4361 9193 2753 -9222 -1968 8431 1951 -9043 -1540
3261 -1540 9903 -247 -8736 475 8680 -302 -9696 2089 8820 -2974 -7999 2821 8714 -3704
3275 -3704 -8624 5028 7091 -4551 -7088 4862 7520 -6540 -6187 7256 5233 -6461 -5878 7576
3289 7576 5107 -8353 -3832 7865 3437 -7933 -3565 8996 1977 -8905 -846 8222 1276 -9108
3303 -9108 -393 9424 -1309 -7957 1175 8122 -1289 -9273 3149 8276 -3445 -7267 3166 7978
3317 7978 -4341 -8008 5316 6319 -5178 -6379 5152 6744 -7161 -5546 6872 4343 -6703
3330 -6703 -4787 7738 4066 -8487 -2767 7684 2585 -7867 -2573 8985 1036 -8411 -123 7809
3344 7809 710 -8642 568 9063 -2020 -7856 1862 7733 -2096 -8418 3837 7206 -3917 -6624
3358 -6624 3734 7493 -4707 -6737 5847 5551 -5276 -5778 5767 5937 -7186 -4343 6943 3725
3372 3725 -6526 -4244 7739 2998 -8280 -1775 7024 1944 -7785 -1435 8599 176 -8182 507
3386 507 7548 -336 -8474 1312 8214 -2338 -7094 2180 7385 -2747 -7676 4118 6591 -4112
3400 -4112 -6409 4120 6674 -5353 -5848 6022 4917 -5340 -5121 6170 4865 -7245 -3400 6620
3414 6620 3053 -6479 -3358 7578 2511 -7812 -1248 6952 1345 -7612 -543 8359 -641 -7536
3428 -7536 960 7071 -669 -8120 2194 7529 -2847 -6604 2595 6944 -3274 -7108 4705 5806
3442 5806 -4378 -5475 4133 5972 -5906 -4920 6058 4026 -5615 -4474 6252 4008 -7284 -2599
3456 -2599 6676 2417 -6542 -2668 7662 1338 -7468 -440 6842 837 -7096 137 7874 -1410 -7039
3471 -7039 1334 7008 -1370 -7255 2878 6794 -3288 -5976 3057 6320 -3809 -6378 4742 5188
3485 5188 -4588 -4681 4591 4965 -5797 -4231 6157 3531 -5471 -3716 6645 3176 -7126 -1692 6444
3500 6444 1671 -6514 -1600 7407 420 -7210 158 6519 115 -6999 877 7119 -2055 -6342 1652
3515 1652 6223 -2069 -6652 3416 6032 -3917 -5485 3195 5824 -4446 -5500 5235 4105 -4720
3529 -4720 -4171 5095 4682 -6056 -3381 6171 2588 -5247 -3148 6336 2267 -6816 -1055 6122 1051
3544 1051 -6462 -664 7258 -291 -6248 956 6037 -411 -6579 1751 6822 -2352 -5436 2263 5732
3559 5732 -2315 -6363 3966 5083 -3861 -4723 3715 5252 -4680 -4913 5384 3538 -4680 -3719 5002
3574 5002 3772 -5966 -2433 5969 1909 -5781 -2274 6412 1685 -6561 -580 5840 597 -6232 -325
3589 -325 6847 -934 -6456 1048 5436 -1038 -6545 2185 6162 -3056 -5230 2681 5635 -2916 -5688
3604 -5688 3999 4552 -4032 -4542 3590 4653 -4843 -3803 5345 2903 -4959 -3081 5350 2898 -6171
3619 -6171 -1774 5522 1430 -5382 -1833 6425 628 -6123 -131 5385 -64 -5897 355 6248 -1434
3634 -1434 -5488 1982 5217 -1550 -5987 2465 5480 -3238 -4701 2837 5181 -3506 -4777 4359 3984
3649 3984 -4215 -3671 3958 4162 -5139 -3187 5392 2301 -4732 -2353 5450 2159 -6029 -940 5255
3664 5255 744 -5509 -1046 6202 29 -5831 985 5224 -480 -5841 1221 5867 -2105 -5033 1939
3679 1939 4876 -2055 -5319 3112 4964 -3519 -4318 3209 4472 -3604 -4166 4452 3173 -4301 -3143
3694 -3143 4349 3289 -5421 -2549 5445 1913 -4973 -1814 5285 1575 -5657 -224 5279 408 -5145
3709 -5145 -426 5966 -608 -5461 1292 4854 -844 -5382 1661 5533 -2461 -4669 2272 4729 -2519
3724 -2519 -5166 3312 4183 -3513 -3610 3513 3925 -3880 -3452 4586 2711 -4273 -2649 4316 3080 -5206
3740 -5206 -1840 5233 1302 -4900 -1418 5235 964 -5496 76 5015 3 -5076 94 5485 -1326
3755 -1326 -5139 1612 4691 -1027 -4934 2104 4788 -2658 -4239 2460 4266 -2818 -4534 3434 3571
3770 3571 -3745 -3106 3369 3328 -4337 -2837 4391 1790 -4262 -2422 4626 2310 -5231 -1122 4972 685
3786 685 -4625 -1213 5175 333 -5174 362 4546 -351 -4987 379 5399 -1619 -4635 1518 4514
3801 4514 -1583 -4645 2655 4345 -2987 -3537 2810 3676 -2903 -3850 3947 2961 -3824 -2542 3823 2815
3817 2815 -4287 -2374 4788 1617 -4461 -1921 4597 1536 -5109 -402 4758 682 -4587 -360 5096
3832 5096 -289 -4964 962 4311 -638 -4627 1404 4575 -1901 -4200 1520 4132 -1947 -4419 2746
3847 2746 4028 -3306 -3315 3040 3553 -3119 -3473 3992 2611 -3746 -2397 3720 2426 -4467 -1533 4652
3863 4652 1313 -4005 -1226 4378 934 -4789 -137 4355 -118 -4368 -129 5041 -614 -4540 1235
3878 1235 3878 -970 -4273 1737 4369 -2249 -3683 2261 3861 -2377 -3889 2733 3279 -3083 -2631
3893 -2631 3106 3094 -3509 -2858 4182 1947 -3776 -1626 3815 1943 -4410 -1397 4166 713 -3893 -652
3909 -652 4300 173 -4430 319 3990 -330 -3996 720 4481 -1392 -4392 1591 3745 -1232 -3976
3924 -3976 1763 4202 -2413 -3248 2268 3281 -2512 -3746 3420 2765 -3172 -2241 2916 2708 -3457 -2096
3940 -2096 4016 1538 -3755 -1503 4019 1426 -4406 -711 3971 342 -3838 -501 4307 -223 -4403
3955 -4403 625 3886 -450 -3806 852 4011 -1596 -4003 1578 3557 -1717 -3875 2278 3247 -2894
3970 -2894 -2645 2564 2870 -2499 -2928 3287 2393 -3412 -2041 3046 1997 -3731 -1728 3832 906 -3345
3986 -3345 -908 3774 1056 -4288 -461 3708 5 -3747 -305 3974 -419 -3884 830 3377 -841
4001 -841 -3716 1216 3805 -2144 -3138 1918 3070 -1454 -3539 2387 2831 -2794 -2422 2600 2486 -2591
4017 -2591 -2495 3167 1973 -3180 -1619 3204 1926 -3787 -1275 3899 694 -3308 -697 3743 579
4032 579 -4244 8 3653 -247 -3256 78 3864 -1038 -3701 1297 3215 -1205 -3441 1244 3472
4047 3472 -2189 -2889 2055 2915 -2073 -3317 2579 2725 -2984 -2009 2652 2355 -2954 -1923 3323 1466
4063 1466 -3027 -1473 3259 1257 -3431 -694 3734 168 -3256 -541 3569 235 -3706 532 3301
4078 3301 -400 -3242 279 3662 -1541 -3360 1509 2831 -1260 -3458 1918 3448 -2034 -2490 2125
4093 2125 2565 -2191 -2935 2762 2226 -2903 -1777 2579 1864 -2702 -1706 3425 1197 -2922 -1046 2927
4109 2927 970 -3732 -647 3569 181 -3228 -90 3468 -90 -3362 637 3156 -744 -3242 791
4124 791 3328 -1631 -3164 1721 2757 -1417 -2979 2040 2750 -2490 -2236 2173 2263 -2363 -2396 2805 1705
4141 1705 -2977 -1454 2666 1536 -3055 -1135 3407 962 -3035 -693 3030 591 -3612 -120 2988
4156 2988 -198 -3118 120 3480 -565 -3273 1021 2965 -848 -2827 998 2961 -1598 -2662 1857
4171 1857 2330 -1764 -2599 2115 2575 -2347 -2259 2063 2266 -2482 -2053 2806 1444 -2796 -1036 2577 1425
4188 1425 -2910 -877 2953 512 -2717 -612 3089 237 -3197 228 2967 -372 -2908 208 3239
4203 3239 -850 -2885 1192 2573 -1141 -2883 1517 2859 -1839 -2286 1603 2167 -1915 -2416 2331 2124
4219 2124 -2486 -1800 1946 1533 -2650 -1674 2757 1083 -2575 -928 2521 976 -2910 -651 3119 148
4235 148 -2792 -151 2906 -147 -2695 615 2638 -435 -2697 736 3229 -989 -2978 1380 2263
4250 2263 -884 -2492 1605 2541 -1861 -2037 1886 2000 -1955 -2181 2225 1720 -2386 -1337 2013 1601
4266 1601 -2531 -1359 3053 791 -2889 -886 2656 840 -2986 -315 2606 -142 -2596 -53 2664
4281 2664 -76 -2759 637 2487 -727 -2591 699 2520 -1248 -2308 1396 2149 -1435 -2475 1600
4296 1600 2243 -2076 -1748 1814 1537 -1928 -1938 2199 1357 -2295 -879 2096 1231 -2465 -984 2397 502
4313 502 -2336 -517 2475 458 -2679 -7 2564 -287 -2310 274 2877 -295 -2616 877 2181
4328 2181 -1051 -2319 889 2266 -1626 -2135 1609 1838 -1611 -2136 1853 1552 -1833 -1278 1856 1362
4344 1362 -2047 -1565 2538 1115 -2481 -909 1825 1018 -2623 -796 2407 83 -2432 -341 2430
4359 2430 177 -2563 342 2376 -310 -2232 417 2379 -726 -2534 1258 1963 -1002 -2235 958
4374 958 2331 -1442 -1809 1549 1149 -1342 -1833 1883 1559 -2057 -1200 1767 1073 -2119 -1104 2244 830
4391 830 -2127 -572 1831 478 -2526 -132 2389 -328 -2073 -97 2236 -180 -2335 543 2069
4406 2069 -566 -2107 582 2101 -803 -2232 1313 1862 -904 -2123 1273 2117 -1750 -1450 1644 1207
4422 1207 -1711 -1625 1900 1077 -2083 -1082 1658 667 -1869 -849 2268 534 -2049 -367 2120 190
4438 190 -2136 172 2250 -281 -2006 325 2133 -311 -2435 423 2098 -739 -2005 749 1950
4453 1950 -1084 -1950 1116 1836 -941 -1828 1506 1631 -1813 -1211 1590 1333 -1549 -1338 1757 993 -2088
4470 -2088 -746 1866 773 -2067 -481 2179 182 -2112 -210 1869 800 -2113 8 2159 -534
4485 -534 -1733 223 1944 -494 -2168 790 1680 -725 -1746 845 2033 -1435 -1756 1289 1452 -1371
4501 -1371 -1746 1280 1368 -1640 -948 1509 1204 -1505 -1215 1949 450 -2075 -370 1501 524 -2228 -289
4518 -289 2205 93 -1753 -267 2166 45 -1920 260 2048 -514 -1909 690 1963 -657 -1839
4533 -1839 863 1322 -678 -1706 780 1656 -1219 -1542 1400 1182 -1000 -1368 1542 937 -1848 -574
4549 -574 1379 865 -1703 -826 1881 532 -1672 -276 1750 601 -1965 -244 2027 -133 -1628 143
4565 143 1528 -118 -1956 455 1782 -588 -1676 438 1698 -735 -1477 1032 1484 -995 -1484 1043
4581 1043 1329 -1387 -1483 1277 1071 -1408 -1040 1580 810 -1573 -595 1566 745 -1535 -659 1895 129
4598 129 -1632 -71 1276 199 -1859 202 1578 -202 -1501 245 1659 -386 -1549 615 1509
4613 1509 -850 -1437 209 1598 -668 -1854 903 1194 -1065 -1306 993 1212 -1131 -1112 1455 850 -1311
4630 -1311 -1058 1413 613 -1500 -574 1210 752 -1451 -663 1705 438 -1606 -122 1410 269 -1821
4646 -1821 47 1566 -300 -1351 96 1606 -284 -1593 985 1261 -617 -1142 643 1256 -1045 -1239
4662 -1239 1024 1020 -780 -1081 1102 1190 -1324 -752 1281 784 -879 -992 1366 501 -1384 -357 1246
4679 1246 373 -1421 -257 1560 37 -1804 20 1509 -73 -1469 185 1364 -242 -1273 294
4694 294 1609 -761 -1536 884 1132 -896 -1172 822 1191 -1071 -1186 1094 864 -802 -782 1071 1072 -1404
4712 -1404 -542 1348 529 -1236 -644 1195 413 -1230 -243 1260 334 -1184 -215 1451 -191 -1177 241
4729 241 1286 -202 -1416 239 1116 -407 -1149 230 1093 -746 -1173 615 1054 -623 -1369 809 1000
4746 1000 -1170 -1049 970 721 -713 -873 1163 669 -1351 -524 1223 509 -1281 -379 1391 0 -1158
4763 -1158 -216 976 321 -1476 223 1375 -117 -1227 252 1135 -192 -1288 388 1309 -952 -1039
4779 -1039 416 1259 -662 -1008 908 896 -749 -889 663 850 -1026 -850 876 720 -761 -988 914
4796 914 615 -1510 -243 888 163 -1073 -457 1021 81 -984 72 1049 -2 -911 92 1225 -421
4813 -421 -978 356 964 -443 -1128 623 1229 -676 -876 510 681 -1001 -1023 944 844 -683 -934 943
4831 943 779 -826 -435 1043 166 -1089 -705 1352 317 -1207 107 933 139 -935 22 1128 -168
4848 -168 -959 -57 1122 -89 -949 111 1204 -235 -1242 169 884 -566 -822 470 768 -565 -874
4865 -874 399 647 -714 -603 678 586 -655 -703 893 500 -1226 -814 782 439 -543 -494 962 362
4883 362 -1244 -214 826 136 -1021 9 1099 -167 -984 -45 919 -355 -1179 105 812 -517 -747
4900 -747 406 853 -403 -760 662 698 -399 -526 561 732 -826 -604 642 514 -881 -611 791
4917 791 202 -943 -245 718 185 -930 -505 1072 -12 -856 6 974 393 -1063 -246 743 -437 -813
4935 -813 -136 875 -441 -993 315 890 -528 -676 450 802 -490 -484 594 422 -808 -561 492 557
4953 557 -854 -372 836 589 -585 -354 732 156 -762 -323 968 247 -837 -43 983 260 -1216
4970 -1216 175 767 -139 -771 187 850 -200 -692 254 598 -109 -739 761 782 -503 -377 494 672 -586
4989 -586 -451 395 635 -534 -467 793 470 -690 -516 631 392 -838 -223 1008 81 -545 -105 734
5007 734 -26 -990 -175 600 -102 -646 354 901 -212 -798 -54 694 -392 -432 145 706 -191 -1049 585
5026 585 382 -501 -470 469 398 -605 -445 520 416 -657 -204 727 439 -569 -128 739 -17 -634 -262 596
5046 596 136 -672 84 601 -36 -807 63 711 -334 -704 255 547 -37 -644 182 828 -270 -386 183
5065 183 566 -361 -513 473 570 -313 -360 526 572 -516 -610 563 53 -458 -189 577 175 -776 -104 588 -98
5086 -98 -584 -259 627 63 -502 0 518 -112 -613 -138 408 -136 -810 127 521 -352 -427 333 617 -332 -402
5107 -402 482 166 -151 -567 363 116 -346 -230 434 342 -573 -283 422 223 -402 -207 312 339 -426 -265 463
5128 463 291 -503 137 576 -212 -690 332 296 -27 -513 133 480 -392 -474 389 553 -43 -621 188 366
5148 366 -449 -616 222 277 -440 -340 235 288 -505 -387 163 403 -514 -187 320 228 -181 -258 770 188 -453
5169 -453 160 116 198 -367 -206 511 -120 -257 -62 407 -31 -454 266 554 -207 -486 277 498 69 -536 422
5190 422 250 -205 -352 228 403 -370 -299 253 214 -177 -452 514 385 -324 -313 440 205 -536 -317 499 285
5211 285 -387 -58 392 447 -375 -89 589 -104 -379 -3 382 -138 -626 319 288 -259 -350 110 306 -241 -600
5232 -600 247 348 -716 -535 267 -35 -434 -308 215 269 -283 -221 454 29 -380 -30 363 -74 -391 -342 450
5253 450 -221 -175 142 345 -53 -495 -167 155 -1 -403 -27 281 -124 -422 200 117 -292 -319 107 368 -292
5274 -292 -148 313 322 -214 -129 282 218 -140 -417 267 -9 -325 -13 159 3 -284 90 201 5 -115 -247
5295 -247 563 -339 -136 52 381 -43 -401 -55 79 61 -260 43 327 -254 -234 225 232 -99 -386 -114 28
5316 28 -146 -344 214 2 -384 -32 372 -18 -289 -73 156 34 -462 -22 268 253 -71 -66 316 122 -252
5337 -252 6 220 1 -287 -155 222 -41 -226 -57 77 -267 -97 285 344 -299 -184 373 278 33 -58 309
5358 309 201 -247 0 290 291 -416 -322 135 7 -292 -154 301 125 -202 -54 329 -195 -299 342 176 11
5379 11 -219 43 308 93 -174 30 319 -20 -285 71 471 -331 -276 244 297 -224 -48 -17 247 -205 -150 190
5401 190 183 -397 -287 250 -47 -251 -265 331 70 103 47 221 -50 -307 -128 201 30 -8 219 236 165 -254 215
5424 215 200 109 -433 328 297 -3 -333 -152 378 -12 -108 -95 73 -103 -189 201 430 -278 -330 177 -54 -171
5446 -171 -96 316 148 -262 -328 207 103 -397 6 93 149 -410 80 317 -106 -144 153 328 46 -278 -61 311
5468 311 -132 -197 -9 120 -58 -312 303 -52 -147 -11 119 140 -80 -180 289 246 10 -80 -61 220 -112 -136
5490 -136 55 -58 -97 61 -112 105 -68 294 118 81 -77 -72 261 180 114 30 267 87 -272 10 107 -105 -82
5513 -82 102 -72 -49 -283 60 277 -311 -313 148 204 42 84 257 116 38 -178 -101 86 -249 148 131 145 129 4
5537 4 140 179 24 156 139 -20 -205 37 145 111 80 -24 -30 -47 -573 -54 -214 42 66 164 -14 145 -184 406
5561 406 276 74 11 190 -82 -154 -282 -16 264 -188 120 246 274 -74 150 251 -132 -60 -157 118 228 -23
5583 -23 -205 242 295 -308 -78 -65 -84 -128 -124 67 415 -124 -11 10 -89 -66 -276 353 190 -49 55 121 -227 3
5607 3 107 94 -133 -305 84 -110 -266 -161 298 191 -199 -31 243 179 107 18 149 93 99 43 -56 -115 176 165
5631 165 193 33 -160 245 61 108 -162 92 151 174 -278 -144 49 -287 -228 -58 247 -129 308 88 160 -50
5653 -50 44 104 177 4 88 2 31 30 -130 126 -225 37 2 284 7 145 256 7 148 -25 -63 77 165 -152
5677 -152 214 116 4 -70 162 109 18 97 143 227 127 -299 85 -46 -133 -211 -84 257 -114 -271 -60 241 -96
5700 -96 116 42 120 -100 -251 144 32 179 -116 93 -29 25 157 -123 57 -69 -58 -114 -26 -209 188 41
5722 41 221 -12 -113 244 237 -161 34 268 -9 -47 139 -15 -160 -122 48 304 26 -238 104 32 109 -236
5744 -236 110 150 60 -284 274 148 -36 -265 -108 263 -373 180 179 76 -197 -187 -262 142 84 -202 49 502
5766 502 -35 -56 142 133 -156 -84 116 66 -141 -6 106 76 -75 219 65 272 -16 -54 305 131 -139 -149 187
5789 187 17 -63 179 171 79 -387 1 157 -190 -129 -258 132 65 -214 51 305 -285 -94 -150 -419 -15 -95 144
5812 144 32 -101 -113 302 117 -164 227 -28 137 -146 190 63 -90 -118 -160 394 14 -46 28 475 54 140
5834 140 -4 28 187 -109 -3 179 -53 69 201 259 -217 -200 80 88 -70 -138 -160 -57 -279 33 43 109 -101
5857 -101 68 12 97 -59 -151 119 77 -389 -208 254 -72 -13 108 -170 -15 -119 59 -112 -28 -280 -132 40
5879 40 35 -190 -212 303 68 43 -28 122 -83 -190 63 135 -176 -450 129 -27 -185 49 213 52 -170 88
5901 88 150 68 -116 -271 -8 -53 -118 -367 21 -69 -75 -19 172 254 -98 -116 164 39 -23 154 -95 -58 -235 66
5925 66 52 16 -158 -78 -200 -128 -247 -114 65 -81 -174 11 171 -291 -230 233 -159 -322 -39 363 114 -96
5947 -96 78 54 136 -316 -14 201 27 -318 1 -12 200 -127 171 276 72 -198 5 154 125 -145 -284 75
5969 75 86 -195 -65 125 -136 -252 85 193 -180 277 205 101 -166 -95 156 -91 -50 -68 -2 10 -230 -29 158
5992 158 -383 -49 -156 14 112 -285 50 109 85 -183 342 34 -165 -8 53 119 244 -359 -193 176 -45 -109
6014 -109 127 431 -76 -14 20 84 -179 -162 166 248 -242 -4 304 135 -233 -210 132 96 -214 -154 -136 49 -124
6037 -124 33 221 48 -70 84 4 -23 -194 94 -31 3 -71 18 20 -127 -250 -9 185 -250 -160 -72 430 -284
6060 -284 -121 183 79 -350 -199 228 272 -342 -130 188 218 -191 -9 425 141 -337 86 169 112 -23 -220
6081 -220 251 -27 -263 -94 50 173 -470 105 196 -142 -211 125 175 -236 -185 277 -32 -71 6 100 414 -255
6103 -255 -102 13 47 -75 22 245 67 -225 -66 -1 109 37 -242 3 69 -82 -133 18 -58 -339 124 85 -69
6126 -69 -267 6 208 125 -133 136 117 -62 -298 112 109 -221 -374 180 45 -419 -28 -1 87 -146 43 148
6148 148 202 -202 10 107 115 -236 144 228 149 -396 -189 226 -22 -177 -140 170 96 -157 -147 100 88 -141 -218 120
6172 120 53 -138 -7 369 -84 -91 186 108 -181 -136 39 151 80 -316 324 109 -82 -155 -17 425 -258 -277 40
6195 40 -125 -172 -144 381 284 -36 -83 204 -165 -316 -226 70 203 -276 43 266 -140 -382 4 428 85 -151
6217 -151 88 522 -390 -353 57 184 -85 -238 260 96 -120 -154 3 299 -152 -37 -97 152 -13 -244 67
6238 67 118 -228 73 373 -132 9 -110 127 -11 -420 19 247 -97 -249 -56 322 -154 -155 103 -18 -13 -137
6260 -137 233 329 27 -114 30 42 -190 -252 175 255 -79 -22 89 47 -336 16 288 -12 -338 -70 203 -43
6282 -43 -323 -68 147 -47 -544 69 93 -5 -573 -187 239 -260 -171 71 528 -187 -328 112 167 -88 -87 -27 245
6305 245 -33 -238 356 183 -198 -134 119 168 -330 -360 228 36 -464 -145 274 78 -187 -141 165 2 -512
6326 -512 -36 60 15 -252 -42 272 -255 -178 87 403 40 -115 -5 479 -349 -197 263 403 -92 -14 132
6347 132 271 -128 -25 212 327 -247 -180 207 103 -129 -304 248 223 -237 62 91 63 -220 -84 189 -35
6368 -35 -274 -50 414 407 -173 27 109 -212 -258 129 302 -199 -82 131 147 -165 -261 228 191 -194 -15 157 186
6391 186 -221 -276 195 168 -180 -233 218 25 -247 -363 19 1 -183 153 432 18 -238 -247 139 -115 -286 126
6413 126 164 19 -309 43 -44 31 -160 -148 207 -101 -489 -36 68 -79 -219 -137 108 -412 -244 -58 -95 -24
6435 -24 -263 -60 396 -7 -190 268 -11 -221 -116 251 136 -360 -32 194 119 -306 -27 325 -223 -338 85
6456 85 30 -128 -380 104 127 -227 -12 -102 -50 20 -274 118 413 -251 61 207 272 -194 -109 197 125 68 -215
6479 -215 300 396 -342 -281 480 -17 -138 -98 270 18 -388 107 -58 -72 -123 60 285 -43 -501 64 39 -151
6501 -151 60 -15 372 -224 -251 28 321 -224 -308 110 -7 -131 82 113 -31 -216 -154 202 21 -292 -112 244
6523 244 88 -229 274 339 230 -81 -95 194 51 -313 235 164 48 -82 -217 65 -326 -118 -31 345 -59
6544 -59 40 60 76 -325 -130 -7 59 -339 -218 132 158 -231 -165 139 -136 -348 -140 260 163 -367 -153 274 34
6567 34 -368 -178 353 -119 -146 112 -32 -251 -121 129 116 79 1 129 317 -96 -161 168 203 34 -209 166
6589 166 2 -341 35 -109 95 -132 28 281 152 -37 -382 221 104 -170 -20 132 316 -297 -257 124
6609 124 -194 -28 59 -34 -48 -275 -60 15 -44 -184 100 151 -42 -25 348 249 -16 107 294 261 90 -161 -79
6632 -79 317 -220 163 257 260 -92 -88 62 -230 -308 -266 266 161 -69 44 146 57 -20 -106 10 -15 -49 295 43
6656 43 -264 -130 -34 347 -25 -39 133 -52 -419 -388 262 47 -147 -149 69 275 -313 -81 65 170 -300 -268
6678 -268 0 38 -329 -94 209 -149 -52 60 -90 204 -238 79 229 1 -240 51 358 -243 -301 264 148
6699 148 -160 -132 -153 204 -40 -142 188 202 55 -169 86 78 -221 -12 288 63 -6 12 324 -24 -150 -69 32
6722 32 -128 -224 128 229 113 -295 -164 426 119 -109 187 180 -125 -78 -81 198 -45 45 268 147 -312 -164 165
6745 165 -18 280 -267 164 302 -39 -34 240 23 -221 -150 -27 -5 -299 -137 91 -52 -266 -171 206 -292 -334
6767 -334 145 328 -61 -265 -85 178 -97 -297 16 137 59 -100 268 108 -165 -232 231 244 -192 -209 44
6788 44 108 -155 58 145 146 -17 112 250 239 -224 4 152 183 -213 100 357 9 10 -78 117 110 -315 -49 216
6812 216 -58 -215 12 316 -296 -304 55 82 148 -221 -44 54 -302 -173 126 125 -298 -256 135 23 -344 -181 194
6835 194 -195 -216 13 198 98 59 1 348 142 -28 -155 172 168 -55 36 196 110 -235 -99 180 -43 -32 128
6858 128 347 44 -237 321 95 -161 -272 188 186 -12 -235 26 148 -116 -110 351 -17 25 -264 180 84 -266
6880 -266 45 111 -146 -58 254 184 152 -209 -16 322 -81 -107 97 246 -237 -539 335 178 64 -143 144 2
6902 2 -225 -65 134 200 -155 -131 166 -180 -37 93 15 213 -257 135 329 106 -84 -170 333 231 -116 -224
6924 -224 188 -26 -206 140 -164 156 -399 134 126 -279 -183 280 234 -82 -144 119 86 -77 106 -86 380 -227
6946 -227 -216 -101 47 70 230 92 -71 -244 124 215 99 -392 -46 133 111 -62 -191 227 136 -330 -204 179
6968 179 -23 -19 2 184 -72 -354 -243 105 3 24 112 13 -130 -281 108 -13 -339 -414 369 149 -68 -7 8
6991 8 156 -232 -70 51 -2 45 -54 310 62 -248 206 162 142 -207 11 270 25 -266 -66 101 -55 -252
7013 -252 43 250 -231 -208 257 247 -150 18 110 169 -257 -251 281 55 135 -56 247 185 -161 -109 77 197 -107
7036 -107 -186 183 260 -90 49 239 -212 -140 75 369 44 -221 138 116 -150 -379 46 307 -155 84 58 324
7058 324 -217 -187 256 -26 -283 -214 227 188 76 -134 176 103 -194 -168 395 21 -104 -109 -3 15 122 -207 292
7081 292 -226 -42 -321 294 56 -68 240 81 -221 67 -60 61 -154 -222 362 197 -178 -241 336 39 -41
7102 -41 -149 226 74 -25 -244 10 -24 -133 -58 310 -49 -119 -129 47 -237 42 119 112 64 53 66 283 151 -74
7126 -74 -32 78 -4 -149 -42 28 -258 -294 9 195 109 -256 263 178 -393 -85 -169 132 -365 -151 328 87 -219
7149 -219 -219 162 -203 -202 8 298 -10 -52 -2 299 -165 -338 -7 113 -21 -205 110 -124 -219 -325 -31 -10 -142
7172 -142 91 5 291 -1 -46 172 111 -252 -202 162 95 -245 188 232 -105 -214 40 308 192 -133 184 417
7194 417 125 -201 227 21 -388 -196 -31 94 41 -119 -55 255 -82 -375 -36 14 -202 103 256 -149 -228
7215 -228 41 177 23 -47 -16 106 -10 -237 37 -34 -77 -275 119 153 146 -123 46 15 3 -65 -42 452 -364 5
7239 5 257 72 14 -168 8 -22 -313 -238 402 311 66 -79 12 -100 133 -66 376 228 47 117 121 -27 -198
7262 -198 170 235 30 0 99 247 261 -178 -79 299 85 -111 -11 -61 -91 -103 -113 -84 -207 -128 -194 321 -38 62
7286 62 167 -72 -192 -18 9 49 -167 -227 134 31 -417 -17 57 92 -185 -110 33 42 -336 -119 249 -25 0
7309 0 108 155 17 -113 -140 130 164 -331 10 233 252 -102 -30 106 -408 24 140 159 -155 -215 203 200 144 -189
7333 -189 77 -62 18 -38 99 12 -117 37 107 158 -216 24 66 -139 18 168 333 -198 -155 -53 499 -280
7355 -280 58 52 297 24 -190 116 101 -220 -397 157 165 -17 -232 241 149 -49 -241 165 70 -108 -233 259
7377 259 292 -418 284 132 -88 -327 -37 7 56 -370 208 483 -128 -152 110 260 83 -291 223 45 -178
7398 -178 -221 -103 142 -44 -3 227 12 -336 -201 161 -18 27 -96 67 152 -211 -110 437 120 -293 256
7419 256 181 -136 -199 -84 44 225 -149 -93 143 80 -47 43 -75 -220 -242 39 225 -93 -64 232 -2 -145
7441 -145 -156 171 77 -223 -289 154 -11 -301 -42 169 149 -122 77 298 364 -189 114 352 -102 -195 -110 218
7463 218 95 -248 86 184 -72 -9 135 -57 -295 -238 -14 103 -85 -68 311 351 18 -108 67 -288 -332 172
7485 172 241 266 -326 63 195 16 -113 17 33 39 -364 44 172 54 43 22 125 -131 -204 95 444 -55 -185
7508 -185 -27 243 -211 -113 223 -42 -327 -158 139 285 -232 -149 175 112 -239 -207 270 -32 -34 -198 65 108
7530 108 -61 1 188 45 6 100 133 12 27 112 244 16 -337 388 417 74 -246 363 215 -21 -78 326 92
7553 92 -312 -77 223 117 31 -114 315 324 -177 43 470 111 -238 115 299 247 -313 -225 283 -245 -313 2
7575 2 325 -84 -187 -215 378 -166 -377 108 422 122 -277 367 208 -129 -318 79 269 -124 -402 158 43
7596 43 -107 -126 191 177 -70 -340 137 394 -208 -150 114 -106 -448 -99 427 161 -118 -143 183 82 -281 -73
7618 -73 194 -104 -156 118 207 -177 -364 172 -33 218 -473 77 472 -237 -183 281 222 -551 -112 92 267 -204
7640 -204 -69 99 231 -157 -203 456 98 -178 -85 116 -140 -613 -53 454 -131 -88 -130 220 -48 -647 3
7661 3 439 -256 -369 189 307 -372 -548 160 367 -47 -132 5 85 -168 63 395 106 -20 -139 148 -1
7682 -1 -587 -221 590 295 -314 -358 172 -23 -476 40 240 171 -474 110 248 -126 -412 -16 278 -406 -327 132
7704 132 135 -40 -147 -125 196 -93 -365 275 162 -36 -198 124 257 56 4 520 239 -151 -136 504 268 -402
7726 -402 397 367 -72 -440 -4 222 92 -200 -85 566 -200 -483 15 444 -62 -440 59 557 -269 -446
7746 -446 192 273 -106 -302 333 -33 -370 -406 302 316 -200 -15 175 225 -115 -278 152 8 -335 -141 180
7767 180 181 -363 -76 413 176 -343 49 428 47 -392 168 471 65 -209 -166 213 -53 -408 177 274 -96
7788 -96 -142 233 218 -422 -258 -28 438 -232 -476 146 372 -298 -154 539 175 -410 -41 260 123 -246 -59
7809 -59 367 233 -369 144 280 61 -322 53 102 88 -483 -9 218 -93 -187 -2 380 9 -442 395 294
7830 294 -92 -111 228 -46 -340 -205 458 164 -319 -581 117 237 -325 -253 452 53 -202 -91 440 -52 -578
7851 -578 -92 624 -153 -217 165 420 116 -372 32 557 -31 -430 322 383 -429 -348 286 417 -96 -369 261
7872 261 401 -208 -162 339 281 -332 -233 643 -37 -239 -312 267 165 -139 -222 188 181 -676 259 310 -191 -581 75
7895 75 175 -215 -348 -122 504 -74 -416 -22 313 -334 -249 366 508 -277 -134 150 95 -199 -236 424 429 -248
7917 -248 8 354 -152 -343 -389 436 297 -289 -91 136 329 -360 -297 378 2 -711 -76 530 31 -328 -35
7938 -35 426 -7 -391 407 612 89 -523 373 421 -263 -238 278 336 -231 -160 408 75 -354 -229 430 -30 -536
7960 -536 -228 109 197 -328 -85 280 136 -431 131 266 166 -466 -284 471 42 -298 199 359 133 -317
7980 -317 126 341 -321 -600 234 410 -252 -251 252 525 -270 -628 251 593 -248 -387 224 306 -378 -542 542
$$ [...]
8191e81
##END NTUPLES=NMR FID
##END=
