##TITLE=1H_Pr DMSO-N-S
 CCl4
 8 sc, 
 9.06.2022
##JCAMPDX= 6.0         $$ Bruker NMR JCAMP-DX V2.0
##DATA TYPE= NMR FID
##DATA CLASS= NTUPLES
##ORIGIN= UXNMR, Bruker Analytische Messtechnik GmbH
##OWNER= root
$$ XWIN-NMR		Version 3.5
$$ Thu Jun  9 16:14:27 2022 Russian Standard Time (UT+4h)  she@DPX200
##.OBSERVE FREQUENCY= 200.131
##.OBSERVE NUCLEUS= ^1H
##.DELAY= (6, 6)
##.ACQUISITION MODE= SIMULTANEOUS
##.ACQUISITION SCHEME= undefined
##.AVERAGES= 8
##.DIGITISER RES= 18
##SPECTROMETER/DATA SYSTEM= spect
##.PULSE SEQUENCE= zg30
##.SOLVENT NAME= DMSO
##.SHIFT REFERENCE= (INTERNAL, DMSO, 0, 15.7039)
##AUDIT TRAIL= $$ (NUMBER, WHEN, WHO, WHERE, WHAT)
$$ ##TITLE= Audit trail, XWIN-NMR		Version 3.5
$$ ##JCAMPDX= 5.01
$$ ##ORIGIN= Bruker BioSpin GmbH
$$ ##OWNER= she
$$ F:/spectra/data/she/nmr/H-F/1/audita.txt
$$ ##AUDIT TRAIL=  $$ (NUMBER, WHEN, WHO, WHERE, WHAT)
(   1,<2022-06-09 16:12:54.71 +0400>,<she>,<DPX200>,
      <created by zg, POWCHK disabled, PULCHK disabled
       configuration hash MD5:
       00 E9 B6 7A A2 85 ED C7 34 08 36 98 17 FE 4E 26
       data hash MD5: 16K
       E9 A5 2F 5E 92 DB 0D 0C A9 57 30 D2 81 DD 80 AB>)
$$ ##END=
$$ 
$$ hash MD5
$$ 6F 09 87 F2 E9 7C 67 22 99 A9 7B 7C F8 A0 BD 56
##$RELAX= 
##$RELAX= 
##$RELAX= 
##$RELAX= 
##$RELAX= 
##$RELAX= 
$$ Bruker specific parameters
$$ --------------------------
##$DU= <F:/spectra>
##$EXPNO= 1
##$NAME= <H-F>
##$PROCNO= 1
##$TYPE= <nmr>
##$USER= <she>
##$AMP= (0..31)
100 100 100 100 100 100 100 100 100 100 100 100 100 100 100 100 100 100 
100 100 100 100 100 100 100 100 100 100 100 100 100 100 
##$AQSEQ= 0
##$AQ_mod= 1
##$AUNM= <au_zg>
##$AUTOPOS= <>
##$BF1= 200.13
##$BF2= 200.13
##$BF3= 200.13
##$BF4= 200.13
##$BF5= 200.13
##$BF6= 200.13
##$BF7= 200.13
##$BF8= 200.13
##$BYTORDA= 1
##$CFDGTYP= 0
##$CFRGTYP= 5
##$CHEMSTR= <none>
##$CNST= (0..31)
1 1 145 1 1 1 1 1 1 1 1 1 1 1 1 1 1 1 1 1 1 1 1 1 1 1 1 1 1 1 1 1 
##$CPDPRG= <>
##$CPDPRG1= <>
##$CPDPRG2= <>
##$CPDPRG3= <>
##$CPDPRG4= <mlev>
##$CPDPRG5= <mlev>
##$CPDPRG6= <mlev>
##$CPDPRG7= <mlev>
##$CPDPRG8= <mlev>
##$CPDPRGB= <>
##$CPDPRGT= <>
##$D= (0..31)
0 1.2 0 0 0 0 0 0 0 0.06 0 0.03 0 0 0 0 0.0002 0 0 0 0 0 0 0 0 0 0 0 0 
0 0 0 
##$DATE= 1654776774
##$DBL= (0..7)
120 120 120 120 120 120 120 120 
##$DBP= (0..7)
150 150 150 150 150 150 150 150 
##$DBP07= 0
##$DBPNAM0= <>
##$DBPNAM1= <>
##$DBPNAM2= <>
##$DBPNAM3= <>
##$DBPNAM4= <>
##$DBPNAM5= <>
##$DBPNAM6= <>
##$DBPNAM7= <>
##$DBPOAL= (0..7)
0.5 0.5 0.5 0.5 0.5 0.5 0.5 0.5 
##$DBPOFFS= (0..7)
0 0 0 0 0 0 0 0 
##$DE= 6
##$DECBNUC= <off>
##$DECIM= 32
##$DECNUC= <off>
##$DECSTAT= 4
##$DIGMOD= 1
##$DIGTYP= 9
##$DL= (0..7)
0 120 120 120 120 120 120 120 
##$DP= (0..7)
150 150 150 150 150 150 150 150 
##$DP07= 0
##$DPNAME0= <>
##$DPNAME1= <>
##$DPNAME2= <>
##$DPNAME3= <>
##$DPNAME4= <>
##$DPNAME5= <>
##$DPNAME6= <>
##$DPNAME7= <>
##$DPOAL= (0..7)
0.5 0.5 0.5 0.5 0.5 0.5 0.5 0.5 
##$DPOFFS= (0..7)
0 0 0 0 0 0 0 0 
##$DQDMODE= 0
##$DR= 18
##$DS= 0
##$DSLIST= <SSSSSSSSSSSSSSS>
$$ [...]
##$SUBNAM2= <"">
##$SUBNAM3= <"">
##$SUBNAM4= <"">
##$SUBNAM5= <"">
##$SUBNAM6= <"">
##$SUBNAM7= <"">
##$SUBNAM8= <"">
##$SUBNAM9= <"">
##$SW= 18.0517599122864
##$SWIBOX= (0..15)
0 0 2 0 0 0 0 0 0 0 0 0 0 0 0 0 
##$SW_h= 3612.71676300578
##$TD= 16384
##$TD0= 1
##$TE= 0
##$TE2= 300
##$TE3= 300
##$TEG= 300
##$TL= (0..7)
0 120 120 120 120 120 120 120 
##$TP= (0..7)
150 150 150 150 150 150 150 150 
##$TP07= 0
##$TPNAME0= <>
##$TPNAME1= <>
##$TPNAME2= <>
##$TPNAME3= <>
##$TPNAME4= <>
##$TPNAME5= <>
##$TPNAME6= <>
##$TPNAME7= <>
##$TPOAL= (0..7)
0.5 0.5 0.5 0.5 0.5 0.5 0.5 0.5 
##$TPOFFS= (0..7)
0 0 0 0 0 0 0 0 
##$TUNHIN= 0
##$TUNHOUT= 0
##$TUNXOUT= 0
##$USERA1= <user>
##$USERA2= <user>
##$USERA3= <user>
##$USERA4= <user>
##$USERA5= <user>
##$V9= 5
##$VALIST= <valist>
##$VCLIST= <CCCCCCCCCCCCCCC>
##$VD= 0
##$VDLIST= <DDDDDDDDDDDDDDD>
##$VPLIST= <PPPPPPPPPPPPPPP>
##$VTLIST= <TTTTTTTTTTTTTTT>
##$WBST= 1024
##$WBSW= 4
##$XGAIN= (0..3)
0 0 0 0 
##$XL= 0
##$YL= 0
##$YMAX_a= 477356
##$YMIN_a= -489970
##$ZGOPTNS= <>
##$ZL1= 120
##$ZL2= 120
##$ZL3= 120
##$ZL4= 120
##$ABSF1= 10
##$ABSF2= 0
##$ABSG= 5
##$ABSL= 3
##$ALPHA= 0
##$AQORDER= 0
##$ASSFAC= 0
##$ASSFACI= 0
##$ASSFACX= 0
##$ASSWID= 0
##$AUNMP= <proc_1d>
##$AZFE= 0.1
##$AZFW= 0.1
##$BCFW= 1
##$BC_mod= 2
##$BYTORDP= 1
##$COROFFS= 0
##$CY= 11.3945322036743
##$DATMOD= 1
##$DC= 2
##$DFILT= <>
##$DTYPP= 0
##$F1P= 2.36226072786647
##$F2P= -0.459571619588291
##$FCOR= 0.5
##$FTSIZE= 0
##$FT_mod= 4
##$GAMMA= 1
##$GB= 0.15
##$INTBC= 1
##$INTSCL= 1
##$ISEN= 128
##$LB= 0.24
##$LEV0= 0
##$LPBIN= 0
##$MAXI= 10000
##$MC2= 0
##$MEAN= 0
##$ME_mod= 0
##$MI= 1.114404
##$NCOEF= 0
##$NC_proc= 0
##$NLEV= 6
##$NOISF1= 3.799351
##$NOISF2= 2.8
##$NSP= 1
##$NTH_PI= 0
##$NZP= 0
##$OFFSET= 15.70392
##$PC= 1
##$PHC0= -18022.11
##$PHC1= -5.19931
##$PH_mod= 1
##$PKNL= yes
##$PPARMOD= 0
##$PSCAL= 0
##$PSIGN= 0
##$REVERSE= no
##$SF= 200.130013532006
##$SI= 16384
##$SIGF1= 3
##$SIGF2= 2
##$SINO= 400
##$SIOLD= 16384
##$SREGLST= <1H.CDCl3>
##$SSB= 0
##$STSI= 0
##$STSR= 0
##$SW_p= 3612.71676300578
##$SYMM= 0
##$S_DEV= 0
##$TDeff= 0
##$TDoff= 0
##$TI= <>
##$TILT= no
##$TM1= 0
##$TM2= 0
##$TOPLEV= 0
##$USERP1= <user>
##$USERP2= <user>
##$USERP3= <user>
##$USERP4= <user>
##$USERP5= <user>
##$WDW= 1
##$XDIM= 8192
##$YMAX_p= 0
##$YMIN_p= 0
$$ End of Bruker specific parameters
$$ ---------------------------------
##NTUPLES= NMR FID
##VAR_NAME=  TIME,          FID/REAL,        FID/IMAG
##SYMBOL=    X,             R,               I
##VAR_TYPE=  INDEPENDENT,   DEPENDENT,       DEPENDENT
##VAR_FORM=  AFFN,          ASDF,            ASDF
##VAR_DIM=   8192,          8192,            8192
##UNITS=     SECONDS,       ARBITRARY UNITS, ARBITRARY UNITS
##FACTOR=    0.0002768,     1,               1
##FIRST=     0,             0,               0
##LAST=      2.2672688,     0,               0
##MIN=       0,             -489970,         0
##MAX=       2.2672688,     477356,          0
$$ Real data points
##PAGE= N=1
##DATA TABLE= (X++(R..R)), XYDATA
$$ [...]
3305a0255N920J3444m498j3548L543J5201n249j4467O017J2882m400j4113M812
3318d711J5179o839j3295O111J2579m465j4548O201J4068p294j2202N723J2940
3331I447n487j4212P165J3282p278j2144N721J3741p155j3460Q369J1521o790
3344B720j2154O260J3531q216j2290Q138J1017o623j2535P493J3410r290j1117
3357i656P982J1036o799j3102Q926J1961r134j0391P310J1834q255j2297R949
3370f36J0455q960j0457P879J2154r337j1309J0024R793q786j0686Q494J1732
3383A0360j0418r608R337R731q475j1025R706J0527j0614r014R052J0022q980
3396F01j0951J1001R228j0623q477R229R760r953j0138J1357Q260r976q661R537
$$ plain form
3305 -10255 -4335 9109 4611 -8937 -5394 9807 4558 -9909 -3892 8990 4590 -9523 -4711
3318 -4711 10468 3629 -9666 -3555 9024 4559 -9989 -3788 10280 2986 -9216 -3493 9447
3331 9447 3960 -10252 -3087 10195 2917 -9227 -3506 10235 3080 -10380 -2011 9510 2720
3344 2720 -9434 -3174 10357 2141 -10149 -2011 9006 2383 -10152 -2659 10751 1461 -9656
3357 -9656 -1674 9362 2563 -10539 -1613 10348 1214 -9177 -1867 9967 1712 -10585 -636
3370 -636 9819 859 -9598 -1719 10435 1098 -10211 -187 9606 820 -9866 -1372 10360
3383 10360 -58 -9666 -329 9402 927 -10098 -392 10135 -479 -9493 -441 9581 601
3396 601 -10350 651 9879 -744 -9221 8 9768 -185 -10323 1034 9294 -682 -9343 194
3410A94R856j1027r080J1412P652r667q812J0190R061j1507p441J0420Q035r995
3424g09r330J1655Q051j1770o520R926P905j0875p997J2051O816j1476o385J0334
3438A676P951j2047p095J2470N630j0774o388J0593P520j2528n891J1891N408
3451H416j0678o784J1833O539j2629n186J1317N310j0736o642J2733N038j2263
3464c732m291J0663O024j1579o115J2964L894j1399m342J0949N654j2789m206
3477h305J2580L296j1291m376J1607M947j3005l267J1934L209j0827m798J2896
3490D600L539j2867k277J1213L368j1829l777J3002K418j2068k317J1025L593
3503G623j2403k793J3295O98j1277k264J1467L357j3172j388J2354P93j0971k432
$$ plain form
3410 194 10050 -977 -10057 1355 9007 -660 -9472 718 9779 -1728 -9169 1251 9286 -709
3424 -709 -10039 1616 9667 -2103 -8623 1303 9208 -1667 -9664 2387 9203 -2273 -8658 1676
3438 1676 9627 -2420 -9515 2955 8585 -2189 -8577 2016 9536 -2992 -8883 3008 8416
3451 8416 -2262 -9046 2787 9326 -3303 -8489 2828 8138 -2598 -9240 3493 8531 -3732
3464 -3732 -8023 2640 8664 -2915 -9030 3934 7828 -3571 -7913 3036 8690 -4099 -8305
3477 -8305 4275 7571 -3720 -8096 3511 8458 -4547 -7814 4120 7329 -3498 -8296 4600
3490 4600 8139 -4728 -7005 4208 7576 -4253 -8030 4972 7390 -4678 -6995 4030 7623
3503 7623 -4780 -7573 5722 6420 -4857 -7121 4346 7703 -5469 -6857 5497 6290 -4681 -7113
3517g113J2354J936j3082m97J1869R43j1355k378J3127R55j2629k53J1597J027
3531F501j1956j108J2766l04j1697J84J1069J198j2736M7J2393q53j0857o95J1705
3546E657P70j2742R37J1544o17j1303k57J2301n24j2467J866J0929o13j1477K56
3561e740J2377j660j1663J737J1047q61j1865J017J2493k295j1210K009J0873
3574F259j286j1929K503J1554k933j0648J615J1797j960j2397L272J1048k873
3587D022j0558J779J2105l167j1390L750J0090k628j0863K685J1877m099j1221
3600g618M363J0092k771j1474L593J1413m691r884L722J0352l330j1735N234J0145
3614G411m726r446L606J0660m277j1080N289R600m343r865L860J1200n321j0053
$$ plain form
3517 -7113 5241 7177 -5905 -6402 5467 6410 -4945 -7323 5804 6759 -5870 -6123 5474 6501
3531 6501 -5455 -6563 6203 5899 -5798 -5614 5455 6653 -6083 -6036 6357 5504 -5353 -6048 5657
3546 5657 6427 -6315 -5378 6166 5549 -5754 -6011 6290 5766 -6701 -4835 6094 5481 -5996 -5740
3561 -5740 6637 4977 -6686 -4949 6098 5237 -6628 -5611 6882 4587 -6623 -4614 6259
3574 6259 4973 -6956 -4453 7101 4168 -6480 -4865 6932 4972 -7425 -4153 6895 4022
3587 4022 -6536 -4757 7348 4181 -7209 -3459 6631 4003 -6860 -4175 7702 3603 -7618
3600 -7618 -3255 6837 4066 -7408 -3815 7598 2907 -6977 -3255 7097 3767 -7968 -2734 7411
3614 7411 2685 -6761 -3155 7505 3228 -7852 -2563 7037 2694 -7171 -3311 7889 2568 -7485
3628g485N469R119m186j0619N060J0354o021r097N522Q659l830j0955N896R996
3642G882o135q775M891R430n104j0089O558Q764o131q361N234R870o301r817P121
3657i63Q024n635q978N944R482o937q298O455P978n828q800O499Q853p492p410
3672g106O538Q311o717r138P861P875p424p343O579Q185p057q218Q093O654p050
3687D3p169O961P998p904p287P799O543o881p337P428P707q797o323Q125N877
3702F783o792p618Q325O956q936n213P085O565p722p029Q974N784q337n575P543
3717G93O764q447o621R154N070q297n367Q036O451r364n155Q586M979p727n971
3732g116Q846N717r617m557Q682M605q090n640R510M291r294l624P969N153q754
$$ plain form
3628 -7485 -2016 7103 2917 -7702 -2642 7712 1691 -7406 -1884 6775 2945 -8010 -2114 7882
3642 7882 1747 -7028 -2137 7293 2189 -7900 -1342 7422 1291 -7070 -1836 8034 1733 -8084 -963
3657 -963 7061 1426 -7552 -1608 7874 937 -7361 -906 7072 1244 -7556 -1057 7796 304 -7106
3672 -7106 -568 7743 1026 -8112 -251 7624 200 -7143 -564 7621 564 -7654 439 7093 43
3687 43 -7126 -165 7833 -71 -7358 441 6984 103 -7234 194 7901 -896 -7219 906 6783
3702 6783 -9 -7627 698 7654 -1282 -6495 590 7155 -567 -7596 1378 7162 -1175 -6750 793
3717 793 7557 -890 -7511 1643 6713 -1584 -6951 1085 7536 -1828 -6983 1603 6582 -1145 -7116
3732 -7116 1730 7447 -2170 -6727 1955 6560 -1530 -7170 2340 6631 -2663 -6287 1682 6835 -1919
3747a919n081R740L771r123l784Q395M704q902m535R865K982q349m023Q609M601
3762F951r939l289R177L306q511m378R696L617r986k503Q673L166q609l793R734
3777C312K854r840j924Q157L519r248l137J0118J793r259k072Q798L218j0054
3791c765k381J0080J252q486k690R680K042r923j106R064J398q551k397R943J515
3806E675r783r09Q996J621r429j781J0038N90r228o25Q847J218r490q79R897J6
3822D774q865p06Q847J188j0046J59R242J5q726j061R782M54r731L22Q637L40
3838D625r007l82R774o93r345R59Q611pr191J80R722j326q699Q39Q478k76r509
3855e247R66R547j818q311O91R153q57r625K114Q385j371q437P87R373j568r353
$$ plain form
3747 -1919 -7000 2740 6511 -2612 -6396 1999 6703 -2199 -6734 3131 6113 -2236 -6259 2350 6951
3762 6951 -2988 -6277 2900 6206 -2305 -6683 3013 6630 -3356 -5859 2814 5980 -2629 -6422 3312
3777 3312 6166 -3674 -5598 2559 6078 -3170 -6307 3811 5604 -3655 -5727 3071 6289 -3765
3791 -3765 -6146 3934 5186 -3300 -5990 3690 5732 -4191 -5297 3767 5165 -3386 -5783 4160 5675
3806 5675 -4108 -5017 3979 5600 -3829 -5610 4428 5018 -4210 -4835 4012 5230 -4260 -5139 4758 4774
3822 4774 -4091 -4797 4050 5238 -4808 -4649 4593 4608 -4118 -5179 4603 5057 -4674 -4352 4285 4625
3838 4625 -4382 -4764 5010 4317 -5028 -4069 4542 4535 -4656 -4476 5246 3920 -4779 -3940 4538 4262 -5247
3855 -5247 -4281 5266 3448 -4863 -4172 4981 4124 -5501 -3387 4998 3627 -4810 -4023 5350 3782 -5571
3871e571K553Q296j654q616J343R549k945q615K660P939j246r160K139R135l345
3886B462p860K239Q511k181r022K991Q551l254p709K252Q551k612q990L614P728
3901E271k818p887K493Q806l153q507L674P521k890q398L294Q455l896p650L688
3916a997P485l098q329L910P940m479o771L100P733l168q630M630P330m463o459
3931e266L118Q101m387p409M644O698m259o677L643P818m977o870M787O664m229
3946A399p414N005P021n378o063M509O593m602p004N433O462n532n800M400O927
3961E956n131p021O015N987n428n911M703O699n696o144O158N458m971o369N401
3976b94O625o651n436N879N241n206o101O134N905o800m875N542N835n968o045
$$ plain form
3871 -5571 -3018 5278 3624 -4992 -3649 5900 2955 -5660 -3000 4939 3693 -5467 -3328 5807 2462
3886 2462 -5398 -3159 5352 3171 -5851 -2860 5691 2437 -5272 -3020 5531 2919 -6071 -2457 5271
3901 5271 2453 -5434 -2941 5865 2712 -5795 -2121 5400 2510 -5888 -2594 5861 1965 -5685 -1997
3916 -1997 5488 2390 -5939 -2029 5911 1432 -5339 -2239 5494 2326 -6304 -1674 5656 1193 -5266
3931 -5266 -2148 5953 1566 -5843 -1199 5499 1240 -5437 -1794 6024 1047 -5823 -1036 5628 1399
3946 1399 -6015 -1010 6011 633 -5430 -921 5672 1070 -5934 -501 5961 429 -5371 -971 5956
3961 5956 825 -6196 -181 5806 378 -5533 -830 5869 173 -5971 187 5645 674 -5695 -294
3976 -294 6331 -320 -5756 123 5364 158 -5943 191 6096 -704 -5579 -37 5798 -170 -6215
3991f215O758N299o339n115N693N873o259n636P014M334o016n058O117N537o739
4006g52m968O765M149n957m754O270N311p409m053O621M120n967n212P041M666
4021E871p474l541O232M604o843m816P657L397o433l390N936M445p364l954P576
4036A903L287o736l829O987M005p478l495P349K750o463l711P144L280p303k534
4051d844P024K867o919l386P611K621p340k035O512L027p358l087Q084J986p135
4066b372k431P138K959p980j899P315J882p113k189P115K549p881j723P369J548
4081D287o760k188P394K066p940r12O895J556p095j694P677J015p352j157P321
4096C113J433p366j733P913L88o783r22P106J270p813n67P556J14o622j122P283
$$ plain form
3991 -6215 543 5842 -497 -5612 81 5954 -305 -5941 1073 5407 -609 -5667 450 5987 -752
4006 -752 -5720 1045 5194 -763 -5517 753 6064 -1345 -5398 1223 5343 -624 -5836 1205 5871
4021 5871 -1603 -5144 1088 5692 -1151 -5967 1690 5087 -1346 -4736 1200 5645 -1719 -5673 1903
4036 1903 5190 -1546 -5375 1612 5617 -1861 -5356 1993 4743 -1720 -5431 1713 4993 -2310 -4844
4051 -4844 2180 5047 -1872 -5258 2353 4974 -2366 -4401 2111 5138 -2220 -5307 2777 4763 -2372
4066 -2372 -4803 2335 5294 -2686 -4585 2730 4612 -2501 -4690 2425 4974 -2907 -4630 2739 4287
4081 4287 -2473 -4661 2733 4799 -3141 -4053 2842 4398 -2697 -4391 3286 4301 -3051 -4208 3113
4096 3113 4546 -2820 -4553 3360 3748 -3035 -3957 3149 4419 -3394 -3961 3595 3709 -2913 -4035 3248
4112C248Q83p989J78P079M74p205p49P878r2p485M08O629N07p336j92P793o17
4129C412p165O21O639L33p675L35P678j053o762J86P208k06q009J450P059j134
4145B917o699M76P420r16p624J595O814r95o964N81P760j554p169J817O600j056
4161C003p337J547P506k444o376J591O463j409p017J763P057k086o091J279O836
4176D285j517p516K411O607j997o403J757O962k311o678K471O229k231o439K132
4191b238P026k849o501K775N937j874p085K914O518l338n875K835O108k330o793
4206d770L220N857l096n463K457O707l229o535L725N674l009n943K880O430l539
4221A366n992L498N486k993o147L489O375m392n274L646N337l278o041M221N565
$$ plain form
4112 3248 4131 -3858 -3680 3399 3873 -3332 -4081 3797 3705 -3780 -3372 3257 3764 -3572 -3764 4029 3412
4129 3412 -3753 -3132 3507 3840 -3835 -3500 4178 3125 -3637 -3451 3757 3551 -4458 -3008 4051 2917
4145 2917 -3782 -3306 4114 3198 -4426 -2831 3983 2988 -3976 -3395 4365 2811 -4358 -2541 4059 3003
4161 3003 -4334 -2787 4719 2275 -4101 -2510 3953 2544 -4473 -2710 4347 2261 -3830 -2551 4285
4176 4285 2768 -4748 -2337 4270 2273 -4130 -2373 4589 2278 -4400 -1929 4300 2069 -4370 -2238
4191 -2238 4788 1939 -4562 -1787 4150 2276 -4809 -1895 4623 1285 -4590 -1755 4353 2023 -4770
4206 -4770 -1550 4307 1211 -4252 -1795 4912 1683 -4852 -1127 4547 1538 -4405 -1525 4905 1366
4221 1366 -4626 -1128 4358 1365 -4782 -1293 5082 690 -4584 -938 4399 1121 -4920 -699 4866
4236D866m348m731L360N676m106n867M546N036l756n143L554N728m302n519M941
4251f5M628m133m759L753N756n122m538M397M473m081n027M392N241n034m215
4266d334M382M610m501n076N288M224n065l889M294M697m757m834N363M161m924
4281c61m023M625M282n057m022N220L363m311m154M913M378n551l613M972L613
4296D274m774m068N475L583n709l144N120L525n083l895N934L053n339l059M870
4311G63L801n549l587O008K596n371k848N244L680o298k805O048K392n082l223
4326d231N724K988o204k405N441K719n367k887N973K334n709k309N632K364n698
4341a635k635O325J737n567j948N281K545o150j847N971J450n197k376N886K321
$$ plain form
4236 4866 518 -4213 -853 4823 717 -5150 -604 4432 676 -4467 -913 4815 513 -5006 -65
4251 -65 4563 430 -4329 -576 5180 58 -4480 -83 4390 309 -4718 -326 4915 -119 -4334
4266 -4334 48 4658 157 -4919 369 4593 -472 -4361 -67 4630 -127 -4961 402 4563 -361
4281 -361 -4384 241 4523 -534 -4556 664 4027 -284 -4438 475 4853 -698 -4311 661 4274
4296 4274 -500 -4568 907 4490 -1219 -4363 757 4282 -801 -4696 1238 4291 -1048 -4107 763
4311 763 4564 -985 -4572 1436 4032 -1339 -4187 1057 4737 -1561 -4366 1682 4074 -1008 -4231
4326 -4231 1493 4481 -1723 -4128 1313 4032 -1335 -4222 1751 4085 -1624 -3933 1699 4063 -1635
4341 -1635 -4270 2055 3792 -1775 -3723 1558 4103 -2047 -3894 2077 3527 -1670 -4046 1840 4161
4356D161o305j376N642J580n419k306O363J345o206r17N437J567n558j943O461
4371B526J090o016j057N269J887n882j441O457M95n602j275N897J425o377q05
4386c409N880M49n422r26N941Q87o366J31N526N41n922q36O475J72o219Q4N784
4403B770M47n840q37O626k21n735pN436O71o415Q0O357p83n211j0N728k2o685
4421c651J178N577m13n600K09N790o79n940J220N337m63n773N92O142j155n497
4437c126J114M963o40n839J003N851j366n261J001N364o79n945J623N457j723
4452A797m884J090N381j152n922J672N524j658n163R40O450j962n962K369N019
4467C539j613n341J382N799k100n324K068M959j380n813K155N441k331m983K031
$$ plain form
4356 4161 -2144 -3520 2122 3702 -1717 -4023 2340 3685 -2521 -3438 1999 3566 -1992 -3935 2526
4371 2526 3616 -2400 -3457 1812 3699 -2183 -3624 2833 3328 -2274 -3549 2348 3773 -2604 -3409
4386 -3409 2471 2920 -2502 -3428 2513 3400 -2966 -2835 2691 3232 -2690 -3526 2949 3121 -3098 -3014 2770
4403 2770 3217 -2623 -3460 3166 2945 -2790 -2797 2639 3310 -3105 -3025 3332 2549 -2662 -2672 3056 3034 -3651
4421 -3651 -2473 3104 2691 -2909 -2700 3090 2411 -3529 -2309 3028 2565 -3208 -2616 3526 2371 -3126
4437 -3126 -2012 2951 2311 -3528 -2525 3326 1960 -3301 -2300 3064 2385 -3560 -1937 3520 1797
4452 1797 -3087 -1997 3384 2232 -3690 -2018 3506 1848 -3315 -2375 4075 2113 -3849 -1480 3539
4467 3539 1926 -3415 -2033 3766 1666 -3658 -1590 3369 1989 -3824 -1669 3772 1441 -3542 -1511
4482a511N028j897n581K918M708k446m608J802N167k270n245L097M256j935n208
4497c725K381N317k772n253L009M719k625m918K580N306l070m673K724M721k555
4512A166m949K796N048l615l954K703M488k875m683L239M313l108m157K491N244
4527D147l628m488L707L895k913m439K931M756l706l998L647L659k862m552L542
4542c02M431m269l607L485L847l300m228M026L519l803l424L344L977l631m052
4557c987M205L806m140l401L518L772l891l741M404K959l602l499L902L676m593
4572f12l113M298K996l586m117M707L264m575k761L868L320l998l863M988K655
4587C471m179k934M077L592m826l125N009K565m585k581M453L007n205k394M636
$$ plain form
4482 -1511 3517 1620 -3961 -1043 3665 1219 -3389 -1587 3580 1310 -3935 -838 3418 1483 -3725
4497 -3725 -1344 3973 1201 -4052 -1043 3676 1051 -3867 -1287 4019 949 -3724 -1000 3721 1166
4512 1166 -3783 -987 4061 446 -3508 -805 3683 808 -3875 -636 3677 569 -3588 -1097 4147
4527 4147 519 -3969 -262 3633 720 -3719 -788 3968 262 -3736 -89 3570 708 -3844 -302
4542 -302 4129 -140 -3747 -262 3585 285 -3943 83 3602 -201 -3625 -281 3696 65 -3987
4557 -3987 218 4024 -116 -3517 1 3773 -118 -3859 545 3504 -98 -3597 305 3981 -612
4572 -612 -3725 573 3569 -17 -4134 573 3837 -738 -3499 369 3689 -309 -4172 816 3471
4587 3471 -708 -3642 435 4027 -799 -3924 1085 3650 -935 -3516 937 3944 -1261 -3655 981
4602I81K388m264k849M708K695n091j905M281K279m207k862N019K533n186j944
4617c424M678K243m494k813N110J929m532k090M548K413m890k215N039J945m838
4632a391j941M775K033n175j618N039J283m374k019N097J582n205j039M819J289
4647C155m741j682N258J382n476o85M347J534m812j429N267P08m678j245M971
4662A874J276n448q02N255L82m467j183N187J060n694l4M546Q59m769q76N141
4678B307N44n193m15M949N67m660r60N296N8m564o31N028L90n350r6N436k14m828
4696b336k0M719O09n436J20N020k19m787j40M876j17n285O30M879M6n093O1N168
4714B695l33n285P62M483q3m908L43N290j119m454L96M939o24n107J054N005j288
$$ plain form
4602 981 3369 -895 -3744 964 3659 -1432 -3337 944 3223 -984 -3846 1173 3706 -1480 -3424
4617 -3424 1254 3497 -997 -3810 1300 3229 -1303 -3393 1155 3568 -1322 -3537 1502 3447 -1391
4632 -1391 -3332 1443 3476 -1699 -3317 1722 3005 -1369 -3388 1709 3291 -1914 -2953 1866 3155
4647 3155 -1586 -3268 1990 3372 -2104 -2789 1558 3092 -1720 -3149 2118 2826 -1852 -3097 1874
4662 1874 3150 -2298 -3100 2155 2537 -1930 -3113 2074 3134 -2560 -2594 1952 2811 -1958 -2834 2307
4678 2307 2851 -2342 -2757 2192 2759 -1901 -2861 2435 2493 -2071 -2702 2326 2716 -2634 -2730 2706 2492 -2336
4696 -2336 -2356 2363 2972 -2464 -2344 2676 2457 -2330 -2470 2406 2289 -2996 -2366 2513 2559 -2534 -2473 2695
4714 2695 2362 -2923 -2161 2322 2239 -2669 -2326 2964 1845 -2609 -2213 2726 2102 -3005 -1951 3054 1766
4731A766m556O74M962o47n187J382M251r40m407P66M919j099m930J527M293j005
4747A769m627R94N107j733m740J624M399j066m812J373N036j942m663J916M129
4762B764j132m885J843M631k172l924J252M609j677m788K179M430j914m165J684
4777a265M595j905m733K245M208k098m062K038M509k766l851K302L823j962m489
4792c411K366M315k630l554K037L924k137m277K750L926k788l455K183M039k497
4807G91m074K655L995k505m081K340M320l043l832K994L723k574m036K823L979
4822C475l291l611L521L239k627m215L201L750l346l091K725L704l201l675L401
4837d1L278l219l000K826L526l322l355L518K727k807l440L163L707l931k813
$$ plain form
4731 1766 -2790 -2116 2846 2199 -2988 -1606 2645 1705 -2702 -1936 2983 1884 -3046 -1519 2774 1769
4747 1769 -2858 -1864 3243 1510 -3230 -1606 2793 1727 -3085 -1712 3324 1382 -3281 -1365 2764
4762 2764 1632 -3253 -1410 3221 1049 -2875 -1623 2986 1309 -3479 -1300 3130 1216 -2949 -1265
4777 -1265 3330 1425 -3308 -1063 3145 1047 -3015 -977 3532 766 -3085 -783 3040 1078 -3411
4792 -3411 -1045 3270 640 -2914 -877 3047 910 -3367 -617 3309 521 -2934 -751 3288 791
4807 791 -3283 -628 3367 862 -3219 -879 3441 398 -3434 -440 3283 709 -3327 -504 3475
4822 3475 184 -3427 94 3333 706 -3509 -308 3442 96 -2995 -270 3434 233 -3442 -41
4837 -41 3237 18 -2982 -156 3370 48 -3307 211 2938 131 -3309 -146 3561 -370 -3183
4852c183L266L065l191l231L421L368m094k643L520K906l175l643M027K547l592
4867f32k492L364K973l526l031L916K542l501k770L673K688l741k766L877K181
4882B755l158k866L844K712m307k137L789K438l547k606L926K263m148j875L378
4897D61K590l863k484M514J761m142j834L635K543m029k430M819J263l617k163
4912b976L860K248m605j120L816J525l922j691M031J899m541j366M199J530m137
4927a250j829M714J002m106j360M318J543m289j699M445J353m245j341M039J857
4942C152m912r78M450P83m002r76M050J174m611q65M310Q30l877j454M796O25
4958B495m319m25L952P56m188r38M557N67m241n20L932Q00m315m72M673k6l967
$$ plain form
4852 -3183 83 3148 -43 -3274 147 3515 -579 -3222 298 3204 29 -3614 413 2960 -632
4867 -632 -3124 240 3213 -313 -3344 572 3114 -387 -3157 516 3204 -537 -3303 574 2755
4882 2755 -403 -3269 575 3287 -1020 -3157 632 3070 -477 -3083 843 3106 -1042 -2917 461
4897 461 3051 -812 -3296 1218 2979 -1163 -2997 638 3181 -848 -3278 1541 2804 -813 -2976
4912 -2976 884 3132 -1473 -2593 1223 2748 -1174 -2865 1166 3065 -1476 -2842 1357 2887 -1250
4927 -1250 -3079 1635 2637 -1469 -2829 1489 3032 -1257 -2956 1489 2842 -1403 -2744 1295 3152
4942 3152 -1760 -2738 1712 2495 -1507 -2483 1567 2741 -1870 -2735 1575 2405 -1472 -2926 1870 2495
4958 2495 -1824 -2249 1703 2459 -1729 -2667 1890 2457 -1784 -2304 1628 2428 -1887 -2359 2314 2288 -1679
4975a679n86L928N04m122l60M251O1l633p76M342M56m515P7M128L2m150l95M605
4993B168j83m065K4L861K95m155R0M477q32l819L31L752J56m331M2M511o05l552
5011a835K4M033j57m678Q17M004r39l510M30M253n99m262Q33L837o37l835M96
5028a725M381j142l969J105L610m89m278R53M087r89l807Q70L790p58m334J367
5044a328L752j158l606R12L876p41m341J599L388r85l833J044M253j575l740J482
5060a001L253r02l861J101M175j651l614J634L386j262l787J602L582j674l427
5075b446J517L413j490l897K178L355j726l278J495L441k067l216K101L289j848
5090H21l446J692L698j930l482K198K899j461l678K300L058k078l178J746L445
$$ plain form
4975 -1679 -2265 1663 2167 -1955 -2315 1936 1997 -1636 -2412 1930 2386 -2129 -2052 2076 2108 -2042 -2437 2168
4993 2168 1985 -2080 -2056 1805 2100 -2055 -1965 2512 1680 -2139 -1808 1944 2100 -2231 -2189 2322 1717 -1835
5011 -1835 -1811 2222 2065 -2613 -1796 2208 1269 -2241 -1811 2442 1843 -2419 -1586 2251 1614 -2221 -1725
5028 -1725 2656 1514 -2455 -1350 2260 1771 -2507 -1554 2533 1544 -2263 -1393 2397 1639 -2695 -1328
5044 -1328 2424 1266 -2340 -1428 2448 1707 -2634 -1035 2353 1368 -2465 -1421 2832 1257 -2483 -1001
5060 -1001 2252 1350 -2511 -1410 2765 1114 -2500 -866 2520 1258 -2529 -927 2655 981 -2446
5075 -2446 -929 2484 994 -2903 -725 2630 904 -2374 -879 2562 495 -2721 -620 2669 821
5090 821 -2625 -933 2765 835 -2647 -449 2450 989 -2689 -389 2669 591 -2587 -841 2604
5105B604j928l552K500L289k434k933J832L327k147l624K751K875k114l079K021
5120f12L249k411l066K816K673k562k987K702L058k701k884K793K639k466k933
5135b692K559K722k508k860K734K710k467l024K885K907l121k509K327L056k905
5150a86k508K976K347k872k284K719K743l045k796L408K078k700k601K958K313
5165B550k948k210L019K103k658k508L036K302l388j835K906K471l437j977K978
5180D04K018l030j871K908K353l459k154L461J816k756k179K856K120l229j919
5195b661L457J583k993k057L106K300l663j528L545J383l232j867L692J601l750
5210a084j051K928J670l131j784L775J043l129j546L407J315l526j185L433J073
$$ plain form
5105 2604 676 -2876 -376 2913 479 -2454 -622 2705 558 -3066 -315 2560 446 -2633 -612
5120 -612 2637 226 -2840 -24 2649 87 -2900 -198 2860 159 -2725 68 2707 241 -2692
5135 -2692 -133 2589 81 -2779 -45 2665 198 -2826 59 2966 -155 -2664 -337 2719 -186
5150 -186 -2694 282 2629 -243 -2527 192 2935 -110 -2906 502 2580 -120 -2721 237 2550
5165 2550 -398 -2608 411 2514 -144 -2652 384 2686 -702 -2537 369 2840 -597 -2574 404
5180 404 2422 -608 -2479 429 2782 -677 -2831 630 2446 -310 -2489 367 2487 -742 -2661
5195 -2661 796 2379 -614 -2671 435 2735 -928 -2456 1089 2472 -760 -2627 1065 2666 -1084
5210 -1084 -2135 793 2463 -668 -2452 1323 2366 -763 -2309 1098 2413 -1113 -2298 1135 2208
5225B208l348j283L408J569l821o38L115Q27l056j019L250J001l772o79L272J133
5241B167l229j155L794P78l761o68L464J001l607j119L716M33l168o00L221P99
5257B066l357q76L504N34l436m48L500L57l467l81L560N39l541o37L535M49l696
5274a795J29L164M29l328l75L557j3l413r3L192N11l608j95L629k20l151j14L511
5292A817J48l736K79L136j21l169n15M079l17l303N5L426j01l297k29L643k42
5309A553l624P63K842K36l607J95L488n37l142O16L199m04l499N61L450p08l243
5326a861O70L009m07l498O92L278q22k871L66L560r38l326J116K970o32l290P34
5343a250L161q65l068R08L011o46l211Q66L423j447k927J013L125j048l286J271
$$ plain form
5225 2208 -1140 -2423 985 2554 -1267 -1905 1210 2037 -1019 -2038 1212 2213 -1559 -2238 1034 2167
5241 2167 -1062 -2217 1577 2355 -1406 -2074 1390 2391 -1216 -2335 1381 1814 -1354 -1954 1267 2066
5257 2066 -1291 -2167 1337 1871 -1565 -2013 1487 1844 -1623 -2004 1556 2095 -1446 -2083 1452 1901 -1795
5274 -1795 -1666 1498 1927 -1401 -1776 1781 1768 -1645 -1738 1454 1965 -1643 -1838 1791 1571 -1580 -1694 1817
5292 1817 1965 -1771 -1492 1644 1523 -1646 -2161 1918 1601 -1702 -1647 1779 1678 -1619 -1848 1795 1553
5309 1553 -2071 -1308 1534 1770 -1837 -1642 1846 1309 -1833 -1217 1982 1578 -1921 -1360 2090 1382 -1861
5326 -1861 -1191 1818 1411 -2087 -1395 1883 1061 -1810 -1444 2116 1178 -2148 -1032 1938 1306 -1984 -1250
5343 -1250 1911 1046 -2022 -1114 1897 1251 -1960 -1094 2329 882 -2045 -1032 2093 1045 -2241 -970
5359i70L064j301k934J099L203j025l411J458K687r39l210J100L327j411k984
5374b247J502K804r84l049R55L347j473k964J418K707j250l052J622K650j394
5389E92k531J237L000j725l040J928L012j961k550J401L037j773k800J858K521
5404B206j670k569J350L061k294k410K244K182j866k526K167K418k002k469J747
5419d31K459j451k787K155K293k180j911J376K587k057k353K110K290j658k573
5434b131K038K184k064k133K146J941j824k384J996K370k156k230K466J540j471
5449B88k482K266K125k358k163K048K525k516j932K579J820k679j807K398K240
5464B352k659j639K389J613k256j817K150K126k736j501K318J528j922k056K463
$$ plain form
5359 -970 2094 793 -2141 -1042 2161 1136 -2275 -817 1870 931 -2279 -1179 2148 737 -2247
5374 -2247 -745 2059 1075 -1974 -1019 2328 855 -2109 -691 2016 766 -2286 -664 1986 592
5389 592 -1939 -702 2298 573 -2467 -539 2473 512 -2038 -637 2400 627 -2173 -315 2206
5404 2206 536 -2033 -683 2378 84 -2326 -82 2100 234 -2292 -125 2293 291 -2178 -431
5419 -431 2028 577 -2210 -55 2238 58 -1853 -477 2110 53 -2300 -190 2100 442 -2131
5434 -2131 -93 2091 27 -2106 40 1981 157 -2227 -231 2139 -17 -2247 219 1759 288
5449 288 -2194 72 2197 -161 -2324 -276 2249 -267 -2199 380 2200 -479 -2286 112 2352
5464 2352 -307 -1946 443 2056 -200 -2017 133 2259 -477 -1978 340 1868 -54 -2110 353
5479C53J863k564j726K506J394k311j695K305J859k521j387K378J608k532j766
5494b236L079J256k874r68K146J556k741r89K372J115k371j260K754R58k668j059
5510a930K625J069k358j394K485J591k993p60K552P58k325j332L098N28k494o23
5526a503K437J076l012r43L172L76k653q95K737J207l002o81K735M13k445r55
5542a936K992Q49l089l30K272R80k526r94K752R95l202k93K683N71k796q57L184
5559A255J64k665k56K581M57k758m25K981K70k520o08K615N74l090j36L068Nk226
5577g14q64K636O98l205L22K419k4k683QK676K90k808J5K447L59l006m7L083m99
5596A103k479n9K762r3k618j78L217l46k590m9K536P8k686LK691j45k507K00K708
$$ plain form
5479 353 2216 -348 -2074 432 1826 -485 -2180 125 1984 -537 -1924 454 2062 -470 -2236
5494 -2236 843 2099 -775 -1743 403 1959 -782 -1771 601 1716 -655 -1915 839 1797 -871 -1930
5510 -1930 695 1764 -594 -1988 497 2088 -905 -1665 887 1645 -680 -2012 1086 1614 -880 -1503
5526 -1503 934 2010 -1002 -1945 1227 1603 -1050 -1945 792 1999 -1003 -1684 1051 1464 -981 -1936
5542 -1936 1056 1905 -1184 -1514 758 1738 -788 -1782 970 1965 -1237 -1530 1153 1724 -1072 -1929 1255
5559 1255 1419 -1246 -1502 1079 1536 -1222 -1647 1334 1604 -916 -1524 1091 1665 -1425 -1561 1507 1512 -714
5577 -714 -1578 1058 1756 -1449 -1127 1292 1268 -1415 -1407 1269 1559 -1249 -1234 1213 1572 -1434 -1481 1602 1103
5596 1103 -1376 -1435 1327 1234 -1384 -1562 1655 1309 -1281 -1330 1206 1284 -1402 -1399 1292 1147 -1360 -1160 1548
5615A548k18k777M69K307K41l152M22K924n40k590L36K402M7k967M76K773p86
5632I15k422O35K330k80k705N24K515o20k399M76K609k41k630N47K180m65k298
5649a329M00K666r62k707J131K032n22k503P72K663j237k008R00K141m42k823
5665a828Q83K793j308k290J139K514j209k376Q42K664j278k037Q87K355j173k326
5681a748J331K006r99k003Q43K366j260k013J151J920j239j904J157K241j530
5696C19j785J135J808r18k439J502K099j654j746J254K247j443k159J420K138
5711A778j449j888J274K059j301k229J664J622j350j964J313K104j304j989J558
5726a02J479j151j969J561J715j625j236J221J658j254k010J866J468j479j570
$$ plain form
5615 1548 1330 -1447 -978 1329 1570 -1582 -1160 1764 1224 -1366 -1030 1372 1419 -1548 -1072 1701 915
5632 915 -1507 -872 1458 1178 -1527 -1003 1512 892 -1507 -1031 1578 1337 -1293 -746 1434 969 -1329
5649 -1329 -929 1737 775 -1932 -801 1231 709 -1794 -1022 1641 404 -1604 -704 1437 995 -1828
5665 -1828 -945 1848 540 -1750 -611 1903 694 -1682 -840 1824 546 -1491 -604 1751 578 -1748
5681 -1748 -417 1589 590 -1413 -570 1796 536 -1477 -326 1594 355 -1549 -392 1849 319
5696 319 -1466 -331 1477 559 -1880 -378 1721 67 -1679 -425 1822 379 -1780 -360 1778
5711 1778 329 -1559 -285 1774 473 -1756 -92 1530 180 -1784 -471 1633 329 -1660 -102
5726 -102 1377 226 -1743 -182 1533 -92 -1328 -107 1551 297 -1713 153 1621 142 -1428
5741a428J470J654j680j800J836J676k058j377J594J761j721j835J730J703j571
5756d6j699J675J866j980j286J576J469j726j596J930J507j823j052J271J597
5771A683j838j651K450J060k212r20J528J449j992j198K175J010j629j630K120
5786D05J426k030j345J732J309j794j475K110J441k307r77J811J169j747j580
5801a852K405P51k030o57K003Q70j776j119K188O63k066q03J883J002j929r18
5817a385J932Q81j914r47K012R83k359q21K266P53j934r76K062Q60k274o80K013
5834D72R63k180p13K175O05k165k90J896N13j905r09K336M16k159MJ456Q36k105
5852g54k21K079J88j867p44K174N28k267l56J963O62k243m03K092J98j729l59
$$ plain form
5741 -1428 42 1696 16 -1784 52 1728 -330 -1707 -113 1648 -73 -1908 -178 1525 -46
5756 -46 -1745 -70 1796 -184 -1470 106 1575 -151 -1747 183 1690 -133 -1185 86 1683
5771 1683 -155 -1806 644 1704 -508 -1428 100 1549 -443 -1641 534 1544 -85 -1715 405
5786 405 1831 -199 -1544 188 1497 -297 -1772 338 1779 -528 -1505 306 1475 -272 -1852
5801 -1852 553 1304 -726 -1383 620 1490 -286 -1405 783 1446 -620 -1423 460 1462 -467 -1385
5817 -1385 547 1428 -486 -1433 579 1562 -797 -1618 648 1401 -533 -1509 553 1413 -861 -1541 472
5834 472 1435 -745 -1458 717 1322 -843 -1133 763 1276 -629 -1538 798 1214 -945 -941 515 1351 -754
5852 -754 -975 1104 1292 -575 -1319 855 1383 -884 -1240 723 1385 -858 -1261 831 1029 -700 -1059
5869a059J989K05k388K13K146l7j976l5J593O21k193l38K162j05k043K77J845
5886H77L86k319P1K095k01j796j96K291l21j948J06J824K25k167J06K162l76j654
5904h35j09J976M0k150K36K250j56k309J82J931o9j923K60J919n83j820M50J796
5922A086j99j997J57K109o58j603J34K094m69j813L82J892j33k127J90K195n28
5939G12j757M48J782n79j969P76K029r57j731P40J697l15k217P61J627m38j912
5956a303N18J777k51j982O79J582l68j835P91J873r14j743O28J809q25j669O23
5973f10J961r91j609R87J426q37j530Q08J953j022j708Q38J634r24j801J180J697
5990A452j082j520O48J692j024j525J251J252o12j454N44J748j178j470J119J408
$$ plain form
5869 -1059 930 1135 -1253 -1040 1106 1069 -907 -942 651 1272 -921 -1259 903 798 -1245 -968 877
5886 877 1263 -1056 -985 1110 909 -887 -1083 1208 887 -1061 -955 869 1094 -1073 -967 1195 819 -835
5904 -835 -944 1032 1072 -1078 -842 1408 1252 -1057 -875 1056 987 -936 -676 1243 660 -1160 -710 1086
5922 1086 887 -1110 -953 1156 498 -1105 -971 1123 654 -1159 -777 1115 982 -1145 -955 1240 712
5939 712 -1045 -597 1185 606 -1363 -587 1442 485 -1246 -506 1191 876 -1341 -580 1047 609 -1303
5956 -1303 -785 992 741 -1241 -562 1020 652 -1183 -392 1481 567 -1176 -548 1261 436 -1233 -610
5973 -610 1351 360 -1249 -262 1164 327 -1203 -395 1558 536 -1172 -334 1300 376 -1425 -245 1452
5990 1452 370 -1150 -502 1190 166 -1359 -108 1144 532 -922 -378 1370 192 -1278 -159 1249
6006A249q60j669R43J506r80j294J024J275j037j512J137J668j358j340R73J593
6022A318j173j274J181J273r38j542R30J479j190j206J144J076p86j570J193J471
6038A386j336j247J375J020j217j460J473R45j282q33J049J371j152j146J153
6053I9J304j392j138J287J361j530j068J145J224j324q66R98J072j738o29J173
6069b2J212j292j040J459J083j746p32J347R61j393j079J556Q96j321j011J124
6085BJ123j490r21J880N29j549p82J243R91j249j153J703O80j135j103J845O93
6102A307k017k60J583N47j164j213J748Q27k036m18J811M09j341j028J854N06
6118A115j774m34J559P49j581p01J783K88j684m55J576M70j277o22J464N60j672
$$ plain form
6006 1249 389 -1280 -337 1169 189 -1105 -81 1194 157 -1355 -218 1450 92 -1248 -275 1318
6022 1318 145 -1129 52 1325 387 -1155 -225 1254 64 -1142 2 1078 292 -1278 -85 1386
6038 1386 50 -1197 178 1198 -19 -1479 -6 939 -343 -1176 -127 1244 92 -1054 99
6053 99 1403 11 -1127 160 1521 -9 -1077 68 1292 -32 -898 100 1172 -566 -1195 -22
6069 -22 1190 -102 -1142 317 1400 -346 -1078 269 1230 -163 -1242 314 1210 -111 -1122 2
6085 2 1125 -365 -1286 594 1123 -426 -1208 35 1026 -223 -1376 327 1007 -128 -1231 614 1307
6102 1307 -710 -970 613 1160 -4 -1217 531 1358 -678 -1096 715 1124 -217 -1245 609 1115
6118 1115 -659 -1093 466 1215 -366 -1067 716 1004 -680 -1135 441 911 -366 -988 476 1036 -636
6135f36l07J653L70j704j29J499J5j442k16J398N72j725j55J554K77j635m20J896
6153H65q6j610m8J349O24j737l18J732K47j624k68J505M28j872qJ533k5j445L7
6172g21J537K70j828j99J537R3j034m06J515j49j574M40J097L57j690J19J496
6189H60j71j703J27J637j21j496L56J746o31j616J15J236L01j501J48J567j76
6206F78j295k18J709l25j404L26J345k65j394K13J590k49j575M18J125q3j411
6223h15L09J332m56j510M59J415j91j470O87J216n04j240K43J370n58j421P08
6240d26J274n14j436N78J279k29j537O42J464m66j211o1J857p52j562P58J225
6257H83o60j376R61J350o68j599P36J360m60j430O27J355p45j214O40J246p78
$$ plain form
6135 -636 -943 710 1080 -624 -753 746 761 -681 -897 501 1073 -652 -807 747 1024 -611 -1031 865
6153 865 779 -831 -879 470 1094 -643 -961 771 1018 -606 -874 631 1059 -813 -821 712 687 -758 -721
6172 -721 816 1086 -742 -941 596 689 -345 -751 764 615 -959 -519 578 935 -755 -636 860
6189 860 689 -1014 -887 750 629 -867 -511 1235 604 -1012 -897 339 640 -861 -713 854 678
6206 678 -617 -835 874 549 -855 -529 816 551 -843 -630 960 711 -864 -446 679 596 -815
6223 -815 -506 826 370 -1140 -681 734 543 -927 -240 976 472 -768 -525 845 287 -1134 -426
6240 -426 848 334 -1102 -524 755 526 -1011 -369 1095 629 -582 -643 1214 462 -1100 -342 883
6257 883 223 -1153 -192 1158 490 -1109 -373 987 527 -903 -276 1079 334 -880 -240 1006 228
6274B28j147O09J223p10j111O99J402j056r61M88J341o57j417P78J461q00j454
6291a084J038J036n81j456R44J384j156q82O34Q58m57j176M35J176o01j283J024
6308a47J025p97j086R37O97n30r43O84J177r84q94N83J330q14j179Q06J264j132
6326cr65Q85J022j051j007J340Q01j250m44P61R00j111r54J184R64r49j081R16
6344d2R99r12q89J242M72o00j249Q41J229j314n61R37P44j185p85J117Q96j167
6362b27o11J133Q01j148r03J117N82o37j114J312O03j143o96R48O66q64n71R99
6380B47Q21j213o84R70P32j112n68R40Q58j444k16R71O11j024r33J382M12j142
6398c92j73P92Q81j346p39J396O73j355p34J416L92j271m38J343J88j116n76J373
$$ plain form
6274 228 -919 -310 913 203 -908 -209 1193 137 -824 -336 1005 348 -1069 -291 1170 370 -1084
6291 -1084 -46 990 409 -1047 -103 1281 125 -757 -123 735 278 -898 -463 713 112 -1171 -147
6308 -147 878 81 -1005 -68 629 99 -844 -160 1017 33 -861 -278 1052 238 -941 -135 1129 -3
6326 -3 -968 -83 939 -112 -1119 221 1022 -228 -672 89 989 -122 -1076 108 1072 123 -958 -42
6344 -42 957 45 -844 398 870 270 -979 -138 1091 -223 -784 153 897 -288 -1073 44 940 -227
6362 -227 -838 295 1096 -52 -955 162 744 107 -1007 305 908 -235 -931 17 683 -181 -752 247
6380 247 1068 -145 -829 141 873 -239 -807 133 991 -453 -669 302 913 -111 -1044 338 750 -392
6398 -392 -565 227 1108 -238 -977 419 1092 -263 -997 419 811 -460 -898 445 633 -483 -1059 314
6416C14N00j476J97P54O02j309n20J440M26j484k9J090J35r60m56J302K47j487
6434g14J68R11M13j221n62J620j8r56k40J177K15j642J19J252K66j384j16J365
6452F53Kj184k89J279J91j187l40J593j56r88l1R67J38j509jJ430J60j207l24
6471h03J466P9j533Q3J283j63j155N0J225L2j273J87J291j84r83p1J238j53j622
6490a006M52J032%j292J19J420k52j326M99Q68M9j316n4J459l59r53P5J233k47
6509D01j285L49J516n62p57o0J156l63r75K70J145l46j060J35J033k09j212L73
6527d51R76j58q48p8J537n37j175M16J227l78j110L45J024k85j299K50J617m68
6545F05j181J48J279o08j113M81J104m69j136O28J166m93j146L73J012n33q41
$$ plain form
6416 314 814 -662 -465 289 891 -418 -938 502 928 -556 -585 505 640 -320 -776 526 773 -714
6434 -714 -546 365 778 -443 -1005 615 597 -359 -599 578 793 -849 -730 522 788 -596 -712 653
6452 653 655 -529 -818 461 652 -535 -875 718 562 -426 -457 510 648 -861 -862 568 728 -479 -803
6471 -803 663 742 -791 -708 575 412 -743 -693 532 564 -709 -522 769 585 -398 -469 769 616 -1006
6490 -1006 -554 478 478 -814 -695 725 473 -853 -354 514 563 -753 -807 652 293 -660 -585 648 401
6509 401 -884 -535 981 419 -338 -398 758 395 -580 -310 835 489 -571 -436 597 388 -824 -451
6527 -451 525 367 -481 -559 978 441 -734 -318 909 531 -579 -234 790 505 -794 -544 1073 605
6545 605 -576 -428 851 243 -870 -389 715 246 -890 -262 904 411 -735 -362 650 117 -724
6562g24M13R21k59j139L28J247l79j070O25R08n25j376O81R80m72q95N17J117
6580H98l47j383P49P20o65p70N65J012n70r60N84J273j004p59L67J144n23r23
6598e92N09Q66n36j080R19Q32p97o95N40J030p89r93R26N78q27o59L99J244o32
6617B43r82P30N82m98r56R36N53m22r25Q09O20m22r87Q12R13j169n95O68J013
6636I23p71r66Q61Q38j154n75R27Q41r62q99J277M45j027o60P25Q84q62n74P50
6655B1O99q13o83P47Q74j103p55J527K61r00o98J185M87r66o43Q84N49q38o23
6674g88J082L78p14o85J021M08r49o83J015Q19j062p51R10Q58j050o09J004L73
6692E77q34o32J248M84j073m91Q27O24j058l99J054K72r91k74Q55P35j048m48
$$ plain form
6562 -724 -311 610 351 -788 -460 787 408 -662 -37 871 346 -1030 -349 631 159 -736 -219 898
6580 898 551 -832 -83 637 -28 -798 -233 779 209 -751 -167 1106 102 -657 -290 854 331 -592
6598 -592 -83 783 247 -833 86 918 121 -574 -34 996 207 -786 140 718 -109 -768 -369 875 243
6617 243 -739 -9 573 75 -881 55 608 186 -739 70 690 268 -719 93 1006 -163 -758 -90 923
6636 923 152 -814 47 885 -269 -844 83 924 -38 -937 340 785 -242 -902 -177 707 -155 -729 21
6655 21 720 -93 -776 -29 845 -258 -1013 514 775 -125 -823 362 849 -117 -760 124 673 -165 -788
6674 -788 294 672 -42 -727 294 702 -247 -930 85 904 -158 -909 1 859 -191 -800 204 577
6692 577 -257 -889 359 843 -230 -721 106 730 -328 -727 327 599 -392 -666 189 924 -124 -572
6710e72R38L81j025j44N83N91p77o71R89K30q92m12J071L34r60n05J190N45r84
6729i0m46R04L19j159j24J211J68q69m63J061K22j074p9P40K38j098j80J321N3
6748F55j133k35J209j5j009l20J400Q1r36l59R92K58r11j21J070j64r05j5J062
6767F04P0j220M7R76Q8j017j68J008J31r02k13J145L28j769K81J035K66j027k96
6786f33R99L01j147J05J070l99n36k75J003J69j376J70Q10Q1j061J33J309k23
6804E00j155K85R17j17r41m5J188o1j228L84Q68q0j100M8J277k42j032l4J341
6823G73l42j254N27Q23m30o78J29R66j02j148M66J009m65j123L45J244k72j140
6841f72M92Q09l31q88J29J154l66j040N08J131n10j108K84J127l48j083K55J162
$$ plain form
6710 -572 366 747 -278 -422 161 752 -25 -696 293 523 -369 -781 290 624 -336 -841 349 894 -90
6729 -90 -536 368 687 -472 -596 615 783 -86 -549 512 734 -340 -419 321 559 -539 -719 602 655
6748 655 -478 -713 496 481 -528 -848 552 633 -303 -662 330 588 -323 -444 626 462 -443 -458 604
6767 604 674 -546 -499 477 565 -452 -620 388 519 -383 -596 549 877 -892 -611 424 690 -337 -633
6786 -633 366 667 -480 -375 695 296 -240 -515 488 657 -719 -549 261 342 -719 -586 723 500
6804 500 -655 -370 547 430 -511 -556 632 571 -657 -273 595 515 -585 -537 740 498 -534 -568 773
6823 773 431 -823 -296 527 97 -581 -452 514 412 -736 -270 739 274 -849 -504 740 468 -672
6841 -672 -180 629 298 -590 -461 693 327 -713 -205 926 416 -692 -408 719 371 -712 -457 705
6859G05k28j209N28O37k84p38J58J110k60r89L34P65m25o25%J321o66q91Q85L71
6879D99k34j067M87R86o29l99N0R33l54j166M74J319o53q24K87J074l26j185N95
6898a33P73m57p37M18R29p50r04P56P20l54p61N36P09n80j121O98R50n12j042
6917h62Q12P93q89n23Q12O07o84r17O17R12q02l90K66P89m91p12Q13M76m76r01
6937g50L83J335r71p49O25Q47m77r07P42P98r16q70Q40R71q41p61O27Q95q01p41
6957g21P94N64o08r99J067N71p56o00O46Q14j055n41O57P18o32n42O15O47p61
6976a22l37M83P22q96p18Q22Q54j031l20O63N58q99n16Q13M35o54m89O69N74m14
6996A97r56J025L38p72n26P60P29j001m24J058J70p63m60O80O67j125l87J030
$$ plain form
6859 705 477 -732 -204 433 149 -589 -431 679 419 -570 -236 529 104 -521 -521 800 134 -757 128 499
6879 499 265 -802 -315 671 42 -357 -307 626 272 -894 -420 899 246 -578 -291 783 457 -728 -133
6898 -133 640 183 -554 -136 793 43 -861 -105 615 261 -500 36 745 165 -956 -258 692 180 -862
6917 -862 -50 743 -146 -669 143 750 66 -851 -234 678 -124 -514 -248 541 50 -662 151 627 151 -750
6937 -750 -367 968 -3 -752 -127 720 243 -664 78 876 -40 -910 -70 901 60 -701 -74 821 20 -721
6957 -721 73 637 29 -970 97 668 -88 -688 -42 772 -283 -824 -167 551 -81 -623 -8 639 -122
6976 -122 -459 24 746 -150 -868 -46 808 -223 -543 120 678 -221 -737 76 511 -143 -632 37 611 197
6996 197 -759 266 604 -168 -694 66 795 -206 -630 428 598 -165 -625 55 722 -403 -790 240
7014B40L49r65o28J399L83j128r6P19M38r63m91J171K47r20m67J084L32r40p20
7033i56J334K13j015l72R48O76r81o38J072O9n95k54Q00J46p11m98R96L29p96
7052b33n56J169L8j023j25Q17L21n73k74P51n4l34o10R47L34q41l01Q34N66j100
7072b47m44R87M95j246M4P84L05j285q4J085J39j005N2Q46J32q76k04Q87L74r66
7092b27j90P20M05j024k92J078K44j254Q7Q83Q8r90j26J039O0r55J9Q25J59q90
7112c41k58J040Mj110K64R78rr51j63R12J86j125J44R51J46j058j30J009j52p94
7132d57j0R69m2q45o8Q19K11j062J93J068n67p10J91J052j11j259L92R75k46j064
7152e71K74Q47k48p86J54P66J68j020N3Q28Mr30k1J220n1j037MJ005j94j158L39
$$ plain form
7014 240 589 -376 -1004 395 778 -350 -446 273 711 -252 -743 428 675 -245 -712 372 704 -236 -956
7033 -956 378 591 -424 -796 152 828 -153 -791 281 350 -245 -499 301 447 -264 -762 234 563 -233
7052 -233 -789 380 418 -605 -730 87 408 -165 -439 312 258 -76 -686 261 595 -246 -547 287 853 -247
7072 -247 -691 296 791 -455 -411 373 678 -607 -691 394 533 -472 -420 426 558 -318 -522 365 739 -227
7092 -227 -417 303 708 -316 -608 470 714 -540 -453 430 518 -472 -598 441 501 -454 -435 390 549 -341
7112 -341 -599 441 445 -665 -401 577 568 -383 -546 366 552 -573 -429 522 668 -390 -520 489 337 -457
7132 -457 -467 502 460 -385 -453 366 577 -485 -292 776 209 -501 -310 742 631 -628 -236 739 493 -571
7152 -571 -297 550 302 -484 -330 436 604 -416 -363 465 469 -461 -482 738 687 -350 -346 659 465 -693 -354
7173c54R41l46r43O73M24k31p23M15O59J31j088J61P11J88j044oJ083m87m47k70
7193e53P44P5p58R3Q01q9q59P2J112k60q23K66P65l56q16J49J012j2j320L45J168
7214G56o06p82L93Q51l68r77N62R09m52q50J08J143o85o72M24P80l15o37O4J008
7234F54o35n64L74P66k22j053O49P63l52j099M81O63k86o79L86Q98n11j085N94
7253b58P46n74p12J013L48m86q68O80R09p00m80L60O65m33r08M42R27p42m56J79
7273c48R33m15o86L81O46k46r23O78N77m17p51O04Q16p01q44N41P50n18n85N26
7293A8N18k81q76L64Q56o01p83P01P14n48o81O07N64o20o53O12P38n14q72O63
7313g4M46l89o00M98Q30p69o40Q81Q47j005p06O15P56n93p98P29Q60r68o58P03
$$ plain form
7173 -354 587 241 -702 -29 395 164 -559 -144 515 646 -442 -281 430 618 -426 -432 651 164 -283 -553
7193 -553 191 266 -492 -399 402 313 -546 -474 638 378 -445 -179 586 230 -586 -437 575 563 -757 -412 756
7214 756 150 -632 -239 612 244 -733 -171 738 286 -564 -456 687 2 -670 -246 534 219 -418 -354 654
7234 654 19 -545 -171 595 373 -680 -31 732 380 -719 -238 425 139 -540 -154 744 233 -852 -258
7253 -258 488 -86 -798 215 563 77 -791 -111 798 98 -382 -22 643 210 -698 -256 671 -71 -527 -348
7273 -348 585 170 -516 -135 511 265 -658 20 597 180 -571 33 849 148 -696 -155 595 77 -508 18
7293 18 536 255 -621 -257 599 -2 -785 -84 630 82 -599 8 572 -48 -701 -89 649 135 -737 -74
7313 -74 372 -17 -617 -119 711 -58 -698 183 1030 25 -681 -66 690 97 -701 28 888 -80 -738 -35
7333c5N16n14m95Q05O02j067m80O23P49q85k83N85O88o86q14Q97M36p41m03M81
7353b1M64m57m52O73L62n37p02P34M66r41l25P60M79p02o88R56L31n13k58K55
7373a16P57l61o93O32K97o81l44P02L85r49j64N92L36o20m74R03K79n84o14R89
7393B72K59o53k64N33J37p13N5M02K98m31m03O93K76o10l54R49J0p66l97Q06L29
7414D28n96rN68Np89k65J040P5n50n84O47O33j073J87O50K7o66j51O37M75q81
7435a92n13J107R9q68k70R90J81p51j65P63J94r25o6Q56J48j033O4O75L02p93
7455a97l18P28Q5m62o94J072K66r52J56O42R7q19l92J213M9p25k21O29L99p90
7475b34j43Q63j99q18O8J047O2j044R5Q21r5r59K48N29L50j131m7J115j67n77
$$ plain form
7333 -35 481 -33 -528 277 879 -188 -668 -45 704 -181 -464 121 809 123 -691 206 642 -99 -502 -21
7353 -21 443 -14 -466 207 569 32 -670 64 530 -411 -736 24 503 -199 -887 69 400 -113 -371 -116
7373 -116 641 280 -413 219 516 -165 -509 193 578 -371 -535 57 393 -227 -701 202 481 -103 -717 272
7393 272 531 -122 -386 147 284 -429 -374 28 326 -105 -508 185 461 -149 -503 446 456 -310 -707 99 428
7414 428 -168 -177 391 396 -393 -658 382 457 -93 -677 -30 603 -470 -283 367 394 -272 -423 214 689 -192
7435 -192 -705 402 501 -367 -637 353 534 -217 -382 381 575 -350 -416 440 588 -445 -381 294 596 -197
7455 -197 -515 213 298 -164 -858 214 480 -472 -316 326 423 -396 -788 425 474 -251 -472 157 556 -234
7475 -234 -377 486 287 -531 -463 584 646 -398 -303 518 423 -536 -288 241 591 -540 -587 528 361 -216
7495b16l24J086l2q79k3Q42N8q98K7Q52r6q16j7Q29N7j057K07Q76l8r49k7J047
7517E09j64n39j00Q71k41p61j09R11O6r71K32M89K36p56l76J050Q4q27J44R14
7537F62j45j003K06Q01k97o54j45J162rj091K10P84l01m35j22O12j58r38P60P99
7557F98l88q39R4J063j89p87L3R81m15p90P9R01k00p40O0R35p1r74M02O52k39
7578B66j073M02Q28k49p76N32M62l40o77L12P63k65q63M34N87k19l25L2P79l96
7598B14r14M06O72k62m64j93J139l79o57K30Q01n43o37M49Q02n67p31O00O25m20
7618A71q51N21O47k06p22M2Q83j73r42M38M89j53o93L73O55l78n43N71L95k58
7638B66q21J77J064q22n02M98Q20n68n57L23N08m08m13L18P69l45q83O33O13n77
$$ plain form
7495 -216 -540 546 514 -365 -388 454 512 -386 -359 493 397 -419 -436 393 450 -607 -400 476 438 -511 -538 509
7517 509 345 -194 -294 577 336 -425 -534 377 443 -528 -296 193 429 -327 -703 347 431 -396 -252 662
7537 662 517 -486 -280 521 224 -430 -575 587 578 -513 -303 481 180 -255 -377 235 77 -861 -101 698
7557 698 310 -529 -435 628 439 -348 -315 666 251 -539 -460 441 241 -499 -439 496 425 -549 -147 505 266
7578 266 -807 -405 423 174 -602 -70 392 52 -625 -313 450 185 -678 -244 343 124 -201 -169 610 214
7598 214 -700 -294 378 116 -348 -541 598 219 -438 -208 593 50 -587 -138 664 97 -634 -34 591 171
7618 171 -680 -159 488 282 -440 -398 485 312 -630 -192 297 144 -549 -176 479 101 -442 129 524 266
7638 266 -555 -378 686 -136 -638 -140 680 112 -445 -122 386 -22 -435 -117 652 307 -576 57 670 93
7658I3n30M65N30l10r31O72O78p61m79O07N10n82n06N49M45m07n85M04N46m09
7678ap78Q00N52n22p66O75P09p90m02O35N12o71m09L63O03n20n21L56N74l04r05
7699h10O74O19j23q01N05N87o29n49M05R21q41o33O91P00o30n79N17N27n83o81
7719g13R14L33o81k00L69P48n99o40P91N7k52n96O03M14q23k01O39N94p81m47
7739d71O90K10p49l21P62M40n71o25Q33K49n74l80P43K55n46o69J032K32q84j49
7759d93O83L07o87m23R35M08p38n84J141N4q98j65N99N30q86k69Q26L47p01n15
7779e29P71J54n56j27M51M82j038J4N15K55p01j86J047l42n76j87Q44L94p92l80
7799d87P98J08n10m24R72j91o68P5N51K29p04l86R01L38p26k33P42j46m44k90
$$ plain form
7658 93 -437 28 558 248 -683 -11 667 -94 -573 34 544 -38 -544 5 450 43 -542 -138 408 -1
7678 -1 -779 21 573 51 -715 -40 669 -121 -523 112 624 -47 -456 -93 510 -10 -531 -175 399 95 -810
7699 -810 -136 483 360 -441 64 651 22 -527 -122 799 -42 -675 16 716 86 -493 24 551 -32 -713
7719 -713 201 534 -147 -347 22 770 171 -469 322 379 127 -469 134 548 -275 -476 163 757 -24 -471
7739 -471 219 429 -320 -641 121 561 -10 -635 198 447 -127 -507 236 491 -55 -724 308 540 -344 -493
7759 -493 190 497 -190 -613 322 730 -8 -592 549 603 -295 -460 139 669 -217 -486 340 687 -14 -529
7779 -529 242 396 -160 -287 164 646 -392 -378 137 392 -309 -495 552 210 -366 -553 291 685 -107 -487
7799 -487 311 419 -91 -515 457 266 -402 -327 224 453 -251 -637 264 602 -124 -357 385 239 -205 -495
7819d95R08R2p19J3O35K07p80l97Q79K24p62j41Q62n5p59J54N23P5r20o8O67R3
7841B36o48J17N42J71p13l09R26K6o79k74J013%q33L5N33J98o14p9P48q7o44m0
7863c75O36K69j180L25M38K85r49K55O32J86q98l6O98J3o24j69P91j14n11n5O98
7884C15l2m85k27O93J62p90K0Q04l62o01K32O66Qo34n7N74j65k91l51R92j72q76
7906e77K92Q22k31m34o6N28j72o92K63O15k55l96k42R19k63m81J82R57n22p81
7926e34J44P99j99o57L1Q06j07q02L43O31j35o19J74N92k89p52N73M88k38r66
7946g17M98Q69l60q68J86Q66l14p12J84R83n02o47L54O72l25q04M32O25l60m44
7966c84L08P19m47o71M53M77j23r50M22P16j97r33N64M72k32n94K96M09k95o20
$$ plain form
7819 -495 413 505 -214 -201 434 641 -139 -536 343 567 -195 -336 526 471 -288 -134 389 464 -456 -524 143 236
7841 236 -412 -295 247 418 -295 -604 322 348 -331 -605 408 408 -425 -390 143 341 -273 -352 396 309 -335 -375
7863 -375 261 530 -650 -325 113 398 -551 -296 336 522 -376 -412 286 299 -325 -494 297 183 -328 -383 315
7884 315 283 -202 -429 264 426 -364 -344 460 98 -503 -271 395 403 -231 -288 286 121 -170 -521 471 299 -577
7906 -577 -285 537 306 -128 -194 334 162 -530 -267 348 93 -303 -545 374 111 -370 -188 769 247 -534
7926 -534 -390 409 210 -447 -416 390 283 -519 -176 455 320 -299 -125 467 178 -574 -1 487 249 -717
7946 -717 -219 650 290 -578 -392 474 160 -552 -368 615 113 -534 -180 492 167 -637 -205 420 60 -384
7966 -384 -76 643 196 -475 -22 455 332 -618 -196 520 323 -610 -46 426 194 -400 -104 305 10 -610
7986f10L72Q85m48q40L82P43m37n56K57P90n26l35K22O05l08o14J57Q03m94o07
8006e59M04P55p42k99L97P96n01p26L67N23j28r73N14Q36o56n98M96P26o45o05
8026f18L79Q93n72k82K0K98J09p74M75P56n02n25K57P00n55o71O13M77n55l13
8046c90N02M35l90m23K41M18j18o30K66N71p61k22N23N20m76o79P21L93n47m85
8066e31M31N41m30o68O61O18o46l95N03O28q20m61O26O98p39n00M85P06r48j45
8086c86N31K43m10k71L52N92o68n98L97R41q86k60P13K65n18l37K40M90m31n15
8106e16O13M79q98l01Q69J39m30l07M66K88m66l76P49j2n10j74L18O03m87n94
8126e47Q01L94p67o05P85L50j85q27O53J58n40j30N22O26j104Q1N11L75o70l69
$$ plain form
7986 -610 -238 647 199 -641 -259 484 47 -509 -252 538 12 -323 -101 504 196 -418 -261 542 48 -559
8006 -559 -155 600 -142 -441 -44 752 251 -475 -108 415 287 -686 -172 664 8 -590 -94 632 -13 -618
8026 -618 -239 654 82 -200 -180 118 227 -547 -72 684 182 -343 -86 614 59 -612 1 478 -77 -390
8046 -390 112 547 157 -266 -25 393 275 -355 -89 482 -279 -501 22 542 66 -613 108 501 -46 -531
8066 -531 -100 441 11 -657 4 622 -24 -419 84 712 -108 -569 57 755 16 -484 1 707 -241 -386
8086 -386 145 388 -22 -293 59 651 -17 -615 -218 723 -163 -423 290 555 37 -300 -60 430 -1 -516
8106 -516 97 576 -322 -623 246 385 -45 -352 114 402 -64 -440 309 297 -213 -387 -69 534 47 -547
8126 -547 254 648 -119 -724 61 411 226 -601 52 210 -330 -460 62 688 -416 -335 176 551 -119 -488
8146d88P15M33r24k08P45R9n98j33L78P07r55l43N67M72o66n26R38K9k20m11O41
8167B52K40r38K1O48K9l56l58L82P14p88l34P08L03n99m91O70L28n74k79N17K92
8188C87n86k62Q65
$$ plain form
8146 -488 227 660 -264 -472 273 372 -226 -359 19 726 -229 -572 -5 467 -199 -725 213 242 22 -389 252
8167 252 492 -446 -425 223 252 -104 -462 -80 634 -154 -488 220 523 -76 -567 103 431 -143 -422 95 387
8188 387 -199 -461 404
8191D04
$$ Imaginary data points
##PAGE= N=2
##DATA TABLE= (X++(I..I)), XYDATA
0@%%%%%%%%%%Qj6J6j6J6j6K4l2M0m8N2o1P4q9J04j21J43j66J87k14K46k79L16
33A68l59M07m57N10n70O39p13P91q76R71j076J186j309J448j595J754j933K131
51A117k348K588k856L159l502L891m341M870n497O252p189Q384r959J2138j5359
66h652K0582l0388N4716k18943l07153P11907K13297o09196k92475O53984K89677
77D77356o99615k19567O55381K09087o03754k77564O74696K28126o79525j68526
87d03905O07948K10555o12636k40153O76061J63558o31279j51140N80509K09669
97D09187o31350j84801O56123J16454n86143j51653N82433J87167o43370j24344
107c70297O17797R7412n60579j55100O02575J43803o36953p5767N75733R7217
$$ plain form
0 0 0 0 0 0 0 0 0 0 0 0 8 -8 8 -8 8 -8 16 -16 24 -24 28 -33 41 -48 56 -65 78 -88 99 -115 131 -148 168
33 168 -191 216 -241 269 -301 338 -375 416 -460 511 -565 621 -688 760 -835 919 -1014 1117
51 1117 -1231 1357 -1499 1660 -1842 2049 -2292 2578 -2919 3333 -3856 4528 -5431 6707 -8652
66 -8652 11930 -18458 36258 -182685 -489838 222069 435366 -173830 -466305 187679 477356
77 477356 -222259 -441826 213555 422642 -181112 -458676 216020 444146 -235379 -403905
87 -403905 204043 414598 -198038 -438191 237870 401428 -229851 -380991 199518 409187
97 409187 -222163 -406964 249159 365613 -220530 -372183 210250 397417 -245953 -370297
107 -370297 247500 344912 -215667 -370767 231808 375611 -261342 -337109 238624 335841
117C35841n57577j41228O16669Q8528o02929n1851N41320J03945n69447j05684
127c42413O09647L8794n55459m8023N24386R6759n77011n5758N74435J1058n11128
138b34713n5927N25606P0096n69927q170N26764N783m88314n5261N33608K7892
149B77437n43961K1044M85815J4069m89553l7772N37587j7329n08078L0742M65305
160B35306J7352n03658k041N25404n0221m72560K4530M66298O279n14352M1548
171b26115M95719o4837m47840J9162M76438k3730n03907P6247M56019o0928m37623
182b41395K3708M82511o2675m72913R4059M20866n2358m39341M6148M72272r7577
193A73305m30749R1550M04145n0808m45717Q0406M46746j17346l96344Q2334M05966
$$ plain form
117 335841 -221736 -362964 253705 342233 -260696 -312547 228773 332718 -236729 -342413
127 -342413 267234 306028 -249431 -297454 226932 323691 -253320 -309078 265357 276415 -234713
138 -234713 -290640 234966 305062 -264865 -273035 253729 259512 -228802 -284063 249545 277437
149 277437 -266524 -245480 240335 254404 -235149 -272921 264666 247337 -260741 -229999 235306
160 235306 252658 -251000 -253041 272363 222142 -250418 -225888 240410 246689 -267663 -226115
171 -226115 269604 204767 -243073 -223911 252527 228797 -275110 -198863 257156 196228 -241395
182 -241395 -217687 264824 202149 -270764 -176705 244161 191803 -247538 -201390 270882 173305
193 173305 -257444 -165894 238251 187443 -258274 -177868 268878 151532 -244812 -162478 243488
204B43488o7379m43963J15291M12865j19255l81353P8649M18316r8905m29535
214b71781J40006L82885j12493l84175R0948M24030j34578m01636J46894L65437
224B45537j07170l95409J17935M13352j60842l69443J41152L60234j12508l99503
234b66665J49598L84764j69112l43369J30526L65185j31759l88504J75018L48280
244B53962j62557l30885J29066L68594j59229l62635J85618L19471j50454l34673
254b43722J43615L64134j86331l31416J83122L07964j47727l43259J70666L46870
264B63916k02805l05214J74161L12430j60285l45443K00834L20090k05654k91905
274b39875J70504L21556j85090l32539K20365K92750j98189k90602J77368L23986
$$ plain form
204 243488 176109 -267854 -152563 260302 141047 -240306 -161657 256659 157754 -271781
214 -271781 -131775 251110 138617 -245558 -154610 269420 134842 -266794 -119900 245537
224 245537 138367 -257042 -139107 274245 113403 -256040 -114888 245346 132838 -266665
234 -266665 -117067 267697 98585 -244784 -114258 250927 119168 -269336 -94318 253962
244 253962 91405 -239480 -110414 258180 98951 -263684 -78066 241405 90951 -243722
254 -243722 -100107 264027 77696 -253720 -70598 237366 89639 -253620 -82954 263916
264 263916 61111 -244103 -69942 242488 82203 -263240 -62406 257684 52030 -239875
274 -239875 -69371 252185 67095 -265444 -45079 247671 49482 -241120 -63752 260234
284B60234k12933l05110K24737K70813j88907k94156J94601L10810k31195k72987
294b44093K14522K62914j88032k95899K18259K84227k36255k47592K02873K64434
304B35358k00451k87153K38276K53863k29138k37451J99287K70170k24565k66675
314b48479K49024K28941k19528k39838K11083K67017k48348k39647K47069K17574
324B24868k15944k47085K34306K50954k62667k13653K37859K17110k22991k45506
334b42749K56953K23318k61241j96752K28950K20907k38763k30610K69085J94266
344B23364k48745j90254K27612K19321k56547k03719K66403J73449k34755j92516
354b16387K37633K07603k69063j75101K55426J64616k30512j93798K55648J85532
$$ plain form
284 260234 47301 -257809 -33072 237741 48834 -245322 -50721 260089 28894 -244093
294 -244093 -29571 233343 45311 -250588 -32329 251898 15643 -231949 -29076 235358
304 235358 34907 -252246 -13970 239893 10755 -226696 -27409 242761 18196 -248479
314 -248479 545 229486 9958 -229880 -18797 248220 -128 -239775 7294 224868
324 224868 8924 -238161 -3855 247099 -15568 -229221 8638 225748 2757 -242749
334 -242749 14204 237522 -23719 -220471 8479 229386 -9377 -239987 29098 223364
344 223364 -25381 -215635 11977 231298 -25249 -228968 37435 210884 -23871 -216387
354 -216387 21246 228849 -40214 -215315 40111 204727 -25785 -219583 36065 221597
364B21597k72421j53225K43949J66813k40816j87078K73245J59000k66633j42658
374a98227K39453J70406k59727j68938K81851J35077k55974j42735K46378J66347
384B13911k77699j42326K76281J20876k46948j45139K59842J49594k84071j16491
394a92170K61654J17642k46006j42226K73362J24031k77251r9181K47453J19423
404A86731k53516j29259K79653R8371k62727r3186K42464J18745k66550j06910
414a86184K76616P9224k48722r5091K49566J10428k77961q2363K67201P1634k44311
425g9963r7373K65618R0912k81304o1170K55371P2235k50278r1298K78908O6506
436A68164k73047n0738K47096P4739k62358p4321K81198M4211k58023m9315K46430
$$ plain form
364 221597 -50824 -204049 39900 206713 -34103 -221181 52064 211064 -55569 -198227
374 -198227 41226 211632 -48095 -217033 64818 199895 -56079 -198814 47564 213911
384 213911 -63788 -206114 70167 191043 -55905 -201044 58798 208392 -75679 -192170
394 -192170 69484 187126 -58880 -201106 72256 196287 -80964 -180145 67308 186731
404 186731 -66785 -196044 83609 181980 -80747 -173933 68531 187276 -79274 -186184
414 -186184 90432 169656 -79066 -174157 75409 185837 -92124 -174487 92714 164348 -79963
425 -79963 -177336 88282 179194 -102110 -163280 92091 164326 -85952 -177250 101658 168164
436 168164 -104883 -155621 91475 166214 -96144 -170465 110733 154944 -103079 -152394 94036
447I4036P0931k72339n0945K71276L1180k43990n2012K52604N7614k73678k8499
458a43822K54136K8207k38310n1155K62061L6143k66605j3341K40045L0736k44285
469a06190m0807K68041J3873k54193p841K35088L0988k56261k1575K66635l835
480A23923k41576r237K41044K3165k65762J777K55695j2026k33984j0679K51076
491A23416O089k64771K0597K40775j1594k34301n716K58200j5392k52320K9750
502a05267K27405q236k39217P080K55822l3809k34391K9244K23304r535k45338
513a32938K5855K44934m3962k19600K5105K26934j9217k46809M5304K30044m6273
524H9377k15363K5462K35875l7315k41145N8323K17352m3274k19898L3491K41079
$$ plain form
447 94036 164967 -107372 -158317 112959 144139 -99851 -151863 100741 158355 -115323 -143822
458 -143822 110314 138521 -99789 -150944 111117 147260 -119345 -132686 107359 138095 -106190
469 -106190 -146997 121044 134917 -119276 -127117 107971 138959 -117302 -138877 127758 123923
480 123923 -117653 -126890 114154 137319 -128443 -126666 129029 117003 -116981 -127660 123416
491 123416 129505 -135266 -114669 126106 114512 -119789 -125505 132695 117303 -135017 -105267
502 -105267 122138 113902 -125315 -118235 137587 103778 -130613 -101369 121935 112400 -132938
513 -132938 -107083 137851 93889 -125711 -100606 126328 107111 -139698 -94394 135650 89377
524 89377 -125986 -100524 135351 98036 -143109 -84786 132566 89292 -130606 -97115 143964
535A43964n7728k28858O3831K10532m2690k28262N0176K37484p3670k13246O1614
546g6853K10870m7645k32550O9010K23874p9050k02247N8083K15673o0366k27745
557a48946Q4043K05341p5690j98195N8861K19304p7371k14538R0901J91278p1135
568F3853k01017O8863K16790r2800j98060Q9725J86728p1243k06748Q5595K07558
579A49244j02852j84891Q6609J90290q0494k08047J03682J93081j05201j78771
589a37350Q6266J96453r6445k01195J15795J78584j02481j79217R2279J98081
599A50770j13272j86534J18741J68383r8880j82805J04212J90799j24770j68813
609a42169J14244J64988j00586j83713J18631J76266j28184j55623J08409J67404
$$ plain form
535 143964 86236 -142622 -78791 131741 89051 -139211 -89035 148449 74779 -138467 -76853
546 -76853 134017 86372 -146178 -77168 146706 67656 -134591 -76508 139165 78799 -148946
557 -148946 -64903 140438 64748 -133447 -74586 144718 67347 -147191 -56290 134988 63853
568 63853 -137164 -68301 148489 55689 -142371 -52646 134082 62839 -143909 -58314 149244
579 149244 46392 -138499 -51890 138400 57906 -150141 -46459 146622 41421 -137350
589 -137350 -51084 145369 48924 -152271 -36476 142108 39627 -139590 -47311 150770
599 150770 37498 -149036 -30295 138088 39208 -143597 -39385 151414 26644 -142169
609 -142169 -27925 137063 36477 -147236 -28605 147661 19477 -136146 -27737 139667
619A39667j09402j78935J31033J58742j24268j51027J08465J69596j24175j66516
629a46820J37383J45453j20293j53170J17623J67732j39888j50522J37282J39758
639A34538j20681j56613J32658J57450j48301j36296J33598J40089j27107j55588
649a46253J47346J41608j48683j26962J30235J41773j37778j46463J55370J24978
659A35171j42631j24452J32180J41043j50402j30413J54925J13247j36201j25446
669a32979J39484J33654j58234j13390J48539J09168j35187j26602J51570J20298
679A36321j60801j01047J42941J10692j42847j21917J62880J03493j57317r5442
689a23044J42169J12425j55953j09653J68035Q9753j51858r6128J48186J08897
$$ plain form
619 139667 30265 -148670 -17637 141105 16837 -134190 -25725 143871 19696 -146820
629 -146820 -9437 136016 15723 -137447 -19824 147908 8020 -142502 -5220 134538
639 134538 13857 -142756 -10098 147352 -949 -137245 -3647 136442 9335 -146253
649 -146253 1093 142701 -5982 -132944 -2709 139064 1286 -145177 10193 135171
659 135171 -7460 -131912 268 141311 -9091 -139504 15421 128668 -7533 -132979
669 -132979 6505 140159 -18075 -131465 17074 126242 -8945 -135547 16023 136321
679 136321 -24480 -125527 17414 128106 -14741 -136658 26222 129715 -27602 -123044
689 -123044 19125 131550 -24403 -134056 33979 123732 -28126 -124254 23932 132829
699A32829j67142r3536J65360Q2175j48524r7953J58391R8629j72067p8398J57913
710C7677Q0497j49916r5050J67209Q2519j68056o8829J50700Q2128j56400q6658
721a24179J72064O6906j59863o5909J48916Q1622j65120p2276J70057N5807j52109
732d4084o7432J54949P5007j72729n6003J63760N1611j51192o7245J65606O1609
743A13857j73943m3644J57301N2033j56422o2624J74474M5531j69006l7570J53841
754E3828N2941j65021n0758J75720L1977j59985l6974J54770M9851j72024l5339
765a01014J69231K4254j51859l9139J60011M0428j72318k2078J58869K3649j50468
776f0434l7640J66249K7081j68005j3165J50169K5857j54899l0616J69848J2176
$$ plain form
699 132829 -34313 -127849 37511 119686 -28838 -126791 31600 130229 -41838 -120236 37677
710 37677 118174 -31742 -126792 40417 122936 -45120 -113949 36751 118879 -37521 -124179
721 -124179 47885 114791 -45072 -110981 37935 119557 -45563 -117839 52218 108025 -44084
732 -44084 -111516 43433 118440 -54289 -110292 53468 105079 -46113 -113358 52248 113857
743 113857 -60086 -103730 53571 105604 -50818 -113442 61032 106563 -62443 -100013 53828
754 53828 106769 -58252 -109010 66710 98687 -61298 -98272 56498 106349 -65675 -101014
765 -101014 68217 92471 -59388 -98527 61484 101912 -70406 -92484 66385 90034 -60434
776 -60434 -98074 68175 95256 -72749 -85914 64255 90112 -64787 -95403 74445 86621
787H6621j58938j0529J48412K5543j63470j7248J68205J668j51419j1792J52931
798F9984J9184j68896k026J60544k615j47666j2146J60224P059j67170R267J51454
810G7197k128j49097p942J64937p167j59417J4594J44095J12j53784J493J63427
822H6320j8625j48617J4320J42695j775j58165J4540J55595k4451j39791J1229
833f6725J46289r290j58390K6660J45812k5517j37476J2217J51926k2028j53398
844h9920L4645J37825k3708j41664J8975J55299l5774j44786L7513J34157k3714
855E8848j47198L0369J52003m5397j35561L6125J35912k8311j50063M3428J42296
866I2451m8159j29171L3995J39587l7216j46661N2733J31157m5448j28279L5486
$$ plain form
787 86621 -72317 -82846 65566 91109 -72361 -89609 78596 80264 -71155 -82947 69984
798 69984 89168 -79728 -81754 78790 76175 -71491 -83637 76587 83646 -83524 -74257 77197
810 77197 75069 -74028 -81970 82967 75800 -83617 -69023 75072 75184 -78600 -77107 86320
822 86320 67695 -80922 -66602 76093 74318 -83847 -69307 86288 61837 -77954 -66725
833 -66725 79564 70274 -88116 -61456 84356 58839 -78637 -66420 85506 63478 -89920
844 -89920 -55275 82550 58842 -82822 -63847 91452 55678 -89108 -51595 82562 58848
855 58848 -88350 -57981 94022 48625 -86936 -50811 85101 56790 -93273 -49845 92451
866 92451 44292 -84879 -50884 88703 51487 -95174 -42441 88716 43268 -85011 -49525
877d9525J42463m8689j38003N6355J23105m2588j31173M2647J40801n8791j26941
888i0339N4793J21362m3513j35055N4797J33484o4785j18594N2799J24239n0753
899C8435j35249O6863J23491o5948j15514N3816J28390o2711j29638P4783J14049
910I0767o4077j17110N9101J29548p4772j19059P6140J08193o2289j20004O8343
921b5219J23685q1860j08026P2844J07546o4717j20692P8635J13417q3313j00212
932h7912O9289J10171p2515j16224Q6560J01981q0564r8366P0500J11783q2629
943A2074j07571R0031R3635p7544j00752P7714J09486r2839r6572Q9293R0476
954H7431p8019j03450Q8655J01768r8171q7132Q6460R1753q3469j02209R8298
$$ plain form
877 -49525 92938 44249 -93754 -37399 85706 43118 -88055 -45408 95393 36602 -90339
888 -90339 -35546 85816 42303 -92752 -37955 95529 30744 -87850 -35051 89188 38435
899 38435 -96814 -29951 93540 27592 -87922 -34106 94284 31573 -98065 -23282 90767
910 90767 26690 -90420 -31319 98229 23457 -95602 -19462 88731 26442 -93562 -25219
921 -25219 98466 16606 -91420 -18576 88970 24253 -96439 -17804 95613 12300 -87912
932 -87912 -18623 91548 19033 -97191 -10631 91350 10786 -87580 -17080 94703 12074
943 12074 -95497 -5466 88169 10625 -90127 -12413 97073 4234 -92338 -3045 87431
954 87431 9412 -94038 -5383 96385 -1786 -88918 -2458 89295 5826 -96383 1915
965A915R0946r7521q1978Q4677R4018r2437r4658J03165Q0167r2927q2252Q7249
977C64R3171j00599q4316J02175P3643q8940q3830R3590Q7250j05608p2987R7388
989A1301P2095q9356q4440J01995P7936j06464o5064R3094P3699r5271p9788J08866
1001A8603O6185j03409o2127R3527P4582j04707p0862J11696N7142r9504o3289
1012h2163R8969P1220j12440n9173J09247N2696r7709o4451J06700O2956j15291
1023b9439m9176J03870N2740j00038o2314J13166N1978j11894m3566R9545N4454
1034G9326j05586n5989J15633M1878j05868m3032R9535N4013j12259m5445J13560
1045C5766L5204j00775m4595J04451M8830j16669l4575J08710L3188j00719m4511
$$ plain form
965 1915 92861 -4660 -86638 -1961 92057 -380 -95038 8127 88294 -4633 -86885 364
977 364 93535 -7064 -91380 10795 84438 -4502 -88332 5258 92508 -13100 -86087 11301
989 11301 83396 -5960 -90400 11595 89531 -16933 -81997 11097 84796 -10475 -90263 18603
1001 18603 84788 -18621 -80748 12779 87361 -17346 -88208 23488 80630 -18874 -82163
1012 -82163 16806 88026 -24414 -83587 25660 78356 -19353 -83804 22896 85852 -29439
1023 -29439 -78615 25255 77995 -22043 -84357 28809 80787 -31107 -74673 24872 79326
1034 79326 -26260 -82249 33384 75262 -30606 -73638 25897 79910 -32349 -77794 35766
1045 35766 70970 -29805 -74400 30051 78881 -37788 -72363 36347 69535 -31184 -75695
1056g5695J11847L8888j16178k6668J03740L4418j05162m0429J17556K7532j12103
1067d2254k3437J02245L4932j11714l1646J17851J8746j05920k4616J04366L2740
1078G1293j17018k0761J12978J5027j01869k6139J09292K5234j17002j2052J06070
1089D5053J5427j01981k4540J13759J5320j12856p245J00821J7364j06153j8932
1100f3963J16240M872j06627n880J00322J6309j12079q578J13491j327j01552
1111d8772o876J04162J1106j15266J903J08212m305r9387p106J10153J619j13817
1123e8374R808J01691k670j02157l267J13286q350j08128J2550R7858j614j06075
1135e5442M076J11934j6245j00075J0924R8085l435j09234J3458J06088j9161
$$ plain form
1056 -75695 36152 75040 -41138 -67806 35934 70352 -34810 -75239 42317 69849 -42254
1067 -42254 -65691 36554 71486 -40228 -71874 45977 64723 -41197 -65813 38553 71293
1078 71293 -45725 -66486 46492 61519 -40350 -66489 42803 68037 -48965 -61017 45053
1089 45053 60480 -41501 -66041 47718 63038 -49818 -57063 43758 61122 -45031 -63963
1100 -63963 52277 57149 -49478 -55358 44964 61273 -50806 -59384 54107 52780 -48772
1111 -48772 -55648 48514 59620 -55646 -53743 54469 50164 -49223 -56329 53824 55443 -58374
1123 -58374 -48566 53125 50455 -51702 -54969 58317 49967 -58161 -45611 52247 50633 -55442
1135 -55442 -51366 60568 44323 -55752 -44828 53257 49822 -59412 -45954 60134 40973
1146D0973r5181Q755J01748r260j09167K1793R8736j9043r4235R590J06151j8776
1158D2084j04914K6658R3643j7485r8074J5666J06861k8206r8249K7673R1962
1169E7619j8003j02505K4939J03938l4541r1733K5994R4240k2282j03671L3932
1180c2073R6695l5464q8621K5167R7524k9644j00902M0048Q9559l3428q9011K7310
1192c2840R9217l8290r3956M1729Q4507l1610r1806L3833R7013m4978q6342M0504
1204b3019Q3615l2972r3970M2439R1172m8406q0663L8921Q6436l9118r3417N1170
1216a7812Q3562m8731p8821L9957Q9068m8174q8209N5806P6652m6864q0669M5354
1228a8881Q8648n6715q0185N6066P3796m6853q2805N2337Q4116o1018p2455N3011
$$ plain form
1146 40973 -54208 -45453 56295 47035 -62132 -40339 58397 39354 -54881 -45291 60860 42084
1158 42084 -62830 -36172 57471 39986 -58088 -42422 64439 36233 -62016 -34343 57619
1169 57619 39616 -62889 -37950 65988 31447 -60286 -34292 59948 37666 -66005 -32073
1180 -32073 64622 29158 -59463 -34296 63228 33584 -67318 -27270 62289 28861 -60150 -32840
1192 -32840 66377 28087 -65869 -24140 60367 28757 -63049 -29216 67797 22819 -63523 -23019
1204 -23019 60596 27624 -66346 -23907 67265 18859 -61804 -22883 63553 24435 -68982 -17812
1216 -17812 65750 17019 -61802 -21845 67223 19049 -69160 -13354 63298 16434 -64235 -18881
1228 -18881 69767 13052 -67133 -11067 62729 15876 -66929 -14592 69524 8506 -63949 -10938
1240a0938P4397m9057q3145N9462P6297o0592o8522N1031P6640n4975p9497O4310
1252d589O8278n7770o8093N2713P6788o1866p2731O5667O3322n5887o9850N7913
1264f105P4508o8463o4416O4581O1623n7333p1035O5676O8452p1312n8347O2511
1276C40O2926o1785o9472P2540O0128p0132n5335O1787O4039o8397o3492P5253
1288H400N2812o6820n5703O4366O3113p4559n5002P3792M8898o4688n7397O9783
1300F995N8242p7477m7510O9890M8823o5895n6685P5371N0714p7021m3036O7912
1312A0323N0075p0843n2565P9491M2487p4188m1875O8772M9887p7275m5611Q0751
1324A9429L6913p1808m2346P2796M6513q1977l7192P8322L3924p1202m2445P8595
$$ plain form
1240 -10938 63459 14402 -68743 -9281 67016 6424 -62098 -11067 65573 10598 -68899 -4589
1252 -4589 63689 5919 -62174 -9461 67327 5461 -67270 -1603 61719 5832 -64018 -6105
1264 -6105 68403 -60 -64476 105 61728 4395 -66640 -964 67488 -3824 -62171 340
1276 340 63266 1481 -67991 4549 64677 -5455 -60790 997 65036 -3361 -66853 8400
1288 8400 61212 -5608 -61311 3055 66168 -8391 -63393 10399 59297 -5391 -62788 6995
1300 6995 65237 -12240 -59750 10140 58963 -6932 -63617 11754 62468 -14553 -57589 10323
1312 10323 60398 -10445 -63010 16481 58968 -15220 -57095 11677 61564 -15711 -61322 19429
1324 19429 56342 -15466 -57812 14984 61497 -20480 -57672 20650 54574 -16628 -59073 19522
1336A9522L9880q3138l0594P4878L4542p3759m0551Q3100L2264q0905k7440P2408
1348B0207L6005p8409l5078Q4328K5382p6388k8028P3369L4986q2778k7391Q1789
1360B7994K1691p3347k8969P7405L0231q4898j9983P7784K0773p3360k8466Q2468
1372B9323K2594q3893j5110P4942K1430p7308k4109Q5458J4507q0305j3383P4642
1384B8788K0960q2216j7073Q5134Q704p6234j4034P6853J8370q5230r272Q0991
1396C5741O882p4359j4613Q0895J1995q4500l683P6419P454p5172j2921Q3218
1408C7356N567q1142r84P3122Q714p8433q121Q4133j219p6497j002P3615P540
1421D2649q2345n46Q1379n186p3127j381P6667K536q3172O314P7120o227p2495
$$ plain form
1336 19522 59402 -23736 -54330 20548 55090 -18669 -59220 23880 56144 -24761 -52201 20207
1348 20207 56212 -22197 -57275 27053 52435 -23953 -51981 21388 56374 -26404 -53795 27994
1360 27994 49685 -23662 -52631 24774 55005 -29893 -49876 27908 48681 -24679 -53145 29323
1372 29323 51917 -31976 -47086 27856 49286 -28022 -52131 33327 47834 -32471 -45854 28788
1384 28788 49748 -32468 -49541 35593 44297 -31937 -45971 30882 49252 -35978 -45250 35741
1396 35741 42623 -31736 -46349 34546 46541 -37959 -41642 34777 42231 -32941 -45862 37356
1408 37356 42923 -38219 -39203 33919 42633 -35800 -43921 40212 38993 -37504 -38506 35109 42649
1421 42649 -39696 -40242 41137 35951 -37176 -38557 38110 40646 -42526 -36212 40908 34681 -37814
1434c7814q42Q0194m266q1234J1280P2764n396p4640K755Q1621j1171p6899J2665
1447c0983P0711m934p7459Q513P9865j6165p1734J1513P1630o845p9258J4774
1459c0372P5276j7253o8711J0220P4228j2276p8074K0383P0240j6656o9002J1599
1471c0398P6787j8873p4684K2904O7438j6232p1505J6327P6548k4831o9649K3080
1483b3088O6621j7179p3732K2896P3349k8509o5455K2444O8172k1289p3845K9242
1495b0373O8154k8908o3642K2483P0315k6491p1394L2809O3528k8153o4064K4785
1507b0951P0786l2796o5884L3717O0222k6745o5925K9674O8444l6766o0766L2619
1519a4371O0331k8514o7506L5874O3909l8365n7314L1447O2528l3360o5815M0666
$$ plain form
1434 -37814 -38656 41538 37272 -43962 -32682 40082 34686 -39954 -37199 44422 33251 -43648 -30983
1447 -30983 39728 34794 -42665 -34152 45713 29548 -42186 -30673 40957 34112 -45146 -30372
1459 -30372 44904 27651 -41060 -30840 43388 31112 -46962 -26579 43661 27005 -41997 -30398
1471 -30398 46389 27516 -47168 -24264 43174 26942 -44563 -28236 48312 23481 -46168 -23088
1483 -23088 43533 26354 -47378 -24482 48867 20358 -45097 -22653 45519 24230 -49615 -20373
1495 -20373 47781 18873 -44769 -22286 48029 21538 -49856 -17047 46481 18328 -45736 -20951
1507 -20951 49835 17039 -48845 -15128 45094 18349 -47576 -17902 50542 13776 -46990 -14371
1519 -14371 45960 17446 -50060 -14186 49723 11358 -45956 -14509 48019 14659 -51156 -10490
1531a0490N8553l7584n6959L3207O3265l9237o1346M3025N4522l6974n7994L6985
1543a1027O2598m4952n5654M2754N2690l7145n9124M2339N8561m7109n1316M1571
1555e814N3078l9823n8327M7141N2864m6592m8484M0030N4737m4270n4945M9655
1567g50M7733m4939m8444M2010N4303m8988m9854N0386M4122m4002m9349M6320
1579a452N1574n3042m3995M8859M3742m5052m9904N1821M6378n4189m0001M7548
1591B287M4705m8975m7464N5884M0504n3037l8727M8151M4876n3578m2905N7294
1603I015L5703n1027l8772N0143M3333n7240l7315N5633L4101m9870m0321N4667
1615H050L9500n9179l2255N3323L4111n1508l8947N8210L3616n7670k9030N1418
$$ plain form
1531 -10490 48063 10479 -46480 -13273 49992 10755 -50591 -7566 46956 9982 -48012 -11027
1543 -11027 51571 6619 -49035 -6281 46409 9264 -49860 -7521 51040 3931 -47385 -5814
1555 -5814 47264 7441 -50886 -3745 49119 2527 -45957 -5927 48810 4540 -50405 -750
1567 -750 46983 2044 -46400 -4390 49913 925 -48929 1457 45579 1577 -47772 -1452
1579 -1452 50122 -2920 -46915 1944 45686 634 -49270 2551 48929 -5260 -45261 2287
1591 2287 46992 -1983 -49447 6437 46941 -6096 -44823 3328 48204 -5374 -48279 9015
1603 9015 44718 -6309 -45081 5062 48395 -8845 -46160 9473 43574 -6296 -46617 8050
1615 8050 47550 -11629 -43884 9439 43550 -7958 -46905 11305 44921 -12749 -41779 9639
1627I639L4774n5026l5490O0567K8088n5739k8818N3058L4032n9353k9946O0583
1639A6369K4148n3806k9199N6208L1090o2440k3851N8406K2969n4177k8972O0344
1651A7089K5666o2105j9784N5773K3697n6518k6382O2421K0051n9539j8145N4769
1663A6993K3886n9666k2308O2889J5609n6588j8757N6021K2159o2110j6552O0664
1675B2240J3788n5328j8901N8875J8359o3084j1795N8039J3255n5898j7628O1862
1687B3784J2871o1475q940N5798J3570n8442j4344O3505P660n9056p774N5617
1699B2774J3061o1555r229O2490M018n5963q758N7988J0238o3471l456N9229L006
1712C0372n5394q345O0861N462o2663L53N6124L641n6388o788O2077O45n9623
$$ plain form
1627 9639 44413 -10613 -46103 14464 42552 -13187 -42005 11053 45085 -14268 -44214 16369
1639 16369 40517 -13289 -42488 13720 44810 -17630 -41481 16925 39894 -14283 -43255 17089
1651 17089 42755 -19350 -39134 16639 40336 -16182 -42564 19857 39908 -19631 -37776 16993
1663 16993 40879 -18787 -41095 21794 37403 -19185 -37942 18079 40238 -21872 -38424 22240
1675 22240 36028 -19300 -38201 20674 39033 -24051 -35846 22193 35448 -20450 -38078 23784
1687 23784 36655 -24820 -33760 22038 35608 -22834 -37178 26327 33987 -25069 -32843 22774
1699 22774 35835 -25720 -34949 27541 31559 -24404 -33162 24826 35064 -28407 -31863 27366 30372
1712 30372 -25022 -33367 27494 32956 -29707 -29354 26770 30411 -25977 -32765 29312 29957 -29666
1725b9666J619N4636M141n9162k412O2127m170n5825R40N5230K761o1365K967
1738b8179N9866o034n4164P66N7653j650o1214P972N5915o268n4109K176N9611
1751C2341o608n9213J0646N3237n812n5660M971O0562j1869n5705J1180N2766
1763C0836o364n7655R394N8624j4520n2236J0109N3585q213n8536J4427N4679
1775C4130j4948n0805R884N5415j2139n7651J8158N1312j4551n1388J1722N6294
1787C5433j7069n3987J9442M9015j4109n3161J5588N5649k1299n0308J9274M8732
1799C3200j5353n4058K0277N2634k3286m7469J8539N0811j9108n3797K4483M9279
1811C6152k3598m6693J9087N1733k3094n1262K6828M5614k2293m7312K1468N1277
$$ plain form
1725 -29666 -28047 26589 30730 -28432 -30844 31283 27113 -28712 -27772 27458 30219 -31146 -28179
1738 -28179 31687 25653 -28511 -27745 29908 28258 -32956 -24984 30931 24663 -29446 -27270 32341
1751 32341 25733 -33480 -22834 30403 24591 -31069 -26098 34464 22595 -33110 -21930 30836
1763 30836 24472 -33183 -23789 34835 20315 -31921 -21812 31773 23560 -34976 -20549 34130
1775 34130 19182 -31623 -21739 33676 21537 -36114 -17956 33356 18805 -32583 -20861 35433
1787 35433 18364 -35623 -16181 32834 18725 -34436 -18848 36801 15502 -34806 -15532 33200
1799 33200 17847 -36211 -15934 36700 13414 -34055 -15516 35295 16187 -37610 -13127 36152
1811 36152 12554 -34139 -15052 36681 13587 -37675 -10847 34767 12474 -34838 -13370 37907
1823C7907k7133m7650K7217M4097k2412m8867K5503M9261k9698m3334K5820M4490
1835C5201k4248m9169K9962M5648l0782m1439K5759M5693k7974m6988L3052M1414
1847C6129l0228m1111K7227M6064l2448m3350L4621L8130k9425m1901L0284M4642
1859C8634l6169l9033L3818L7807l0351m2385L4627M1122l7515l5697L2594L8333
1871C5785l2635m1571L8126L6794l6811l4207L2406L9147l6027l8756L9777L2677
1883C4705l4899l4687L4033L8328l9524l4391L9307L1095l4554l5447L7455L6025
1895C7446m1913k9783L7635L0814l6103l4980M1365L1535m1905k7375L6857L1251
1907C4844l8503l3124M3721K7103m0712k6484L7622L1015m2076k8443M3808K3944
$$ plain form
1823 37907 10774 -36876 -9659 34438 12026 -36841 -11338 37923 8225 -35109 -9289 35201
1835 35201 10953 -38216 -8254 37394 6612 -34827 -9068 36625 8651 -38337 -5285 36129
1847 36129 5901 -35210 -7983 38081 5633 -37717 -3096 35034 5609 -36292 -6008 38634
1859 38634 2465 -36568 -2750 35057 4706 -37679 -3052 38070 555 -35142 -2548 35785
1871 35785 3150 -38421 -295 36499 -312 -34519 -2113 37034 1007 -37749 2028 34705
1883 34705 -194 -34881 -848 37480 -2044 -36435 2872 33967 -587 -36034 1421 37446
1895 37446 -4467 -34250 3385 34199 -1904 -36884 4481 36016 -5889 -33264 3593 34844
1907 34844 -3659 -36783 6938 34041 -6671 -33155 4467 35482 -6594 -35037 8771 32715
1919C2715l9167k7073L9390K9826m4853k4328M2339K3243l8968k7712M2890K6681
1931C4983m5855k0914M0740K3069m0087k6529M5675K1578m3900j9336L9611K3731
1943C2766m3021k3322M6632J7691m2194j9139M0644K2968m5937j8603M5321J5491
1955B9297m0821j9664M3398K0444m7933j4391M3666J4902m1415j8961M6403J5927
1967C0852m7055j1821M1966J5592m3639j6871M8146J1311m5073j1028M1728J5760
1979B9868m6264j3309M7973Q329m2733j1646M3373J4328m8390q936M5803P132
1991B5528m1589j1866M5628J0406m7922n575M3268P993m2913j1081M8015N957
2003B5849m5844l753M1697P994m4860p622M8253J978m3590l369M2005O834m7043
$$ plain form
1919 32715 -6452 -33525 5865 35691 -9162 -33490 8849 32092 -6876 -34588 8302 34983
1931 34983 -10872 -31786 8954 32023 -8064 -34593 11082 32660 -11240 -30576 9035 32766
1943 32766 -10255 -33577 13055 30746 -11448 -30587 10057 33025 -12912 -31515 13806 29297
1955 29297 -11524 -31188 12210 32654 -15279 -29670 13996 28898 -12517 -31478 14925 30852
1967 30852 -16203 -28024 13942 29534 -14105 -30976 17170 28481 -16592 -27620 14108 29868
1979 29868 -16396 -29705 18268 26597 -16136 -27782 15591 29919 -18471 -27407 18396 25528
1991 25528 -16061 -27927 17701 28107 -19815 -25390 17878 25871 -17042 -28123 19892 25849
2003 25849 -19995 -23748 17949 25943 -18917 -26539 21714 23692 -19898 -23267 18738 25572 -21471
2016b1471l212M6889j40m1746m041M4214M689m8401P79M4088j95m1682l599M6184
2030B2356P64m7031L437M1900J05m3115j608M7322l374m4244L694M0984O09m4907
2044b3108J510M6652o312m1452L257M1680q29m6187N382M4258p386m0449L589
2057a9395M3614m475m5857R123M1134o950m0421M183M4788q416m3623J1097L9116
2070B3918o884m1810O925M5146j2239m0394J0412L8877o984m3678J1260M2676
2082B7225j3801l8196R786M0283r165m3744J4285L9885j3782l7587J0076M1470
2094B6735j2584m2209J6494L7414j3104l8491J1578M2431j6659l9019J7019L6042
2106B5647j2919l9615J4410M1434j9688l5817J6753L5645j3919m0507J8828L8184
$$ plain form
2016 -21471 -24683 22206 22066 -19680 -23721 20493 25182 -23219 -22440 21648 21453 -20229 -23828 22356
2030 22356 23120 -23911 -20474 21426 21531 -21584 -23192 24130 20756 -23488 -19794 21190 21799 -23108
2044 -23108 -21598 25054 18742 -22710 -19453 22227 21398 -24789 -19407 24851 17465 -22984 -19395
2057 -19395 24219 19744 -26113 -16990 24144 17194 -23227 -19044 25744 17328 -26295 -15198 23918
2070 23918 17034 -24776 -17851 27295 15056 -25338 -14926 23951 16967 -26711 -15451 27225
2082 27225 13424 -24772 -14986 25297 16132 -27612 -13327 26558 12776 -24811 -14735 26735
2094 26735 14151 -28058 -11564 25850 12746 -25745 -14167 28264 11605 -27414 -10395 25647
2106 25647 12728 -26887 -12477 28957 9269 -26548 -9795 25850 11931 -28576 -9748 28436
2118B8436k0465l3925J5890L7278j7032l9329K1705L5069k0185l3847J6831L8403
2130B8829k1016l6840K3262L2150j8932l4979J9266L7808k3910l3532K2783L1309
2142B6198j8870l5964K2346L5846k5848l0302K1408L2331k0812l5754K5414L2312
2154B8305k5257k9396K1323L3190k3849l3789K7695K8970k4232k9919K2881L3649
2166B9571k7888l0363K8540K6510k3809l0452K5611L1804k9771k7270K7253K6622
2178B6358k4551l0705K8887K8801l0577k4507K6089K7416k6734k9903L1661K4832
2190B7067k9141k3752K5871K7915k9781k6465L2015K2128k8035k4366K7951K6915
2202B8322l1950k3402L1172K1137k7360k5225L0486K4489l3164k0220L0107K1087
$$ plain form
2118 28436 7971 -25954 -10064 27214 10182 -29147 -7442 27627 7442 -26405 -9574 28829
2130 28829 7813 -29027 -5765 26385 7453 -27526 -8260 29548 5638 -27894 -5111 26198
2142 26198 7328 -28636 -6290 29556 3708 -26594 -5186 27145 6333 -29421 -4007 28305
2154 28305 3048 -26348 -5025 28165 4316 -29473 -1778 27192 2960 -26959 -4078 29571
2166 29571 1683 -28680 -140 26370 2561 -27891 -2280 29524 -247 -27517 -264 26358
2178 26358 1807 -28898 -11 28790 -1787 -26294 -205 27211 477 -29426 2235 27067
2190 27067 -2074 -25826 45 27960 -1821 -28286 3729 25857 -2178 -26544 1407 28322
2202 28322 -3628 -27030 4142 25279 -2081 -27306 3180 27669 -5495 -25715 4392 25479
2214B5479k8828k4657L3781K0904l3128j8374K8961K2502l1595k2424L4738J7837
2226B5196l1639j8412L0003K1791l4030j9340L5085J5433l0341j8857L1535K0061
2238B6485l5463j5702L3005J5409l0603j9364L4795J7240l6090j3021L1549J5837
2250B4077l1975j7862L6146J3703l4436j2322L1203J6263l4820j4768L6643J0715
2262B2567l2745j2588L2305J5080l6441j1628L5788R440l1904j2985L4567J2241
2274B3697l7051q248L3740R273l2707j2174L6827Q965l6574o113L2680R580l4285
2287a2390j0330L7417N686l4273o371L2581R604l6337o953L6930L852l2813o828
2300b0225L3987P936l7880l245L4875L269l2402p172L6275M857l7084j391L3118
$$ plain form
2214 25479 -3349 -28006 5775 26679 -6449 -24823 4138 26640 -4955 -27379 7359 25196
2226 25196 -6443 -24855 5148 26939 -7091 -26431 8654 24087 -6254 -25111 6424 26485
2238 26485 -8978 -24680 8325 23734 -6869 -26233 8562 25802 -10288 -23309 8240 24077
2250 24077 -7898 -25760 10386 24089 -10347 -22669 8534 24797 -10023 -24791 11852 22567
2262 22567 -10178 -22766 9539 24619 -11822 -23450 12338 21778 -10126 -23111 11456 23697
2274 23697 -13354 -21602 12138 21411 -11296 -23470 13357 22322 -14252 -20365 12315 21895 -12390
2287 -12390 -22720 14697 20383 -13890 -20261 12320 21924 -14413 -21366 15564 19416 -13397 -20225
2300 -20225 13762 21698 -16182 -19427 15448 18717 -13685 -20857 15418 20275 -16809 -18200 14918
2313A4918L852l3286n808L7399J609l5338n53L1990M298l5595k675L7331j418
2326A6724l3113p43L2894L159l6940P43L5532k590l1797j276L4716N15l6999L575
2340a5600L3430k311l2172o92L6141k720l5520N001L1626j404l3317Q87L6632
2353A9981n314l3523N058L1398j664l5150M036L5645p533l1186M187L2466l300
2366A5101l5856P543L3153p867l0426M675L3661o212l5032R649L1241p712l0803
2379a8885N332L4800r532l2757J0708K9500o782l2698P992L4097j1675l0328R973
2392a0255K9961p860l3433J1019L2332j2922k8522R125L1407r806l3434J3800
2404h588K9740j2530k8491R478L2001j2358l1808J5211K7636j1801k9132J1225
$$ plain form
2313 14918 18770 -14516 -20324 17075 18684 -16654 -17207 14783 19081 -16514 -19189 18142 16724
2326 16724 -16389 -17132 15762 18921 -18019 -17276 18256 15666 -16131 -17407 17309 17824 -19175 -15600
2340 -15600 17830 15519 -16653 -17345 18796 16076 -19444 -14443 17183 15779 -17538 -16651 19981
2353 19981 14667 -18856 -13798 17600 15936 -19214 -15178 20467 12934 -18252 -14065 18401 15101
2366 15101 -20755 -13212 19941 12074 -18352 -13677 19984 13772 -21260 -11611 19630 11918 -18885
2379 -18885 -13553 21247 11715 -21042 -10334 19166 12384 -20314 -12322 21775 10100 -20228 -10255
2392 -10255 19706 11846 -21587 -10568 21764 8842 -19680 -10555 20852 11046 -22388 -8588
2404 -8588 21152 8622 -19869 -10391 21610 9252 -22556 -7345 20291 8490 -20642 -9417
2416i417L2115j5427k9139J5619K6411j1974l0290J4387L0554j7335k6454J4415
2428f535K7458j3018l0697J6992K8126j7541k5491J3959K8508j5724k9364J9295
2440d032K5347j6459k5925J5004K9215j8918k7152K0001K3888j6331k6509J7094
2452d777K7968k0189k4840J9248K3554j6698k7026J9780K5696k1162k2316J8044
2464b718K4513j8555k6432K1846K3507k1295k1738J8496K4668k0794k4523K3251
2476B26K0660k0031k1976J9569K4379k3209k1707K3170J9350j9908k2716K2359
2488A66K2870k4915j8890K1729J9870k0771k2636K4083K0214k4413j7625K1230
2500I12K0348k2430k1510K5944J7693k3877j7361K1588K0821k5163j8769K5842
$$ plain form
2416 -9417 22698 7271 -21868 -6249 20162 8188 -22102 -7715 22839 5504 -20950 -6535
2428 -6535 20923 7905 -22792 -5800 22326 4785 -20706 -6747 21761 6037 -23327 -4032
2440 -4032 21315 4856 -21069 -6065 23150 4232 -22920 -2919 20969 4638 -21871 -4777
2452 -4777 23191 3002 -21838 -2590 20964 4266 -22760 -2980 22716 1554 -20762 -2718
2464 -2718 21795 3240 -23192 -1346 22161 866 -20872 -2376 22292 1498 -23025 226
2476 226 20886 855 -21121 -1552 22827 -382 -22089 1081 20431 523 -22193 166
2488 166 23036 -1879 -20769 960 20830 59 -22577 1506 21720 -2693 -20318 912
2500 912 21260 -1170 -22680 3264 20957 -2920 -20281 1307 22128 -3035 -21804 4038
2512D038J5987k2850j7855K3290J9521k6518j6239K5013J5223k2839j8011K5412
2524D172J7393k7230j3754K3918J5541k3821j7688K7472J4457k6422j3021K3373
2536D390J5821k5592j5599K8144J2261k5520j3290K4721J5438k8127j2404K7418
2548G661J0839k4483j3739K6450J3577k8684j0058K6290J0462k4901j3279K8097
2560H232J0912k8187q720K5321J1000k6262j1779K8862Q658k7150q038K4910J1187
2573A8946k7975r757K9096O445k5815q536K5988J0372k9338o545K7423O178k5492
2586i010q535K7645P920k9483m493K6150O016k6071p813K9299M943k8342l589
2599a5363K5515O543k7605n867K9109K912k6621m133K6074O115k8956l585K8564
$$ plain form
2512 4038 20025 -2825 -20680 2610 22131 -4387 -20626 4387 19610 -3229 -21240 4172
2524 4172 21565 -5665 -19419 4499 20040 -3781 -21469 6003 20460 -5962 -18983 4390
2536 4390 20211 -5381 -20980 7164 19425 -6095 -19385 5336 20774 -7353 -19757 7661
2548 7661 18500 -5983 -19722 6728 20305 -8379 -18437 7853 18315 -6586 -19865 8232
2560 8232 19144 -9043 -17763 7558 18558 -7704 -19483 9379 18037 -9113 -17151 7759 18946
2573 18946 -9029 -18786 10310 16755 -9060 -17596 8392 18764 -10574 -17119 10304 16482 -9010
2586 -9010 -17545 10100 18020 -11463 -15956 10194 16210 -9861 -17674 11625 16568 -11774 -15363
2599 -15363 10152 16695 -10910 -16777 12332 15244 -11377 -15510 10564 16679 -12277 -15862 12702
2612A2702J546k5211m365K6946M473k9484j096K6629J990k5525l926K8317K032
2625A5028k8810M37K6004J286k6414k415K8957n40k7252R71K5039K006k8018l16
2639a4037K8855k375k5683M20K5985J033k9321K435K7411l426k4639K90K7307
2652A4255j288k8428M251K5593k968k5235R14K8096l342k7095M558K4681k270
2665A1722k6185K408K8103n718k5606N071K4393k653k7015M709K6855o869k3906
2678a4691M214K5410m159k7384P355K5262p126k3757M634K6424o388k6610Q706
2691h110K3453o568k3923N472K6631r009k4607R222K2532o087k5250P739K5615
2704A7110j0324k2794Q677K3208p186k6030J0211K4364j0813k2287Q722K3567
$$ plain form
2612 12702 14248 -10963 -15328 11618 16091 -13393 -14489 12140 14130 -11395 -15321 12996 15028
2625 15028 -13782 -13345 12659 13945 -12469 -14884 14073 13533 -13719 -12748 12291 14297 -13721 -14037
2639 -14037 14818 12443 -13240 -12820 13165 14198 -15123 -12688 14723 11297 -13342 -13052 14255
2652 14255 12967 -15461 -11210 14383 11415 -13820 -12906 15190 11848 -15247 -10689 13992 11722
2665 11722 -14463 -12055 16048 10330 -15276 -10205 14188 11535 -15480 -10771 16084 9215 -14691
2678 -14691 -10477 14933 10774 -16610 -9255 16007 8881 -14876 -10242 16182 9794 -16816 -8110
2691 -8110 15343 8775 -15148 -9676 16955 7946 -16661 -7439 15093 9006 -16244 -8505 17110
2704 17110 6786 -16008 -7331 15877 8691 -17339 -7128 17236 6423 -15864 -7142 16425
2716A6425r027k5002J1941K2214j0588k1983Q806K4759j1421k3664J2838K0703
2728A6001j0200k2270J0088K4138j2956k1661J2455K0594j0600k2904J2461K2770
2740A7916j4490j9741J1672K1020j1269k2986J4540K0533j4236j9249J2067K1624
2752A7401j3472k1861J5445J9030j3569j9535J2685K1937j5555j9653J5423J7816
2764A6092j3169k0234J4917K0312j6643j8038J5043J8126j3915k0225J6446J8947
2776A7659j7300j6800J5231J8162j5544j9456J8056J6755j6506j6252J4846J8549
2788A7400j7199j7607J8195J5078j5986j6536J6197J8303j8907j5710J8049J4600
2800A5877j6037j6937J7952J6584j9468j3929J7499J4642j7014j6605J9789J4485
$$ plain form
2716 16425 7398 -17604 -5663 16551 5963 -16020 -7214 17545 6124 -17540 -4702 16001
2728 16001 5801 -16469 -6381 17757 4801 -16860 -4405 16189 5589 -17315 -4854 17916
2740 17916 3426 -16315 -4643 16377 5108 -17878 -3338 17195 2959 -16290 -4223 17401
2752 17401 3929 -17932 -2487 16543 2974 -16561 -3876 18061 2506 -17147 -1724 16092
2764 16092 2923 -17311 -2394 17918 1275 -16763 -1720 16406 2491 -17734 -1288 17659
2776 17659 359 -16441 -1210 16952 1408 -18048 8 16763 257 -15995 -1149 17400
2788 17400 201 -17406 789 15867 -119 -16655 -458 17845 -1062 -16772 1277 15877
2800 15877 -160 -17097 855 17439 -2029 -15958 1541 16183 -831 -17436 2353 16838
2812A6838j9553j2886J6996J5223j8524j5515K0697J2497j8294j3182J7562J5215
2824A7074k0176j3437K0381J1335j8164j2640J8503J4000k1196j1262K0034J0707
2836A5159j8397j2879K0041J2356k1184r907J8697J1602j9246j2489K1504R991
2848A5248k0617r188J8752J1660k0793j0823K1783Q295j9349r705J9579J0847
2860A5689k1914q648K1092P446j8960r644K0882R443k2529o566J9785P757j9331
2873e498r763K2323P040k1612n827J9662P938k0873p921K2420N384k0346o008
2886a3081J9759P417k2032n462K1927M136j9856o051K0730O572k2859m042K1136
2899H294M233j9755o250K1998M767k2570k500K0149M060k0352n291K2830K413
$$ plain form
2812 16838 -2715 -15601 1395 16618 -1906 -17421 3276 15773 -2521 -15703 1859 17074
2824 17074 -3102 -16539 3842 15177 -2987 -15627 2876 16876 -4320 -15582 4452 15159
2836 15159 -3238 -16117 3924 16280 -4904 -14811 3886 15488 -3758 -16247 5257 15248
2848 15248 -5369 -14557 4195 15855 -4938 -15761 6022 14317 -5032 -14737 4842 15689
2860 15689 -6225 -14873 6219 13665 -5295 -14939 5943 15386 -7143 -13709 6076 13833 -5498
2873 -5498 -15261 7062 14102 -7510 -13337 6325 14263 -6610 -14531 7889 13273 -7073 -13081
2886 -13081 6678 14095 -7937 -13399 8528 12664 -7192 -13243 7487 14059 -8800 -12842 8294
2899 8294 12527 -7228 -13478 8520 13287 -9283 -11783 8366 12426 -7926 -13217 9613 12026
2912A2026k1474j957J9745M004k1334l671K2886P90k0368j841K0015L824k2757
2925a0112j462K1668O04j9877k352K1170K330k3044P21K0419K40j9647k347K2483
2939A0794jk1711J316J9403P44k0651r32K2503k009k0299J468J9457M56k1626
2953a1088R41K1901k669j9715J056K0135m28k1812K823K0508l177j9179J267K0830
2967A1393k017k1680M315J9282k991j9271J828K1593m517k0258M820J8730k958
2980H269k0179L301K1500n473j9285M663J8513k946k1020N264K0124n998j8406
2993a1673M242J9334m457k0541O878J8545o225j7801M306K0218o053j9716P417
3006e526J7514n913j8301N531J9951p532j8520P652J7135n817j9065P031J9428
$$ plain form
2912 12026 -9448 -11405 8340 12344 -8990 -12661 10225 11015 -9353 -11194 8821 12645 -10112
2925 -10112 -11574 10094 10698 -9179 -11531 9639 11969 -11075 -10354 10065 10305 -9342 -11689 10794
2939 10794 10793 -10918 -9602 9801 10545 -10106 -11038 11465 9456 -10843 -9375 10082 10538 -11088
2953 -11088 -10147 11754 9085 -10630 -9574 10561 10133 -11679 -8856 11652 8475 -10704 -9437 11393
2967 11393 9376 -12304 -7989 11293 8302 -10969 -9141 12452 7935 -12323 -7503 11227 8269
2980 8269 -11910 -8609 12891 7418 -11867 -7204 11309 8363 -12657 -7393 12731 6733 -11673
2993 -11673 -7431 11903 7446 -13095 -6217 12328 6103 -11698 -7392 12826 6773 -12943 -5526
3006 -5526 11988 6075 -12226 -6695 13256 5724 -12796 -5144 11991 6174 -12891 -5860 13568
3019A3568r154j6810P364J7438o660j9237Q838J7927r322j6325P281J8333q400
3032D841j8797J0145J6522q908j6326P716J8294r811j7224J0596J5558q723j7242
3045a3359R428J7897j1326j5682J0452J4984q816j7061J0585J6654j2064j4010
3057a2318R707J5332r725j6937J2303J4729j1577j3893R702J6201j1356j5927
3069a3759J3018J3303j0910j4315J0502J6138j3067j4056J2682J2776j0751j4860
3081a3299J2267J4851j3997j2501J2040J3150j1469j4703J3759J3034j3777j1540
3093a2185J2000J3194j2727j4030J4815J1586j3366j1488J1883J3735j4246j2340
3105a3169J4827J0269j2464j2040J3257J2461j4895j0688J4306J0166j2878j1977
$$ plain form
3019 13568 4414 -12396 -5032 12406 5746 -13491 -4653 13274 3952 -12373 -5092 13241 4841
3032 4841 -13956 -3811 12711 3803 -12523 -4807 13487 3676 -13548 -2952 12606 3883 -13359
3045 -13359 -3931 13966 2640 -13042 -2590 12394 3578 -13483 -2898 13756 1692 -12318
3057 -12318 -2611 12721 2996 -13941 -1638 13091 1514 -12379 -2677 13524 2168 -13759
3069 -13759 -741 12562 1652 -12663 -2161 13977 910 -13146 -464 12312 1561 -13299
3081 -13299 -1032 13819 -178 -12679 -639 12511 1042 -13661 98 13132 -645 -12185
3093 -12185 -185 13009 282 -13748 1067 12653 -713 -12201 -318 13417 -829 -13169
3105 -13169 1658 11927 -537 -12577 680 13141 -1754 -12442 1864 12030 -848 -12825
3117a2825J4431J1597j5875r216J3413J0898j3737j1956J5862R819j5074r021
3129a1684J3547J0644j4590j0929J6438Q003j4085r058J3750J0739j6083q724
3141a2032J5438P852j3981r411J4997R749j6770p034J4667P953j4186r637J6194
3154C799Q149j6355o354J4431P773j4964q685J7213O198j5925n916J4546P741
3167A1651j6318o827J6715N010j4733o476J5633P016j7232n080J6375M426j4700
3180d540o428J6272N886j7366l815J5290M727j5148n931J7430L824j6776l036
3193i611J4946N002j5929m871J7260K573j5592l171J4953N091j7336l249J6948
3206G014J837j4901l447J5880L705j7156j868J5708K041j5042l732J7133K201
$$ plain form
3117 -12825 1606 13203 -2672 -11888 1525 12423 -1314 -13270 2592 12411 -2663 -11684
3129 -11684 1863 12507 -2083 -13012 3426 11429 -2656 -11714 2036 12775 -3308 -12032
3141 -12032 3406 11258 -2723 -12134 2863 12612 -4158 -11192 3475 11428 -2758 -12395 3799
3154 3799 11948 -4407 -10761 3670 11443 -3521 -12206 5007 11205 -4720 -10636 3910 11651
3167 11651 -4667 -11494 5221 10231 -4502 -10978 4655 11671 -5561 -10641 5734 10160 -4540
3180 -4540 -10968 5304 11190 -6176 -9991 5299 10026 -5122 -11053 6377 10201 -6575 -9611
3193 -9611 5335 10337 -5592 -10463 6797 9370 -6222 -9393 5560 10651 -6685 -9934 7014
3206 7014 8851 -6050 -9497 6383 10088 -7068 -8936 6772 8813 -6229 -9961 7172 9373
3219I373j7072n09J4786K467j5901k593J7320N10j5964m02J4795K192j6762j100
3233h860J7260n84j5329p73J5356J997j7328J28J6477j026j4547j048J6096K97
3247H116j7107J930J5040n83j5169n42J6921j115j6093K037J4249k49j5646L89
3261g822J6877k454j5194J962J4657n72j6441J856J6455l286j4303J498J5149
3274H382j275j6467L478J5009l385j3705J590J5229k696j5822M437J3924k847
3287E852j4729K442J6312m534j4593M367J3368k531j5409L775J5820n348j3733
3300h941L934J4046l388j5630N041J4700n666j2978L826J4324m101j5199O067
3313c965J3666n507j3186M087J4883n861j4120O822J2118m674j3573M718J5004
$$ plain form
3219 9373 -7699 -8208 6578 9045 -6856 -9449 7871 8381 -7583 -7985 6810 9002 -7760 -8860
3233 -8860 8400 7816 -7513 -8286 7070 9067 -8261 -8133 8344 7318 -7229 -8277 7819 8116
3247 8116 -8991 -7061 7979 7396 -7773 -8315 8606 7491 -8602 -6565 7684 7435 -8211 -7822
3261 -7822 9055 6601 -8593 -6631 8026 7454 -8987 -7131 9324 6038 -8265 -6767 8382
3274 8382 7107 -9360 -5882 9127 5742 -7963 -6373 8856 6160 -9662 -5225 8699 5852
3287 5852 -8877 -6435 9877 5343 -9250 -4883 8485 5954 -9455 -5680 10140 4792 -8941
3300 -8941 -5007 9039 5651 -9979 -4938 9762 4096 -8882 -5056 9268 5167 -10032 -3965
3313 -3965 9701 4194 -8992 -4905 9978 4117 -10003 -3181 8937 4263 -9310 -4592 10412
3326A0412p289j2850O607J2413n223j3996O486J3598p559j1916N879J3019n939
3339C642j4288P991J2634p726j1521N752J3220o767j3499Q639J1461p119j1840
3352i421O466J3645r019j1907Q790J0707o761j2678P985J2601r301j0633Q124
3365a402J1025p515j2523R007J1610r750r682Q020J1209q284j2074R881J0391
3378I913r357r960Q072J1582r415j1093J0431R183q664j0258Q566J1424j0628
3391b04r475R546R568q902j0554J0079J0011j1015q375R907Q698q938j0688J1254
3405I12Q804j0995p570R119R339j0088r821J1943P586j0226q109R702R556j1411
3419a259q529J1448P073r667q382J0174R180j2172o980J0986O775r766q427J1563
$$ plain form
3326 10412 3123 -9727 -3120 9293 4070 -9926 -3440 10158 2599 -9317 -3438 9581 3642
3339 3642 -10646 -2655 9979 2253 -9268 -3516 9704 2937 -10562 -1923 9538 2419 -9421
3352 -9421 -2955 10690 1671 -10236 -1446 9261 2500 -10178 -2193 10408 1107 -9526 -1402
3365 -1402 9623 2108 -10415 -1408 10202 452 -9230 -1210 9999 1715 -10359 -478 9913
3378 9913 556 -9404 -1332 10250 835 -10258 173 9356 692 -9566 -1000 10424 -204
3391 -204 -9679 -133 9435 533 -10021 58 10069 -946 -9321 586 9284 346 -10342 912
3405 912 9716 -1279 -8849 270 9609 -479 -10300 1643 9229 -997 -9106 596 10152 -1259
3419 -1259 -9788 1660 8733 -934 -9316 858 10038 -2134 -9114 1872 8647 -1119 -9546 2017
3433B017P631j2124o274J0531P159j0709q042J2549O041j1328o019J0400P673
3446I505j2109o694J2512N229j0925o000J0567P321j2468n600J2132M703j1092
3459b919n807J1886O015j2866m316J1175N019j1436n662J2618M780j2623l686
3472g822J0963N306j1922n269J3071L427j1579l891J1117N187j2574m210J2577
3485D381K944j1135m168J1953M509j3343k527J1913K709j1161m019J2626L222
3498G904j3075k032J1688K725j1218m029J3349J652j2119j563J1011K941j2299
3511e065k206J2540J335j1832j583J1434L072j3131j552J2478R23j1371j815J2186
3525E413J911j3372k06J1805P84j1478j727J2751Q12j2890O92J0905R83j2222
$$ plain form
3433 2017 9648 -2476 -8750 1781 8940 -1769 -9811 2738 8779 -2549 -8568 1832 9505
3446 9505 -2604 -9298 3214 8443 -2482 -8482 2085 9406 -3062 -8662 3470 8173 -2919
3459 -2919 -8726 3160 9175 -3691 -8007 3168 8187 -3249 -8911 3707 8487 -4136 -7822
3472 -7822 3141 8447 -3475 -8744 4327 7754 -3825 -7716 3401 8588 -3986 -8196 4381
3485 4381 7325 -3810 -7978 3975 8484 -4859 -7386 4527 7236 -3925 -7944 4682 7904
3498 7904 -5171 -7203 4485 7210 -4008 -8037 5312 6964 -5155 -6718 4293 7234 -5065
3511 -5065 -7271 5269 6604 -5228 -6811 4623 7695 -5436 -6988 5490 6413 -4958 -6773 5413
3525 5413 7324 -6048 -6254 5551 6335 -5143 -6870 5881 6693 -6197 -5505 5400 6383 -5839
3539e839p28J3341j043j1665M49J0921Q41j2386L13J2555j138j1549J60J1715
3553E947O9j2890J705J1674j385j0926K29J1979p71j2629K296J0898j415j1176
3567f395P39J2504j946j1898K595J0607j246j1698J791J2296k845j1281K392J0685
3581F300j225j2223K732J1753l481j0543K224J1558k389j2145L534J0910l328
3594C677j0292K274J1846l435j1635M369R827l064j0602K718J2121m319j0864
3607g379M261R922l173j1101L982J1411n334r596M084J0194l875j1112M676J0697
3621G657n144r757M192J0619m545j0842N808R141m848r348M223J0472n472r837
3635g681N888Q681m428r661M745J0555o360r163N952Q510m831j0159O270R609
$$ plain form
3539 -5839 -6567 6774 5731 -5934 -5485 5436 6277 -6109 -5796 6759 5621 -5928 -5768 5947
3553 5947 6016 -6874 -5169 6505 5120 -5806 -5577 6402 5631 -6998 -4702 6196 4781 -6395
3567 -6395 -5656 6848 4902 -6996 -4401 6206 4960 -6738 -4947 7349 4504 -6777 -4385 6300
3581 6300 5075 -7148 -4416 7337 3856 -6687 -4463 7095 4706 -7439 -3905 7005 3677
3594 3677 -6615 -4341 7505 4070 -7565 -3196 6631 3567 -7035 -4317 7804 3485 -7379
3607 -7379 -3118 6804 3631 -7470 -3488 7923 2589 -7007 -2923 7271 3396 -7716 -3040 7657
3621 7657 2513 -7244 -3052 7567 3022 -7820 -2012 7129 2281 -7067 -2844 7628 2156 -7681
3635 -7681 -1793 6888 2460 -7201 -2456 8099 1739 -7424 -1472 7038 2207 -7952 -1682 7927
$$ [...]
8191D35
##END NTUPLES=NMR FID
##END=
