##TITLE=1H_Pr DMSO-H-N
 
 8 sc, 
 7.06.2022
##JCAMPDX= 6.0         $$ Bruker NMR JCAMP-DX V2.0
##DATA TYPE= NMR FID
##DATA CLASS= NTUPLES
##ORIGIN= UXNMR, Bruker Analytische Messtechnik GmbH
##OWNER= root
$$ XWIN-NMR		Version 3.5
$$ Tue Jun  7 14:49:49 2022 Russian Standard Time (UT+4h)  she@DPX200
##.OBSERVE FREQUENCY= 200.13135
##.OBSERVE NUCLEUS= ^1H
##.DELAY= (6, 6)
##.ACQUISITION MODE= SIMULTANEOUS
##.ACQUISITION SCHEME= undefined
##.AVERAGES= 8
##.DIGITISER RES= 18
##SPECTROMETER/DATA SYSTEM= spect
##.PULSE SEQUENCE= zg30
##.SOLVENT NAME= DMSO
##.SHIFT REFERENCE= (INTERNAL, DMSO, 0, 15.7039)
##AUDIT TRAIL= $$ (NUMBER, WHEN, WHO, WHERE, WHAT)
$$ ##TITLE= Audit trail, XWIN-NMR		Version 3.5
$$ ##JCAMPDX= 5.01
$$ ##ORIGIN= Bruker BioSpin GmbH
$$ ##OWNER= she
$$ F:/spectra/data/she/nmr/H-F/1/audita.txt
$$ ##AUDIT TRAIL=  $$ (NUMBER, WHEN, WHO, WHERE, WHAT)
(   1,<2022-06-07 14:48:32.17 +0400>,<she>,<DPX200>,
      <created by zg, POWCHK disabled, PULCHK disabled
       configuration hash MD5:
       00 E9 B6 7A A2 85 ED C7 34 08 36 98 17 FE 4E 26
       data hash MD5: 16K
       84 F7 F2 46 22 32 93 73 F7 FE 2E 9B 28 8E 31 57>)
$$ ##END=
$$ 
$$ hash MD5
$$ 55 22 F1 FA 70 96 02 38 DF 00 68 77 2F 41 4E 33
##$RELAX= 
##$RELAX= 
##$RELAX= 
##$RELAX= 
##$RELAX= 
##$RELAX= 
$$ Bruker specific parameters
$$ --------------------------
##$DU= <F:/spectra>
##$EXPNO= 1
##$NAME= <H-F>
##$PROCNO= 1
##$TYPE= <nmr>
##$USER= <she>
##$AMP= (0..31)
100 100 100 100 100 100 100 100 100 100 100 100 100 100 100 100 100 100 
100 100 100 100 100 100 100 100 100 100 100 100 100 100 
##$AQSEQ= 0
##$AQ_mod= 1
##$AUNM= <au_zg>
##$AUTOPOS= <>
##$BF1= 200.13
##$BF2= 200.13
##$BF3= 200.13
##$BF4= 200.13
##$BF5= 200.13
##$BF6= 200.13
##$BF7= 200.13
##$BF8= 200.13
##$BYTORDA= 1
##$CFDGTYP= 0
##$CFRGTYP= 5
##$CHEMSTR= <none>
##$CNST= (0..31)
1 1 145 1 1 1 1 1 1 1 1 1 1 1 1 1 1 1 1 1 1 1 1 1 1 1 1 1 1 1 1 1 
##$CPDPRG= <>
##$CPDPRG1= <>
##$CPDPRG2= <>
##$CPDPRG3= <>
##$CPDPRG4= <mlev>
##$CPDPRG5= <mlev>
##$CPDPRG6= <mlev>
##$CPDPRG7= <mlev>
##$CPDPRG8= <mlev>
##$CPDPRGB= <>
##$CPDPRGT= <>
##$D= (0..31)
0 1.2 0 0 0 0 0 0 0 0.06 0 0.03 0 0 0 0 0.0002 0 0 0 0 0 0 0 0 0 0 0 0 
0 0 0 
##$DATE= 1654598911
##$DBL= (0..7)
120 120 120 120 120 120 120 120 
##$DBP= (0..7)
150 150 150 150 150 150 150 150 
##$DBP07= 0
##$DBPNAM0= <>
##$DBPNAM1= <>
##$DBPNAM2= <>
##$DBPNAM3= <>
##$DBPNAM4= <>
##$DBPNAM5= <>
##$DBPNAM6= <>
##$DBPNAM7= <>
##$DBPOAL= (0..7)
0.5 0.5 0.5 0.5 0.5 0.5 0.5 0.5 
##$DBPOFFS= (0..7)
0 0 0 0 0 0 0 0 
##$DE= 6
##$DECBNUC= <off>
##$DECIM= 32
##$DECNUC= <off>
##$DECSTAT= 4
##$DIGMOD= 1
##$DIGTYP= 9
##$DL= (0..7)
0 120 120 120 120 120 120 120 
##$DP= (0..7)
150 150 150 150 150 150 150 150 
##$DP07= 0
##$DPNAME0= <>
##$DPNAME1= <>
##$DPNAME2= <>
##$DPNAME3= <>
##$DPNAME4= <>
##$DPNAME5= <>
##$DPNAME6= <>
##$DPNAME7= <>
##$DPOAL= (0..7)
0.5 0.5 0.5 0.5 0.5 0.5 0.5 0.5 
##$DPOFFS= (0..7)
0 0 0 0 0 0 0 0 
##$DQDMODE= 0
##$DR= 18
##$DS= 0
##$DSLIST= <SSSSSSSSSSSSSSS>
$$ [...]
##$SUBNAM2= <"">
##$SUBNAM3= <"">
##$SUBNAM4= <"">
##$SUBNAM5= <"">
##$SUBNAM6= <"">
##$SUBNAM7= <"">
##$SUBNAM8= <"">
##$SUBNAM9= <"">
##$SW= 18.05172834244
##$SWIBOX= (0..15)
0 0 2 0 0 0 0 0 0 0 0 0 0 0 0 0 
##$SW_h= 3612.71676300578
##$TD= 16384
##$TD0= 1
##$TE= 0
##$TE2= 300
##$TE3= 300
##$TEG= 300
##$TL= (0..7)
0 120 120 120 120 120 120 120 
##$TP= (0..7)
150 150 150 150 150 150 150 150 
##$TP07= 0
##$TPNAME0= <>
##$TPNAME1= <>
##$TPNAME2= <>
##$TPNAME3= <>
##$TPNAME4= <>
##$TPNAME5= <>
##$TPNAME6= <>
##$TPNAME7= <>
##$TPOAL= (0..7)
0.5 0.5 0.5 0.5 0.5 0.5 0.5 0.5 
##$TPOFFS= (0..7)
0 0 0 0 0 0 0 0 
##$TUNHIN= 0
##$TUNHOUT= 0
##$TUNXOUT= 0
##$USERA1= <user>
##$USERA2= <user>
##$USERA3= <user>
##$USERA4= <user>
##$USERA5= <user>
##$V9= 5
##$VALIST= <valist>
##$VCLIST= <CCCCCCCCCCCCCCC>
##$VD= 0
##$VDLIST= <DDDDDDDDDDDDDDD>
##$VPLIST= <PPPPPPPPPPPPPPP>
##$VTLIST= <TTTTTTTTTTTTTTT>
##$WBST= 1024
##$WBSW= 4
##$XGAIN= (0..3)
0 0 0 0 
##$XL= 0
##$YL= 0
##$YMAX_a= 192187
##$YMIN_a= -32386
##$ZGOPTNS= <>
##$ZL1= 120
##$ZL2= 120
##$ZL3= 120
##$ZL4= 120
##$ABSF1= 10
##$ABSF2= 0
##$ABSG= 5
##$ABSL= 3
##$ALPHA= 0
##$AQORDER= 0
##$ASSFAC= 0
##$ASSFACI= 0
##$ASSFACX= 0
##$ASSWID= 0
##$AUNMP= <proc_1d>
##$AZFE= 0.1
##$AZFW= 0.1
##$BCFW= 1
##$BC_mod= 2
##$BYTORDP= 1
##$COROFFS= 0
##$CY= 11.3945322036743
##$DATMOD= 1
##$DC= 2
##$DFILT= <>
##$DTYPP= 0
##$F1P= 2.36226072786647
##$F2P= -0.459571619588291
##$FCOR= 0.5
##$FTSIZE= 0
##$FT_mod= 4
##$GAMMA= 1
##$GB= 0.15
##$INTBC= 1
##$INTSCL= 1
##$ISEN= 128
##$LB= 0.24
##$LEV0= 0
##$LPBIN= 0
##$MAXI= 10000
##$MC2= 0
##$MEAN= 0
##$ME_mod= 0
##$MI= 1.114404
##$NCOEF= 0
##$NC_proc= 0
##$NLEV= 6
##$NOISF1= 3.799351
##$NOISF2= 2.8
##$NSP= 1
##$NTH_PI= 0
##$NZP= 0
##$OFFSET= 15.70392
##$PC= 1
##$PHC0= -18121.3
##$PHC1= 12.80074
##$PH_mod= 1
##$PKNL= yes
##$PPARMOD= 0
##$PSCAL= 0
##$PSIGN= 0
##$REVERSE= no
##$SF= 200.130013532006
##$SI= 16384
##$SIGF1= 3
##$SIGF2= 2
##$SINO= 400
##$SIOLD= 16384
##$SREGLST= <1H.CDCl3>
##$SSB= 0
##$STSI= 0
##$STSR= 0
##$SW_p= 3612.71676300578
##$SYMM= 0
##$S_DEV= 0
##$TDeff= 0
##$TDoff= 0
##$TI= <>
##$TILT= no
##$TM1= 0
##$TM2= 0
##$TOPLEV= 0
##$USERP1= <user>
##$USERP2= <user>
##$USERP3= <user>
##$USERP4= <user>
##$USERP5= <user>
##$WDW= 1
##$XDIM= 8192
##$YMAX_p= 0
##$YMIN_p= 0
$$ End of Bruker specific parameters
$$ ---------------------------------
##NTUPLES= NMR FID
##VAR_NAME=  TIME,          FID/REAL,        FID/IMAG
##SYMBOL=    X,             R,               I
##VAR_TYPE=  INDEPENDENT,   DEPENDENT,       DEPENDENT
##VAR_FORM=  AFFN,          ASDF,            ASDF
##VAR_DIM=   8192,          8192,            8192
##UNITS=     SECONDS,       ARBITRARY UNITS, ARBITRARY UNITS
##FACTOR=    0.0002768,     1,               1
##FIRST=     0,             0,               0
##LAST=      2.2672688,     0,               0
##MIN=       0,             -32386,          0
##MAX=       2.2672688,     192187,          0
$$ Real data points
##PAGE= N=1
##DATA TABLE= (X++(R..R)), XYDATA
$$ [...]
1223E4j07R6P3p9j50K14j64O9Q0j05mj71K16j28J42j55mJ39L8nj8j11p3l3K12
1248B6q9J95oj36o2J65k7K4P3j94l9J24j28M4Q6q6J54r2%p5kN8O4o7P3k08J62
1275C7M8k0p7L0r7J30j44L0J03jR1j6k07J0qN1K3j8N6N4M5p4O0j68J58m9o3P4
1303E8j04J10q8N0Q3j15R9j2n6o3o6K06j25K9q1J12K5M5l7j26O8k6L6K0Q5k70
1329a43J81p3J36n7j43J33o4J21j50J05n5N0OL7n6n2RJ11J14k25J0M4o3J0M3r4
1355f5R9L4O0k10K37j37j5j1NO7q4O1j37O2j00PQ5J77j16r3J96j97N0q2L5J46
1381G4p6o7Q8j70J35J99k18k6J53l5j07Q6P1j10J33oK3n1%n9R6j62J12o1p2J35
1407H5j29N3O8j01pj3Jl3R3r4K5p2P2%J19k22J59n0L0K19k07m0n3Q2K7N5p5Q0
$$ y = [54, -53, 43, 116, 37, -113, 101, -63, 6, 86, -19, -23, -194, 22, -106, 36, -119, -123, 16, 54, 49, 31, -80, -153, -186, 26, -63, 132, 126, -10, -72, 93, 66, 90, 163, -31, -70, 54, -74, -30, 56, -30, 124, 32, 32, -43, -45, 13, 77, 10, 83, -125, 37, 85, 65, -12, 18, -79, 51, -93, -63, 40, 39, 130, 114, -93, -83, -91, -40, -17, -35, 21, 75, 120, 46, 106, -62, 96, 47, -16, 58, -46, 64, -24, 26, 109, -6, 93, 81, 25, -38, -104, 102, -23, 6, -75, 37, 62, 107, 70, -56, 12, -14, 22, 42, 127, -143, 38, -35, 101, 44, -99, 34, -30, 91, -59, 46, -9, 41, 47, 84, 28, -24, -15, 96, 210, -15, -5, 39, -24, -14, 29, -65, 34, 68, 128, -82, 155, 18, 3, -8, -3, 64, -20, 41, -96, -34, -134, -127, -42, 135, 19, -74, 122, -75, -25, -107, -72, 74, -2, -69, 19, -151, -16, 183, -35, -61, 92, 57, -50, 36, 107, -3, 130, 124, 147, 96, 96, 37, 133, -29, 83, 22, -50, 85, -44, 9, 77, -24, -31, -44, -43, -76, 17, -77, -52, -124, -52, -52, 67, -155, 4, -46, -16, 203, -4, -44, -97, -15, 12, 67, -8, 72]
1435G2j8o4J9j81k0L48k22J17j22K8P3j3j83P1P8J72k83K1J51j38J58j93J80j50
1459i9J84k5k08J56K7n1L0n2k1J20j37J20p3o3k3J36O3o5J7K4o2nN4j1K4rP8o8
1487F1j21Rm4J79j17J29j61J16j09M2j4M8l3j7J50p5q5pP6kj05K3N5L8j25q2J44
1514b7J26j38J44ko6K6M6j84L1RN0l2J19m4j55J84j27J0pQ5M9l8j57m0O5J79p0
1541C6m5Q4p7m1Q7m6j05J26q2J91j21Q5L7k61K23n8JL3k60K13p7M0J25m4L9J5
1567A18j65o8K98oj53J07j18r4K7MQ7r4J7L6n6J11j42Q9q6Q9JM3j85K03j48N8
1593b7R1k9j8J0r8J75j73J0l6J20m3j80K75k47O9J25N4l1l8M0Pl2N0O6l00K5K12
1620G7n8r5M8R1J3k2J19k00J12j1l7o6N7j07J55L8kK1J5k06K1J30rnp2R1l3J05
$$ y = [72, 54, -10, 9, -172, -192, 156, -66, 51, -71, -43, 30, 17, -166, -95, -17, 155, -128, -107, 44, -94, 64, -129, 51, -99, 85, 60, -148, 8, 35, -16, 14, -38, -59, 61, -76, 44, -29, -92, -115, 21, 84, 19, 36, 60, -2, -7, 47, 36, 60, 51, 129, 61, -60, -51, -95, 84, -33, 96, -65, 51, -58, -16, -30, 18, -15, -32, 118, 43, -42, -49, 27, 25, -80, -57, -2, 36, -89, -171, -27, 99, -39, 105, 103, 37, 63, 109, -75, -44, -35, 15, -17, 102, 58, -97, 87, -40, -30, -37, 48, 97, 59, -98, -138, -73, 106, 36, -9, 75, -2, -43, 44, -2, -107, 19, -63, 128, 7, 92, 129, -132, 91, 33, 34, 67, -193, 20, -57, -17, 108, 64, 103, 118, -47, -115, 183, 177, 24, 131, 13, -81, -54, -50, 37, -57, -40, -4, -60, 51, -91, -2, -88, 1, 2, 45, -140, 63, -85, -27, 64, 35, 17, 27, -71, 104, -69, -59, -95, 25, -18, -198, 77, -170, -101, 24, 78, 47, 9, 49, 56, 24, 74, 140, -160, -135, 77, 19, -76, -28, 63, 76, 54, 173, -27, 85, 74, 37, -29, 28, -79, 76, 114, 112, 133, 148, -58, -37, 93, 84, 79, 7, 98, 65, 170]
1648A70k24n0J15m6P4l5p7J17j16P9j10J71l4k16L9J88n0O2p4m0n1O9L3J9j1l
1674aR4j15R5j89K24p2N7k12K17j26K9mj00K21j49M9n8Q2p3J37J12j25j61JO4
1699cQq9L4JJ96n6Qj58m7P6j7P2j3K2o3J1N5K67k53j80J14R2M3j45J02J19k55
1726e9nJ04ll2m1M3l6k8j34J46j59K8P2R5j02P5R3M9r2R0Kj42J1L2o4JJ04j38
1754i0j41K32J25n9J09j35r1J62r9rqR0j33J55j51M9J95m01R5rL4J8J48J6n4l3
1780A5j68N2J77K8j39L3k8j4j31J27J09k5n3j3L9n1o5Q4m2J49o2Q9p7J34j97q0
1806a09RP1N7K5L7k35J57q9J5J79j26q0J25M0k42K46l0j24J15r9l3P0L4Mo7M1
1832ij6M0K2p8K6MK8o4P7q1J8J8K9k4j22J12J12j76O8Q4n4O7K4O3k44l9K03k08
$$ y = [170, -54, -104, 11, -35, 39, 4, -73, 44, -72, 7, -103, 68, 34, -182, -143, 45, -5, 57, -17, -57, -108, -39, -6, 13, 2, -1, 93, -22, 73, -116, 108, 36, 93, -119, 98, -28, 1, -3, -103, 118, -31, 18, -40, 42, -31, 106, 218, 93, -68, -67, -3, 5, -84, -50, -49, 147, 91, 99, -59, -106, -30, -47, 25, 12, 34, -29, -18, 37, 304, 51, -129, -15, 77, 120, -25, 77, 196, -59, -64, 40, 37, 5, -36, 7, -29, -57, -191, -45, -204, -176, -104, -9, -111, -36, 57, 106, 14, 104, 106, -36, -25, 7, -57, -56, 48, -90, -231, 1, 126, 67, 176, 41, -50, 112, 13, 4, -4, 86, -47, 108, -43, 6, 201, -200, -105, -114, -80, -62, 86, 102, 48, 15, -153, -101, 76, 104, -35, -2, -30, -44, -175, -48, 61, 36, -17, -30, 9, -42, -107, -23, -65, 84, 22, 111, 34, 168, -29, -109, -100, -29, 28, 53, 90, -145, 12, -77, -62, 117, -9, -89, 36, 76, -166, 80, 50, -74, 41, -58, -91, -21, 13, 17, -50, -9, -25, 15, 37, -41, -15, -11, 17, -47, 30, -51, -33, -15, 14, -10, -132, -20, 92, -84, -16, 68, 14, 81, 105, 168, -76, -115, 88, -120]
1860a20J69n0lr4J34l9r3JJ91l1k27L03j98J17p9J06M%j23O5J94l63K31j07j0
1885b2K8L7m4j7J48j55J0L2J39k02J08nk1j31k9J30Lp2j03K14Qj24Q7LQ4q4p3
1912e1J38j74P9j35j7J39n7o4J33n6P6J8j76Q8J70l6p2P7o5q6J56k1N6k82K25
1937F3K7m6J4N1n9M1j29j0n4P9j05J77o8J4k8K3K43k25R9o1j42J67j38nJ11l1
1963HK4N1j40Q7r7J01k5ro8K09n9k22K40m6j8r7Pm0J39or5j7K93m1r0q1k7M9J24
1992A54j89J3Q3o2P8k50J85L9j48N2M0l5j17J35J9k27N2K34n4M1n9j62K47j37
2016f8N3P2p2m7K4q4R9P1q5j9O7J22j83N2K3P6j35J54j41J01j82J79m4j42J46
2041C7k40K12k2r1J18k5r5J57K1K4p5%J20j19K0lk6j04P2l7K9l7J53n4j22O2J94
$$ y = [-120, 49, -1, -4, -98, 36, -3, -96, -95, 96, 65, -162, 141, -57, 60, -19, 87, 91, 91, -32, 33, 227, -136, 95, -12, -22, 6, 43, -1, -18, 130, -25, -15, 17, 156, -46, 62, 57, 36, -95, -124, 6, 9, -63, -166, 48, 56, -68, 19, 22, 106, 22, -51, 87, -87, -8, -143, -160, -21, -78, -142, -9, -65, 11, 29, -147, -59, 111, 75, 3, 80, 15, -71, 85, 64, 120, -162, 63, 90, 44, 58, 109, 50, 91, -38, -48, -102, -23, -128, 49, -19, -5, -33, -10, 233, 8, 107, 46, -96, 71, -67, -72, 39, 8, 32, 83, -57, 30, -67, 34, 9, 0, -68, 141, 82, -140, 100, 54, 36, -61, -54, -94, 45, 39, -56, -73, 220, 179, 89, 8, -19, 30, 154, -35, -22, 61, -1, 77, -173, 12, 51, -97, -45, -5, -40, -157, -22, -3, -230, -178, 56, 2, 43, -16, -178, 69, -68, -15, 57, -15, -62, -38, -122, -23, 48, -37, -56, 11, 133, -50, 2, 25, 101, -34, 120, -21, 80, -102, 77, 33, -109, 37, -203, 9, -13, -104, 14, -11, -106, 51, 72, 96, 21, 21, 141, 22, 42, 39, 13, -91, -19, -56, -27, -64, 89, 35, -87, -25, 169]
2068A69j43o9Q1j04N4n4n3K69q6p1n9j8K76j05k67N3K56k30K1J17JR3k51K19j17
2093a8K1L8p9OJ20m0R5n1j79J56n1j17q7N0K09J8Q7k35J84k11n8L02r0n2N1R3
2119A62j76p0k4J24K7q4J44k54k8L44m8k33J58j99J46q7JK27p9r1O7p3o4J21J8
2144B9J72l50J94n6M2q9mN5N5o2L3J64k53j06J75J13k25J72l5j28K6K28r5q7Q9
2169E7r0L5n8n4r9J38J4O2qN7Lm6j07R4J4o1R0J35k86J59m3O9R8q7Jk34K50j8
2197H5O9k48l2J38n7m7K27j47j1j3M4j04r3J56J6J19k27N8J56j54mM5j60K63j87
2222a08K19j1r1o1m8J29kp4M9NJ93m2N0j77J31j36j18K17l26J76j19O3J30k57
2246b08J72j21J3j0P3%kR7j31Q0N2K8j05J11Lr5P4Q8N8l35M9J87o3k0m5l1R2n0
$$ y = [169, 26, -43, 38, -66, -12, -66, -119, 150, 64, -7, -66, -84, 192, 87, -180, -127, 129, -101, -80, 37, 38, 131, -120, 99, -18, 3, 41, -38, -32, 88, 48, 143, 92, -87, 69, 18, -99, -186, -136, 73, 91, 178, -57, 127, -84, -142, 160, 70, 18, 69, 162, -14, -84, -108, 16, 43, -41, 103, -151, -179, 165, 117, -116, 42, -157, -11, -98, -97, 130, 51, -40, 27, -46, -110, 11, 29, 201, -149, 45, -11, 31, -58, -62, -7, 48, -14, 19, 183, -70, -176, -1, 112, -113, 59, 24, -104, -78, 150, 55, -32, 57, -33, 2, -56, -110, -209, -71, -57, 5, -3, 54, 57, 11, -96, -2, 12, -49, 41, 176, -110, 49, 6, 75, 173, 86, 87, -147, 103, 85, 154, -94, -126, 12, -45, -92, 135, -12, -23, -36, 8, -96, -189, -33, -17, 102, -125, -67, 89, -65, -69, -24, -184, 79, -108, 111, 100, 9, -52, -100, 29, 27, -47, 2, 7, 200, 158, 208, 31, 162, 26, -92, 125, -201, -25, -144, -81, 49, -208, -36, -157, -144, -154, -81, -81, -83, 14, -117, -37, 15, 43, -62, 49, 52, -43, 31, 119, 177, -158, -109, 78, 15, -5, -50, -81, 11, -39]
2274c9L7K0n9o1m0J61nJ6N4j71J5J8J77o7k06J37Lq9J80j13J68k9l1J8j57%m1
2301a04R8M3l8O5k19K18o3j97L16j93J56lj29k2k4Q8j58K97j03k4J17k08Q3Q6
2325H2j44L0Q0K5j59k2J14J14j60J73j28L1Km3k0P8j30J14K7p2K4K2j52J76o0
2350Bl2KM2k7K7m9RJ7r7J23jJ15j35M4l0j44K02j55J14j36K87j16p6j58J32O3
2376B3O8j8p0J59p6j6j67n1J39J8j22J76j52Q9l8oR0j18K22k21Q4j31J77J02K8
2401A89j04L2m8p9J4l4N6o9P8j9j5k7Q8o2m7l5q7N7O5P3qJ06k15J24r3o4O8J20
2429F4N3K3j05j21J58o6q8po1K0L03j96J25j84l6J61Rpj16M9J02J6j64R5R3k1
2455I9m9j10l8Q3J95j21o9J3l6QN5J28j12K3l3n8m3J07K3R4k19J08j6J68l12K89
$$ y = [-39, -2, 18, -41, -102, -142, 19, 14, 30, 84, -87, -72, -54, 123, 56, -150, -13, -10, -99, 81, -32, 136, 107, 76, 94, -63, -63, -104, -6, 37, -1, 64, -155, 63, 0, -197, 119, -74, 82, 79, -50, -72, -96, -8, -166, 131, 28, 4, 121, -87, -4, 82, -62, -32, 48, 73, -86, -108, 6, 120, -40, 133, 5, 36, 38, -5, -25, 53, -77, 37, 64, -8, 16, 38, -114, 62, 2, -30, -28, 14, -13, 14, -35, -26, -9, -106, 17, 16, 131, -4, 40, 10, -134, 68, -87, 27, -109, 178, 62, -14, -172, -40, 23, 91, 73, 3, 162, 86, 70, -97, -148, -9, 9, -113, 63, -89, 0, -38, -44, 46, -72, 150, -71, 13, -118, 59, 161, 189, 85, 117, 69, -10, 4, -30, 26, -43, 35, 16, 1, -26, 62, 0, -47, -82, -169, -112, -47, 26, 18, 124, -91, 33, -60, -124, -56, 64, 117, 140, 35, -86, 72, 6, -82, -89, -150, -130, 173, -23, 102, -82, -118, 43, 52, 45, -71, -22, 80, 96, -68, 27, 120, 99, 50, -60, -98, -15, 180, 59, -10, 3, -33, -25, 30, 158, 46, 69, 36, -22, -65, 42, 65, 159, -60, 48, 32, 200, -112, 177]
2481A77k27K9j8J8K6KL5p5o0L9o9J64j91J05P0j70Q5M8J31k33j12L52j79N5j6
2506a4J0J10k3r5j40P3K31j05j5J29p8j12K03j32p2J03P5j1j19M9p8JJ87j65p7
2531f5K1m1O0o5J44j7r9L6mq9j9L3J45P5k12J71j48n9J89o8J68n4j29Q4j74K20
2557A03j26j3p7K28j8j70m0J02L0j0J20q1j63j6J01O7O1m1r4J41Pj03r6J45Kj38
2583g9Q4M7j74J73Ok0M4Mq3N3QoM7k07J32o8K1K3J6q9j4K04k4j14J29j95J5mJ46
2612G5q5l9R2j17N9m2OK37k69R2o2o3J35j5j15K26k86K51o4j66R7n3K3J24j07
2637f6p3l3J90oJ54j18%K5M6j32n7OJ52J9j88Q2r4J47n6J6K0J03j41k32J51J87
2663A02q2L5j06Q3m0K1J18Nj26R5kj19p4PJ4%J27M3j06K2L6j7j49K55j01O7k11
$$ y = [177, -50, -21, -39, -21, 5, 7, 42, -33, -93, -54, -123, 41, -150, -45, 25, -145, -60, -12, 119, -114, -226, 126, -53, 2, -14, -4, 106, 83, -12, -152, -79, 152, 47, 32, 161, 83, -29, 174, 42, -30, 73, 148, 137, 18, 67, -11, -10, 177, 12, -65, -44, -85, -25, -90, 54, 37, -62, -26, -30, -119, -138, -105, 40, 115, -97, 74, -74, -133, 56, -12, 156, 102, -27, 57, -117, 103, -23, -36, -113, 115, 97, -73, -113, -11, 19, 9, 129, 48, -115, -131, -30, 37, 98, 57, -37, 104, 111, 8, -88, 57, 59, -79, 5, 52, -122, 51, 57, 37, 81, 85, 2, 55, 63, 57, 104, -103, 29, -39, -18, 5, 21, -68, -82, 122, 98, -16, 113, -82, -67, -71, 75, -10, -49, 43, -74, -15, -57, -51, 186, -83, 9, -53, -116, 19, 4, -111, 115, -171, 80, 16, -150, -53, -106, -83, 41, -66, -139, -172, 18, 12, 166, 48, 48, 73, 119, -13, -70, -64, 88, 107, -81, 1, -93, 54, -2, 14, 34, 137, -4, -236, -85, 102, 20, 55, -51, 32, -8, 13, 131, 136, 10, 105, 103, -16, -90, -83, -69, -69, 58, 101, -5, 17, 53, 36, -113, 142, 41, 108, -103]
2690a03LJ10j3O3j08Kl7M1O3k0J09J37j21j07N3k83K24J41k24L8l5n4j6L3P4k5
2716e5mO5o7N8j56J61P9j05Q5j69l1L22l2j86J25j03l9N2q7J98r0l5oJ11O5n9
2742I7j51J22j71K31M3k01j2J02o3j05J93j3j16P2J3p4j05K16j78O7o1o5J93J29
2766A63r8J4n5j46J90l4j88K63j66J61j02Op6j6P1M7J11j41M3p1pm7R5q0O1k8
2792c0J03R1J4j53q5j2j20K83l6j26J36k2j54Q4J07j78P7P3j6J26r1j77P9k5L3
2817a9K9n2J10j48L6l1J71n3q3J09q7n4O5Q4r0J49j36J80j79r9K33q6p0m9P6J38
2843A44j62O4j2p6J26O2j48q3J57P7k5k22QO7L8l6R6j12nm9J46j15q4J53l2J22
2869I9j32LK1K6L0r5P1j17J92pKq9O5j01L1p8N6J37j66K7n7L8O0N0N0P7k59J28
$$ y = [-103, -100, 10, -3, 60, -48, -46, -83, -42, 21, 1, 110, 247, 126, 19, 72, -211, 13, 154, -70, -32, -67, -121, -137, -104, -30, -55, -59, 6, -61, -3, -159, 2, 81, -24, 61, -108, -139, 183, 151, -35, 90, -13, -52, 0, -87, 111, 21, -14, -20, 91, 156, 97, -54, 68, -103, 128, 171, -30, -42, 60, -3, -108, 85, 72, -44, 28, 41, -33, -138, 78, -100, -33, -94, -159, 34, 163, 65, 79, 24, -122, 68, 34, -154, 109, -57, 104, 2, 8, -68, -84, -13, 34, 145, 4, 47, -24, -31, -78, 17, -63, -2, -30, 73, 164, 178, 25, -60, -72, -192, 91, 55, -71, 65, 43, -111, -27, 80, -98, -21, 52, 36, 162, 71, -106, -27, -52, -19, 10, -42, 68, -80, -44, -75, 96, 43, -40, 69, -18, -72, -7, 77, -13, 136, 0, 180, 1, -98, 135, 49, -21, -70, 6, 144, -18, 46, 34, -42, 84, 146, -2, -85, 72, 149, 124, -98, -90, -23, 15, -21, 75, -37, -42, -91, 55, -60, -144, 9, -23, 99, -33, -30, -9, 17, 47, -48, 23, -94, 98, 91, 93, 4, 69, -32, -1, -79, -23, 114, -52, -25, -82, -44, 16, 66, 116, 193, -66, 62]
2897F2k08J18K20k41M2o1N6M7j89R8M9m7M9JoN4j58J92M9p9o3J09j7j17j41J63
2923a8J6O0j1m5J58k27l7O4j6R6m3j25j0J14l0J5L0o9OO0L2P8j01P9O9j25q6K
2951f4J67j8k20K49j22O1k23J02J14N1o5k52K42m1J93l02L0l1P3J39o5j06J32
2974D4j09kJ46j51J78J0j16qj6l5Q9m7M4jp4O6J82k93K20r9j55J98Q7k41J19j18
3000h2J23r2n2J0K51j90k5J58j62N8o6J27j96K19j97J68m5J64k6k37L03j21qj57
3024g5J23j29J85q4j06M3K27p3m2l1j31J43j5j41M1K17j77P9k17K35o0j3r5J13
3048A7J11k17O0L2J29j60J7O4k54K36j12P8p9J25o0L7O7j97P2NQ9j52M4K8J20
3073A00j38O6O9j45n5R9J83j69O9n5k2j0M3J6n7P5l9K9k16J00o2R1r2J51o4J30
$$ y = [62, -146, -28, 192, -49, -7, -68, -12, 35, -154, -56, -7, -54, -5, -4, -10, 44, -114, 78, 127, 48, -15, 94, 77, -40, -181, -18, -2, 58, 47, 2, 160, -67, -104, -40, -56, 40, -3, -128, -138, -24, -54, -39, -9, -78, -72, -12, 20, 98, -3, 76, 145, 20, -66, -64, 103, 85, -135, 114, -8, 53, -170, -68, 46, 97, 32, -220, 22, -19, 174, -128, -98, -129, -56, 83, 18, -88, 44, -65, -67, 79, -72, 106, 116, 0, -8, -24, -59, 30, -17, 27, 26, -48, 18, 200, -93, 127, 28, -127, 71, 158, -83, 36, -82, 41, -51, -103, -93, 158, -32, -57, 101, -61, -3, -69, 58, -138, 81, -116, 52, 7, 171, 145, -92, 211, 90, 82, -75, 48, -81, 104, 20, -86, -43, 184, 111, 69, 38, -93, 50, 35, -106, -65, 152, -25, 54, -163, 72, 12, -1, -96, 17, 128, -89, -29, 3, 132, -28, -11, 53, -201, 35, -77, 1, -78, 47, -13, 24, 91, -106, -34, -29, 60, -92, -48, -20, 100, -38, 28, 97, -48, -103, -4, 179, 10, 79, 24, 2, -8, 35, 51, -6, 69, 30, 59, -157, -57, -119, -28, -120, 31, -33, 97]
3099I7j94K42j42P0j18j9k9J43j35R1r8Q1q7J31K9k76J24K0P8R1r3N8j15q6R8
3124c9o1J56p5R4P4k77J50l7J03j03o9kN2J78l80J38j7Q7K4%O0o2PO2j65J70o4
3151Dqp1Q2j23K22j88J74n1j23J46p4J25j76O6R2j28m0J15n7P6j9K7j30Q0M3o3
3177Am5K7kk0O1j23L06k78j16L45k93J15k4K45l55Q6Q6qk7N5J0m8L5N4p2o1p9
3204a25J65pj88L22k96K54k13P7nJ26q5M8N4j40O9J2q2j8L5m4KK14l0j41O4m1
3230B7k3pl7l7K49o0j07N0J06k79L3J08qj56J07m7K6O2KO7j5j8j07NJ2j83J44
3257h6K2K9J19o8Nr2%J17n2k9K0K2rK4J8j22k1J46J2P5j04j5L5r7M3J17q8j22
3285a01R6L4k8J42r7j7j07L5l9J08j12R7k7j19K56q5J9j01M8N6k05K73o7J3r4
$$ y = [97, -97, 145, 3, 73, -45, -64, -93, 50, -85, 6, -92, -11, -98, 33, 62, -214, -90, -70, 8, 99, 6, 64, -51, -137, -39, -100, 56, -19, 75, 149, -128, 22, -15, 88, -15, -84, -86, -34, 144, -236, -98, -115, -28, -4, -4, 56, -6, 1, 63, -102, 68, 4, -4, -75, 7, -116, 106, -82, 92, 41, -82, 64, -10, 115, -61, 5, 97, -31, -71, 44, -13, 63, 44, 71, -59, 21, 64, 1, -44, -17, -19, -39, 22, -101, 205, -73, -189, 156, -137, -22, -46, 199, -156, -70, 16, 8, -19, 36, 46, -2, 33, 87, 15, -46, -125, 40, 33, -155, 167, -129, 125, -88, -11, -16, 110, 25, 73, 127, -13, 56, 68, -14, -32, 3, -41, -39, 175, 145, 4, 68, 27, 4, -3, -40, -77, 172, 112, 5, 55, 161, -118, -85, 23, 15, -141, -34, -81, -55, 7, 9, 76, 61, 43, -64, -59, -47, -230, -86, -64, -35, 84, 16, 21, -71, -71, 46, -6, -35, -15, 7, -2, 22, 40, -82, -103, 43, 55, 130, 26, 11, 46, -51, -8, 109, 21, -101, -5, 29, 1, 143, 46, 29, -78, -43, -82, 26, -86, 11, -16, -135, 121, 36, 55, -46, 2, 58, -147, 126, 59, 72, -22]
3310b2lQ2j37N0o1n5K54j95j8J85Q0k12J95j62j9NQ0j65J04J68j98%r6P5O2k9
3336c2r7J92q2j69L63k01J53j32JK9M3j58J7J4J70k47J60j79K13Q3j18M7q7O8
3360E1p7Nl5Q3p5J04P7j49R0J0q0n3K04j3m0J3LJ1k32J00o9R1KQ3j69J25k05K66
3388A21j00o2k0R3m6J05q7P5j47O8L8j69J25%K8O9Q2k56J96p8J4O1k73J48K17
3413B02j09N6j37N6j70J66j48J24q5j9o7N7J00q4j9J86mj43Q0M0L3P6j79K6j02
3438f4J60pJoj66J1O9O6o1j16K07J7l8J05Nj72j4M0j1k0j04O5j80K12n0J7JR4
3466F1M6Or9n1L9j2L4o4O9Q8n1k8k07K10l4N6N5k20J89j72J79j01j7q5J73Oj21
3493e1K03j37k6J67n5j80J80n8J06k79j8J48o7J57q8np9J41r1j57j3J86J52j02
$$ y = [-22, -25, 57, -80, -30, -91, -146, 108, -87, -105, 80, 160, -52, 143, -19, -38, -33, 47, -118, -14, 154, -44, -44, -140, -65, -3, -32, -129, 63, -19, -188, 175, -26, 127, -5, -4, 25, 68, -90, -73, -59, 111, -136, 24, -155, 58, 141, 23, 70, -17, 51, -26, -21, -56, 27, -48, 56, 133, -16, 74, 84, 4, -49, 155, 142, 102, 115, 118, 129, -103, -3, -72, 19, 21, 104, -65, 60, -145, 121, 21, -41, -61, 32, -14, 91, 4, 79, -68, 0, 38, -131, -6, -6, 22, 91, 173, -83, 113, 35, 49, 110, -163, -15, 202, 93, 149, 12, 68, -102, 64, -84, 40, -45, -64, -131, -74, 26, -58, -77, 109, 105, -38, 42, 82, 115, 191, 12, 38, -64, 96, 89, 90, 84, -82, -71, -2, 64, 3, -113, 94, 111, 73, 178, 183, 11, -3, 37, 26, 6, -98, -33, -213, -1, -51, -34, -33, 61, 107, 113, 14, -37, 2, -10, 24, -40, 29, 117, 66, 38, -169, 41, 7, 63, 118, -102, 87, -85, 94, -7, -24, -109, 64, 70, -51, 152, 15, -11, 156, 101, -79, 101, 43, 149, -130, -148, 0, -67, 90, 2, -3, -82, 59, -32, -189, -202, -16, 136, 34]
3517C4K5J0j66O2l7Q1n4MO0j53K28j69K4k3L3o6L5K4P4o9N5m8N4K5P2k45J84L7
3545I1k13jnK65j37k5J4j2K7R1j62l7J03O2o6R0j00m7J14J3rJ9j87K44j32j0l7
3572d7K6j10N8J8K59J2k36K4J46j14M7L2j34m8J02k9J34r1j2p5o4K22k45K21j41
3597d5M3j17O2L3K7r6J62j4j37J27P2k06J84j96J02O5k82K93o5n2p5J80j11J7
3621b9J3L8j1m2J45j70J71j32J2N4N1k41L23j33Q8Pk74J85N2l14K45nr5J62r3
3646Gp1P1L5M4j14j71K82q3k8L9P5K2p2n9j23J53L9j8M2o5n3Lk4j39J97r9L9O8
3674cN7j01J33k39O1J93l7m8Q7j41J70n4r7J19k53L41j85J15k2l1j24OL0O2j76
3699a37J46m3%k36K54J0o3J52J6q7r4J7J30m3J02p5m2j23J18r9l5J71j52J44n7
$$ y = [34, 59, 69, -97, -35, -72, 9, -45, -41, 19, -134, 94, -75, -51, -74, -41, -107, -72, -48, 26, -43, 12, -36, 18, 43, 115, -130, 54, 91, -122, -123, -128, 137, 0, -25, -11, -23, 4, 95, -67, -104, -1, 61, -5, 85, -15, -62, 52, 65, 56, 75, -112, 132, 0, -10, -47, -21, -131, -73, -55, 204, 216, -20, 4, 150, 36, 83, 115, -19, -67, 35, 6, 140, 49, 37, -38, -102, 120, -125, 96, -45, -2, -119, -57, -24, 3, -93, 69, 55, -82, 45, 117, -89, 95, -101, 1, 66, -216, 77, 12, -40, -115, 65, -46, -29, -16, 22, 11, -31, 114, -56, 115, -17, -5, 49, 100, -141, 182, 49, 137, 144, -130, 55, 107, -207, 38, 33, -62, 100, 7, -64, 7, 42, 86, -28, -199, 83, 0, -28, 11, 86, 108, 36, -23, -146, 7, 46, 28, 70, 5, -48, -45, -69, -208, -11, -110, -71, -3, 54, -47, 86, -153, -92, 101, 64, 16, 103, -38, 132, 78, -19, 100, -153, 188, 3, 118, 96, 65, -59, -53, -23, 39, -137, 9, -34, -34, -270, -16, -6, -69, 83, 99, 12, -82, -65, 65, 22, 124, 49, 7, -116, 2, -97, -132, 39, -113, 31, -26]
3724b6K12q1p1kmMj43J10R0j16L0olj13K75j81PrN2j3J24p5q9k5P0n8K6N3M9k5
3754F2j26K26r0q0k9M1j86N5j3q7L76J9j98j15P2QP9j76P0J16j48J51Jp3J1K02
3780A68k12q6J95J40j58j52N2K18N3j71j0n1R0j21J97k09O3L0q9J14P6j14k3L8
3804C8P8j03J36j35Pj70PP7Q6PQ0j42J38j27j82n4L81K7j87N0O8j03L5O5k64M42
3830B55l14R0q4J37o0r5M2K3l9L4Q2j7r1j0j6n9K01J32k25J4J2n9N2M4j33j07
3856a91K12j36J32k3M7l6n7J23j54mJ2O4k8Q4j86J73o9J84l12K21p1l5KR4n7p6
3882h7M6J01j60L9o4K20r8K4O8L7j48J39k70K36l13R0M0J24j64J06J28p4N9j82
3906a03J39N0j64o1K26lj9k35J01k2J51K3r9j11Q3n4O2O2j5j73K15j45N4n1J23
$$ y = [-26, 186, 105, 34, 32, 28, 32, -111, -1, 89, -27, 3, -3, -6, -119, 156, -25, -18, -27, 25, 12, 136, 61, -28, -53, 17, -41, -15, 38, 87, 62, -64, 162, 72, -8, -37, 4, -182, -127, -140, -227, 149, 168, -30, -145, -73, -65, 14, -162, -92, 24, -124, 27, 28, -45, -34, 168, -44, -130, 65, 205, 47, -105, -53, 165, 218, 47, 37, -14, 76, -45, 152, -57, 6, 36, -53, 61, 137, 23, 0, 38, 116, 13, 149, 14, 21, -149, -142, -65, 21, 28, 108, -34, 104, -23, -205, -259, 122, 149, -38, 12, 80, -23, 12, 77, -187, 255, -59, 31, -53, 84, 24, -71, -29, -6, -45, -11, 71, 54, -37, -47, -63, -122, 79, 211, -14, 0, 12, -47, 5, 49, -84, -191, 21, -115, 17, -6, 41, 5, -52, 71, -83, -87, -75, -11, -39, 45, -141, 32, -37, 147, -165, 56, -15, -50, -48, 46, -11, -87, -41, 60, -100, -61, -125, 95, -3, 21, 89, 126, -22, 117, -153, 83, -230, -140, -100, 24, -140, -34, 94, 20, 79, -103, 36, 86, -78, -139, 87, 84, 65, -170, -69, -91, 60, 83, -16, -127, -44, -98, -36, 26, 11, -162, 53, -92, -38, -89, 34]
3931C4P0p0j63Q1L9j7PJ7j58K33Q8k45J42m7n6j39J91O3Pk75K45J03j88O8J7m8
3957ak71L33n7j14N4J74j28J12j4j51J51j78Q9r5P0O4P5l26P6R0J05P9k31J0l4
3982a18J7o7K02oPP3j32j16K29O4j41j30J50OK5m3J55j85J49j77l4R2Qo2Q5P7
4008A28j35J07j56R6m8OJ22o4N7n6m6r4j32J60q9K17j21J56j03OJj11M8RK4J15
4034I7K8j72R7r5n6J48L0j03J33l5n5j4l8n9K00o2q8P0j98K05P0N6j86j87J44
4059g0N5m5oP5Q6n7K7q3k6PJ19j56K04j60K1l4P6k6J35j11ll0n7J26k5Q4j34L6
4087B8J25k15J64j34J26k82R1J60n7N2k73K0K30r7k7J46j18k3J88j25r0J22o7
4110e6L3jjq4J35j81J49J0P8j58OR7p7O8o7M5j06K13q0j24j00K32J50k7j20o4
$$ y = [34, 104, 34, -129, -48, -9, -26, -19, -2, -160, 73, 161, -84, 58, 11, -45, -184, 7, 70, 77, -198, 47, 150, -38, 30, 47, -1, -272, 61, 4, -110, -56, 118, -10, 102, 88, -63, 88, -90, -1, -96, -26, 38, 113, -213, -137, -47, 58, 137, -94, -84, -118, -101, -168, 34, 28, 35, 108, -24, -140, 89, 153, 12, -118, 32, 38, 63, 20, 175, -10, 139, -38, -72, 20, 28, -34, 51, 128, -7, 100, -56, 40, -8, -2, 120, 56, 113, 57, 11, -83, -215, -55, -144, 73, -48, 108, 5, 11, 12, -99, -51, -42, -18, 97, 125, -47, 50, -45, -101, 47, 77, -26, 107, 72, 17, 3, -35, -94, 106, 44, -44, 26, -172, 33, 103, 159, -27, -214, -70, -15, -60, -66, 9, 95, 38, 65, -18, -44, -37, 82, -74, 130, -30, -9, -43, 33, 7, 142, 31, 28, -2, -59, 67, 42, 126, -8, 28, 153, -62, 102, -32, 94, -188, -97, 63, 6, 58, -215, -195, 35, -62, -89, 57, -61, -84, 104, -21, -111, 11, -56, -23, -24, -25, -109, 26, -155, -6, 4, 82, -76, -70, 27, -50, 18, -49, -4, -110, 103, 23, -101, -201, 31, 181, 154, 34, -30]
4136c0O5O3l3j56P9r1k0J4J70p9o8M9J32p9k2j5M7j41J98j71P8K7L2or2P6j05
4163g8j13L34m5OJ2lp5n6J9n5J26j85M5J17p2k3O6o8K4K3L3j12J55l3J3j26J44
4190G3m8k52J67J5J42k27K65j46J0N2J04k09J06j12n6J51JR9j06O5L0j99J66p3
4214A8r7O1m7J48p6j60J50L1J84k79P4P9k5p7M4n7p2J48j06j4nk3R2p2k7K03m4
4241E1j8Jq4J38j4j5J0q2k5O1N2O5K8j41K8%J3r3J57k4n8j0m4P2k56J23OJ8Q3
4270D2J4q3J02j53l0K59l5j29j5R4l4N6o8n0N7p3J3K08j99pJ8j33J66L7p5OQj38
4298a42J73j4j33j9J89J18l66K95K7k05jlJ71q9J1m9l9Q0mk05K36P8j01R6j17
4323a3j18J81J22j11o0J16j7J8o6m9j39N7K16k13J09k03K54j57p0K16J04j84P6
$$ y = [-30, 35, 98, 65, -91, -12, -103, -123, -109, 61, -18, -86, -37, 95, 16, -6, -21, 26, -115, 83, -88, -10, 17, 49, 43, -49, 27, -78, -191, 143, 98, 104, 116, 113, 38, -18, 1, -54, 72, -113, -68, 49, -23, -46, 20, -48, -24, -1, 32, -80, 75, 42, 55, -71, 73, 25, -227, -60, -45, 97, -130, 135, -11, -1, 51, 155, -54, 52, -60, -116, 35, 36, 135, 29, 94, 124, -75, 91, 18, -79, -18, -65, 83, 7, -153, -3, 28, 212, -67, 7, 86, 61, -16, 28, -29, -101, 47, -59, -73, -78, -101, -9, -81, -108, 95, 51, 33, 34, -50, 88, 74, 59, 69, -13, -38, 23, 75, 140, 168, 27, 55, 55, 68, -25, 132, 108, 50, 40, -4, 68, -188, -65, -59, -41, 42, 56, -27, 75, -78, -108, 151, 116, -13, -28, 66, 32, 88, 20, -30, 27, -46, -33, 175, -24, -31, -13, -146, 20, 57, -18, -12, -4, -142, 31, 17, -116, -135, 54, 172, -194, 101, 128, -77, -78, -81, 90, 1, 12, -37, -76, 4, 0, -205, 31, 109, 8, 104, -13, -131, 50, 172, 61, 1, 117, 100, 118, 52, 3, -136, -79, 137, -76, 33, -170, 84, -73, -143, 73, 177, -7, 69]
4346F9m8J50j58J5n2o9pK38j53J1k1J1Qj3o0R9j26r2L10j5j68J32J68k07l9N3
4372C6k0N1o1J2Jk8k6n0L3n8R1O7o0M6j45R4m0k8K00k16J12j5k5L4j72RP2M7j47
4401a86R4J02r2RnP2M9Q6j57J41p8n0R5j28K07p1J0n6k5K0j31J16K8o8j27K81
4427A36j3j37o9M9j4r2R2N7j62J20J07M7o3K2j24R5m3J29j06kM2k02K10j33N5
4452AJ00q9mj11K25m3q6J2M5o1j07J19j4j5o5J23q2J91j87r9N4m9J76O0j27J27
4478I4k11M6L1J87n9Lj48P5l2R3j82K01n3J9P8j60rL1kr2K03n6p5K1R0j11L0o0
4506d8K3J47j81J68P8k66J37j00P5q0PJ53Q8j97j37L4L95l39J12N5m2j59K03j47
4530b1p9N4K16l5k39L39l08J08P6j35P0J02q1p4L8j15M0RN8J3l1J07j54j07J03
$$ y = [69, 21, 171, 13, 28, -24, -93, -100, 138, -15, -4, -25, -14, -6, -19, -79, 20, -106, -198, 112, 97, -71, 61, 229, 22, -17, 36, 16, 67, 6, 18, 19, -9, -35, -85, -52, -110, -19, 48, -12, 34, -111, -17, -57, -85, 115, -101, 11, -4, -29, 5, -167, -158, -86, -39, -186, -92, 10, -82, -73, -78, -6, 43, 129, -28, 113, 35, -15, 80, -48, 159, 88, 98, 42, 17, 37, -94, 22, 50, -18, -145, 136, 123, -14, -83, -34, -48, -140, -48, 9, -153, -33, 74, 121, 58, 80, -44, 51, 8, 137, 31, 29, 71, -131, 79, -54, 1, 101, 12, 8, -103, 122, 79, -7, 5, 50, -11, -118, 1, -13, -28, -93, 30, -52, 139, -48, -147, -93, -142, 34, 94, -33, 94, -117, -71, -40, 147, 88, 91, -57, 18, -14, 79, -103, 98, 45, 64, 142, -18, -27, 4, 2, -90, 113, 57, -18, 3, 93, -18, 12, -48, -25, 122, -59, 109, 187, -79, 58, -42, 33, -47, -40, 113, 201, 4, -133, -99, 296, -43, 69, 124, 82, -77, 126, -21, -100, -46, 170, 135, -104, 235, -73, 35, 111, -24, 46, 148, 67, -7, 31, -84, -44, -35, 23, 36, 5, 112, -42, -149, -46]
4555d6O9N7j34L4J48K1k41J16k06M27k88J10rq4K95l28K5n1j06J85N9j48k9N4
4579g0P6j07Q1N9qo0K18j97J14k55Q5J64k64K86K6k31O7P5j31J44k73R9J27J9
4603D4m9r4J54r3M1n1P3M6L3j76oO3O2j32N8J11Qk06J46Q8r6n7J84r5j86J06J53
4630A29r6L0j36J17M2r2p2J18N2o2P4q2k22K75Mk15O9K12j33q0J54p4Q9j66m9
4655a14J35P7k0r1K2L5mkN4j23J29%q0K44k74N1j2K57k88j98L17r0Q0lj5j09j
4682b3j67K65j36j65Q4L4J84j08J05n7m0k6M8qj64J70p8k8J82M5j58P5K0k04P0
4707h0J42N9k55K70j65O8J08j17J18j17rN5m4j02j20K74n1m2L4j14K6Q4M4J02
4731A68p7n3l3j08N6O3q2k3J91l40K87m6j09l7J20K49k20m4R2j90J18j25J72p2
$$ y = [-46, 23, 80, -54, -20, 128, 149, -92, 24, -182, 245, -43, 67, 58, -26, 269, -59, -34, -85, -191, -6, 53, -95, -124, -70, 6, -101, -20, 39, 31, -29, 189, -8, 106, -149, -64, 100, -164, 122, 148, -83, -16, 59, -72, 72, -201, -102, 25, 44, -5, -99, 55, -38, 3, -48, 25, 71, 104, -72, -78, -15, 47, -85, -27, 84, 92, -114, 32, 120, 24, -33, 151, 56, -130, -24, 129, 33, 63, -73, 44, 86, -6, -78, 40, 92, 30, 104, 22, -200, 75, 79, -136, -67, 145, 12, -68, 86, 12, 101, -65, -114, 21, 98, 78, -13, 9, 44, 40, 38, 92, -31, 98, 98, 18, 262, -12, 39, 27, 284, -4, -202, 115, 25, 105, 102, 87, -22, -23, -190, 75, -61, -226, -142, -108, 76, -32, 73, 16, -24, -50, -2, -10, -174, -4, -82, -110, 72, 117, -41, 34, 54, -150, -80, 62, 121, -134, 136, -29, 39, 147, 30, 148, 31, 22, 77, 33, -69, -189, 85, 34, -8, 26, -88, -62, 22, 66, 168, 91, 38, 5, -103, -47, 16, -66, -89, 102, -238, 49, 3, -106, -143, -23, 226, 6, -38, 54, -136, -18, -143, 29, -43]
4755d3N4K0J08j06p0j31K05o8J33k32LN5J82j45Lj04J99j66J9N0J39Jk26J26N4
4780F0j1L3P2j63J22j52R2j2J01k42J77n3k7O3k9j32O7N9R3k05J41j21J06M0N3
4805A32j28k0M1J3O1r0M5j37K03j10P6n2N2PP2k21l2J16k7N1j09K29j10r5L1R5
4831I3j43l7L9J09k3Q0j78J9pJ16kJ9j19M4p2J24j11N8J41j32P7k02j07J65J29
4856H0j63k4L8J08r8p3M3M7l0J00j54J18L4LJ9M6j17j75K25l1%q6R0j94K67P8
4882A51j67R7j24J03M4l07K83N3k02j14J12K12M6k08J23j54K4Q1q9j9J10Oj64
4905a03J26p0K05j95K8o2J4R5L6k4Km3p4qL4k4J64Nk07k3Q8J1j0J25j47Ll8J13
4933B1q8P1P3P9k24j1j10K43r8N5n1J59j1p3l7O4m5o6J15j19J32r9O7m4k4K17
$$ y = [-43, 11, 31, 139, 33, -37, -168, 37, -31, 102, -130, -127, -72, 110, -35, -32, -136, 63, -103, -84, -34, 105, 106, -120, 6, 60, 49, 82, 154, -9, 113, -39, 53, 41, 142, -100, 77, 24, -3, 60, 31, -101, -34, 25, 118, -87, 54, -67, 39, 79, 132, 4, -16, 25, 38, 99, 9, 54, -83, 120, 10, 86, 34, 86, 93, 165, -56, -88, 28, 1, 52, -57, 172, 62, -33, -2, 93, -50, -87, -48, 61, 38, 118, -60, -41, -48, 68, 66, 85, -34, 10, -62, 62, -49, 9, 150, 18, 95, -107, -214, -49, 80, -83, -107, -69, 39, -59, -132, -89, -42, -72, 28, -126, -8, 26, 29, 48, 94, -23, -198, 27, -4, -4, -90, 0, -194, 73, 151, -16, 81, -43, 60, 104, -203, 80, 133, -69, -183, -71, 141, 187, -21, 102, -52, -28, 53, -36, -55, 55, 61, -103, 23, -47, 158, -37, -9, -71, -57, 38, 74, 50, 52, 9, -65, -73, -39, -63, 101, 106, -101, -124, -36, -25, -35, 90, -57, -54, -92, 21, -67, 4, 77, 156, -68, -79, -189, 54, -44, 11, -40, 119, 108, 35, -2, 62, 17, -49, 66, -53, 79, -20, 47, 3, -21, 196]
4959A96k71L5M8m1l7N7P4M5k11K4R8n7O8O1j23N9K5l8K2m7L2j12P1K44l01K3O5
4986Im0J07j32J31l9k%J13j87J24q4Ok1J21r7M0J66j47j4k9j40K11o4l8j01Q0
5012b7J05j62R2J10j79R9j96P9Q5n5kJ23j56Q1O7j06j09J62J69k20M8N8n3pJ93
5037A99k54j1K20l07J02M8k0N9n9N8J41j14ML0k1p9n6J63p2k0q9L9K4n2J70M6
5063A49k85P8R2n1j13L2P2J1M1N9r7P5j36K25j82q5N3J57k21J21QJ0J10j55M1
5088IOL2p5J68j61J34J28l37R2R1j17J12l1Q9j88L8J00P2j06o6P7j40Q0O1j63
5113i5Q5kj66K35j09Q0r0J9J45J1k02K79k50J84k00J71J24k23nj71K2J79o4J06
5137F3n4L5K8j60J84j79J82j12J29n7o8o4J81j93J30K7r9Q6n1M4m4J62j44k1j66
$$ y = [196, -75, -40, 8, -33, -70, -13, 61, 106, -105, -81, 17, -40, 28, 89, -34, 25, 50, 12, 34, -13, 19, -93, -22, 222, -79, -56, 9, -31, 76, -56, 75, 36, 34, 34, 147, -40, 84, 0, 6, -15, 106, 9, 49, 215, 68, 54, 25, -115, 96, 32, -6, -107, -27, 78, -84, 8, 118, -61, 38, -158, -79, 6, -49, -51, 72, -84, -3, 64, -42, -151, 11, 180, -40, 8, 66, 13, 6, 199, -55, -66, 154, -153, -51, -3, -23, 36, -23, 35, 176, 62, 66, 96, 75, -4, -60, 103, 31, 11, -78, -39, -15, -67, 103, 149, -136, -58, 34, -17, -130, -98, -26, -15, 26, 85, -12, 63, -73, 152, -30, -115, -62, 95, -126, -5, 3, 13, 123, -32, 9, 15, 47, -28, 140, -21, 113, 241, -96, -4, 87, -30, 82, 51, 140, -48, -10, 90, 162, 56, -10, 67, -73, 7, 68, -95, -10, -12, -178, 57, -52, 28, -62, -43, 102, 113, -89, 190, -60, 124, -76, 95, 219, -4, -9, -180, -158, 21, -43, 63, 9, 44, 72, -88, 96, -83, 99, -13, 116, 59, -9, -73, 108, -85, 45, 72, -27, 59, 8, 52, 8, 170, 26, 5, -161]
5162a61J45Q2m8r8K4R9n6n7J62j15J6P6o4j6N8n8o9J34p9J10j21N3j24M5L4J2
5188a6o9N7m7J83p9kN5o0m5j6P3j65J71m9m0o4J58J6l9l9K70k03j50J47k2J56
5214A81j05k39L19j97N6J5o3P6jJ2l8k02K98K5j71L7qMMN0j24K6J4j3L4MJ0J0
5242A4J32r6n0l9j13J84j08j25R6J67P7m0j44J37j09l4N8L2Q1k27R4Qj95J14n
5267i1R9o7R2j09J67k05J92K53k45j84j1K1J49K5j60J04P7j97J58N0k04J30j01
5290e7j1P4qKp8K48j32Ro1J62j68l5jL3L7Q1m7j66K30j74j15O8K61L4k05N6J29
5317A66m3k20J3K69k41N5o5p8J07J54j37o0L8J50j16j1n9J44r8R2J08j16j50J20
5341B2MP4r5L6N6k4j63P0Q5j51J10m8k23K24L7j91K81j0r6L6j81K50m9k0K6O7
$$ y = [-161, -16, 66, 18, -80, -56, 43, -13, -70, 92, -23, -7, 69, 5, -11, 47, -11, -80, 54, -25, 85, -36, 17, -107, -62, -28, -16, -85, -28, -75, 108, 29, 27, 82, 22, -23, -39, 34, -131, 40, -9, -49, -113, 45, 61, 22, -17, 253, 50, -100, 47, 25, 181, 76, -163, 156, -41, 15, 30, -33, 43, 42, 54, 16, -186, 112, 137, -34, 3, -5, -1, 3, 53, -71, -45, -31, -44, -10, -6, 4, 14, 146, 50, 0, -39, -152, 32, -76, -201, -105, 62, 139, 99, -45, 92, -17, -51, 7, 39, 120, -107, -13, -5, -200, -86, -91, 8, -59, 33, -76, 91, -114, 78, 331, 86, -98, -109, -88, 61, 86, -74, 30, 107, -90, 68, 118, -86, 44, -57, -68, 6, -2, 0, -78, 170, 38, 47, -14, 148, -20, -55, -56, -23, 14, 95, 48, -118, 112, -62, -177, -109, 152, 186, -19, 37, 166, 123, -97, -84, 185, -56, -1, -66, -144, -37, 117, -20, -80, -42, 108, -8, -19, -78, 66, -32, 60, 168, 52, -98, 22, 26, 100, 5, 41, 97, 73, -90, -20, 65, -86, 24, -24, -247, -23, 14, -177, 104, 94, -2, 34, -147, 103, 54, 34, 60, 127]
5367A27mj33o0J84k5M8j18l9q1Q9R2j18j38J53P0R1j35o5J14k0k4QL4L7q2l3P3
5394D5q9J10j86N7j1J19j24KmJ4J36j87L8m2J51M4m9k93K42J55j15Rr1l5J48Q5
5420A29j16rj49K15Pj93J59r0P8k0k0k1L7qk5Q6ll4j30K02j42r3K33j21J25n8
5446C9K0j5n7j20J68j08K43J1q3k15M8j50L40K2k02J98k76J66O0j0k9J17j09j0
5470D8R9j53J3j31J43n2Q6m3p8L4q4J38j75J9P1J61j70K5K8P1k20K29K3j57k6
5495a01K46k08J11N9r7p0J99k7Qn8j50Q3j91M15k68J57j79J92j18O5R5j21j9n9
5519c6Oo5J13k8K1m1k9M9RJ21j82J52j08l5K27j58Q5jj65J37j28K6M3N2o3k2R1
5546G1k40k3R9J50Ll0k05K08K3p9k0q2K06k13J98o4o3K20j31n5L9kk3kN7j8k3
$$ y = [127, 123, -10, -70, 114, 89, 137, 19, -20, -101, -12, 80, -38, -176, -23, 47, 138, 3, -62, 52, 32, 8, 16, 50, 87, 5, -28, 45, -44, 66, -120, -63, -74, 45, -79, -77, -81, -67, 69, -118, -80, -122, 29, 73, 24, -269, -27, 128, 13, 22, -69, -104, 44, 129, 13, 4, -145, 70, 77, -116, 43, -47, 31, 11, -9, -30, 7, -1, -26, 60, 57, 23, -107, 95, -47, -140, 93, -28, 97, 39, 59, 44, -13, -133, 35, -73, 170, 181, 98, -117, -69, -219, 121, 143, -59, 139, -137, 29, 89, 79, 50, 167, 58, 48, 147, -6, 7, -124, 19, -33, 53, 10, -68, -34, -118, 20, -155, -136, -65, 96, -74, -49, -21, 50, -170, 59, 82, -75, -101, 145, -63, 48, 107, 10, -60, 139, 112, 120, 62, -88, -5, -196, 219, -49, 108, -71, 121, 3, 68, 163, 42, 23, -36, -30, -95, 18, -10, 11, -30, -59, -10, -1, 120, -62, 90, -18, -53, 174, 16, 101, 100, -65, 72, -56, -30, 13, 65, 2, -20, 71, -169, -192, -93, 57, 60, 30, -175, 33, 56, -23, -43, -125, 81, -132, 66, 2, -61, 159, 28, -27, 12, 10, -13, -15, 42, 24, 1]
5573AJ85k19Q4k6j35J97j14J2M3l8J8Q2o8j68N9J02M9Pl3m2K13j15J10l28J81
5598E7r6p8j03J04J42p1P6R5n4J7o1k9j3J4l9q9J01n8J06j07R8M9j74k5J49l6
5624b5Lk4P8m7Q1j81J36rR6j61j08M2P9K41j41q9K6Nk8j1p7P6l4J33n7j49K48
5651A03o7j62J34O9q0J08j79R2j3l2j12J09J47j78K9k1M9NJ03k16J57jJ40j97
5675a3k58K68l0RKk3J14j45Q8O5J9j4k45K12K10l93J55l0j80K27J10j73J64k32
5699i3m8J77K0j62L9%J25lj01l1L46l51J16p4n1J41p4J09oj04J34J1p1RO9j66
5725c9On3j0J07N5j05r0K04j52J35%n6J08o9N5j91J50p1P6p1j38K03P8j01j05
5750g4o4L6J09K35l8p1p3l2r4K68k12L6Rk7j29N9N2K0KN7j06m6J57j65Q1P6j9
$$ y = [1, 186, -33, 51, 25, -110, 87, -27, -15, 28, -10, 8, 90, 22, -146, -87, 15, 64, 71, 38, -4, 209, 94, 204, -124, 57, -39, -117, -220, -116, 26, -45, 31, 126, 72, 89, 28, -1, -14, 0, -39, -128, -27, -85, 21, -86, 12, 61, -113, -138, 11, -25, -22, -46, 32, -15, 66, -115, 21, 12, 108, -53, -161, -119, -40, 201, 60, -29, -3, 2, -26, -37, -114, -38, -72, 61, 4, -145, 103, 36, -126, 8, 77, -3, 105, -74, 18, 5, -27, -139, -30, 117, -61, -32, -53, -4, 1, 104, -112, 45, 44, 184, -13, -271, -3, -33, -24, -22, -45, 69, -76, 12, 77, 96, 82, -163, 49, 259, -134, 21, -9, -189, 38, 148, -25, 139, -93, -141, 36, 56, -106, -67, -67, 58, 55, -46, -77, 269, -82, 34, -40, -91, 50, -24, 85, 79, -25, 109, 120, 49, 58, 127, -39, -33, -86, -96, 11, 66, -39, -129, 75, -77, 58, 58, 2, 110, 41, 96, -95, 55, -16, 60, -11, -149, 54, 132, 31, -74, -138, -102, 7, 242, 204, 133, 60, 28, -66, 202, -10, 26, 35, 8, -121, -62, -10, 10, 12, 69, -37, -83, 74, -91, -10, 66, 47]
5777D7j37k5M0J89m2k8Km3l16L27J1j96J17Q0j87K76r7m5qk9J07R8r5j43K47r9
5803E1j6j72J11o8P7O5j34J96k37p0J85J08l5j49N1O6Rj52l6K19J1J2r6J21j8
5828I9k1ql1j57K23o9j24J8J87q1p7M1kr6l9R9Q0K8J9j1l8l5J2o4j04Q8Q9J1N3
5857I0j72Q0M4j14J73k07J32o4q7J22o8K8K0J68k14J12J30j62L5o5%J17q5k05
5881a92L56k96R4R1K3n1J29r6j09J01j2q5n9k5J73j28K03j56j8L7j17mN8q5K79
5906A11J1j52J63j32l1ON5j34rJ14k9n7J19R9m3n9J08p2P6j42K0o2l0RJ05k%j29
5934h7L01k07k4p0k0L6N8o2O4N0o0J4R0M6r0J4j47O1J88k08l7J50pO0j70O6p2
5961f3o2J44k5j33K26j48j8J56%L6k6q0J9j73K19K0M5j52N2n1J42j98J16j18K60
$$ y = [47, -90, -115, -75, 114, 72, 44, 46, 3, -313, 14, 25, -171, -54, 26, -161, 115, 18, -27, -35, -64, 43, 141, 46, -97, 150, 51, 35, -137, -26, -94, -17, 48, -86, 110, -127, -197, -12, 96, 61, -88, -37, 29, 38, -114, -150, 69, 80, 92, -4, 117, 99, 78, 70, 39, -118, 105, 36, -88, -70, 117, 36, -41, 0, -2, -98, -137, -38, 42, 70, 89, 78, 40, 5, 17, -47, -151, -63, 26, 37, 90, -82, -2, 42, -72, 101, -106, 26, -38, -125, -3, -71, -43, -23, 145, -69, 43, 173, 11, 46, -19, -19, 98, 13, -192, 164, -132, -38, 53, 76, 25, 154, 58, -51, 50, 38, -47, -106, -131, 42, -86, 117, -39, -57, -20, -137, -141, -83, -168, 111, 122, -30, 133, 1, -30, -24, 31, -103, -112, 2, -27, -84, 35, 134, 91, 32, 140, 68, 144, 2, 22, -40, -70, -61, 44, 42, 42, -87, 214, 7, -17, -87, -107, -71, -13, -75, -11, 39, -21, -7, 83, 129, 39, 53, -94, -33, 155, -53, -90, 60, 53, 113, -57, 9, -63, -125, 19, -6, -139, 87, -61, -79, 77, 77, 113, 87, 7, 26, -147, 72, 92, 137, -15, 37, -14, 128, -70, 46, -72, 188]
5986A88j61N4q8KJ23l19K15j27K21j05rK5P2j25K9j86K85Q3k04M9J49j63q9N3
6010b8J9m0J47j48J76k09n9K88k4o5j04J95j00r7N9J8n3J64r7j38K2P1oO7J6m0
6036C4k1j14J63j56OJ76j51J14J18k85J75J03rj83K8m0J46m2r9p0N7J47j45J63
6060A15j03r9P1oP4L4p0J75j70O5n9qJ8j1J8j18J05J2l7O8j05P9J1J9P9q8j23
6087e4R9J25l12J74n1L6j36J52M6j33K40j68O7p7M3j31Q8m5N1J33j61j5qk3QN0
6113bj45J13J44m5j9p7J86j92k0m4L4J31j61J5P2J11k70K34j85R4k2K03q1N8k15
6138h3J79j76J8PL0J0L3M7Q1k81J06K6l5J86j97O6j9P2n0p9o0J26MQ1r3p5J89
6165A13j33j09J30L1J52k05L7l2J2Op4r0J73L4q3P0j68J85j43J65J09k59J19J02
$$ y = [188, 27, 81, -7, -5, 118, -201, 14, -113, 108, 3, -6, 19, 91, -34, -5, -191, 94, 177, -27, 22, 171, 8, -81, -28, -9, -49, 98, -50, 126, -83, -142, 146, 122, 57, -47, 148, 48, -49, 10, 28, -25, 139, 42, -96, -74, -3, -9, 58, 74, 34, 13, -101, 62, -94, -88, 88, -63, 51, 169, -116, 59, 162, 153, -30, -2, -42, 104, 62, -37, -107, -50, 97, -48, 115, 12, -87, -16, -22, 52, 86, 16, 191, 21, 86, 27, 19, 37, 26, 44, -74, 31, 43, 6, 74, -31, 48, 59, 78, 157, 69, -54, 45, 170, -142, 32, -19, 17, -119, 33, 79, -54, 186, 18, 85, 8, 51, -80, 8, -37, 14, 147, -14, -29, -37, -60, -52, -2, -147, -34, 110, 65, 46, -31, 155, -37, -57, -101, -67, 64, -97, -82, -10, 101, -169, 65, -120, -26, -48, 155, 74, 132, -83, 96, -80, -62, -55, -25, -15, 18, 65, 146, -135, -29, -3, -38, 148, -49, 17, -2, 70, 20, -59, -119, 7, 11, 92, -1, -76, 113, -20, -129, 1, 32, 184, -21, 16, -16, -4, 2, -72, -162, 11, 45, -38, 32, -136, 49, -94, 71, 180, -79, 40, 142]
6189A42k04P0q9R8m9J06q9o7K27q7M6J8n9k02K63k27K34j71J59p1Kk7m3O2j12
6214g0l6K14j35J33j21k4J11o6J2j1N2Q9j70Q2Q8j11j37J66o5L3j23k5P5n8K03
6239A06j56j4M3j04J82J7j42KJ60p7j06J30j22o4R9J10j51J44%q6n0KJ50q9k4
6264d0J3J55j14J12j93o2O4M9kp0P9M4k02Q9J31o6J7m5k5P2j11kJ43J9j21N0O2
6291D6M6j12j22j8J68j4j5QQ9k48J46P8j9pL6j12Q6j15P9p1K64j53j26K13j57
6316c0p1O8O2M5k06J44k0j50J54J20k82J05N9Lj64R0J06J01k29N4N5R3M9o9Kl3
6342E6o3qj34J50K2l9J1j22P3L1QL3k73K49k26M9Q9K03Mp9M1n5pP6r0Q4L7j40
6370b0J1o2J19j05K06o1rnj08J20l3j3jn2O0n4N6j71J93m0K01j74R1Q4k67r0K26
$$ y = [142, -62, 8, -81, 17, -32, 74, -15, -82, 145, 58, 104, 122, 63, -139, 124, -103, 131, -40, 119, 48, 50, 23, -20, 42, -70, -106, 108, -27, 106, -15, -39, 72, 6, 18, 7, 59, 148, -22, 60, 148, 37, -100, 66, 1, 34, -89, -114, -39, -97, 106, -50, -64, -21, -125, 57, 74, -68, -66, 94, 17, -89, 41, -81, -145, -46, 64, -87, 57, 57, -29, -79, -77, 73, -16, -40, -27, 128, 14, 126, -67, -129, -65, -16, -18, -88, -9, 35, -167, -78, 53, -13, 4, -41, -66, 6, -105, -107, 36, 55, -66, -16, 46, 92, -20, -142, -160, 8, -6, -21, -13, 76, -172, -26, 52, 33, 26, 62, -50, 36, -79, 0, -71, 193, 40, -86, 127, -30, -101, -33, 29, 74, -132, 12, -8, -158, -4, 116, -166, -61, -2, 1, -163, -73, 33, 134, -95, -41, 14, 107, 156, 87, 89, 56, -7, -15, -149, 1, 23, -16, -5, -127, -54, -23, -15, 18, -255, -6, -232, -183, -94, 109, 113, 34, 75, 20, 13, 89, -1, 83, 120, -20, -9, -71, 48, -57, 149, 88, 79, 74, -34, 86, 53, 40, 39, -13, 47, -7, 49, -122, 71, 31, 232, 58, 149, 233, -34, -124, 102]
6397A02j51N1J6L1j33P8P2L3l26J97J05k47K05J35j49JO8j75n6N1j7J00J52r4
6421D9L4L6o7j16M0K11j86Pj35J48j51J87j18J11J6k5kj49K78k13J77j42q9J48
6445D9m8q1%J6r8J80j05O0j30J30K04k14O3p2k6P6l4J56j88L2k4o5J92k25J07
6470d5J67m7pRor4K7j37K77j19n8q7O5K1Q7j07K7j04Q2R4K1j59O9j0pJ6j3n6J48
6499E4l1J14j34Q4j19n3R1j34O3n3P3%q5J61J1j02oK06j82J1n6J29m4pR7l6p9
6526b7J66j28P3k4Jk39J19J70k02J92j61J4L4M9o3K2N5O9k39J05lkj83J62N1r5
6552h4J63n1J24j61J19k06J16M8j9q4J52j25Mm0Q8mn2P9Jj83M8J34mK9p2j1K4
6579C3O8j11J1K1j24J22m8O6n8j7K5R6k84J36J80j60O8j08R1k7Q0pJ2o3pJ36l03
$$ y = [102, -49, 2, 18, 49, -84, -6, 66, 99, -227, -30, 75, -172, 33, 168, 19, 20, 88, -87, -143, -92, -109, -9, 143, 49, 83, 119, 52, -64, -24, 187, 1, 8, -127, 21, -130, 57, -61, 50, 66, 41, 39, -110, 168, -45, 132, -10, -99, 49, 1, -80, -80, -64, -162, 18, -87, -27, -157, -27, 177, -37, 26, -46, -72, 4, -30, 126, -62, -30, -54, -119, 73, -152, -45, 122, 75, 68, 77, 71, -23, 4, -133, 144, 25, -33, -120, -55, -34, 53, -54, -27, -131, -49, 45, 66, -93, -24, -34, -41, -25, -38, -94, 54, 23, 137, 3, 87, -32, -85, 6, -128, -65, -118, -45, -45, -130, 31, 42, -60, -66, 140, -42, -31, -87, 42, -2, -9, 88, 52, -27, 139, 11, 84, 60, 61, -178, -59, 111, -91, 101, -60, -46, -12, 37, -26, -4, 51, 120, -119, -14, -17, -19, -202, -40, 11, -84, 79, 28, 152, -9, 110, -96, 20, 68, 49, -35, 117, -8, -4, -44, 44, 40, -12, 67, 68, -115, -67, 67, 63, 92, 20, 9, 33, 101, -10, 1, 22, -102, 20, -28, 38, -20, -37, -12, 84, -200, -64, 116, -44, 24, -84, 7, -20, 60, 53, 65, 2, -5, 131, -172]
6606a72N3J93j27M6L6pj01mk5K46r8M2j38J47k3k76J39J52j52m7J14J8m5p4J68
6631F5r6P6j33R7J63j73J7J11j47K6m5N5p2j00R5O4k2K3n1J12l4R1Q4l17l4N8
6657h7J66j32Q5KO0j84K48k28J25j03Q7nq7Q7j41j1K07p9P3Q2k10j67K14M1R3
6682A36j66L2kQ6j91R5J65j19p1m5L3J65m1j43Lm9K5J37P4j03J01q2K6j82K30
6707A14l2P3l8k12ko8n0L11J3j07J16p5j66L7Q7qN4j29Q5M3p9R1m7o5J3j1L2l8
6735e8L8J25j83LJ04r9p7J39m3J1M1n0m9J57R0j45jN6M3pN6j41k16K60k9pm5K07
6763A80l07K8J72k26K40j10J2L1j12N3J01j29J00P5J2o7q3kj87L21j23Nm1r2J16
6788c3jM8R0Pj45R0j3K2R0j49L7o6M2k6M0q5J73q9O8k9r2R3l5P3p7K07l37K29
$$ y = [-172, -119, 74, -53, -7, 29, 22, -79, -83, -108, 138, 40, 82, -56, 91, 68, -208, -69, 83, -69, -116, -2, 16, -29, -103, 65, -31, 45, -88, 9, 172, -1, 16, 127, -20, 6, -39, 16, -56, -156, -61, 3, -19, 4, -47, 65, 31, 122, 206, -111, -145, -87, 79, -53, 32, 34, 94, -90, 158, -70, 55, -48, 39, 34, -53, 34, -107, -118, 89, 10, 83, 165, -45, -212, 2, 43, 136, -30, 2, 0, 86, -105, -10, 155, 36, -35, -80, -47, 118, 77, -66, -63, -112, -87, 50, 124, 21, 122, 40, 66, -116, 114, 82, 155, 117, -95, -97, -165, -215, 96, 109, 2, 118, 43, -123, -86, 1, -7, 47, -82, 3, 46, -33, 58, 11, -54, -41, -52, -20, -58, -20, 105, -78, -75, 29, -70, -147, -8, -51, -40, 1, -49, -98, 59, 149, 4, 3, 59, 102, 95, 151, 10, -206, 54, 25, 18, -27, 180, -127, -99, 73, -153, 87, -23, -11, 20, -92, -39, 62, -67, 33, 108, 120, 53, -30, -32, -219, 102, -21, -16, -57, -149, -33, -34, 14, 104, 111, -34, 56, 43, 65, 155, 6, 43, -23, 19, -7, 33, -52, 121, 32, 100, 71, -21, 72, 37, 110, 33, 240, -97, 132]
6816A32j33P4L0k64M3N0J14j02J03m6Q6j74N2j5r0Q0R0j07J00p2n0J21L3j07p2
6841a24N9Q8r8j6M1O0q1j24L59j51KO7m8j48J6J35j94K43k26J45o9J25m8Q4j19
6866b2oQ6p6n5L7N7J5q1K1K0J1j01J20j51J09M3j17J88k52K60n0pj20N2k6Q0q0
6893d5J25l5j24J18j12R7J28n0j25k1J4N6L4qJ0R6j57L1j19P6l9K07m6Oj10p2
6919f5J42l8j10%P4oO7j43J50j58K74m7j01Ro5j87K50M7l04Q9J33j04J09J01p0
6944D7q1j05J34n1r0P1Rr5K71l7j0K4M6j41R8l6r8q2J28R9k7Kl13J55P7n8J36
6971G3j68MQ2Q6ok31J88r1R2j07%P3K4K5O0p0O2k69J49j1k0j19J44J40J0p8j03
6998f1J61j2j48l3K04j72J48o1j00N0N8n5J1j10K27o2j35J50j12J18o8J79j82
$$ y = [132, -1, 73, 103, -161, -118, -68, 46, -56, 47, 1, 87, -87, -35, -50, -140, -60, 30, -77, 23, -49, -99, 22, 55, -52, -124, -65, 23, -75, -91, -50, 10, -71, -195, 164, 13, 15, 82, 34, -114, -98, 37, -157, 86, -140, 5, -64, 61, 13, 97, -22, -28, 58, -18, -73, -36, 21, 36, -45, -24, -4, 7, -94, 26, -125, -16, 27, -90, 98, -154, 106, 56, 49, -71, -19, -45, 35, -45, 80, 45, -79, 39, -73, 24, 152, 102, -23, -44, -30, 26, 60, 52, 62, 158, 1, 32, -87, -11, -50, 157, 111, 117, 7, -65, 77, 39, -71, -71, 3, -3, 64, -79, 71, -87, 187, 140, 39, 48, -17, -204, 46, 93, -211, -122, 11, -93, 16, 117, 47, -34, -139, -5, -56, -146, -75, -66, -161, 110, 73, 63, 87, 133, -8, 90, 54, -44, -126, 2, 101, 74, 76, -237, -82, -5, -63, 73, -95, -91, -9, 77, 71, -160, 28, -63, 29, -78, -78, -5, 19, 44, 104, 34, 96, -173, -24, -35, -55, -174, -30, 110, 120, 42, -61, 100, 88, -60, -93, 111, -61, 87, 26, -74, -24, 34, -21, -10, -120, 107, 45, -90, 60, -52, 66, -2, 177, -5]
7021ej16L5NJ19j43mL2O3j21K38j11K3K01l04J16j31J53j8n5N8n1K7m8N1lNJ52
7048A68k04p3K5N4Q5L9J35j82l0J86q3o4kJ0N2o4j27J50Q9k36p3J37J48j87M7
7073@l9M6j41J25o1K6p5P6J2p1J69L1n3j03JJ86j55J52q1j16J68j43N1K3j47J34
7099A5l9J08j03l3J66j39M4R0j59K12k65j5K9p4K86j03j32L4R9J03j87J31o3j06
7123a01k4O8M1J47j39o3J22j26m4J77nJ03j55l2RKJ20k26K67r7N6q0K9j07j3J14
7149D3o1Q3j40J6J32J26l04K62j49j2K23k81R8j38q3N9rK11j44PQ1J47j74k9M8
7174A2J04q9Q0l8k3l9j1n5P0qj20K14k9J11l68J02j7J06n0p7J03jO4K9r2%j16
7201a38J28Q2q0LJ10j47JO5j08J03o4qM1O1k4K4j7j96J31M0L5k9J7%L0J3j04j30
$$ y = [-5, -121, -86, -81, 38, -105, -109, -77, -14, -135, 103, -8, 15, 216, -88, 28, -103, 50, 32, -23, 35, -16, 11, -37, 14, 11, 16, 168, -36, -109, -84, -30, 55, 94, 229, 47, 17, 203, 120, 56, 54, 64, 116, 52, -75, 75, 164, -72, -145, -8, 140, -47, 0, -39, 7, -134, -9, -70, -44, -119, -43, -31, -102, 67, 98, 45, -58, -57, 129, -26, 126, 45, -71, 97, -46, 5, 28, -119, 15, -24, 84, -19, -52, 114, -25, 19, 109, -50, 162, -103, -118, -89, -163, 123, 20, -112, -78, 21, 124, -63, 68, 5, -101, -125, -57, -16, 131, -8, -71, 51, -75, -119, 58, 53, 156, 1, -31, -22, -20, 100, -126, 141, 44, 100, 20, 49, -58, -71, 43, -18, 65, -75, -59, 73, 199, -105, 157, 8, -4, 219, -62, 36, -102, -185, -126, -135, 76, -68, -61, 20, 167, -7, -36, 12, 116, 27, 107, 69, 46, 7, -4, -59, 11, 3, -117, 97, 68, 179, -189, -87, -104, 2, -48, -125, -22, -23, 41, 70, -22, -22, -138, -10, 72, -8, -5, 105, -42, -41, 24, -84, 19, -45, -53, -12, 49, 25, 49, 32, -164, -33, 7, 42, 13, 30, 30, 60, 73, -31, -161]
7229a61J22k0K6m3MN9j09N9R0j49Q8kNm7P5o0Q0m3n9o5J45J19j33l6J22j47P4
7256fL32j75k64K15k46J77j11L3m0j63K58J1J01j71J52j52P4p0L4j33Q8J02N3
7279I9j18M6P2k34R7L7k9K7k9M7j41J52Qj69J80m1o9P7j19O9N7J79k51K3k4J28
7305G4j55KK0J53j81Q5J81l6j21q9M3j27J11J97j49k5l0J6L2M2j06R1k07L65j31
7330E5o2M3n1P5mJ03j08M4k16L5jJ43m3j07J44j44J55L9Q1n4k03N5J29j48J91
7355A51j47j8M7J42r5j26N6J28k9j92O3m5J41p5K5k8o3oo2J73l7r0rmm7K70j82
7382e9M8J9J72l63K0K08L9l6k6P9j9j7J25k28K3k01K41j20Q1j03K36j56J11j01
7406b7j9J3K0j61J94p2r3J36j18J43j10Q1N9n2p0J05j47K28k17J38Q1o1r0K1K
$$ y = [-161, -39, -59, -33, -76, -72, -13, -122, -63, 27, -122, -34, -36, -31, -78, -3, -63, 17, -26, -85, -150, -5, 114, -19, -55, 67, -80, -6, 326, 151, -113, 102, -144, 33, -78, -45, -85, -248, 10, 21, 122, -49, 103, -49, 25, -45, -11, -144, -56, 46, 99, -19, 27, 99, -135, -38, -1, -30, -3, -32, 15, -126, 26, 34, -135, 45, 4, -65, 12, -107, -38, 19, 198, -53, -30, -54, 74, -81, -79, -59, 94, -87, -2, 179, 143, 22, -67, -24, -151, -40, 157, 8, -17, -47, -31, 1, 43, -63, 28, -179, 186, 55, -7, 36, -15, 60, 56, 159, 51, 95, -121, -86, -87, 56, 13, -94, 50, -94, 61, 100, 181, 127, -76, -21, 108, -40, 151, 4, -14, 33, 175, 80, -46, 10, 138, 109, -83, -20, -65, 76, 1, 26, -2, -65, -71, -133, 40, 3, -87, -96, -100, -147, 123, -59, -11, 8, 180, -183, -163, 45, 84, 48, 22, 101, 82, 65, 190, -38, -15, -216, 25, -95, -14, -117, 119, -37, 74, -27, -46, -33, -13, -174, 20, -52, -145, -9, -127, 16, -94, -13, 46, -6, -76, 29, -118, 110, -107, 31, 112, 51, -39, -18, -16]
7431a6Q2j74K04j59O7r8J84L8n5Qr8J17r5m4O1m0K8Q3j31J14k30J86j1R4j45J36
7457A06q8l2J97j08plk67K02J93l04J78p1l3J0O9m4j13J65j42P3l2Q8p2K07j46
7482B6K3j65M6P1O8m8j45QJ66j1j37N1K0n6k7J02L5l4n8R2P0O7j84R5r5j11M2
7509h9M7jMr4J04J02j30P7r0O1J15k57J02P5P3R5j90pj28J94o1M7m6Rj89K86k87
7536a78K40q5O7j3mm6n0P1j80M8N3J34m0m5L3j12l6J71j61M4J42n5l3L6l8O9j21
7563h9J32k05L01j59Q4k3oK5k1j75J94n9j1K03j55j70J80O3K2j00M4K5k84K61
7587G7J04k18M5q6J54K0k7J23k69J37j86J8J04o3M8Q2M6k2k1j09J0J4P3j72K0
7612i8J35Rl2j43J86Mj47K28o3k54J57r8J09j72R9J12j22P7j36L6R3nO7QJ5p8
$$ y = [-16, 66, -108, 96, -63, 4, -94, 90, 128, 73, 81, -17, 100, 5, -39, 22, -18, 10, 93, -38, 76, -154, 32, 21, 115, -30, 106, 18, -14, 183, 75, 68, 65, -202, 0, 193, -111, 67, -4, -37, -27, 42, -2, -115, 50, -92, -19, -51, 37, -35, 172, 26, 49, -116, -70, 1, 69, 21, -124, -116, 50, 39, -98, -47, -27, -83, -110, -8, 27, -7, -65, 27, 97, 164, -20, 75, -20, -131, -89, -42, -43, -39, -133, -29, 73, -57, 20, -70, -9, 106, -151, -49, 26, 99, 194, 4, -3, -131, 63, 2, 49, 3, 12, -177, 109, -178, 62, -23, 44, 31, 27, -19, -69, 2, -178, -130, -77, 57, 17, -28, 5, -107, -143, 28, -133, -89, 53, -2, -35, 1, -37, 32, -89, 43, -162, 139, -20, 64, 41, 35, 60, 39, -136, 58, -1, -12, 191, 36, -134, 46, 109, 131, 31, 75, 100, -184, 77, 181, -37, 8, -78, 76, 96, 69, 192, -77, 60, -126, -108, -4, -67, -19, 63, 109, 87, 66, -43, -33, -19, 54, -118, -98, 37, 46, 14, -129, 57, 61, -86, 142, 79, -175, -18, -116, -7, -179, -80, 32, -90, -13, -149, -113, -20, -25, 42, 50, 65, -13]
7638a3j28J67R4k01J02R3k4q4M3p7rj6J06r9j38J07m3J09Q3k22L57k69N2J9j25
7663a16J49j98K31k22J33j1J41n7j66J51l3nn5N9p3MJJ19J3K3j49m3J53p2qQq5
7690a08Q1M2N4q6O5O4k22mP1J07l4j20J21r6Q1J08j66R9j11k4J09n1K1J7k22J44
7716f0n8O8M4J49j33m3J19j83K37p3RoN4l7r1q9J94j23r5j88L05K3OLQ7j62O1
7743A8j02P6J25j42r9J32l6Pl8O2M4k21J81KO7M7j21j81K22n0Q1j45K76r9j14
7768hr3P1J97k23J06p6K5K9Q2j93J47j2R5j18j19k9K01j39Q9r4J41Q5m5m3r7R3
7794G2j02J5o1j5P9j3L3J2l1Q4r8P7J90r0j18rL9k30R2J41o1j29P0O2N2J09j41
7821B9J99l44K69j46J41q1%k9M0j89K38j72PK01q4l0n0j0o8J10j03K61k63j4M4
$$ y = [-13, -141, 26, 120, -81, 21, 114, 90, 6, 49, -28, -37, -53, 53, -46, -184, -77, -120, -11, 72, -150, 207, -62, -10, 9, -116, 33, -165, 66, -156, -23, -34, 107, 50, -116, 35, 2, -3, -58, 1, -72, -68, -67, 52, 65, 88, -61, -104, 49, -23, -31, -23, -108, -27, 15, 69, -17, 48, 112, -110, -114, -43, 64, 30, -90, 31, -65, 16, 124, -42, 57, -54, -78, 31, -20, 1, 18, -204, -60, -118, -50, -6, 143, 10, -33, 86, -97, 140, 67, 76, 70, 124, 87, -4, -93, 101, -22, -117, -305, 0, 23, 29, 32, 119, -43, 18, -84, -8, 117, -25, -124, 8, -28, -21, -59, 3, 47, -174, 7, 9, 76, 123, 2, -179, 43, -7, 74, -71, 205, 106, -8, -101, -30, 167, -56, 50, -26, -1, 28, 110, -83, 64, 52, 147, 29, -90, -119, 82, -57, 32, -62, 79, 164, 119, 76, -21, 72, -30, -15, -76, -91, -12, -25, 8, 20, -11, 73, -25, 52, 242, 152, 34, 25, 64, -166, -74, 67, 6, -123, -53, 9, 61, 170, 29, 228, -116, 153, 7, 148, 67, 67, 38, 78, -111, 127, -45, -38, 163, 79, 49, -1, -11, -79, 31, -72, 189, -74, -88, -44]
7846d4N0p6J84k7n7p4J99k26J23L1j09r4K17p3M6M2r9Q8m8k9r2J0J91r7n8K8j15
7873a09L9Q2M8j67J9o2J96j35J03J11q7l1L7o5p4R9m1J04j41oJ39J11j31k2N2
7898F9l9R5r1MJ7P9j63K3Q4q5j12J36j06J61j1r4J21j05p1J87j00lJ26k32j2K70
7924A48j64l6K9M4jl6r7j6K11j08P8o1L9n2J41k11J44k3m2o6K6J12K9j08oP1j4
7951C1q0p9O1Q1L4q7J00l0Ln7m8J08O1r7q2oJ35p7O6l2r4LJ00j7l4kp8P2Q9n6
7981a2J74j12m2J00n3j02Q8J75k46J00j46K3l9q6K58j64R2n5J32j60LN4n6P7J7
8006B0j6j93K79r4J85p2k14J56k29K60p7k8j8n1M4O3M3j04J07o8K30j46N6q3j06
8031e6K7j4J35m3j9Q4pj62J48j42J63p2k6pj96NRJ78J07j84K11j20J13k5J50k58
$$ y = [-44, 6, -70, 114, 87, 30, -44, 155, -71, 52, 83, -26, -120, 97, 24, 70, 112, 13, 101, 53, 24, -68, -58, 133, 36, -22, 6, -109, -70, 12, 60, -107, -88, -150, 46, -89, 14, 125, 38, 7, 44, -21, -95, 4, -37, 67, -74, -80, 59, 170, 39, 17, 69, 30, 125, 34, 38, 55, 134, -29, -6, 78, -7, -119, 17, -89, 72, 61, -33, 88, -17, -88, 99, -1, -4, 122, -110, -122, 148, -16, -52, -23, 21, 20, -16, -113, -129, 82, -26, 52, -9, 30, -22, 119, -92, 52, 29, -13, -79, -53, 59, 88, -20, -26, 45, 31, -49, -128, -67, 14, 48, -39, 61, 31, 34, -23, -71, 37, 98, 1, -81, -87, 48, -29, 37, 5, -89, -86, 14, -3, -37, -39, -117, -45, 44, -12, 162, 50, 8, 108, 55, -47, 41, 216, -30, 70, -76, -53, -92, -178, 80, -84, 8, -47, 85, -75, -72, -18, -74, 3, 20, 4, -189, 90, -4, 181, 109, -105, 51, -178, 82, 5, -23, -41, -92, -48, 15, 58, -46, 61, -7, 223, 77, 133, 50, -56, -29, -43, 92, 49, 30, 114, 107, -55, 93, -49, 114, 42, 16, 9, -187, -182, -173, 5, 112, -72, 139, 19, 132, 107, 257, -1]
8057aO5l0n2J6j6Q5j11l6J2j00J46R7n5n5J12Rj25J08l4J63j61J13j53m2Q5nj3
8084B2O0k3j05J6L3J48j64q1R9qm5J10o9J52j86o9M4R4J73j70JJ82j99l6N8m1
8110dQ1j08J09L0J3o5p6J31j92J32M8j60M7J09O3j23k24K7k7K77n6l1L4J59p1
8135A23j84J01l7p0O6o4M0O1o0k39J21K45j57J85k26J69o9o4P7j91J28%L2J46
8159A33n8O2n9j81K07p3L3n0k9M5j78J49j32J5J00R8j33P4J13J00j7k74O6K5p7
8184d1R7L5l4j57J08J35k52
$$ y = [-1, 64, 34, -18, -2, -18, 67, -44, -80, -68, -168, -22, 75, 20, -35, 77, 86, -39, 69, 35, 198, 37, 150, -3, -45, 40, 35, 22, 82, 59, -46, -30, 3, 151, -13, -94, 5, -3, -48, 62, -7, 145, -41, -110, -66, 28, 201, 31, 32, 214, 15, -21, 37, -4, 77, -31, 78, 108, 121, 56, -20, 111, -81, 51, 99, -61, -14, 95, 158, 35, -189, -162, -189, 88, 32, 1, 35, 194, 123, -61, 40, 3, -67, -1, -65, -25, 36, -24, -263, -142, 103, -54, 131, -95, 74, 5, -59, 18, -173, -45, -45, -13, 133, 75, 137, 78, -103, 104, 31, 64, 14, -15, 30, -148, 1, -131, -116, -16, 82, -51, 23, 136, 236, 219, -55, 11, 36, -41, 56, 91, 57, -100, 8, 143, -109]
8191a09
$$ Imaginary data points
##PAGE= N=2
##DATA TABLE= (X++(I..I)), XYDATA
0@%%%%%%%%%%%QqQj6J6k1K9l2L6m4N4o5P6q9J06j23J41j62J86k15K44k77L13l53
35a88M00m48N01n61O26o96P74q59R52j053J161j283J416j561J719j892K085k298
53a205K538k804L104l446L838m295M832n481O276p277Q584j0379J3012j7267K5363
68A5393m6789K23583j76624k7300J8743j3365J0888q898P528o554N780n144M455
81A696l839L573l179K884k573K537k107K002j739J601j344J182j186R99r51Q64
97D20p51O90o62O07n32M22l62M61l71N10p4L37q8O1k74j16m43P4j32J49O4N1j0
120C1K0j9K9j02P5N7p1Q5n5m3N1L1m1n8R5Kjo9M9j9k6R4j31N1J7n3M9K1M5l6K15
151B93kn6l3q0o9j62K6R6L0M2l6q9LJ4Q2j22P2J1P2l8J4K4j03N1j9n3k8J01J1
$$ y = [0, 0, 0, 0, 0, 0, 0, 0, 0, 0, 0, 0, 8, 0, 8, -8, 8, -13, 16, -16, 20, -24, 30, -35, 41, -48, 58, -65, 76, -86, 100, -115, 129, -148, 165, -188, 212, -236, 265, -296, 330, -366, 408, -451, 501, -552, 609, -674, 742, -819, 900, -992, 1093, -1205, 1333, -1471, 1633, -1813, 2025, -2270, 2562, -2919, 3357, -3920, 4664, -5715, 7297, -9970, 15393, -31396, 192187, 15563, -11737, 7006, -6359, 4529, -4369, 3159, -3395, 2385, -2759, 1696, -2143, 1430, -1749, 1135, -1438, 1099, -1008, 994, -745, 856, -488, 694, -492, 507, -444, 420, -331, 359, -303, 304, -228, 194, -168, 293, -78, 432, 358, 695, 607, 668, 394, 278, -165, -91, -223, -74, -10, 41, 31, 51, 32, 61, -41, 34, 91, 20, 105, 50, 7, 58, 89, 48, -10, 85, 87, 86, 17, 66, 47, 21, 115, -16, 35, 52, -1, 48, 69, 114, 78, 293, 291, 235, 202, 122, 53, -109, -83, 13, 43, 85, 49, -40, -37, -23, 59, -63, 9, 20, 92, 54, 68, 92, -11, 40, 21, -32, -60, 41, 52]
180E2k1j3NL9L7o0Mn1K7o3J06n7L7o9L0Q0l5k5nJ40j03L9n8J09j29N0q6N5q0n6
210a01n2P5J19l8K0j37K3J9QN9j27J21j30j23P0n8J01j5j8l6Jk6J32l9j07J36
236a23o8m1J39j03j6Q1J9M1j5j4l9l4J13Np4nJ11J1p4P5j37J32Qk7N0p8J4M8m3
265d4l7m6j06J53M7p8j6M6J05J6L6j47J02O1j13O4l4pj20k3NK8R4oM5j50R6j03
293a32J47Q9p8q2J48p2j10R5k8j13P7K3l3J83j16m5K7m9k5M2l5K5j2J12j2l9N2
320C9j02P6R4r0L7j41Q0q9K3J13r5Rm1KnR1n5L7j4k3N8qNL7j06M3J14j61m0P7
350c5K0j3m4J45j5m3l0N3M0k34J86kK9O8j13o3k3j7J7J25oQo8R5O5j46R2Qjq8
380A0J42q9m2O5p5J22p3M2O4j52mj5J1n0P5Mq8J25j74O0L5pl3J70l9J0r9L6K10
$$ y = [52, 31, 18, 23, 62, 99, 39, 43, -8, 19, -44, 62, 5, 42, -27, 3, 83, 48, 23, 18, 158, 55, 94, 36, 145, 16, 66, -20, 35, -45, -101, -153, -78, 41, 3, 23, -114, -91, -72, -64, -5, -132, -11, -141, -264, -194, -252, -151, -166, -184, -220, -219, -245, -113, -152, -259, -123, -191, -232, -93, -196, -212, -131, -112, -71, -86, -100, -139, -173, -60, -55, -129, -134, -23, -12, -86, -11, -148, -16, -8, -35, 15, -63, -49, -1, -44, -81, -127, -233, -80, -33, -111, -127, -81, 24, 40, 76, -71, 31, 92, -21, 43, 9, 2, -118, -141, -136, -108, -14, -20, 25, -125, -29, -132, 15, 104, 26, -56, 92, 20, -90, 5, -23, -136, -59, -36, -69, 114, -2, -47, -20, -69, -94, -52, -87, -62, -74, 38, 26, -13, 39, -63, 13, 107, 17, 54, -87, -7, -96, -73, 40, -55, -46, -87, -85, -90, 1, -54, -17, -31, -54, 4, -4, 1, 38, -68, -25, 89, -72, -112, -35, -15, -28, -72, 73, 58, 15, -15, 38, 78, -156, 30, 28, 57, 125, 12, -51, -74, -91, -74, 51, 45, 53, -15, 80, 145, -1, 91, 99, 98, 10, 152, 63, 21, 86, 11, 133, 60, 102, 166, 14, 10, -5, 6, -44, 31, 35, -53, 72, -102, -42, -7, -14, -47, 123, 84, 94, -5, 31, 241]
409B41l04L9q2J40j16N2J24k32K06j59J38m5%pJ58k35P5o8R3j08m1K13k84K84
433H2p0J0n0K5N7J17j40n2L1J67j72o0J56k35L8J31j2n8J03j6kq5J01j33R1Q7
459A11j97J45O4k32J88k16Q3qrJ56K5n3m8m8jN4q3K18j86o0J33p1J22j94J80j52
485g9N9O2oo7J08l5j77O3P3N5k2q7P1K8k03J60K08l43K9J63J0j8j1O1l7J4L9j1
513A07m2k19K38j61M2J08j73J25Nj6j47K14R3j87J80j01k25r2J58PQ4QL9l5j4
538dNo0J14o1pK02j67j18K03j07K5j19J06L2J48jp4k17JP4l6M0O2j16R3KJ49k15
566d6OR0J09j48j12K08Pl9j48P5p3Q4O1k3j08Q5m2j54K47q0R1p5J2j11M3J40l8
593F1j86J27j7o9M5J33Jj08K0p2n5J06O5k11J70j08j1K33o9j91K36r6O3n0lo8
$$ y = [241, -63, -24, -106, 34, -82, -30, 94, -138, 68, -91, 47, 2, 2, -5, 153, -82, -7, -75, 18, -90, -131, 82, -202, 82, 12, 22, -28, -3, 54, 171, 31, -21, 10, 177, 5, -55, 101, -134, -96, 35, 23, -35, 68, 52, 50, -35, 66, -67, 24, 111, -86, 59, 123, -109, 79, -137, -54, -62, -71, 85, 110, 57, 9, -39, -40, 14, -69, 149, -37, -97, 36, -35, 87, -107, 73, -79, -20, 42, 36, -31, 77, 42, -135, -72, 1, 56, 34, -53, 18, 46, -157, 3, 211, -132, -103, 60, 70, 52, 41, 102, 65, 79, 118, 107, 65, -154, 84, -77, -35, 73, -100, 25, 30, 14, -133, 81, 174, -13, 167, 66, -159, -251, -93, -86, -2, 6, 45, 10, -4, 1, -59, 55, -6, -13, 189, 22, -96, 107, 0, 25, -94, 12, 44, 192, 191, 117, -100, -99, -25, -61, -21, 41, -75, 18, 20, 169, -46, -40, 50, 159, 11, -101, 107, 114, 75, -73, 2, -71, 13, 74, 51, -57, 28, -14, -168, 79, -1, 90, 15, 27, -84, -41, 99, 61, -125, 2, -15, -84, -39, 94, 95, -13, 7, -65, -120, -14, 51, -160, 10, -98, -109, 124, 55, -136, 100, 4, 67, 17, 14, -54]
619e4R1On4q7J65J6k1j42P8J04K0%j17p1q9J79rj14J60J98j62O0k31m7K12j19
645b8K4R5j05N8j00J35j25N0Pm3K07j69j41J30J52k15J58j56jK6P0l3M2P3Nq6
671C0j45M4J50k30J89j59N6J46k65J26J04J4K8j61kn6K72p8K0j27k6O1j01J89
695G9k0j83J4K49j07P4l16K45j7q2J47r7k4k5J17j72J33J45k33J39j31J49p1J55
719A68j1l30J46n2Q0j21P7M6N1J00k87J67kp9P9j74J21Q6L3k18J59M6n2N5j37
744d9P5j67J23N3k42K11N1Rk17QJ30M1J0Or0L9qO3L7k5l4j0J32k61K13j72KJ06
772C4j14r1K62k37K67j25R6k24J22p6J61k04P3N2m7J15l4rQ8J5j46Q8k6k3l6k2
798d1ON3l6j4J28q0j20R8l2oO1K0l3J84k55j1R8j0j5P1Ol2j17P2p7J09m0JO9j39
$$ y = [-54, 37, 43, -11, -98, 67, 83, 62, -80, -2, 102, 122, 122, 5, -66, -155, 24, 15, -99, 61, 259, 97, 157, -74, -121, 91, -28, -4, 91, -14, 44, -56, 79, -46, 4, 11, -32, 175, 6, -135, -5, 147, -68, 90, -66, -67, -41, 29, -4, 38, 111, 116, 30, -115, -71, 79, -151, 38, -121, -65, 81, -184, -58, 46, 60, 88, -73, -75, -131, 141, 63, 83, -44, -70, -9, -110, 79, 59, -124, -110, 139, 32, 106, -210, 35, 18, -64, 83, -14, -38, -63, 54, -118, 15, 160, -73, 66, -65, 84, 13, 168, 157, -173, -27, -79, 1, -120, -43, 3, 54, 154, -133, 34, 32, -47, 32, -142, -21, 65, 98, -120, 39, 85, 33, 88, -49, 26, -141, -18, 35, -207, 4, 55, 64, -153, -145, -15, 26, 36, 42, -48, -9, -17, 46, 83, 58, 24, 14, 146, -115, 98, -74, -72, 34, -80, -171, 91, -146, 121, -4, 92, -132, -10, -86, 75, -129, -56, -4, -51, 64, 30, 21, 109, 124, -22, 66, 40, 17, -19, -41, -35, 18, -18, -32, 96, 16, -104, -6, -38, -44, 17, 37, 4, 188, -67, -78, 20, 10, -5, 66, 72, 40, -77, -5, -82, 27, -13, -12, 57, -82]
828h2j13J03LP6o0O9o8k6K5JQ9j8o7P1J56j26J69l17R7j73J42M2J44j47N4q2J19
855H1j82kJ47nl4N5j34N8q9J21l7P0j08J98k0j45K9k24K07J17j28q4J13J42j17
880B9j03J84j84P4R7M8j13Oj9j15O2j2j59K62j60K50j47K5m6J00j68n1pL15l38
905a70K8K61o2j33J11Ml5J13j58J31j15n6K9J3nj22J68j23J00K30k92J39l4R2
929A14k17J49j24L06j27k14R6o0K54q4j6j35J87K6j55M4J7j63R6l1N3M2j70M9
953f3J7L9J91k28K05p0k1q5O9n2J10L5l0j8r9q7J78j25L4PJ01k45K09k23nJ11
979d5K5J8J49j37p4O3O2p3M0N0j53J25j40J95L2O6j39j5j23J23p8%Q7Pm6J07o0
1006F6N0j15k4NP4j27nJ02j49M8J27j70L26k85Q2Ml5K7MN8L1j35k20J64J45P9
$$ y = [-82, -195, -92, -89, -13, -73, -4, -72, -98, -73, -72, 17, -1, -68, 3, 159, 33, 202, -115, -18, -191, -49, -7, 137, -10, 44, -38, 81, -101, -103, 44, 39, 5, 60, -74, -16, -105, 16, -21, 49, -59, 139, 119, -26, 3, -221, -14, 103, -25, -109, 4, 146, 29, -74, 110, -74, 0, 97, 145, 32, 38, 19, -96, -34, -46, -205, 57, -103, 147, 0, 25, -21, 79, -89, -140, -147, 168, -170, -142, 119, 57, -76, 35, 39, 4, 117, -41, 90, -25, -81, -52, -39, -44, -166, 2, -121, -21, 209, -83, 56, 22, 114, -103, 46, -78, 228, 101, -113, -17, -77, 177, 93, 77, -58, 129, 155, 0, 44, 61, -102, -6, -37, 16, 58, -112, -63, -46, -7, 184, -44, 161, 91, 70, -15, 54, 2, 112, 147, 117, 99, 0, -87, 91, -34, 0, 7, 108, -137, 72, -151, -156, -45, -20, -2, 147, 10, -64, -1, 61, -12, 28, 78, -75, 50, -90, 105, 137, 203, 64, 49, -74, 49, -29, -29, 58, 65, 19, 126, 66, 116, 1, -23, -18, 56, -71, -76, 26, -123, -75, 52, -118, 208, -77, 5, 9, -26, 1, 5, 63, 94, -41, -261, -97, 48, 127]
1032A27j80N1K1M6n5N6%J3%r8R6j33R6R5j5M6j26p2J6O4p8n6J30j18J08o2J73
1059A45j71j0R6j43J67k39J62q2k0L8K09l02J4J17P6j57lJ43M7j90j0Q5m3L4k8
1084f5J63m2m6O0Jp5q2J49N9jn9o3j21P6J19r4K46j70k5O7k4j94O0k7J41j76K64
1111A41r4N7N4j5j25j67QJ81j85J79k8J05j85J39Q7k42P6p0J32l4N0q9J93p8j79
1136h9J11K8k6j05Q9N6k8nJ08k43J33k4jp8R8j51K46j18m1k4M3N4OP5n3k8l4j
1164br3J05j45J60J9o3J3n9P2l5m5l5K42n7j88K06j44O1n7j03J99o2P5j92j5K43
1190A00j53l2J2o2J34J23j79j4J34r0J07n7J45k29J78j87J05Kj43P9k1J52j42
1213c8J31k7rJ1q8n4M8j32P5j32N9K53L9k61J48o6J33n3J00k10J49kp9j0j45K47
$$ y = [127, -53, -2, 19, 65, 10, 66, 66, 79, 79, -19, 77, -56, 40, 135, 120, 166, 40, -32, -16, 48, -30, -86, 44, -74, 34, -28, 145, -26, -36, 60, -83, 84, -155, 7, -75, -95, -57, 152, -150, -136, -19, 57, -100, -103, 40, 87, -103, -113, -28, -71, -37, -65, 98, 56, 10, 70, 71, -4, -86, 63, 122, 121, 62, -1, -122, -46, 73, -21, 225, 55, 30, 97, 73, -121, -61, -88, 53, -123, 141, 47, 104, 158, 143, 18, -149, -141, 40, -145, 34, 6, 111, -74, 65, 152, -90, -14, -84, 48, 14, 64, -25, 168, 90, -89, 22, 50, 24, -81, 8, 64, 36, 31, 139, -104, 29, 5, 4, -74, 24, -127, 119, 1, -40, -64, -21, 33, 39, 114, 61, 33, -1, -2, -95, 10, -135, 25, 44, -19, -6, -65, 7, -28, -73, -108, 134, 77, -111, 95, -49, 12, -45, -148, 51, -11, 64, -128, -143, 100, -53, -85, -73, -135, -1, 122, -57, -71, 63, -27, 80, 23, 168, -61, 117, -70, 35, 37, -106, -27, -48, 104, -38, 93, 66, 57, 68, -20, -74, -26, -158, -83, -215, -156, 97, 136, -125, 23, -43, 90, 37, 137, -73, 76, 74, -5, -15, -160, 87]
1239H7k6j9p7K2n3o2J86k6m4K3JN3lk7m9q9o1K93j35M1j6m3J07p0q8l5Q8J20l8
1268F0j68J28j12N4p7J51L9J91q7j80R7q5m7K12j1k02K6Q1j83J21j8j7K8n3J11
1293E9j33J75j18Jj92J49J16L6M5l7o9p2p7J23m6n5K51k07J7MN3M1R5j99K68l50
1319a22l7J63p7o6R7J9j59J87m4l1L3r2J15j02J53M3qq7r6J69N3j80j6J11k51
1344b25K86J5j3j46J09l3O5k2n1L5J89r5Rj60Q5q4N9q3J9K6m0J02n4M7m5o9k0
1371i4O8L6Q9l1j38L8M7m8o0O5nJ78k17JJ26Qj8r5N0q7J68m2j25J11j20K21J3
1398A39k11J46o9k3m9m0J66j38P2J0o3JJ02l5N1M6j77M9k0N5KQ6j13Q7j34KK4
1425c4J81j60j9P1q6R8O1j04Qo0L5o7RM8N1L6j20r8k4K23l6r8Q5O4jk24J79j82
$$ y = [87, 61, 42, -35, -13, -66, -128, 58, 32, -12, 11, 12, 65, 62, 35, -14, -103, -164, 129, -6, 35, 19, -24, 83, 13, -75, -110, -22, 98, 60, -108, 20, -92, -38, -115, 36, 75, 266, 179, -1, 96, 11, -36, 176, 165, -37, -11, 70, -113, 8, -10, -27, 1, -52, 59, -74, 101, -17, -16, -208, -59, 57, 93, 138, 101, 32, -40, -117, 6, -40, -95, 156, -51, -34, -30, 23, 64, 159, -40, 228, -122, -159, 4, -73, -139, -42, -23, -182, 5, -39, -70, -37, -129, -14, -116, 37, 80, 72, -15, -111, 58, 111, -69, -85, 26, -225, 61, 76, 63, -83, 26, -7, 58, 36, -15, 20, 209, 114, 123, -37, 48, -36, 23, -60, -41, -15, -55, 47, -7, 40, -5, -74, -94, -26, 10, 99, 68, -70, -32, 15, -33, -93, -28, -33, 145, -72, -71, 55, 63, 45, -50, 0, -87, 81, 39, -86, 25, -95, 126, 139, -72, 74, 5, -18, -67, -107, 59, -79, -7, 3, -60, -59, 43, 8, 59, 105, -72, -23, -43, 12, 14, 100, -13, 74, -60, -58, -34, 147, -13, -32, 39, -47, 51, 112, 8, 16, -44, -9, -76, -67, -19, 32, 68, -52, -150, -174, 49, 13, -85, 0, 64, 63, -161, 18, -164]
1453a64J55O2m6O5K7j64J94j28m8K1m3k0J11p8J57j07L2r7O7oQ8q9j34J94r8Q6
1479C7p9O2J29q2p6OJ3p9K74l25J86p3J22j72K68j49j79M1l8J53o7K4mk0J12q6
1505bl3J5J79m1k67K15K43m35j02K23j73K32p1jN8K5j03J26j34N4p9j4P3m8J55
1530I5j02Lj21n0K98L6r6j18R3n3K7p4J75m5j59J38O4k30J51L9j87J1l9J95K6
1555G7j36P2R6j71J35j08M5L0m1K6J0o4j41K25j45J00l5M9j09j4J53j77J38K8
1579D3K17l45R9J6q0j38K45j59J75q9O6j05J09j36N2Q3n5J33q5k6p3%m3J02L0
1604C6M4n6q8J15L2j66K14j08J0j6j8P0j04K3J47k60J65L1k8J21l39J17N5o6J68
1629I9j10j27J30k0Jj11P9J24k7k9J57k28J31l8k6J45j48j8Q0j07oNO8k0J21j07
$$ y = [-164, -9, 53, 7, 72, 99, -65, 129, 1, -47, -26, -69, -89, 22, -56, 101, -6, 26, -71, -4, -10, 78, -11, -145, 49, -49, 37, -42, 20, 149, 67, -9, -3, 10, -69, 205, -120, 66, -7, 115, -57, 211, 62, -117, -76, -114, 39, -28, -4, -8, -28, 84, -2, -35, -20, 159, 118, -149, 66, 309, -126, -228, -5, -178, 54, -17, -18, 40, 65, -38, 88, -46, 8, -71, -85, -12, -60, 95, -7, -4, -125, -175, 123, 159, 63, -55, 38, -15, 12, -62, 113, 68, -91, 47, 111, -119, 32, 71, -116, -105, -144, 51, 77, -59, 13, 109, -62, 73, -35, 10, 40, -1, 25, 35, -29, -170, 55, -90, 10, -25, 24, -85, -99, 54, -123, 15, 43, 260, -85, 14, 30, -50, -188, 57, -102, 73, -16, 50, -55, 54, -82, -30, 53, -2, 131, 46, 20, -53, -53, -96, 6, 36, 80, 24, -64, 51, 83, -83, 131, 23, 33, 17, -1, 69, -35, -12, 135, -125, 40, 71, 43, 164, -175, -58, -3, -69, 99, -11, -138, -8, -28, -27, -138, -59, 65, 38, 9, 166, -62, 69, 31, 5, 150, 2, -16, 64, -43, -49, -44, 24, 4, 125, 18]
1655A8J1N9o1J41j27O5k08O0mJ2k6L2J8m5J48j26Q1q3R2j06k9J45k88K04K03j23
1681F3k4j39O5J69mj47r8P3P3M7q1k2J9n4kp1K63j60J8N7k33J14K34j15j75k0
1707a50J33k4J37n3J25m3k7m0o3l4%J07j40J40l1Jr3J54p2K5j08p9J74j0Pp5n5
1734i4KL4o2K32p6klj45O0J80j27m9J19r9j10J55K9m1L3L6m7o3q0J38l6j25J85
1761D4l6pM4%jk5J47o3m1j28J40j22M5K44k61p5J86j45L6J11l7m6Q3O3j21J7j59
1788a07J37N1l9Q9j79O8j22J29l7N8L6o3K9LM0j49j69L44o8l7k1K00M3k15%j66
1814a45Q0K07m1L5rj13L5j9Q1r0K4k5OL8k13J13j40P4K80p5j02Q6j84J49M4j85
1840h9J26k26J70L2J22k05N8J52N5j71j7n5M3l7n0J52j4j30M4R5j02O5M0j6k4
$$ y = [18, 29, 88, 27, 168, 41, 106, -102, -42, -46, -34, -60, -28, -10, -55, 93, -33, 48, -35, 57, -49, -78, 67, -221, -17, 186, 63, 39, -100, -35, 134, 130, -17, -115, -42, 31, 78, -3, -25, -6, -60, -62, -133, 130, -30, -12, 45, -188, -74, 160, 45, -130, -150, -17, -41, 96, 43, 168, 125, 98, 58, -5, -39, -39, 68, -72, 68, 37, 38, -55, 99, 27, 52, -56, -135, 39, 29, 36, -39, -94, -92, -58, -120, 112, 36, 34, 31, -114, -54, 126, -1, -50, 69, -30, -140, 15, 44, 3, 36, 72, 25, -38, -118, 20, -16, -141, 44, 8, 1, 45, 45, 44, 19, 166, 103, 62, -66, 74, -48, -3, 241, -20, -95, 91, -54, -18, 93, 56, 10, 93, 156, 35, 52, -107, 30, 81, 42, 131, -48, 20, -102, 27, -10, 48, 84, 21, 50, 53, 93, -56, -225, 119, 51, 14, -7, 193, 236, 21, 21, -145, -65, 142, 101, 136, 127, 14, 49, 30, 111, 21, 45, 20, 26, 64, -149, -36, -176, -102, 178, 103, 1, 87, -97, 52, 96, -89, 37, -189, -19, 13, 135, -70, -12, 140, 195, 24, 7, -48, -5, -42, -92, 60, 46, -84, -40, 55, -47, 18, 58, 42, 18]
1865A8l6j5jJ32n5J4j5m6O0p1mq4J36J6j38Q4j7K2j31J05o8N6J76o4qJ05k72J55
1893E4n2l3j1k2j7K46j47l8oJ0P2l7k8R1o4m5j16J53M2k28K82k01P1J14J44k16
1919A8o1k6Q7r9K6J21J5m3J20k02M6n2K27j92P5M9r0m7K9K2j10O3J70j35J5j5
1945A1p8J71K5l27R3J41O8Q3l16J80r4K17j92L8N1Pq7R1lj20O6J37j78n4M3N7
1971C0j02l8J63m3Kj10J11jK9j4j33P0J02p1N5O3j00j27kJ03n9L6n3K25Qj49j6
1998b1n0K3J24N2n7l6k8j32O1N0k7R2q9J65j37N7K8pJ9j89M6J64j44J1k5Q5L9
2025G4j8j00R1qj56J40j91J78Q7r4J1Q1J7o5j5or3J2J00j12p4j08M73k87M0Q4
2051F1n7MO6Q1k81K74k69L19k11J43j29K0J48j26J9j30q9L04j02M9n5o4M6kJ61
$$ y = [18, -18, -33, -34, 98, 43, 57, 42, -4, 56, -15, -19, -103, 33, 49, -89, -5, -22, 0, -131, -26, -94, -38, 138, 74, 66, 171, -101, 54, 2, -31, -42, -64, -81, 165, 18, -20, -26, -16, 56, 19, -9, 82, 18, -27, -143, 10, 52, -176, 106, -95, -24, 90, 234, 18, -43, -69, 18, -81, -55, 66, 81, 38, 158, -44, 2, -50, 177, -15, 60, 109, 19, -28, 1, 23, -87, -24, 146, 11, 26, 11, -67, 104, 129, -198, -105, 36, 104, 187, -129, 51, -43, 174, -18, 20, 71, 78, -9, 82, 79, -41, 25, 162, -16, -70, -27, 30, -72, -110, 53, 10, 12, -98, 13, 12, 41, 27, -106, -36, 66, -5, 50, 113, 13, -114, -116, -13, -72, -36, -89, 136, 144, -5, -21, -71, -48, 76, 128, 71, 35, 7, -125, -64, -14, -41, 51, -38, 127, -10, 47, 75, 68, 87, -102, -56, 108, -36, -25, -50, 35, 74, 56, -44, 47, 39, -117, 23, -168, 10, 97, 3, 14, 95, 112, 47, 32, 26, -67, -55, 45, -67, -141, -249, 224, -63, -23, 61, 4, 8, 74, 155, -126, 148, -121, 198, -13, 130, 1, 21, 169, 43, 62, -68, -157, 147, 45, 94, 39, -25, 21, 19, 180]
2076A80k65K12k45K69j06k18J81O8j91L3j2Q4Op2M8K7J2n2L7N0K3Po3K6K1q3J0
2103a3k9K1J76j50K0O7j57kr9K04J07j83Q1K5j9qm4J23k83j4K5P1N6r9J15J58
2129A49k00K47j58o1M0r8N3j0Q0N0p1l5OP9KJ38k60P8P%k9J00j38J0J03q1j59
2156a58K69j88J96j62J15j58j1j03K19n4K3J12j12%n6M2L4M0l16K22K2M8j69J43
2180bK4K2m4J14k09J27j9L8j5r2J53n7m6k4J70k31J8J22j86J78l5o4J40p1j51
2205a40J79r0J04%n6M3k0r0J78j31R6L2k48J70J02k46J42o5O5r1L7j46R2M7NP1
2231D0m9J82j74N7r7J10j8Q6j66LJ92k82M9J28J05q6q5o4K1r6l1J35n6J29J03
2256A36n9p8j35K46L3j36J9kj08J2o3K13k8r6K7mK37l08J44j1q1J61q0o1k4q9
$$ y = [180, -85, 127, -118, 151, 45, -173, 8, 76, -115, -82, -94, -10, -4, -76, -28, -1, 11, -41, -4, 46, 69, 76, 13, 39, 60, -23, -13, -42, -21, 155, 5, 25, 92, -65, -67, -166, 38, 145, -38, 43, 68, 49, 41, -3, 120, -163, -177, -152, -81, -25, -124, -9, 149, -51, 196, 38, -23, 17, -81, -28, -38, 42, 92, 21, -14, -8, 71, 73, 211, -49, 29, 36, 36, 7, 107, -31, -21, 82, 1, -158, 111, -77, 119, -43, 72, -86, -97, -200, 19, -35, -12, 100, -12, -12, -68, -26, 8, 48, -268, -46, -24, 24, -145, -2, 22, 44, 0, 114, -95, 32, 13, 51, 36, -56, 97, 40, -6, -30, 140, -91, -73, 49, -137, 41, 6, -58, 82, 11, -140, 39, -51, 53, 53, -3, 40, 20, -70, 108, -23, 73, 105, -143, 27, 129, -117, 25, -40, 25, -66, -29, -175, -83, -36, -31, 40, -9, 173, -1, 56, -41, 69, 51, 137, -29, -26, 166, -116, -67, 61, 166, 80, -5, -69, -48, -144, -175, -40, -96, 33, 136, 77, -1, -136, 110, 143, 7, 26, 24, -84, -72, -135, 78, 50, -46, -19, -23, 214, -94, 50, 39, -42, 119, 39, -22, -46, -135]
2282a35J51n4o4K41j71j26J44Q9j63J68j40J18M1l9j35J15j87L5J1K05kK6j43
2305a5J11n6j05K68k30K7M1p1K7N1m5J14j13K8J8Q0j32J15q9Q1q3k8m2N7j01J4
2331g8K0J02L8j28O2m8o5J13J81j00o1Qo8O8k16L4K18m5L6p9k01K46j57K47j25
2356BOK4p2P1p5nRJ35j41O7o3L06j78j59J61j33o1J60K3l7k35J90Q5k6j25J44
2382G3m5o7K7K6M6q4m8J19j02J98oq9m0r9O5P7q2k5N0N3q0R7P4Lj42j7j29R0J80
2411A23k90R5P4P1r5j4N0K7j45l4J34J46l5j22n4%R1N4n6j50M6K34k47P4J08j61
2437g6J20ok31L33k52j2J77K9L2j27Rmpj26M0J72j33Q0L8mj56J17N1j44n1P1K1
2464c9R0q5j3q6J19N3N7j8q7P4O2p9q0Q8q2J27j40k0l1J11m0Q2j72L2J68%j32
$$ y = [-135, 16, -38, -102, 139, -32, -158, -14, 75, -88, 80, -60, 58, 99, 60, -75, 40, -147, -112, -101, 104, 102, 128, -15, 96, 40, -65, 203, -27, 0, 41, -30, -3, 48, 3, 117, 4, 32, 50, 130, -2, 113, 24, 105, 22, -6, -48, 9, -92, -78, -58, 44, 82, -46, 16, -32, -97, 16, 197, 97, 36, 44, -24, 44, -172, -138, 80, 35, 71, -8, -209, 37, -120, 127, 2, 8, 32, -40, 31, -44, -49, -40, 95, -46, 21, -42, 264, 86, -73, 88, -45, -106, 54, 77, 40, -195, -5, 80, 54, -71, 73, 28, -39, -12, 14, 60, -24, -72, 47, -55, 143, 137, 48, 8, -91, -26, 51, -31, -56, -6, 47, -33, 64, 138, 141, -1, -18, -147, -57, 123, -167, -72, 2, 73, -22, -36, 14, 41, -104, -138, -4, 142, 107, -15, -69, -69, 22, 76, 20, -130, -84, 150, -97, -23, 85, -76, 44, 38, -193, 140, -112, -124, 53, 82, 114, -13, -4, -8, -15, -141, -101, 71, -62, 18, 56, 52, -104, 13, 64, -80, -131, -60, -39, 51, -34, -47, -133, -14, 39, 96, 78, -9, 65, 127, 48, -32, 56, -26, 101, -39, -59, -90, 21, -19, 63, -109, -77, 91, 91, -41]
2491d1r8r0K17J25k65L79k05J6j34J00Q8p9j6k1p0J35K0l7J41j68j99J83N2r0
2515e7K7J26j10R5L3j76q8P0L8J59j79J49k23J55R4j07Lm8j7J10r7O2NM3j44R1
2541A4j01N3l4J24j38m9K14j90N2N2R2k22P9P0J1K3j06M6qJ21l0j3j42J21n8o4
2567h3J39r6Q1J08j0L1l5p5j01L3q7J23l1q7O1r8Q6j10J69n2L2K5j9r1o4K76o4
2594F1k6n9r2R4R5q8M5j8n1P4j0j41R4ML5m7J73j63p9Q9j04Q5M6J01k04J32j35
2621h9K7J18k3j63J10J77j61Nl2J60j15J6m6q4K1J34O3p3N0L6n6j4j9K1Q5k16
2647f8J26P0r5j6j20P5R7m9j7P3r8M7p7l4Lk3J69j15l8M6l0J02k6j20J45j7R6
2674A06j78R1K7q6R3j64K3J54j40J75j1q6J8J0O5j19K2k0m5l1n9J74j16J28r6
$$ y = [-41, -139, -229, -12, 113, -152, 227, 22, 38, -96, 4, 92, 13, -3, -24, -94, 41, 61, 24, 165, -3, -202, -19, 33, -57, -30, 96, -14, 81, 114, -62, -150, -80, -42, 117, -62, 87, -136, 19, 113, 6, 9, -39, -56, 54, -43, 19, 24, 67, -77, 14, -87, -34, -68, 56, -82, -131, 83, -107, -55, -3, 89, -133, -54, 16, 27, 50, -56, -10, -18, 103, 73, 60, -82, 39, -19, -83, 56, -40, 41, 149, 139, 170, 135, 60, -41, -8, -95, 28, -3, -90, -29, -127, -41, -151, 18, -34, -2, 23, 4, -87, -151, 125, 61, 35, -24, -116, -22, 73, -15, 30, 12, -39, 35, 25, -116, -22, -18, 17, -30, 143, -20, -99, -10, -114, -29, 17, 118, -86, 46, -89, -62, 56, 33, -130, -20, 157, -4, 1, -31, 129, 14, 30, -16, -100, -79, 55, 118, 45, 95, 131, 75, 61, 42, 63, 148, -68, 58, 128, 33, 17, -103, -28, 69, 20, 3, 76, -22, 25, -52, -86, -83, -106, 63, -52, -90, -44, -74, 28, 2, -118, 27, 10, 106, -72, 19, 46, -40, 53, -111, -88, 66, -74, 101, 90, 4, 22, 32, 97, -22, 0, -20, -65, -96, -155, 19, -97, 31, -65]
2699f5n2K39j23j79m5J54K37k17pJ27j86K24j92n6Q0L7m2Q9k1L7q7O8r6j89M40
2724A75k76l6O1J49o2o1j2j2J4l8J08l3J22j43J93k57K4J77j78J12j18Q5m3J5
2748c4J51NLj38q4n1J89n2p1j02K01j24m3M4N3J26j03r4R3j05J11J5K1o4j6P2
2774CL6M3j70O9N9Pj05r6K58j43K15j72M7qN4j48J4k1J33j81K6J81j80j9K00j18
2800a6P1n0j35P4J2J55j16R6o4m8Q6j09m0J1J10J05q3p9k4Q8j23J16l6j93K39
2825D7Q0q5Llr1j24R8K7J19j37nK7K9J0l07K53L5j38M5K26j57J42n9j65J0J19
2851aJ21j84J13P8j73P5J33p2k23M0L00k77J91q4P7j04j84J93M7J8o8O8j34J29
2875G9n6j53K23r6j00Q1Q8o3m2J69k48M9n7J43n0M5J5l8r8J73m8j46K28j49Q8
$$ y = [-65, -117, 122, -1, -180, -225, -71, 166, -51, -58, 69, -117, 107, -85, -141, -61, -24, -66, 23, 2, 39, -48, 20, -76, -265, 175, -101, -137, -76, 73, 11, -50, -62, -74, -60, -98, 10, -23, 99, -44, 149, -108, -84, 93, -85, 27, -91, -6, -49, -34, 117, 122, 125, -13, -97, -148, 41, -11, -82, -184, 17, -107, -150, -106, -53, 73, -30, -124, -31, -136, -25, -10, 11, -53, -69, 3, 39, 82, -88, -19, 40, 47, -58, -154, 104, -39, 176, 4, 51, 43, 97, -51, -37, -58, 75, -106, -80, 101, -79, -98, 102, -16, 55, 5, -130, -56, -44, 111, -5, 91, 27, -21, 65, -44, -84, -73, 37, 142, 59, -20, -44, 44, -79, 37, 1, -192, 47, 127, 42, 45, 42, -49, -173, -75, -48, 71, -66, -71, -44, -15, -5, -312, -59, -24, -162, -117, 109, -48, 94, 35, -130, -120, -1, 120, -64, 49, 127, -46, 29, 162, 90, -133, -93, 207, -70, 121, 37, 114, 10, -174, 19, 66, 84, 16, 84, -50, 79, 23, -130, 93, -3, -103, -22, 66, 3, -39, 130, -118, -69, -126, 17, -33, 12, 27, -11, -109, 64, 16, -130, 98, -51, 37]
2900C7R0k57J36J00o6j9n8J29j12J12O9j71r9J40r7J05r9K7j08J79M7k44J94n6
2924b1j6j53K33j39P7N2q1J53j06Q7m4j94P6OM0l3j8L02l29J00p7j7J00j3j5j
2950c1O6j60K70k37J1Rm8J08j7n8R0J3k2q9J06L6l9J27l4o0p9k7P3j61J66n4r
2977e0Q7j0K7L5k26J57Q0N8k93K21j40q7J81K3j40L0N3j2k0n0O4K2j27K34qj22
3003a3j01n9K32j44J5O4J10j18l2O1j1J8L4L9j49K0R9M1k35J71L3k25K30k1l2
3028B7Ojo1J72m9j57O8J72k62Ro1K00r3L6J18j69J41k32J22K2J9M0k2L0m9l4P6
3055F8j17k6J62l5r7J65k35L7oJ71j85R3J39j97J37j60q8M3N1Q2l0O8K6l9l8L5
3081B4k5K34k48J0O4l3r2j2K59j18Lr8j56K38m5n2J27j59J05j17J2K5K5J46m9
$$ y = [37, 127, -130, 6, 106, 40, 21, -37, 92, -20, 92, 161, -10, -109, 31, -66, 39, -60, -33, -141, 38, 85, -159, 35, -21, -37, -190, 43, -96, -19, 33, -48, 105, -1, 86, 42, -152, -76, -70, -30, -63, -81, 221, -108, -8, -85, -102, -2, -15, -30, -31, 35, -125, 145, -92, -81, -72, -120, -12, -29, -87, 3, 16, -6, -95, 11, 47, 8, 135, 101, 41, -38, -65, 8, -153, 13, -41, -50, 37, 27, 54, 89, -137, 20, 100, 158, -135, 86, -54, -141, 40, 63, -77, -47, 6, -6, -26, -76, -12, 10, -117, 117, 109, -13, -114, -173, 59, -85, -70, -6, 104, -14, -46, 15, 4, 22, 56, 95, -54, -34, 65, 106, -129, 42, 75, -150, 80, 59, 27, 33, 32, -29, 143, 94, -63, 5, 177, -85, -76, -137, 63, -30, 6, 124, -45, 96, -136, -14, 8, 27, 67, 45, 75, 26, -8, 68, -49, -75, 87, 52, -45, 120, -115, -78, -84, 87, -98, -5, 134, -63, 74, -86, -174, -131, -80, 2, -28, 40, 66, 27, -11, 24, -1, 233, -15, -5, 59, 26, -66, -78, 181, 63, 66, -32, -188, 50, 5, -47, 80, -79, 26, -91, -79, -54, -29, 117, 68]
3106F8k3q1M8o8J88j45Q5n8j19L9j48J99J25p7k2k8lJ16j45J15J06j21j7q1K6
3131b1J45j56J44J1k11r1K94k24J64j01J5KrP9O8o3m8J08o1m8p6J62k37K30j36
3156f0J61j06J12j24M4N2j05JR4j96K00j4k1j32J01j6j08K54j23N0P5j98oPJ11
3181E3k6j48J14j68J23L1J68o7qj90J28P6j3j9o2p0L6j10J31J11j73J8J82k93
3205a76L35j83q0mJ3K40k87K50P4k11j35J35J00K8k09m9O1O8N0P8j80K19k37J92
3229I2k14J32Rk9j66J68M2j37J20NM1j41N0l0qm5K77k60J7M4Q6m5k9K18j12k7
3255E8p5O5k11J74Kl1P9j26K22l20L04j92N2P0r2J81k64J05J08Pj45M4o5J52R7
3280A99j36j21J29q0j37M1J90m8P0j18o2K45j55K1Qq6M7r7m9O5J88j50J08r6j3
$$ y = [68, 45, -36, 12, -56, 132, -13, 72, 14, -105, -66, -214, -15, 110, 33, 11, -17, -20, 96, -49, 66, 172, 51, 34, -47, -21, 124, -32, 112, 123, -88, -179, 115, -109, 55, -46, -31, -29, -38, 41, 109, 46, -2, 106, 45, -3, -79, 83, -154, 76, -60, 101, -5, 107, -17, 27, 79, -26, -25, 69, -127, 73, 59, 38, -94, 7, -9, -117, 137, 14, 64, 139, -59, -65, -58, 53, 27, -121, -7, -175, -52, -21, 147, 80, 72, -118, 10, 86, 73, 54, -8, -78, -42, -152, -21, 90, -83, -65, 117, -176, 159, -24, -104, -108, -95, 145, -142, 108, 182, -29, -164, -29, 71, 99, -110, -159, -98, -30, 20, 98, -82, 137, -100, 92, -122, 10, 19, -10, -176, -8, 34, -103, 17, 22, 63, -78, -28, -58, -66, -111, 166, -94, -77, -33, 53, 8, -21, 197, 85, 58, -17, 48, -163, 11, 13, -18, 61, -65, 157, -163, 141, -51, 1, 71, -21, 160, -104, 1, 109, 116, -29, 15, -50, 102, 199, 63, -58, 71, -9, -146, -105, 85, 37, 107, -11, -73, 172, 17, 38, 46, -40, 7, -90, -139, -74, 114, -36, 72, -24, -37]
3305c7J1L1J21O5j24N6m3p8n3p1K44j39Q0j39J71J9p5n6K4j11J34r1j4Rl0K19
3331A23N1j79K0J11n4m7j3K9q2k4J12l4r0K21j98N0J0m6k16J71j6n0L14k62J77
3356G8j18J10n4q4Q7J63j89Qk31J87M5k0Nj14K11j64K4o0J48lq3qR2J8lj20J05
3383C0j61J36OO1j71K5J28J23j82r8lJ43j84J2K93l61J30q2o0K85q2k0p3Q1j43
3408a67J53P2j03o8L6J79Oo9r1k8J56r5n6J5P4J35k27LJ3M4K0j89K5l4J56J92
3434A52q3n5J09j04j38M1k3K21j74p2J73m3M0j1J40j59j6pn8qK27j01qj55K62
3459A50j37j00J8j6J44p1o2K2O6q9J39r0J0n5L5J40j23mL6j86o9J98J16j05R5
3484F2p4j49J26j2J87p7j68J46j34N4j8J12j95J06k1J33n2j47N0j47L72o3r9J21
$$ y = [-37, -26, 5, 126, 191, 67, 123, 80, 2, -51, -122, 122, -17, 63, -76, 95, 114, 39, -17, 7, -104, 30, -61, -75, -66, -96, 123, 174, -5, 15, 126, 72, 25, 12, 41, -41, -65, 47, 13, -77, 144, -54, -4, 6, -40, -256, -85, -101, -151, 163, -99, 78, -40, 70, 16, -68, 19, 182, -7, 1, -230, -43, 2, -18, -13, -127, 84, -80, -56, -116, 32, 29, -54, -62, 30, 48, 45, -75, 30, -131, 5, 11, 72, -99, -74, 54, 177, -5, -103, -106, 37, -147, -135, 158, -203, -73, -155, -215, 70, -12, -32, -105, -24, -167, -14, 58, -45, -113, -77, 102, 108, 39, -52, -80, 76, -19, -75, -60, 14, 149, -78, -75, -62, -18, 2, -187, -162, -196, -40, 152, 69, 14, 123, 19, -119, -78, -101, 120, -54, -126, 47, 4, 44, 33, 173, 14, -2, -9, -67, -75, 152, 51, 43, -112, 150, 13, -87, -69, -85, 59, -12, -74, -52, 14, -75, 64, -26, -16, -71, -36, 104, -19, -23, 13, -173, -242, -44, 72, -33, 62, -12, -161, -35, -47, 140, 63, -105, 41, -93, -39, -57, 55, -140, -34, -55, 78, 26, -121, -71, -218, 154, 91, -8, 113]
3508A13K4K3k48J32Q3j17k1L8k5J69r6n0j03q4K18q3J2O2j2j29K10l11K89m7O0
3533A07j09K9J3j51J49J62k55J7J91j88K1LQ7j12N1OJ8kJ49j92l9j03J01M5m1
3558d3R7q4j22q9L25l5p5j2M2M3o3K5L5p4J29j15L7O1j31j8K3jl9M5Q0K8k9j10
3586g0N2o1M2k1nJ1N9k4J06l4P1j44j20J69J1j97J74n5J32m4n6L0o7K12k70J8
3612h1J13Q3j13j12J25R3j77j1MK0j6N4J41j27J15o7L2J02q5j34Nl4K9K6L5q6
3638f6j08J10J04p7L6n0r0J33j51J10l1J91j31J6J01q6O0j07m3m8K87k55oK35
3662A34k08R4M9r1qn3J16k6j43RJ13q4J3P3l1q2K59l39J27Q2Q1p2l0R8n6r5M7
3689b3o4k2M3J25j0k8j40J50n6j39j3K5L37q3r3L8q2J22K1j89om5J97o6j3M9K1
$$ y = [113, 137, 160, -88, 44, 127, 10, -11, 27, 2, 171, 75, 25, -78, -162, 56, -27, -15, 47, 35, -94, 116, -195, 94, 47, 107, -2, 27, 40, -111, 38, 200, -55, -38, 153, -35, -14, -11, 76, -36, 15, 21, 39, 37, 186, -6, -45, -148, -47, -2, -43, 54, -30, -152, -241, 84, 49, -26, -38, 4, 47, -16, 9, 44, -30, 99, -16, 21, 82, -49, -67, -44, -45, -84, -39, 41, 69, 40, -70, -18, -79, -37, -58, -63, -52, 7, -17, 89, 55, 126, -18, -138, 31, 42, -155, 19, -36, 96, 52, -4, 26, -41, 171, -99, -81, 32, 115, 2, -110, 15, 108, -69, -80, -76, -56, -72, -18, 123, -4, 111, 44, 76, 178, 93, -41, -36, -70, -41, -15, 20, -66, -174, -64, 40, -37, -1, -51, -141, -8, -159, -49, -80, 111, -20, -4, 97, 11, 71, -36, -79, -127, 160, -95, -101, 134, -74, 20, 69, -22, -30, -83, 33, 7, -136, -127, -14, -98, -85, -12, -43, -125, 134, -205, -78, 4, 85, 13, -17, 81, 25, -70, -23, -87, -109, -66, 59, 49, 21, -119, 31, -25, -164, -177, -152, 185, 102, 9, 47, -35, 87, 108, -81, -87, -132, 65, -1, -14, 35, 56]
3716E6k0M3j16r4J51q2M4J4p8R0j29J86J35l39K73j51k01K42kn4n1J03j03Q8j02
3741i7J25j71J69M8m2O9j76J73j1q7m6J0j06J75N0m1Mm8J41j37jJ6p0k9J48k64
3767a98K27j64J89j32K52k19Q0p7J01j31J35p9qK8K7r5J80j63J55j7K2o6j34O4
3791b3J02n2r2J24kn9L15j31j89R2k04K03j11N9j04L9K98m31K0K63j07p9rQ6k7
3816a9m8RL9l2p7J31J54k86R4K9J02m8j64O4J05j34K0J38Jq2k68J49J36j5j41
3841a43J90k0l1j31kP2o2J19o8Q1N7L8n5K9j4mPl5L1j44N0J07j83K19j75M1J76
3868A50l77L28p6r3p6J34j9l7K53k38R3J51j74n2L8o7PJ42r8M6r9R6N6m4j07n5
3894a18K09j7L0q5j34N7M9P3k3Rj21J43l8j9J19j25kP9j2j33KK51j98o0O9l9L8
$$ y = [56, 36, 79, -37, -131, 20, -62, -18, -4, -82, 8, -121, 65, 200, -139, 134, -17, -218, 24, 22, -32, -83, 20, -83, 5, -97, 28, -143, 26, 74, 32, 101, -75, 98, 87, 0, -46, -36, -142, 33, 83, 42, 46, -2, 139, 2, 1, 17, -53, -82, 66, -198, 29, -135, 54, -78, 174, -45, 35, -42, 59, -72, 63, -16, -24, 4, 31, -64, 116, -47, 108, 91, 113, 47, -87, -23, 79, 27, -65, 59, 57, -2, 313, 182, -7, 85, -119, 84, -27, 32, -72, -33, 265, -166, -146, 117, 10, -69, -78, 8, -19, -67, -58, -19, -51, -128, 3, 157, -129, -35, -6, 96, 48, -116, -52, 53, -81, -61, 77, 78, -4, -272, -123, 13, -2, -143, 47, 27, -4, -135, -137, -65, -127, -8, -76, 5, 62, 100, 45, 74, 60, 56, 63, 28, 59, -85, -35, 72, -111, 108, -67, -26, 150, -227, 101, 25, -68, -144, -10, -29, -66, 187, -51, 42, 193, 19, -33, 5, -62, -55, 87, -11, 35, -64, 32, 88, 44, -63, -118, 91, 74, 104, 19, -115, -58, -9, 64, 41, 50, -71, 72, 34, 15, 134, 9, 7, 86, 74, -59, -57, 194, -4, -64, 5, -34, 4]
3921Dj20K33k80%J72L5j90K24k02J47J2N5p3j6mj8j52J56N4Q0q7r0K16l28J2J31
3947b9l6J06k6p8j37J17k5Q9k5K03q8j19J49m3j96O6J01j09R2j32Q5j20N5O6L1
3972cK17k14J42j91O2l3k5rJ29lj42J41q3J8J43n6j2l8o2j54L05j49L0q7Q7j71
3998a58J42q6L0LQ9L8k33J65J7j52P8M1q2J08J7p3P4q1J00L9j88J39q9M7O1N6
4024A02k26L15r3m1JK0j14J62j68nk0J76j45R4n0r0J06R2p3j76K22Lm5p1O1Om7
4051dJ02k17J08p7J59o5R0j60m8J89k07L7J54j02K01j22J16k20P2m8m5J32p1m
4075c0p1J59R9j06L7K9j11J20k5N2j73Q2j12K19k45M3j05K30o4K6j23n9K1J42
4099C5P0k16P7QJ47j65n7J44p0p9R2j27L2J48J6j44J77j35j7m9P1L9J7q6N0L5
$$ y = [4, -116, 117, -163, -163, 9, 44, -146, 78, -124, 23, 35, 90, 17, 1, -3, -21, -173, -17, 37, 117, 30, -60, 156, -172, -160, -29, -65, 41, 15, -63, -200, -83, -108, -19, -44, 159, 71, -48, 101, 58, -138, -72, 29, -80, 12, -120, -35, -155, -100, -34, -3, 214, 0, 142, -49, 13, -20, -45, -54, 75, 72, -70, 71, -12, 6, 149, 93, 81, 43, -19, -173, 132, -17, 13, -74, 13, -158, -16, -102, -72, -69, 20, 58, -175, -10, 7, -145, -67, -26, -108, 0, 17, -56, 18, -63, 37, 76, -112, 27, -62, -15, 46, 102, -124, 191, 98, 57, 58, 78, -36, 126, -42, -47, -67, 109, -36, 58, 8, -82, 24, 116, 43, -133, 89, 92, 47, -24, 37, 43, -4, 98, -119, -11, -88, 71, 6, 96, -64, -112, 77, -130, -93, 61, -41, 160, 38, 154, -66, 6, -42, -87, 45, -26, -30, -101, 58, 157, 51, 88, 117, 6, 126, 101, 153, -20, 62, -50, 169, -76, -33, -138, 92, 28, 54, -69, -128, -107, 35, 105, -111, -34, -26, 121, -44, -101, 43, -27, -106, -14, -141, -109, 39, 55, -89, 88, -47, -64, -113, -42, -3, 14, -72, -22, 13]
4125A3J47j69l2j3J67o7j76J26j3M3K3n9N0l8j46K7j30J66mJ04K8M2k00K22j16
4150eP4q7K4J47k16J62j62J31j04m0N6Q1j8j20J9Q7j4n2M5L9r5n6Q0L1Mp2J78
4177A17j09j14J55k3j8l2M1j51J21M5j72M2J73r7R3m3P3q3n9l9Q4k3o1m1P9J01
4203E9K1K4j06J46j63O7k14J82j05J34J0j36M6J07l0j59J06R4o4j63K54J24k51
4226a7J1kJ4n4J37j59m4l6J31m1N7mQ3n8O3q5l0k9K28p6lm8L4k06JJ26N1nj11
4255g2J43Q0j34Q0r3Q3k11J34j51J74J02k05K08k85J49j96J70K1J41j87j25J4
4277a60K27o3j02P7O9j87M2Q8r2P1M1J0j40K69k08K58k02P4p6o3N0q7J40k39J04
4302i9J55k00L27k41M7l2n0K6j14N2n0J85k8q5J79Q5j36q8J28j25l5J29r0r1K31
$$ y = [13, 160, -9, -41, -54, 113, 46, -130, -4, -17, 26, 49, -10, 40, 2, -144, -117, -247, -81, -85, 19, 47, 89, -111, 111, -5, 69, -18, 6, 153, -63, 99, -63, 68, -36, -76, -20, 61, 43, -77, -58, 29, 15, -37, 8, 47, -48, -104, -24, 7, 11, -61, 117, 8, -106, 49, 26, 8, -24, 17, -134, -13, 32, -140, -98, 75, -22, 71, 28, 101, 18, -41, -80, 4, -19, -80, -121, -42, 59, 80, 104, -2, 144, -19, 48, -166, 16, -89, 45, 55, -81, -35, 72, 42, -117, -11, 83, 19, -144, 110, 234, -17, -6, -8, 6, -48, 89, -70, -114, -150, -19, -60, -3, -7, 76, 18, 81, -4, -34, -63, 165, 89, 86, 38, 72, -134, -133, -7, 44, 39, -72, 71, 151, 17, 97, 4, 87, -124, 10, -141, 33, 135, -70, 138, -147, 2, -194, -24, -3, 138, -49, -174, -160, 67, 4, -98, -21, 48, -139, -97, -9, -101, -30, 11, 21, -119, 150, -58, 200, -2, 72, -4, -67, -17, -104, 36, -203, -99, 56, -144, 183, -58, -11, -43, -93, -67, -181, -129, -179, 6, -22, -107, 72, 157, 21, -67, 61, -64, -99, 30, -60, -151, 80]
4327H0j13J69j68j0J02l4O1j93J24K2jj65J39L0J1J17j60m3m3NKK27k49J58K9
4352I7j69J23j60O0K6J6j17K75p1rk05K91k96J46Q0r6P1j77R4r1R7J10o7o2k7
4377f1P0Q4j42k9J13K8J3L4k37J19M4j75N9J22m9k2L0nJ05r1j23J05R8mj56J38
4403F8p8l4mM7j64J92P4K8j95J0J7k8M3Q9o0k7J1j04L5J14k3j29J52j40O3j9J57
4430I5j60j41J84J8K2p7j02K70o1q9k7R2KNJ3r4o6J57m2q5J31o6J8L7j03r5K69
4457A05r7L5J7L7j36J8J10K1J7j94n5Q3l5o9J90K04l43K2m7L0j25K80j13KM3k9
4483b9QL4Q4j03J7J2O4j19k7lJ57pk70K41l8o0P6j38p1K18J27j26n2R2j55p7k3
4510a68J92j04p6N8J19N9p1N8k67K57K4j23R0p9K1j51J60K2j46J63q6Q8n7J60
$$ y = [80, -33, 136, -32, -42, 60, 26, 87, -106, 18, 40, 39, -126, 13, 43, 54, 171, 11, -32, -75, -70, -68, 159, -90, 68, 97, -72, 51, -109, -49, -23, -7, -124, 151, 80, 71, -134, 157, -139, 7, 87, -9, 62, -115, -21, -112, -15, 95, 28, -34, -61, 9, 93, -49, -78, 35, 63, 76, 110, -127, -8, 36, -139, -80, 42, -7, -29, 1, -4, 101, 10, -113, -8, 90, 86, -70, 68, -10, -44, -48, -1, -165, 27, 101, 129, -66, -56, -39, -67, -24, 65, 5, -22, -11, -115, -80, 34, 11, -118, 34, -106, -43, -62, 95, -65, -206, -22, -4, 18, -59, -161, 109, 48, -41, -68, 24, 26, 31, 44, -50, -116, 41, -1, -86, 45, -21, -3, 34, -69, -164, 105, 8, 43, 60, 97, -39, -21, 89, 110, 127, -67, -122, -39, -74, -143, 47, 251, -92, -70, -117, -87, -212, 68, -45, -43, 0, -29, -21, 13, 97, -6, 11, 23, 87, -32, -59, -62, 95, 88, -182, 59, 21, -39, 37, -101, -172, 46, 173, 47, -5, 87, -68, -145, -168, 24, -80, -156, -98, 21, 80, 9, 67, -200, 57, 81, -42, 48, -31, -10, -161, -1, 21, -125, 38, -48, 40, -17, 143]
4534A43j07Q4k02J13l7q8K3J48j03j2L2m5M9P9j24M0J0O2r8o8K8J71m5j7n0Mk4
4561c4J27j48N5J23k00J1j29J67J26j61j9J02l5J17j28l6J08lj15O4Pn3N6p6J57
4586H3j38Q1j51K57k14N7j19J90J05j79kJ2%l7K8j23K35m3Q5j24j23K90k35k30
4610b95L12Q1j09j72J51j4l5l4J57j82J20o7j4P6m6L2J30k7j91L4N6lJ4L4N9j82
4636a15J76q5m7k6k2J73j42R9o6P2l0m1J07k0J03j71o3J04j09J69k00J68M3J3
4660I0r6M7p5l8J25q7J10j13N7j30Q1J06r7J36j07K2j07KK4K5K2pJ51p4r0j4r3
4687a30Q8J43j46J1j4j09L00j26r5L1J33Rk27J94l4J02j12J28j07l5N7k2n9K5
4711En3J3r9K68k3k42j00Q4pJ74p5N3P9j38Q3k5L6Lo0P4j46P2J6L2N7p6n7M4O2
$$ y = [143, 36, 120, -82, 31, -6, -94, -71, 77, -26, -38, -6, -51, -2, 77, -47, -7, 3, 65, -33, -101, -73, 98, 53, 36, -14, -10, -34, 93, -55, 0, 123, -77, -66, -195, -28, 98, -63, -82, 20, -15, 102, -26, -62, 46, 43, -72, -8, -1, -54, 2, -74, 83, -55, 26, -125, 132, -82, -25, -144, 46, 151, -28, -30, -18, -18, -55, -27, -150, 85, 42, 127, 3, -120, 170, -65, -295, 17, 98, -11, -183, -32, -46, -81, -115, 42, -140, -20, -87, -101, -25, -71, -39, 91, 64, -127, -93, -37, -40, -26, 8, 67, -115, 61, -24, -71, -97, -119, 54, -88, 11, -55, 17, -13, -54, 53, 33, 136, -35, -98, 6, -103, 66, -134, 34, 77, 90, -6, 41, -34, -72, 53, -34, 76, -37, 20, -110, -29, 77, -20, 116, 9, 31, -76, -74, -50, -25, -3, -10, 141, 67, -23, -37, -130, -42, 101, -45, -34, -48, -157, 143, 17, -78, -47, 86, 95, -132, 62, 28, 130, 18, 146, 39, 4, 61, 39, -20, 5, -48, -35, -134, 134, 111, -131, -231, -147, -154, 20, -55, -2, 77, -61, 22, -3, 33, 36, -24, 50, -96, -24, -8, 24, 81, 5, -52, -8, 54]
4740E4j63J14O6j4kl1m4M0J92l86J90J11m3j24J12p5J54j30p8m1%k6K11r9jL6
4766B3M9j48L7j23K42j87J01j4R9j8k23J05J32J2p0q6P1j09K4P2j2l4R2O0n5j32
4792i2N5M8j91J20KJ85j44N6n1O7lk52R0Q0k6Q0K8K5p1K8P7j39n2LN0P3m6j09
4820a09j1ML8J49j67P6j14J71r0R1m5O6R4k55K11k31R7Q0L7k14J88j45j04K66
4844H3k4j33J23j65JR5l8rJ86k21L6J24J14p9K0r2o7J40j97Q6P3q9JJ1J4O8l0
4871C1J31j13j60oM7k52M07r6M3RR2p0j1j19K2K31k46J5L3K2M8j34J47k9PL4j87
4898a04J64j11pJ39L6j03p7R0K53l57M9l4J85k03R0k7m7lm2J35Mm1J6K5L3o5j52
4925a54J89O8k99J73L8l9j03R2K64l29J75k0o2O5k77J47r7J47j10m1K37j00Q4
$$ y = [54, -109, 5, 71, 57, 55, 24, -20, 20, 212, -174, 16, 127, 84, -40, 72, -3, 151, 21, -57, -98, -98, -124, 87, -12, -13, 23, 72, -76, -39, -162, 80, -107, -6, -20, 79, 61, -162, -57, 75, 87, 17, -69, 2, -107, -83, -11, -23, -57, 35, 95, 40, -92, -37, 11, -180, -60, -58, 127, -17, 39, -12, 55, 52, -200, -110, -30, -56, 24, 52, 77, 6, 34, 111, -28, -80, -77, -27, 46, 0, -109, -120, -116, -78, 71, -96, -20, -134, 37, -53, 38, -7, 59, 153, -102, 109, -122, -25, 55, 92, -122, 66, -79, -183, 83, 59, -74, 49, -116, -115, -20, -58, -67, 119, -102, -66, 58, 172, 93, 113, 21, -46, 94, -103, -17, 56, -33, -32, -21, -7, 61, 31, 162, 49, -111, -117, -70, -322, 85, -11, 32, 41, 133, 63, 52, -67, -45, 186, -60, -45, -12, 10, 58, -76, 71, 42, 49, 83, -104, 60, -51, -58, 81, 117, 14, -63, 27, 280, -77, -28, -62, 123, -80, 10, -17, -64, -67, -109, 26, 30, -11, 5, 30, 63, -2, -154, 35, 103, -196, -23, 15, -24, -127, -35, 229, -100, 75, 55, -7, 58, -219, -72, -169, -22, -132, -173, 64, -36, 48]
4948D8j4n1qJ7L0k9nm4R6j9J5Ql2j01J19P3J0K0k17K00k44K88j07P5j27mn9J36
4976G4j53J22j32k7m1K04m9k9L5oM4j26J53p7R8j81L37l18J31j36J13K8j30N6
5000a0J99k74J87j94N8O1j16NK19k14N7O7j40n3P1K23k79j9K70o4j2j3RN6j72
5025g8k1J77r3J6J68j61M3j9q0J17Oj19L3J41j67J06K7k5J4j44J72j11K7m7Q9
5050G1K2P5j92k5J74j99o3J45r1J74o3o2nO1K6j31M2Km5Q6K6J51l41p0K09q7J99
5077H9k00J10n5J9J04m7J34m4j02J5M5%j11J34k46J74o8J18p3j18J60j75R2KJ09
5102F6k23N7J27j1m9J3J16k07Q6j33K42q7Q7L1q0k3j79K08j00J89k82K75r3p6
5126d6KP6p5jk0Q7j2J28j30N1J08l06M7q8L16j17o0M0J74j59m1R3q5L0l0o8J02
$$ y = [48, 34, -17, -25, -8, 22, -7, -12, -56, 40, 21, 36, 44, 12, -89, 30, 103, 113, 133, -84, 116, -128, 160, 53, 128, 1, -3, -62, 74, -79, 43, -89, -116, -157, 47, -2, -31, 4, -2, 42, -84, 69, -8, 90, -91, 246, -72, 59, -77, 36, 64, -66, -10, 189, -85, 102, -92, -34, 27, -89, -84, 135, -79, -22, 45, -95, -148, -77, 146, -133, -152, 118, 54, 42, 29, 38, 94, -78, -99, 78, -15, 1, 169, 8, 51, 32, -48, 69, 75, -44, -11, 130, -37, 69, 96, 71, 85, -59, 113, 2, 29, -18, 71, 93, 168, -24, -49, 125, -74, -137, 8, -83, 91, 28, -34, -39, 22, 48, -83, -41, -39, -84, 2, 28, 179, -162, -232, -23, -110, 89, -111, -1, -56, -37, 67, 20, 154, 110, 8, 23, 68, 68, -43, 91, -155, 19, -49, 69, -4, -122, 38, -137, -45, -43, 66, -157, -100, 27, 16, -33, -20, 96, -111, -25, -158, 84, -3, 84, 115, 35, 12, -167, 41, -59, 130, -152, 123, 30, -46, -44, 32, -43, -44, -64, 23, 11, 139, 9, 60, 168, -138, -91, -179, 137, 20, -40, 0, 174, 15, -26, 67, -18, 12, -18, -86, 16]
5153A6M6j45K2J32k1j25j54K02j9R9j44J39J06k00O3n0qJ9J16j92J05Qj50J22
5177a3r1R6K4M5j60J8L3l5O6J50j42n1P6o4L3L0mj30K28k17J61R5j95k1J23k03
5203a48J79k6o5J75l73L63j96J35N3j64L6M6%n4j7J08m6l0o4N8J03Q7l13J65j1
5228Aj56J82j34N6J19j13PR3M5mk42Q7J79k06p8L3K81j30J9R0k05K33k03J3L1
5253bK3n0J11j33Q6R0k17M8L7n3n0O4J6R7j85l3J12l5R1o4N0j3O6RL6r2J15j31
5281gk4P3j58J97On3j53J98j65M8M0M0j49l9Q3O8r9K7O4J26j23O4j44J55l2J40
5307A83j95j7lQ4o8Q7p2n6K65k89R9no9L4R9M1r4K6n9k1k7j10J12J68p8n1N8j71
5335a29J36qP1J5k9L3Oj99J4k0J53j4P6m6j16N5L5N4p2J50k10J2M2J60j86o0l8
$$ y = [16, 62, -83, -61, 71, 50, -75, -229, -27, -46, 53, -91, 48, 154, -46, 17, -33, -41, -22, 94, -98, 7, 15, -135, -13, -104, -8, 16, 61, -99, -81, -48, -83, -17, 133, -9, -60, 16, -48, -15, 15, 11, -119, 109, -108, 53, 148, -47, -68, 55, -148, 31, 5, -60, 115, -258, 105, -91, 44, 97, -67, -31, 15, 15, -39, -56, 52, 6, -24, -88, -30, 73, 160, -153, 12, 1, -155, 27, -107, -51, 68, -45, -38, 55, 100, 96, -146, -59, 120, -86, -164, -131, 150, 20, 39, 129, -76, 157, -46, -33, -2, 21, -29, 82, -51, 35, 125, -92, -44, -7, -60, -110, -46, -30, 67, -118, -151, -39, -74, 17, -47, 3, -10, 56, 65, 101, 9, 124, -7, -31, 42, -116, 81, 87, 34, -119, 79, -86, -38, 2, 42, -107, -146, -63, 5, -94, -67, -3, 123, 0, 64, -80, 75, 43, 183, -12, -29, -32, 52, -16, 71, -1, -57, 208, -81, 18, 13, -56, -22, 77, 118, 24, 50, -9, -30, -57, -167, -55, 113, 35, -16, 42, -129, 7, -1, 70, 85, 56, 89, 95, -104, -90, -110, 43, 29, 105, 59, -57, -2, 33, 87, 15, 165, -45, -33, 9, 169, -17, -77, -115]
5362a15L7J67j49L3J47l9j21N9j54J91j91J45J7j3QJ34k04l9R2Pr7l2J07o4O1
5387a3rL6jK6mo6r7R1N4K3k3O6n4r3M9O7j82J20J10k57J26J00m3n9j6J11k2k2
5415A8J63j57q9R3m0J21j13R9l3j28l8J3J60q6k6J27J2Jk65J27J6OJ35m2n9Km8
5442c1P8j06Q8LP4j98OJ48r8q6L9O2J03j04J70k15R6O1k67K10o8LK3m5J93o0j54
5469g5Q3K3m2j26K36k8J4j3j58O3l8N8r8J01j4J7q2j06J02jO0O9j02K6K50k30
5495a1J38j03P3j8l4n4m7J31J11k73K29k77J84p1l7M9J24p6j69O9OK1r6J23k3
5520c1Qj06J39r5j8K41m2r6p5J72r0j87J60j2J59j37ol0J19%j11N0L8lp7QJ4m9
5548e7Q2RJp6O5K1l5J98k05J3J03j43O8qk10P6J30j19J49M6j23M8j81J49J05r4
$$ y = [-115, -78, 89, -60, -27, 120, 81, -40, 19, -135, 56, -135, 10, 27, 14, 22, 156, -48, -87, 5, 12, -85, -117, -10, -74, -13, -22, 14, 13, 39, 35, -31, -128, -37, 17, 40, 17, 83, 29, -64, -15, 52, -130, -10, 100, -157, -31, 69, 26, -33, -49, 62, 40, 18, 181, 24, -65, 28, -12, 109, -4, 95, 62, -66, -104, -91, 69, -17, -43, 84, 96, 97, -168, -41, -25, -19, 116, 74, 15, 17, -31, 47, -59, 29, 32, 106, -92, -86, 62, -36, -122, -83, -21, 82, -22, 148, -67, 29, 90, -177, 33, -35, -32, -9, -54, 139, 79, -75, 8, 31, -11, -137, 99, 71, 85, 72, -86, -23, -61, -3, -101, 0, -14, 3, -79, -185, -83, -84, -24, 45, -57, -31, 219, -11, 127, 24, 97, 79, 45, -9, -56, 75, 186, -87, 142, -135, 49, -22, -59, -10, 114, 38, -131, -62, -56, -35, -131, -8, -31, -23, -129, 10, -85, -103, 138, 96, 0, -75, 97, 7, -180, -20, -32, 127, -10, -16, -46, 73, 73, -38, 12, 50, 47, -30, -22, -8, -57, 25, 34, 35, -41, 24, 45, 10, 208, 3, 16, 119, -24, 44, 36, -174, -98, 32, -87, 62, 108, -15, 33, -148, 1, 106, 12]
5574A2J3K13r2j91K2Q1j70K24lM6k61J13Q5j79J8J75j34O3o1q2R1m3J14p5K8j5
5600hN0j74O9O4l0P6n0n5moJ3Q5p4J6o8l7K01m2R6p7m9k6O5j91P7J36J13j11k00
5629a41K06K7K3j83P6J04o8L5r0j0L2l1J19j54K92k12K6J62k86J82o3j40J28p
5653B7m3M3j10p1J35Rj40J23K04n1j49RL7M7j4n2R3q0M3j33R5j5j4k9N5K02o3
5680A58l5m5j81NQ6j80J71R5j9j79P2O4j45M6J38m8L8k4p9J47j33J06N8j14q7
5705h5k4M5m9J93j43M4k23J80J39o2pj25K98k78J34k16K32p6Q2r6R8J0j26o9j26
5730b50K87q9R2j62K17o2j08R5ML4m6j10J85l05J99N8mM8j49R4q2n9K00j55Lm
5756f9J32Qj26L3j3J79k13l2J08j12l3J95j80J67p0p5J96j59j55J87r2Q1J39j94
$$ y = [12, 25, 238, 146, -45, -23, 58, -112, 112, 109, 155, -106, 7, 92, -87, -69, 106, -28, 35, -26, -108, -17, -60, 54, -21, 7, -8, 42, -132, -63, 1, -29, 47, -3, -58, -62, -68, -55, 30, -44, -28, -96, -133, 68, 26, 122, 45, -4, -30, 35, -156, -79, 57, 170, 59, -141, 65, 92, 115, -68, 8, 112, 44, 79, -11, -21, 11, -20, 99, -55, 237, 25, 51, 213, -73, 109, 46, -94, 34, 27, -16, 27, -83, -154, -19, -10, -150, -27, 177, 126, -23, -14, 23, 70, 56, 4, 97, 17, 60, -73, 22, 7, -7, -36, 19, 221, 158, 123, 78, -103, -98, -12, -192, -21, 74, 55, -124, -52, 12, -133, -87, 51, 3, 41, 17, -62, 85, -48, 58, 116, 2, -85, -109, -64, -113, 80, -63, -19, -242, -62, 77, 15, 8, -117, 181, -97, 37, -179, 53, -23, 59, -37, 61, 71, -55, -124, -250, 37, -52, 40, -122, 95, 33, -75, 20, 24, 58, 12, -98, 87, -218, -19, 39, 35, 83, -66, 28, -54, -113, 87, -68, -65, -69, 63, 71, -55, -22, -35, 144, -69, -101, 7, -105, -138, 57, -123, 44, -26, -101, 95, -64, -219, -32, -124, -43, 96, -98]
5780i8J39j19J01Q2j8o5j34R6k7Q5L4j08O8j39J63o0j42m9J44j21L16q2J5m1J9
5805E9m2k00J91j5pr3P6q8K07Oj24R5j28J07j32j32K72j23J51o5N1o1Q2k08J73
5830E2k2Rl0j28P0K19k11Q1R2j5p0k00K02j09Q4K4L3j41K58j75j09K61j23j95
5854a43J18j33K4J06o6J04m4J29K9j97k8l0%K05Pl8j68O0N9j59J85n7K09p0r7
5879Ek1m4Q4N2j07J40m5j5o5Mk6j04J27k8J95k21O0O9J3j08J20q8m3J7J3q2K25
5906A27j93J36j16K38j42k40K32r8J16j28r0J72O1K0j03p6J8%R4K3pK15l03m2
5930h6P0K18j71P4j09J01l8n3l4lp7J31Ml7l4R1j07J97j66MJ92k83M4J58n2o6
5956c2J86j90K0K1N5j98L4L3Q6K13j31Q3k04P3j37K56k01J20j52K78l07L3p8K39
$$ y = [-98, 41, -78, 23, 105, 87, 22, -112, -16, -43, 42, 76, -32, 36, -103, 60, 0, -142, -191, -47, -168, 148, 66, 81, 40, 59, 17, -183, 8, -7, -14, -107, -31, -119, 88, 94, -30, 65, -63, 44, -88, -220, 52, -71, 80, 15, 66, 5, 87, -121, 52, 30, 39, 9, -119, -49, 170, -41, 40, 132, 117, 47, -153, 49, -60, 24, 48, 81, -60, 198, 23, -86, 175, 52, -143, -25, -158, -134, -28, -94, 10, -34, 95, 124, -73, -101, -131, -131, 74, 81, 43, -125, -65, -6, -165, 20, -37, 172, 102, 5, -16, -60, 24, 76, -31, 109, 64, 49, -16, -12, -38, -142, -15, -43, 152, -69, -9, 60, 73, -35, 85, -3, -46, -29, -16, -98, 127, -66, 70, -46, 192, 50, -190, 42, -56, 60, -68, -158, 14, 75, 95, -8, -84, -66, -66, 28, 51, 44, 259, -44, -86, -16, 202, 31, 105, -4, 97, 59, 6, -28, -31, -108, 23, 27, -10, -44, 47, -60, 137, -29, -25, 167, -116, -72, 86, 34, -32, 154, -36, -16, 5, 60, -138, -104, -71, 15, 228, 97, 180, -24, 49, -88, 168, -33, 87, -65, 213, -94, -61, -139, 100]
5980A00k07R7k3l5K9R6J23k62J73o4%r8K02j81K42o3r6M0j18J48Jj95j8K7J20
6005C8m9o0J44j2K9j33J38K0n4j45j46K87m6j35J85j75O1J53j08L4q1J0l0k6J49
6030D8j44P0M4j8n6R3r1n4L1J31n6N3q7P6p9M2J10j66J32p9P5n5j04R7L2n3J32
6057A24j74j11J29n0M6K2o6j11K34k4r4L4p0Q9p9R0J42k12N0j65J28N1kj39nL46
6083A83q6l7j5r3r3J35M9m6J93r9j99K54j62R5n1n9O1qQ1l15K95J4l3j1J2r6n8
6110h9L9J7M8L1p9P9O5k36K23k25J37j80L20j03J53j42J7j62J88k75J35l5m6J91
6134G1j49L9k3K52j62N7j2j32K42kk61lJ3P8p0o1K12p9L5N1j35M3j4Q7j5p4n7
6161f9K3lP4o9J10L2j69K15l7mk49P1L23k37K9J10j65j8J15j3p7KL9q4K3rO7r0
$$ y = [100, -107, -10, -33, -68, -39, 57, 180, -82, 91, 27, 27, -71, 131, -50, 192, 129, 33, 73, -45, 103, 104, -91, -109, -82, 38, -11, -71, 73, 61, 90, -43, 95, 115, 61, -84, -230, 57, 11, -124, 61, -114, -53, 100, -8, 26, -55, -45, -75, -101, 48, -96, -26, 18, 0, -56, 37, -54, -108, -77, 54, -2, 51, -36, 40, -39, 3, 113, -53, 79, 0, 75, 20, -84, 13, 45, -8, 124, -50, -161, -32, -82, -36, -14, -80, -191, 43, 19, -75, -41, -111, -22, -101, -11, 131, -81, -31, -196, -68, -17, -19, -158, -163, 183, 97, 60, 45, -48, -141, -6, 43, -3, 190, 91, -108, 146, -16, 79, 28, -31, 30, 22, 103, -212, 83, 97, 64, 53, 65, -31, -89, -50, -33, 15, 46, -33, 46, 111, -125, 98, -127, 10, -170, 150, 47, 200, 58, 75, -87, 101, -174, -39, -74, -120, 71, -78, -39, -62, 190, 28, 85, 73, -59, 183, 181, -80, -83, -70, 8, -62, -123, 89, 10, 45, 96, -39, 4, -10, 77, 62, -12, -69, -46, -49, 25, -44, 66, 98, -71, 144, 107, 103, -146, -75, 248, 11, 40, 150, -15, -33, 82, 69, -8, -6, 33, -51, -28, -37, 30, -60]
6189f0K20k87J29m2M7j0l0kK9n2P1j31J04J11k77J82K6O9r8j37K29l7n3J76k17
6214d0J19p2Jm2M7q7K8J0k2r1jJ60r0qJ32M8o3j7Qm9KOP1j03Lm9J09j6n7M5J17
6245I9n3k48K92k05j7K50N3j50Rp6o5L5O4O9k7j18J32j57rK12k53O3J38k1P7n7
6271C7j22k8N9K7j78M4Q1m1L42k15p0J33L1j80J87j60K3R8J19j40j18J47l1k14
6295a69K11k01Q7K9J45r1n8N1M4j5p9M9j10J65Q5l41J12J43r1RJ21M7l00K92O4
6320A99k40k8K17j90J35l6J32p7j26L7j86J23J7J32j78K32k15n8K06j15K29j56
6342E4rK3p9J6k3p3J40j05J14k2k7l1k0P7q7j26lJ92p7r7R6M6K2Q9j34l7L7J90
6370A46j29p9J22j27J54j27K58j32n3qM5j43N6j4M0r8KM5k2J5J53q5n5L5L6M3
$$ y = [-60, 160, -127, 2, -40, 7, -3, -33, -35, -6, -58, 13, -118, -14, 97, -180, 2, 28, 97, -1, -138, 91, 54, 1, 177, -40, 79, 7, 8, -34, 13, -74, -46, -36, -58, -149, -150, 10, -80, -88, 44, 92, 29, 12, 20, -29, -27, -21, 50, -53, -50, -99, 10, -6, -63, -18, 99, 46, -202, 90, -115, -132, 118, 171, 21, 30, -46, -111, -76, -12, 57, 30, -88, 44, -113, -122, 90, -163, -100, 38, 17, 94, 37, -85, -113, -54, -27, -205, -161, -80, -121, 221, 6, -64, 69, 100, -80, 107, -53, -30, 68, 187, 47, -71, 76, 45, -169, 42, -159, -72, -43, 102, 11, -47, 4, 48, 33, -46, 3, -107, 58, 143, -198, -86, 57, -34, -25, 96, 143, -157, 135, 199, -41, -69, 148, -42, 93, 57, 189, 112, -14, 23, -163, -40, -23, 109, -69, 163, -52, -110, 96, -19, 210, 54, 45, 68, -11, 5, -18, -91, 49, -56, 58, 36, 9, -22, -42, 35, -52, -178, -181, 11, -66, -163, -67, -21, 1, 90, -44, -81, -44, 146, 17, -62, 60, -67, 87, -40, 218, 86, 33, 25, 70, -73, -17, -31, 9, -89, -87, -42, -64, -49, 104, 19, -36, -1, 35, 78]
6396G8j4j26J74p7j31J47k4k7mN4j42Q8L9L7j6J19j04k1oq1P0j21nQ1J02j25n2
6423h7l9P9k8K18j30L4J0j49R5n4N5J06n9L8Kq3J16j23K7J0K8N7j54j6Q1O8j4
6450H8k03P2R0j41jQ0Jj1N1j69K16Pl1j12J61O1k00J9L5O2j47P3P6j33K6K7j36
6477a39J1K15j93J42j34L0J30J30k02Oj08Q8M7N5j65k2J42KP9q6M5j61K22k53
6501a19J57J46k64J07R6n0j2QK3K1k43J97Kj75J97j29J47q0q4J6K3r5J04Ok7J17
6527H9j25J15j71P6J4L1J01j86p3J81K7j81jP8n8Q1j6j9M0J8K3j46J90r6m0N1
6553Cn8j52K32J2l4j16J04K9n4J71k77K94N1j46j45J17L1k15J51J3R1j1k78J73
6577a4p3P4J6j05K3J04k9l9q4K04j04qr5Q7QP5j96J56J19k01J44r3q7N8N6J05
$$ y = [78, 64, -62, 112, 35, -96, 51, 27, 0, -4, 50, -92, -4, 35, 72, 56, 175, 71, 50, 44, -37, 33, -88, -93, -12, 90, -35, -87, -126, -47, -75, 143, 13, 47, 57, -92, 3, -51, 4, 110, 51, 89, 91, 8, 124, 1, 28, 38, 66, 123, -31, -47, 34, 102, 88, -115, -43, 47, -94, -95, -15, -14, -25, 26, -143, 73, 80, 49, -63, 98, 159, -41, -22, 13, 75, -72, 1, 77, -56, -30, -3, -139, -128, 87, -106, 36, -98, -68, 62, 192, -10, -4, -112, -24, 23, 78, -87, -109, 33, 35, 114, 28, 73, -88, 134, -119, 38, 184, -80, 27, 123, 73, 61, 69, 92, 113, -130, 67, 69, -106, 91, -38, 109, 29, -55, -39, -16, -111, -7, -1, -28, 89, -36, 79, -92, -16, -2, 29, 130, -56, -129, 52, 79, -102, -103, -25, -83, -2, -18, -37, 3, 21, 44, -102, 88, -8, -48, 3, -55, -207, 25, 37, 3, -113, -9, 20, -34, 137, -140, 154, 205, 59, -86, 31, 62, -153, -2, 11, 102, 91, -187, -14, -87, -13, 3, -102, -79, 25, -4, -43, -127, 77, -27, -35, -130, -43, -35, 40, -156, 0, 119, -82, 62, -31, -118, -60, -4, 101]
6603A01N4k17K7O7n9p5J35o6p8J21l9nJ15r4N0q2K12k09jQJN8J8j16J45k70L13
6630A14j14Rj0J1Q1j35R4o2K7j9J31j33R3j39p7J26m7J21n4N5Kp3JK9j17j4J49
6657D9q1Q4Q8j70j27R7r1J71J6k18N9MJ69M9j97P7J42j67p9J17K14l21J44J07
6681A36k65K82l9j33k0O4n9R3j01o3J87j37M6n5L7N3M5j97N7k6K46j81PP0J8j05
6707d0L1k7k9pJ17jj06j5O0K3Rj69K05Jj19K40j11j41J15K8K7j64O3q4R2L2j5
6734A5J91k43K18j82j26J5R2J3J71k70J45k0o9k1O8N2j55q1J14J77j33J2L3j44
6758a28O7L2K1R0j69K7L1n0P2j04L8qJ3o1O8mK59j56K2j65J25j6Q2k3j78N7PN5
6786Dk6p5Mj0J05j1P6j68J41j27j6J17q8J41j55Q3j05K08M1j02M1N5j02j01Q3
$$ y = [101, 155, -62, -35, 32, -27, -102, 33, -33, -111, 10, -29, -34, 81, -13, 37, -45, 167, -42, -43, -35, -34, 24, 42, -74, 71, -199, 114, 0, 9, -1, 10, 91, -44, 50, -12, 15, -4, 127, -6, 87, -52, -129, -3, -50, 71, 17, 72, 74, 1, 2, 31, -86, -100, 49, -32, 52, 140, -30, -157, -60, -151, 20, 36, -182, -123, -119, 50, 99, -98, -21, 121, -46, -125, -8, 206, -115, 29, 136, -129, 153, 114, -19, -39, 25, -34, 59, -42, -105, 82, -55, -9, -64, -27, 26, 71, -126, -69, -95, 151, -30, -23, 47, 65, -40, -9, -36, -65, -72, 45, 44, -62, -77, -17, 6, 15, -154, 51, 52, -67, 173, 62, -79, 36, 64, 91, -73, -10, -94, -2, 30, 15, 206, -37, 181, -1, -127, -112, -20, -7, 164, -106, 39, 19, -50, -71, -3, 49, -106, -187, -73, 104, -29, -17, 16, -128, -61, -29, -8, 82, -87, -60, -29, -79, -7, -111, -73, -81, -68, -129, -61, -65, 194, 38, 60, -105, 20, 4, 86, 63, -115, -58, -51, 4, -22, -97, -93, -103, 2, -9, 67, -101, 40, -87, -103, 14, -74, 67, -88, -5, -110, 98, 139, 37, 78, 133, 31, -70, 13]
6811A3j82J94j5l1K1K9j29J30p0R6j38K49m5j76Q9j67K13q3j27J31P5k38K64k74
6835a71J87O1k2n4j48K22j09J21p9O2j44J12k8l5q3K27j39q8P0q2J48lJ6M6j05
6860a8J4o6J46j5r9o5J71j32J01k39K02K7q7N9L7j84J14J21j51J55q4kO1O7j43
6885a0O9M6q2O8j90J24r9Q9O6o8o0O6K8j00J20Kj34K2j01J12P7q9J28n2qj7q6
6912g9P5LR0o9k7r9K24r4j64J8J29j1j20J14M6l7M6PR7l09K13j96K89k6j26J75
6938A69k61J45K4j2j74J75j78J91j23R2j7j79K00j25K1o8P5J12r4k7K2Kj02K25
6962I3om7j0j8%Rn4J5j20J87p5M1J05k29O2j49R6K31n5N5N3r3q8j5m2O0Q8k08
6990a14L9P5k33L98j70j07K1L7L1R0k4j78J73k2j15P3j00j7J88p8J57p6Q5j88
$$ y = [13, -169, 25, 10, -21, 0, 29, -100, 30, -40, 56, -82, 167, 122, -54, 35, -132, 81, -2, -129, 2, 77, -161, 103, -171, 16, 77, 55, 1, -147, 75, -34, 87, 8, 70, -74, 38, 10, -25, -108, 119, -20, -108, -38, -120, 28, 25, 41, 87, -18, -4, -70, 76, 61, -38, -103, 68, -64, 37, -202, 0, 27, -60, -1, 36, -148, -34, 87, -64, 91, 7, 5, 66, 133, -10, 59, 105, 23, 91, -99, 25, -74, 15, 81, 13, -47, 19, 47, -53, 67, 69, -65, -43, -144, -32, 45, -44, 84, 32, 24, 7, -79, -4, -1, 89, 20, -7, -106, 118, 24, -140, -122, 7, -4, -124, -10, 36, -1, 45, 52, 149, -160, 53, -143, 146, 120, -6, 169, -92, 53, 77, 65, -109, 66, -112, 79, -44, 48, 31, -148, 52, -73, -52, -120, -45, 67, -27, -54, -32, -30, -132, 93, 87, 40, 30, 12, 12, 21, -33, -18, -138, 49, -26, 15, 120, -109, -47, -196, -100, 131, 76, 131, 184, 91, 3, -12, -54, 6, 94, -114, -75, 0, -233, 165, -5, -112, -91, -54, -23, 67, 43, -135, 38, 16, -99, -26, -126, -143, 45, -33, 124, 48, 133, -55]
7014e5p1K14j24J0M5n2J19j41LM2J10KK9j77k2K39j36J45k42R8J7j06j6M7m1R0
7040B7j97J74q8L0O1P8r3J9j7p9l7j5J26j6L0k5r5J27n9j29J88k8P4j19J35j99
7066a27J72o5j13J0J67m5l4J00L1j82O2L23k82m1L0N7J0Or3K6J20Kk18K44ll08
7092a51K32k08J65p3PJ34j64Q8j34k2K07r2Q1m0l3P5j74J61n9o4Q6j32O6M5l0
7117b9J82j86n3N1K4n3J26j00O1K19l49K28j9p2k7k4j1M9r4K9L4l2K4R0j8K5r3
7144a8o9R2j0M9m0j45J49n4Q9K4p3O2p5n2J57q9J77j17nP9j04k9LL9l9m7L6o8
7172g8J07J1p8O1jo6K01j92o8K02o5Q4k0l04L84k95Q6L9M5j4J1j6q3N5R1j19n6
7199g8j1J58j28N9m3p6J88r3l7lJ49j01k2j25Q5Q2%k9m9NK84l81K59q7m5j6J88
$$ y = [-55, -126, 88, -36, -26, 19, -33, 86, -55, -52, -10, 100, 102, 131, -46, -68, 171, 35, 180, -62, 36, 53, -53, -69, -22, -63, 27, -170, 4, -84, -54, 7, 85, -8, 11, -6, -85, -122, -137, -11, -27, 3, -22, -117, 10, -49, -178, 10, -18, 56, -63, 72, -127, 45, -20, -133, -123, 44, -1, -35, 65, 96, -86, -24, 299, 17, -24, 6, 63, 73, 79, -14, 12, 132, 134, -84, 160, 157, -151, 81, -127, 38, -35, -28, 106, -58, 30, -104, -126, 81, -11, 70, 30, -3, 72, -102, 59, 0, -64, 22, -110, -44, 1, -29, 153, -33, -86, -35, -11, -64, 62, -38, 23, 242, -107, 121, 102, 30, 3, -21, -32, 17, -77, -48, -14, -46, -22, 68, 50, 75, -18, -87, 5, -5, 44, 4, -141, 8, -46, 43, 67, -6, 56, -19, -71, 86, -3, 174, 57, 52, 131, 27, -2, 1, 40, 1, -46, -10, -78, 29, 40, -38, 23, 22, -44, 157, -35, -103, 99, 34, 118, 98, -206, 178, -117, -31, 8, 53, 39, 50, 34, -49, 6, 97, -22, -78, -89, 69, -59, 0, -43, -119, 69, -24, -61, -64, 85, -16, -38, -163, -78, 4, 4, -25, -74, -69, 215, -166, 93, 6, -39, -55, 133]
7226A33j64j55J76j25J51r3J18m4k9k8P6j19P2n0J33k5L3p8K1J12j1j78q4J94
$$ y = [133, -31, -186, -10, -135, 16, -77, 41, -3, -32, -60, 16, -103, -31, -81, 52, 27, 60, -18, 3, 115, 104, -74, -158, 36]
$$ [...]
8191b43
##END NTUPLES=NMR FID
##END=
