##TITLE=1H_Pr DMSO-H-0
 
 8 sc, 
 7.06.2022
##JCAMPDX= 6.0         $$ Bruker NMR JCAMP-DX V2.0
##DATA TYPE= NMR FID
##DATA CLASS= NTUPLES
##ORIGIN= UXNMR, Bruker Analytische Messtechnik GmbH
##OWNER= root
$$ XWIN-NMR		Version 3.5
$$ Tue Jun  7 14:43:37 2022 Russian Standard Time (UT+4h)  she@DPX200
##.OBSERVE FREQUENCY= 200.13135
##.OBSERVE NUCLEUS= ^1H
##.DELAY= (6, 6)
##.ACQUISITION MODE= SIMULTANEOUS
##.ACQUISITION SCHEME= undefined
##.AVERAGES= 8
##.DIGITISER RES= 18
##SPECTROMETER/DATA SYSTEM= spect
##.PULSE SEQUENCE= zg30
##.SOLVENT NAME= DMSO
##.SHIFT REFERENCE= (INTERNAL, DMSO, 0, 15.7039)
##AUDIT TRAIL= $$ (NUMBER, WHEN, WHO, WHERE, WHAT)
$$ ##TITLE= Audit trail, XWIN-NMR		Version 3.5
$$ ##JCAMPDX= 5.01
$$ ##ORIGIN= Bruker BioSpin GmbH
$$ ##OWNER= she
$$ F:/spectra/data/she/nmr/H-F/1/audita.txt
$$ ##AUDIT TRAIL=  $$ (NUMBER, WHEN, WHO, WHERE, WHAT)
(   1,<2022-06-07 14:42:03.10 +0400>,<she>,<DPX200>,
      <created by zg, POWCHK disabled, PULCHK disabled
       configuration hash MD5:
       00 E9 B6 7A A2 85 ED C7 34 08 36 98 17 FE 4E 26
       data hash MD5: 16K
       9F D0 5E 64 42 26 EA 20 9A 06 EE B4 1F D0 26 57>)
$$ ##END=
$$ 
$$ hash MD5
$$ A9 34 5E 09 25 A9 1A 8E 69 FD B5 97 B7 6F 49 61
##$RELAX= 
##$RELAX= 
##$RELAX= 
##$RELAX= 
##$RELAX= 
##$RELAX= 
$$ Bruker specific parameters
$$ --------------------------
##$DU= <F:/spectra>
##$EXPNO= 1
##$NAME= <H-F>
##$PROCNO= 1
##$TYPE= <nmr>
##$USER= <she>
##$AMP= (0..31)
100 100 100 100 100 100 100 100 100 100 100 100 100 100 100 100 100 100 
100 100 100 100 100 100 100 100 100 100 100 100 100 100 
##$AQSEQ= 0
##$AQ_mod= 1
##$AUNM= <au_zg>
##$AUTOPOS= <>
##$BF1= 200.13
##$BF2= 200.13
##$BF3= 200.13
##$BF4= 200.13
##$BF5= 200.13
##$BF6= 200.13
##$BF7= 200.13
##$BF8= 200.13
##$BYTORDA= 1
##$CFDGTYP= 0
##$CFRGTYP= 5
##$CHEMSTR= <none>
##$CNST= (0..31)
1 1 145 1 1 1 1 1 1 1 1 1 1 1 1 1 1 1 1 1 1 1 1 1 1 1 1 1 1 1 1 1 
##$CPDPRG= <>
##$CPDPRG1= <>
##$CPDPRG2= <>
##$CPDPRG3= <>
##$CPDPRG4= <mlev>
##$CPDPRG5= <mlev>
##$CPDPRG6= <mlev>
##$CPDPRG7= <mlev>
##$CPDPRG8= <mlev>
##$CPDPRGB= <>
##$CPDPRGT= <>
##$D= (0..31)
0 1.2 0 0 0 0 0 0 0 0.06 0 0.03 0 0 0 0 0.0002 0 0 0 0 0 0 0 0 0 0 0 0 
0 0 0 
##$DATE= 1654598522
##$DBL= (0..7)
120 120 120 120 120 120 120 120 
##$DBP= (0..7)
150 150 150 150 150 150 150 150 
##$DBP07= 0
##$DBPNAM0= <>
##$DBPNAM1= <>
##$DBPNAM2= <>
##$DBPNAM3= <>
##$DBPNAM4= <>
##$DBPNAM5= <>
##$DBPNAM6= <>
##$DBPNAM7= <>
##$DBPOAL= (0..7)
0.5 0.5 0.5 0.5 0.5 0.5 0.5 0.5 
##$DBPOFFS= (0..7)
0 0 0 0 0 0 0 0 
##$DE= 6
##$DECBNUC= <off>
##$DECIM= 32
##$DECNUC= <off>
##$DECSTAT= 4
##$DIGMOD= 1
##$DIGTYP= 9
##$DL= (0..7)
0 120 120 120 120 120 120 120 
##$DP= (0..7)
150 150 150 150 150 150 150 150 
##$DP07= 0
##$DPNAME0= <>
##$DPNAME1= <>
##$DPNAME2= <>
##$DPNAME3= <>
##$DPNAME4= <>
##$DPNAME5= <>
##$DPNAME6= <>
##$DPNAME7= <>
##$DPOAL= (0..7)
0.5 0.5 0.5 0.5 0.5 0.5 0.5 0.5 
##$DPOFFS= (0..7)
0 0 0 0 0 0 0 0 
##$DQDMODE= 0
##$DR= 18
##$DS= 0
##$DSLIST= <SSSSSSSSSSSSSSS>
$$ [...]
##$SUBNAM2= <"">
##$SUBNAM3= <"">
##$SUBNAM4= <"">
##$SUBNAM5= <"">
##$SUBNAM6= <"">
##$SUBNAM7= <"">
##$SUBNAM8= <"">
##$SUBNAM9= <"">
##$SW= 18.05172834244
##$SWIBOX= (0..15)
0 0 2 0 0 0 0 0 0 0 0 0 0 0 0 0 
##$SW_h= 3612.71676300578
##$TD= 16384
##$TD0= 1
##$TE= 0
##$TE2= 300
##$TE3= 300
##$TEG= 300
##$TL= (0..7)
0 120 120 120 120 120 120 120 
##$TP= (0..7)
150 150 150 150 150 150 150 150 
##$TP07= 0
##$TPNAME0= <>
##$TPNAME1= <>
##$TPNAME2= <>
##$TPNAME3= <>
##$TPNAME4= <>
##$TPNAME5= <>
##$TPNAME6= <>
##$TPNAME7= <>
##$TPOAL= (0..7)
0.5 0.5 0.5 0.5 0.5 0.5 0.5 0.5 
##$TPOFFS= (0..7)
0 0 0 0 0 0 0 0 
##$TUNHIN= 0
##$TUNHOUT= 0
##$TUNXOUT= 0
##$USERA1= <user>
##$USERA2= <user>
##$USERA3= <user>
##$USERA4= <user>
##$USERA5= <user>
##$V9= 5
##$VALIST= <valist>
##$VCLIST= <CCCCCCCCCCCCCCC>
##$VD= 0
##$VDLIST= <DDDDDDDDDDDDDDD>
##$VPLIST= <PPPPPPPPPPPPPPP>
##$VTLIST= <TTTTTTTTTTTTTTT>
##$WBST= 1024
##$WBSW= 4
##$XGAIN= (0..3)
0 0 0 0 
##$XL= 0
##$YL= 0
##$YMAX_a= 72641
##$YMIN_a= -268604
##$ZGOPTNS= <>
##$ZL1= 120
##$ZL2= 120
##$ZL3= 120
##$ZL4= 120
##$ABSF1= 10
##$ABSF2= 0
##$ABSG= 5
##$ABSL= 3
##$ALPHA= 0
##$AQORDER= 0
##$ASSFAC= 0
##$ASSFACI= 0
##$ASSFACX= 0
##$ASSWID= 0
##$AUNMP= <proc_1d>
##$AZFE= 0.1
##$AZFW= 0.1
##$BCFW= 1
##$BC_mod= 2
##$BYTORDP= 1
##$COROFFS= 0
##$CY= 11.3945322036743
##$DATMOD= 1
##$DC= 2
##$DFILT= <>
##$DTYPP= 0
##$F1P= 2.36226072786647
##$F2P= -0.459571619588291
##$FCOR= 0.5
##$FTSIZE= 0
##$FT_mod= 4
##$GAMMA= 1
##$GB= 0.15
##$INTBC= 1
##$INTSCL= 1
##$ISEN= 128
##$LB= 0.24
##$LEV0= 0
##$LPBIN= 0
##$MAXI= 10000
##$MC2= 0
##$MEAN= 0
##$ME_mod= 0
##$MI= 1.114404
##$NCOEF= 0
##$NC_proc= 0
##$NLEV= 6
##$NOISF1= 3.799351
##$NOISF2= 2.8
##$NSP= 1
##$NTH_PI= 0
##$NZP= 0
##$OFFSET= 15.70392
##$PC= 1
##$PHC0= -18075.95
##$PHC1= 12.80074
##$PH_mod= 1
##$PKNL= yes
##$PPARMOD= 0
##$PSCAL= 0
##$PSIGN= 0
##$REVERSE= no
##$SF= 200.130013532006
##$SI= 16384
##$SIGF1= 3
##$SIGF2= 2
##$SINO= 400
##$SIOLD= 16384
##$SREGLST= <1H.CDCl3>
##$SSB= 0
##$STSI= 0
##$STSR= 0
##$SW_p= 3612.71676300578
##$SYMM= 0
##$S_DEV= 0
##$TDeff= 0
##$TDoff= 0
##$TI= <>
##$TILT= no
##$TM1= 0
##$TM2= 0
##$TOPLEV= 0
##$USERP1= <user>
##$USERP2= <user>
##$USERP3= <user>
##$USERP4= <user>
##$USERP5= <user>
##$WDW= 1
##$XDIM= 8192
##$YMAX_p= 0
##$YMIN_p= 0
$$ End of Bruker specific parameters
$$ ---------------------------------
##NTUPLES= NMR FID
##VAR_NAME=  TIME,          FID/REAL,        FID/IMAG
##SYMBOL=    X,             R,               I
##VAR_TYPE=  INDEPENDENT,   DEPENDENT,       DEPENDENT
##VAR_FORM=  AFFN,          ASDF,            ASDF
##VAR_DIM=   8192,          8192,            8192
##UNITS=     SECONDS,       ARBITRARY UNITS, ARBITRARY UNITS
##FACTOR=    0.0002768,     1,               1
##FIRST=     0,             0,               0
##LAST=      2.2672688,     0,               0
##MIN=       0,             -268604,         0
##MAX=       2.2672688,     72641,           0
$$ Real data points
##PAGE= N=1
##DATA TABLE= (X++(R..R)), XYDATA
$$ [...]
$$ plain form
1263 165 1 92 -30 -12 57 38 71 -18 -163 135 237 18 25 23 -45 -26 46 -20 -23 -77 20 -49 -32 -88 3 205 -143
1290 -143 95 53 14 111 56 175 -113 163 46 120 -93 3 26 -35 -16 -5 46 -16 -67 94 -247 127 -22 36 31
1315 31 109 -2 -64 -62 -20 131 -97 -47 7 -13 -100 -41 116 30 -10 8 33 27 -37 -18 -145 78 39 109 139 -171 -73 35
1343 35 -4 129 -68 -9 200 136 96 -48 99 -94 -44 -75 -12 174 -141 72 61 -32 36 104 43 45 36 -58 21 -32 -163
1370 -163 -193 -18 -12 -97 -53 209 -2 237 -42 -70 86 65 150 -68 -43 -164 -17 56 1 -49 31 15 30 249 -103
1395 -103 51 -57 16 30 5 123 -82 37 -16 -28 -38 189 64 65 110 -138 83 -127 -85 113 106 125 46 38 109 -142
1421 -142 31 68 -33 -79 -35 228 250 98 -73 -153 51 7 30 -49 -10 -8 50 131 -26 56 -2 117 57 135 41 -46
1447 -46 -92 56 -39 56 42 39 19 65 75 5 32 -98 4 -15 -35 -95 51 9 6 -96 61 -131 17 17 20 -135 -92 185
$$ packed form
1263A65j64R1j22J8O9j9L3q9j45K98J02k19Pko8J9P2o6ln4R7o9J7n6R1K02l48
1290a43K38m2l9R7n5J19k88K76j17P4k13R6K3o1J9J1N1o2n1J61l41L74j49N8n
1315C1P8j11o2KM2J51k28N0N4k0q7N9J57q6m0J8K5oo4J9j27K23l9P0L0l10R8J08
1343C5l9J33j97N9K09o4m0j44J47j93N0l1O3J86l15K13j1r3O8O8o1Krr4P9n3j31
1370a63l0J75Oq5M4K62k11K39k79k8J56k1Q5k18K5j21J47P3n5n0Q0j6J5K19l52
1395a03J54j08P3J4k5J18k05J19n3j2j0K27j25JM5k48K21k10M2J98pJ9p9qP1k51
1421a42J73L7j01m6M4K63K2j52j71q0K04m4K3p9L9KN8Q1j57Q2n8J19o0P8r4q7
1447d6m6J48r5R5j4lk0M6J0p0K7j30J02j9k0o0J46m2lj02J57j92J48%Lj55M3K77
$$ plain form
1475 185 35 18 7 243 -34 -170 -37 11 -44 42 -45 37 3 -75 -15 -71 -60 109 -4 -129 9 -32 -12 -18 56 -32
1501 -32 110 50 98 49 28 67 46 -11 -54 -175 -86 -137 169 2 93 75 72 -15 126 -32 5 34 -62 111 -120 -26 2
1528 2 56 -14 -114 29 -46 63 -46 -74 -36 76 -38 -18 152 -70 -15 32 -36 123 -50 100 76 176 16 -52
1552 -52 -122 -41 121 56 -56 -72 -42 132 -18 97 -33 36 -22 -114 87 -35 30 -113 157 -141 99 -70 -11 -135
1576 -135 -132 -29 98 101 -55 22 26 -8 -80 -32 15 -38 14 203 62 38 178 -44 -4 47 171 -95 -63 -48 -135 -62 -6
1603 -6 -92 -22 108 33 -151 -61 35 -21 50 125 -98 -74 57 -60 -26 212 16 70 0 26 61 82 92 -36 31 49 -44
1630 -44 24 153 -104 51 66 62 -34 -12 -124 55 76 31 8 32 -78 -45 -54 -62 87 67 103 59 18 -38 -97 65 -25 -6
1658 -6 4 11 -9 -49 54 -57 142 -90 125 52 -138 -111 26 -71 7 -61 97 -18 -179 14 -83 -104 117 99 -52
$$ packed form
1475A85j50j7j1K36k77j36J33M8n5Q6q7Q2l4p8O0n6J1J69j13j25J38m1K0oP4q8
1501c2J42o0M8m9k1L9k1n7m3j21Q9n1L06j67R1j8lq7J41j58L7K9r6J73k31R4K8
1528BN4p0j00J43p5J09j09k8L8J12j14K0J70k22N5M7o8J59j73J50k4J00j60o8
1552e2p0Q1J62o5j12j6L0J74j50J15j30O9n8r2K01j22O5j43K70k98K40j69N9j24
1576a35LJ03J27Lj56P7Ml4p2M8M7n3N2J89j41k4J40k22M0N1J24k66L2J5q7P3N6
1603fq6P0J30p5j84R0R6n6P1P5k23K4J31j17L4K38j96N4p0K6L5K1J0j28O7J8r3
1630d4O8J29k57J55J5mr6K2j12J79K1m5k3K4j10L3rqJ49k0L6m4m1n6n9J62r0J9
1658fJ0Pk0m0J03j11J99k32K15p3j90K7J37r7P8o8J58j15j61J93r7k1K21j8j51
$$ plain form
1683 -52 -67 11 93 -78 -86 -46 50 56 -68 85 122 -79 38 -14 -44 -11 -68 75 -87 -129 21 41 -99 -65 40 125
1709 125 -43 47 18 93 -85 -139 35 -22 -35 -30 63 66 -91 47 25 62 0 -60 -85 -177 76 -74 -54 112 20 -13 4
1736 4 -38 36 -10 -127 -177 188 89 -59 120 89 18 -111 -162 -45 7 64 186 26 165 223 117 106 1 -43 29
1761 29 100 26 205 117 111 0 -65 9 -133 18 -47 -52 19 -38 -78 16 10 122 -111 -129 -57 -17 83 71 6 -36 23 23 25
1790 25 -71 36 77 155 22 174 5 -17 -62 -145 71 27 -38 102 53 -111 -125 41 -22 -68 -2 23 71 -66 -97 91
1816 91 29 -163 63 17 -96 103 66 9 18 -4 0 -14 -22 -125 72 120 217 88 -105 -16 -107 29 -51 -116 110 96 85
1843 85 32 94 -66 16 -8 86 60 -15 -85 -53 -62 -64 -12 111 -113 18 -101 74 148 22 -44 106 157 22 -86 -37
1869 -37 35 107 25 46 -68 9 -43 -70 85 55 1 -8 -81 -13 191 -68 -43 -80 146 -55 -13 -18 -82 200 126 -103 19
$$ packed form
1683e2j5P8Q2j71qM0R6Oj24J53L7k01J17n2l0L3n7J43j62m2J50K0j40L4J05Q5
1709A25j68R0k9P5j78n4J74n7j3NR3Lj57J38k2L7o2o0k5r2K53j50K0J66r2l3J7
1736Dm2P4m6j17n0L65r9j48J79l1p1j29n1J17N2N7J22j60J39N8j06j1j05m4P2
1761B9P1p4J79q8oj11o5P4j42J51o5nP1n7m0R4oJ12k33j8P2M0J00j2o5m2N9%K
1790B5r6J07M1P8j33J52j69k2m5q3K16m4o5J40m9j64j4J66o3m6O6K5M8j37l1J88
1816I1o2j92K26m6j13J99l7n7Rk2Mj4qj03J97M8R7j29j93Q9r1J36q0o5K26j4j1
1843H5n3O2j60Q2k4R4k6p5p0L2rkN2J23k24J31j19J75P4j26o6J50N1j35j08M9
1869c7P2P2q2K1j14P7n2k7J55l0n4rp3O8K04k59K5l7K26k01M2no4K82p4k29J22
$$ plain form
1896 19 4 131 32 -117 72 -22 47 -20 164 -22 -56 -69 -49 26 -36 81 -84 -1 -34 99 25 -75 97 58 -17
1921 -17 -34 -46 -92 115 -4 47 -55 23 132 -91 -11 -23 -14 149 -30 -19 -12 54 149 -5 55 -164 -91 -12 99 -11
1947 -11 -112 -58 -117 81 37 17 -31 19 11 -67 139 -109 84 32 148 135 -1 66 19 52 41 0 -13 272 57 -73
1973 -73 0 -118 96 20 50 22 167 99 -100 -135 110 -7 63 36 189 2 -26 -33 3 110 -3 139 -5 -110
1997 -110 18 -105 95 72 -27 39 12 119 -54 -82 32 -2 -68 67 62 -48 29 125 107 -57 57 48 197 20 197
2022 197 -98 -70 132 150 -16 48 81 45 -102 -108 126 186 -29 -152 1 -37 -21 121 31 48 67 -115 -19 32 35 -76
2048 -76 -42 -59 -28 81 -120 127 168 8 217 -3 -44 -19 -84 64 193 -39 -34 71 -92 112 -84 4 -44 -15
2072 -15 229 -145 -127 -154 101 -63 74 -37 111 48 -17 36 -39 26 -51 11 -42 37 68 154 -30 46 40 44 154 87 193
$$ packed form
1896A9j5J27r9j49J89r4O9o7J84j86l4j3K0P5o2J17j65Q3l3J33p4j00J72l9p5
1921a7j7j2m6K07j19N1j02P8J09k23Q0j2RJ63j79J1PO6R5j54O0k19P3P9J11j10
1947a1j01N4n9J98m4k0m8N0qp8K06k48J93n2J16j3j36O7m7L3j1m1j3K85k15j30
1973g3P3j18K14p6L0k8J45o8j99l5K45j17P0k7J53j87k8pL6J07j13J42j44j05
1997a10J28j23K00k3r9O6k7J07j73k8J14l4o6J35nj10P7R6j8j64J14rJ49j77J77
2022A97k95K8K02J8j66O4L3l6j47oK34O0k15j23J53l8J6J42r0J7J9j82R6N1Lj11
2048g6L4j7L1J09k01K47M1j60K09k20m1K5o5J48J29k32NJ05j63K04j96Q8m8K9
2072a5K44l74J8k7K55j64J37j11J48o3o5N3p5O5p7O2n3P9L1Q6j84P6oMJ10o7J06
$$ plain form
2099 193 106 -34 89 141 42 73 -64 22 -94 -18 71 60 100 21 -28 -7 129 13 94 -54 7 -55 81 4 9 -51
2125 -51 51 27 -65 42 39 -190 -27 -145 -155 -133 29 -81 125 11 -52 24 7 -82 37 39 3 -25 -50 21 77 -151
2151 -151 54 -13 -116 41 143 -31 31 182 63 31 12 -113 -56 2 -144 24 18 45 -83 -113 -40 -135 -80 -63 -160
2176 -160 74 96 23 -110 105 158 78 -33 33 21 6 -276 -60 -54 8 -5 -8 -21 -28 -19 -93 23 -184 -100 114 65 142
2203 142 -46 -59 100 -95 39 -92 15 8 -28 -59 -174 -91 -18 44 98 -39 34 -50 -79 96 -43 20 -107 -174 24
2228 24 -3 -18 -67 -31 -106 -102 -121 -41 -20 -22 91 120 83 -13 6 -132 120 -107 -35 222 120 46 14 -42 -113 99 94 -41
2256 -41 107 -60 -37 -180 -9 159 11 -35 -2 33 -52 31 120 232 93 167 96 -32 201 22 -153 35 -17 -2
2280 -2 71 -94 61 -18 69 84 -4 15 -7 36 38 -131 -23 60 33 -8 37 -163 -31 90 -125 237 -14 -68 -9 41
$$ packed form
2099A93q7j40J23N2r9L1j37Q6j16P6Q9j1M0p9m9K1J36j16Q1j48O1o2J36p7No0
2125e1J02k4r2J07lk29J63j18j0K2J62j10K06j14o3P6j7q9J19Kl6k8k5P1N6k28
2151a51K05o7j03J57J02j74O2J51j19l2j9j25N7N8j46J68oK7j28l0P3r5N5J7r7
2176a60K34K2p3j33K15N3q0j11O6j2j5k82K16OO2j3lj3pRp4J16k07Q4K14m9P7
2203A42j88j3J59j95J34j31J07pl6l1j15Q3P3O2N4j37P3q4k9J75j39O3j27o7J98
2228B4k7j5m9L6p5Mj9Q0K1kJ13K9l7r6J9j38K52k27P2K57j02p4l2n6p1K12nj35
2256d1J48j67K3j43J71J68j48m6L3L5q5Q3Q9J12j39P4p1j28K33j79j75J88n2J5
2280bP3j65J55p9Q7J5q8J9k2M3Kj69J08Q3k7m1M5k00J32J21k15L62k51n4N9N0
$$ plain form
2306 41 160 67 44 -53 50 -89 107 -6 -53 -20 -53 57 -97 21 87 -144 11 -71 33 145 -37 -39 -44 40 -128
2331 -128 9 126 -114 -94 -110 80 -3 18 43 -4 53 123 -295 -38 105 51 15 -93 104 187 70 -94 6 -5
2355 -5 55 13 142 -115 56 -28 139 86 13 153 -20 62 13 30 -64 115 91 57 130 -44 -81 2 40 16 1 6 -41
2382 -41 -95 -129 4 -113 -56 77 -100 -76 57 -11 -65 -130 142 15 -82 -181 7 -64 99 -7 154 -43 51 -54
2406 -54 -133 -6 156 -114 76 114 52 67 4 -6 22 -137 74 -54 -41 -66 -117 188 -92 108 -27 -3 -87 -27 -37
2431 -37 12 9 41 -10 43 60 90 204 10 29 -20 3 -127 -88 53 -14 6 -15 2 121 74 -24 48 128 114 -22 140
2458 140 131 -1 -39 -50 203 -53 12 -53 33 160 -37 196 31 29 -14 -11 53 -129 -45 -89 113 95 -6 -151 85
2483 85 -4 -97 40 152 -3 164 91 -109 22 86 -104 -32 55 -70 11 -191 85 -35 -38 -49 74 13 110 -158
$$ packed form
2306D1J19r3k3r7J03j39J96j13m7L3l3J10j54J18O6k31J55q2J04J12j82knQ4j68
2331a28J37J17k40K0j6J90q3K1K5m7N7P0m18K57J43n4l6j08J97Q3j17j64J00j1
2355eO0m2J29k57J71q4J67n3p3J40j73Q2m9J7r4J79k4l4P3j74l7Q3L8k4j5Nm7
2382d1n4l4J33j17N7J33j77K4J33o8n4o5K72j27r7r9J88p1J63j06J61j97R4j05
2406e4p9J27J62k70J90L8o2J5o3j0K8j59K11j28J3k5n1L05k80K00j35K4q4O0j0
2431c7M9lL2n1N3J7L0J14j94J9m9K3j30L9J41o7K0k1J7J19m7r8P2Q0j4j36J62
2458A40rj32l8j1K53k56O5o5Q6J27j97K33j65km3LO4j82Q4m4K02j8j01j45K36
2483H5q9r3J37J12j55J67p3k00J31O4j90P2Q7j25Q1k02K76j20lj1J23o1R7k68
$$ plain form
2507 -158 -38 138 77 -95 158 64 -50 -16 124 163 5 47 -119 -9 37 10 -39 -71 116 49 -73 -17 80 -42
2531 -42 158 17 -53 3 173 -46 60 33 49 -20 127 -154 -97 -17 -13 -83 -147 -128 100 9 78 58 -1 -33 -100 -37 -59
2558 -59 53 35 -24 -96 108 -28 48 33 56 59 52 17 49 165 -69 -30 -159 -93 210 93 -7 113 -81 -171 -4
2583 -4 80 8 -19 -235 115 72 -64 -36 108 -34 108 54 -119 -56 -123 38 27 64 91 -139 -130 57 38 -83 -47 -17
2609 -17 -22 -145 179 78 -12 73 -123 -73 112 -76 78 15 -50 6 116 102 15 -42 65 -49 -35 46 110 47 18 43
2635 43 40 -12 48 29 -62 -51 -27 82 -125 101 -69 132 20 134 4 -39 144 -95 128 -2 34 -32 -63 -92 31
2660 31 201 -82 72 141 151 -9 -19 -79 36 -109 -47 50 196 -24 146 114 201 -23 -73 10 46 82 -43 54 128
2685 128 -103 75 -21 36 -21 85 -2 24 -11 81 -46 103 -33 53 34 61 28 27 153 -16 -30 42 18 38 -21 -107
$$ packed form
2507a58J20J76o1j72K53r4j14L4J40L9j58M2j66J10M6k7m9l2J87o7j22N6R7j22
2531d2K00j41p0N6J70k19J06k7J6o9J47k81N7Q0Mp0o4J9K28r1O9k0n9l2o7O3k2
2558e9J12j8n9p2K04j36P6j5K3Lpl5L2J16k34L9j29O6L03j17j00J20j94r0J67
2583dQ4p2k7k16L50m3j36K8J44j42J42n4j73O3o7J61j1L7K7k30RJ87j9j21L6L0
2609a7nj23L24j01r0Q5j96N0J85j88J54o3o5N6J10j4q7n7J07j14J4Q1O4o3k9K5
2635D3ln2O0j9r1J1K4J09k07K26j70K01j12J14j30m3J83k39K23j30L6o6l1k9J23
2660C1J70k83J54O9J0j60j0o0J15j45O2R7J46k20J70l2Q7k24n0Q3L6L6j25R7P4
2685A28k31J78r6N7n7J06q7K6l5R2j27J49j36Q6j9K7l3jJ26j69j4P2k4K0n9q6
$$ plain form
2711 -107 -32 -29 -136 -65 43 15 40 38 25 68 36 -69 -12 -90 -6 16 76 27 66 -22 -20 -58 -7 -130 -72 13 18 199 -4
2740 -4 -97 121 -170 78 -94 -39 -90 -2 257 -193 -8 -63 43 -24 -143 179 45 11 119 -1 69 -58 -127 30
2764 30 75 35 -15 6 54 -30 138 -173 -5 48 11 -28 132 21 -72 20 -38 70 -42 -108 -5 12 150 8 -31
2789 -31 70 43 -40 -14 136 -121 94 -94 88 -14 38 -12 37 179 138 -60 -121 -24 103 -94 53 -147 134
2812 134 -34 21 26 -181 -23 -96 -30 131 -4 -12 -9 -154 12 2 -65 28 33 37 84 115 16 79 31 67 -147 -20 38 125
2840 125 68 -164 -47 -51 164 -65 126 54 -51 70 -32 57 -54 56 168 9 -105 -214 21 128 -22 -108
2862 -108 36 42 68 121 56 137 119 -93 30 142 233 -38 64 -28 11 17 -49 -54 17 105 -53 12 16 60 66 -21 41 -117
2890 -117 19 93 2 -25 -148 58 145 131 -37 13 110 -5 25 108 -43 114 95 36 -52 -178 -31 -72 12 12 -161
$$ packed form
2711a07P5Lj07P1J08k8K5kj3M3l2j05N7p8Q4K2O0m9L9q8Kl8N1j23N8Q5NJ81k03
2740dr3K18k91K48j72N5n1Q8K59m50J85n5J06o7j19L22j34l4J08j20P0j27o9J57
2764C0M5m0n0K1M8q4J68l11J68N3l7l9J60j11r3R2n8J08j12o6J03J7J38j42l9
2789c1J01k7q3K6J50k57K15j88J82j02N2n0M9J42m1j98o1R7J27j97J47k00K81
2812A34j68N5Nk07J58p3O6J61j35qLj45J66j0o7R3NMM7L1r9O3m8L6k14J27N8Q7
2840A25n7k32J17mK15k29J91p2j05J21j02Q9j11J10J12j59j14j09K35J07j50q6
2862a08J44OK6N3o5Q1j8k12J23J12R1k71J02r2L9Oo6nP1Q8j58O5MM4Oq7O2j58
2890a17J36P4r1k7j23K06Q7j4j68N0R7j15L0Q3j51J57j9n9q8j26J47m1Q4%j73
$$ plain form
2915 -161 65 47 -83 106 65 -42 78 -57 17 -19 -26 -83 57 -11 -36 12 -4 157 -5 -18 -79 53 185 15
2939 15 18 -101 258 -128 -61 -40 -67 -15 67 65 93 -19 86 115 -37 110 145 40 150 89 67 -11 -15 2 -17 43 41 -46
2967 -46 -36 3 -166 93 32 -101 127 -86 86 -30 -131 46 -71 44 83 -102 95 -47 76 -29 60 -89
2989 -89 10 -120 35 110 60 -66 24 88 7 42 -42 109 64 -52 48 -131 86 -52 10 -18 -25 4 -162 -45 -143
3014 -143 3 90 -26 -74 45 -37 7 -35 104 -2 55 -10 105 35 -83 -146 59 -39 -49 274 84 -13 175 -14
3038 -14 -50 -51 24 84 140 -28 107 98 -158 29 -47 -21 51 -21 -87 34 37 56 -139 32 145 -41 91 47 5 107
3064 107 78 124 -38 142 0 -57 90 -23 107 122 -48 -64 -87 -85 80 -33 -21 -157 -12 48 33 179 82 37
3088 37 -17 11 45 44 -15 -118 38 -30 76 73 -108 0 6 -111 28 -10 89 -65 -104 72 2 -122 -124 40 59 -79
$$ packed form
2915a61K26j8j30J89m1j07J20j35P4l6pn7J40o8k5M8j6J61j62j3o1J32J32j70
2939A5Lj19L59l86O7K1k7N2Q2kK8j12J05K9j52J47L5j05J10o1k2p8mJ7j9O0kq7
2967d6J0L9j69K59o1j33K28k13J72j16j01J77j17J15L9j85J97j42J23j05Q9j49
2989h9R9j30J55P5n0j26R0O4q1L5q4J51m5j16J00j79K17j38O2k8pK9j66J17r8
3014a43J46Q7j16m8J19q2M4m2J39j06N7o5J15p0j18o3K05r8j0L23j90r7J88j89
3038a4l6jP5O0N6j68J35rk56J87p6K6P2p2o6J21LJ9j95J71J13j86J32m4m2J02
3064A07k9M6j62J80j42n7J47j13J30J5j70j6k3KJ65j13J2j36J45O0j5J46r7m5
3088C7n4K8L4jn9j03J56o8J06lj81J08Oj17J39l8R9j54l9J76p0j24kJ64J9j38
$$ plain form
3114 -79 57 -35 108 14 16 -127 -55 81 57 -67 23 43 -102 198 134 34 31 -37 27 78 17 -174 96 -37 -135 -85
3140 -85 14 2 121 -42 68 60 12 -42 184 -68 -28 70 -65 -95 -30 -39 -51 -30 -4 -31 -82 93 -8 -144 28 100
3166 100 -15 -12 -23 59 62 -41 -40 84 16 8 11 8 -127 -22 199 -160 40 -29 55 -118 15 37 44 86 -46 -177 4
3193 4 76 -49 59 -187 -93 -101 94 109 -22 217 49 21 -110 81 -44 37 40 -20 -198 158 -64 -73 3 73 -165
3218 -165 5 -33 59 -29 90 14 21 -58 -14 -65 33 -16 -55 54 -79 139 -47 -33 70 -21 -76 -25 32 64 49 125 -38
3245 -38 30 -135 -10 72 11 11 -69 11 0 -54 -124 -222 186 -93 -73 48 118 -109 140 76 -104 1 163 5 24
3270 24 38 39 -14 -144 -90 34 -36 -87 -4 -91 -143 -39 -106 101 67 121 2 -60 -15 36 -94 143 -104 11 -58 46
3296 46 152 -166 98 -29 -81 41 99 72 128 -63 53 124 -183 -247 -84 226 -55 131 -9 -115 56 -21 11
$$ packed form
3114g9J36r2J43r4Kj43P2J36k4j24R0K0j45L00o4j00lo8O4N1o1j91K70j33r8N0
3140h5R9j2J19j63J10qm8n4K26k52M0R8j35l0O5rj2K1K6k7n1J75j01j36J72P2
3166A00j15Lj1Q2Lj03JJ24o8qLlj35J05K21l59K00o9Q4j73J33K2PM2j32j31J81
3193DP2j25J08k46R4qJ95J5j31K39j68k8j31J91j25Q1Lo0j78L56k22rP6P0k38
3218a65J70l8R2q8J19p6Pp9M4n1R8m9l9J09j33K18j86J4J03r1n5N1N7L2j5P6j63
3245c8O8j65J25Q2o1%q0Q0j1n4p0r8M08k79K0J21P0k27K49o4j80J05J62j58J9
3270B4J4Jn3j30N4J24p0n1Q3q7n2J04o7K07l4N4j19o2M5N1j30K37k47J15o9J04
3296D6J06l18K64j27n2J22N8k7N6j91J16P1l07o4J63L10k81J86j40j06J71p7L2
$$ plain form
3319 11 -41 137 27 -32 -122 103 54 64 -16 5 33 35 -74 -9 30 14 35 -116 -71 59 101 -136 91 34 61 -19 -95
3346 -95 50 154 -62 38 141 1 -12 -40 94 -66 6 2 -101 -132 -9 112 -35 159 39 -45 43 80 -41
3369 -41 0 -51 77 11 -91 -8 -61 33 28 -58 -123 -24 12 26 57 41 -30 -18 125 9 -151 -25 160 88 -28 154
3395 154 -34 48 28 -27 -33 99 62 -17 -80 28 157 122 50 46 -62 195 94 -196 -74 -70 104 44 76 4 113 12
3421 12 -10 37 -23 -51 56 -47 -22 -182 -140 16 -13 90 -86 20 -72 -143 -6 -147 -178 18 172 -12 -59 84
3445 84 -67 61 -72 18 16 -122 -43 67 47 43 28 -59 -104 -64 -89 -69 -242 84 -6 -67 170 50 -37 16 122 141
3471 141 5 74 -48 -97 143 -162 -22 270 -39 -72 -138 -100 89 -46 56 29 17 -73 102 -18 -88 244 -48
3494 -48 -82 145 96 -5 100 -227 -18 14 -67 -146 -40 -107 186 42 -199 -44 10 -10 83 -64 100 -53 -20 -24
$$ packed form
3319A1n2J78j10n9r0K25m9J0q0K1K8Kj09O5L9j6K1j51M5J30M2k37K27n7K7q0p6
3346i5J45J04k16J00J03j40j3k8J34j60P2mj03l1J23J21j47J94j20q4Q8L7j21
3369d1M1n1J28o6j02Q3n3R4nq6o5R9L6J4L1j6p1J2J43j16j60J26J85p2j16J82
3395A54j88Q2k0n5oJ32l7p9o3J08J29l5p2mj08K57j01k90J22MJ74o0L2p2J09j01
3421A2k2M7o0k8J07j03K5j60M2J56k9J03j76J06r2p1J37j41l1J96J54j84m7J43
3445H4j51J28j33R0kj38P9J10k0mj5q7m5M0k5K0j73L26r0o1K37j20q7N3J06J9
3471A41j36O9j22m9K40l05J40K92l09l3o6L8J89j35J02k7j2r0J75j20p0L32k92
3494d8l4K27m9j01J05l27K09L2q1p9J06o7K93j44k41J55N4k0R3j47J64j53L3m
$$ plain form
3518 -24 31 -83 -112 42 -133 -1 -21 90 -92 -204 86 -118 -91 111 -18 34 99 78 -140 79 -62 -2 69
3541 69 12 -62 -56 -29 -59 -2 108 -64 5 117 6 90 223 -64 -86 153 -79 145 120 67 -59 30 -115 46 -40
3566 -40 13 -76 170 20 -102 87 -104 -94 70 31 -49 167 11 -153 19 61 -63 77 48 131 85 52 69 167
3590 167 -184 -89 -58 39 134 89 -249 9 -17 -106 52 50 6 125 -60 68 -182 -164 -53 -102 -20 63 -66 -36 23
3615 23 -105 -82 14 64 101 -87 69 42 48 -37 45 95 -135 -36 -92 62 56 -12 197 18 -16 -2 -20 -47 -10 3 -121
3642 -121 45 125 15 26 -15 -48 132 -1 -53 11 28 -74 55 -23 -51 -21 53 -84 -182 -18 -24 -168 -70 -173 -41
3667 -41 16 70 -127 58 -122 -20 102 -18 110 14 144 75 131 -89 119 102 -40 -95 3 -60 -105 166 -52 -35
3691 -35 68 40 71 -31 105 21 53 19 -94 -12 249 96 -82 5 128 30 -12 118 -12 66 -65 -29 -74 -154 1
$$ packed form
3518b4N5j14k9J54j75J32k0J11j82j12K90k04K7K02j29N2O5k1k18K19j41O0P1
3541F9n7p4OK7l0N7J10j72O9J12j11Q4J33k87k2K39k32K24k5n3j26Q9j45J61q6
3566d0N3q9K46j50j22J89j91J0J64l9q0K16j56j64J72M2j24J40k9Q3m6l3J7R8
3590A67l51R5L1R7R5m5l38K58k6q9J58km4J19j85J28k50J8J11m9Q2Q3j29L0N9
3615B3j28K3R6N0L7j88J56k7Oq5Q2N0k30R9n6J54oo8K09j79l4J4j8k7L7J3j24
3642a21J66Q0j10J1m1l3J80j33n2O4J7j02J29p8k8L0P4j37r8J64oj44R8j03J32
3667d1N7N4j97J85j80J02J22j20J28r6J30o9N6k20K08j7j42n5R8o3m5K71k18J7
3691c5J03k8L1j02J36q4L2l4j13Q2K61j53j78Q7J23r8m2J30j30P8j31L6m5q0J55
$$ plain form
3716 1 19 19 -119 -137 -38 42 -44 -39 17 -128 6 -86 96 -9 -6 81 -118 -164 186 -49 29 55 -109 -77 106 9 -10
3743 -10 -13 -4 -66 -90 -87 -77 14 154 89 71 -35 52 125 69 -5 102 61 67 -3 -51 -51 -3 128 -134 -176 56 137 -47 31
3772 31 133 -138 -10 -65 141 -21 140 -51 78 -32 24 -55 5 50 24 2 15 146 93 -95 9 57 38 -42
3796 -42 -56 129 -209 -37 80 92 -75 -69 127 -46 6 -17 149 -48 -36 126 -167 -203 -98 6 -212 92 79
3819 79 12 -48 26 -13 -53 75 54 136 43 -120 100 86 199 90 8 29 -50 8 10 35 -171 79 74 -35 175 63
3845 63 45 65 -72 224 -130 60 139 34 92 154 -28 115 -45 -9 104 169 63 22 -19 -140 54 -90 19
3868 19 -14 -29 27 119 57 76 -86 9 72 61 235 73 -62 93 111 -1 -10 -162 26 54 -138 188 62 52 99
3893 99 50 50 140 -43 3 -6 -13 116 -174 21 30 -30 -27 130 -57 -27 101 -11 -232 -18 -131 1 16 -30 -44 74
$$ packed form
3716AJ8%j38j8R9Q0q6NN6j45J34r2J82j05LQ7j99m6L50k35P8K6j64L2J83r7j9
3743a0lRo2k4LJ0R1J40o5j8j06Q7P3n6p4J07m1Op0m8%M8J31k62m2K32Q1j84P8
3772C1J02k71J28n5K06j62J61j91J29j10N6p9O0M5k6k2J3J31n3j88J04M8j9q0
3796d2j4J85l38J72J17J2j67OJ96j73N2k3J66j97J2J62k93l6J05J04k18L04j3
3819G9o7o0P4l9m0J28k1Q2r3j63K20j4J13j09q2K1p9N8KK5k06K50nj09K10j12
3845F3j8K0j37K96l54J90P9j05N8O2j82J43j60L6J13O5j06m1m1j21J94j44J09
3868A9l3j5N6R2o2J9j62R5O3j1J74j62j35J55J8j12rj52J88K8j92L26j26j0M7
3893I9m9%R0j83M6rpJ29k90J95Ro0LJ57j87L0J28j12k21K14j13J32J5m6j4J18
$$ plain form
3919 74 -52 -135 -59 73 41 -108 -76 168 28 -49 122 6 119 73 36 -80 63 -17 -2 180 -116 -54 -73 -89
3943 -89 131 35 -133 -184 -22 -116 115 63 -19 -9 45 55 96 79 16 -24 -138 -40 -66 137 -88 -18 104 195 25 152
3969 152 -55 -61 -65 13 184 20 13 41 -5 -113 -41 -21 -21 -2 -132 -149 -51 73 173 3 187 168 95 -40 177 -104
3995 -104 -71 78 81 -91 116 -41 -58 14 45 2 -12 -93 -221 10 65 0 -47 -84 96 59 -2 130 71 -37 -65 56
4021 56 -67 -87 -10 91 234 36 64 71 -46 79 -27 -13 -98 -11 88 19 9 -39 -175 79 -3 -47 53 58 80 198
4047 198 38 -64 92 25 134 -73 70 0 -79 -9 -120 101 -5 4 -53 -8 77 3 -29 -141 101 100 -97 -188 25
4072 25 -96 125 123 -74 127 98 -92 -68 40 -56 -17 25 60 31 102 -37 -98 132 152 77 109 82 -62 -96 -1 113
4098 113 94 105 69 -41 20 -54 -137 145 8 24 -40 64 19 44 -68 81 58 70 -1 -15 -86 -198 -72 -16 -34 108
$$ packed form
3919G4j26q3P6J32l2j49L2K44j40p7J71j16J13m6l7j16J43q0J5J82k96O2j9j6
3943h9K20r6j68n1J62r4K31n2q2J0N4J0M1j7o3m0j14R8k6K03k25P0J22R1j70J27
3969A52k07omP8J71j64pK8m6j08P2K0%J9j30j7R8J24J00j70J84j9p3j35K17k81
3995a04L3J49Lj72K07j57j7P2L1m3j4q1j28K31N5o5m7l7J80l7o1J32n9j08k8J21
4021E6j23k0P7J01J43j98K8Pj17J25j06J4q5Q7R9o9j0m8j36K54q2m4J00NK2J18
4047A98j60j02J56o7J09k07J43p0p9P0j11K21j06Rn7M5Q5p4l2j12K42jj97r1K13
4072B5j21K21kj97K01k9j90K4J08r6L9M2L5k9P1j39o1K30K0p5L2k7j44l4R5J14
4098A13j9J1l6j10O1p4q3K82j37J6o4J04m5K5j12J49k3J2p1j4p1j12J26N6j8J42
$$ plain form
4124 108 -77 -16 -30 -98 93 119 27 -47 -74 113 -72 3 34 20 80 153 4 -25 -91 -14 19 63 14 38 71 -59 25
4151 25 27 -54 -49 87 -97 63 67 154 -3 -5 253 48 47 -36 -21 120 -148 -70 22 48 -42 70 -72 94 83 -22 137
4178 137 159 91 -21 34 45 -45 -35 62 45 111 186 -9 68 89 -61 70 -120 -24 154 -121 25 -81 120 47 -189
4203 -189 42 2 55 61 51 61 33 -61 42 -4 59 70 11 22 -149 -51 -130 -168 -23 31 -41 55 2 -80 64 53 -58
4230 -58 11 8 -129 80 33 85 -32 -157 105 -129 23 4 25 38 51 65 35 37 30 88 134 54 -118 40 213 -98
4256 -98 64 112 -126 191 95 269 61 -32 -27 105 -44 -5 123 16 4 78 97 -13 -73 32 -91 -64 129 -43
4280 -43 14 -41 -79 -15 162 -97 -56 -11 27 149 -162 -28 -74 22 181 -146 59 46 -157 133 -125 113 58 -15
4304 -15 114 27 -8 -68 -31 78 33 31 -93 -168 84 95 36 -31 96 -166 115 -107 -38 67 -115 145 101 -93 154
$$ packed form
4124A08j85O1j4o8J91K6r2p4k7J87j85P5L1j4O0P3j49k9o6P7L3M4m9K4L3j30Q4
4151B5Kq1NJ36j84J60MQ7j57kK58k05jq3J5J41k68P8R2K6r0J12j42J66j1j05J59
4178A37K2o8j12N5J1r0J0R7j7O6P5j95P7K1j50J31j90R6J78k75J46j06K01p3k36
4203a89K31m0N3Oj0J0k8r4J03m6O3J1n9J1j71R8p9l8J45N4p2R6n3q2J44j1j11
4230e8O9lj37K09m7N2j17j25K62k34J52j9K1J3J3J4l0KpN8M6q0j72J58J73l11
4256i8J62M8k38L17r6J74k08r3NJ32j49L9J28j07j2P4J9j10o0J05j23K7J93j72
4280d3N7n5l8O4J77k59M1M5L8J22l11J34m6R6J59l27K05j3k03K90k58K38n5p3
4304a5J29q7l5o0L7J09m5kj24p5K52J1n9o7J27k62K81k22O9J05j82K60m4j94K47
$$ plain form
4329 154 -31 46 67 -19 6 27 187 -113 17 -25 -14 -56 -29 -129 -109 -198 -40 -94 -97 42 32 -40 9 -35 -53 190
4355 190 -75 -23 -66 174 -81 -3 71 180 0 19 -47 30 -33 12 192 -53 -24 111 -1 168 50 -42 56 -22
4379 -22 93 -230 -88 -21 -28 -19 3 32 27 -43 -1 -32 15 46 -32 156 67 252 51 -66 60 -79 10 -76 25 129
4405 129 -25 30 98 -45 -7 8 -107 -96 -53 -19 37 17 -46 -8 -18 1 44 72 146 133 -102 106 -25 12 39 -80
4431 -80 -51 -93 -43 45 2 67 146 -43 132 140 35 44 -15 42 -39 -168 56 -14 -34 182 -18 -144 134 19 14 45 72
4458 72 -146 -95 -9 38 -175 -24 76 -13 40 136 35 -74 134 -140 30 -116 123 55 20 50 147 132 -157 12
4482 12 12 -41 100 102 94 -112 77 110 128 85 -8 -44 45 131 -81 -16 -3 85 3 -103 -142 16 -46 210 179 -44 -3 -9
4510 -9 37 -40 -58 20 -166 21 -8 -144 13 76 -70 -129 158 62 -14 -17 93 -130 -107 -33 96 11 17 80 -66 60
$$ packed form
4329A54j85P7K1q6K5K1J60l00J30m2J1m2K7j00K0q9J58n4lJ39j0p2M9m4j8K43
4355A90k65N2m3K40k55P8P4J09j80J9o6P7o3M5J80k45K9J35j12J69j18r2R8p8
4379b2J15l23J42O7pRK2K9np0M2l1M7L1p8J88q9J85k01j17J26j39Q9q6J01J04
4405A29j54N5O8j43L8J5j15J1M3L4N6k0o3L8j0J9M3K8P4j3k35K08j31L7K7j19
4431h0K9m2N0Q8m3O5P9j89J75Qj05Rn9N7q1j29K24p0k0K16k00j26K78j15nL1K7
4458G2k18N1Q6M7k13J51J00q9N3R6j01j09K08k74J70j46K39o8l5L0R7j5k89J69
4482A2%n3J41Kqk06J89L3J8m3r3l6Q9Q6k12O5J3Q8q2j06l9J58o2K56l1k23M1o
4510iM6p7j8P8j86J87k9j36J57O3j46n9K87r6p6lJ10k23K3P4J29q5OO3j46J26
$$ plain form
4536 60 -9 24 -52 98 25 107 23 8 66 74 -30 -10 -53 -205 120 180 -25 -18 -115 23 35 0 132 -60 -37 -41 -59 -124
4564 -124 -8 24 29 -29 -102 -84 32 47 -75 91 40 65 -72 -52 -192 34 60 44 97 74 -108 24 129 -39 24
4589 24 37 -51 23 288 -64 62 -97 41 -2 0 10 22 72 -21 -89 -20 41 59 -6 12 18 112 22 93 164 -125 139 29
4617 29 -26 -18 62 10 97 -33 88 -22 33 33 47 84 149 6 45 78 69 -132 -75 66 -129 -13 95 78 -173 -10
4643 -10 -6 154 -47 -33 48 -77 236 66 113 -75 4 -38 63 -23 -74 171 -54 -9 91 -113 82 -99 58 40
4667 40 -7 -44 -69 88 40 -41 96 148 -130 -132 110 178 32 55 180 -101 -13 192 -36 22 114 -38 46 -34 89
4692 89 244 -28 98 -65 -80 26 -34 101 -7 80 -28 -132 87 24 -51 146 -128 167 -49 120 33 -30 141
4715 141 34 143 -7 78 68 4 -59 111 -50 -14 -67 -4 -23 -170 -110 98 -5 -88 8 17 -201 54 -38 -66 8
$$ packed form
4536F0o9L3p6J50p3Q2q4j5N8Qj04K0m3j52L25O0k05Pr7J38J2l5J32j92K3mj8o5
4564a24J16L2Nn8p3J8J16J5j22J66n1K5j37K0j40K26K6j6N3k3j82J32J05j68O3
4589B4J3q8P4K65l52J26j59J38m3KJ0J2N0r3o8O9O1J8o5J8OR4r0P1P1k89K64j10
4617B9n5QQ0n2Q7j30J21j10N5%J4L7O5j43L9L3rk01N7J41j95J16J08j7k51J63
4643a0MJ60k01J4Q1j25L13j70M7j88P9m2J01q6n1K45k25M5J00k04J95j81J57j8
4667D0m7l7k5J57m8q1J37N2k78kK42O8j46K3J25k81Q8K05k28N8R2j52Q4q0J23
4692H9J55k72J26j63j5J06o0J35j08Q7j08j04K19o3p5J97k74K95k16J69q7o3J71
4715A41j07J09j50Q5j0o4o3J70j61L6n3O3j9j47O0K08j03q3R6Rk18K55r2k8P4
$$ plain form
4740 8 195 57 38 202 -52 61 -12 41 11 31 36 -4 -6 7 102 2 -36 -93 -65 -119 31 146 -38 52 -31 -184 -7
4767 -7 -139 14 32 -125 64 -72 -54 48 -74 66 -143 177 17 47 49 150 87 50 90 136 68 78 33 -37 -39 53
4793 53 63 92 124 96 -194 32 -4 74 -3 -47 2 69 -32 -20 -98 122 111 -75 30 -60 -12 30 33 -2 174 -49 102
4820 102 -144 -64 -16 -41 -59 121 -19 -83 35 48 60 -89 -65 101 28 -25 -24 102 12 4 33 114 1 -50 -32 78
4846 78 -148 -54 -2 -43 -85 -12 -55 118 35 -78 -49 70 -100 85 -48 -82 -117 -19 -100 -102 -121 -35 -41 -151 -61 55 157
4873 157 -61 -157 -22 206 -2 -13 -89 -141 158 -61 -134 -49 26 104 -32 67 152 -71 -117 -92 -115 14 63 -83 85
4898 85 -30 -107 14 -23 -83 22 -51 -13 -196 11 73 147 46 39 119 115 -105 -44 132 -92 130 41 5 -89 26 133
4924 133 -104 -234 -106 -85 -128 -114 66 -33 -58 -102 -48 -199 61 35 107 19 -151 -31 153 -127 -47 82 124 -5
$$ packed form
4740HJ87j38j9J64k54J13p3N3l0K0Nm0kJ3R5j00l8n7K8n4J50J15j84R0q3j53J77
4767gj32J53J8j57J89j36J8J02j22J40k09L20j60L0KJ01o3l7M0M6o8J0m5p0kR2
4793E3J0K9L2k8k90K26l6P8p7m4M9O7j01J2p8K20j1j86J05r0M8M2Ll5J76k23J51
4820A02k46Q0M8k5j8J80j40o4J18J3J2j49K4J66p3n3JJ26r0qK9Q1j13n1J8J10
4846G8k26R4N2m1m2P3m3J73q3j13K9J19j70J85j33l4l5R8q1kj9Q6oj10R0J16J02
4873A57k18r6J35K28k08j1p6n2K99k19p3Q5P5P8j36R9Q5k23m6K5k3J29M9j46J68
4898H5j15p7J21l7o0J05p3L8j83K07O2P4j01pQ0mk20O1J76k24K22q9l6r4J15J07
4924A33k37j30J28K1m3J4J80r9k5m4N4j51K60k6P2q8j70J20J84k80Q0J29M2j29
$$ plain form
4948 -5 12 11 -3 -34 -15 -102 -6 13 47 -118 69 -10 142 107 -54 -70 106 -167 -116 -18 30 -58 53 74 47 -10 -19 62
4976 62 30 -15 33 -78 38 118 -95 -74 -75 -3 25 -174 -11 24 19 -39 63 -214 6 113 -112 149 4 -79 120
5001 120 104 -71 123 -99 -15 49 -72 17 -208 -142 24 -77 -101 -5 -19 -72 179 67 -100 -186 -53 86 -88
5024 -88 106 28 -156 14 -53 -85 69 126 51 -110 33 -175 -163 -37 25 49 27 150 37 81 -123 122 72 115
5048 115 -35 -85 -117 -11 -76 -97 127 -103 -118 -18 -2 6 6 64 -56 142 15 -107 -42 -17 -14 -76 14 -195 -10 -9
5074 -9 18 18 -12 129 -69 -18 88 49 -58 159 17 -24 35 112 7 25 49 78 3 -34 11 -127 86 -143 100 103
5100 103 -29 -49 49 82 -26 153 -67 66 -112 123 4 61 2 -29 -260 -36 -6 -52 110 87 181 111 42 -27
5124 -27 -134 53 66 -85 97 33 -49 47 30 -39 31 -79 11 -27 104 80 -1 -77 -18 -72 -41 90 106 -77 73 100
$$ packed form
4948eJ7jj4l1J9q7R6J9L4j65J87p9J52l5j61j6J76k73N1R8M8q8J11K1k7n7rQ1
4976F2l2m5M8j11J16Q0k13K1jP2K8j99J63L5nn8J02k77K20J07k25K61j45q3J99
5001A20j6j75J94k22Q4O4j21Q9k25O6J66j01k4R6j4n3K51j12j67q6J33J39j74
5024h8J94p8j84J70o7l2J54N7p5j61J43k08J2J26O2K4k2J23j13M4k04K45n0M3
5048A15j50n0l2J06o5k1K24k30j5J00J6Q%N8j20J98j27j22O5K5Lo2R0k09J85J
5074iK7%l0J41j98N1J06l9j07K17j42m1N9P7j05J8K4K9p5l7M5j38K13k29K43L
5100A03j32k0R8L3j08J79k20J33j78K35j19N7n9l1k31K24L0m6J62k3R4p0o9o9
5124b7j07J87J3j51J82o4q2R6j7o9P0j10R0l8J31k4q1p6N9n4L1J31J6j83J50K7
$$ plain form
5150 100 14 156 -14 -78 116 -47 262 -32 -46 -37 -10 -6 32 15 -21 43 -11 -71 -94 24 88 22 93 -8 93 58
5176 58 -32 -51 191 -44 -7 127 185 -126 33 28 102 -78 93 23 42 -45 38 -42 127 136 78 -163 -117 107 -64 89
5202 89 11 -64 56 86 -13 -35 -6 -113 -13 -160 -85 -105 -193 -149 -57 169 41 41 -55 -44 12 24 99 -26 62 -109 7
5229 7 -119 30 -177 37 9 -118 135 58 171 -154 96 95 68 -72 5 -45 -52 -80 81 2 40 -48 18 97 201 -194
5255 -194 2 -78 -103 176 -31 -100 -18 4 -43 -119 -11 21 -41 -61 -72 -72 -184 132 -46 -98 -193 -22 71 139 -125 -96
5281 -96 108 -38 17 -88 128 -44 12 13 27 34 70 78 138 30 -4 -93 26 96 -77 -51 -4 88 -37 -69 4 61 -62
5308 -62 64 -54 -56 50 -79 78 -107 -193 -56 14 -149 136 72 -72 89 180 41 -30 -36 -56 -7 66 28 146 47
5333 47 20 -22 49 17 151 -9 -85 -1 -2 76 -82 51 -33 -76 161 -68 -1 24 69 1 159 67 -44 -18 -117 58
$$ packed form
5150A00q6J42j70o4J94j63L09k94j4RK7ML8j7l6O4n4o0k3J18O4o6P1j01J01l5
5176E8r0j9K42k35L7J34N8l11J59nP4j80J71p0J9q7Q3q0J69Rn8k41M6K24j71J53
5202H9p8p5J20L0r9k2K9j07J00j47P5k0q8M4R2K26j28%r6J1N6J2P5j25Q8j71J16
5229Gj26J49k07K14k8j27K53p7J13l25K50jk7j40P7n0pk8J61p9L8q8O6P9J04l95
5255a94J96q0k5K79k07o9Q2K2m7p6J08L2o2k0j1%j12L16j78n2r5J71R3O8k64K9
5281i6K04j46N5j05K16j72N6JJ4PL6QO0j08l4q9J19P0j73K6M7R2j25l2P3N7j23
5308f2J26j18kJ06j29J57j85q6J37P0j63K85o4j44J61R1j39p1ok0M9P3l8J18r9
5333D7k7m2P1l2J34j60p6Q4jP8j58J33q4m3K37k29O7K5M5o8J58r2j11K6r9J75
$$ plain form
5359 58 -112 -10 59 -53 22 -125 32 60 -166 17 38 -68 -116 -87 71 -47 -117 -22 7 -35 27 83 19 117 10
5384 10 35 94 -38 25 -32 -11 141 -67 -164 59 -33 53 13 -38 109 -15 81 60 69 45 -18 -3 -118 143 162 -42
5410 -42 -18 -168 104 66 -76 -48 17 -9 -42 -32 -73 -24 86 44 95 28 18 86 38 16 -12 -36 85 -52 -67 -173 26
5437 26 -143 10 -87 106 161 -60 63 90 4 -73 179 -85 147 -93 126 -134 -71 20 57 -11 14 19 19 -135 -117
5462 -117 121 -6 -76 8 -10 -108 22 -107 -53 36 -15 -81 -28 1 -31 -49 113 61 84 -23 -58 9 34 147 82 17
5488 17 -51 12 -127 51 -11 -101 88 41 23 180 -178 -30 110 81 -63 164 66 -133 46 -104 138 -77 -103
5511 -103 -36 46 -52 17 -58 -96 137 33 84 6 85 -20 -10 64 -48 4 81 -89 -51 -86 42 5 4 -11 -12 104 -20
5538 -20 -59 -186 70 -51 -21 67 -146 41 28 -73 -5 76 -38 16 158 74 167 48 95 48 -43 -13 83 -42 -94
$$ packed form
5359E8j70J02O9j12P5j47J57K8k26J83K1j06m8K9J58j18p0R5K9m2O2N6o4R8j07
5384A0K5N9j32O3n7K1J52k08r7K23r2Q6m0n1J47j24R6k1Rk4o3J5j15K61J9k04
5410d2K4j50K72l8j42K8O5k6l3J0m1M9J10m2N1o7j0O8m8k2k8k4J21j37j5j06J99
5437B6j69J53r7J93N5k21J23K7q6p7K52k64K32k40K19k60O3R1L7o8K5N%j54J8
5462a17K38j27p0Q4j8r8J30j29N4Q9n1o6N3K9l2j8J62n2K3j07l5O7K5J13o5o5
5488A7o8O3j39J78o2r0J89m7j8J57l58J48J40k9j44K27r8j99J79j50K42k15k6
5511a03O7Q2r8O9p5l8K33j04N1p8P9j05J0P4j12N2P7j70L8l5J28l7jj5jJ16j24
5538b0l9j27K56j21L0Q8k13J87j3j01O8Q1j14N4J42q4R3j19M7m7r1L0R6j25n2
$$ plain form
5563 -94 27 -41 77 7 82 -122 -294 67 58 46 -104 47 136 -20 191 13 -100 -7 -35 -42 -24 -6 189 -29 -114
5588 -114 30 69 132 -72 -24 -190 48 -64 -149 -131 -32 -64 30 107 64 87 30 -70 -80 -60 -55 -93 147 -190 -156 -102
5614 -102 -183 19 14 21 115 -54 -38 115 81 -109 -30 25 105 15 173 69 -20 -77 5 104 -120 80 -22 -98 76 -102
5640 -102 101 75 43 6 10 -65 212 -88 87 134 -32 -38 68 124 78 63 16 3 67 78 99 44 16 15 50 92 64 -7
5668 -7 -21 69 -65 16 -28 8 32 -64 -30 13 -24 4 -16 -68 156 -68 -87 -106 77 38 -166 95 -166 15 -82 -33 -86
5695 -86 -18 141 18 59 75 27 -37 63 24 105 59 34 -40 -131 62 53 -179 -160 -124 -60 -13 15 -120 -11 -185 112
5721 112 -112 3 -8 -115 58 -48 156 -43 -68 90 -60 99 81 39 -100 -30 154 -115 -36 97 33 132 -21
5744 -21 173 -36 -41 69 -33 -78 132 21 20 -2 -138 -21 35 25 -98 80 25 -58 9 16 -34 70 -66 83 171
$$ packed form
5563i4J21o8J18p0P5k04j72L61rj2j50J51Q9j56K11j78j13R3k8pJ8J8J95k18q5
5588a14J44L9O3k04M8j66K38j12q5J8R9l2R4P7m3K3n7j00j0K0Nl8K40l37L4N4
5614a02q1K02nPR4j69J6J53l4j90P9N5Q0r0J58j04q9n7Q2R9k24K00j02p6J74j78
5640a02K03k6l2l7Mp5K77l00J75M7j66oJ06N6m6j5m7j3O4J1K1n5k8jL5M2k8p1
5668gj4R0j34Q1m4L6K4r6L4M3l7K8k0n2K24k24j9j9J83l9k04K61k61J81r7M9n3
5695h6O8J59j23M1J6m8o4J00l9Q1m6k5p4r1J93rk32J9L6O4M7K8j35J09j74K97
5721A12k24J15j1j07J73j06K04j99k5J58j50J59j8m2j39P0J84k69P9J33o4R9j53
5744b1J94k09nJ10j02m5K10j11jk2j36J17N6j0j23J78n5q3O7Pn0J04j36J49Q8
$$ plain form
5769 171 -67 -80 17 -140 95 134 55 117 66 -45 -56 40 -28 8 -26 -53 -3 -7 178 21 134 151 99 0 -22 101
5795 101 46 -39 -181 34 -47 -8 100 -74 -30 14 -29 -30 26 27 3 194 4 -44 -47 9 130 -97 -60 49 79 -78
5821 -78 61 90 -48 -80 44 34 128 -136 -16 -35 -144 -64 -45 -103 -4 148 147 -25 119 151 54 -150 41 -9 -28
5846 -28 -127 -56 35 -101 -24 58 -169 -54 75 156 57 -68 217 -179 76 -31 -39 -78 8 -20 40 103 12 85 110 113 -170
5873 -170 34 -135 76 31 -62 8 31 82 -65 -23 63 56 -90 -116 147 17 -99 -79 84 66 86 -37 -6 44 45 25
5899 25 -42 -82 -21 -21 -60 19 24 -87 -11 -38 -11 23 136 8 4 21 -8 -64 -70 63 -9 -47 10 105 -15 127 -143 -76 -110
5928 -110 -37 52 -88 45 -16 -36 -162 90 5 239 -31 -151 136 3 96 51 44 -147 115 -116 69 -40 2
5951 2 57 -125 44 147 -89 -12 165 39 -126 -151 33 58 -129 -62 31 -37 26 -72 1 -64 -103 94 188 -48 -62
$$ packed form
5769A71k38j3R7j57K35L9p9O2n1j11j1R6o8L6l4k7N0mJ85j57J13J7n2r9k2J23
5795A01n5q5j42K15q1L9J08j74M4M4m3jN6Jk4J91j90m8lN6J21k27L7J09L0j57
5821g8J39K9j38l2J24j0R4k64J20j9j09Q0J9n8R9J52jj72J44L2r7k04J91n0j9
5846b8r9P1R1j36P7Q2k27J15J29Q1r9j25K85l96K55j07ql9Q6k8O0O3r1P3K5Lk83
5873a70K04j69K11m5r3P0K3N1j47M2Q6pj46k6K63j30j16K0J63j8K0j23L1N0Jk0
5899B5o7m0O1%l9P9Nj11P6k7K7L4J13j28mJ7k9n6oJ33p2l8N7R5j20J42k70O7l4
5928a10P3Q9j40J33o1k0j26K52q5K34k70j20K87j33R3m5pj91K62k31J85j09M2
5951BN5j82J69J03k36P7J77j26j65k5J84K5j87O7R3o8O3r8P3o5l9J97R4k36j4
$$ plain form
5976 -62 -97 -48 49 164 -57 -57 -98 -10 99 16 93 96 63 -28 63 -157 -51 -86 -30 -157 127 -138 -119 151 6 -57
6002 -57 6 76 -36 -16 -93 -26 24 104 -32 71 -109 99 -79 19 -95 -140 -26 -64 92 -144 37 -105 -7 60
6026 60 82 54 123 54 133 108 89 48 208 -3 -14 -53 -66 66 55 81 -113 66 -19 22 2 100 61 -46 -195 -5
6052 -5 -150 20 -90 7 30 56 19 113 116 -7 154 -126 -125 84 38 -140 -4 -40 -71 -8 110 6 -97 -90 81 110
6078 110 -103 129 -92 11 -69 -54 64 -136 -103 -63 -157 77 -109 -18 9 -45 -24 204 3 -58 54 4 -16 28
6102 28 -60 -30 -147 -20 -40 83 -41 26 -30 -15 -69 -30 -24 132 95 22 -62 -53 3 -56 -90 -171 140 53 101 69 -61 2
6130 2 74 90 -73 -21 -98 134 -15 36 -26 -10 -103 1 -133 -24 114 81 78 9 148 -25 4 5 -11 -127 124 56
6156 56 9 -18 75 62 14 131 -93 37 119 -68 8 43 137 139 47 138 70 -113 -82 -120 -68 181 -40 -47 59 135 -164
$$ packed form
5976f2l5M9R7J15k21%m1Q8J09q3P7Ll3r1R1k20J06l5N6j27K84k65J9K70j45o3
6002e7O3P0j12K0p7O7N0Q0j36J03j80K08j78R8j14m5J14l8J56k36J81j42R8O7
6026F0K2k8O9o9P9k5j9m1J60k11j1l9j3J32j1K6j94J79q5M1k0R8l9j07j49J90
6052ej45J70j10R7K3K6l7R4Lj23J61k80JK09m6j78J36l6l1O3J18j04j03PJ71K9
6078A10k13K32k21J03q0J5J18k00L3M0r4K34j86R1K7n4K1K28k01o1J12n0k0M4
6102B8q8L0j17J27k0J23j24O7n6J5n4L9OJ56l7p3q4RN6n9l4q1L11q7M8l2j30O3
6130BP2J6j63N2p7K32j49N1o2J6r3J04j34J09J38l3lo9J39j73K9Jj6j16K51o8
6156E6m7k7R3j3m8J17k24J30Q2j87P6L5R4Kr2R1o8j83L1l8N2K49k21pJ06P6k99
$$ plain form
6183 -164 77 51 -20 15 39 35 -36 -150 14 -12 79 -31 40 -46 216 59 -29 34 23 -128 74 113 -85 25 255
6208 255 -51 -8 -85 -16 20 -57 -35 79 71 -58 -55 -6 -174 -90 46 110 -44 -49 -26 -125 -88 76 -73 -249 -12 -17 -26
6235 -26 26 -64 21 -110 35 70 -14 179 -83 -43 3 3 49 -44 3 -163 119 -4 -131 -66 136 53 -62 2 -151
6260 -151 -161 -56 -47 29 -108 -14 68 -108 -51 35 41 8 95 132 114 -195 -87 24 42 107 31 -74 -131 35 -20 -111 163
6287 163 29 123 58 -2 -77 78 -20 94 21 -15 21 -34 -26 -33 156 7 -60 26 14 -104 -79 167 114 -33 25 -57 78
6314 78 69 165 -154 -52 -7 -148 -83 37 -34 -67 76 -161 -58 -7 23 -37 11 -76 13 -35 -38 -55 -43 -30 -76 70 -92
6341 -92 45 -86 -25 49 125 107 -63 -26 -49 -158 -37 58 -78 1 53 54 75 128 12 168 -97 -85 167 -32 -30 146
6367 146 109 10 6 -67 -69 -16 -57 49 55 11 44 4 153 81 64 -90 -28 28 -26 156 102 15 2 -29 -114 -60 29 118 53
$$ packed form
6183a64K41k6p1L5K4mp1j14J64k6R1j10P1q6K62j57q8O3j1j51K02L9j98J10K30
6208B55l06M3p7O9L6p7K2J14qj29LM9j68Q4J36O4j54nK3r9L7J64j49j76K37nr
6235b6N2r0Q5j31J45L5q4J93k62M0M6%M6r3M7j66K82j23j27O5K02q3j15O4j53
6260a51j0J05RP6j37R4Q2j76N7Q6Ol3Q7L7j8l09J08J11J8O5p6j05n7J66n5r1K74
6287A63j34R4o5o0p5J55r8J14p3l6L6n5QpJ89j49o7Q6j2j18K5K46n3j47N8q2J35
6314G8rR6l19J02M5j41O5J20p1l3J43k37J03N1L0o0M8q7Q9m8lj7J2J3m6J46j62
6341i2J37j31O1P4P6j8j70L7k3j09J21R5j36P9N2JK1N3j16J56k65J2K52j99KJ76
6367A46l7r9mp3kN3m1J06Om4L3m0J49p2j7j54O2N6n4J82n4q7j3l1q5N4Q9Q9o5
$$ plain form
6396 53 29 145 110 83 59 -33 8 -31 -52 102 118 58 42 -95 71 -111 -11 -30 16 -10 -39 74 4 -98 10 -70
6422 -70 -43 17 106 31 47 -129 -16 -13 182 -103 98 60 109 70 -80 -33 -4 -69 20 36 -100 13 -38 27 40 -8 -107
6449 -107 -4 -116 29 -52 -60 -25 -90 83 -135 -92 45 -154 7 32 -63 -12 91 6 -55 23 54 -63 -71 33 -183
6474 -183 -64 -10 108 111 114 -167 23 53 -136 131 -8 191 -37 -25 -92 70 79 6 -107 -5 -23 -65 3 135 10
6499 10 29 88 86 17 51 143 168 24 -12 105 -112 68 262 235 55 1 -24 142 -155 -66 -113 32 9 16 24 3 -36
6526 -36 -64 -48 -2 58 -116 73 59 48 -7 72 11 -65 -89 62 54 -95 18 -15 26 -61 -19 15 13 -27 28 -107 -44 -163
6554 -163 124 -132 46 -7 -118 -74 25 3 47 65 25 156 129 -184 68 55 -100 122 -32 -21 9 21 -43 -108 261
6579 261 109 117 -103 25 29 72 -28 31 51 -13 -9 42 6 -80 59 64 36 -97 185 -144 112 -95 112 -133 105
$$ packed form
6396E3k4J16l5k7k4r2M1l9k1J54J6o0j6j37J66j82J00j9M6k6k9J13p0j02J08q0
6422g0K7O0Q9p5J6j76J13LJ95k85K01l8M9l9j50M7K9o5Q9J6j36J13n1O5J3m8r9
6449a07J03j12J45q1qL5o5J73k18M3J37j99J61K5r5N1J03q5o1P8L1j17qJ04k16
6474a83J19N4J18LLk81J90L0j89K67j39J99k28J2o7J62Rp3j13J02j8m2O8J32j25
6499A0J9N9ko9L4R2K5j44l6J17k17J80J94k7j80n4k5J66k97Q9m7J45k3PQk1l9
6526c6k8J6M6O0j74J89j4j1n5P9o1p6k4J51qj49J13l3M1q7M2L4km0N5j35O3j19
6554a63K87k56J78n3j11M4R9k2M4J8m0J31k7l13K52j3j55K22j54J1L0J2o4o5L69
6579B61j52Qk20J28MM3j00N9K0o4MN1l6q6J39Nk8j33K82l29K56k07K07k45K38
$$ plain form
6604 105 -49 -79 8 134 -12 -32 -147 80 189 -156 131 -68 -52 25 51 120 -4 -46 13 -64 -140 64 -17 -48
6628 -48 18 -112 -85 -80 84 -1 9 -7 -67 -20 132 93 -36 -50 -49 6 -17 63 -192 -108 21 58 136 -118 43 73 -29
6655 -29 65 -20 -52 5 154 -76 -41 -144 -87 -108 0 69 173 4 56 -95 -17 42 -64 79 -186 92 -17 -44
6679 -44 30 -79 -19 -108 19 -8 30 182 51 167 -16 -66 13 -12 5 74 57 19 -13 -42 -137 7 -34 -10 -47 -30 -10
6706 -10 -62 73 -4 -95 -121 -17 17 118 117 -25 1 -82 -49 119 173 95 17 90 60 -45 -122 -71 172 -52 -73 -171 -35
6733 -35 -14 -136 37 -83 43 -105 77 55 -143 49 55 -10 -18 -36 41 -111 -93 60 75 28 9 76 127 163 -172 -54
6759 -54 12 -31 95 53 210 -32 20 144 12 118 -69 -56 28 34 -110 -49 15 15 -46 -105 65 -137 39 -34 -76 -97
6785 -97 6 66 33 77 -117 -61 -48 -222 207 101 109 4 4 32 -23 -10 24 71 -29 17 78 77 61 -29 -52 58 156 -125
$$ packed form
6604A05j54l0Q7J26j46k0j15K27J09l45K87j99J6P7K6O9j24m2N9p7p6K04q1l1
6628d8O6j30K7NJ64q5J0j6o0M7J52l9j29j4JN5k3Q0k55Q4J29L7P8k54J61L0j02
6655b9R4q5l2N7J49k30L5j03N7k1J08O9J04j69N2j51P8N9j06J43k65K78j09k7
6679d4P4j09O0q9J27k7L8J52j31J16j83n0P9k5J7O9j7l8l2k9r5J44m1K4l7J7K0
6706a0n2J35p7r1k6J04L4J01jj42K6q3L3J68N4p8p8P3l0j05p7N1K43k24k1r8J36
6733c5K1j22J73j20J26j48J82k2j98J92Oo5qj8P7j52J8J53J5m7j9O7N1L6l35J18
6759e4O6m3J26m2J57k42N2J24j32J06j87J3Q4Oj44O1O4%o1n9J70k02J76p3m2k1
6785i7J03O0l3M4j94N6J3j74M29j06Qj05%K8n5J3L4M7j00M6O1jj6r0k3J10R8k81
$$ plain form
6813 -125 80 -154 -112 43 -36 -7 -106 113 -9 -28 -58 -72 -93 -173 62 -22 157 -57 209 90 72 -97 -7 -62
6837 -62 41 -19 -75 62 3 53 28 -56 66 36 13 62 5 65 -49 -141 109 30 -89 224 15 107 -16 -40 -74 44
6863 44 78 62 52 -28 -44 2 -70 -20 -88 -77 20 -65 32 -27 -35 -108 241 92 -34 -115 64 64 -16 79 -111 -30 132 116
6891 116 -2 -127 -52 43 -10 -5 -50 6 85 -28 44 -81 -57 -7 69 34 135 -60 -20 -101 -10 -60 52 -47 69 35
6917 35 -65 84 -80 -86 21 116 41 118 -103 82 36 -169 8 77 -120 10 11 47 56 52 -35 48 52 -52 79 25 15
6944 15 -186 49 -81 46 4 45 124 35 -14 13 121 68 -33 1 -151 -37 -21 -28 -16 -20 -45 -55 49 -110 -108 -113 -162
6971 -162 -150 -8 -114 26 58 -80 47 -54 -33 9 53 131 -108 -2 -59 -40 -142 88 178 -85 118 112 -42 29
6995 29 7 13 -27 2 -18 -48 8 -121 52 38 -20 13 5 23 -127 60 -104 228 106 -56 99 -145 49 -6 187
$$ packed form
6813a25K05k34M2J55p9K9r9K19j22j9l0j4k1q0K35q4J79k14K66j19j8j69R0n5
6837f2J03o0n6J37n9N0k5q4J22l0k3M9n7O0j14r2K50p9j19L13k09R2j23k4l4J18
6863D4L4j6j0q0j6M6p2N0o8J1R7q5R7n9qp3L49j49j26q1J79%q0R5j90Q1J62j6
6891A16j18j25P5R5n3Nm5N6P9j13P2j25K4N0P6l5J01j95M0q1R1n0J12r9J16l4
6917C5j00J49j64oJ07R5p5P7k21J85m6k05J77O9j97J30JL6Rmq7Q3Mj04J31n4j0
6944A5k01K35j30J27m2M1P9q9m9K7J08n3j01L4j52J14J6pJ2mk5j0J04j59Knm9
6971a62J2J42j06J40L2j38J27j01K1M2M4P8k39J06n7J9j02K30R0k63K03oj54P1
6995B9k2Om0K9k0l0N6j29J73j4n8L3qJ8j50J87j64L32j22j62J55k44J94n5J93
$$ plain form
7020 187 -32 126 50 35 -7 -49 -82 117 132 115 38 -73 -55 9 -72 -176 79 -59 -12 -117 46 219 0 21
7044 21 50 3 -77 -2 148 158 12 -1 18 -31 125 -47 -83 -71 -3 -3 -70 -48 5 138 66 -66 -51 17 -78 -54 -29 -41
7072 -41 -24 21 54 -98 93 -36 -9 100 -43 -81 95 29 -24 158 -68 -21 120 -9 31 35 119 -4 -180 174
7096 174 -39 -65 61 -84 -49 -73 -61 -124 31 18 -68 24 8 -3 -37 -76 -29 -133 -49 -59 -15 -71 -28 33 36 66 150 -65
7124 -65 -35 40 -18 78 -3 -41 -89 165 120 87 23 -115 -24 32 -20 -96 -120 15 155 -114 -17 -43 11 -9 -29 -252 42
7151 42 94 -79 -217 -24 119 50 72 66 -1 -147 109 -86 -76 -109 -50 -147 -59 -35 -12 116 178 -14 -159 3 79
7176 79 22 -39 -44 13 44 -28 -129 35 -38 -68 51 -119 -53 -106 121 -21 7 94 21 -167 36 173 124 39 23 -33
7202 -33 41 77 8 -33 -15 -23 30 -147 4 -59 -58 45 -95 15 -52 133 -74 84 80 81 142 54 86 -79 85 -286 -83
$$ packed form
7020A87k19J58p6j5m2m2l3J99J5j7p7j11J8O4q1j04K55j38M7j05J63J73k19K1
7044B1K9m7q0P5J50J0j46j3J9m9J56j72l6J2O8%o7K2N3J33p2j32J5O8r5K4K5j2
7072d1J7M5L3j52J91j29K7J09j43l8J76o6n3J82k26M7J41j29M0MQ4j23j76L54
7096A74k13k6J26j45L5k4J2o3J55j3q6R2j6j1l4l9M7j04Q4j0M4n6M3O1LL0Q4k15
7124f5L0P5n8R6q1l8m8K54m5l3o4j38R1N6n2p6k4J35J40k69R7k6N4k0k0k23K94
7151D2N2j73j38J93J43o9K2oo7j46K56j95J0l3N9r7Q8K4K3J28O2j92j45J62P6
7176G9n7o1nN7L1p2j01J64p3l0J19j70O6n3K27j42K8Q7p3j88K03J37m9q5j6n6
7202c3P4L6o9m1J8qN3j77J51o3JJ03j40J10o7J85k07J58mJO1q8L2j65J64l71K03
$$ plain form
7229 -83 134 -53 -135 54 27 -107 40 -7 -168 28 -149 -56 58 32 249 65 36 9 28 -21 -47 25 28 3 -10
7254 -10 62 -20 66 -61 -181 121 -99 -31 -100 204 -157 -26 -41 -4 -17 -68 -51 98 102 -52 22 126 62 11 163
7279 163 96 31 187 31 194 7 -170 255 24 -16 -193 50 141 -41 7 19 -40 159 -36 -126 -48 4 -9 -120
7303 -120 112 80 175 76 101 -90 -11 -80 -46 -22 111 128 -17 -96 54 5 74 -26 -39 -20 1 22 -49 21 27 208 -2
7330 -2 78 104 194 -63 119 37 187 -83 -59 -5 -149 136 -42 117 74 -155 85 130 52 15 42 -3 159 -45 -81
7355 -81 -67 92 108 -7 144 -28 -10 -61 -1 -31 5 73 -110 105 -29 -109 -37 -183 -65 -29 107 -53 42 12 9
7380 9 -12 -120 100 71 -45 -143 30 -10 -2 -66 -18 -64 -15 26 -19 84 -59 28 120 0 -59 32 -162 36 -44 95
7406 95 -165 8 62 63 17 -76 -39 -47 185 -5 38 -12 8 29 7 -51 -48 105 75 -69 102 -149 -34 17 7 66 2
$$ packed form
7229h3K17j87q2J89k7j34J47m7j61J96j77R3J14k6K17j84k9k7J9m9k6P2Lk5j3
7254a0P2q2Q6j27j20L02k20O8o9L04l61J31j5L7j3n1J7J49Mj54P4J04o4n1J52
7279A63o7o5J56j56J63j87j77M25k31m0j77K43R1j82M8J2n9J99j95r0P8N2j3j11
7303a20K32l2R5r9K5j91P9o9L4K4J33J7j45p9J50m9O9j00j3J9K1K1p1P0OJ81k10
7330bQ0K6R0k57J82q2J50k70K4N4j44K85j78J59m3k29K40M5p8l7K7m5J62k04l6
7355h1J4J59J6j15J51j72J8n1O0l0L6O8j83K15j34q0P2j46J18L6J36j60R5l0l
7380Ik1j08K20k9j16r8J73m0Qo4M8m6M9M1m5J03j43Q7R2j20n9R1j94J98q0J39
7406I5k60J73N4Jm6r3L7qK32j90M3n0K0K1k2n8LJ53l0j44J71k51J15N1j0N9o4
$$ plain form
7433 2 -87 -61 -8 -3 -23 80 23 30 -15 -25 94 -132 21 -43 85 103 -100 6 -84 89 -73 -19 12 -109 -163 -56
7459 -56 -44 -184 101 52 35 -46 106 104 -190 -15 -81 -90 87 -56 168 -15 -9 38 40 3 5 -192 30 -84 36 55
7485 55 -77 -36 83 -9 -28 17 -100 101 -107 54 56 85 -47 -61 38 59 121 -1 -79 -56 51 -72 11 24 10 -100
7511 -100 163 -5 118 64 169 29 -112 -77 -20 -79 29 29 64 -125 -21 85 110 7 115 86 -169 -44 -9
7534 -9 101 118 -115 -20 -107 -25 -31 21 102 -4 79 -49 -145 134 65 -52 74 -45 -67 -27 -70 -30 -102 78 66 -113
7560 -113 108 -40 -134 -103 -68 128 16 -90 -159 -39 133 134 -7 -3 -28 67 -3 -4 -32 -95 74 -104 114 -19 83
7585 83 -51 -80 95 35 -28 -180 -61 -18 -136 26 18 88 70 2 32 -8 86 -73 80 -74 30 77 104 -89 62
7610 62 0 13 13 -60 30 -5 62 48 173 -21 -135 91 -107 -16 -39 60 92 -27 13 15 -121 134 123 0 -42 106
$$ packed form
7433Bq9K6N3Nk0J03n7Pm5j0J19k26J53o4J28J8k03J06r0J73j62N4L1j21n4J07
7459e6J2j40K85m9j7q1J52kk94J75o6rJ77j43K24j83OM7Kl7Kj97K22j14J20J9
7485E5j32M1J19r2j9M5j17K01k08J61KK9j32j4R9K1O2j22p8K3J07j23Q3J3j4j10
7511a00K63j68J23n4J05j40j41L5N7n9J08%L5j89J04J06K5j03J08k9k55J25L5
7534iJ10J7k33R5q7Q2oN2Q1j06Q3j28r6K79o9j17J26j19k2M0m3M0p2J80j2j79
7560a13K21j48r4L1L5J96j12j06o9J20J72Jj41Mk5R5p0jk8o3J69j78K18j33J02
7585H3j34k9J75o0o3j52J19M3j18J62qP0j8o8L0m0R4j59J53j54J04M7K7j93J51
7610F2o2J3%p3R0l5O7j4J25j94j14K26j98R1k3R9L2j19M0Kj36K55j1j23m2J48
$$ plain form
7636 106 -159 -89 -91 86 -34 121 -53 121 180 -19 -128 -17 -9 -64 109 27 119 -33 -13 49 -27 45 -51 89 -64
7661 -64 -14 -39 -128 -132 69 36 -19 8 -143 72 -36 -55 78 -24 40 16 -10 153 -20 61 26 -92 -56 -47 71 73 98
7688 98 29 45 -91 66 -134 -50 -50 -63 -13 84 126 -76 105 -203 7 -68 107 -31 -66 92 -27 81 108 62 85
7713 85 170 -130 272 -50 28 94 5 114 75 11 -101 -47 -93 133 129 -82 31 -40 69 76 -68 127 -111 -53 106
7738 106 -234 -45 129 -43 -47 -28 16 200 68 27 32 39 107 -53 79 88 -68 -142 -21 84 -152 -46 -78 3 -24
7763 -24 60 105 48 71 102 67 -29 53 88 -46 -127 0 153 -110 79 -94 21 48 -58 -25 142 -32 -80 83 -150
7788 -150 12 -39 40 -183 -44 61 -118 10 -93 -183 100 -4 -141 15 -66 -28 -94 51 34 78 107 -8 -145
7811 -145 47 93 55 -4 59 -117 45 100 73 -22 -39 -46 136 50 -47 -109 -105 -73 30 -28 60 38 -125 -3 54 -148 -35
$$ packed form
7636A06k65P0kJ77j20J55j74J74N9j99j09J11Qn5J73q2R2j52K0O2p6P2r6J40j53
7661f4N0k5q9mK01l3n5K7j51K15j08j9J33j02O4k4k6J63j73Q1l5j18L6RJ18KK5
7688I8o9J6j36J57k00Q4%j3N0R7M2k02J81l08K10p5J75j38l5J58j19J08K7m6K3
7713H5Q5l00M02l22P8O6q9J09l9o4j12N4m6K26mk11J13p1J09Pj44J95k38N8J59
7738A06l40J89J74j72mJ9M4J84j32m1NPO8j60J32Rj56p4J21J05k36J06l2Q1k7
7763b4Q4M5n7K3L1l5r6Q2L5j34q1J27J53k63J89j73J15K7j06L3J67j74m8J63k33
7788a50J62n1P9k23J39J05j79J28j03r0K83j04j37J56q1L8o6J45j7M4K9j15j37
7811a45J92M6l8n9O3j76J62N5k7r5j7pJ82q6r7o2ML2J03n8Q8k2j63J22N7k02J13
$$ plain form
7838 -35 -20 89 -69 18 17 -79 -77 -12 -55 60 -17 105 35 82 -38 108 -101 -37 -100 23 -31 -51 67 80 -44 125
7864 125 -73 13 -54 121 -17 -12 -77 -17 -96 -113 -167 201 -189 -190 32 124 22 35 63 160 -29 34 4 -71 13 125
7890 125 84 66 -102 22 67 11 49 -12 129 54 68 61 22 127 37 -87 -176 155 118 -145 13 91 -147 -2 -29
7915 -29 212 -29 -55 86 59 78 87 102 15 -102 -178 -50 -34 -17 0 62 48 -20 -5 21 107 11 -69 42 -33 -15 84 -114
7943 -114 -57 144 23 97 -47 -123 108 -44 96 -104 55 -133 81 126 96 -25 98 93 50 67 4 -34 -119 -102
7967 -102 94 -53 -213 -31 11 111 27 54 80 68 51 18 74 -47 13 -136 -45 -39 113 168 99 20 53 -40 -62 85
7993 85 -11 21 78 -118 8 44 74 74 -31 -59 -134 -39 21 -39 -171 -74 51 12 119 58 179 229 -85 139 -101 109
8019 109 -13 -5 -236 4 32 20 27 -162 169 -188 0 -22 84 39 73 33 -185 28 107 -130 -109 9 -37 -72 -83
$$ packed form
7838c5J5J09j58Q7jr6KO5m3J15p7J22p0M7j20J46k09O4o3J23n4k0J18J3j24J69
7864A25j98Q6o7J75j38No5O0p9j7n4L68l90jK22R2j02J3K8R7j89O3l0p5Q4J12
7890A25m1j8j68J24M5n6L8o1J41p5J4pl9J05r0j24q9L31l7k63J58P8k38J45k7
7915b9K41k41k6J41k7J9RJ5q7j17p6J28J6J7J7O2j4o8J5K6Q6r6q0J11p5J8R9j98
7943a14N7K01j21P4j44p6K31j52J40k00J59j88K14M5l0j21J23nm3J7o3l8q5J7
7967a02J96j47j60J82M2J00q4K7K6j2j7l3N6j21O0j49R1OJ52N5o9p9L3r3k2J47
7993H5r6L2N7j96J26L6L0%j05k8p5R5O0o0j32R7J25l9J07o1J21N0l14K24k40K10
8019A09j22Qk31K40K8j2Pj89L31l57J88k2J06m5L4m0k18K13P9k37K1J18m6l5j1
$$ plain form
8044 -83 7 33 -54 -72 -68 110 -65 -51 110 95 12 68 8 0 -17 -23 -114 -86 98 -28 20 -40 58 -49 17 -5 -43 94
8072 94 -71 41 -50 -206 -33 -137 -148 -11 -55 -4 33 -118 -116 -36 96 62 7 -27 95 -89 10 -51 -226 -67 -115
8097 -115 -32 -127 -156 76 33 159 45 17 104 -28 86 -91 -155 -46 -74 -26 31 -21 -31 -39 -48 -49 63 -48 -48 95 103
8124 103 -96 -166 -95 103 -189 -102 50 30 67 76 87 88 -27 -103 62 42 27 -48 -46 168 25 -33 48 175 -32 85
8150 85 -18 164 -105 -112 86 -3 60 -81 -23 -91 -91 -28 105 -2 104 26 -39 -72 -44 -70 84 -156 -50 22 26 10
8176 10 52 47 72 -75 -86 -81 -13 8 112 -126 0 29 64 55 -92
$$ packed form
8044h3R0K6q7j8MJ78j75J4J61j5q3N6o0qj7or1K8J84j26M8o0R8j07O6k2l8J37
8072I4j65J12r1j56J73j04j1J37m4N1L7j51KQ0J32l4n5l4J22j84R9o1j75J59m8
8097a15Q3r5k9K32m3J26j14k8Q7j32J14j77o4J09k8M8N7n2j0qrjJ12j11%J43Q
8124A03j99p0P1J98k92Q7J52k0L7RJ1Jj15p6J65k0j5p5KK14j43n8Q1J27k07J17
8150H5j03J82k69pJ98q9O3j41N8o8%O3J33j07J06p8o5l3K8k6J54k40J06P2Mj6
8176A0M2nK5j47j1NO8K1J04k38J26K9L5rj47
8191i2
$$ Imaginary data points
##PAGE= N=2
##DATA TABLE= (X++(I..I)), XYDATA
$$ plain form
0 0 0 0 0 0 0 0 0 0 0 0 0 8 0 0 -8 8 0 8 -14 8 -10 20 -24 23 -30 40 -42 46 -60 69 -74 88 -105 118 -132 154 -174
37 -174 190 -215 248 -274 300 -341 382 -417 464 -520 570 -625 694 -765 836 -922 1018 -1117
55 -1117 1225 -1352 1491 -1639 1809 -2004 2213 -2441 2690 -2923 3040 -2737 703 11198 -268604
70 -268604 50628 -25181 15228 -8829 10020 -4629 5458 -5903 1954 -3348 3262 -1391 2870
83 2870 -2135 1411 -2129 1304 -1231 1330 -904 851 -1307 713 -72 1731 654 1020 -700 -1109
99 -1109 -2034 -526 1155 3110 1286 167 -2191 -2314 -1583 774 2040 3049 1933 542 -1372 -2515
115 -2515 -3066 -2456 -833 1957 3304 2290 -272 -2303 -3357 -1721 940 2756 2739 392 -1534 -2709
131 -2709 -2812 -1371 270 1764 2186 1862 1483 104 -885 -1589 -570 136 61 265 -65 107 232 288 -144
$$ packed form
0@%%%%%%%%%%%Qq%qJ6qQk2K2j8L0m4M7n3P0q2Q8j06J29j43J62j93K23k50K86l28
37a74L64m05M63n22N74o41P23p99Q81r84J090j195J319j459J601j758J940k135
55a117K342k577K843l130L448l813M217m654N131n613N963n777L440J0495k79802
70b68604L19232p5809M0409k4057J8849j4649J0087j1361P857n302O610m653M261
83B870n005L546l540L433k535K561k234J755k158K020p85J803j077L66j720m09
99a109r25J508J681J955j824j119k358j23P31K357J266J009j116j391j914j143
115b515n51O10J623K790J347j014k562k031j054J636K661J816j7k347j926j175
131b709j03J441J641J494M22l24l79j379r89p04J019P06p5K04l30J72J25N6m32
$$ plain form
150 -144 -391 -687 -537 -269 299 755 1017 762 303 -632 -1059 -1816 -745 614 2430 1933 744 -1406 -2318
169 -2318 -1052 1006 2522 2117 998 -604 -2145 -2235 -1450 -25 1028 1968 2282 1553 -302 -1548 -1664
186 -1664 -507 203 652 599 336 -502 -1 -72 -168 97 -4 -140 64 320 584 910 693 -111 -780 -1267 -1272
207 -1272 112 1306 1900 715 -997 -1841 -894 642 1733 1673 939 -601 -1543 -1996 -1521 -720 221 1348
225 1348 1899 1495 -119 -1016 -1150 -838 207 560 596 -328 -44 -54 -39 -37 51 48 -33 -317 363 744 694 795 302
248 302 -653 -1414 -1452 -638 560 1607 734 -609 -1403 -887 -146 912 1359 970 -146 -873 -1383 -1464 -1071
267 -1071 -260 779 992 726 374 -163 -320 -109 38 96 -262 55 230 179 34 -21 -34 -201 -253 -201 26 406
289 406 831 738 298 -248 -1053 -1147 -596 639 501 202 -112 -139 -195 -94 209 449 192 148 -15 -139 -56 -103
$$ packed form
150a44k47k96J50K68N68M56K62k55m59r35m27p57J071J359J816m97j189k150r12
169b318J266K058J516m05j119j602j541r0P85J425J053R40L14p29j855j246j16
186a664J157P10M49n3k63q38N01p1r6K65j01j36K04K56K64L26k17q04o69m87n
207a272J384J194N94j185j712q44R47J536J091o0p34j540r42m53M75Q01R41J127
225A348N51m04j614q97j34L12J045L53L6r24K84j0J5KQ8lq1k84O80L81n0J01m93
248C02r55p61l8Q14J198J047q73j343p94N16P41J058M47l89j116p27n10q1L93
267a071Q11J039K13k66l52n37j57K11J47N8l58L17J75n1j45n5j3j67n2N2K27L80
289D06M25r3m40n46q05r4N51J235j38k99l14k7n6J01L03K40k57m4j63j24Q3m7
$$ plain form
311 -103 -94 -182 -443 -876 -664 149 850 811 -305 -760 -831 -240 635 1060 412 -170 -831 -967 -903 -620 64 732
333 732 923 881 489 -40 -269 -222 -85 -256 -697 -309 227 824 600 -20 -687 -823 -629 -335 19 528 864
354 864 724 378 -46 -70 202 205 -64 -616 -447 80 581 644 199 -392 -633 -167 8 368 508 380 167 -107
376 -107 -312 -698 -727 -511 54 416 284 156 -3 330 127 -127 -220 -18 246 342 513 258 -2 -202 -512
397 -512 -594 -522 -142 -60 -131 -385 -367 263 122 -55 -30 193 -13 -16 -34 -61 -145 47 -237 -382 -373 -113 -47 -116 -236
422 -236 -414 -214 184 302 1 199 127 -106 94 255 112 -89 -281 -166 -249 -193 205 405 348 -17 -304 -25
444 -25 154 176 -77 24 -16 -200 22 122 85 132 -85 -86 -189 -48 94 175 117 39 50 -19 52 48 101 -220 148 18
470 18 -84 38 27 62 -22 189 75 67 85 -55 55 -89 99 -102 28 57 138 -59 -80 -138 -22 -68 215 11
$$ packed form
311a03Rq8k61m33K12Q13P01l9j116m55p1N91Q75M25o48n82o61j36O4K83O84O68
333G32J91m2l92n29k29M7J37j71m41L88N36N97k24o20o67j36J94K94L54N09L36
354H64j40l46m24k4K72Lk69n52J69N27N01O3m45n91k41M66J75L60J40j28k13k74
376a07k05l86k9K16N65L62j32j28j59L33k03k54r3K02K64R6J71k55k60k00l10
397e12q2P2L80Q2p1k54J8O30j41j77K5K23k06lj8k7q4J92k84j45RK60O6o9j20
422b36j78K00L98J18l01J98p2k33K00J61j43k01j92J15q3N6L98K00n7l65k87K79
444b5J79K2k53J01m0j84K22J00l7M7k17jj03J41J42Q1n8p8J1o9P1mN3l21L68j30
470A8j02J22j1L5q4K11j14qJ8j40J10j44J88k01J30K9Q1j97k1n8J16m6K83k04
$$ plain form
494 11 -150 35 -108 -46 -40 156 -33 -2 -108 -105 -7 45 17 113 73 65 104 148 -30 15 4 -28 -86 41 54 -87 7 21
522 21 -72 83 -104 -6 -59 121 101 -148 24 -15 -65 -58 89 2 11 -7 -78 53 -6 -28 31 115 40 -95 -63 30 24 40
550 40 -72 1 122 -156 48 11 86 -57 -38 77 28 -62 41 2 45 186 -53 91 240 -212 9 160 -55
573 -55 -38 -150 100 -42 -90 -69 -96 -41 175 -21 22 147 -147 106 101 15 96 -136 -48 45 12 -37 181 132 -140 13
599 13 -46 -156 67 -13 45 -96 -39 -53 -125 87 -121 158 43 53 16 -27 -36 113 93 61 142 -29 66 -142 24 128
625 128 58 16 94 -97 -50 12 132 -30 -168 -69 113 -43 61 97 123 9 48 -32 54 -162 -166 57 -28 106 -9
650 -9 82 13 -12 -75 -50 -57 10 90 36 -66 -96 104 -132 -170 7 8 -7 -64 101 8 -99 16 -18 -186 -9 -52 -183
677 -183 1 98 -36 -134 -77 258 42 67 -39 25 86 43 31 -226 -14 -154 -19 12 -24 -69 73 8 120 53 81
$$ packed form
494A1j61J85j43O2OJ96j89L1j06LR8N2k8R6m0qL9M4j78M5j1l2n8J27J3j41R4J4
522B1r3J55j87R8n3J80k0k49J72l9n0PJ47q7Rj8p1J31n9k2N9Q4p5j35L2R3oJ6
550D0j12P3J21k78K04l7P5j43J9J15m9r0J03l9M3J41k39J44J49m52K21J51k15
573e5J7j12K50j42m8K1k7N5K16j96M3J25k94K53nq6Q1k32Q8R3l3m9K18m9k72J53
599A3n9j10K23q0N8j41N7j4p2K12k08K79j15J0l7m3rJ49k0l2Q1j71R5k08J66J04
625A28p0m2P8j91M7O2J20j62j38R9J82j56J04L6K6j14L9q0Q6k16mK23q5J34j15
650iR1o9k5o3K5pO7Q0n4j02l0K00k36l8J77Jj5n7J65r3j07J15l4j68J77m3j31
677a83J84R7j34r8N7L35k16K5j06O4O1m3j2k57K12j40J35L1l6m5J42o5J12o7K8
$$ plain form
702 81 -7 -117 -93 -73 -106 -117 -33 157 104 -22 -29 41 82 -71 -63 78 -33 -9 -7 -85 274 50 -123 81 106 -71 89
729 89 21 106 140 19 47 -35 -15 -61 83 122 -114 -81 -78 7 76 -34 10 -57 26 11 -45 60 120 -58 -55 0 -43 -56 20
758 20 -93 -35 19 -65 50 -34 33 -54 -136 47 5 102 37 -60 15 -70 13 1 90 -2 -107 -42 -69 -19 192 42 -80
785 -80 55 -16 21 -66 61 9 -52 -82 57 90 -69 111 0 -71 54 -171 19 -70 -155 -36 -103 -78 -45 154 84
810 84 -42 -199 52 79 -108 -2 -17 -29 169 6 96 10 -119 69 72 214 -88 85 -1 -45 -89 22 -93 -34
834 -34 -196 19 93 -63 41 1 110 -176 -53 37 2 -169 -53 -9 9 -109 50 -31 -29 64 81 143 -65 37 -42
859 -42 -106 22 -54 93 79 63 -59 -5 -67 -98 18 135 106 83 -69 -72 39 26 -45 93 -75 -157 -22 0 67 -122
885 -122 65 -57 -23 -64 -128 24 42 -50 4 1 -87 -61 -99 -35 -65 58 114 -1 15 66 138 -12 -96 -31 6 -69 -41 -126
$$ packed form
702H1q8j10K4K0l3j1Q4J90n3j26pP0M1j53QJ41j11K4Kp8L59k24j73K04K5j77J60
729H9o8Q5L4j21K8q2K0m6J44L9k36L3LQ5O9j10M4o7Q3j5n6J05O0j78LN5m3j3P6
758B0j13N8N4q4J15q4O7q7q2J83m2R7o5r7P5q5Q3j2Q9r2j05O5k7N0K11j50j22
785h0J35p1L7q7J27n2o1l0J39L3j59J80j11p1J25k25J90q9q5J19o7K5L3J99p0
810H4j26j57K51K7j87J06j5j2J98j63R0q6j29J88LJ42l02J73q6m4m4J11j15N9
834c4j62K15P4j56J04m0J09k86J23R0l5j71J16M4J8j18J59q1KR3J7O2k08J02p9
859d2o4J28p6J47j4j6j22N4o2l1J16J17k9k3j52lJ11j3p1J38j68q2J35K2O7j89
885a22J87j22L4m1o4J52J8r2N4lq8K6l8O4l0J23N6j15J6N1P2j50q4O5L7p5K8q5
$$ plain form
913 -126 -108 -11 -5 -27 72 67 -97 -40 97 -11 37 34 193 57 14 60 -177 83 34 32 -34 -28 145 7 89 -18 67 166
941 166 -20 62 23 36 65 43 95 -69 107 -126 56 107 74 26 -54 -76 -106 -181 13 -95 64 -1 -58 50 52 91
967 91 -60 -130 258 -35 45 -48 -108 -52 89 -140 -7 -8 -8 -43 -67 19 195 144 -137 -31 -87 61 -3 -57 21 163
993 163 130 -35 17 77 25 192 24 91 -31 17 -10 141 98 -25 -99 -55 -66 78 -7 15 90 -135 -26 -77 -109 3
1019 3 -89 -192 5 -33 -90 -44 -93 4 -69 97 98 -3 -87 -101 9 24 1 101 75 119 112 -82 -66 80 55 45 -152
1046 -152 -23 -73 144 -30 108 59 17 7 -45 39 97 -109 -138 10 -206 170 -45 31 -130 -134 -33 -95 38 -92
1070 -92 25 47 96 -34 63 -4 -27 68 -18 -110 -27 -85 107 25 -94 47 -134 20 -48 -40 -30 -52 -105 -146 -19 11 -216
1097 -216 -66 116 -141 92 -78 -166 109 14 -81 -85 1 -83 91 -46 134 6 -39 -31 -55 -87 68 132 -81 32
$$ packed form
913a26J8R7Ok2R9nj64N7J37j08M8lJ59j36m3M6k37K60m9ko6OJ73j38Q2j07Q5R9
941A66j86Q2l9J3K9k2N2j64J76k33J82N1l3m8q0k2l0p5J94j08J59o5n7J08KL9
967I1j51p0L88k93Q0r3o0N6J41k29J33j%l5k4Q6J76n1k81J06n6J48o4n4P8J42
993A63l3j65N2O0n2J67j68O7j22M8k7J51m3j23p4M4j1J44q5K2P5k25J09n1l2J12
1019Cr2j03J97l8n7M6m9R7p3J66Jj01q4j4J10J5k3J00k6M4pj94J6J46k5j0j97
1046a52J29n0K17j74J38m9m2j0n2Q4N8k06k9J48k16L76k15P6j61mJ01o2J33j30
1070i2J17K2M9j30R7o7k3R5q6r2Q3n8J92q2j19J41j81J54o8QJ0k2n3m1J27L0k27
1097b16J50J82k57K33j70q8K75r5r5mQ6q4J74j37J80j28m5Qk4l2J55O4k13J13
$$ plain form
1121 32 18 32 122 -61 -111 59 41 -123 -173 59 -16 67 14 -36 186 -47 -30 113 100 65 49 -46 73 -223 16
1146 16 4 -26 -92 -80 -136 11 -60 -14 -67 -55 59 3 -75 25 87 3 -160 105 135 106 -29 214 -56 0 -162 -40
1172 -40 -126 -7 -14 6 115 96 64 -72 89 -112 -65 97 -17 -40 -1 -116 19 59 75 16 -204 -81 -51 160 7
1197 7 -77 8 31 -126 43 61 103 116 45 -146 3 171 10 39 -58 -146 -3 -14 53 -24 -134 59 92 -1 -49 -141
1223 -141 -18 32 -119 23 -19 123 194 112 64 -63 -20 102 32 25 207 -89 -95 46 51 53 102 111 -9 -71 35 93 69
1250 69 -136 6 -39 -103 -165 -39 -104 -125 -52 33 42 -58 -62 -95 -84 -137 141 -3 -76 -12 -148 54 1 -76 18 165 43
1277 43 127 -70 -152 -29 -77 -23 -53 -43 -218 -124 94 61 19 -136 122 55 -30 81 -152 82 -241 -6 54 -67
1301 -67 9 7 -196 -8 163 -119 -6 -105 47 -123 -160 -77 68 49 -118 44 70 17 56 45 -67 -12 -99 100 -138
$$ packed form
1121C2j4J4R0j83n0J70j8j64n0K32p5Q3n3n0K22k33J7J43j3l5j6r5J19k96K39
1146A6j2l0o6J2n6J47p1M6n3J2J14n6p8J00O2q4j63K65L0k9j35K43k70N6j62J22
1172d0q6J19pK0J09j9l2j36J61k01M7J62j14k3L9j15J35M0J6n9k20J23L0K11j53
1197Gq4Q5K3j57J69J8M2J3p1j91J49J68j61K9r7q8J43j1O7p7j10J93L3r3m8r2
1223a41J23N0j51J42m2J42P1q2m8j27M3J22p0pJ82k96oJ41NKM9Rj20o2J06N8k4
1250F9k05J42m5o4o2J26o5k1P3Q5Rj00ml3J1n3K78j44p3O4j36K02n3p7R4J47j22
1277D3Q4j97q2J23m8N4l0J0j75R4K18l3m2j55K58o7q5J11k33K34l23K35O0j21
1301f7P6kk03J88J71k82J13r9J52j70l7Q3J45j9j67J62K6n3L9j1j12N5q7J99k38
$$ plain form
1326 -138 -123 110 137 -33 83 -43 124 -26 -129 116 -171 34 -118 -62 51 19 -82 -85 23 156 94 109 -275
1349 -275 -137 -24 -66 -41 23 40 -137 81 -4 77 46 13 -1 77 29 40 -37 -120 138 -77 -28 -37 45 41 137 83 -42
1376 -42 74 67 -51 90 -43 59 -2 -148 -29 -52 69 61 -14 66 -70 26 -8 59 14 -28 84 86 46 -88 90 -37
1402 -37 -50 58 -43 99 -135 -14 27 -32 -27 -33 -13 -89 -31 -42 14 -114 78 33 34 -10 -205 -5 102 -10 -9 -30 -200
1429 -200 -59 73 -37 31 73 230 14 -17 96 11 94 40 96 -129 -128 -26 23 -67 5 110 -118 181 95 13 -169
1454 -169 45 -148 60 -172 26 166 137 27 3 132 -43 -26 135 9 67 -72 27 -22 -72 182 -96 23
1476 23 100 -199 -38 -27 71 -8 -34 21 -55 100 55 -7 -78 -71 -89 69 15 2 53 -95 -54 -86 99 137 -16 123 -48
1503 -48 80 72 85 -14 98 -23 139 65 49 80 -56 6 27 11 -8 -87 -189 -7 26 146 -90 -82 61 -102 157
$$ packed form
1326a38J5K33K7j70J16j26J67j50j03K45k87K05j52N6J13l2j01lJ08J33o2J5l84
1349b75J38J13m2K5O4J7j77K18q5Q1l1l3j4P8m8J1p7q3K58k15M9rQ2mR6n4j25
1376d2J16pj18J41j33J02o1j46J19k3J21qp5Q0j36R6l4O7m5m2J12Km0j34J78j27
1402c7j3J08j01J42k34J21M1n9NoK0p6N8j1N6j28J92m5Jm4j95K00J07j12Jk1j70
1429b00J41J32j10O8M2J57k16l1J13q5Q3n4N6k25JJ02M9r0P2J05k28K99q6q2j82
1454a69K14j93K08k32J98J40k9j10k4J29j75J7J61j26N8j39R9m9n0K54k78J19
1476B3P7k99J61J1R8p9k6N5p6J55m5o2p1Pj8J58n4j3N1j48M1l2J85L8j53J39j71
1503d8J28qJ3r9J12j21J62p4j6L1j36O2K1j6j9p9j02J82L3J20k36QJ43j63K59
$$ plain form
1528 157 219 -47 -12 37 -33 253 -106 197 -82 -142 0 39 150 -171 75 24 -18 -9 42 21 -12 -152 -133 79 40
1553 40 -126 99 -14 103 35 1 25 -29 58 15 131 -11 -182 16 47 77 136 -15 -34 -70 -35 14 -63 32 -63 34
1579 34 3 -156 -47 38 95 58 132 62 -31 66 1 23 10 -113 -114 -27 10 -1 92 61 -115 -60 27 -13 28 -78 67 -124
1607 -124 35 -9 -19 -68 71 64 24 185 51 156 29 15 -12 72 13 -19 133 8 -76 -25 -58 47 32 56 -11 -101
1633 -101 -88 -69 -52 137 -92 67 -13 65 -133 -26 -97 -51 -29 -46 54 -96 -23 -63 128 -147 124 2 -13 30
1657 30 -176 -128 -5 -57 17 46 -26 -2 67 63 -26 25 -5 -2 -76 -60 -104 10 72 -134 62 64 83 23 -61 -133 -31 115
1685 115 -137 -31 50 193 92 -86 -1 279 0 -4 17 65 105 85 -55 84 62 35 -103 151 -48 103 -17
1708 -17 -97 183 -10 -32 -108 34 -79 -55 47 -117 -32 -31 26 119 -133 -83 113 -87 190 -53 79 45 27 54 71
$$ packed form
1528A57O2k66L5M9p0K86l59L03k79o0J42L9J11l21K46n1m2RN1k1l3j40J9K12l9
1553D0j66K25j13J17o8l4K4n4Q7m3J16j42j71J98L1L0N9j51j9l6L5M9p7R5r5R7
1579C4l1j59J09Q5N7l7P4p0r3R7o5K2j3j23jQ7L7j1R3l1j76N5Q7m0M1j06J45j91
1607a24J59m4j0m9J39pm0J61j34J05j27j4k7Q4n9l2J52j25q4N1l3J05j5K4o7r0
1633a01J3J9J7J89k29J59q0P8j98J07p1M6K2j7J00j50P3m0J91k75K71j22j5M3
1657C0k06M8J23n2P4K9p2K4O9mq9N1l0Lp4J6m4J14O2k06J96KJ9o0q4p2J02J46
1685A15k52J06Q1J43j01j78Q5K80k79mK1M8M0k0j40J39k2k7j38K54j99J51j20
1708a7q0K80j93k2p6J42j13K4J02j64Q5JN7R3k52N0J96k00K77k43J32l4j8K7J7
$$ plain form
1733 71 95 -45 71 53 98 -138 -72 -40 46 97 123 98 -62 12 61 -109 37 -5 61 -79 -36 15 81 39 27 43 7
1760 7 179 -2 8 78 -5 8 -44 160 -16 160 -19 -96 -39 23 15 -56 37 -72 66 -40 102 36 -65 36 48
1785 48 -124 -79 6 -47 104 96 -121 -160 -8 -35 -4 30 -152 -51 41 -180 46 -98 7 48 4 -161 82 -102
1809 -102 -153 25 -55 -78 -144 -81 -136 -59 151 -54 -106 -27 -69 -35 -17 -99 -104 163 -71 131 -94 82 -10 -35 92 -92
1835 -92 -141 -41 -7 -105 63 -73 87 3 30 55 109 83 -73 -39 -169 -17 -33 -84 -226 -46 31 34 -75 72 -37
1860 -37 195 41 -74 5 -66 4 -63 -162 107 60 -166 125 -64 45 37 -40 -17 129 -147 -7 55 77 -27 25 -165
1885 -165 -37 -57 61 47 -92 37 -89 -8 -19 -130 69 -42 -44 -64 7 32 -156 -70 -54 97 70 -205 82 -144
1909 -144 -19 72 -67 115 113 114 -44 262 -88 103 19 -46 24 -15 -69 -107 78 44 -56 99 -40 9 -102 -91 -16
$$ packed form
1733G1K4j40J16j8M5k36O6L2Q6N1K6k5j60P4M9j70J46m2O6j40M3N1O6m2j2J6l6
1760GJ72j81J0P0q3J3n2K04j76J76j79p7N7O2qp1R3j09J38j06J42o6j01J01J2
1785D8j72M5Q5n3J51qk17l9J52k7L1L4j82J01R2k21K26j44J05M1m4j65K43j84
1809a02n1J78q0k3o6O3n5P7K10k05n2P9m2L4J8q2nK67k34K02k25J76r2k5J27j84
1835i2m9J00L4r8J68j36J60q4K7K5N4k6j56L4j30J52j6n1j42J80P7Lj09J47j09
1860c7K32j54j15P9p1P0o7r9K69m7k26K91j89J09qp7K3J46k76J40O2K2j04N2j90
1885a65J28k0J18j4j39J29j26Q1j1j11J99j11kk0P1K5j88Q6J6J51k7k75K87k26
1909a44J25R1j39J82kJj58L06l50J91q4o5P0l9n4l8J85l4j00J55j39M9j11J1P5
$$ plain form
1934 -16 -30 69 -91 -88 119 -93 -76 -173 -93 33 0 -24 -55 -24 106 -43 8 113 24 1 -88 -158 93 34 -62 30 -84
1961 -84 -105 -2 -22 -132 58 -108 101 35 42 25 8 173 56 23 -151 -26 8 -12 -20 98 17 60 -51 -7 -137
1986 -137 -102 93 26 -22 138 -133 87 -54 -95 47 86 -61 7 -51 -36 83 -36 48 62 63 -103 -16 -240 -2
2010 -2 99 -119 -30 -70 76 -83 -52 78 43 -108 -29 70 103 -115 126 1 49 13 -145 31 -171 -68 -66 49
2034 49 5 -30 45 -4 148 -66 -83 -76 -167 -31 -22 -71 -62 -62 -35 222 -47 128 4 -8 29 -14 -24 -35 77 160 44 54
2062 54 -76 15 124 -269 -25 -108 -41 -1 -22 132 156 228 65 117 137 -132 76 6 85 157 89 -31 -40 11 88 -48
2088 -48 -63 -47 -128 -12 -62 -147 65 -23 -47 63 105 93 46 -106 26 152 -31 29 -29 69 26 -85 -10 -23 -193 12
2114 12 -211 -66 22 49 98 117 64 -27 -72 33 -66 -149 108 32 17 -87 123 -71 -82 146 115 160 193 -151 -55 15
$$ packed form
1934a6j4R9j60LK07k12J7r7Q0J26l3k4l1L1J30j49N1J05q9k3q9p0K51n9r6R2j14
1961h4k1J03k0j10J90j66K09o6Pj7j7J65j17l3j74J25L4k0qJ18q1M3j11M4j30
1986a37L5J95o7m8J60k71K20j41m1J42L9j47O8n8J5J19j19Q4J4Jj66Q7k24K38
2010bJ01k18Q9m0J46j59L1J30l5j51P9R9L3k18K41j25M8l6j58J76k02J03KJ15
2034D9m4l5P5m9J52k14j7Pr1J36Rm9R%K7K57k69J75j24j2L7m3j0j1J12Q3j16J0
2062E4j30R1J09l93K44q3O7M0k1J54K4P2j63N2K0k69K08p0P9P2o8j20rN1P7j36
2088d8j5J6q1J16n0q5K12q8k4J10M2j2m7j52J32J26j83O0n8R8m3j11P5j3j70K05
2114A2k23J45Q8K7M9J9n3r1m5J05r9q3K57p6j5j04K10j94j1K28l1M5L3l44R6P0
$$ plain form
2140 15 -20 125 156 159 11 -95 76 -48 -13 21 -117 -24 -86 38 -18 102 -74 -6 -43 82 17 -107 -29 -103 -43
2165 -43 -98 -59 -46 34 21 -81 137 -74 95 11 40 70 11 109 -119 68 211 17 -12 -121 -123 -110 24 5 -15 5
2191 5 -22 60 -107 -31 139 -107 30 50 -13 24 57 -15 -28 -54 -8 -59 -19 111 9 37 -69 -60 -103 32 23 166 -105
2218 -105 -80 176 -36 -84 103 51 183 33 62 -67 50 46 -101 -30 -45 118 74 103 159 185 16 75 -21 -10 -86
2243 -86 -35 -55 58 4 175 75 -94 -4 54 -8 -25 -19 143 80 68 -53 88 -63 -79 -9 -95 -48 20 -95 -62 -34
2269 -34 -104 59 -4 45 17 13 92 -78 -103 40 -57 -105 -6 106 87 55 -111 -41 -102 -51 -71 73 -90 63 -20 104
2295 104 -116 -37 25 -4 -56 -13 164 -67 -47 -19 13 -27 -42 111 -80 -10 -27 -120 64 107 11 -73 16 16 100 -57 91
2322 91 -16 29 -27 32 44 24 -21 49 -21 34 -15 16 -20 6 -138 80 38 -57 23 21 -64 -77 -40 80 -48 -22 -74 -78 10
$$ packed form
2140A5l5J45L1Lj48j06J71j24L5L4j38R3o2J24n6J20j76O8l7J25o5j24P8p4O0
2165d3n5L9J3Q0j3j02K18k11J69q4K9L0n9R8k28J87J43j94k9j09kJ3J34j9k0K0
2191Ek7Q2j67P6J70k46J37K0o3L7L3p2j3k6M6n1M0J30j02K8j06Rm3J35rJ43k71
2218a05K5K56k12m8J87n2J32j50K9j29J17mj47P1j5J63m4K9N6K6j69N9r6J1p6
2243h6N1k0J13n4J71j00j69R0N8o2j7OJ62o3j2j21J41j51j6P0q6M7O8j15L3K8
2269c4p0J63o3M9k8mP9j70k5J43r7m8R9J12j9l2j66P0o1N1k0J44j63J53q3J24
2295A04k20P9O2k9n2M3J77k31K0K8L2m0j5J53j91P0j7r3J84M3r6q4Q9%Q4j57J48
2322I1j07M5n6N9J2k0m5P0p0N5m9L1l6K6j44K18m2r5Q0kq5j3L7J20j28K6n2mQ8
$$ plain form
2351 10 -57 12 50 147 82 -102 237 21 -4 109 75 56 -103 -140 87 -132 67 -2 99 69 77 13 -114 -6 -31
2376 -31 121 62 76 127 -183 82 -60 -187 204 53 -2 -13 -17 19 35 71 -80 -106 -40 -138 194 39 -42 -100 -45 29
2402 29 36 14 -50 11 61 -55 80 45 -254 21 -122 -157 -52 -11 9 -13 14 -245 112 142 17 17 -37 4 77 -56
2428 -56 31 45 -62 69 35 -158 -138 -23 -39 93 43 8 -142 -21 191 -136 17 13 51 102 -70 93 -41 49
2452 49 278 -129 -26 -151 -191 4 -92 100 100 -128 128 -197 -76 99 58 -13 66 -70 -226 201 66 -102 0
2475 0 145 -20 63 -89 136 54 -133 121 145 27 -68 -42 34 -26 41 -42 91 56 10 -41 -17 51 -38 181 -75 -24
2501 -24 4 -66 -116 28 -28 -161 -40 -88 52 -61 -99 134 -1 148 -106 84 107 -23 -29 -182 -113 86 -48 -29
2525 -29 35 -94 -3 -40 -4 83 -22 95 -113 -108 -89 20 -113 -38 135 29 113 -202 -72 -40 189 -125 -23 -148
$$ packed form
2351A0o7O9L8R7o5j84L39k16k5J13l4j9j59l7K27k19J99o9J01l0Qo4j27J08k5
2376c1J52n9J4N1l10K65j42j27L91j51n5j1mL6J6L6j51k6O6r8L32j55q1n8N5P4
2402B9Pk2o4O1N0j16J35l5k99K75j43l5J05M1K0k2K7k59L57L0j25%n4M1P3j33
2428e6Q7J4j07J31l4j93K0J15j6J32n0l5j50J21K12l27J53mL8N1j72J63j34R0
2452D9K29m07J03j25m0J95r6J92%k28K56l25J21J75m1p1P9j36j56M27j35j68J02
2475@J45j65Q3j52K25q2j87K54K4j18r5K6P6o0O7q3J33l5m6n1K4O8q9K19k56N1
2501b4K8p0n0J44n6j33J21m8J40j13l8K33j35J49k54J90K3j30oj53O9J99j34J9
2525b9O4j29R1l7L6Q7j05J17k08NJ9J09j33P5J73j06Q4l15J30L2K29l14J02j25
$$ plain form
2549 -148 -49 199 -108 -137 97 91 -156 28 63 15 128 -208 33 -99 -75 -11 -140 59 223 31 -8 116 129
2572 129 -126 -42 -122 -98 1 34 46 23 12 -174 -132 -14 -23 -26 -79 29 -70 23 4 124 52 8 14 17 82 55 -149 6
2600 6 131 50 -58 -3 -47 -95 32 27 -55 -162 -63 -36 28 -132 -26 133 -58 113 -76 -45 144 -39 -35 23 90 -93
2626 -93 -20 -31 207 -99 1 23 97 273 25 12 217 45 15 211 -95 -144 -92 -108 34 -58 46 -52 157 -26
2650 -26 47 8 -103 10 -55 225 207 -42 -44 109 120 110 -115 78 44 -6 5 -75 109 -44 69 67 73 113 24 17 -73
2677 -73 35 202 -83 189 -17 -119 33 41 10 117 42 -87 -7 29 69 142 82 39 2 32 207 7 171 -5
2701 -5 83 6 -43 -156 6 -44 53 -138 46 184 -34 -175 -11 -49 48 20 -20 -31 58 12 162 -62 62 166 20
2726 20 48 -8 -24 -4 34 -31 -89 -156 -106 -131 -105 3 52 -42 79 -56 4 43 141 -59 94 68 21 -57 227 5 70
$$ packed form
2549a48R9K48l07k9K34ok47J84L5m8J13l36K41j32K4O4j29J99J64j92l9J24J3
2572A29k55Q4q0K4R9L3J2k3j1j86M2J18rln3J08r9R3j9J20p2m4OLO5k7k04J55
2600FJ25q1j08N5m4m8J27nq2j07R9K7O4j60J06J59j91J71j89L1J89j83MN8O7j83
2626i3P3j1K38l06J00K2P4J76k48j3K05j72l0J96l06m9N2j6J42r2J04r8K09j83
2650b6P3l9j11J13o5K80j8k49kJ53J1j0k25J93l4n0J1q0J84j53J13kOM0q9pr0
2677g3J08J67k85K72k06j02J52Ql1J07p5j29Q0L6M0P3o0m3l7L0J75k00J64j76
2701eQ8p7m9j13J62n0R7j91J84J38k18j41J64l8R7k8m0j1Q9m6J50k24J24J04j46
2726B0K8n6j6K0L8o5n8o7N0k5K6J08M9r4J21j35O0L9R8k00J53k6m7p8K84k22O5
$$ plain form
2753 70 -112 -162 19 -68 -33 142 163 -60 -105 -122 39 -33 193 20 151 149 -59 160 -14 34 111 -158 6 -29
2777 -29 -42 -12 164 -125 -42 -90 -68 33 16 83 -58 -4 87 -94 -76 -18 0 -63 -23 58 -43 86 29 88 39 9 -56
2804 -56 -4 -28 81 33 38 105 -95 14 26 21 47 -10 146 -3 31 -61 74 -31 -43 -22 -28 110 223 71 -4 -100 29
2831 29 -72 13 35 29 -65 -3 -67 60 112 -110 68 89 -10 67 -17 100 -11 -45 -29 -106 -19 -89 88 160 -33 -53 -33
2858 -33 -120 97 72 6 63 13 10 34 -13 -67 -45 -27 22 -29 145 -75 26 -35 52 -35 -107 40 70 -59 -44 35 -56 33
2886 33 41 -43 43 95 20 99 -21 -138 136 9 165 -92 90 24 74 -149 82 34 -78 -66 -49 241 -23 -57 -3
2911 -3 -23 -78 -41 -83 20 7 -184 178 148 -7 34 -11 182 65 125 15 -162 46 -29 8 62 58 218 13 70 -12
2937 -12 89 -61 39 110 -19 -111 144 11 234 -193 -165 -42 98 30 83 -59 -102 -34 33 96 -106 60 -100
$$ packed form
2753G0j82n0J81q7L5J75K1k23m5j7J61p2K26j73J31kk08K19j74M8P7k69J64l5
2777b9j3L0J76k89Q3m8K2J01j7O7j41N4R1j81J8N8J8o3M0Q1j01J29n7N9m9l0o5
2804e6N2k4J09m8NO7k00J09J2nK6n7J56j49L4r2J35j05j2K1oJ38J13j52p5r6J29
2831B9j01Q5K2or4O2o4J27N2k22J78K1r9P7q4J17j11l4J6p7Q7p0J77P2j93k0K0
2858c3q7K17k5o6N7n0lK4m7n4K2J8M9n1J74k20J01o1Q7q7p2J47L0j29J5P9r1Q9
2886C3Qq4Q6N2p5P9j20j17K74j27J56k57J82o6N0k23K31m8j12J2J7K90k64l4N4
2911ck0n5L7m2J03j3j91L62l0j55M1m5J93j17O0j10j77K08p5L7N4mJ60k05N7q2
2937a2J01j50J00P1j29r2K55j33K23m27K8J23J40o8N3j42m3O8O7O3k02J66j60
$$ plain form
2960 -100 -5 -182 5 17 114 76 -60 66 -28 52 35 121 1 -101 -39 -103 195 98 27 31 71 77 83 -176 123 97 -75
2987 -75 -52 -195 154 38 -24 -135 -90 -4 -36 -38 -148 84 67 -3 -16 92 -1 -15 -50 -58 30 60 85 -6 94 104 6
3014 6 140 -13 -69 -7 -140 -69 43 -4 -6 36 65 -87 0 -37 -84 -20 -132 3 -3 -192 -1 25 -66 43 -96 49
3040 49 53 72 -210 4 57 -72 -58 -41 42 11 3 152 -66 -18 51 9 200 -18 -26 46 27 -137 -99 14 4 -174 -212
3067 -212 -122 146 -50 9 -34 97 87 42 -42 63 131 40 -29 -1 -46 124 -21 -81 -37 54 116 -46 157 73 78 -13
3093 -13 69 -192 -41 81 -34 -9 -61 22 182 79 -49 -97 -65 -134 -43 -127 21 -127 -79 4 35 130 12 -37 -62
3118 -62 -127 118 -86 -37 19 101 126 -59 152 77 22 -8 -73 -34 -89 81 -39 133 -12 -39 26 -45 28 18 -30 43
3144 43 1 119 46 -47 90 -53 -29 26 155 0 -69 -130 -157 91 -57 1 -50 -60 -78 -70 109 108 126 64 105 33 20
$$ packed form
2960a00R5j77J87J2R7l8j36J26r4Q0j7Q6j20j02O2o4K98r7p1MM0OOk59K99k6j72
2987g5K3j43L49j16o2j11M5Q6l2kj10K32j7p0j3J08r3j4l5qQ8L0K5r1J00J0r8
3014FJ34j53n6O2j33P1J12m7kM2K9j52Q7l7m7O4j12J35oj89J91K6r1J09j39J45
3040D9MJ9k82K14N3j29J4J7Q3l1qJ49k18M8O9m2J91k18qP2j9j64L8J13j0j78l8
3067b12R0K68j96N9m3J31j0m5q4J05O8r1o9K8m5J70j45o0M4R1O2j62K03q4Nr1
3093a3Q2k61J51J22j15K5n2Q3J60j03j28m8L2o9R1q4J48j48M8Q3L1R5j18m9k5
3118f2o5K45k04M9N6Q2K5j85K11p5n5l0o5L9n5J70j20J72j45k7O5p1P3j0m8P3
3144D3m2J18p3r3J37j43K4N5J29j55o9o1k7K48j48N8n1j0j8QJ79jJ8o2M1p2j3
$$ plain form
3171 20 -166 83 -37 140 77 146 -225 170 -88 -85 5 55 30 -23 42 -48 -71 181 -107 11 -41 -67 49 66 -17
3196 -17 40 -41 -91 143 -185 37 114 37 -66 -48 127 106 30 -80 4 -64 -47 -76 -93 2 -65 77 -65 50 -27 -54
3222 -54 54 48 27 -115 -44 -24 6 -131 -163 -23 -29 68 0 -43 -32 -47 -8 3 30 -49 -71 -71 17 -16 84 54 -22 -38 63
3251 63 57 -58 14 -4 -126 -29 87 66 -10 -98 7 54 -37 -99 -15 -11 23 -116 54 60 74 -73 168 254 142 -13 -5
3278 -5 11 105 20 16 35 24 90 23 124 -16 32 48 -77 76 135 -143 10 31 -70 -97 24 74 -116 -92 100 -7
3304 -7 99 38 -25 131 139 -62 -88 -64 79 -47 99 -70 -42 89 -200 66 41 -46 -85 -99 -99 -62 38 -115 40
3329 40 -147 82 -128 27 -99 -100 19 -113 -95 -41 52 -34 92 -87 -21 -31 195 -176 17 67 14 -71 108 37
3353 37 47 97 138 -37 17 35 179 116 22 -63 19 -80 -65 -114 -65 103 158 1 -125 -71 -126 0 7 45 -76 -43 279
$$ packed form
3171B0j86K49j20J77o3O9l71L95k58LR0N0k5n3O5r0k3K52k88J18n2k6J16J7q3
3196a7N7q1n0K34l28K22P7p7j03J8J75k1p6j10Q4o8J7k9j7R5o7J42j42J15p7k7
3222e4J08ok1j42P1K0L0j37l2J40oR7o8m3J1j5L9J1K7p9k2%Q8l3J00l0p6j6J01
3251F3oj15P2j8j22R7J16k1p6q8J05M7r1o2Q4ML4j39J70OJ4j47K41Q6j12j55Q
3278eJ6R4q5mJ9j1O6o7J01j40M8J6j25J53N9k78J53K1j01k7J21N0j90K4J92j07
3304gJ06o1o3J56Qk01k6K4J43j26J46j69K8J31k89K66k5q7l9j4%L7J00j53J55
3329D0j87K29k10J55j26jJ19j32J8N4R3q6J26j79O6j0K26l71J93N0n3q5J79p1
3353C7J0N0M1j75N4J8J44o3r4q5Q2r9J5m9M9J68N5j57j26N4n5J26PL8j21L3L22
$$ plain form
3380 279 -206 -24 128 -70 -10 -16 -1 21 -100 47 -28 -123 39 36 136 -39 -138 181 -78 219 -35 -36 -124 -86 46
3405 46 -206 101 83 -78 9 23 -56 71 82 -18 -35 79 -12 -59 138 -82 -112 25 78 -14 103 -46 98 -57
3429 -57 75 2 -141 -197 -119 77 -82 -2 -161 -62 33 54 135 63 110 113 -103 75 -47 7 9 -75 -20 141 -7 -121
3455 -121 44 44 1 67 -155 26 104 -86 -48 -21 -11 -8 -144 63 -12 101 -39 150 -15 1 5 97 20 -13 46 49 114
3482 114 123 101 50 -2 68 30 11 -30 -100 127 -129 31 -55 -132 -31 94 80 148 -170 5 38 -74 -32 -81 17 57
3508 57 -81 -103 80 102 -56 -63 152 -145 93 -5 -81 -220 2 -30 -17 19 -57 10 -71 -11 92 -22 33 -118 8
3533 8 -7 -109 91 92 68 -25 -14 -133 -212 -41 182 -27 -26 -31 -30 -126 3 -96 -47 93 146 -164 118 -34 109 -44
3559 -44 -55 32 -76 122 -38 51 -16 22 122 -6 87 -76 -61 -145 -51 -21 -89 24 -16 57 87 3 152 44 -74
$$ packed form
3380B79m85J82J52j98O0oJ5K2j21J47p5r5J62lJ00j75r9L19k59K97k54jq8L8J32
3405D6k52L07j8j61Q7J4p9J27J1j00j7J14r1m7J97k20l0J37N3r2J17j49J44j55
3429e7J32p3j43n6P8J96j59Q0j59R9R5K1Q1p2M7Lk16J78j22N4Kq4N5J61j48j14
3455a21J65%m3O6k22J81P8j90L8K7J0Lj36K07p5J13j40J89j65J6MR2p7l3N9LO5
3482A14Rk2n1n2P0l8j9m1p0K27k56J60q6p7J01J25j4O8l18J75L3j12M2m9R8M0
3508E7j38k2J83K2j58pK15k97K38r8p6j39K22l2J3L6p6O7q1O0J03j14N5j51J26
3533Hj5j02K00Jk4r3J1j19p9J71K23k09JnJr6J29r9M9J40N3l10K82j52J43j53
3559d4j1Q7j08J98j60Q9o7L8J00j28R3j63J5q4R4L0o8J13m0P3L0q4J49j08j18
$$ plain form
3584 -74 87 -29 -130 -77 -20 45 41 29 -93 -6 37 -43 -25 -19 -59 -101 105 84 -73 -71 -5 45 42 -72 -166 -155 -27 -32 -15
3613 -15 -243 -12 160 99 -94 -18 30 27 111 -83 -95 48 0 -38 24 40 -105 -34 -28 -47 48 -49 -65 -52 -8 100 -66
3640 -66 47 11 30 -38 165 -63 196 -87 -1 -19 -74 56 -72 72 -26 80 119 20 -37 136 -48 -87 59 45
3664 45 30 101 -105 147 -9 -24 24 139 31 -15 104 276 150 -117 107 -64 68 -75 -26 13 -128 119 -19
3687 -19 111 41 92 15 99 117 -23 9 -45 152 110 32 16 61 -9 -15 -153 1 7 47 10 -24 4 123 -58 51 -49
3714 -49 86 -127 124 13 -61 106 2 55 12 -10 -2 -52 48 86 -23 67 117 69 -51 132 7 11 -13 98 -116
3739 -116 2 61 15 -19 -134 -30 5 24 58 10 -168 -96 57 56 -52 -104 -22 -175 -175 179 -31 -18 -134 103 100 -113
3765 -113 74 62 77 -15 -11 -46 -34 -167 -3 -10 138 -22 126 -19 -1 -64 -2 -70 -20 5 -149 37 125 -98 -95 159
$$ packed form
3584g4J61j16j01N3N7O5mj2j22Q7M3q0J8Om0m2K06k1j57KO6N0lj14r4J1J28nJ7
3613a5k28K31J72o1j93P6M8lQ4j94j2J43m8l8O2J6j45P1Oj9R5r7j6J3M4J08j66
3640f6J13l6J9o8K03k28K59k83Q6j8n5J30j28J44r8J06L9r9n7J73j84l9J46j4
3664D5j5P1k06K52j56j5M8J15j08m6J19J72j26k67K24j71J32j43M9L9j41K47j38
3687a9J30p0N1p7Q4J8j40L2n4J97m2p8j6M5p0oj38J54OM0l7l4K8J19j81J09j00
3714d9J35k13K51j11p4J67j04N3m3k2Qn0J00L8j09R0N0m8j20J83j25Mk4J11k14
3739a16J18N9m6l4j15J04L5J9L4m8j78P2J53jj08n2Q2j53%L54k10J3j16K37lk13
3765a13J87j2J5r2Ml5J2j33J64pJ48j60J48j45J8o3O2o8N0K5j54J86Q8k23LK54
$$ plain form
3791 159 2 3 103 -127 72 61 113 -121 18 -121 81 -138 206 69 -68 -67 -11 7 -116 -94 6 13 -68 19
3815 19 -18 86 -84 -40 20 51 126 -29 85 -2 18 190 39 -89 -63 172 -61 48 48 -72 32 116 102 4 104
3840 104 -34 7 -126 48 29 81 110 24 176 -20 132 49 178 -1 -16 -31 12 38 27 -73 -20 16 -72 32 23
3865 23 49 -84 33 -96 -72 57 -166 61 -79 173 -37 -164 -105 -36 -111 119 61 -47 -127 23 105 102 58 -84
3889 -84 -37 80 -35 106 -20 -16 86 -10 55 63 164 70 -65 38 -109 -20 73 69 36 -124 -48 24 -57 -62 20 49 -157
3916 -157 86 53 -10 62 36 -43 -52 79 66 68 47 -10 -24 -16 32 -96 67 14 41 -18 114 95 131 54 116 132 27 12
3944 12 156 -50 -7 99 118 -22 -35 72 -131 -73 -45 -35 5 154 140 56 -22 149 -5 43 51 120 -14 87 -47
3969 -47 -134 60 -53 61 -158 -21 38 144 128 -184 13 -1 -1 103 -5 -1 220 -123 33 93 41 19 55 138 54
$$ packed form
3791A59j57JJ00k30J99j1N2k34J39j39K02k19L44j37j37JN6J8j23K2J00Pq1Q7
3815A9l7J04j70M4O0L1P5j55J14q7K0J72j51j28K6K35k33J09%j20J04Q4j4r8J00
3840A04j38M1j33J74j9N2K9q6J52j96J52q3J29j79j5j5M3K6j1j00N3L6q8J04r
3865B3K6j33J17j29K4J29k23K27j40K52k10j27N9O9p5K30n8j08q0J50Q2lm4j42
3889h4M7J17j15J41j26MJ02r6O5QJ01r4j35J03j47Q9R3ml3j60P6P2q1nQ2K9k06
3916a57K43l3o3P2k6p9rJ31j3Kk1n7j4QM8j28J63n3K7n9J32j9L6p7O2J6j05j5
3944A2J44k06M3J06J9j40j3J07k03N8K8J0M0J49j4q4p8J71j54M8QO9j34J01j34
3969d7q7J94j13J14k19J37N9J06j6l12J97j4%J04j08MK21l43J56O0n2k2L6Q3q4
$$ plain form
3994 54 38 -81 -29 -3 52 -81 78 64 29 -100 94 -64 -8 -2 17 -82 59 -110 -61 16 3 104 -21 179 -43
4019 -43 9 169 -30 -90 0 18 -30 103 102 9 -55 7 40 97 -94 -136 -15 60 -2 79 4 -148 -79 -1 -11 -107 111
4046 111 43 15 -18 54 -70 -21 175 97 21 -116 71 -107 88 -8 -24 -114 -15 84 71 -26 63 66 25 -172 173 21
4072 21 -65 71 16 -100 11 138 -59 -64 98 -69 68 -112 45 -57 -104 43 -99 -48 85 37 80 -8 -75 -93
4096 -93 28 83 64 98 112 -77 -16 -28 -97 32 -69 31 -54 60 -127 27 33 -125 100 165 -30 -94 4 29 38 95
4122 95 20 55 -162 2 -33 3 -45 -89 -153 191 72 33 -10 -138 22 135 -5 87 -5 161 -43 -176 61 59 -5
4147 -5 124 104 -7 -16 -65 43 -217 -76 -135 -21 -153 134 57 -101 47 -77 47 -96 -71 -55 -185 31 -138
4170 -138 -13 1 -109 -142 -122 105 -31 -28 75 62 31 70 65 45 26 99 129 53 242 -142 12 115 -83 157 -74
$$ packed form
3994E4j6j19N2K6N5j33J59j4l5j29J94j58N6OJ9r9J41j69M9P7j3J01j25K00k22
4019d3N2J60j99o0R0J8m8J33jr3o4O2L3N7j91m2J21P5o2Q1p5j52O9P8j0r6K18
4046A11o8k8l3P2j24M9J96p8p6j37J87j78J95r6j6r0R9R9j3r7Q9Lm1j97L45j52
4072B1q6J36n5j16J11J27j97nJ62j67J37j80J57j02m7J47j42N1J33m8M3q8o7j8
4096i3J21N5j9L4J4j89O1j2o9J29j01J00q5J14j87J54Oj58K25O5j95o4R8K5RN7
4122I5p5L5k17J64l5L6m8m4o4L44j19l9m3j28J60J13j40R2r2J66k04j33K37ko4
4147eJ29k0j11rm9J08k60J41n9J14j32K87p7j58J48j24J24j43K5J6j30K16j69
4170a38J25J4j10l3K0K27j36LJ03j3l1L9nk0j9P3L0p6J89l84J54J03j98K40k31
$$ plain form
4195 -74 4 -69 33 30 5 86 -152 -99 157 -72 73 165 54 -73 -16 -62 2 107 125 -3 -69 -153 -75 -101 55 -76
4221 -76 74 -12 60 60 145 13 27 -4 -22 -23 -9 39 -98 46 44 -39 -15 -2 81 100 -116 -5 32 64 206 -47 193
4248 193 -173 -76 -62 -103 180 65 2 126 50 -140 -6 -77 -25 42 90 21 -17 -35 2 110 0 68 -43 -61 128
4273 128 193 -96 61 84 112 -35 38 -38 -87 52 106 41 200 -21 8 -155 -137 37 -25 -25 84 88 -109 -72 -16 104
4299 104 -81 81 -113 8 -168 -12 64 -18 195 -48 -57 132 -53 -184 64 81 -76 -230 31 -71 -148 -178
4321 -178 -103 -137 3 66 -5 122 57 5 -20 31 -28 -86 41 41 -60 48 -109 231 7 32 25 -64 -75 -77 -11 -132 -12
4348 -12 155 66 -38 209 61 -72 -39 6 15 -4 -70 -52 47 -125 -55 33 -51 62 75 140 164 66 149 78 33 6 -87
4375 -87 -227 -56 -61 -92 51 -78 -77 72 -189 101 -24 -44 -32 30 29 146 28 149 -22 10 -169 -20 -14 -131 68
$$ packed form
4195g4P8p3J02lk5Q1k38N3K56k29J45R2j11j27N7m6O4J05J8j28o6q4P8k6J56j31
4221g6J50q6P2%Q5j32J4l1j8jJ4M8j37J44kq3K4J3Q3J9k16J11L7L2J42k53K40
4248A93l66R7J4m1K83j15o3J24p6j90J34p1N2O7M8o9l8j8L7J08j10O8j11j8J89
4273A28O5k89J57K3K8j47P3p6m9J39N4o5J59k21K9j63J8J74o2%J09Mj97L7N6J20
4299A04j85J62j94J21j76J56P6q2K13k43rJ89j85j31K48J7j57j54K61j02p7l0
4321a78P5l4J40O3p1J27o5n2k5N1n9n8J27%j01J08j57L40k24K5pq9j1kO6j21J20
4348a2J67q9j04K47j48j33L3M5Rj9o6J8R9j72P0Q8q4J13J3O5K4r8Q3p1m5k7r3
4375h7j40J71nl1J43j29JJ49k61K90j25k0J2O2jJ17j18J21j71L2j79J49Oj17J99
$$ plain form
4400 68 -77 -115 -24 -13 -60 -14 75 -99 -138 10 -16 142 79 -119 -130 127 -29 -110 0 -87 -73 120 -148 33 104
4425 104 58 119 110 -19 -4 -167 70 180 -44 -12 42 21 108 -53 24 -154 -165 107 -7 5 -63 -49 33 -138 180
4450 180 -61 -98 -36 28 27 20 21 -46 -6 -2 137 -217 -192 27 -115 -18 75 -44 47 60 -25 -68 -77 -75 2 21 -80 -74 48
4479 48 62 42 123 -29 113 96 -54 89 -75 -179 84 160 -48 -53 -24 -60 -4 3 5 -100 -28 21 56 -26 -11 -72 133
4506 133 13 6 -30 -11 -74 141 86 -95 19 172 -69 55 22 53 -109 48 5 70 -54 -38 -99 -44 63 -103
4530 -103 -89 103 29 -5 74 -16 -6 83 -81 89 -51 -1 16 117 49 8 -92 -126 11 -21 -44 -69 12 38 -16 -33
4556 -33 -165 -7 149 12 -17 -71 55 108 17 44 47 -61 -28 166 44 63 -195 146 -68 -50 -112 106 -94 -64
4580 -64 57 -71 -28 -77 39 61 -35 -37 21 -196 116 -62 -10 115 45 -137 -9 -106 -101 49 135 -98 182 61 32
$$ packed form
4400F8j45l8R1J1m7M6Q9j74l9J48k6J58o3j98j1K57j56q1J10q7J4J93k68J81P1
4425A04m6O1rj29J5j63K37J10k24L2N4k1Q7j61P7j78j1K72j14J2o8J4Q2j71L18
4450A80k41l7O2O4jpJo7M0MJ39l54K5K19j42R7R3j19R1J3q5m3rKP7J9j01OJ22
4479D8J4k0Q1j52J42j7j50J43j64j04K63P6k08nK9l6N6PKj05P2M9L5q2J5o1K05
4506A33j20pl6J9o3K15n5j81J14J53k41J24l3L1j62J57m3O5j24J6o1N5J07j66
4530a03J4J92p4l4P9r0J0Q9j64J70j40N0J7J01o8m1j00l4J37l2k3k5Q1K6n4j7
4556c3j32J58J56j37k9n4J26N3r1K7Lj08L3J94j22J9k58L41k14J8o2K18k00L0
4580f4J21j28M3m9J16K2r6kN8k17L12j78N2J25p0j82J28r7NJ50Q6k33K80j21k9
$$ plain form
4605 32 -10 -87 5 -112 202 4 1 225 8 15 47 -39 -39 -127 104 -108 -52 138 -100 136 67 52 88 -155 -43 39
4631 39 46 -129 -49 -139 66 18 68 186 -75 65 7 110 74 121 44 -99 46 115 -96 -49 -118 -134 92 -14 57
4656 57 -73 118 -28 3 -48 -30 -42 25 -4 -9 7 -36 70 179 39 13 130 -186 18 -32 -33 -65 21 51 266 6
4682 6 -28 -28 40 -47 73 -23 -94 12 32 -46 -43 -32 55 -93 19 150 -337 47 -7 -56 8 67 40 92 -43 61 128
4709 128 14 54 5 46 7 -102 54 42 33 56 -38 78 117 70 23 79 -21 7 41 -41 303 -34 -26 -9 36 87 -78
4736 -78 96 -147 -157 -43 59 41 65 118 -31 110 -110 48 116 -46 -19 -82 -19 -32 -133 62 12 99 40 62 -214
4761 -214 -71 129 -51 -87 -89 12 -43 8 36 -81 -19 -48 75 -55 30 47 -15 10 -27 -144 81 76 -78 -128 -41 123
4787 123 -255 129 96 -79 33 250 56 -15 -72 -65 24 25 111 -128 163 101 253 -100 -19 57 -59 181 -94 67
$$ packed form
4605C2m2p7R2j17L14j98lK24k17PL2q6%q8K31k12N6J90k38K36o9j5L6k43J12Q2
4631C9Pj75Q0r0K05m8N0J18k61J40n8J03l6M7p7j43J45O9k11M7o9j6K26j06P1
4656E7j30J91j46L1n1J8j2O7k9nJ6m3J06J09j40k6J17l16K04n0jl2Q6L0K15k60
4682Fl4%O8q7J20r6p1J06K0p8LJ1Q7j48J12J31m87L84n4m9O4N9k7N2j35J04O7
4709A28j14M0m9M1l9j09J56j2rK3r4J16L9m7m7N6j00K8L4q2L44l37QJ7M5N1j65
4736g8J74k43j0J14J02j8K4N3j49J41k20J58O8j62K7o3O3j3j01J95n0Q7n9K2k76
4761b14J43K00j80l6kJ01n5N1K8j17O2k9J23j30Q5J7o2K5l7j17K25nj54n0Q7J64
4787A23l78L84l3j75J12K17j94p1n7PQ9JQ6k39K91o2J52l53Q1P6j16K40k75J61
$$ plain form
4811 67 9 200 -101 13 106 -122 -2 134 -93 40 48 113 -28 119 59 -51 -18 66 124 1 57 -11 113 79
4835 79 -59 101 86 54 137 135 -40 61 99 19 -112 -8 -93 4 -46 -79 -13 -54 -80 -19 87 115 -4 -100 45 -58
4861 -58 118 3 -18 54 -73 69 -35 35 53 -7 0 94 -86 -75 5 103 -8 -126 -91 128 -13 -36 -17 -134 -97
4886 -97 -54 97 98 117 -52 0 -89 -126 29 -156 -43 -79 81 124 101 87 -19 39 -72 79 78 97 149 -5 -78 160
4912 160 4 -1 50 -72 73 -1 -157 62 -12 -7 -100 -100 92 58 138 65 17 -41 126 131 -56 69 -28 28 26 -23 -81 -93
4940 -93 37 -63 -127 126 76 -127 2 73 172 -43 14 104 0 15 -33 -22 -211 19 86 92 -98 -33 138 4 -125
4965 -125 124 -144 114 60 19 -143 -175 -93 16 -17 -271 -129 -17 -154 10 22 78 73 6 15 73 72 15 -5 -169 9
4991 9 -71 69 68 -16 -107 -39 38 75 61 20 4 155 73 -43 -74 -22 6 -3 96 -88 -106 -97 63 10 59 -60 73 -171
$$ packed form
4811F7n8J91l01J14R3k28J20J36k27J33QO5j41J47o0j10L3Q4N8j23N6o8J24l4
4835G9j38J60j5l2Q3kj75J01L8q0j31J04q5R7n0l3O6m1k6O1J06K8j19r6J45j03
4861e8J76j15k1P2j27J42j04P0J8o0PR4j80J1Q0R8j11j18L5K19j41k3J9j17L7
4886i7M3J51JJ9j69N2q9l7J55j85J13l6J60M3k3j4j06N8j11J51jJ9N2j54p3K38
4912A60j56nN1j22J45p4j56K19p4Nr3%J92l4Q0p3m8n8J67Nj87J25r7N6km9n8j2
4940i3J30j00o4K53n0k03J29P1R9k15N7R0j04J5m8J1j89K30O7Oj90O5J71j34j29
4965a25K49k68K58n4m1j62l2Q2J09l3k54J42J12j37J64J2N6no7RN8jn7k0j64J78
4991Iq0J40jq4r1O8P7L7j4m1j6J51q2j16l1N2K8rR9j84j8RJ60n3M9j19J33k44
$$ plain form
5019 -171 26 -63 -41 -24 118 4 175 -36 -6 128 142 -136 -126 -156 5 -51 72 31 -109 -99 -100 55 142 45 -134
5044 -134 -57 14 74 64 -63 -16 -21 -20 -157 -210 -80 -120 -110 -64 -182 60 75 147 -62 179 -8 -5 29 9 36 -35 -29 -6
5072 -6 80 110 -108 47 -124 60 -12 30 238 100 75 20 7 52 -98 -120 174 -155 -57 69 -32 94 7 34 3
5097 3 34 -39 0 124 -1 -109 142 74 -54 -120 -13 86 83 -11 170 127 58 -174 80 56 -11 35 10 14 83 -55 14
5124 14 33 -108 -11 -69 103 -86 -14 -79 123 -75 24 -32 -1 71 91 -101 -22 -52 81 53 -73 187 44 104 -80
5149 -80 -102 28 124 -134 127 -36 -26 -11 2 -70 -30 -34 -179 4 -18 156 84 2 19 87 -100 -34 -108 157 111 -131
5175 -131 -8 -16 -32 -170 -55 113 -184 56 27 -74 74 3 84 121 70 -107 106 -25 -59 -149 76 -17 -16 -32 67
5200 67 122 111 -101 -207 15 72 -129 8 -27 175 76 -142 -136 63 -119 62 61 34 -35 71 73 -111 -50 2 169
$$ packed form
5019a71J97q9K2J7J42j14J71k11L0J34J4k78J0l0J61n6J23m1j40J0jJ55Q7r7j79
5044a34P7P1O0j0j27M7nJj37n3J30m0J0M6j18K42J5P2k09K41j87LL4k0K7p1OK3
5072fQ6L0k18J55j71J84p2M2K08j38k5n5j3M5j50k2K94l29R8J26j01J26q7K7l1
5097CL1p3L9J24j25j08K51o8j28o6J07R9lr4J81m3o9k32K54k4o7M6k5MO9j38O9
5124A4J9j41R7n8J72j89P2o5K02j98R9n6L1P2K0j92P9l0J33k8j26K60j43O0j84
5149h0k2J30R6k58K61j63J0J5J3p2M0mj45J83k2J74p2q2J7O8j87O6p4K65m6k42
5175a31J23qj6j38J15J68k97K40k9j01J48p1Q1L7n1j77K13j31l4r0K25r3Jj6R9
5200F7N5j1k12j06K22N7k01J37l5K02r9k18OJ99j82J81jk7o9J06Kj84O1N2J67
$$ plain form
5225 169 116 86 29 113 74 -84 10 75 24 -106 76 6 42 -43 85 -50 -33 169 59 -71 25 128 196 -55 -57
5250 -57 47 -34 -25 160 26 13 34 -75 28 -91 -88 -104 99 -135 -42 -48 22 121 -7 -42 59 -7 -30 124 53 37
5276 37 -32 -94 29 -19 72 133 143 -1 -98 21 -58 92 -61 49 4 6 -15 -42 -54 8 73 31 148 267 -85 -144
5302 -144 -193 -17 102 -42 -107 21 212 -39 213 138 -127 -213 160 51 -30 -114 -77 4 78 7 0 149 -22 -142
5326 -142 120 91 -135 157 57 -105 -19 16 146 98 107 63 127 7 -223 114 61 -83 -41 84 72 82 61 -45
5350 -45 73 54 59 32 -57 18 -50 5 -36 54 -195 -79 36 -99 74 -195 -173 -148 -23 12 -97 -38 44 -1 10 -56
5376 -56 -15 93 239 162 59 157 2 26 18 83 0 43 -114 -16 -8 34 -64 51 -131 -143 84 -93 -126 110 -66 159
5402 159 35 -130 5 -40 -35 135 -71 212 38 36 23 -109 26 36 39 1 27 188 -146 73 9 -159 -33 195
$$ packed form
5225A69n3l0n7Q4l9j58R4O5n1j30J82p0L6q5J28j35J7K02j10j30R6J03O8k51k
5250e7J04q1RJ85j34j3K1j09J03j19Lj6K03k34R3oP0R9j28l5J01o6k3J54p1j6
5276C7o9o2J23m8R1O1J0j44r7J19p9J50j53J10m5Kk1k7j2O2O5m2J17J19l52n9
5302a44m9J76J19j44o5J28J91k51K52p5k65q6L73j09q1q4L7Q1P4p1pJ49j71j20
5326a42K62k9k26K92j00j62Q6L5J30m8Rm4O4j20k30L37n3j44M2J25j2J0k1j06
5350d5J18j9Nk7q9P5o8N5m1R0k49J16J15j35J73k69K2K5J25L5j09N9Q2m5J1o6
5376e6M1J08J46p7j03R8j55K4qO5q3M3j57R8QM2r8J15j82j2K27j77l3K36j76K25
5402A59j24j65J35m5NJ70k06K83j74kj3j32J35J0Ll8K6J61l34K19o4j68J26K28
$$ plain form
5426 195 26 63 -53 153 -27 39 -174 -184 96 69 30 22 72 38 -95 -63 3 -26 49 26 122 -24 -49 6 67 125
5452 125 111 58 98 12 -85 59 56 -43 -30 -12 19 -36 -47 -4 -47 32 116 -135 -6 74 -45 -66 1 38 -1 54 85 28
5480 28 -5 -85 153 61 46 124 -17 51 -26 14 24 -42 17 -68 66 -23 40 34 -64 -66 7 90 -113 70 -29 -61 21 73 99
5509 99 17 -59 -100 121 1 193 48 -34 -199 -29 31 -115 -20 -3 -18 72 -141 149 -45 -26 -59 -1 13 81 17
5534 17 137 41 -30 54 23 38 -42 152 -43 10 -83 6 -90 -20 -11 58 -66 -92 64 81 -44 1 137 75 -83 -41 -59
5561 -59 -20 -111 -152 -67 -7 -47 -14 -168 31 -91 47 -26 -29 99 61 66 33 -35 96 34 64 18 53 -40 -28 35 -160 55
5589 55 34 89 -34 97 109 -48 -42 -159 83 215 41 -40 -156 -66 56 -25 -252 19 -15 0 8 42 -47 1 -75 120
5615 120 -32 15 -36 83 -10 -35 60 115 200 -163 101 0 -16 -76 72 -154 -1 124 -8 -194 35 -58 -64 -1
$$ packed form
5426A95j69L7j16K06j80O6k13j0K80k7l9qN0l4j33L2O6k9P5k3R6j46k5N5O1N8
5452A25j4n3M0q6r7J44lr9J3J8L1n5j1M3m3P9Q4k51J29Q0j19k1O7L7l9N5L1n7
5480B8l3q0K38r2j5P8j41O8p7M0J0o6N9q5J34q9O3or8kP3Q3k03J83r9l2Q2N2K6
5509I9q2p6m1K21j20J92j45q2j65J70O0j46R5J7j5R0k13K90j94J9l3N8J4O8o4
5534A7J20r6p1Q4l1J5q0J94j95N3r3Q9r6P0RO9j24k6J56J7j25M5J36o2j58M2j8
5561e9L9r1m1Q5O0m0L3j54J99j22J38p3lJ28l8Nl3o8J31o2L0m6L5r3J2O3j95K15
5589E5k1N5j23J31J2j57Oj17K42J32j74q1j16R0J22q1k27K71l4J5QL4q9M8p6J95
5615A20j52M7n1J19r3k5R5N5Q5l63K64j01j6o0J48k26J53J25j32j86K29r3oO3
$$ plain form
5639 -1 47 -72 -88 175 9 128 49 24 -37 -41 -67 -37 21 -130 -13 64 -61 69 36 -6 82 -51 53 -22 50 49 -9
5666 -9 -107 23 -9 21 42 130 3 14 -134 -78 25 -50 51 40 -38 -108 -62 -10 35 -27 -138 60 138 25 48 -82
5692 -82 -84 35 10 -131 -55 36 39 55 -21 128 -24 -24 48 70 -34 93 -12 160 8 20 31 98 37 57 98 -79 -34
5719 -34 -51 38 15 128 21 -18 -201 -23 -56 -104 0 53 -35 140 -40 -46 -91 -32 4 13 -112 7 44 55 139 -2
5745 -2 56 10 -9 -17 66 78 0 50 -42 -50 34 28 111 -45 -9 -92 -11 -13 70 -107 32 -80 -56 14 44 -82 -35 -3 -91 -125
5775 -125 10 -104 -117 -12 -258 -100 23 -61 -24 81 -67 35 -39 132 -106 110 -4 -74 34 14 54 105 -291
5798 -291 30 -85 -127 -9 -214 18 -109 -242 9 9 19 71 -98 100 -15 -50 -7 -25 7 -17 68 -94 82 129
5822 129 130 8 97 -59 34 -147 17 159 92 -21 -26 -188 -77 -24 40 125 -8 -94 -66 -72 -22 92 147 -129 -17
$$ packed form
5639aM8j19j6K63j66J19p9k5o1mk6L0N8j51J17P7j25J30l3m2Q8j33J04p5P2jn8
5666ir8J30l2L0K1Q8j27J1j48N6J03p5J01j1p8p0M6N2M5o2j11J98P8j13K3j30
5692h2kJ19k5j41P6R1LJ6p6J49j52%P2K2j04J27j05J72j52J2J1O7o1K0M1j77M5
5719c4j7Q9k3J13j07l9j83J78l3m8J04N3q8J75j80om5N9L6Rj25J19L7J1Q4j41
5745bN8m6j9qQ3J2p8N0r2qQ4oQ3j56L6q3Q1kQ3j77J39j12K4P0L0j26M7L2q8l4
5775a25J35j14j3J05k46J58J23q4L7J05j48J02p4J71k38K16j14p0J08k0M0N1l96
5798b91L21j15m2J18k05K32j27j33K51%J0N2j69J98j15l5M3j8L2k4Q5j62J76M7
5822A29Jj22Q9j56R3j81J64J42o7j13nj62J11N3O4Q5j33q6K8oN0J14N5k76J12
$$ plain form
5847 -17 8 78 -85 -117 -32 -95 78 -136 -100 -14 22 -68 221 -70 -195 155 117 -125 36 -104 -151 20 107 -18
5871 -18 -142 -72 34 121 108 -30 -60 47 -7 73 97 -39 40 134 1 -42 -118 -20 -152 -6 66 -19 -93 -63 -45 70
5897 70 -32 -14 -100 11 -46 -135 16 -92 -33 142 -96 189 174 89 142 -54 -22 -1 79 7 87 -61 -30 44 79 -31
5923 -31 71 125 -91 -127 27 105 32 -184 -11 20 21 -52 -65 -8 -47 14 -69 -137 -126 -19 -4 -147 -86 -288 77 -95
5949 -95 32 123 61 -24 -89 -4 -8 27 -47 161 -155 -36 158 52 -166 -27 -76 -77 -107 111 32 176 46 18 93 -57
5975 -57 -32 -14 57 36 -143 149 46 -210 21 52 149 2 79 90 37 -19 188 37 -62 19 -11 35 -113 103 -24
6000 -24 32 -43 91 -58 7 -10 -39 -111 90 -17 65 41 -26 -84 -84 79 -95 -47 20 -95 38 -25 27 -104 218 40
6026 40 43 -22 -75 -23 -37 -93 65 2 -103 58 16 -54 -37 87 2 115 -102 -133 138 124 -143 -29 21 -34 112 66
$$ packed form
5847a7K5P0j63l2Q5o3J73k14L6Q6L6r0K89k91j25L50l8k42J61j40m7J71Q7j25
5871a8j24P0J06Q7j3j38l0J07n4Q0K4j36P9R4j33m3p6R8j32J46P2q5p4L0J8J15
5897G0j02J8q6J11n7q9J51j08N9J75k38K85j5q5N3j96L2K1Q0p2Q0j48L1P4L5j10
5923c1J02N4k16l6J54P8p3k16J73L1Jp3j3N7l9O1q3o8J1J07J5j43O1k02L65j72
5949i5J27R1o2q5o5Q5mL5p4K08l16J19J94j06k18J39m9jl0K18p9J44j30k8P5j50
5975e7K5J8P1k1j79K92j03k56K31L1R7j47P7J1n3n6K07j51r9Q1l0M6j48K16j27
6000b4N6p5J34j49O5j7k9p2K01j07Q2k4o7n8%J63j74M8O7j15J33o3N2j31L22j78
6026D0Lo5n3N2j4n6J58o3j05J61m2p0J7J24q5J13k17l1K71j4k67J14N0n5J46m6
$$ plain form
6052 66 -53 76 64 -137 51 -54 -79 127 28 -52 162 -16 -130 82 7 -179 15 28 22 -23 -91 -42 -62 -41 94
6077 94 20 156 30 30 -99 -23 30 -43 -130 29 -33 19 48 118 40 -65 -49 33 -104 -108 85 76 -75 158 -121 95
6103 95 -89 65 -23 -9 19 -11 18 -151 -22 107 44 43 101 95 68 -131 -44 -50 3 -149 130 36 187 -100 41 181
6129 181 16 110 38 -110 33 -175 -43 114 -76 188 37 -84 60 76 52 39 -24 19 58 -32 3 -161 1
6152 1 -21 -116 -56 -5 -132 -158 8 129 69 12 -83 5 62 -59 -126 104 -45 3 -105 -17 19 79 155 -4 129 56
6178 56 117 103 0 33 42 -42 24 -35 4 20 11 -47 -11 -38 91 2 -101 3 39 5 -54 -30 33 -61 164 28 13 -26
6206 -26 44 58 65 -33 -16 -11 167 -114 10 80 51 -158 -29 105 15 40 -51 -29 -157 -52 -130 27 -174 -48 -115 -118
6232 -118 69 -1 17 -33 9 -43 -100 -99 5 36 -30 133 145 38 23 -102 -64 -77 -65 -97 -7 -160 11 -126 72 -10
$$ packed form
6052F6j19J29j2k01J88j05k5K06r9q0K14j78j14K12p5j86J94J3om5o8M9k0K1J35
6077I4p4J36j26%j29P6N3p3q7J59o2N2K9P0p8j05J6Q2j37mJ93rj51K33k79K16
6103I5j84J54q8J4K8l0K9j69J29J29o3jN8ok7j99Q7oN3j52K79r4J51k87J41J40
6129A81j65R4p2j48J43k08J32J57j90K64j51j21J44J6k4j3o3M3L9r0L5j64J62
6152Ak2r5O0N1j27k6J66J21o0n7r5Q8N7j21o7K30j49M8j08Q8L6O0P6j59J33p3
6178E6O1j4j03L3Rq4O6n9L9J6rn8L6k7J29q9j03J04L6l4n9K4O3r4K25j36j5l9
6206b6P0J4Pr8J7NJ78k81J24P0k9k09J29J34r0K5r1K2j28J05p8J57k01J26o7l
6232a18J87p0J8n0M2n2n7JJ04L1o6J63J2j07j5j25L8j3J2l2R0j53J71j37J98q2
$$ plain form
6258 -10 59 -188 60 -1 60 61 139 20 -148 -49 20 -74 -17 -56 49 -129 20 -120 -44 -63 -95 99 -99 -135 -46 38
6284 38 75 -11 -117 101 82 38 -54 -60 21 -46 9 -53 -14 -39 -42 30 72 -126 84 -89 57 103 96 -193 8 112 -103
6311 -103 -19 -13 -30 -67 45 -121 -42 -95 14 -26 -69 63 138 61 -253 95 22 79 -196 -19 4 -45 -48 35 -27 -155
6337 -155 -29 -101 -33 -37 17 -57 62 -61 72 180 -16 -71 -84 7 -64 60 -47 -184 -37 19 -190 -99 -51 78
6361 78 -171 37 -41 -81 -110 -42 64 10 85 6 49 -111 125 185 -104 3 -133 -69 46 -7 -57 146 81 32 34 -135
6387 -135 46 25 20 -106 112 115 -81 117 -33 -130 45 121 8 -106 75 69 72 148 -212 151 62 27 195 46 -110
6412 -110 -98 -104 -170 -104 147 -51 -122 -65 -30 -77 107 73 -89 24 -76 4 -86 -14 92 87 32 -42 -10 -116 1 -103
6438 -103 -119 -60 143 -81 -17 -108 63 -147 63 -102 84 -20 -45 -94 92 36 -52 43 -10 -50 109 68 35 -11 -16
$$ packed form
6258a0O9k47K48o1O1JP8j19j68R9O9r4N7l9J05j78J49j40P6j9l2J94j98l6Q9Q4
6284C8L7q6j06K18j9m4r2oQ1o7N5o2L9k5lP2M2j98K10j73J46M6pk89K01J04k15
6311a03Q4Oj7l7J12j66P9n3J09m0m3J32P5p7l14L48p3N7k75J77K3m9lQ3o2j28
6337a55J26p2O8mN4p4J19j23J33J08j96n5j3R1p1J24j07j37J47N6k09R1M8J29
6361G8k49K08p8m0k9O8J06n4P5p9M3j60K36O0k89J07j36O4J15n3n0K03o5m9Kj69
6387a35J81k1nj26K18Lj96J98j50r7J75P6j13j14J81oLP6l60L63q9l5J68j49j56
6412a10J2oo6O6K51j98p1N7L5m7J84l4j62J13j00Q0r0P2J06nn5p4L2j06J17j04
6438a03j6N9K03k24O4r1J71k10K10j65J86j04k5m9J86n6q8R5n3m0J59m1l3m6n
$$ plain form
6463 -16 -2 -86 14 -69 -20 -53 100 -140 -44 -181 -132 83 64 -74 -59 -154 20 88 156 -187 -63 -47 -63 30 -72
6488 -72 180 -63 -17 4 145 27 23 7 5 -25 -125 89 -44 20 5 2 -70 24 -38 -121 68 27 68 -24 -5 -3 25 66
6516 66 -40 -54 -59 -191 28 12 55 51 1 74 -131 64 -52 -65 61 -115 -5 -138 -68 -66 -49 26 141 -99 13
6541 13 -67 -46 -16 -108 -75 -35 -62 -23 90 20 121 98 73 -26 -52 -124 -34 -45 140 -181 -9 -26 160 -34 -86 -54 39
6568 39 164 97 -57 -174 157 92 153 -18 62 89 -26 71 -83 46 101 -80 51 -2 53 -37 1 -84 10 -63 -84
6593 -84 11 3 37 26 12 20 35 85 6 -17 33 81 0 -144 7 100 65 -20 -59 -74 50 179 114 -50 -11 17 17 45 -115
6622 -115 25 257 36 -20 -227 22 101 -52 -12 32 -12 -169 80 58 -154 53 -122 -28 -25 41 113 -25 -53 44
6646 44 -211 -137 -22 -27 -66 16 -6 -52 119 38 136 20 72 -101 -63 -115 -112 -60 -78 -38 -97 -31 83 -76 -53 -66 0 2
$$ packed form
6463a6J4q4J00q3M9l3J53k40R6j37M9K15j9j38J5r5J74O8O8l43J24J6j6R3j02
6488g2K52k43M6K1J41j18mj6kl0j00K14j33O4j5lp2R4o2q3J89m1M1r2J9KK8M1
6516F6j06j4nj32K19j6M3mn0P3k05J95j16j3J26j76J10j33P0KJ7P5J15k40J12
6541A3q0K1L0r2L3M0k7L9J13p0J01k3k5r9k6p2R0j1J85l21J72j7J86j94n2L2R3
6568C9J25o7j54j17L31o5O1j71Q0K7j15R7j54J29N5j81J31n3N5r0L8q5R4p3k1
6593h4R5qL4j1j4QJ5N0p9k3N0M8q1j44J51R3l5q5l9j5J24J29o5j64L9K8%K8j60
6622a15J40K32k21n6k07K49P9j53M0M4m4j57K49k2k12K07j75R4LO6P2j38k8R7
6646D4k55P4J15nl9Q2k2m6J71q1R8j16N2j73L8n2LN2j8M0n9O6J14j59K3j3O6K
$$ plain form
6674 2 -48 48 -98 -72 -30 143 -28 26 -86 22 -62 134 124 -26 -1 -56 -55 76 -82 -1 99 53 102 74 -12 -41
6700 -41 111 135 33 -14 -67 28 -1 -68 118 102 4 -133 -79 0 -181 -89 -43 -44 141 -16 74 -81 57 25 -109 105
6726 105 123 72 -95 25 -49 -28 -7 -55 -35 -23 -48 -113 -39 56 -59 86 -23 -61 -29 -86 38 -104 -45 -124 -113 -143
6752 -143 -19 -59 57 -31 1 25 -31 -33 85 -50 -4 -39 -2 -59 -115 -36 43 -37 -78 -166 -88 46 112 197 -92 -36 221
6779 221 -98 -44 -5 28 -65 136 40 73 -44 87 67 63 211 -25 -4 98 141 67 -235 -19 73 -81 -55 -101 53
6804 53 -176 120 20 0 -117 5 13 -19 52 102 -20 -78 -9 -33 -101 154 -4 -10 -174 -71 -4 43 8 145 -14
6829 -14 -9 -137 139 28 28 53 -118 119 -142 -79 81 55 -19 -48 45 -137 144 -53 9 26 52 -7 1 127 188 154
6855 154 -37 -150 22 56 32 140 -111 -125 52 -47 125 -93 45 -33 -53 -26 -74 -155 -60 -186 -103 68 -49 148
$$ packed form
6674Bn0R6j46K6M2J73j71N4j12J08q4J96j0j50K5n5JJ31j58Q1J00m6M9k8q6k9
6700d1J52K4j02m7n3R5k9o7J86j6r8j37N4P9j81R2M6jJ85j57R0j55J38l2j34K14
6726A05J8n1j67J20p4K1K1m8K0J2k5o5P4R5j15J45j09l8L2n7J24j42N9p9J1l0
6752a43J24m0J16q8L2K4n6kJ18j35M6l5L7n7n6P9P9q0m1q8P8J34O6Q5k89N6K57
6779B21l19N4L9L3r3K01r6L3j17J31k0mJ48k36K1J02M3p4l02K16R2j54K6m6J54
6804E3k29K96j00k0j17J22Ql2P1N0j22n8O9k4o8K55j58oj64J03O7M7l5J37j59
6829a4Nj28K76j11%K5j71K37k61O3J60k6p4k9R3j82K81j97O2J7K6n9QJ26O1l4
6855A54j91j13J72L4k4J08k51j4J77r9J72k18J38p8k0K7m8q1R5j26Q3J71j17J97
$$ plain form
6879 148 -218 139 -3 -104 160 167 -30 15 12 20 0 -118 78 -19 -33 -19 -39 -50 51 31 71 12 6 -136 154 152 -17
6906 -17 -1 -16 -43 -29 137 -34 -133 26 -81 -50 70 68 -140 -86 38 83 -12 -156 112 -7 -138 44 59 -15 5
6931 5 -11 77 51 -37 -31 87 103 -88 193 67 -188 20 -27 -33 83 69 -11 -41 14 -15 97 -51 182 107 64 24 122
6958 122 -15 -70 -95 -41 70 33 57 26 100 -133 -150 -127 -58 -80 -113 36 22 87 6 21 87 7 -111 -46 -38 48 -163
6985 -163 -75 61 -13 30 64 70 -131 32 -50 -92 59 148 -118 -12 76 74 -17 52 -86 64 -124 93 -16 -10 93
7010 93 21 -101 42 -72 -38 -11 97 -17 113 -67 42 76 108 171 -89 67 -5 99 28 -88 32 43 -25 54
7034 54 -32 37 19 52 3 -27 -215 -73 32 -52 66 92 -219 -12 35 17 42 -21 91 18 -70 -59 -9 -19 -7 -24 -170
7061 -170 44 72 8 -90 167 16 73 -134 36 97 36 31 5 26 -83 17 8 -62 -153 -62 2 -136 -75 58 -38 -142
$$ packed form
6879A48l66L57j42j01K64Pj97M5lQk0j18J96r7j4J4k0j1J01k0M0n9oj42K90kj69
6906a7J6j5k7J4J66j71r9J59j07L1J20kk08N4J24M5r5j44K68j19j31J82J5p4K0
6931Ej6Q8k6q8OJ18J6j91K81j26k55K08m7oJ16j4q0l0N5k9J12j48K33p5m3m0R8
6958A22j37n5k5N4J11l7K4l1P4k33j7K3O9k2l3J49j4O5q1J5O6q0j18O5QQ6k11
6985a63Q8J36p4M3L4Ok01J63q2m2J51Q9k66J06Q8kr1O9j38J50j88K17j09OJ03
7010I3p2j22J43j14L4K7J08j14J30j80J09L4L2O3k60J56p2J04p1j16J20J1o8P9
7034E4q6O9j8L3m9l0j88J42J05q4J18K6l11K07M7j8K5o3J12p3q8J1N0j0J2j7j46
7061a70K14K8o4r8K57j51N7k07J70O1o1nk6K1j09J00rp0r1R1O4j38O1J33r6j04
$$ plain form
7087 -142 -25 -87 35 -44 73 87 152 0 -150 -48 134 67 35 219 50 -42 71 -20 -167 74 40 54 150 59
7111 59 52 76 -17 13 179 -27 -109 -6 16 4 223 -15 -117 -32 60 77 -184 -116 2 -81 109 -27 -25 -74 85 -62
$$ packed form
7087a42J17o2J22p9J17J4O5j52j50J02J82o7l2J84j69r2J13r1j47K41l4J4R6r1
7111E9pK4r3L0J66k06q2J03K2j2K19k38j02Q5R2J7k61O8J18q3J90j36Km9J59j47
$$ [...]
8191I
##END NTUPLES=NMR FID
##END=
