##TITLE=1H_Pr DMF
 
 8 sc, 
 12.4.2024
##JCAMPDX= 6.0         $$ Bruker NMR JCAMP-DX V2.0
##DATA TYPE= NMR FID
##DATA CLASS= NTUPLES
##ORIGIN= UXNMR, Bruker Analytische Messtechnik GmbH
##OWNER= root
$$ XWIN-NMR		Version 3.5
$$ Fri Apr 12 16:25:26 2024 Russian Standard Time (UT+4h)  she@DPX200
##.OBSERVE FREQUENCY= 200.1309
##.OBSERVE NUCLEUS= ^1H
##.DELAY= (6, 6)
##.ACQUISITION MODE= SIMULTANEOUS
##.ACQUISITION SCHEME= undefined
##.AVERAGES= 8
##.DIGITISER RES= 18
##SPECTROMETER/DATA SYSTEM= spect
##.PULSE SEQUENCE= zg30
##.SOLVENT NAME= CDCl3
##.SHIFT REFERENCE= (INTERNAL, CDCl3, 0, 15.7039)
##AUDIT TRAIL= $$ (NUMBER, WHEN, WHO, WHERE, WHAT)
$$ ##TITLE= Audit trail, XWIN-NMR		Version 3.5
$$ ##JCAMPDX= 5.01
$$ ##ORIGIN= Bruker BioSpin GmbH
$$ ##OWNER= she
$$ F:/spectra/data/she/nmr/H-F/1/audita.txt
$$ ##AUDIT TRAIL=  $$ (NUMBER, WHEN, WHO, WHERE, WHAT)
(   1,<2024-04-12 16:24:18.68 +0400>,<she>,<DPX200>,
      <created by zg, POWCHK disabled, PULCHK disabled
       configuration hash MD5:
       00 E9 B6 7A A2 85 ED C7 34 08 36 98 17 FE 4E 26
       data hash MD5: 16K
       7B AD 9E 22 1E E1 0A BE 5C F3 47 1A 6F FC 97 08>)
$$ ##END=
$$ 
$$ hash MD5
$$ F1 5E 77 E9 CF 27 5F 72 FB 13 E0 21 50 87 2B 91
##$RELAX= 
##$RELAX= 
##$RELAX= 
##$RELAX= 
##$RELAX= 
##$RELAX= 
$$ Bruker specific parameters
$$ --------------------------
##$DU= <F:/spectra>
##$EXPNO= 1
##$NAME= <H-F>
##$PROCNO= 1
##$TYPE= <nmr>
##$USER= <she>
##$AMP= (0..31)
100 100 100 100 100 100 100 100 100 100 100 100 100 100 100 100 100 100 
100 100 100 100 100 100 100 100 100 100 100 100 100 100 
##$AQSEQ= 0
##$AQ_mod= 1
##$AUNM= <au_zg>
##$AUTOPOS= <>
##$BF1= 200.13
##$BF2= 200.13
##$BF3= 200.13
##$BF4= 200.13
##$BF5= 200.13
##$BF6= 200.13
##$BF7= 200.13
##$BF8= 200.13
##$BYTORDA= 1
##$CFDGTYP= 0
##$CFRGTYP= 5
##$CHEMSTR= <none>
##$CNST= (0..31)
1 1 145 1 1 1 1 1 1 1 1 1 1 1 1 1 1 1 1 1 1 1 1 1 1 1 1 1 1 1 1 1 
##$CPDPRG= <>
##$CPDPRG1= <>
##$CPDPRG2= <>
##$CPDPRG3= <>
##$CPDPRG4= <mlev>
##$CPDPRG5= <mlev>
##$CPDPRG6= <mlev>
##$CPDPRG7= <mlev>
##$CPDPRG8= <mlev>
##$CPDPRGB= <>
##$CPDPRGT= <>
##$D= (0..31)
0 1.2 0 0 0 0 0 0 0 0.06 0 0.03 0 0 0 0 0.0002 0 0 0 0 0 0 0 0 0 0 0 0 
0 0 0 
##$DATE= 1712924658
##$DBL= (0..7)
120 120 120 120 120 120 120 120 
##$DBP= (0..7)
150 150 150 150 150 150 150 150 
##$DBP07= 0
##$DBPNAM0= <>
##$DBPNAM1= <>
##$DBPNAM2= <>
##$DBPNAM3= <>
##$DBPNAM4= <>
##$DBPNAM5= <>
##$DBPNAM6= <>
##$DBPNAM7= <>
##$DBPOAL= (0..7)
0.5 0.5 0.5 0.5 0.5 0.5 0.5 0.5 
##$DBPOFFS= (0..7)
0 0 0 0 0 0 0 0 
##$DE= 6
##$DECBNUC= <off>
##$DECIM= 32
##$DECNUC= <off>
##$DECSTAT= 4
##$DIGMOD= 1
##$DIGTYP= 9
##$DL= (0..7)
0 120 120 120 120 120 120 120 
##$DP= (0..7)
150 150 150 150 150 150 150 150 
##$DP07= 0
##$DPNAME0= <>
##$DPNAME1= <>
##$DPNAME2= <>
##$DPNAME3= <>
##$DPNAME4= <>
##$DPNAME5= <>
##$DPNAME6= <>
##$DPNAME7= <>
##$DPOAL= (0..7)
0.5 0.5 0.5 0.5 0.5 0.5 0.5 0.5 
##$DPOFFS= (0..7)
0 0 0 0 0 0 0 0 
##$DQDMODE= 0
##$DR= 18
##$DS= 0
##$DSLIST= <SSSSSSSSSSSSSSS>
##$DSPFIRM= 0
$$ [...]
##$SUBNAM2= <"">
##$SUBNAM3= <"">
##$SUBNAM4= <"">
##$SUBNAM5= <"">
##$SUBNAM6= <"">
##$SUBNAM7= <"">
##$SUBNAM8= <"">
##$SUBNAM9= <"">
##$SW= 18.0517689322627
##$SWIBOX= (0..15)
0 0 2 0 0 0 0 0 0 0 0 0 0 0 0 0 
##$SW_h= 3612.71676300578
##$TD= 16384
##$TD0= 1
##$TE= 0
##$TE2= 300
##$TE3= 300
##$TEG= 300
##$TL= (0..7)
0 120 120 120 120 120 120 120 
##$TP= (0..7)
150 150 150 150 150 150 150 150 
##$TP07= 0
##$TPNAME0= <>
##$TPNAME1= <>
##$TPNAME2= <>
##$TPNAME3= <>
##$TPNAME4= <>
##$TPNAME5= <>
##$TPNAME6= <>
##$TPNAME7= <>
##$TPOAL= (0..7)
0.5 0.5 0.5 0.5 0.5 0.5 0.5 0.5 
##$TPOFFS= (0..7)
0 0 0 0 0 0 0 0 
##$TUNHIN= 0
##$TUNHOUT= 0
##$TUNXOUT= 0
##$USERA1= <user>
##$USERA2= <user>
##$USERA3= <user>
##$USERA4= <user>
##$USERA5= <user>
##$V9= 5
##$VALIST= <valist>
##$VCLIST= <CCCCCCCCCCCCCCC>
##$VD= 0
##$VDLIST= <DDDDDDDDDDDDDDD>
##$VPLIST= <PPPPPPPPPPPPPPP>
##$VTLIST= <TTTTTTTTTTTTTTT>
##$WBST= 1024
##$WBSW= 4
##$XGAIN= (0..3)
0 0 0 0 
##$XL= 0
##$YL= 0
##$YMAX_a= 268268
##$YMIN_a= -275601
##$ZGOPTNS= <>
##$ZL1= 120
##$ZL2= 120
##$ZL3= 120
##$ZL4= 120
##$ABSF1= 10
##$ABSF2= 0
##$ABSG= 5
##$ABSL= 3
##$ALPHA= 0
##$AQORDER= 0
##$ASSFAC= 0
##$ASSFACI= 0
##$ASSFACX= 0
##$ASSWID= 0
##$AUNMP= <proc_1d>
##$AZFE= 0.1
##$AZFW= 0.1
##$BCFW= 1
##$BC_mod= 2
##$BYTORDP= 1
##$COROFFS= 0
##$CY= 11.3945322036743
##$DATMOD= 1
##$DC= 2
##$DFILT= <>
##$DTYPP= 0
##$F1P= 15.6554695791079
##$F2P= 12.8336369535428
##$FCOR= 0.5
##$FTSIZE= 0
##$FT_mod= 4
##$GAMMA= 1
##$GB= 0.15
##$INTBC= 1
##$INTSCL= 1
##$ISEN= 128
##$LB= 0.24
##$LEV0= 0
##$LPBIN= 0
##$MAXI= 10000
##$MC2= 0
##$MEAN= 0
##$ME_mod= 0
##$MI= 1.114404
##$NCOEF= 0
##$NC_proc= 0
##$NLEV= 6
##$NOISF1= 3.799351
##$NOISF2= 2.8
##$NSP= 1
##$NTH_PI= 0
##$NZP= 0
##$OFFSET= 15.70392
##$PC= 1
##$PHC0= -25380.79
##$PHC1= 8.38731
##$PH_mod= 1
##$PKNL= yes
##$PPARMOD= 0
##$PSCAL= 0
##$PSIGN= 0
##$REVERSE= no
##$SF= 200.130013532006
##$SI= 16384
##$SIGF1= 3
##$SIGF2= 2
##$SINO= 400
##$SIOLD= 16384
##$SREGLST= <1H.CDCl3>
##$SSB= 0
##$STSI= 0
##$STSR= 0
##$SW_p= 3612.71676300578
##$SYMM= 0
##$S_DEV= 0
##$TDeff= 0
##$TDoff= 0
##$TI= <>
##$TILT= no
##$TM1= 0
##$TM2= 0
##$TOPLEV= 0
##$USERP1= <user>
##$USERP2= <user>
##$USERP3= <user>
##$USERP4= <user>
##$USERP5= <user>
##$WDW= 1
##$XDIM= 8192
##$YMAX_p= 0
##$YMIN_p= 0
$$ End of Bruker specific parameters
$$ ---------------------------------
##NTUPLES= NMR FID
##VAR_NAME=  TIME,          FID/REAL,        FID/IMAG
##SYMBOL=    X,             R,               I
##VAR_TYPE=  INDEPENDENT,   DEPENDENT,       DEPENDENT
##VAR_FORM=  AFFN,          ASDF,            ASDF
##VAR_DIM=   8192,          8192,            8192
##UNITS=     SECONDS,       ARBITRARY UNITS, ARBITRARY UNITS
##FACTOR=    0.0002768,     1,               1
##FIRST=     0,             0,               0
##LAST=      2.2672688,     0,               0
##MIN=       0,             -275601,         0
##MAX=       2.2672688,     268268,          0
$$ Real data points
##PAGE= N=1
##DATA TABLE= (X++(R..R)), XYDATA
0@%%%%%%%%%%%%Qj6J6j6K4l2L2m0N6o4P2q8J04j20J41j65J92k21K50k85L25l65
34a92M09m65N25n86O57p36Q17r06J009j120J237j367J508j660J835k027K228k452
52a286K705k982L294l647M043m499N028n645O379p276Q397r843J1792j4569J8885
67A0776k6566M4336j60207m9016L62290Q6655k10579k97911K1385K74317K11005
78B66485j33829k86486r8793K24440K51670k1818k77736j78584J31541K86151
88A63041Q1240k14064k50350K4224K58721J77514j21863k60730q0104J97245K22091
99A96965k5854k39845j50959J23531K44711N9707j98368k12097L7129K39288J47713
110B21921j24447k40759o2219J89026K03768l0427k21798j35664J15607K18881
$$ plain form
0 0 0 0 0 0 0 0 0 0 0 0 0 0 8 -8 8 -8 16 -16 16 -24 32 -32 40 -48 56 -64 77 -88 104 -117 133 -152 173 -192
34 -192 217 -248 277 -309 348 -388 429 -477 532 -588 649 -718 790 -870 965 -1062 1166 -1286
52 -1286 1419 -1563 1731 -1916 2127 -2372 2656 -2989 3390 -3886 4511 -5332 6460 -8109 10776
67 10776 -15790 28546 -131661 -180677 181613 268268 57689 -240222 -218837 55480 266485
78 266485 132656 -153830 -252623 -28183 223487 201669 -76067 -254651 -123110 163041
88 163041 244281 30217 -220133 -195909 62812 240326 118463 -142267 -222371 -25126 196965
99 196965 171111 -68734 -219693 -96162 148549 208256 9888 -202209 -165080 74208 221921
110 221921 97474 -143285 -205504 -16478 187290 156863 -64935 -200599 -84992 133889
120A33889M8441j79930j82039M2874K13539J18550j23084k11970l9735J79693
130B28J76884m1372k04801j15235J12094J96153L7926j62093j56988M1985J84707
141F9488R5451j11696j78088k2409J60900J44583n0363j82762r0238J11834J74833
152A21533K3823j53120j39375M4182J68889Q2883j03448j57819j4832J45071J22373
163A40160n3562j62625o8879J11026J53697O447j48421j20297N4723J60338O8318
174A40925j04990j45584o701J36596J07665n3939j45306n4094J03737J30878n613
185A03574j35019r6597O1457J43332M8755j04582j28311M531J28928R3376n4933
196F4511j31847m4839R5084J13981r263j19209p9038O0142J24170L3054r9931
$$ plain form
120 133889 182330 2400 -179639 -136765 76774 195324 72240 -139730 -179465 228
130 228 177112 135740 -69061 -184296 -72202 123951 161877 -216 -157204 -115219 69488
141 69488 164939 53243 -124845 -147254 13646 158229 107866 -74896 -165134 -53300 121533
152 121533 145356 -7764 -147139 -102957 65932 148815 45367 -112452 -127284 17787 140160
163 140160 86598 -76027 -144906 -33880 119817 126264 -22157 -142454 -87731 72607 140925
174 140925 35935 -109649 -116350 20246 127911 73972 -71334 -125428 -21691 109187 103574
185 103574 -31445 -128042 -66585 76747 125502 20920 -107391 -102860 26068 119444 64511
196 64511 -67336 -112175 -17091 96890 87627 -31582 -110620 -50478 73692 106746 6815
207F815j09533J6527J22576P7855o2097j24758l4124R6661J06475j4607j15038
218c3248p1093O0411J14692K4819r5832r6078K4373J15093O2634o8153j15135
229g7517k0171R9285R6345k4125j13037o2307O3075J07844J9117r0658q5511K5778
241f1882J03040N0519o5049r8921r088R2498P9586l1910j04239m8499O6255R8922
253G1232J0595q8985p7825K8295R7161M4588o2280q9964m728Q6198O8884l5285
265D7886r6345l7404O9045R0983N32r0997p0913L5773R7664L9462o5785q8197
277f8296j828Q4767O4508l5626q9866l0980O6556Q0605o364q5947n8974M1246
289d0199R0817K8800o7997q0831M880Q2757N8043l6684q3819k6626O1938P1703
$$ plain form
207 6815 -102718 -86191 36385 114240 52143 -72615 -106739 -10078 96397 81790 -33248
218 -33248 -104341 -43930 70762 95581 -251 -96329 -71956 43137 105771 37618 -77517
229 -77517 -97688 1597 97942 73817 -39220 -101527 -38452 69392 88509 -2149 -87660 -61882
241 -61882 41158 91677 26628 -72293 -81381 11117 90703 58793 -45446 -93945 -27690 71232
253 71232 81827 -7158 -84983 -56688 40473 85061 22781 -67183 -71911 14287 83171 47886
265 47886 -48459 -85863 -16818 74165 74697 -16300 -87213 -51440 46224 85686 19901 -68296
277 -68296 -70124 14643 79151 43525 -46341 -77321 -10765 69840 63476 -22471 -81445 -40199
289 -40199 50618 79418 11421 -69410 -64530 18227 76270 39586 -44233 -70859 -8921 62782
301F2782q152p7013m8909M0746P9863J9338o6043p0297J2338Q0237M9825m1323
313C3392q1244k1593O3288O9074j0028p5005m5784L9970P4741J5394o3393o2704
325f3892J6997P6356M0934m5920p6677j3062O6564O4375j6274p5695m1697M2289
337b5702P2195J2653o0881n7182J7683O9401L3685m4240o6878n944O2840N4116
349F1746k1433p0755l3448M4265O7124Q164n9302n2903J7855O4685L0575m0672
361A5901n9987l884N6946M6195k2942o4172k5534M5615O1131J223o0581m8158
373e8247K3031O5349K7300m3375n9295j923N6570M3607k3678o0613k1075M5110
385g239N4962m228n8816m0707K7974O2511K0471m6227n5929K354N6328M0444k4078
$$ plain form
301 62782 54630 -22383 -71292 -30546 49317 68655 2612 -67685 -55347 24890 74715 33392
313 33392 -47852 -69445 -6157 62917 52889 -22116 -67900 -27930 46811 62205 -1188 -63892
325 -63892 -46895 29461 70395 24475 -52202 -65264 1300 65675 49401 -26294 -67991 -25702
337 -25702 46493 59146 -1735 -58917 -41234 28167 61852 17612 -49266 -55210 7630 61746
349 61746 40313 -30442 -63890 -19625 47499 55663 -3639 -56542 -38687 25998 56573 15901
361 15901 -44086 -47970 8976 55171 32229 -31943 -57477 -11862 49269 50492 -10089 -58247
373 -58247 -35216 30133 57433 14058 -45237 -47160 9410 53017 29339 -31274 -52349 -7239
385 -7239 47723 43495 -15321 -56028 -28054 34457 54928 8701 -47228 -44874 11454 51898 27820
398B7820n7051j8962M1390M8856m819n1826l3510K7015N4017J3711m4193m7902
410d5454P452N3866L4418k6834n4700j5585M1618M6699n633m9814l1281K6078
422a9170N0228J0941m2443m2773J0952N1958K8638l0720n2920j0169M5160M5156
434D4838r744n1893k9997K7861M9977J0067m1182m0049J1063M7689K4155k9817
446A2968m6614n122M3142L8281j3795m8980k4291K9620M6706O950m0115l7061
458c8311J1028M4093K1812k7032m1225l467L8634L2210j4974m4132j8525L0663
470i226M2674K237m1223l4364J4283M4958K0404k8470m1315l035L8112L0990j4869
483B1156m1687j5816L0272L8640j600m0513k9479J8248M3805J5790l1273l9782
$$ plain form
398 27820 -29231 -48193 -6803 42053 37234 -14592 -48102 -21087 32930 46641 2448 -45454
410 -45454 -38002 15864 50282 23448 -31252 -46837 -5219 41480 35847 -13967 -45248 -19170
422 -19170 31058 41999 -444 -43217 -32265 19693 48331 17611 -35309 -45478 -318 44838
434 44838 35094 -16799 -46796 -18935 31042 41109 -73 -40122 -29059 18630 42785 12968
446 12968 -33646 -38768 4374 42655 28860 -20120 -44411 -14791 31915 38865 -1250 -38311
458 -38311 -27283 16810 38622 11590 -29635 -33102 5532 37742 22768 -21364 -39889 -9226
470 -9226 33448 35685 -5538 -39902 -25619 19339 39743 11273 -30042 -33077 5035 36025 21156
483 21156 -20531 -36347 -6075 32565 30965 -9548 -39027 -20779 23026 38816 7543 -32239
495c2239L8L8758K9332j5451l9787j4412K8023L4524k282l5873k4225J7964L7985
508B2355J0771l0156l4244L660L7173K5319j7000l8052j2587K7385L2846k034
520B5436l3361k2542J6289L4212Q799k7988k9789O183L5181K0651j9949l6495
532b3373q264L0179L1685n384l5271k1530J8109L4449P779k7860k7948P105L2955
545A2631J7146k0446l2687m084L0007K7322r005l4367j7798K0073L2894N764k7365
558H5k6174O737L0124J5604j7862k8273k962K6040K2238r743l0010j3022K0477
571f741K9167K102k7663k3697R014L0300J4291j8745k7949k409K5556K1030j0001
584A4255k8326j0753K0819K6608j126k8170k0645J2646L0745J1324k1790k8077
$$ plain form
495 -32239 -32201 6557 35889 20438 -19349 -33761 -5738 28786 26504 -9369 -33594 -15630 22355
508 22355 33126 2970 -31274 -27614 9559 34878 17878 -20174 -32761 -5376 27470 25436
520 25436 -7925 -30467 -14178 20034 28833 845 -28944 -22761 12420 33071 13122 -23373
532 -23373 -31637 -1458 30227 24843 -10428 -31958 -13849 20600 28379 519 -27429 -20324 12631
545 12631 29777 9331 -23356 -27440 2567 29889 20884 -13483 -31281 -11208 21686 27450 85
558 85 -26089 -19352 10772 26376 8514 -19759 -22721 3319 25557 15814 -14196 -27218 -6741
571 -6741 22426 24528 -3135 -26832 -17818 12482 26773 8028 -19921 -22330 3226 24256 14255
584 14255 -14071 -24824 -4005 22603 21477 -6693 -27338 -14692 16053 27377 5587 -22490
596b2490k85K7088K0740j0576k7826j0196J9534K4154j661k5195j6895J2789K6732
609A5913P411k1355k4042K682K6117J7711j1921k6527q740J9054K2713j577k3160
622e721j5338J1595K3678N703j9790k0636M710K4854J4413j4265k5894n831K1444
635a078K2543l764k5004j5331J2808K4422N502j9847j9837N260K3676J2096j5022
648F424k3596k654K1991J9743o816k5101j2820J4765K3962M025k0051j8920N169
661a3879K1984J1044j3316k0508j785J9221J6113p394k2075r498J5073K1466J672
674A8118k0156j7454O245K1917J0694j3184k0217k112J8164J5270o906k0332p913
687a7866J4855J9303o29k0371j5153Q984K2400Q514j5713k0611m50J9730J5298
$$ plain form
596 -22490 -22775 4313 25053 14477 -13349 -23545 -4011 20143 18482 -6713 -23608 -10819 15913
609 15913 23324 1969 -22073 -19391 6726 24437 12516 -14011 -22751 -3697 19016 17439 -5721
622 -5721 -21059 -9464 14214 19917 127 -20509 -15799 9055 23468 9203 -16691 -22522 -1078
635 -1078 21465 17701 -7303 -22634 -9826 14596 20098 251 -19586 -14326 9350 21446 6424
648 6424 -17172 -19826 2165 21908 15092 -10009 -22829 -8064 15898 19923 -128 -19048 -13879
661 -13879 8105 19149 5833 -14675 -16460 2761 18874 11480 -10595 -20093 -5020 16446 18118
674 18118 -2038 -19492 -13247 8670 19364 6180 -14037 -16149 2015 17285 10379 -9953 -17866
687 -17866 -3011 16292 15663 -4708 -19861 -10877 11523 20037 4324 -16287 -16737 2993 18291
700A8291p679k0427p490J4470J7824j343j8817j2551R620K0081N633j5993j8171
713a6552J774J9480J3500q499j9708o880J3678J6819o52j6639j1440P977J7071
726I929M481j3970j4982K968J7729J0664r819j8556m691J4965J6319k125j7630
739d718j1276Q717J7394M209j3989j4281L591J7037Q900j0802j7302k175J6056
752A361J4746m699j8493r798J0540J7726L397j4437j4077L381J5943Q297r432
765D455j4933j499J3804J1774n142j5918p061J0640J5497J502j4213j2630M108
778i616J5430P766r043j4172j652J2602J0725m799j4285n594J0537J3734m17j4551
792c335j0950O300J6120O313j1107j4900n67J4053J1094n335j4613n430J0354
$$ plain form
700 18291 10612 -9815 -17305 -2835 14989 13646 -5171 -17722 -8102 11979 17612 1619 -16552
713 -16552 -14778 4702 18202 9703 -10005 -16885 -3207 13612 12960 -3679 -15119 -7142 9929
726 9929 14410 440 -14542 -11574 6155 16819 7000 -11556 -16247 -1282 15037 12912 -4718
739 -4718 -15994 -7277 10117 14326 337 -13944 -10353 6684 15584 4782 -12520 -14695 1361
752 1361 16107 11408 -7085 -16883 -6343 11383 14780 343 -13734 -10353 5590 13887 4455
765 4455 -10478 -11977 1827 13601 8459 -7459 -14520 -3880 11617 13119 -1094 -13724 -9616
778 -9616 5814 13580 4537 -9635 -11287 1315 12040 7241 -7044 -12638 -2101 11633 11216 -3335
792 -3335 -14285 -7985 8135 14448 3341 -11559 -12126 1927 13021 7686 -6927 -12357 -2003
805b003J2807j054j3611q998P124J4598L958j1755j3194J439J4226R704o313j4248
819g320m787R984J1991p54j2028p966O045J2263K895j0313j0713K425J2908P615
833A2245p209j3433l389J0761J1765j423j2551q116O107J2343L017r916j0123
846i922K659J2180O260p893j2456j415J1771J0639l595j3538p025P897J2938K219
860A0719j0770j0139K872J1834N755p407j1028o23J0637Q594m324j2103n033Q309
874b707J1627R16j0775r368L187J1465N648o714j0349j086R195P679l622j0321
888e225l862P749R875m72j0637p837M744J1725M422q219j0746j81J0315P880m206
903E325j0711l609P968R340j271j0444o455N823J1168K651r300j0009J405J1063
$$ plain form
805 -2003 10804 9750 -3861 -12859 -5735 8863 12821 1066 -12128 -10689 3537 13241 6928 -7320
819 -7320 -12107 -2123 9868 9114 -2914 -10880 -4835 7428 10323 10 -10703 -8278 4630 12245
833 12245 5036 -8397 -11786 -1025 10740 9317 -3234 -11350 -5243 7100 10117 201 -9922
846 -9922 -7263 4917 11177 3284 -9172 -10587 1184 11823 8228 -5310 -12335 -4438 8500 10719
860 10719 -51 -10190 -7318 4516 10271 2864 -8164 -8787 1850 10444 6120 -5983 -11016 -2707
874 -2707 8920 9836 -939 -10307 -7120 4345 9993 3279 -7070 -8156 1039 8718 5096 -5225
888 -5225 -9087 -1338 8537 8065 -2572 -10409 -5665 6060 10482 2263 -8483 -8664 1651 9531 5325
903 5325 -5386 -8995 -1027 8313 7042 -3402 -9857 -4034 7134 9785 485 -9524 -8119 2944
917B944P265n085j0915l429P807R011q41r200n804M825R221J888p936p922K097
932f074R755N512n600r980k295Q110Q578j275r289n748M712R021J886p519p289
947g495K354R192M387o285r372p52R136P995l000j0454n199O269R889J467q422
962b90p638K510R174M129o021q442q8Q478O456l768r503l574O807Q964K94q580
978a092o978K870Q910L959n522p847l79P336N639l262q056k645O352P602p08q423
994b244n955L891R140L314o497q300j7Q045N988l390q273k634O324P191j223q256
1010b896m919M844Q812J849p563p833J429Q919N554m377q732k376O561P094j139
1025E227p635m408M359P572J175o806o409K030Q160M352m773q186j754O689O921
$$ plain form
917 2944 10209 5124 -5791 -9220 -1413 7598 6757 -2443 -8247 -3422 5799 7687 -249 -8171 -6074
932 -6074 3681 9193 3593 -6387 -8682 -572 8006 6731 -2558 -8306 -3594 5427 7313 -206 -7495
947 -7495 -5141 4051 8438 2153 -7219 -7971 1165 9160 6160 -4294 -9493 -3224 6665 8132 -290
962 -290 -7928 -5418 3756 7885 1864 -6578 -6666 1812 8268 4500 -5003 -8577 -1770 7194 7488 -1092
978 -1092 -8070 -5200 3710 7669 2147 -5700 -6079 1257 6896 3634 -4422 -7067 -715 6887 6179 -2244
994 -2244 -8199 -4308 4832 8146 1649 -6651 -6668 1377 7365 3975 -4298 -6932 -608 6583 5360 -2896
1010 -2896 -7815 -2971 5841 7690 127 -7706 -6277 2642 8196 3819 -4913 -7289 -728 6366 5227
1025 5227 -2408 -6816 -2457 5115 6290 -516 -6925 -4895 3265 7617 2844 -5342 -7096 -407 6514
1040F514j114p487m576L799P175J479n979n768J868P302L466m990p409n93P252
1055I39O304k399q249m101N001P848J089o792o053K167P468L238n080o923N2P126
1071A635N328l203p971l009N699P531L04p156n885K319P384L371m481o500m36
1086e070N950M702k505o547k289N000O176l60o643m896K901P210K814m952o583
1101e092k11O229M825k526o528k170M929N775q69o591m040L761P142J677o013
1116B98o482R54P186M682l375p097k124N202N828p49o148l703L420O158J074n446
1132c22n240J523O532L616l704o546j543N228N553p45n899l686K926N660J243
1147D596m657m598J388N742K844l814n920o96N639N163j654o479l479L698O242
$$ plain form
1040 6514 5400 -2087 -6663 -2864 4311 5790 -189 -5957 -4089 3213 6679 1689 -5720 -6313 939
1055 939 7243 4844 -3405 -7506 -2505 5343 6432 -360 -6413 -4246 3222 6460 1380 -5543 -5491 1635
1071 1635 6963 3760 -4211 -7220 -1521 6010 6314 -842 -6727 -4408 2976 6347 1866 -4634 -5070
1086 -5070 880 5582 3077 -3470 -5759 -759 5417 5057 -1586 -6482 -3581 3629 6443 1491 -5092
1101 -5092 -5303 926 5751 3225 -3303 -5473 -544 5231 4362 -2229 -6269 -2508 4634 6311 298
1116 298 -6184 -5230 1956 6638 3263 -3834 -5958 -756 5072 4323 -1825 -5528 -2108 4050 5124 -322
1132 -322 -5562 -4039 2493 6109 2405 -4141 -5684 -456 5097 4352 -1547 -5233 -2307 3353 4596
1147 4596 -61 -4659 -3271 2471 5315 1501 -4419 -5115 524 5687 4033 -2446 -5925 -2227 4015
1162D015J134n184m915J476N847K706l865n529r5N606M321k461o366k475M512
1177a273O047K81n708m726J854N956K670l672n234k57M897L765k123n356j861
1192d740M115N091k51n424m060K229N863K423l855n341l88M883L968j814n142
1207b443j918L761M635n17n140l326K818N679J489m681n209O10N704L820k637
1222B645n719j739M219M760o36n102l041K882N185R21m606m508J244N558L163
1237E226l070n584j430M334M760m68m904l228K273M750J227l743l928R31M672
1252A818K527k914m873p97M415M306j076n182k988K779N074J114m083m067J024
1267b923M756K378l088m633k56M613L782j887n361k320L646N206N04m726m179
$$ plain form
1162 4015 5149 -35 -4950 -3474 2373 5079 1214 -4315 -4410 1196 5517 3056 -3310 -5785 -1273
1177 -1273 4774 5055 -653 -5379 -3525 2431 5101 1429 -3805 -4062 835 4600 2477 -2879 -4740
1192 -4740 -625 4466 4215 -1209 -5269 -3040 2823 5246 1391 -3950 -4338 545 4513 2699 -2443
1207 -2443 -4361 -600 4035 3518 -1622 -4948 -2130 3549 5038 357 -4852 -4242 1462 5282 2645
1222 2645 -3074 -4813 -594 4166 3530 -1572 -4613 -1731 3454 4375 -231 -4739 -3495 2063 5226
1237 5226 2156 -3428 -4858 -524 4236 3768 -1136 -4364 -2091 2659 3886 143 -3785 -2854 1818
1252 1818 4345 1431 -3442 -4239 176 4482 3406 -1776 -4764 -1985 3089 4203 120 -3947 -2923
1267 -2923 1833 4211 1123 -3510 -3766 847 4629 2742 -2619 -4939 -1293 3913 4417 -309 -4488
1282d488J330N039K488k941m523m57M043L387j581m538j826L284M381M7m396l563
1298d314J580M832K262k970m493n88L884L465j236m232j854K912L962r7m153l040
1314d080K007M746J628l605m505M9M569L507j766m742j855L183M139j04m145k818
1330c792K059M359J129l641l913O75M555K889k277m691j479L430M103j37m021
1345g52k903J712M023J269l017l455M95L916K418k176m195j055L469L857m41m217
1361a052k869J880M270J403l082l606L69L798K330k140l899o44L553L344j130
1376B525m355k235K678M372P61l722l646Q28M135K313k273l892o09L353L037j134
1392B136l901j792K645L881L68l680l304J045M122K271k257l953q79L125L148
$$ plain form
1282 -4488 -3158 1881 4369 1428 -3095 -3552 491 3878 2297 -2241 -4067 -783 3598 3645 -751 -4314
1298 -4314 -2734 2098 4360 1390 -3103 -3691 193 3658 2422 -1810 -3664 -752 3210 3113 -1040 -4080
1314 -4080 -2073 2673 4301 696 -3809 -3760 809 4316 2550 -2192 -4047 -864 3275 3171 -974 -3792
1330 -3792 -1733 2626 3755 114 -3799 -3124 1431 4320 2043 -2648 -4127 -697 3406 3269 -752
1345 -752 -3655 -1943 2080 3349 332 -3123 -2628 1288 3706 1530 -2665 -3720 -251 3606 3165 -1052
1361 -1052 -3921 -2041 2229 3632 550 -3056 -2687 1111 3441 1301 -2598 -3242 311 3655 2525
1376 2525 -1830 -4065 -1387 2985 3746 24 -3622 -2794 1341 3654 1381 -2511 -3120 233 3270 2136
1392 2136 -1765 -3557 -912 2969 3337 -343 -3647 -2602 1520 3791 1534 -2419 -3298 -173 2975
1407B975o61l515j884K119L408L40l257k821J281L882J732k665l846l50L588L124
1423C450j114l899j848K426L557J88l357k592J509L740J223k930l519K87L837
1438I58K767j682m107j574K760L680K03l380k715J197L470J374k391l092J18L228
1454H14K309j553l590j203K705L381k8l406k660J256L577J477k363l139J4L079
1470F70K183j526l323q58K797L045o04l610k232J947L783J063k948l320L28L453
1486H48K255j650l359q35K672K749o49l283j778K010L366N81k980k950O28L439
1502A064K106j699l366r63K505K798l63k953j784J621K980N30k643k579P81L269
1518A304J793j967l393o73K840K899n64l224j885J745L067N19k638k387R38L110
$$ plain form
1407 2975 2314 -1201 -3085 -966 2442 2782 -475 -3296 -2015 1867 3599 934 -2912 -3262 326 3450
1423 3450 2336 -1563 -3411 -985 2572 2760 -597 -3189 -1680 2060 3283 353 -3166 -2879 958
1438 958 3725 2043 -2064 -3638 -878 2802 3005 -375 -3090 -1893 1577 2951 560 -2532 -2414 814
1454 814 3123 1570 -2020 -3223 -518 2863 2835 -571 -3231 -1975 1602 3079 716 -2423 -2409 670
1470 670 2853 1327 -1996 -2854 -57 2988 2384 -1226 -3458 -1511 2272 3335 387 -2933 -2605 848
1486 848 3103 1453 -1906 -2741 -69 2680 2031 -1252 -3030 -1020 2346 2927 -53 -3003 -2375 1064
1502 1064 3170 1471 -1895 -2858 -353 2445 2082 -871 -2655 -1034 1946 2476 -167 -2746 -1965 1304
1518 1304 3097 1130 -2263 -2936 -96 2803 2239 -985 -2870 -1125 1942 2461 -177 -2564 -1626 1484
1534A484J322k240l063m2L120K486j192l431j525K182L177L22k818k413R31L000
1550A300J284k031k748NK803K126j232l168j236K252L068J87k918k475R04L094
1566A215J502j863k808k51K568K075j073k865j017K241K707k37l000k104J420
1581a490L275J100k378k928J00K920K056j310k957q49K305K525n09k927j700J707
1597a060L110O65k628k774M22L111K036j425l078j020K192K618j57k663j764J337
1613a078K737O71k296k430N07K883J767j577l022q20K394K665k95k829j819J380
1629a162K792O40k294k273O63K819J395j873k869k84K731K450q47l121j610J808
1645a035K980N25k468k344O37K738J370j690k597k13K474K094r31k873j299J874
$$ plain form
1534 1484 2806 566 -2497 -2539 581 3067 1875 -1556 -3081 -899 2278 2600 -218 -2631 -1700 1300
1550 1300 2584 553 -2195 -2190 613 2739 1507 -1661 -2897 -645 2423 2610 -308 -2783 -1879 1215
1566 1215 2717 854 -1954 -2205 363 2438 1365 -1500 -2517 -276 2431 2194 -806 -2910 -1490
1581 -1490 1785 2885 507 -2421 -2321 599 2655 1345 -1612 -2461 -156 2369 1860 -1067 -2767 -1060
1597 -1060 2050 2715 87 -2687 -2265 846 2882 1457 -1621 -2641 -449 2169 2012 -651 -2415 -1078
1613 -1078 1659 2330 34 -2396 -1889 994 2761 1184 -1838 -2658 -264 2401 2106 -723 -2542 -1162
1629 -1162 1630 2270 -24 -2297 -1634 1185 2580 707 -2162 -2446 285 2735 1888 -1233 -2843 -1035
1645 -1035 1945 2470 2 -2342 -1705 1033 2403 713 -1884 -2097 377 2471 1540 -1333 -2632 -758
1661g58K821L63k513k347O28K755J496j538k583m03K229K029p89k605j126J847
1677d94K555P4k602k126J007K918J298j897k719k45K474K041q57k631j022J856
1693c70K329j57k502j675J282K731P87k151k506J86K638J888j113k697r68J841
1709d57K331q2k313j603J101K432P02j973k227L18K527J682j247k689q93J965
1725d26K414m1k383j741J009K411P61j825k049L56K345J358j405k462m30K200
1741I2K134n31k586j466J412K517N25k036k018N00K316J203j450k242k01K122
1757B91J846p64k502j197J605K468L73k143k069M70K368J351j253k238m21J871
1773E6J772n72k201j040J477K187J55k115j833P40K419J150j505k292k55K031
$$ plain form
1661 -758 2063 2426 -87 -2434 -1806 949 2445 907 -1676 -2079 150 2179 1390 -1215 -2341 -494
1677 -494 2061 2135 -467 -2593 -1586 1332 2630 733 -1986 -2231 243 2284 1427 -1204 -2226 -370
1693 -370 1959 1802 -700 -2375 -1093 1638 2425 274 -2232 -2046 592 2480 1367 -1330 -2298 -457
1709 -457 1874 1792 -521 -2124 -1023 1409 2111 138 -2089 -1771 756 2438 1191 -1498 -2391 -426
1725 -426 1988 1947 -436 -2177 -1168 1243 2004 179 -1870 -1514 831 2189 784 -1678 -2108 92
1741 92 2226 1695 -891 -2357 -945 1572 2097 61 -1957 -1457 859 2062 612 -1630 -1831 291
1757 291 2137 1373 -1129 -2326 -721 1747 2120 -23 -2092 -1622 746 2097 844 -1394 -1815 56
1773 56 1828 1256 -945 -1985 -508 1679 1834 -281 -2114 -1374 1045 2195 690 -1602 -1857 174
1789A74J745o85k222q85J538K013j12k141j493J076K370P42j853k191J09K265
1805D50J675r04k333q84J566K012j3j978j417R13K097O32j657j913K16K143J452
1822B057j005k274p97J643K051j2k003j489Q28K055O80j545j789K67K008J222
1838A897j151k146m74J840J921l56k208j371J129K184N56j674j787L29J953J090
1854A732j147j927k49J785J601o08k105j043J327K094L36j798j742M14J990J115
1870A775j077j880l43J599J515n10j886r27J256J911J94j813j636N51K070J100
1886A899j217j988l50J653J577m73j830q67J199J726L1j741j311P96J968O89j456
1903C05j864L6J871J409p17j925p62J312J676l2j663j195Q08J779N22j435j643
$$ plain form
1789 174 1919 1234 -988 -1873 -335 1678 1566 -575 -2068 -992 1378 2120 267 -1924 -1815 450
1805 450 2125 1221 -1112 -1996 -430 1582 1569 -409 -1826 -913 1184 1816 159 -1754 -1538 605 2057
1822 2057 1052 -1222 -2019 -376 1675 1663 -340 -1829 -1001 1054 1734 189 -1600 -1333 675 1897
1838 1897 746 -1400 -1874 -34 1887 1531 -677 -2048 -919 1265 1821 147 -1640 -1311 642 1732
1854 1732 585 -1342 -1591 194 1795 1187 -918 -1961 -634 1460 1796 -2 -1744 -1330 660 1775
1870 1775 698 -1182 -1525 74 1589 1079 -807 -1734 -478 1433 1627 -186 -1822 -1271 799 1899
1886 1899 682 -1306 -1656 -3 1574 1101 -729 -1596 -397 1329 1360 -381 -1692 -896 1072 1761 305
1903 305 -1559 -1523 348 1757 1040 -885 -1647 -335 1341 1309 -354 -1549 -741 1038 1560 125 -1518
1920a518J83J839J268q38j950p26J352J773M4j664j302O46J722O19j231j520J43
1937a160J655J068q85j794m52J480J607k15j802j161Q78J804M95j374j487K64
1953a079J641R11r79j635k06J526J384n18j817r09J120J804L08j528j519L23J688
1970E15R89q94j598l27J349J290l90j609p88J039J606J91j497j387M30J735R22
1987A576r71j660l10J373J329l86j546p56J003J495M6j472j181O30J706O72j206
2004C42j627o6J564J271n44j642p15J045J468M4j406j045O23J529M80j177j411
2021a267J21J517J097o64j631o32J119J496N9j393j113N36J460N56j043j316R0
2038a008J391R78p05j554m80J203J455q4j507j096O28J545N42j070j302O9J344
$$ plain form
1920 -1518 -1335 504 1772 934 -1016 -1742 -390 1383 1427 -237 -1539 -893 829 1448 217 -1303 -1160
1937 -1160 495 1563 678 -1116 -1568 -88 1519 1304 -498 -1659 -781 1023 1518 144 -1343 -1079
1953 -1079 562 1473 494 -1141 -1347 179 1563 1045 -772 -1681 -561 1243 1551 23 -1496 -1173 515
1970 515 1504 610 -988 -1315 34 1324 934 -675 -1463 -424 1182 1373 -124 -1511 -1081 654 1576
1987 1576 605 -1055 -1365 8 1337 951 -595 -1351 -348 1147 1193 -279 -1460 -830 876 1548 342
2004 342 -1285 -1351 213 1484 940 -702 -1417 -372 1096 1140 -266 -1311 -688 841 1321 144 -1267
2021 -1267 -1146 371 1468 804 -827 -1459 -340 1156 1215 -178 -1291 -755 705 1261 218 -1098 -1008
2038 -1008 383 1361 656 -898 -1378 -175 1280 1196 -311 -1407 -779 766 1308 238 -1064 -995 349
2055C49Q76p16j380l08J206J213l31j473q19Q29J502L41j217j261K04J396Q29
2072A240p27j320k72J110J099l26j345p00Q50J398K00j245j207K92J441Q49p56
2089E81j392l73J098J142k03j263p20P45J250J40j150j016M27J365O25r14j346
2106a004j29J229J082l89j325o27Q47J198O0j145q79N12J265M33r86j190O8J285
2124C05R53n40j380n66R20J252Q7j144r47L90J217M97q32j095J1J150Q24n41j266
2143g05m47R65J203l6j201r42N02J273M69q62j114O5J117P58n96j182k64J014
2161A7J062k54j260p57O98J306L27j027j113J31J191P42n84j149k73R42R38k42
2179F95j149o16P15J181J91j047j047K39J242P30o38j208l01R42J004k01j102
$$ plain form
2055 349 1225 509 -871 -1179 27 1240 909 -564 -1383 -554 948 1289 72 -1189 -985 411 1240
2072 1240 513 -807 -1079 31 1130 804 -541 -1241 -391 1007 1207 -38 -1245 -953 488 1337 581
2089 581 -811 -1184 -86 1056 853 -410 -1130 -385 865 1005 -145 -1161 -734 631 1256 342 -1004
2106 -1004 -1133 96 1178 789 -536 -1163 -316 882 942 -203 -1082 -570 695 1128 142 -1048 -980 305
2124 305 1258 718 -662 -1228 -308 944 1031 -113 -1060 -670 547 1044 212 -883 -872 278 1102 561 -705
2143 -705 -1152 -187 1016 980 -221 -1163 -661 612 1081 219 -895 -830 287 1045 449 -733 -997 17
2161 17 1079 825 -435 -1192 -494 812 1139 112 -1001 -870 321 1063 479 -670 -943 -1 937 695
2179 695 -454 -1070 -355 826 1017 -30 -1077 -838 404 1134 496 -712 -1013 -71 933 732 -370
2196c70o31O63J105J53j028r22L40J223O18p59j235j91J064J009k64j170o32O78
2214c49J094J27r70q29L61J110M59q13j085J5J076Q59m02j206n20P61J105J06
2232H99r92q51L46J087M43p43r91LJ034P69m49j164m52Q21J137N4j071q87L54
2251f53J136N22p19j020n4R67P25m23j051l31Q21R64j14j072p23N31J128L48q40
2270A42r99P2J025O66m72j017k65Q27Q50j75j028n82O05J070K30r19r72J70J084
2289C12P00n21j075l25Q05R05j14r54o02N27R72J96q38q61K40J037N76o14j058
2308f92k13Q74Q94j82j001n75N53R50J60q46p40L01R76M31o80r70m1R46Q08l35
2328F18j055n10O46R92J22q59p58K80R33M05o20q68j7Q79O81l86r87l97O96R62
$$ plain form
2196 -370 -1001 -338 767 920 -108 -1030 -690 533 1151 392 -843 -1034 30 1039 775 -395 -1027 -349
2214 -349 745 872 -98 -927 -566 544 1003 190 -895 -880 196 1055 653 -553 -1073 -312 793 899
2232 899 -93 -944 -598 489 932 189 -802 -799 235 1004 555 -609 -1061 -240 897 951 -120 -1007 -653
2251 -653 483 1005 286 -734 -788 179 904 481 -570 -901 -80 884 770 -302 -1025 -494 634 982 142
2270 142 -857 -785 240 906 434 -583 -848 -21 829 654 -374 -956 -351 719 949 30 -942 -772 312
2289 312 1012 491 -584 -909 -104 801 687 -267 -869 -342 630 826 -12 -873 -633 404 980 366 -692
2308 -692 -905 -31 863 681 -320 -895 -342 608 768 -78 -818 -517 459 890 210 -760 -801 145 953 618
2328 618 -437 -947 -301 691 813 -46 -804 -524 409 814 194 -674 -691 188 869 483 -504 -901 -205 757
2348G57M4r25p53L13R95M24o40q75l3Q42O53l87r50k95P39Q92j04r58o66M60J011
2369E44L52p32q98L5Q90O32m10q94k53P08P74j63q90n21N29R14K01p95q27J47
2389f57R45N76m76r23k48P23P70j38q58n00N03Q91J23p87p56K35R54N10n56r46
2409f15k02P93Q11j68r03m98M92Q45J36p43o65K58Q76L74o07q55k5Q47O78l21
2429E08r18l93N87Q40N8p81o36L10Q31L08o02p59L1Q25N87l91q97l25O76Q51j4
2450F96q25o60L10Q89L46n72p80%P71N50l65q20k44O68P51j09q37n54M23Q57K74
2471G69o68p63Q8P88M92m04p90j66O69O59j96q29m14N22Q33J32p54p24J92Q64
2491C00M69m54q07j86O65O59j62p68l93M83P49Q4p26o13K42Q36L92n29q06j14
$$ plain form
2348 757 801 -124 -877 -564 431 855 215 -660 -693 149 802 415 -535 -830 -91 801 697 -261 -927 -467 544
2369 544 896 164 -734 -699 191 823 413 -481 -734 -26 748 585 -305 -826 -297 617 818 23 -804 -657
2389 -657 288 864 388 -535 -783 -60 710 572 -286 -786 -283 608 731 -56 -812 -577 377 887 331 -615
2409 -615 -817 -24 787 619 -284 -782 -290 555 691 -52 -717 -459 417 791 184 -671 -696 151 829 508
2429 508 -410 -803 -216 624 682 -99 -735 -425 406 714 112 -647 -616 209 796 405 -492 -817 -141 710 696
2450 696 -129 -789 -479 410 756 184 -596 -596 175 725 360 -460 -704 -36 715 606 -231 -785 -362 495 769
2471 769 101 -662 -574 214 706 302 -488 -654 15 674 478 -351 -765 -243 590 722 -32 -756 -564 300
2491 300 769 315 -492 -678 -13 646 484 -284 -677 -194 555 639 -87 -700 -458 378 770 241 -565 -679
2511f79P27O54k08p98l96M99P30M6o95n56K80Q14K93o01p62J3P95O09l27q47l36
2532g45N68P49J9p03n40K89P64K59n82o64O9P58M82l84q02k25O17P12m9p60n36
2553g04L47P68K54n88o55O9P28M45l90p60j69O51O75j30q05m92M23Q04K13o13
2573G1o89R8P29M54l84p29j30O14N90j98p41l51M74P44Q5o72o16J84P74L85m46
2594B46p22j02O27N51k14p05l14M75O79L6o76n70K66P72L57n16p38q0O60N90j90
2615D32p15l31M22O63M3o16m94K74O89K50n16o51K1O85N03k75p36k73N13O41k1
2636E08o29m54K91O58J89n29n78J03O63M06l59p05j90N65O36o9o85m35K99O63
2656C48K03m81n78R1O23L58l46o24j32N74N38j45o52l92L65O85J37n39n53J12
$$ plain form
2511 -679 48 702 494 -304 -700 -201 529 575 -120 -676 -396 418 711 110 -652 -639 156 765 438 -409 -745
2532 -745 -177 572 591 -112 -652 -363 401 660 78 -586 -517 241 723 339 -463 -688 -71 641 592 -168 -704
2553 -704 -357 411 665 77 -578 -509 219 664 274 -486 -655 -4 671 541 -264 -756 -333 471 684 71
2573 71 -618 -520 209 663 279 -450 -580 34 624 426 -315 -666 -192 552 637 -35 -651 -467 307 692 246
2594 246 -476 -578 49 600 386 -319 -633 -158 521 557 -119 -689 -423 349 706 190 -548 -628 32 622 432
2615 432 -283 -614 -192 471 514 -102 -596 -322 367 617 101 -550 -529 156 659 384 -352 -625 -112 529 508
2636 508 -121 -575 -284 374 563 34 -544 -441 222 628 269 -436 -626 -61 575 506 -179 -614 -315 348
2656 348 551 70 -508 -417 206 564 218 -406 -538 36 574 429 -223 -615 -250 435 572 33 -520 -408
2676d08O27L46l72n98p5N44M86j96o62k82M35O36N5o02n27J87O67L20l89o20o7
2697d95N51M51j92n96k42M22N64j7n62m45K56O43K43m49n93j8N71M47k12o06k45
2718e24M37N33k4n54l98K84O02J88m92n71M9O33M18k94o31k20M55N64l7n51l72
2739e05K61N85J30m65m91J14N83L43l45o10j19N09N21r8n88l59L18N80J33m84
2759A3m71J28N64K86l62n51q9N34M88j63o23l15L58N93J11m90m88J06N55L03l33
2780A54n21n4M81M17j82n59k45L95N51K4n22m39J80N69K65l67n32k9M98L80j96
2801B68n32j98M08M93k8n36l82K38N77K10m14n17k6N14L93j92n28k03L63M68j8
2822C58m91l35K48N29J57m31m64L9N35L57k54n31j83L98M74l9m83l13K46N06J10
$$ plain form
2676 -408 219 565 193 -405 -480 64 550 354 -308 -590 -155 481 536 -66 -593 -406 261 581 192 -428 -495
2697 -495 56 507 315 -281 -523 -101 463 446 -116 -561 -305 338 581 132 -461 -479 92 539 327 -279 -524
2718 -524 -87 446 422 -132 -530 -246 356 544 52 -519 -470 163 581 287 -344 -564 -109 455 418 -133 -505
2739 -505 -244 341 471 6 -485 -371 212 555 210 -400 -519 -10 511 413 -175 -534 -216 364 497 13
2759 13 -458 -330 234 520 158 -393 -482 52 540 377 -246 -561 -203 390 501 11 -477 -371 184 487 154
2780 154 -367 -421 60 477 295 -264 -509 -114 437 461 -61 -500 -320 249 514 147 -385 -414 84 464 268
2801 268 -264 -462 -54 439 411 -125 -507 -269 308 518 104 -413 -439 75 468 276 -252 -455 -92 376 358
2822 358 -133 -468 -220 309 466 35 -429 -390 145 502 248 -283 -466 -68 406 367 -116 -429 -183 323 433
2843D33m26m30J03N20K89k96n39j14M40M63q3n11l18K71M96J08m00m04R2M69K58
2864D21l00m67o3M38M08j32n06k70L10M93Q9m28l99J00M89K50k96m58m2M38L57
2885D32j62n03k10L36M83L6m58l89J39M98K29k96m58m0M13L44j73m45j70L16M29
2906C51k4m44l15K06M82J70l39m40j6M46L42j83m45j80L43L97l1m24k99K10M79
2927B86J43l71m34K9M76L15k05m86j66L41M03mm26k81J91M36J18l51l78P7M38
2948A51K57k35m58j28L81M05n4m38k85K32M29J02l39l60Q6M19K32k60m31p5L93
2969B4L86r7m74k59K57M51J08l74l69N3M18K48k38m05o4L54L35j11m30k11K73
2990a25M24N9l84l66J19M38K33k73m08m7L67L16j20m16j82L02L92J4m01l20J38
$$ plain form
2843 433 7 -423 -320 200 489 193 -346 -460 -20 443 360 -151 -469 -198 298 406 6 -398 -306 163 421
2864 421 121 -346 -409 29 437 305 -201 -471 -161 332 421 -7 -406 -306 183 433 137 -321 -363 75 432
2885 432 270 -233 -443 -107 376 412 -46 -435 -296 202 431 135 -323 -363 50 394 221 -224 -394 -78 351
2906 351 327 -117 -432 -226 256 426 87 -353 -369 77 419 236 -209 -389 -46 351 320 -104 -403 -193 286
2927 286 429 58 -376 -347 129 444 239 -247 -413 -72 331 327 -99 -380 -189 247 365 14 -364 -287 151
2948 151 408 173 -285 -413 -32 373 319 -119 -404 -172 257 359 20 -340 -254 165 397 137 -294 -369 24
2969 24 410 313 -161 -420 -163 288 396 22 -347 -294 124 372 134 -271 -335 19 354 243 -187 -398 -125
2990 -125 299 358 -26 -392 -273 165 398 125 -283 -330 37 353 233 -183 -365 -63 329 343 -58 -378 -240
3011b40M60J95k88m32l8L77L35j24m20j86K62L81K8l82k83J44M21J60l05m00k
3032c37M03L18j67m23j77K83L99Ml77k84J66M14J30l06l78M6M06K78k02m24j61
3053c89L42L95j6m07k91J71M09J40l00l61K9L83K45j92m16q8L38L41o0l98k51
3074c76J91M26J25l34l61L7M01K40k06m01p6L37L53r0m21k28K38M38Q5l56l75
3095c53O4M28K57k17m07j13L39L36r2l84k15K45L83N6l64l28J07M25K11k58m03
3116b83o6L59L35j08l95k01K48L80M2l64k91J22M15J88k73m07m0L80L33j01m30
3137a57k12K56L98M9l54l10J15L91J87k85l68k9L85L07j59m16j74K63M11K4l75
3158e3l10J41M00J64k68l62qL71K90j70m12j47L13L71kl97k90J63M08J77k95l78
$$ plain form
3011 -240 220 415 127 -305 -343 34 369 245 -175 -361 -99 282 310 -72 -355 -211 210 370 65 -335 -337
3032 -337 66 384 217 -206 -383 -100 299 303 -74 -358 -192 222 352 46 -332 -286 120 398 196 -228 -389
3053 -389 -47 348 332 -75 -366 -195 214 354 54 -307 -278 105 350 158 -258 -346 -8 333 273 -125 -376
3074 -376 -185 241 366 32 -329 -292 109 349 143 -258 -334 3 356 266 -155 -383 -145 293 378 22 -353
3095 -353 -289 139 396 179 -228 -341 -2 334 242 -142 -357 -112 271 327 -37 -365 -258 167 378 120 -283
3116 -283 -349 10 345 237 -158 -359 -111 269 311 -53 -344 -222 193 381 108 -299 -339 41 374 273 -157
3137 -157 -369 -113 285 334 -20 -330 -215 176 363 78 -290 -319 66 373 214 -202 -376 -113 298 322 -53
3158 -53 -363 -222 178 342 74 -288 -296 75 365 195 -217 -364 -51 320 318 -79 -369 -206 202 379 84 -294
3180b94lL58K84j46l98j35K88L50j8l79k67J83L98J36l01l72J1L86K64j57l97
3201b09j39K99L33k8l60k41J85L99J03l21l50N3L90K61j98m01j14K96L47k0l79
3222i4k44J83L73R7l09l18P1L67K13k01l77r8L19L34o2l79k32K03L74Q8l00l23
3244c15P0L81K04k33l64n8L23L18q4l82k30K38L83P6l19l16P0L67K08k10l54n4
3266b81L00K90r3l83j64K38L59M2l49k89J06L72J78k28l54m0L28K71j11l59j64
3287c31K45L52Pl43k79J57L70J54k46l62k7L32K97j18l61j75K55L31Ol21k51J40
3309a68L56J22k62l32J5L48K52j46l73j40K65L31j5l36k39J48L68R6k64l21N0
3330b45L41K34j82l65j15K84L56l4l59k37J48L69J15k68l11M2L22K13j63l54o9
$$ plain form
3180 -294 -297 61 345 199 -199 -334 -46 304 286 -93 -360 -177 221 357 56 -316 -305 81 345 188 -209
3201 -209 -348 -49 284 256 -104 -345 -160 239 342 21 -329 -276 114 375 177 -224 -338 -42 305 285 -94
3222 -94 -338 -155 218 315 6 -312 -241 126 339 138 -239 -337 -18 316 254 -125 -357 -154 220 308 8 -315
3244 -315 -245 136 340 107 -257 -315 8 326 242 -140 -370 -132 251 327 8 -308 -238 129 337 127 -227 -281
3266 -281 19 309 216 -167 -331 -93 266 308 -41 -330 -224 148 326 98 -256 -296 32 303 192 -167 -331
3287 -331 -86 266 273 -70 -349 -192 178 332 86 -276 -303 29 326 208 -153 -328 -73 258 264 -57 -308 -168
3309 -168 188 310 48 -284 -269 79 331 185 -188 -328 -63 268 253 -83 -322 -174 194 290 26 -295 -245
3330 -245 96 330 148 -217 -332 -48 308 274 -85 -322 -174 195 310 42 -269 -227 95 308 145 -209 -278
3351b78K78L05n9l51k23J84L71Q4k88l03M8L23K08j84l32p2K83K94q3l61j80K24
3373a12L49O9l19l04P9L59K04k02l36p6K95K75o5l34j77K05L21M2k92k83J02L51
3395A51J71k25l50l2L06K66q9l31j67K07L25K8l00k56J21L33J43k40l19k1L15
3416C6K65r5l65j62K23L33L7l06k44J03L19J40k20k97j1L04K50j39l44j13K31
3437e5L17ml03k43J21L29J21k22l12J7K94K21j36l34j10K51L17l5l26k27J53L36
3459A70J15k42k90mL15K23j47l05j06K38K82k5l02j97J62L00J02k50k87K0L21
3480I3K04j64l05q8K38K71m5k97j78J57L08O2k64k73O5L14J88j66l26p1K46K83
3502B52n3k95j63J45L02N3k41k44O4K92J56j75k93n9K73K50o6l04j63J81K79O2
$$ plain form
3351 -278 0 305 246 -105 -328 -144 227 311 23 -280 -232 91 299 115 -217 -289 -6 288 205 -156 -336 -112
3373 -112 237 306 -13 -317 -238 121 325 123 -213 -289 6 281 216 -118 -295 -90 231 273 -19 -302 -200 151
3395 151 322 97 -253 -285 21 287 198 -133 -300 -93 232 260 -40 -296 -175 158 301 61 -258 -279 36
3416 36 301 206 -159 -321 -98 235 272 -34 -278 -175 144 284 64 -233 -244 60 310 171 -173 -286 -55
3437 -55 262 258 -45 -288 -167 162 283 61 -251 -234 60 281 145 -189 -299 -48 269 234 -92 -319 -166 170
3459 170 285 43 -247 -251 64 287 140 -165 -271 -33 249 224 -78 -275 -113 187 289 39 -248 -228 93
3480 93 297 133 -172 -260 -22 249 204 -93 -271 -114 194 256 -8 -281 -216 98 286 120 -206 -277 -31 252
3502 252 199 -96 -259 -114 188 241 0 -244 -180 112 268 93 -200 -259 14 264 198 -106 -269 -88 191 253
3524B53k55k34P3K77J45j78k83l5K63K27q7l03j41J88K92L8k50k52Q5K83J46j78
3546G4k58l0K38K09p6k71j35J93K64J2k54k07R3K74J33j89k56k4K47K03r7k65
3568a22j07J95K33Nk60j94J13K74R8j91k65MK62J90r9k61j09J83K41Nk45j82J12
3591a20K58Q2j92k23J5K49J74j11k69q7K00K33k2k33j54R4K49P4k10k03L6K24
3613F4J71j33k49p1J94K32k2k51j66J18K39Q0j82k08J5K28J38j17k23m9J89K11
3635B08o0k27j46J46K28O1k00j92M1K21J25j25k19l8J96J82o2k25j22J50K22L2
3657A96k10j85M3K34J22j40k10m1J94J68m1k09j11J34J94L0j88j70O8K27R8j40
3679F3k18j9J95J78n8k21j03J29K05K4j97j61P8K18R4j59k15KJ88J85q4k27j12
$$ plain form
3524 253 -2 -236 -163 114 259 81 -202 -237 26 253 166 -137 -278 -90 202 240 -10 -262 -177 106 252 74
3546 74 -184 -214 24 233 157 -114 -249 -56 208 220 -34 -241 -148 126 259 70 -186 -210 37 240 143 -122
3568 -122 -229 -34 199 204 -56 -250 -137 137 235 44 -221 -217 45 235 136 -125 -234 -51 190 195 -50 -232 -120
3591 -120 138 220 28 -195 -180 69 243 132 -137 -224 -24 209 187 -46 -200 -106 143 217 7 -196 -160 64
3613 64 235 102 -147 -218 -24 208 186 -65 -231 -113 126 206 24 -184 -169 59 197 80 -143 -192 -3 208
3635 208 148 -79 -225 -79 149 210 10 -182 -141 80 205 80 -139 -177 19 201 139 -86 -208 -58 164 196
3657 196 -14 -199 -156 78 200 60 -150 -191 3 171 130 -79 -190 -56 138 168 -20 -190 -122 105 203 63
3679 63 -155 -174 21 199 141 -80 -183 -54 151 175 -22 -183 -105 113 207 48 -167 -165 23 208 124 -103 -215
3702b15J47K19Rj77j76P3K06Q9j42j86J0J77J39q2k00p8J56J92Oj98j39O6K13
3725A09Q5j55j80KJ87J37r2j91p7J50J85rk02j37R4K01P3j37k02mJ87J50p6j97
3749i9o8J24J75Nj86j32Q7K00M8j33j84LK01J38q8j86o8J45J76j9j75j23Q7J92
3773A20M5j57j64K4J93J19q8k01p0J63J72k1j70j31P0J87P3j49j54J9J64J14r2
3796F6j75m2J36J66k4j79j20R2J83N3j45j54L4J61J06q5j74m6J47J54k9j87j03
3819a65R5J85M3j56j47J4J71J21r5j78l7J28J54l2j58j04J00J59L3j32j52M6J74
3842F7R3r9j79k7J51J32l7j53j00J07J61K8j48j39N0J65R5j19j65k8J51J47l7
3865A16j81r8J09J53L4j47j32N2J56P5j03j65j7J54J28m9j67o5J04J62Qj43j19
$$ plain form
3702 -215 -68 151 160 -17 -193 -120 86 175 33 -153 -143 34 173 91 -109 -187 -31 161 167 -31 -170 -104 109
3725 109 194 39 -141 -139 48 185 93 -98 -175 -25 160 151 -51 -188 -94 107 180 43 -159 -163 24 174 98 -99
3749 -99 -167 -43 132 137 -49 -181 -94 106 154 21 -163 -160 41 179 91 -95 -163 -18 158 139 -36 -159 -72 120
3773 120 165 8 -156 -132 61 180 92 -109 -179 -16 156 135 -35 -166 -96 91 164 15 -139 -120 44 158 66
3796 66 -109 -151 -15 151 127 -52 -172 -80 103 156 11 -143 -109 52 158 73 -101 -147 0 154 125 -62 -165
3819 -165 -70 115 158 2 -145 -131 40 161 66 -112 -149 -21 133 101 -57 -161 -61 98 131 -1 -153 -107 67
3842 67 160 61 -118 -145 6 138 101 -52 -152 -45 116 144 -4 -143 -93 72 167 48 -117 -145 6 153 116
3865 116 -65 -163 -54 99 133 -14 -146 -94 62 137 34 -131 -148 6 134 85 -82 -147 -43 119 127 -16 -135
3888a35M5J59R0j22j53PJ40J20o3j51q6J25J62Kj62j26O8J61P1j16j59NJ31J19
3912A32m7j72n2J06J50j4j51j17Q2J66N7j11j57jJ60J12p5j54m6J16J40j0j58
3935d4j02R0J69M5j39j52K0J66J14p6j91k9J15J43j3j64r8Q3J64L6j27j51K9J47
3959C5J06r0j67k8J41J34k7j56r4Q5J65L1j36j28L3J65Q1j03j66oJ39J46l9j78
3983e7r2J01J67L5j52j25L4J48P9j09j23k0J29J16o1j44o5J08J30J0j20j20L8
4006i3J51P4r2j46mJ34J05n4j47n1J08J29Lj42j17O6J62O4j28j34JJ37J09n2j52
4031f9n1J01J36pj37j05P6J28N8j20j34KJ47R9o2j57m1J15J33j8j39q3O7J52L2
4056A23j13j37K9J49Q7p0j59l4J28J24j6j47r4O8J45N2j26j18J5J46Q3q7j36m7
$$ plain form
3888 -135 -90 69 159 37 -116 -109 31 151 88 -63 -149 -24 138 140 -22 -148 -80 81 152 36 -123 -118 13 132
3912 132 85 -87 -139 -33 117 103 -48 -165 -83 83 140 29 -128 -129 31 143 68 -86 -132 -16 124 114 -44
3935 -44 -146 -56 113 158 19 -133 -113 53 167 91 -100 -129 -14 129 116 -48 -146 -63 101 137 10 -141 -112 35
3959 35 141 51 -116 -144 -3 131 104 -52 -146 -61 104 135 -1 -129 -96 69 150 47 -119 -125 14 160 121 -57
3983 -57 -149 -48 119 154 2 -123 -89 59 138 29 -94 -114 15 131 70 -74 -139 -31 99 109 -11 -131 -93
4006 -93 58 132 40 -106 -110 24 129 75 -72 -123 -15 114 117 -25 -142 -76 86 150 22 -112 -111 26 135 83 -69
4031 -69 -120 -19 117 110 -27 -132 -56 72 130 10 -124 -122 25 124 62 -95 -136 -21 112 94 -45 -128 -61 91 123
4056 123 10 -127 -98 51 138 68 -91 -125 3 127 111 -36 -130 -62 83 135 9 -109 -94 52 135 48 -88 -135
4080a35J37J23l6j54q8Q7J58L4j36j21L1J58P4j01j42pJ22J27m2j54o6Q7J56L2
4104A44j48j25L6J72P7r6j65jJ27J12l7j55p3R9J44Oj33j30O3J47Q7j21j47j7
4128a34J47J17o5j38p8J14J46Qj43j18P2J52O6j15j55NJ49J14n5j63o0J06J56
4151A28mj31j26O3J55M7j15j33RJ47R9o9j55n6J13J51j4j46j06O4J54N3j17j48
4175a37K6J47J08q6j48m0J20J36j7j44j05P2J61N1j23j35QJ51J05p5j61k7J10
4198cJ32k6j49q7Q3J38M8j34j28K0J50Q7q5j42m2J34J25l5j38q6Q9J48L0j39j24
4223a34L4J66Q2r1j51k8J31J32l5j61p9J02J38J9j23j28N3J29P5q8j43k1J34J17
4247A30l0j64q3J06J42Jj22j24N5J56N8j00j49j0J57J10n5j58n6J03J41Mj26j18
$$ plain form
4080 -135 2 125 89 -65 -153 -66 92 126 -10 -131 -100 58 132 31 -111 -118 4 131 89 -65 -131 -44 112 144
4104 144 -4 -129 -93 79 156 60 -105 -106 21 133 96 -59 -132 -33 111 117 -16 -146 -83 64 151 30 -117 -134
4128 -134 13 130 65 -73 -151 -37 109 117 -26 -144 -72 80 146 31 -124 -119 30 144 89 -74 -134 -28 128
4151 128 124 -7 -133 -70 85 132 17 -116 -107 40 139 70 -85 -141 -28 123 109 -37 -143 -79 75 128 11 -137
4175 -137 -111 36 144 58 -90 -130 -10 126 109 -35 -140 -68 93 144 21 -114 -106 45 150 75 -86 -113 -3
4198 -3 129 103 -46 -133 -50 88 136 2 -126 -106 44 131 46 -96 -138 -4 121 86 -52 -138 -49 99 129 -10 -134
4223 -134 -100 66 148 57 -94 -122 9 141 106 -55 -134 -32 106 125 2 -126 -73 56 131 43 -100 -121 13 130
4247 130 100 -64 -147 -41 101 102 -20 -144 -89 67 125 25 -124 -134 23 133 78 -80 -136 -33 108 112 -14 -132
4271a32N6J55O3r8j46kJ47R6o4j48o2J10J37Oj48j07O4J56M1r8j50K2J26J09n9
4296G4j67m5J17J42k4j43j06P6J56M2j20j34J1J61J00p3j62m0J13J49j5j56r0
4319a34P7J53M1j29j25J8J58Q8r5j54l9J45J24k0j67r2R1J50L0j31j31L5J58R2
4343A43j00j52l3J34J32k4j60r1R4J52K4j22j31M0J60Q7j13j41k3J39J27m0j60
4366e8p4R0J56J1j37j21M1J56O4j02j36k4J43J19n3j64o2J01J69%j50j16N5J55
4390F3P3j04j49j3J49J23m4j65o5J06J56oj45j19O5J58P4j21j49pJ52J15o9j60
4414h2n3J15J43mj51j06N7J60N6j23j52J7J54J07p1j59o7J25J49%j49j10O8J54
4438G8N6j22j39J3J63R5p2j58n3J31J40j3j49j07O2J60N4j33j35K3J57Q9q2j64
$$ plain form
4271 -132 -76 79 142 44 -102 -104 43 139 75 -73 -135 -25 112 118 -30 -137 -73 83 124 26 -124 -102 24 133 74
4296 74 -93 -138 -21 121 97 -46 -152 -76 80 122 2 -132 -121 40 140 67 -95 -135 -22 127 112 -44 -134
4319 -134 -57 96 137 8 -117 -99 59 147 52 -102 -141 4 128 108 -59 -151 -60 90 120 -11 -142 -107 51 143
4343 143 43 -109 -142 -8 124 100 -60 -151 -57 95 119 -3 -134 -94 66 153 40 -101 -124 15 142 102 -58
4366 -58 -132 -42 114 125 -12 -133 -92 64 128 26 -110 -134 9 128 75 -89 -151 -50 119 119 -31 -147 -92 63
4390 63 136 32 -117 -130 19 142 98 -67 -132 -26 130 124 -21 -140 -75 83 157 36 -113 -120 32 147 78 -82
4414 -82 -135 -20 123 119 -32 -138 -81 79 135 12 -140 -123 31 138 67 -92 -159 -34 115 115 -34 -144 -76 78
4438 78 134 12 -127 -114 49 144 72 -86 -139 -8 132 119 -30 -137 -75 85 139 6 -129 -106 51 140 58 -106
4462a06l3J25J41k9j54j02Q0J61N1j30j39K3J54J00p4j68l2J31J33k1j63r0Q1
4485f1J72L0j41j33L1J52R8r6j48l8J37J26l5j49r0Q3J59L2j42j44O0J58P7r4
4509D4j65k5J57J19l9j49j01J00J65K0j39j22L0J70P9j02j55j0J27J49o2j59p7
4532a45J02J60J8j58j04L3J69P4j07j65qJ41J30n2j66q1J05J65Nj40j22N2J66
4555G2P9j31j48kJ61J18o1j63p1J26J44J3j62j25P8J56P2j21j63K1J48J17p3j78
4579i3n4J33J59k0j59j12P8J72M7j35j57J1J69J16q5j79n3J37J62j5j73j10Q7
4602g4J76N3j44j47K4J61J18r2j60n9J49J40k2j75r3R1J70M5j54j47L0J76R2r8
4626F0j82l9J58J48m1j82q6Q3J91M3j48j62M4J72R5j18j62k6J54J49l9j83r0J21
$$ plain form
4462 -106 -139 -14 127 98 -56 -158 -78 83 134 4 -135 -112 42 142 68 -100 -132 -1 132 111 -52 -142 -61
4485 -61 111 141 0 -133 -102 50 148 52 -96 -134 3 129 94 -55 -145 -62 97 129 -13 -157 -97 61 138 44
4509 44 -121 -146 11 130 91 -58 -159 -59 106 126 -13 -135 -105 65 144 42 -113 -123 4 153 91 -68 -145
4532 -145 -43 117 135 -23 -127 -94 75 149 42 -123 -131 10 140 88 -78 -159 -54 111 116 -24 -146 -94 72
4555 72 151 20 -128 -130 31 149 88 -75 -146 -20 124 137 -25 -150 -72 84 156 35 -128 -107 41 158 85 -93
4579 -93 -147 -14 145 125 -34 -146 -68 104 151 16 -141 -130 39 155 70 -109 -162 -25 137 122 -51 -161 -74
4602 -74 102 155 11 -136 -112 49 167 75 -85 -144 5 145 123 -52 -145 -54 116 161 7 -140 -110 66 158 60
4626 60 -122 -161 -3 145 104 -78 -164 -81 110 153 5 -157 -113 59 154 36 -126 -152 2 151 112 -71 -161 -40
4650d0J75Pj50j48N8J72R8j15j85j0J72J33o7j83p6J24J70J6j88j28O1J92P6j30
4674C4j91mJ73J51p0j88p4J26J73nj72j18O7J93P1j31j81lJ78J46q3j90o4J37
4698b5J88k7j77j17Q0J89N9j45j86J9J82J41q9k02o2J45J73j1j91j22R0J87O1
4721A60j50j71J8J97J20r7k02m6J60J62j9j96j12J04J90N0j59j62K8J99J15j10
4743G9j96m4J68J70l7k06j13J14J94L7j64j72N0J99J03j23j97k5J60J72n8j92
4765h1j00J16J91L5j86j52O0J91R5j12j94k3J80J56o8j81r4J32J83J7j92j41P1
4788i7K04P2j38j88nJ77J51p7k04p3J36J80J1j91j37P1K01P0j43j79kJ95J38p9
4812I3k05o1J46J77j6j87j18Q8K02N5j50j66J7J89J15r2j91o0J63J78l4k02j08
$$ plain form
4650 -40 135 142 -8 -156 -98 74 172 57 -128 -138 34 167 100 -83 -159 -35 135 151 -37 -165 -104 88 164 34
4674 34 -157 -161 12 163 93 -95 -169 -43 130 125 -47 -165 -98 95 166 35 -146 -149 29 175 92 -98 -162 -25
4698 -25 163 136 -41 -158 -78 111 170 25 -161 -142 40 181 92 -110 -172 -27 146 135 -56 -178 -88 99 160
4721 160 10 -161 -143 54 174 77 -125 -171 -11 151 132 -64 -176 -72 118 168 9 -153 -125 74 189 79
4743 79 -117 -161 7 177 140 -66 -179 -65 129 166 2 -170 -120 79 182 59 -138 -163 -3 169 111 -81
4765 -81 -181 -65 126 161 -25 -177 -117 74 169 57 -137 -160 20 176 108 -73 -167 -35 148 165 -27 -168 -97
4788 -97 107 179 41 -147 -152 25 176 99 -105 -178 -42 138 149 -42 -179 -108 93 163 20 -159 -161 34 172 93
4812 93 -112 -173 -27 150 134 -53 -171 -83 119 174 24 -142 -125 64 179 87 -104 -164 -1 177 143 -59 -167
4835a67R5J95M8j57j77L7J88J16j09j93m3J63J60l2j97j22J29J97K6j61j59L3
4857a30J93J16j21j95k4J76J56n3j96r7J16K09K4j81j53N5J97J00j28j89l4J80
4879B1J45m6k08q8J26J90Mj82j47P9J86R0j38j81rJ88J38p1k01o9J39J88k0j65
4903c1j43Q6J99P7j56j76OJ74J39p1k04p6J46J82j5j93j17Q2J99N6j38j90L0J85
4927E1J19r8j92o6J64J80k9j80j32J00K06M4j71j58L5J93J02j05j81n4J77J67
4949A72l4j98j04R8K03L4j69j63N0J88J02j14j80l9J61J59m9j93j05J23J93J5
4971A50j68j47M1J97R9j31j87k2J82J44n0j98p9J27J90J2j86j42N9K00Q1j19j87
4994a34qJ83J32p6j76p4J16J79Jj73j32O7J94P1j41j79PJ89J26r0k00n1J35J72
$$ plain form
4835 -167 -72 123 171 14 -163 -126 62 178 69 -124 -167 -4 156 124 -73 -195 -66 131 157 -4 -163 -130
4857 -130 63 179 58 -137 -161 15 171 118 -78 -175 -59 150 174 -7 -160 -105 92 192 64 -125 -159 21
4879 21 166 120 -88 -176 -50 140 144 -38 -185 -106 80 170 32 -149 -158 30 168 97 -104 -173 -34 154 134 -31
4903 -31 -174 -88 111 188 32 -144 -138 36 175 104 -100 -176 -30 152 137 -56 -173 -91 108 164 26 -164 -134 51
4927 51 170 72 -120 -186 -22 158 129 -51 -183 -83 123 167 -4 -162 -127 66 168 63 -118 -172 5 172
4949 172 138 -60 -164 -66 137 171 2 -161 -111 77 179 65 -115 -154 7 166 117 -76 -181 -58 135 150
4971 150 -18 -165 -124 73 172 41 -146 -168 14 158 108 -90 -169 -42 148 160 -26 -168 -109 91 172 53 -134
4994 -134 -142 41 173 97 -79 -153 -37 142 143 -30 -162 -95 99 170 29 -150 -143 46 172 82 -118 -169 -34 138
5018A38mj84j24Q4J96O3j54j67K1J81J27j00j88m7J36J78j1j89j14Q9J76O3j47
5041B3j69K5J84J11j00j85n0J53J72m3j77j07R4J84L1j54j48L3J79J12j12j81
5063a25m5J65J63m5j84j04J20J84K7j62j50N1J71J06j04j82k8J51J48m5j81q3
5085a52J02J83Oj50j45O4J72Q7j26j66j8J60J36n3j86p7J15J77J1j62j43P2J78
5108H5P7j34j61LJ67J32p4j70p1J17J69Jj50j34N9J72N7j09j58oJ56J35p6j80
5132i3o1J31J38J2j64j17P2J72O1j27j64J5J61J14q5j60n2J24J63k0j67j03P8
5155g2J76N0j27j53J3J66J00p9j59m4J26J39j2j61j02R0J45M5j31j31J7J57Q9
5178A42q7j65l1J36J36l8j53q5Q2J57K5j25j36M0J61R4j07j45l0J36J31l1j61
$$ plain form
5018 138 134 -50 -174 -90 106 169 15 -152 -131 50 177 77 -111 -158 -22 156 145 -44 -158 -69 107 170 23
5041 23 -146 -121 63 174 74 -111 -161 -8 164 121 -56 -163 -69 115 146 -8 -156 -123 56 168 56 -125
5063 -125 -170 -5 158 113 -71 -175 -55 129 156 -6 -156 -105 66 172 68 -114 -142 9 157 112 -69 -152
5085 -152 -50 133 139 -11 -156 -92 80 167 41 -125 -143 17 153 100 -86 -163 -48 129 140 -22 -165 -93 85
5108 85 162 28 -133 -130 37 169 95 -75 -146 -29 140 141 -9 -143 -84 88 145 36 -122 -128 28 163 87 -93
5132 -93 -154 -23 115 127 -37 -154 -82 90 151 24 -140 -125 36 150 65 -95 -147 -23 140 120 -47 -150 -72
5155 -72 104 154 27 -126 -113 53 153 74 -85 -129 -3 136 124 -37 -139 -49 96 141 10 -121 -104 53 142
5178 142 55 -110 -141 -5 131 93 -60 -145 -63 94 119 -6 -142 -102 59 153 46 -99 -129 7 138 107 -54
5201e4q1Q3J68K1j40j28M7J56Q5j13j49j1J29J25m5j49q2J01J45J7j38j21M8J39
5225E3Q2j05j45NJ23J19n6j63o1J16J47Nj43j13N9J45P8j10j37pJ41J05o0j40
5249f2p1J06J40Jj26j20N7J68M9j13j50K1J24J01o1j40o4J24J29j1j47q9N7J56
5273G9M4j26j18J6J43J00o6j62m5J26J33qj32j02N5J59L5j13j36L1J37R1o8j53
5297h0l5J02J33k1j37r5Q1J46L8j26j30J8J49R7r6j33l3J18J26j9j64o8Q3J36
5321I0L1j22j16J6J57P4p3j42l1J23J22k3j48q5R2J38K7j28j21L9J44O0p6j38
5345i0j8R6J26k2j50p2P6J42K0j19j18J8J60Q1r5j38rJ23J08l7j48n3Q1J47Rj33
5371a5q9K8J46O0q5j43oJ15J22n3j35p5R3J34Pj21j04M4J48O0j03j39j0J35J05
$$ plain form
5201 -54 -135 -52 116 137 -3 -131 -84 72 157 44 -105 -116 13 138 93 -56 -138 -37 108 125 -13 -134 -86 53
5225 53 135 30 -115 -110 13 132 76 -87 -148 -32 115 120 -23 -136 -77 68 146 36 -101 -108 33 138 78 -62
5249 -62 -133 -27 113 114 -12 -132 -75 93 142 29 -121 -100 24 125 64 -76 -140 -16 113 102 -45 -134 -77 79
5273 79 123 -3 -121 -105 38 138 72 -90 -135 -9 124 116 -16 -118 -63 96 131 18 -118 -87 50 141 73 -80
5297 -80 -115 -13 120 99 -38 -133 -52 94 132 6 -124 -106 43 140 44 -89 -122 -4 122 103 -61 -129 -46 90
5321 90 121 -1 -117 -101 56 130 57 -85 -116 7 129 106 -42 -127 -35 103 130 2 -119 -80 64 124 48 -90
5345 -90 -108 -12 114 92 -58 -130 -54 88 108 -11 -129 -111 49 130 35 -103 -112 11 119 82 -66 -119 -38 109 118 -15
5371 -15 -104 -76 70 130 45 -98 -104 11 133 80 -55 -130 -37 97 104 -17 -121 -77 71 131 28 -111 -121 14 119
5396A19m1j50n3R2J43%j37r6M3J45N8r8j33J2J23R3m5j34n6R8J41kj37r1N3J33
5422H0M1j01j20jJ26J01n8j44m1J09J09Oj42r2O3J28N8j02j26K0J20Q3m9j46m4
5447a22J20J22j7j31j01Q1J34M7j14j16J7J29Q6o3j36l5J02J13j6j28q8P5J29
5470H8L7j17j14K3J26P8p1j26m5J11J12k3j26p4O5J41L5j08j21J8J35Q2p2j33
5494g9k4J05J15k4j27p8Q0J27K7j08j21M0J33N7p5j30k6J20J02k8j38o9Q3J35
5518I7Pj03j16M1J14O6p8j26mJ07J03k5j36o1R0J16J0j04j06L5J32N8p8j22j4
5543i7J12J10l1j48n8R0J17Lj18r1L8J50M4q8j23j4J25R9n0j41m8R8J14Jj19r3
5569a18N0J33N2r4j27J3J29R0n4j33n4R9J24lj20r2M8J42L8j04j17LJ37Q3n3j50
$$ plain form
5396 119 78 -72 -125 -33 110 110 -27 -123 -80 65 123 25 -108 -96 27 120 75 -59 -115 -17 124 122 -15 -106 -53 80
5422 80 121 20 -100 -101 25 126 68 -76 -117 -8 101 107 -35 -127 -64 64 122 20 -106 -86 34 117 68 -78 -122
5447 -122 -2 120 103 -28 -129 -48 86 133 19 -97 -80 49 135 72 -64 -99 3 116 100 -28 -116 -41 88
5470 88 125 8 -106 -83 43 121 50 -76 -121 -10 102 79 -47 -121 -56 85 120 12 -109 -91 44 126 54 -79
5494 -79 -103 2 117 93 -34 -112 -32 95 122 14 -107 -67 66 123 48 -82 -108 12 114 86 -52 -121 -38 97
5518 97 104 1 -115 -74 40 106 28 -98 -102 5 108 83 -53 -114 -24 92 102 -2 -108 -73 59 117 39 -83 -97
5543 -97 15 125 94 -54 -112 -22 95 98 -20 -111 -73 77 121 33 -90 -104 21 120 70 -71 -119 -21 93 94 -25 -118
5569 -118 -68 65 117 23 -104 -91 38 128 74 -59 -113 -14 110 107 -13 -105 -57 85 123 19 -98 -95 42 125 72 -78
5595g8l8J01J16j2j28q5P3J25M1j12j14K6J20P9o4j29m0J11J02j3j18r1Q2J30
5619H4K2r6j22J7J50P8p6j33k6J04J17k4j36p1P8J32K3j28j00K8J38O2q3j27j5
5644a04J15R8l4j31p4Q6J23L1j30j00L4J46P0r1j30j8J16J19m1j40o0R4J22J3
5668A14j27r5M2J36O1q9j30oJ21J05m4j59m7R7J23nj25r7O1J21N6r6j06j0J15
5693A6R8m4j35m4Q7J21Nj28q9M3J40M9r9j16mJ36Q1m3j38m7R6J33j4j11j04N6
5719e5J27N3j04j25J0J25Q4n5j36m7J01J18rj20q6N4J35L8r5j17J3J27Q4o9j30
5744g9l5J06J12nj26q6N8J45M0j07j16J7J25P3o6j18m6J06J14j9j37o4O2J25L1
5769A10j09j09J9J27O7p2j18k8J13R9j9j29o1P1J19K1j07j09M6J19N7o7j30nJ03
$$ plain form
5595 -78 -116 -15 101 89 -39 -124 -51 74 115 3 -111 -85 35 114 50 -79 -119 -8 94 81 -37 -128 -46 84
5619 84 106 10 -112 -95 55 133 57 -76 -102 2 119 95 -41 -112 -34 98 121 -7 -107 -79 59 121 38 -89 -104
5644 -104 11 109 75 -56 -130 -44 79 110 -20 -120 -86 60 130 39 -91 -109 7 126 85 -55 -115 -21 101 114
5668 114 -13 -108 -66 70 131 42 -88 -94 27 132 88 -71 -118 -21 102 97 -28 -125 -64 57 113 17 -89 -99 16
5693 16 114 70 -65 -109 -22 99 104 -24 -113 -70 70 119 20 -96 -100 36 117 74 -64 -111 -15 118 104 -7 -111 -55
5719 -55 72 125 21 -104 -94 31 115 60 -76 -123 -22 96 87 -33 -119 -65 70 108 13 -104 -91 36 120 51 -79
5744 -79 -114 -8 104 99 -27 -113 -55 90 130 23 -93 -76 49 122 56 -62 -108 -2 112 93 -44 -108 -46 79 110
5769 110 1 -108 -89 38 105 33 -85 -113 0 99 80 -49 -110 -39 80 101 -6 -115 -69 50 107 40 -90 -95 8
5794HJ10l9j25n6O3J31J9j18r6L5J27N1p7j33J2R9R2l0j28o0O9J23K0j06j04L8
5820g5J24N9o9j40%J21R1l8j27o1P6J30Pj10r8N2J23M2p5j19%J11R2m5j32m5R0
5847a6J05Oj21q2M7J19O1r8j20kJ25R3o7j14m9Q8J22pj05j00O0J21M2r0j11NJ24
5874C6P3m9j25l8Q6J27j0j17q8N6J23M1j04j10K2J02Q0n2j13l4Q4J02%j15q3M7
5900e9J16L2q4j11K9J06Q5o4j14k3Q5J00j7j12q7Q0J27K6j13j00K2J35O9p7j11
5925f0k9R7J01rj23p5O7J05L1j01r9J7J27O8p4j22k3J04R1j6j23n6O2J14K6j09
5951iq7J9J24N9o2j24j8J06R8k7j09n8O2J20K0j18r7L3J25O5p2j27j7J11R5m2
5977G0j21m8O8J16J4j11r8L9J29M4p2j13k4J18Q7k6j30n3R0J02J6j05j00M3J26
$$ plain form
5794 8 118 79 -46 -102 -39 92 111 -7 -103 -68 59 110 33 -100 -88 11 103 73 -55 -115 -46 77 97 -9 -113 -75
5820 -75 49 108 39 -101 -101 20 111 73 -54 -115 -39 91 98 -12 -110 -58 65 107 32 -87 -87 24 116 71 -61 -106 -16
5847 -16 89 95 -26 -108 -61 58 119 21 -99 -101 24 117 50 -64 -113 -25 97 90 -15 -115 -55 66 108 18 -93 -88 36
5874 36 109 60 -65 -103 -17 110 100 -17 -105 -49 74 115 11 -99 -77 25 105 53 -60 -94 -10 92 92 -23 -106 -59
5900 -59 57 89 5 -106 -77 29 114 50 -64 -87 -2 98 81 -31 -118 -38 89 115 2 -98 -76 59 128 51 -60
5925 -60 -89 8 109 100 -23 -98 -31 74 105 4 -95 -78 49 117 43 -79 -102 2 93 77 -46 -102 -40 74 100 -9
5951 -9 -96 -77 47 106 44 -80 -98 8 106 79 -30 -88 -26 94 114 -4 -101 -68 57 122 50 -77 -94 17 112 70
5977 70 -51 -99 -31 85 99 -12 -110 -71 58 102 30 -83 -107 11 98 72 -58 -111 -21 81 97 -8 -108 -65 61
6002F1N5q6j21KJ16J00m7j36m4P5J33j1j14q8M3J38M1r0j18oJ22Q3m5j35m4R1
6028b5J25mj24q9N1J38L7r9j09J1J16R0o5j17n6J08J09Mj28q1N8J17N4j04j20
6053a03K5J10R5o0j24n8J07J14pj25q9N9J20M4r1j06%J16P3n0j37k3R4J26k1j31
6079d2p6O1J40L7j09j12J4J28Q0o9j20l8J05J17k5j23p6O0J41J7j01j20J5J39
6103D3P0o5j18l5J05J14k4j37p2N2J41L6j10j13K7J30P9q3j28k2J06J28m5j20
6127d1q1Q4J40J7j10j14L7J27P5q2j34j8J11J19n6j20p4Q4J33J1j15j09L4J35
6151E3O3q5j33j1J34R7l6j51o0J00J23J7j36r2M3J46N3r1j36LJ37Q9m6j33o3R4
6177b1J25J2j39r2M9J45N9j05j46J3J37R6o9j38m5J07J25j2j33j01O6J43M7j01
$$ plain form
6002 61 116 30 -91 -89 27 127 80 -56 -100 -25 108 97 -17 -105 -62 76 117 27 -91 -97 25 108 63 -72 -116 -25
6028 -25 100 96 -28 -117 -66 72 109 10 -99 -88 28 118 53 -64 -120 -12 97 101 -27 -108 -50 67 121 17 -103
6053 -103 -78 32 127 67 -57 -115 -8 106 99 -26 -115 -56 64 108 17 -89 -89 27 100 50 -87 -110 -16 110 89 -42
6079 -42 -118 -57 83 120 11 -101 -87 41 121 52 -68 -106 -1 116 91 -32 -108 -48 93 110 9 -111 -96 43
6103 43 113 48 -70 -105 0 114 90 -47 -119 -67 74 110 0 -113 -86 44 123 40 -88 -110 -4 124 79 -41
6127 -41 -122 -38 102 119 9 -105 -68 59 134 52 -82 -100 11 130 74 -46 -120 -36 97 108 -7 -116 -82 53
6151 53 116 31 -102 -113 21 118 82 -69 -129 -29 94 111 -25 -117 -74 72 125 34 -102 -99 38 127 81 -52 -115 -21
6177 -21 104 116 -23 -115 -66 79 138 33 -113 -100 37 133 64 -74 -119 -12 113 101 -32 -133 -67 76 123 22
6201B2j38J0J40Q8p2j33m9J24J39k5j41r3P9J31M5j08j39J7J58Q2o8j45m6J15
6225gJ40k7j53q2Q2J37L8j31j09K4J37Q4r3j38k9J29J23l2j46p5Q3J43K2j25j26
6250a31L9J53Q8r6j49j3J25J21m4j46p5R8J50J0j40j14N9J35O1q4j53j0J39J10
6274A33n0j56n8Q7J47Qj37j13N2J66N7r7j55k0J61J05m7j63o4J21J44Lj40j17
6298a33N8J65N2j11j47LJ51J06o7j56n1J15J45oj51j10P2J51N2j26j39J6J51R0
6322A30o7j63l1J16J46k3j57r2P7J57M6j38j21J8J47J01q0j53m4J40J29k3j64
6345d9q5Q4J45L1j14j36K4J61Q3q5j53l1J33J24l6j58q0R6J47J9j31j24L4J61
6369F0P6r3j48j5J22J22l9j52q4J15J45L3j51j38N5J70Q2j08j52j7J46J23m9j71
$$ plain form
6201 22 -116 -106 34 122 50 -83 -132 -8 131 106 -35 -128 -49 82 127 19 -120 -103 55 137 69 -76 -122 -7
6225 -7 133 106 -47 -129 -47 90 128 -3 -112 -88 49 133 40 -98 -127 2 125 93 -53 -128 -45 98 120 -5 -131
6250 -131 -92 61 149 53 -96 -109 16 137 93 -53 -128 -30 120 130 -10 -124 -65 70 131 47 -106 -116 23 133
6274 133 83 -73 -131 -44 103 111 -26 -139 -87 79 136 39 -116 -136 25 130 83 -80 -144 -23 121 124 -16 -133
6298 -133 -75 90 142 31 -116 -113 38 144 77 -79 -130 -15 130 124 -27 -137 -65 86 138 12 -127 -111 40 130
6322 130 63 -100 -131 -15 131 108 -49 -141 -64 93 139 1 -120 -102 45 146 66 -87 -131 9 138 115 -49
6345 -49 -134 -50 95 126 12 -124 -100 61 144 59 -94 -125 8 132 96 -62 -142 -46 101 120 -11 -135 -101 60
6369 60 136 43 -105 -120 2 124 85 -67 -151 -36 109 142 -9 -147 -92 78 160 52 -100 -117 29 152 103 -68
6393f8o1R7J50J6j55j17O2J56N0j00j54J1J34J27q0j48o6J24J55j6j48j14P0J52
6417G7P0j27j36JJ59J10q1j53n9J31J42j2j49j09P6J53N7j32j43J9J53J12q8j55
6441h4n9J28J51k4j61r6P8J66L6j30j30K2J54R3q6j65k6J29J42k9j64q6R8J47
6465A04L6j42j34N5J54Q3r6j57k0J37J24m6j56p4R3J57J3j36j26M3J62P1j06j54
6489a15oJ33J30o3j54q0J16J53J0j38j25N1J61O9j11j43j0J54J12n2j64n7J05
6512b4J54j0j38j17O9J58N1j09j63J8J53J07p9j49o3J28J27Oj70r0N7J68N2j32
6536Dj41J4J68J01p7j70l8J34J43k7j55q9O5J71L1j17j39RJ71R9q6j64l0J32J33
6561A42k5j70q5Q8J65K4j39j32L4J68Q3j03j65k2J35J43n1j67p2R1J74J0j38j38
$$ plain form
6393 -68 -129 -32 118 134 -21 -138 -76 80 130 30 -124 -113 21 148 68 -80 -146 -22 133 117 -31 -145 -75 77
6417 77 147 20 -116 -115 44 154 73 -80 -139 -8 134 122 -27 -136 -60 93 150 18 -125 -106 47 159 71 -84
6441 -84 -143 -15 136 112 -49 -145 -67 99 135 5 -125 -103 51 144 58 -107 -133 -4 138 109 -55 -141 -43 104
6465 104 140 -2 -136 -81 73 156 60 -97 -117 20 144 98 -58 -132 -39 118 131 -5 -131 -88 74 145 39 -115
6489 -115 -121 12 142 79 -75 -155 -39 114 124 -14 -139 -88 73 142 31 -112 -122 32 144 92 -72 -129 -24
6512 -24 130 120 -18 -135 -66 92 143 34 -129 -111 42 149 70 -79 -142 -14 113 119 -51 -141 -84 84 136 4
6536 4 -137 -123 45 146 69 -101 -139 -5 138 111 -44 -133 -68 103 134 17 -122 -113 58 157 71 -93 -123 9 142
6561 142 117 -53 -138 -50 115 139 0 -132 -98 70 153 50 -115 -137 -2 141 90 -77 -149 -58 116 126 -12 -150
6585a50N3J80O5j01j46j2J16J42n3j46r2J11J60J3j47j34N7J69O9j11j60nJ49
6608B7J28o7j63o0J05J52Kj54j18P5J47O8j13j53lJ58J15o5j63o1J25J49oj55
6632c0j14P7J62O1j28j51J7J56J14p1j77m2J25J40j7j56j11P8J72M4j34j45QJ83
6656F1Q0q2j57m8J33J47l0j53j01Q1J67L5j34j40L4J67Q7q8j67k2J40J32k9j63
6680e0r2R2J59L6j38j49M9J65Q5j02j63k2J54J21m5j73p1R7J65Qj41j27M6J68
6704G2O8r3j65j1J53J21m8j73o7R8J71J0j51j28N3J75O9j21j44OJ32J36o2j72
6728g1o7J19J54kj65j14P8J59N8j16j61QJ51J22q1j57n3J29J34j0j62j01Q0J55
6752H7M9j11j58K1J52J11p1j76l6J31J44k1j60r3P3J73L9j37j42L6J47R3q6j61
$$ plain form
6585 -150 -97 83 148 47 -99 -111 5 147 94 -52 -144 -33 127 140 -7 -141 -84 85 154 43 -117 -122 27
6608 27 155 88 -75 -135 -30 122 124 -30 -148 -73 74 142 29 -124 -127 31 146 81 -82 -143 -18 131 125 -30
6632 -30 -144 -67 95 156 28 -123 -106 50 164 93 -84 -126 -1 139 122 -34 -145 -67 105 149 15 -130 -122 61
6656 61 141 59 -98 -146 -13 134 104 -49 -150 -69 98 133 -1 -141 -107 60 147 59 -108 -130 10 142 113 -50
6680 -50 -142 -50 109 145 7 -142 -93 72 157 55 -108 -130 24 145 100 -73 -144 -47 118 126 -15 -142 -96 72
6704 72 140 47 -118 -129 24 145 97 -76 -143 -45 126 136 -15 -143 -90 85 154 33 -111 -105 27 163 101 -71
6728 -71 -138 -19 135 133 -32 -146 -68 91 149 33 -128 -120 31 153 72 -85 -138 -9 125 115 -47 -148 -68 87
6752 87 136 25 -133 -112 40 151 80 -96 -132 -1 143 122 -38 -131 -58 115 154 17 -125 -89 58 151 65 -96
6776i6l3J24J43k4j70q1Q4J65L5j37j46L3J66Q3r5j59k7J37J39m0j68p7R8J62
6800A16J6j40j26M2J66P7r9j58pJ36J24n7j55q1J10J52J4j57j12N4J68O0j13j50
6824a20lJ48J13n6j75n5J20J44kj49j14N5J82N1j14j45jJ55J12o5j65n7J26J60
6848A45j4j67j01P5J52O0j21j61J8J66J12q9j67m4J19J61j0j78j00P8J69L8j25
6871A6j62L7J54J02p9j69m0J29J51l2j68r8J00J71K0j29j33K8J69Q4q8j64k5J33
6895GJ29l3j53r6J02J61K5j47j26L1J76P6j03j55k5J33J43n6j62p6J02J60J9j42
6919a0j39O0J65P7j16j37k4J38J31m7j74n4J03J49K4j59j10M8J63O9j13j59pJ62
6943D0J21p2j69o5J26J55j4j49j19O7J67M0j05j54J2J50J04o2j56n8J10J47mj58
$$ plain form
6776 -96 -129 -5 138 114 -56 -137 -53 112 147 10 -136 -103 63 146 51 -108 -135 2 141 101 -67 -144 -46 116
6800 116 132 -8 -134 -92 74 151 52 -106 -113 23 147 90 -65 -146 -36 116 130 -27 -139 -85 83 143 30 -120
6824 -120 -123 25 138 82 -93 -148 -28 116 114 -35 -149 -94 88 139 25 -120 -121 34 146 81 -84 -141 -15 145
6848 145 131 -36 -137 -62 90 150 29 -132 -114 52 164 75 -92 -136 -17 144 134 -44 -144 -66 103 141 16
6871 16 -146 -109 45 147 68 -101 -141 -12 139 107 -61 -159 -59 112 132 3 -130 -102 67 151 63 -101 -126 7
6895 7 136 103 -50 -146 -44 117 142 -5 -131 -100 76 152 49 -106 -131 2 145 89 -73 -149 -47 113 132 -10
6919 -10 -149 -89 76 153 37 -100 -124 14 145 98 -76 -130 -27 122 146 -13 -123 -75 88 157 44 -115 -122 40
6943 40 161 89 -80 -145 -19 136 122 -27 -146 -79 88 128 23 -131 -119 31 135 73 -83 -141 -31 116 112 -46
6967d6j00P1J64N8j27j51K2J55J13p9j66m1J24J39j9j61r8Q0J65M0j30j42K8J68
6991F7Q2j02j45m4J43J38l4j67q4Q2J72K8j36j38L6J62Q1q0j77k5J55J35m0j74
7015f5q6J15J57K2j39j39N5J63Q3j14j62j5J51J16n2j57p1J01J52Mj43j19O0J64
7039H1O5j15j53j0J53J32o7j70n3J15J51%j49j25O2J68N8j09j56PJ53J17o9j62
7063g6o6J35J56l0j49j14P5J58N5j08j65J1J58J06q3j64l2J12J54j9j75r4P9J58
7087H2O6j37j52K9J56J06q1j58m6J30J34j7j62r4R8J56L6j45j38M3J59R3r3j59
7111i4l6J37J36m3j60r1R7J70J9j44j32M4J64P5r8j62j6J46J17m4j56q1J06J66
7135A20J4j47j31N0J65Q5j09j60nJ40J17m9j64o8J02J69Nj56j13O1J65O0j28j46
$$ plain form
6967 -46 -146 -75 89 147 20 -131 -109 46 159 80 -86 -127 -3 136 117 -44 -142 -62 103 143 13 -129 -101 67
6991 67 149 47 -98 -142 1 139 105 -62 -146 -64 108 136 0 -138 -102 60 141 61 -116 -141 14 149 109 -65
7015 -65 -151 -36 121 143 4 -135 -80 83 166 52 -110 -125 26 142 90 -67 -138 -37 115 119 -24 -143 -83 81
7039 81 146 31 -122 -132 21 153 86 -84 -137 -22 129 129 -20 -145 -83 85 143 34 -122 -115 38 155 86 -76
7063 -76 -142 -7 149 119 -30 -144 -69 89 144 36 -129 -118 40 146 63 -101 -133 -21 133 114 -61 -155 -76 82
7087 82 148 11 -141 -112 44 150 69 -89 -135 -5 129 112 -50 -144 -46 110 146 1 -137 -94 65 158 65 -94
7111 -94 -130 7 143 100 -60 -151 -54 116 135 -9 -141 -97 67 142 44 -118 -134 12 129 85 -71 -152 -46 120
7135 120 134 -13 -144 -94 71 156 47 -113 -118 22 139 90 -74 -142 -40 129 134 -22 -135 -74 91 151 23 -123
7159a23QJ36J31o8j74n5J29J41nj54j26P9J62N9j28j42J7J58J08p5j69n1J27J51
7183A36k3j45j09P6J69M1j23j48L2J40J12q7j63m4J41J35k7j66r6R6J65K7j41
7206bj34L8J51R3r5j61k1J31J36m5j66o6Q5J72K6j47j21L1J68P6r5j63k2J45J33
7231A47m1j62q3J05J47K3j50j25M9J66O5j08j54qJ48J24m9j70o6J12J43J0j59
7254c6j10N4J71N8j06j54%J56J12o8j52n9J12J46j3j45j04P2J59O2j31j45PJ67
7278E3J09p8j76m1J27J35j2j62r5O6J55N0j24j34K2J46R8q4j53l8J23J39k9j47
7302e0j04Q6J66L4j39j28L6J58Q8q2j64k8J41J22k3j68p5R7J51J1j25j25L3J56
7326F8P7r7j57j4J28J16m1j40q8R6J47L6j54j17N5J48P2j02j43mJ30J19m8j62
$$ plain form
7159 -123 -115 21 152 84 -90 -145 -16 125 120 -34 -160 -81 81 140 12 -130 -113 45 153 78 -91 -142 -15 136
7183 136 113 -32 -141 -65 104 145 22 -126 -94 46 158 71 -92 -136 5 140 113 -53 -149 -53 112 139 -2
7206 -2 -136 -98 53 146 51 -110 -131 0 136 91 -75 -141 -56 116 142 -5 -126 -95 73 149 54 -109 -131 14 147
7231 147 106 -56 -139 -34 113 136 -14 -139 -90 76 141 33 -121 -129 19 143 94 -76 -142 -30 113 123 -36
7254 -36 -146 -92 79 137 31 -123 -123 33 145 77 -75 -134 -22 124 111 -34 -138 -66 93 155 24 -121 -114 53
7278 53 162 84 -92 -133 -6 129 117 -45 -140 -74 81 131 7 -127 -105 41 139 55 -98 -136 -13 126 97 -50
7302 -50 -154 -68 98 132 -7 -135 -99 59 147 65 -99 -127 14 136 113 -55 -130 -33 118 129 4 -121 -88 68
7326 68 145 48 -109 -123 5 121 80 -60 -148 -52 95 131 -23 -140 -85 63 135 33 -110 -114 16 135 87 -75
7350g5n9J01J44J3j38j12N7J47O9j17j36nJ45J19p0j55n4J06J31J2j41j12N4J53
7374G7N0j07j40J1J44J08p3j47n3J02J41j0j45r6O7J53N2j18j35J1J59Q7p1j59
7398i2m1J30J22j6j38r5P9J55K8j23j33J8J59Q0p6j55k4J25J10k9j42q3R1J42
7422I2J0j09j25M2J39P7r0j46j0J19J18k9j49o2Q2J35K3j30j10L7J54P0r0j46
7446i8j3J26J12k9j48p1R4J44Mj35j16M7J52O0j02j29rJ28R9m9j49m6R3J40Kj41
7472c4q7N5J47L9j02j32J4J28J02n1j43m5J01J16Mj30j03O4J36M4j05j16%J31
7496C3Q6n3j50k8J01J24j2j36r6P4J31M3j14j24K5J31R1p2j22n6J21J21l5j26
7520d3p5P2J36K8j11j06K5J25Q5p3j41k2J13J08k3j45p2Q3J24K9j20j15L3J39
$$ plain form
7350 -75 -134 -33 111 124 -14 -126 -69 78 147 30 -106 -111 34 153 83 -72 -126 -20 111 123 -18 -130 -76 77
7374 77 127 20 -120 -109 35 143 70 -77 -130 -28 113 103 -42 -138 -71 82 134 16 -119 -108 51 138 67 -92
7398 -92 -133 -3 119 103 -35 -130 -51 104 132 9 -124 -106 53 133 57 -98 -122 3 113 84 -58 -141 -50 92
7422 92 102 -7 -132 -90 49 126 36 -110 -120 -1 117 88 -61 -123 -41 94 117 -13 -123 -86 68 138 48 -98
7446 -98 -111 15 127 98 -50 -121 -27 117 121 -14 -130 -83 69 129 27 -102 -111 17 116 67 -82 -128 -35 105 107 -34
7472 -34 -121 -66 81 120 18 -114 -100 28 130 79 -64 -109 -8 108 112 -18 -121 -57 79 123 18 -98 -98 33
7496 33 119 66 -84 -112 -11 113 101 -35 -131 -57 74 117 3 -121 -96 35 126 54 -68 -124 -3 118 83 -43
7520 -43 -118 -46 90 118 7 -99 -74 51 136 63 -78 -100 13 121 98 -47 -119 -36 88 117 -3 -118 -85 54
7544E4P2q7j33k1J23R9l0j25q2R2J30J7j13j09L4J40O9r0j37j1J26J02n0j16o2
7569a08Q9J26kj16j04N4J38M8r3j24j1J38Q6n6j28o5J11J18qj15r1L6J42L9q8
7594A6j21MJ25J00n9j37n5J00J25jj26q5O5J18N2j06j18J6J24P6m3j35n2J06J08
7619I7%j32q1N9J25M6j01j17RJ25P3n9j25l3J04J06k6j20o8N5J30L3j04j08K6
7644h6J21P7o4j25k8J12R7j8j15q4P4J27K2j07j06K4J19O5o6j28j2J01J09k9j35
7669e5n7P1J13K7j08j08L0J24P9q0j18k0J11J08m5j15o8Q6J15J2j14r0L6J25O3
7694A22q7j06qR9J03m0j28o1P7J16J0j15q7M1J27L3p1j20kJ16Q9n4j22l8P9J10
7720H3jj14q6N8J21M0q2j03JJ08Q9o2j20l2Q3J20pj25o4N1J15M0r6j04PJ17P6
$$ plain form
7544 54 126 39 -94 -115 8 107 77 -48 -130 -38 92 109 -4 -113 -79 61 130 40 -97 -108 18 120 70 -46 -108
7569 -108 -19 107 105 -11 -115 -61 77 125 32 -92 -103 35 121 65 -63 -128 -17 101 93 -22 -113 -77 65 104 16
7594 16 -105 -101 24 124 65 -72 -127 -27 98 97 -29 -114 -49 69 121 15 -103 -87 37 113 70 -65 -117 -11 97
7619 97 97 -35 -116 -57 68 114 13 -104 -95 30 103 44 -81 -114 -10 96 70 -50 -118 -63 67 100 -4 -112 -86
7644 -86 35 112 48 -77 -105 7 104 86 -29 -113 -39 88 110 3 -103 -79 40 105 39 -89 -101 0 109 80 -55
7669 -55 -112 -41 72 99 -9 -117 -87 37 116 36 -82 -102 9 117 72 -43 -111 -25 90 102 -12 -102 -66 59 122
7694 122 35 -71 -79 20 123 83 -45 -106 -29 87 97 -18 -105 -64 63 96 25 -95 -97 19 108 54 -68 -106 -27 83
7720 83 82 -32 -118 -60 61 101 19 -84 -83 25 114 52 -68 -100 -17 103 96 -29 -93 -42 73 113 17 -87 -80 37 113
7747A13n6j27l3R6J04oj29q4P5J14L2r5j12K1J10P5n5j23l5J04J03Jj35o3N7J28
7773H0L2j04j02J8J29O4p4j20k6J15R9j9j39o6Q8J15J8j03j09L2J26N8q4j24o
7798a02J07J03k9j32n6P2J22J1j08r7L9J15O7q0j10k1J12J01l4j16o7P5J11J5
7822I8j10q6M1J12O4q9j24KJ17Q7n4j11o0R1J16Kj11r2M8J22N0r4j16JJ11Q4m0
7849E9j27m0Q8J14nj16p3M7J17O0r9j11J4J06Q0m8j20m5Q8J19j0j15q2O0J16L6
7875A13j03j09J3J16P3n3j24l9J03J00j0j25o1O3J14K9r4j05RJ24O9n0j33j7R6
7900aJ10l4j14o5P3J13J9r9j03L6J12P0o6j21l2J10R8m2r2q9P6J22J8j00j03K5
7926g9J23O4p8j14j5J00J01l6j14o0P4J25jr5j03M8J21N4p6j28jJ24Q1m3j28l5
$$ plain form
7747 113 57 -70 -103 -7 97 91 -38 -122 -47 67 99 4 -108 -87 23 98 43 -80 -115 -11 92 93 -42 -105 -48 80
7773 80 112 8 -94 -76 53 117 43 -77 -103 12 111 92 -47 -113 -25 90 108 5 -104 -72 54 112 28 -96 -102
7798 -102 5 108 79 -53 -109 -37 85 96 -12 -109 -70 45 112 32 -78 -99 13 114 80 -36 -103 -28 83 98
7822 98 -12 -98 -57 55 119 30 -94 -92 25 112 58 -53 -113 -22 94 96 -15 -107 -59 63 113 19 -97 -96 15 99 59
7849 59 -68 -108 -20 94 89 -27 -100 -53 64 124 25 -86 -72 34 114 66 -54 -99 -11 108 98 -17 -99 -39 77 113
7875 113 10 -99 -86 30 103 50 -74 -113 -10 90 80 -45 -106 -43 71 100 6 -99 -90 34 103 53 -80 -97 -1
7900 -1 109 75 -39 -104 -31 82 101 2 -101 -65 47 117 51 -70 -102 8 106 64 -28 -117 -41 81 99 -1 -104 -79
7926 -79 44 108 30 -84 -99 1 102 66 -48 -108 -34 91 90 -5 -108 -60 61 115 39 -89 -90 34 115 72 -56 -91
7952i1Q1J05Lj06q6K8J35N2p9j30kJ17Q8n5j19n3Q2J30rj20p2L3J28M6q2j19J0
7979h5J09Q9n9j24l5R0J21nj21q6P6J14K4r6j02J1J13P9n5j24l0J03R0nj21p5
8005a04O2J20L1j09j07L3J12O0n8j19k5J02J06k4j24o5O5J30Qj05r7M1J16P3o9
8030E3j26j6R8R9k9j17o1P5J10K1j00j06M4J19N4q8j26jJ12Q8k4j33n3Q6J00K
8056H1r4r4L8J25N5r0j04j5J13R5m0j31m5Q0J12Mj03q5M5J19M5p5j24MJ20P9n3
8083F2j23m2R1J13j1j14q6M7J27M5q4j25J3J03Q7n6j18l0R6R4pj14p1O6J14K5
8109A02j02r3J9J19P0o5j26k0J06R4j2j18p8O8J11M3j13j07K7J14P6p2j21k1J01
8134BJ08l0j29o5P9J11K2j04j10L4J35N6p8j15j9J16R0l1j15n5P6J11J7j09j01
$$ plain form
7952 -91 -10 95 98 -8 -94 -66 69 121 42 -88 -90 27 115 60 -59 -112 -30 100 91 -29 -101 -68 60 106 24 -95 -85
7979 -85 24 113 54 -70 -105 -15 106 101 -20 -106 -30 84 108 12 -90 -79 34 113 58 -66 -96 7 97 92 -29 -104
8005 -104 -42 78 109 0 -107 -74 38 98 40 -79 -104 -2 104 80 -44 -109 -44 86 94 -11 -108 -67 49 122 53
8030 53 -73 -89 9 108 79 -38 -99 -24 86 107 7 -99 -55 64 118 30 -96 -97 15 103 79 -54 -107 -21 79 81
8056 81 -13 -107 -69 56 111 21 -83 -98 15 110 70 -61 -106 -26 86 90 -13 -98 -53 66 111 36 -88 -84 36 115 62
8083 62 -61 -103 -12 101 90 -24 -110 -63 64 109 25 -100 -87 16 103 47 -71 -101 -5 89 82 -32 -103 -37 77 102
8109 102 0 -93 -74 45 115 50 -76 -96 10 104 92 -26 -104 -36 75 118 5 -102 -75 39 115 43 -78 -99 2
8134 2 110 80 -49 -114 -35 76 98 -6 -116 -82 53 109 31 -84 -103 13 103 72 -43 -98 -22 89 106 -3 -104
8159a04L9J24O5r0j17j3J20R6m7j32m5Q6J10lj02r9N2J23M4q1j23PJ04Q6m2j28
8185g0l0Q0J10lj13q2
$$ plain form
8159 -104 -65 59 124 34 -83 -96 24 120 73 -59 -104 -18 92 89 -13 -112 -60 63 107 26 -97 -90 14 100 58 -70
8185 -70 -100 -20 90 87 -26 -108
8191a08
$$ Imaginary data points
##PAGE= N=2
##DATA TABLE= (X++(I..I)), XYDATA
0@%%%%%%%%%%%%%%%%%%%%%%Kj0J6j6J6j6J6k1K9l2L6m4M8n2O2p0P8q6R6j09J21
43F4j36J50j66J84k02K23k47K72l00L32l63L99m41M85n34N93o57P27q10R04j010
64e33J132j261J357j251m0J7236K21723J540l03909k11595J24446L09243J03973
77B62061k18801k69012J8091K74687J89511j32900k85469q4902K21677K51492
87B26435k6847k71358j80359J28214K76374Q4484k04874k38024K0854K46562J64144
98B25605j19142k48794o7939J95601K13211l4640k39426j46691J27738K44657
108A50180O0045j97150k11134L2833K32735J45189j17496k30208n8215J81162
118a2059J91583l5338k14575j24368J19980K13341M0698j82098j78846M5129K12359
$$ plain form
0 0 0 0 0 0 0 0 0 0 0 0 0 0 0 0 0 0 0 0 0 0 0 0 2 -8 8 -8 8 -8 8 -13 16 -16 20 -24 24 -28 34 -36 42 -44 52 -57 64
43 64 -72 78 -88 96 -106 117 -130 142 -158 174 -189 210 -231 254 -280 313 -344 383 -427 477 -533
64 -533 599 -662 695 -556 -596 16640 238363 239903 -64006 -275601 -151155 158088 262061
77 262061 43260 -225752 -207661 67026 256537 123637 -161832 -246734 -25057 226435
87 226435 199588 -71770 -252129 -123915 152459 236943 32069 -205955 -185101 61461 225605
98 225605 106463 -142331 -210270 -14669 198542 163902 -75524 -222215 -94477 150180
108 150180 210225 13075 -198059 -165226 67509 212698 95202 -135006 -193221 -12059
118 -12059 179524 144186 -70389 -194757 -74777 138564 179262 -2836 -181682 -136553 75806
129G5806J17933j19333k07276m1260J70903J69322l8591j93068j06194J08976
139f2782J84098K9392j59362j47379M8193J82998R0047j14484j77324k1682J59704
150A1419J44140m7051j77730q9333J05854J66915K2010j46286j30127M7071J62872
161F9754P3933j06951j53465p943J47951J20197n6842j63776o8883J09971J52438
172A16384Q125j43349j16448N2111J52233O2569j01971j36345n46J33853R9595
183A26211n8993j43412m8929J06398J29893o846j34460r6371N8695J39578M8983
194A20747r8888j22169M465J22004Q6062n5590j25379l7682R6489J09308j4892
205H4475j21085p6825O3336J25785L3205j00152j10080J4721J19842P6644n9487
$$ plain form
129 75806 193739 74406 -132870 -174130 -3227 166095 127504 -65564 -171758 -62782
139 -62782 121316 150708 -8654 -156033 -107840 75158 165205 50721 -126603 -148285 11419
150 11419 155559 108508 -69222 -158555 -52701 114214 136224 -10062 -140189 -93118 69754
161 69754 143687 36736 -116729 -124672 23279 143476 86634 -77142 -146025 -36054 116384
172 116384 124509 -18840 -135288 -83177 69056 131625 29654 -106691 -107237 26616 126211
183 126211 67218 -76194 -125123 -18725 111168 104322 -30138 -126509 -67814 71764 120747
194 120747 21859 -100310 -95845 26159 112221 56631 -68748 -106430 -9941 99367 84475
205 84475 -36610 -113435 -50099 75686 108891 8739 -101341 -86620 33222 109866 50379
216E0379j19657l1098R4099J00129j8894j13141o4961O4924J13770K0288r9276
227c438r6120K6192J16352O3403o6738j13710k1361R4960R2504k2918j06894n6935
239i4703O2176J01457J3505r0360q0347L0338J03346M7694o7543r9617q947R2511
251I510Q0201k9843j01867m8419O2956R4678R374q5606p2597L0733R4657L9455
263H3232o5560q8890p12Q9578O9228l7427r8772l8770O8780R1640K409q8378o9502
276h3144L3973R3296L6232o4461q3100K331Q4092N9966l9495q9843k8155O8995
288i313Q1132o798q6244n9702L9243Q8797K9400o4240p6957M791P8330N3233l7379
301C4293p9906k1921O3416O9226j1859p8926m8261M2725Q1672K0313o6015p1291
$$ plain form
216 50379 -69278 -100376 -6277 93852 74958 -38183 -103144 -38220 75550 95838 -3438
227 -3438 -99558 -73366 42986 106389 39651 -74059 -95420 -460 92044 69126 -37768 -94703
239 -94703 -32527 68930 82435 -7925 -88272 -57934 45412 93106 25563 -74054 -83001 9510
251 9510 89711 59868 -41999 -90418 -27462 67216 76590 -9016 -81613 -50880 43777 83232
263 83232 17672 -71218 -71930 17648 86876 49449 -49323 -88093 -19313 72327 74736 -13642 -83144
276 -83144 -49171 44125 80357 15896 -67204 -64873 19219 79185 39690 -50153 -78308 -9313
288 -9313 71819 65021 -21223 -80925 -41682 47115 76515 12275 -64682 -59891 18439 71672 34293
301 34293 -45613 -67534 -4118 65108 53249 -25677 -73938 -31213 50459 70772 4757 -66534
313f6534J0384P8273M9468l9191p7792j9708O1641O4889j3097p4216m1873M3498
325b4258P4924J2575o6337o3585J8002P7815M2142m4829p6131j4227O3617O1904
337F1612j5436p1615l7958M1950O8057Q665o1123n4038K0850P0100L2298m5839
349A7523o7752o513O2473N4816j9282o8575l3523M1322O3630P334n6495m8842
361e3884J9603O2779K6810m3125n9351j058N9494M6745k4319o6091k6801M5364
373a3834O1724K616n8755m7120K1967O2440K4804m2956n6008J369N6853M0761
385E3861k6823o1390j9483M7183N5961m133n9107m1677K6135O0985K1094m3171
397I435n2902K247N2840L6711k4597n4054j5393M2441M7045p402n3163l3201K8170
$$ plain form
313 -66534 -56150 22123 71591 32400 -45392 -65100 -3459 61430 48333 -25883 -67756 -24258
325 -24258 50666 63241 -3096 -66681 -48679 29136 71278 26449 -49682 -63909 -292 61612
337 61612 46176 -25439 -63397 -21447 46610 55275 -5848 -59886 -39036 31064 63362 17523
349 17523 -50229 -56742 5731 60547 41265 -27310 -60833 -19511 44119 51453 -5042 -53884
361 -53884 -34281 28498 55308 12183 -47168 -48226 11268 58013 33694 -32397 -59198 -13834
373 -13834 47890 50506 -8249 -55369 -33402 29038 53842 10886 -45122 -43753 13100 53861
385 53861 27038 -34352 -53835 -6652 49309 45176 -13931 -55608 -29473 31512 52606 9435
397 9435 -43467 -41220 11620 48331 23734 -30320 -45713 -3272 43773 36371 -16792 -49993 -21823
410b1823N5284J4623m3818m8503N816N2140L4018k5187n2074j4103M0636M3820
422D0829q113m9785k8697K8971N1020R258m4953m4114J1338N3336L0132k9725
434A9497n2787j1302M2978M3461r183m9031k7190K7868M7135P029m1688l7994
446d1207J3500M8533K3333l1000m7388n718M2701L8749j2042m7093k4191K7326
458a4497M3896O151l8080l3955J2556M2856J9055k8997m1055j636M0602L3038
470C9934j5618m5618j9909L0124M3196L555l9678l3581J3432M2742J8508k8321
482H766l9035m74L8672K9166j7375m2742j4838L1965L9739j365m0855l0319J6828
495b1867M2662J6208k9076l7472J96L6362K6449j6132l7768j1743K9016L3441
$$ plain form
410 -21823 33461 48084 4266 -44237 -38421 13719 47737 22550 -29524 -43627 -2991 40829
422 40829 32716 -17069 -45766 -16795 34225 43483 -1470 -45584 -34246 19090 49222 19497
434 19497 -33290 -44592 -1614 41847 32664 -16367 -43557 -15689 31446 38475 -3213 -41207
446 -41207 -27707 20826 44159 13159 -34229 -39947 2754 41503 29461 -17632 -41823 -14497
458 -14497 29399 35550 -2530 -36485 -23929 18927 37982 8985 -32070 -33706 6896 39934
470 39934 24316 -21302 -41211 -11087 32109 35664 -4014 -37595 -24163 18579 37087 8766
482 8766 -30269 -30743 7929 37095 19720 -23022 -37860 -5895 33844 32479 -8376 -38695 -21867
495 -21867 20795 37003 7927 -29545 -29349 7013 33462 17330 -20438 -32181 -3165 30276
507C0276m085l6923k4293J8477L8846J1818k9420l4582K161L5414K4845j5598
519A6936l5697j1259K6526L0460m008l3382k0591J8585L4992P561k9992l0914
531c0783O465L6284K1748j9232l6394q991K8731L0384n301l3447j9335J8654L2671
544B1454N344k8746k6741R015L3922J6902k1284l3542m797K9562K7718p535l2676
557a1404j7600J8145L0456N053k5639k3618P922K9099J3447j9344k8099j575K7427
570D270K2791j0099l0926j4052J9893K9391L064k6469k2968Q583K8745J2714j9000
583E937k6434l38K6427J9951j2019k9607j0370K2275K7894p58k8608k1528J1548
596a5630K9965J1645k0164k6324m8K5341J8553j1279k6461q122K0485K3443l049
$$ plain form
507 30276 26191 -10732 -35025 -16548 22298 34116 4696 -29886 -27725 7689 32534 16936
519 16936 -18761 -30020 -3494 26966 22958 -10424 -31015 -12430 22562 30123 131 -30783
531 -30783 -24318 11966 33714 14482 -21912 -30903 -2172 28212 22911 -10536 -29871 -11217 21454
544 21454 26798 -1948 -28689 -19674 14248 31150 9866 -23676 -28473 1089 28807 21272 -11404
557 -11404 -29004 -10859 19597 24650 -989 -24607 -16685 12414 25861 6517 -21582 -23157 4270
570 4270 27061 16962 -13964 -28016 -8123 21268 24332 -2137 -25105 -16522 12223 24937 5937
583 5937 -20497 -20835 5592 25543 13524 -16083 -26453 -4178 23716 22958 -5650 -27178 -15630
596 -15630 14335 25980 5816 -20508 -20556 4785 23338 12059 -14402 -22524 -2039 21404 18355
609A8355k6075j6992J3133K7302Q230k0648k4153J528K4633J7208j0899k4692
621a3070p565J8542K0907l176k3331j4007J3363K4509N037k1350k1806M691K5789
634H533J5460j3632k5849o456K0321K1573l738k3742j3667J3403K3298L600k0842
647a738j9126O842K4690J2026j5738k4387l316K1696K0115n663k3862j2650J3451
660g660K2082L358j8857j6964O142K1307R529j4419k0554r88K0213J6765p368
673A2586k2677j0467J4311K1469K605j8937j6819N773K0594R420j3361j9055m87
686a5045J8927J4521q512k1427p725J6031K0407k98k0774j5902Q199K1895Q711
699A9008j4674j9314q2J8658J3642q431j9648n960J5380J7546k272j9608j2888
$$ plain form
609 18355 -7720 -24712 -11579 15723 23953 3305 -20848 -19320 5313 22521 11622 -13070
621 -13070 -20635 -2093 18814 15638 -7693 -21700 -8337 16172 21209 -141 -21947 -17256 8533
634 8533 23993 10361 -15488 -21944 -1623 19950 16212 -7530 -21197 -7794 15504 19104 -1738
647 -1738 -20864 -14022 10668 22694 6956 -17431 -20747 949 21064 15401 -8461 -21111 -7660
660 -7660 14422 17780 -1077 -18041 -11899 9408 18937 4518 -16036 -17024 3189 19954 12586
673 12586 -10091 -20558 -6247 15222 17827 -1110 -17929 -12156 8438 17858 4497 -14558 -15045
686 -15045 3882 18403 9891 -11536 -19261 -3230 17177 16879 -3895 -19797 -11598 10297 19008
699 19008 4334 -14980 -15062 3596 17238 8807 -10841 -16801 -1421 16125 13853 -5755 -18643
712a8643R719K0531O461j5207j8150P03J8022J2990p530j8003n935J3111J5266
725A3335j872j6641j0361R247J7631L993j5002j5846K849J8276J1474r220j8481
738a0618n093J4149J5512k285j6779r963R415J6727K762j5013j4034M821J8093
751G694R086j1375j8105k796J5798J5064l717j7436r641R463J6198K797j3530
764e00j2479M221J5405P070j0273j4913r39J4472J2216n002j6219p742R916J5305
778A0538K140j3165j1950L817J4360O698r280j3353l46J3339J0282o045j5298
791h263n589J1434J4705l2j4844j1597N659J5712O450j0360j3902j61J3330R795
805A2337o087j4144m199J1219J2683j822j4348r260P220J4955M569j1139j3124
$$ plain form
712 -18643 -8924 11607 18068 2861 -15289 -14586 3436 16426 8896 -9107 -15042 -1931 13335
725 13335 11463 -5178 -15539 -6292 11339 15332 330 -15516 -12667 5609 17083 7863 -10618
738 -10618 -15711 -1562 13950 11665 -5114 -15077 -5662 11065 13827 -1186 -15220 -10399 7694
751 7694 16780 5405 -12700 -15496 302 15366 11649 -5787 -15428 -5965 10233 13030 -500
764 -500 -12979 -8758 6647 13717 3444 -11469 -12408 2064 14280 9278 -6941 -14683 -4767 10538
778 10538 12678 -487 -12437 -8620 5740 12438 3158 -10195 -10541 2798 13080 7035 -8263
791 -8263 -13852 -2418 12287 12255 -2589 -14186 -8527 7185 13635 3275 -10627 -10788 2542 12337
805 12337 6250 -7894 -12093 -874 11809 9987 -4361 -13621 -6401 8554 13123 1984 -11140
818a1140O78J3091R198n637j2930l958R632J0819j701j2131p224O963J2760K706
832A1126j1001j1441K110J3206Q319o578j3246l741J0006J1069j542j1902p038
845a0653O699J1913J855j0840r991L623J3139O462q406j3173j887J1661J0910
858A1312k960j2837o806P234J1837J656j0272q983L641J1607M892q130j1165l09
872i283J1141R061m041j2248n666P555J1354J490r764q717K889J0460M747o831
886B147r600n8R707P317m558j1096l895Q433J0614j71j0851q318M299J1414M454
901I838p737j0031K50R967O931m970j0579k708Q824R467j820j1140o858N859J1511
916F804L238q746r956P61J0098O842m524r802k735P455Q033j575r210n212N485
$$ plain form
818 -11140 -10462 2629 11827 6190 -6740 -10698 -1066 9753 8052 -4079 -11303 -4340 8420 11126
832 11126 125 -11316 -9206 4000 12319 5741 -7505 -11246 -1240 9829 8287 -3615 -10653
845 -10653 -3954 7959 9814 -1026 -11017 -7394 5745 12207 3801 -9372 -11259 402 11312
858 11312 8352 -4485 -11291 -4057 7780 9436 -836 -9819 -6178 5429 10321 2191 -8974 -9283
872 -9283 1858 10919 6878 -5370 -11036 -3481 7873 9363 -401 -9118 -6229 4231 8978 2147
886 2147 -7453 -7511 2196 9513 4955 -6141 -10036 -1603 9011 8840 -2011 -10329 -6030 5384 9838
901 9838 2101 -7930 -7680 2287 9218 4248 -6331 -9039 -215 9252 7432 -3708 -10566 -4707 6804
916 6804 10042 1296 -8660 -7899 2199 9041 4517 -5285 -8020 -565 7468 5893 -3317 -8529 -3044
931c044R557J762q388q430J817R869N974n044r714k531P500P967j426q815m925
946g871N292Q794R97q366p337L102J0049M696o670j0052j201R076Q269k522r908
961c652n007N806R023R42q088o740L200R059L478o666q610J79Q897O822l557r586
977d500m022O182Q667P11p737o437K671Q119L248n644p313M01P755N421l879q694
993e051k778O754Q230l23q527o363L454Q862L327o083p699L58P784N235m049q264
1009e133j900P118P355j703q917n249M936R146K290p215p808R81Q236N196m030
1024C303p934j794O407O382j726p728m020M831P868J222p055o866J642Q119M794
1039G445m180p853j979O042O362j175p020l874M217O950P71o624n819K480P961
$$ plain form
931 -3044 6513 8275 -113 -8543 -6726 3143 9117 4073 -5641 -8172 -672 7295 5869 -2946 -7871
946 -7871 -2579 6215 7212 -1154 -8491 -5389 4660 9356 2686 -7366 -8567 509 8778 6256 -3652
961 -3652 -8659 -2853 6170 7112 -976 -7716 -4516 4543 8021 1355 -7255 -7076 1821 8643 5086 -4500
977 -4500 -8522 -2340 6327 7038 -699 -7136 -4465 3654 6902 1258 -6055 -5654 2101 7522 3643 -5051
993 -5051 -7829 -1075 7155 6832 -1695 -8058 -4604 4258 7585 1502 -6197 -5839 1945 7180 3131 -5133
1009 -5133 -7033 85 7440 5737 -3180 -8429 -3493 5653 7943 728 -7080 -6099 2137 7333 3303
1024 3303 -4631 -6425 -18 6364 4638 -3090 -7110 -2279 5589 6811 -244 -7110 -5468 2651 7445
1039 7445 3265 -4588 -6567 -525 5837 4662 -2358 -6232 -2015 4935 5706 -918 -6737 -4257 3704
1054C704L701n283p954r29P202O524k047p909l925M768P247O20o703n424K792
1069c616P520K800n631p204J71P474N745k941q037l424N092P278O78o383n399
1084e877K101O659K795m500o017J47O219M521k969o966k390N222O593j6o645n148
1100f271K525O928K776m650o099J54O114M213l129o605j626N617O013j198p182
1115b420m416L810P471K066n723o442N95O620M359l120o447j615N115N270j272
1130C851o260l360L831O356J110n591n565J185O428L904l177o246j657M697N052
1145D558q28n515l125L247N506P24n160m710J783O278L136l991o350j015N541
1160G9N307j323o180l317L543N753O91n159m396K039N973K325m394n778M8N932
$$ plain form
1054 3704 7405 2122 -5832 -6761 441 6965 4918 -2991 -6916 -2148 5099 5719 -984 -6408 -3616
1069 -3616 3904 6704 1073 -6131 -5960 1514 7259 4318 -3719 -7143 -2051 5227 5905 -478 -5877
1084 -5877 -3776 2883 5678 1178 -4839 -4692 1527 6048 3079 -3887 -6277 -1055 5538 5522 -1123 -6271
1100 -6271 -3746 3182 5958 1308 -4791 -4637 1477 5690 2561 -4044 -5670 -53 5960 4762 -2420
1115 -2420 -6836 -3026 4445 6511 788 -5654 -5059 1561 5920 2800 -3647 -5262 -147 5123 3851
1130 3851 -2409 -5769 -1938 4418 5528 -63 -5628 -4443 1985 5889 2712 -3534 -5191 -494 4558
1145 4558 3730 -1785 -4910 -1663 3843 4567 -593 -5303 -3520 2758 5894 1903 -4447 -5462 79
1160 79 5386 4063 -2117 -5434 -1891 3862 4553 -606 -5002 -2963 3010 5335 941 -4837 -4789 1143
1176A143M643k297o438k778M098N815N30n163m303J769N422K190l756m897J81
1191c841N122L714k414n723k042M196N432J13n295m262J837N532K416l568m908
1206c691p5M745L481k311n223j459M356M818p91n629l627K902N953J762m502n219
1222d510M36N339L552k564n288j297M260M399j093n285k874L219N431J045m732
1237C8m786Q88N402L431k565n262j554L814M322n18m525k766K511M593Q11m106
1253b72l973J208N048K760l006n190j052M314M406q53m940k841K729M729P31m189
1269c91l737J563M962K111l549m940j88M920M104j705n447k579L285N009O88m254
1285a48l841J281M594K083l000m262j10M256L288j763m783j960L288M584L88m228
$$ plain form
1176 1143 5786 3489 -2949 -5727 -1629 4186 4716 -447 -4750 -2981 2441 4631 875 -4022 -3841
1191 -3841 1281 4995 2581 -3142 -5184 -988 4444 4557 -738 -5000 -3163 2369 4785 1217 -3691
1206 -3691 -3766 979 4460 2149 -3074 -4533 -177 4641 3850 -1779 -5406 -2504 3449 5211 709 -4510
1222 -4510 -4074 1265 4817 2253 -3035 -4332 -72 4327 3234 -2051 -4925 -1706 3725 4770 38
1237 38 -4748 -3860 1542 4973 2408 -2854 -4408 -594 3728 3210 -1315 -4081 -1570 3023 3834 -272
1253 -272 -4245 -3037 2011 4771 1765 -3425 -4477 -163 4243 3390 -1550 -4391 -1662 3067 3798 -391
1269 -391 -4128 -2565 2397 4508 959 -3981 -4169 751 4855 3150 -2297 -4876 -1591 3418 4106 -148
1285 -148 -3989 -2708 1886 3969 969 -3293 -3403 853 4141 2378 -2405 -4365 -1077 3507 3895 -333
1301c33l720J248M541K227k709m144l52L818L089j633m350j530L354M204k65m557
1317a112l326K015M950J900l433m501r5M266L253j738m410j476L311L845n38m311
1333a400k692K375M585J191l740m146M40M423L071j897m404j557L046L740j78
1348B857l773k540J903L936R97l302l561O50M195K655k153m423j340L325L907
1363C333k30l954k720J811L956J051l143l324Q42L987K118k575m163n54L839L580
1379C854j045m400k436K440M238Q60l434l353Q56L871J949k399l729l19L566L036
1395C555j277m124j977K596M075O65l480l393O95L816K238k005l576p02L008K830
1411B944r61l572j659K475L607K07l577l029J257M070J906k532l826m23L395K913
$$ plain form
1301 -333 -4053 -2805 1736 3963 1254 -2890 -3242 576 3665 2032 -2318 -3848 -494 3710 3445 -1112
1317 -1112 -4438 -2423 2527 4427 994 -3507 -3602 664 3917 2179 -2231 -3707 -396 3449 2911 -1400
1333 -1400 -4092 -1717 2868 4059 319 -3827 -3387 1036 4107 2210 -2194 -3751 -705 3035 2857
1348 2857 -916 -3456 -1553 2383 3380 78 -3483 -2833 1362 4017 1864 -2559 -3899 -574 3333
1363 3333 3103 -851 -3571 -1760 2196 3247 104 -3220 -2378 1609 3727 1152 -3011 -3565 274 3854
1379 3854 2809 -1591 -4027 -1587 2651 3511 77 -3276 -2420 1451 3400 1001 -2728 -3047 519 3555
1395 3555 2278 -1846 -3823 -1227 2848 3513 33 -3360 -2665 1151 3389 1384 -2192 -2894 114 2944
1411 2944 1983 -1589 -3248 -773 2834 3041 -536 -3565 -2308 1762 3668 1136 -2690 -3113 282 3195
1427C195j182l688j481K609L378j90l603k532J770M020J318l033l750L3L751K914
1443C529j363l837j632K433L353J16l115k401J344L391J152k601l172K21L424
1458H42K497j500l710j447K532L405J36l186k500J231L336J162k449k945L91L301
1474A096K051j874l601q49L053L268m91l674k389J761L669J074k720l020L92L230
1490I76J919j793l234n65K864K766q05l466j902J966L507Q33k796l014L65L168
1506G89K065j504l094p79K431K546n94l028j649J895L171N14k893k803P18L391
1522A176J971j843l330p45K652K674o09l058j548J904K941J72k889k337J227L353
1538A711J340k344l224k06L057K586r81l266j493J991K919K05k684k151J082K995
$$ plain form
1427 3195 2013 -1675 -3156 -547 2831 2641 -962 -3494 -1724 2296 3614 581 -3169 -3136 615 3529
1443 3529 2166 -1671 -3303 -870 2483 2599 -516 -2917 -1573 1818 2970 369 -2803 -2582 842
1458 842 3339 1839 -1871 -3318 -786 2619 2755 -431 -2931 -1700 1636 2798 349 -2596 -2205 1096
1474 1096 3147 1273 -2328 -3177 -124 3144 2653 -1021 -3410 -1649 2020 3094 374 -2646 -2254 976
1490 976 2895 1102 -2132 -2697 167 2933 2128 -1338 -3240 -1274 2233 3066 270 -2744 -2379 789
1506 789 2854 1350 -1744 -2523 -92 2454 1860 -1168 -2817 -922 2249 2763 -130 -2933 -2215 1176
1522 1176 3147 1304 -2026 -2771 -119 2555 1946 -1112 -2660 -756 2185 2357 -532 -2869 -1642 1711
1538 1711 3051 707 -2517 -2723 334 2920 1939 -1327 -2820 -829 2090 2295 -389 -2540 -1458 1537
1554A537J125k195k883J9K978K353j149l270j466K067L043L70k675k350Q25K884
1570A213J260j936k631N1K738J979j363l103r63K422K902j92l047k216J335L160
1586A609J081k258k692K28K803J800j497k924o31K524K579n88l130j860J672L226
1602A942Q86k452k807J79K858J980j221k837q83K134K390l55k701j644J539K861
1618A869O55k431k604M11K966J904j460k981q49K263K484l91k701j571J592K723
1634A879L67k529k287Q83L047J473j961l042m11K661K525o74k947j580J646K735
1650A785M15k354k138Q10K724J212j848k676j91K590K245q25k913j495J696K788
1666A825M93k307k214N88K588J303j622k475j54K389J970r95k799j158J977K740
$$ plain form
1554 1537 2662 467 -2416 -2397 581 2934 1785 -1485 -2951 -884 2159 2529 -146 -2496 -1671 1213
1570 1213 2473 537 -2094 -2043 695 2674 1311 -1792 -2755 -333 2569 2377 -670 -2886 -1551 1609
1586 1609 2690 432 -2260 -2032 771 2571 1074 -1850 -2481 43 2622 2034 -1096 -2956 -1284 1942
1602 1942 2828 376 -2431 -2252 606 2586 1365 -1472 -2355 -221 2169 1814 -887 -2531 -992 1869
1618 1869 2524 93 -2511 -2100 866 2770 1310 -1671 -2520 -257 2227 1836 -865 -2436 -844 1879
1634 1879 2246 -283 -2570 -1687 1360 2833 872 -2170 -2581 80 2605 1931 -1016 -2596 -950 1785
1650 1785 2200 -154 -2292 -1482 1242 2454 606 -2070 -2261 329 2574 1749 -1164 -2659 -963 1825
1666 1825 2318 11 -2203 -1615 973 2276 654 -1821 -1975 414 2384 1389 -1410 -2568 -591 2149
1682B149J51k615k193Q88K805J258j784k516r0K380J797j078k591q02K060K369
1698B188k84k659j786J284K811R26k032k506M2K465J787j014k477q42J825K171
1714A899k26k378j573J272K569P40k067k389J99K524J821j073k612r41J814K249
1730A828j21k265j498J168K342N07k021k035N48K524J395j500k583m96K158K167
1746B118m43k465j393J344K338L76j997j847O69K364J083j599k340k19K230K013
1762B232o66k528j340J411K422M98j940j954M34K185J187j303k122k41J990J727
1778A992p48k330j060J563K303K40k146j873O58K327J113j449k127j12J990J558
1794A899r09k214p14J739K085k13k295j592J069K446Q60j720k195qK105J582q35
$$ plain form
1682 2149 2300 -315 -2508 -1620 1185 2443 659 -1857 -1947 433 2230 1152 -1439 -2241 -181 2188
1698 2188 1904 -755 -2541 -1257 1554 2480 448 -2058 -2016 449 2236 1222 -1255 -2097 -272 1899
1714 1899 1673 -705 -2278 -1006 1563 2303 236 -2153 -1954 570 2391 1318 -1294 -2235 -421 1828
1730 1828 1707 -558 -2056 -888 1454 1961 -60 -2095 -1547 977 2372 872 -1711 -2207 -49 2118
1746 2118 1675 -790 -2183 -839 1499 1875 -122 -1969 -1300 1064 2147 548 -1792 -2011 219 2232
1762 2232 1566 -962 -2302 -891 1531 2029 89 -1865 -1431 754 1941 638 -1484 -1725 265 1992
1778 1992 1244 -1086 -2146 -583 1720 1960 -186 -2059 -1401 926 2039 590 -1537 -1649 341 1899
1794 1899 990 -1224 -1938 -199 1886 1673 -622 -2214 -1145 1301 2161 441 -1754 -1762 343 1925 1090
1811A090k144p54J539J875j51k021j367J025K202O72j714k054J17K129J563q75
1827A132k192q27J506J905o2j915j320R67K034M96j709j801L79K164J303j207
1843H53k255n43J787J938k70k084j281J058K008M24j661j623M94J989R80j290
1859E24k006k24J867J710n42k112j156J181K042M10j633j644L73J866R92j112
1875E36j823k19J710J514n89k034r78J295K015L08j790j681M46J978J043j117
1891F14j836k17J611J379o25j846p21J385J762p0j862j385Q20K017P61j381j836
1908a430l5J750J308o88j812o10J316J602j72j740j162Q92J881N93j469j766O0
1925a482J821J371p09j873p37J226J634Qj572j148P44J693M89j384j527K54J759
$$ plain form
1811 1090 -1054 -1808 -269 1606 1455 -566 -1933 -908 1294 1966 252 -1802 -1685 444 2007 1132
1827 1132 -1060 -1887 -381 1524 1462 -453 -1773 -806 1228 1724 15 -1786 -1407 757 2060 853
1843 853 -1402 -1945 -158 1780 1510 -574 -1855 -797 1211 1635 -26 -1649 -1155 834 1814 524
1859 524 -1482 -1706 161 1871 1329 -783 -1939 -758 1284 1694 61 -1583 -1210 656 1648 536
1875 536 -1287 -1506 204 1718 1129 -905 -1883 -588 1427 1735 -55 -1736 -1290 688 1731 614
1891 614 -1222 -1439 172 1551 926 -920 -1641 -256 1506 1436 -426 -1811 -991 1026 1787 406 -1430
1908 -1430 -1465 285 1593 905 -907 -1517 -201 1401 1229 -511 -1673 -781 1100 1693 224 -1542 -1482
1925 -1482 339 1710 1001 -872 -1609 -383 1251 1259 -313 -1461 -717 976 1465 81 -1446 -1192 567
1942E67J121r47j841n01J432J613j89j705j081Q62J685L43j399j361M30J696Q37
1959A562j110j727k11J608J484m43j816j008J000J728L91j387j394K93J568Q67
1975A405r43j531k07J426J287m70j685q47J050J681K88j467j405L23J640R14r35
1992E24j547k20J382J192n12j586o57J148J546J8j589j255O30J736P39j137j592
2009a180j08J443J178n18j525n99J095J363p8j452j024P09J596N26j195j494K1
2026a242J504J161n69j563o48J038J374L4j342j003O06J456M62j131j372J40J502
2043D07J047p03j609n59J162J426l4j404j000N93J426M16j077j208K28J388P89
2060A288q34j426k66J266J260k92j468q73P52J461L35j130j167K24J323P21p57
$$ plain form
1942 567 1688 741 -1100 -1601 -169 1444 1255 -450 -1531 -669 1016 1359 -40 -1401 -971 725 1562
1959 1562 452 -1275 -1486 122 1606 1163 -653 -1661 -661 1067 1458 71 -1323 -1030 538 1405
1975 1405 462 -1069 -1276 150 1437 967 -718 -1565 -515 1166 1454 -13 -1418 -1095 545 1459 524
1992 524 -1023 -1243 139 1331 819 -767 -1424 -276 1270 1288 -301 -1556 -926 810 1549 412 -1180
2009 -1180 -1288 155 1333 815 -710 -1309 -214 1149 1071 -381 -1405 -696 900 1426 231 -1263 -1242
2026 -1242 262 1423 854 -709 -1357 -319 1055 1089 -253 -1256 -650 806 1268 137 -1235 -1095 407
2043 407 1454 751 -858 -1417 -255 1171 1137 -267 -1267 -674 752 1168 91 -1117 -889 499 1288
2060 1288 454 -972 -1238 28 1288 996 -472 -1345 -593 868 1203 73 -1094 -870 453 1174 417
2077D17j300k04J186J115l52j438p67Q48J454L07j193j244K00J351Q26o75j308
2094g77k84J083J040l36j278o11Q58J276R6j234j060M25J402O60q72j308j38J166
2112A08R75m04j241n09Q89J131l4j224q74N90J353M69r99j279j5J252R95m24j319
2131e60n81Q44J157O0j095q55M60J211M15r16j134O0J221Q99n44j319m93R27J187
2150I44Kj145q55M88J203L61r22j030J89J198O99p10j266k45J078J113k14j265
2168c77p96O26J254L45r46j029J65J116O46o33j113j99J006R65k81j213o84P19
2186d29J224K86j019j045J67J161P03o09j119k40R47R20k81j134n82P39J170J40
2204I99j082r96L13J245O55p14j188j99R76R40k87j106n13P19J034L2j026q22
$$ plain form
2077 417 -883 -1087 99 1214 862 -576 -1343 -495 959 1266 73 -1171 -971 380 1206 531 -777
2094 -777 -1061 22 1062 726 -552 -1163 -305 971 1067 -167 -1227 -802 600 1260 388 -920 -1058 108
2112 108 1083 679 -562 -1071 -182 949 915 -309 -1183 -593 760 1229 230 -1049 -1064 188 1183 759 -560
2131 -560 -1141 -297 860 920 -175 -1030 -570 641 1056 140 -994 -934 287 1186 642 -677 -1170 -243 944
2150 944 946 -199 -1054 -566 637 998 76 -954 -765 433 1132 422 -844 -1089 -11 1102 888 -377
2168 -377 -1173 -547 707 1052 106 -923 -758 358 1004 371 -742 -941 65 1030 749 -464 -1148 -429
2186 -429 795 1081 62 -983 -816 345 1048 439 -680 -920 27 947 666 -468 -1050 -311 859 999
2204 999 -83 -1079 -766 479 1134 420 -768 -967 9 949 662 -444 -957 -238 796 828 -198 -1020
2222a020M43J167M81q31j115n8J058Q91l49j136n18P03J041O1r70p74M02J092
2240E68M05q15j044J4J090Q49m24j198n17P72J103J02j001q35L46J070M18p48
2258A55r48O3J005O98n27j094l24Q83R98j03j076p30M93J090L33q01r06J05R76
2277B90O00n39j004k13Q87R03k23j085o33N86J111K94q68r63R1J007O68m62j010
2296e63k60P88Q31j71r86n40N80J016J85q97q93K13J051O07n73j019k26Q41Q22
2315H06k22r49m75O11R34M2r06p42L81J025M51p00j016j04R40Q12k77r90m80N96
2335b63R11P5q27o97L31R44L69o83r16J4R11P32l70r94m51O68R37P6q71p09L25
2356d88R22L71o77q36N1R10O11m46j004l00P82R19p1r43o84M00R87L21o97q20
$$ plain form
2222 -1020 -577 590 1071 240 -875 -933 125 1016 667 -469 -987 -284 757 818 -152 -926 -524 568
2240 568 973 158 -886 -872 218 1067 643 -555 -1072 -300 803 905 -96 -931 -585 485 903 155
2258 155 -793 -730 275 973 446 -648 -972 -89 909 806 -270 -1000 -507 583 916 115 -791 -686 290
2277 290 890 351 -653 -866 21 924 701 -384 -1017 -431 680 974 106 -857 -766 241 909 447 -563
2296 -563 -823 -35 796 625 -361 -901 -321 695 880 -17 -910 -697 354 961 388 -631 -857 -16 806
2315 806 584 -365 -840 -229 705 747 -159 -901 -520 505 956 256 -760 -864 76 888 611 -379 -859 -263
2335 -263 648 723 -104 -801 -470 474 843 160 -756 -742 169 901 531 -463 -914 -246 691 767 -104 -813 -488
2356 -488 434 805 128 -708 -657 253 864 418 -586 -886 -104 815 744 -199 -883 -483 504 825 128 -692
2376f92Q5Q47N49m71q86j85P75P61j78r36n50N12R57K37p57q22J17Q86N38m42
2396C45q66j97P31P29k08q91m78N63R14J48q18q03K00R50N49n16r13j97P47P22
$$ plain form
2376 -692 -607 240 789 318 -568 -753 22 783 605 -331 -881 -369 588 825 68 -754 -637 249 787 345
2396 345 -521 -718 13 742 534 -357 -835 -272 642 790 -28 -831 -631 319 868 352 -561 -758 -11 711
$$ [...]
8191b1
##END NTUPLES=NMR FID
##END=
