##TITLE=1H_Pr DMF-Bn
 CDCl3
 8 sc, 
 5.04.2022
##JCAMPDX= 6.0         $$ Bruker NMR JCAMP-DX V2.0
##DATA TYPE= NMR FID
##DATA CLASS= NTUPLES
##ORIGIN= UXNMR, Bruker Analytische Messtechnik GmbH
##OWNER= root
$$ XWIN-NMR		Version 3.5
$$ Tue Apr  5 13:13:35 2022 Russian Standard Time (UT+4h)  she@DPX200
##.OBSERVE FREQUENCY= 200.131346
##.OBSERVE NUCLEUS= ^1H
##.DELAY= (6, 6)
##.ACQUISITION MODE= SIMULTANEOUS
##.ACQUISITION SCHEME= undefined
##.AVERAGES= 8
##.DIGITISER RES= 18
##SPECTROMETER/DATA SYSTEM= spect
##.PULSE SEQUENCE= zg30
##.SOLVENT NAME= CDCl3
##.SHIFT REFERENCE= (INTERNAL, CDCl3, 0, 15.7039)
##AUDIT TRAIL= $$ (NUMBER, WHEN, WHO, WHERE, WHAT)
$$ ##TITLE= Audit trail, XWIN-NMR		Version 3.5
$$ ##JCAMPDX= 5.01
$$ ##ORIGIN= Bruker BioSpin GmbH
$$ ##OWNER= she
$$ F:/spectra/data/she/nmr/H-F/1/audita.txt
$$ ##AUDIT TRAIL=  $$ (NUMBER, WHEN, WHO, WHERE, WHAT)
(   1,<2022-04-05 13:12:29.06 +0400>,<she>,<DPX200>,
      <created by zg, POWCHK disabled, PULCHK disabled
       configuration hash MD5:
       00 E9 B6 7A A2 85 ED C7 34 08 36 98 17 FE 4E 26
       data hash MD5: 16K
       B4 BC 6B A5 C4 0C 03 57 D8 1F 85 C7 E5 A4 6A 6D>)
$$ ##END=
$$ 
$$ hash MD5
$$ 5A F6 76 E4 70 A6 9A C8 AC 0E 85 FF 95 48 17 BE
##$RELAX= 
##$RELAX= 
##$RELAX= 
##$RELAX= 
##$RELAX= 
##$RELAX= 
$$ Bruker specific parameters
$$ --------------------------
##$DU= <F:/spectra>
##$EXPNO= 1
##$NAME= <H-F>
##$PROCNO= 1
##$TYPE= <nmr>
##$USER= <she>
##$AMP= (0..31)
100 100 100 100 100 100 100 100 100 100 100 100 100 100 100 100 100 100 
100 100 100 100 100 100 100 100 100 100 100 100 100 100 
##$AQSEQ= 0
##$AQ_mod= 1
##$AUNM= <au_zg>
##$AUTOPOS= <>
##$BF1= 200.13
##$BF2= 200.13
##$BF3= 200.13
##$BF4= 200.13
##$BF5= 200.13
##$BF6= 200.13
##$BF7= 200.13
##$BF8= 200.13
##$BYTORDA= 1
##$CFDGTYP= 0
##$CFRGTYP= 5
##$CHEMSTR= <none>
##$CNST= (0..31)
1 1 145 1 1 1 1 1 1 1 1 1 1 1 1 1 1 1 1 1 1 1 1 1 1 1 1 1 1 1 1 1 
##$CPDPRG= <>
##$CPDPRG1= <>
##$CPDPRG2= <>
##$CPDPRG3= <>
##$CPDPRG4= <mlev>
##$CPDPRG5= <mlev>
##$CPDPRG6= <mlev>
##$CPDPRG7= <mlev>
##$CPDPRG8= <mlev>
##$CPDPRGB= <>
##$CPDPRGT= <>
##$D= (0..31)
0 1.2 0 0 0 0 0 0 0 0.06 0 0.03 0 0 0 0 0.0002 0 0 0 0 0 0 0 0 0 0 0 0 
0 0 0 
##$DATE= 1649149948
##$DBL= (0..7)
120 120 120 120 120 120 120 120 
##$DBP= (0..7)
150 150 150 150 150 150 150 150 
##$DBP07= 0
##$DBPNAM0= <>
##$DBPNAM1= <>
##$DBPNAM2= <>
##$DBPNAM3= <>
##$DBPNAM4= <>
##$DBPNAM5= <>
##$DBPNAM6= <>
##$DBPNAM7= <>
##$DBPOAL= (0..7)
0.5 0.5 0.5 0.5 0.5 0.5 0.5 0.5 
##$DBPOFFS= (0..7)
0 0 0 0 0 0 0 0 
##$DE= 6
##$DECBNUC= <off>
##$DECIM= 32
##$DECNUC= <off>
##$DECSTAT= 4
##$DIGMOD= 1
##$DIGTYP= 9
##$DL= (0..7)
0 120 120 120 120 120 120 120 
##$DP= (0..7)
150 150 150 150 150 150 150 150 
##$DP07= 0
##$DPNAME0= <>
##$DPNAME1= <>
##$DPNAME2= <>
##$DPNAME3= <>
##$DPNAME4= <>
##$DPNAME5= <>
##$DPNAME6= <>
##$DPNAME7= <>
##$DPOAL= (0..7)
0.5 0.5 0.5 0.5 0.5 0.5 0.5 0.5 
##$DPOFFS= (0..7)
0 0 0 0 0 0 0 0 
##$DQDMODE= 0
##$DR= 18
##$DS= 0
##$DSLIST= <SSSSSSSSSSSSSSS>
$$ [...]
##$SUBNAM2= <"">
##$SUBNAM3= <"">
##$SUBNAM4= <"">
##$SUBNAM5= <"">
##$SUBNAM6= <"">
##$SUBNAM7= <"">
##$SUBNAM8= <"">
##$SUBNAM9= <"">
##$SW= 18.0517287032376
##$SWIBOX= (0..15)
0 0 2 0 0 0 0 0 0 0 0 0 0 0 0 0 
##$SW_h= 3612.71676300578
##$TD= 16384
##$TD0= 1
##$TE= 0
##$TE2= 300
##$TE3= 300
##$TEG= 300
##$TL= (0..7)
0 120 120 120 120 120 120 120 
##$TP= (0..7)
150 150 150 150 150 150 150 150 
##$TP07= 0
##$TPNAME0= <>
##$TPNAME1= <>
##$TPNAME2= <>
##$TPNAME3= <>
##$TPNAME4= <>
##$TPNAME5= <>
##$TPNAME6= <>
##$TPNAME7= <>
##$TPOAL= (0..7)
0.5 0.5 0.5 0.5 0.5 0.5 0.5 0.5 
##$TPOFFS= (0..7)
0 0 0 0 0 0 0 0 
##$TUNHIN= 0
##$TUNHOUT= 0
##$TUNXOUT= 0
##$USERA1= <user>
##$USERA2= <user>
##$USERA3= <user>
##$USERA4= <user>
##$USERA5= <user>
##$V9= 5
##$VALIST= <valist>
##$VCLIST= <CCCCCCCCCCCCCCC>
##$VD= 0
##$VDLIST= <DDDDDDDDDDDDDDD>
##$VPLIST= <PPPPPPPPPPPPPPP>
##$VTLIST= <TTTTTTTTTTTTTTT>
##$WBST= 1024
##$WBSW= 4
##$XGAIN= (0..3)
0 0 0 0 
##$XL= 0
##$YL= 0
##$YMAX_a= 286635
##$YMIN_a= -304596
##$ZGOPTNS= <>
##$ZL1= 120
##$ZL2= 120
##$ZL3= 120
##$ZL4= 120
##$ABSF1= 10
##$ABSF2= 0
##$ABSG= 5
##$ABSL= 3
##$ALPHA= 0
##$AQORDER= 0
##$ASSFAC= 0
##$ASSFACI= 0
##$ASSFACX= 0
##$ASSWID= 0
##$AUNMP= <proc_1d>
##$AZFE= 0.1
##$AZFW= 0.1
##$BCFW= 1
##$BC_mod= 2
##$BYTORDP= 1
##$COROFFS= 0
##$CY= 11.3945322036743
##$DATMOD= 1
##$DC= 2
##$DFILT= <>
##$DTYPP= 0
##$F1P= 2.36226072786647
##$F2P= -0.459571619588291
##$FCOR= 0.5
##$FTSIZE= 0
##$FT_mod= 4
##$GAMMA= 1
##$GB= 0.15
##$INTBC= 1
##$INTSCL= 1
##$ISEN= 128
##$LB= 0.24
##$LEV0= 0
##$LPBIN= 0
##$MAXI= 10000
##$MC2= 0
##$MEAN= 0
##$ME_mod= 0
##$MI= 1.114404
##$NCOEF= 0
##$NC_proc= 0
##$NLEV= 6
##$NOISF1= 3.799351
##$NOISF2= 2.8
##$NSP= 1
##$NTH_PI= 0
##$NZP= 0
##$OFFSET= 15.70392
##$PC= 1
##$PHC0= -17826.97
##$PHC1= 9.40078
##$PH_mod= 1
##$PKNL= yes
##$PPARMOD= 0
##$PSCAL= 0
##$PSIGN= 0
##$REVERSE= no
##$SF= 200.130013532006
##$SI= 16384
##$SIGF1= 3
##$SIGF2= 2
##$SINO= 400
##$SIOLD= 16384
##$SREGLST= <1H.CDCl3>
##$SSB= 0
##$STSI= 0
##$STSR= 0
##$SW_p= 3612.71676300578
##$SYMM= 0
##$S_DEV= 0
##$TDeff= 0
##$TDoff= 0
##$TI= <>
##$TILT= no
##$TM1= 0
##$TM2= 0
##$TOPLEV= 0
##$USERP1= <user>
##$USERP2= <user>
##$USERP3= <user>
##$USERP4= <user>
##$USERP5= <user>
##$WDW= 1
##$XDIM= 8192
##$YMAX_p= 0
##$YMIN_p= 0
$$ End of Bruker specific parameters
$$ ---------------------------------
##NTUPLES= NMR FID
##VAR_NAME=  TIME,          FID/REAL,        FID/IMAG
##SYMBOL=    X,             R,               I
##VAR_TYPE=  INDEPENDENT,   DEPENDENT,       DEPENDENT
##VAR_FORM=  AFFN,          ASDF,            ASDF
##VAR_DIM=   8192,          8192,            8192
##UNITS=     SECONDS,       ARBITRARY UNITS, ARBITRARY UNITS
##FACTOR=    0.0002768,     1,               1
##FIRST=     0,             0,               0
##LAST=      2.2672688,     0,               0
##MIN=       0,             -304596,         0
##MAX=       2.2672688,     286635,          0
$$ Real data points
##PAGE= N=1
##DATA TABLE= (X++(R..R)), XYDATA
$$ [...]
875g236J9602M656j2163j159J0514l951j6682J032K0597N541k0286j4357R769
888d123J1381n305o936M342K23j2792m298J5452J0623j3289j6003N856J3622j971
902c218o983O856P849j0397j2450J2545K2501k357k1323l768J8020Q933r386l515
916C307R331m55j3832j339J7678Q186j5713j4161O675R985m345o052M330J40j3595
931i860o706J4752J2449j2318j8186L570J4235j097r654M261R923p226j4277P304
945a2830K2127K861j8914p534J4701J0898n901l917P821J642j1075k410J5291
958A2760R185j2090j3392M858R768l166n585M757K226j2602r540J1638J4523q929
972D411j9518o90J4024J686j0397L79R838m017j4580K448J9575N985j6003r984
$$ y = [-7236, 12366, 17022, 4859, 3700, 14214, 10263, -6419, -5387, 15210, 20751, 465, -13892, -4123, 7258, 1953, -4983, -641, -418, -13210, -17508, -2056, 8567, -4722, -20725, -14869, -1247, -3218, -10201, -3345, 4504, -5893, -18343, -5798, 16703, 14346, -6977, -10745, 7275, 16208, 6822, 3307, 12638, 12183, -1649, -2988, 14690, 22876, 7163, -6998, -323, 9662, 5317, -735, 3595, 3735, -9860, -16566, -1814, 10635, -1683, -19869, -16299, -2064, -3161, -12815, -8554, 1369, -5857, -20134, -12830, 9297, 12158, -6756, -14290, 411, 11309, 5408, 1491, 9312, 10954, -121, -2531, 12760, 21945, 9855, -3537, 1321, 11089, 7923, 2338, 7095, 9321, -3281, -12821, -1183, 13340, 4411, -15107, -15797, -1773, -87, -10484, -10105, -267, -4284, -18864, -16416, 3159, 9144, -6859, -16843]
986a6843J1123J1076l815l530P094K462j0033l209J4600J0854j0046j3117M364
999I80J0407k173o223N088N199j0561j1668Q496J6031m476j9494m509J2655M108
1013C860r550k574Q229j389j3637j866J5825P791j2526j1161P235J0493j968l489
1027d727N873K882r106m558J2783J2465p249j3154L014J1366lo710L598P494p061
1042F907j2901M923J6581J82j7552p669J0504O213p789m226O457j12j2201l945
1056a4628J2895Q138j0539j1447M743R240j681m068N411M272q403o717J0403J3810
1070A1429m149j3685L21J1946K727o490J402Q183l118j2080J273J5213L978j4126
1084B824q980P646P048n586m321N092L40j1110m989J1154Q714q998j1975L032
$$ y = [-16843, -5720, 5356, 1541, -1989, 5105, 7567, -2466, -5675, 8925, 19779, 9733, -3384, 980, 11387, 9214, 2991, 8079, 13278, 2717, -8951, -455, 15576, 11100, -8394, -12903, -248, 3860, -5690, -8264, -35, -1424, -15061, -16927, -1102, 6689, -5837, -16998, -9763, 730, -1238, -4727, 1146, 4028, -5078, -9636, 3147, 15612, 8363, -4791, -1777, 9589, 9586, 2876, 6474, 13968, 6907, -5994, -1071, 15510, 15692, -1860, -9529, 975, 7188, -601, -4827, 1630, 1518, -10683, -14628, -1733, 6405, -4134, -15581, -10838, -1598, -3279, -7347, -1936, 2336, -6067, -12784, -2381, 11429, 7280, -6405, -6084, 5862, 8589, 2099, 3501, 11684, 8566, -3514, -2241, 12972, 16950, 2824, -6156, 1490, 8538, 2952, -1369, 3723, 4063, -7047, -12036, -882, 7832, -1166, -13141, -10109]
1098a0109Q819j459n153M024N288o885q522P312J4055q85j2847k531J0420M708
1112F235n460p2P541q91j0275p48J3377O086j0991r142N817P190l712m354M480
1127E081J866r593o658Q614R852o138j2478K79Q659L11n785J656N272m609r260
1142a2931L710J3032J653j1431m633Q335N486m286r22O785L40r342j576J2229
1156F449P447q746r236M830P603k651m408M157L483p644p662O510J0540l487j1987
1171d802k192P333J603n460k8M683l108q802J022J0984L074r636n924O132N384
1186B63l160j363N856J410q246k880J0763Q564o382r234L268Q274p90m578K993
1201D758M554n369p742M085J0442q87j0634l782N656K473m421q51L826k423q319
$$ y = [-10109, -1290, -2749, -7902, -3878, 1410, -5475, -13997, -6685, 7370, 6485, -6362, -8893, 1527, 6235, 775, 703, 8244, 7353, -2922, -3670, 9707, 15793, 4802, -4340, 1477, 8667, 4955, 601, 5081, 6947, -2646, -9304, -690, 9162, 3024, -9454, -9175, -516, -205, -5990, -4334, 938, -3671, -12931, -9221, 3811, 5464, -5967, -10600, -2265, 3221, -1065, -1987, 4798, 5138, -4204, -5780, 6449, 13896, 5150, -4086, 744, 8347, 5696, 1288, 5445, 8928, 1284, -6378, 132, 10672, 7185, -4802, -6994, 339, 1942, -3518, -3546, 1137, -1971, -10773, -9751, 1233, 4307, -5329, -11253, -5121, 263, -2897, -4260, 1596, 3006, -5240, -8120, 2643, 11207, 4825, -4409, -1141, 7133, 6343, 1765, 4758, 9312, 3943, -3799, 286, 10728, 9841, -793, -4575, 1081, 3554, -867, -1718, 2108, -315, -8634]
1216h634j48R368L478q534o296M907M939l110j811N596K499p515m489Q782R572
1231H604m185r289J115P997J241m133J664M640k885o911J935R044J318q434m529
1246b808M227K737k993q42L395j789p946j316Q625M177p616o983L803N309k802
1261b822l266M586L545o186o061O064R806j686q918j046O668K626k980N66M046
1276D942j596n834J171P956K292o470m143L573K506k563n16L943p50p727k732
1291e948P839N311o357p724K236N624j571m070K683L893m346o563L209Q608N13
1306C337p462k781N021K978j741L06L165j166n130P61P376K746n535l717L498
1321A656K774k606r76M504O11p281l930O605O676m654q188P14N569l22m055J147
$$ y = [-8634, -8782, 586, 4064, -4470, -10766, -5859, -920, -4030, -5841, -245, 2254, -5261, -9750, -968, 8604, 4419, -4870, -3755, 4242, 5483, 1350, 3014, 7654, 4769, -2142, -207, 8837, 10155, 1721, -2808, 1419, 4156, 1163, 321, 3716, 1927, -6019, -7335, 1290, 5467, -2149, -9132, -5329, -20, -2822, -6088, -1502, 2043, -4143, -10204, -4140, 5666, 3980, -4938, -5984, 684, 3310, 330, 896, 4942, 3346, -2488, -1317, 6639, 8931, 2461, -1682, 1891, 4397, 1834, 1318, 5261, 4511, -3216, -5948, 1891, 7202, 845, -6879, -4643, 981, -590, -4660, -1977, 1916, -2430, -8993, -5784, 2824, 3337, -4125, -6906, -1885, 1093, -648, -342, 2823, 1657, -3473, -2712, 4664, 7410, 1875, -1842, 1656, 4430, 1824, 848, 5352, 5963, -1318, -5248, 1357, 8033, 3379, -4809, -4095, 1474, 1152, -2903, -1756]
1337a756L807k824o123J359P168J548n908l245L277K548j176N61L060j235n114
1352d053J29O976L334n100m178L287L490k312j870L928K179n936n089M743P299
1367F827j980p714j147M879J115l169J32K875j583n101M11N977J917m699k956
1382d216K423J797j523N61L472o93n686j011O634M281m566n039K545M158j776
1397A361k689K984L094m041n551K802O910j59o328k284L651J824k049N2K426j352
1413F51m437K13N390J972m318k831K460J691j905j01L768K72n533k374N637N195
1429E750l345n614J132M290o59k967J825L158k602n012J388N910Q79m997k522
1444c386K678J461j533K85K591j172m434p4N207K333l944l237K200K203j783r31
$$ y = [-1756, 2051, -773, -6896, -5537, 1631, 3179, -2729, -5974, -2697, -149, -1325, -764, 2296, 1061, -4053, -3924, 3052, 6386, 1286, -2892, 395, 3885, 1573, -297, 3631, 5810, -126, -5215, -472, 6827, 4847, -2867, -4014, 865, 1980, -1189, -1057, 1818, 235, -4866, -4455, 1522, 3439, -1260, -4216, -1793, 4, -1519, -958, 2514, 1821, -3865, -4876, 1758, 6039, 1473, -3566, -1021, 3137, 1361, -1328, 1656, 4750, 709, -4842, -2040, 4870, 4711, -1617, -3901, -250, 1574, -475, -423, 2003, 651, -3786, -3573, 1817, 3789, -529, -3360, -900, 791, -1114, -1215, 2553, 2825, -2708, -5082, 555, 5750, 2405, -3209, -2077, 2213, 1554, -1413, 412, 3570, 968, -4044, -2656, 3254, 4133, -864, -3386, -708, 753, -780, -495, 2096, 924, -3510, -3584, 1623, 3956, 12, -3225, -1025, 1178, -605, -1536]
1460a536L286J483m477l500M074N574j698n362l66L918N02k441Q04K746j583m457
1476c033L71N126J441m175k533K154J278j575Q2K800n15m616j145M977L160l482
1492C15l847J742K812j437j653K758K332l459l828K761N363m42m632r86L123Q70
1508A792j809O16K621j223m087k1M566J542l614k675J836J321j598l12K503K90
1524A748m056k158L712L781k226m015M86K870k70j770J654K313k080l608J482
1539b137M843O69l816j462K557J066j618L87K576n64m098o49M331K158l280l000
1555b037J522J813j505j043K289R99l430k715K692L875j238l790j97K544K6j372
1571a567J239K090j641l394R31M261R20l293j572K250J210j514N5K530l0l620
$$ y = [-1536, 1750, 3233, -1244, -4744, -670, 4904, 3206, -2156, -2522, 1396, 1898, -543, 261, 3007, 1424, -3033, -2662, 2464, 3905, -270, -2803, -649, 629, -946, -864, 1936, 1421, -3195, -4340, 637, 3797, 315, -3532, -1790, 1022, -415, -2068, 690, 3022, -437, -4265, -1504, 3859, 3417, -1215, -2201, 922, 1792, -17, 599, 3220, 1997, -2090, -2111, 2455, 3997, 383, -2292, -456, 865, -733, -1045, 1458, 1748, -2308, -4466, -754, 3027, 801, -3214, -2728, 142, -128, -1898, -244, 2069, -11, -3619, -2137, 2706, 3375, -441, -1903, 654, 1720, 102, 489, 3065, 2501, -1597, -2246, 2085, 4243, 963, -2037, -515, 1298, -207, -1250, 1039, 2038, -1392, -4107, -1415, 2460, 1222, -2568, -2765, -221, -195, -1567, -328, 1762, 121, -3273, -2342, 1919, 2839, -454, -2026, 224, 1434, -80, -25, 2505, 2475, -1145]
1587a145j427L624K828k271l108O39K085n95j268J341J357k345k689J606L447
1602B079l15l231o72J949J28j388R22K167j308l532K73M107J395l111j949J951
1618e35J616j441n44K305Q78k974j919K735L186j089l037Q2J848rj010R93J161
1635B246j846k487J136L058j00k799q91J731R4j605N37K239p31l494o14L598K127
1652B199k469k440J250J951q29q91J607J279j866j954J713L039k48k314m19J359
1668I67J20o19R84J088j570k504Q26K963J08k799j091J647L83j746j10K194J42
1685I83l178j356K758K602j592k727M22J919k7q23P76J234j075j740J022K485
1701A683K28j671m87J013R1n66R74J410j269k594L78K994O11k616j540J526R11
$$ y = [-1145, -2572, 1052, 3880, 1609, -1499, -860, 1225, 630, -638, 703, 2060, -285, -2974, -1368, 2079, 1764, -1467, -2139, -190, -62, -1450, -528, 1639, 331, -3201, -2928, 1179, 2574, -537, -2486, -535, 1081, -360, -904, 1401, 2279, -695, -2614, 121, 3307, 2218, -819, -737, 1111, 1102, 92, 1085, 2246, 400, -2087, -951, 2107, 2007, -792, -1683, 48, 142, -1463, -926, 1313, 582, -2912, -3526, 72, 2199, -270, -2710, -1460, 491, -338, -1229, 378, 1657, -209, -2163, -450, 2589, 2341, 27, -392, 967, 1087, 468, 1452, 2540, 970, -1534, -708, 2255, 2363, -436, -1527, 120, 503, -1243, -1353, 841, 983, -2195, -3551, -793, 1809, 217, -2510, -2088, -169, -196, -1019, -243, 991, -84, -1824, -802, 1683, 1911, 240, -247, 766, 857, 291, 1265, 2675, 1406, -1188, -810, 2184, 2795, 179, -1361, 165, 1076]
1718A076j577o82J783P48k464j875J787K498o85k385l73J349L24m95N80P53r74
1735f12j376Q88K087R5j478j95J121J4p88R44J854q10k617j89K884J300k061j914
1753h53R90J359r04j051J033R42j518j918Q04K051k2j825p95O57K07k47N95N53
1771E8j150j325Q60K014Q3j505k80J323K09r59N19J978J06k349p98K416J873j273
1789A800k135L53J403j18r82N13O96j002j475L42J477O8j403o15L14j41j87O14
1807d78P41j165j729N56K160L84j639o37J324O68q86j64J802O93j720j163J536
1824B83K070m58j663k18R94K42m39K31M36q49j138L75J110l3j093l89L59k92o20
1843a092P03J005q61j877l1J967Q41j490j010R27J004o30l98J118Q56j003j155
$$ y = [1076, -501, -1183, 600, 1348, -1116, -2991, -1204, 1294, 609, -1776, -2149, -800, -476, -971, -391, 362, -612, -1988, -1100, 987, 1082, -396, -591, 530, 544, -244, 700, 2554, 1744, -873, -1062, 1822, 3122, 1061, -853, 137, 1496, 592, -459, 574, 1516, -2, -1920, -1116, 935, 913, -912, -1707, -1050, -843, -1090, -495, 58, -1092, -2417, -1557, 457, 540, -965, -1245, 78, 287, -672, -153, 1825, 1931, -418, -1216, 1200, 3073, 1800, -335, 18, 1421, 1303, 321, 834, 1530, 528, -947, -605, 872, 940, -463, -1078, -764, -905, -1092, -478, 263, -902, -2631, -2075, 85, 469, -1170, -1807, -483, 185, -701, -865, 937, 1630, -90, -1253, 283, 2353, 1895, 232, 14, 1008, 1250, 811, 1042, 1478, 629, -509, -134, 976, 943, -150, -539, -180, -472, -1092, -389, 616, -245, -2122, -2153, -186, 655, -835, -1845, -918, 86, -544, -942, 176, 1032, 29, -1126]
1860a126P47J710J41j206l70O03J68n0K91L46p27j120M87J190L4j104l07N72m3
1879B36q85K70J185l07j774n03J520J153r69j287L43Q90k47m14O29O55p23r85
1897a213N82J291J63r14k39M42R0k00O33N20p15r91K24J411J91j077m55O98J89
1916F30p25j07R87J55j358q25R22J179m95j207m4N98j05l02M39M38n80p66M04
1935g62J121J37q05j97N71j9k57L94Q48l89j153pJ313O13r13p08M36M65m98k48
1955e8O48L28r93q61O58R15k36r47j49L80o7j80M26M77o57p97L40J038K68p91
1975b58j99N24J48l68J17P95%j020l69R96P39n21p88K02L95k78j72M35K44p39
1995a17o77M89Q69k26p33m9L82j74l65M14O70m33r02J39J004L89p36m61M26K82
$$ y = [-1126, -379, 1331, 1472, 266, -104, 499, 667, 617, 908, 1254, 527, -593, -106, 1084, 1118, 14, -293, 279, 236, -649, -379, 806, 499, -1275, -1778, -258, 895, -74, -1361, -1018, -128, -375, -789, -160, 495, -228, -1213, -631, 660, 823, -91, -330, 112, 202, 2, 635, 1155, 440, -551, -327, 1084, 1275, 198, -257, 441, 630, -95, -202, 785, 940, -418, -1243, -321, 858, 363, -844, -888, -290, -395, -697, -258, 180, -400, -1166, -762, 359, 496, -309, -506, 65, 46, -211, 183, 1031, 642, -511, -518, 795, 1408, 495, -213, 223, 688, 190, -58, 590, 918, -75, -936, -278, 637, 401, -546, -695, -315, -382, -562, -136, 341, -316, -1113, -773, 265, 533, -258, -457, 67, 215, -153, -36, 759, 759, -261, -630, 366, 1105, 584, -204, -2, 393, 115, -57, 378, 622, -117, -794, -305, 564, 338, -395, -444, -62, -236, -601, -187, 483, 50, -852, -713, 291, 680, -56, -517, -91, 191]
2015A91l15l9N37J47p84l36O10O32k37n61K3K83k16q0N58K27o58o35M09R00o3
2036E93q91k0M97j6l88M6O45r4q74k94Q12N61m77o05J28L11j01JL24J04n60l08
2058f06M87N75l14l99K17K22k52j29O14L67n61p86L68R31L7p81k82N04J53l72
2078gj12M30J23o91m11M63M97k16m37o7J80k0R7K60Nn00k41N01O22k97m13J62
2100g2M06k25l49M45N49l24p71oQ52L71o44n34L08L52k00k38J53J92l66l68K09
2121b60L89n6k81Po0j02P9M63J01o39l27N58O60k92n00K2N18p1m67J73O18m6o78
2144a91k71O22M58k48n48K5L01N0j04J2pk25j16K16J61j03j72J42m6k86J8M65
2166A53K60m59o71M49P45q9o73j05M40J98l89j04M38J59l56m23K96M57m2k86j04
$$ y = [191, -124, -163, 374, 521, -263, -599, 11, 643, 406, -155, -132, 151, -65, -145, 413, 640, -18, -653, -244, 656, 593, -298, -318, 179, 163, -225, -179, 466, 372, -502, -796, 16, 577, 100, -505, -377, -66, -167, -166, 158, 262, -298, -606, -119, 456, 142, -257, -40, 182, -70, -199, 415, 782, 221, -565, -197, 734, 771, -10, -292, 212, 365, -7, -119, 311, 434, -257, -668, -205, 292, 76, -361, -428, -248, -268, -171, 89, 94, -406, -647, -146, 476, 179, -234, -72, 334, 109, -240, 205, 754, 430, -341, -347, 505, 876, 232, -302, 6, 358, 158, -80, 73, 265, -101, -469, -260, 129, 73, -208, -201, -261, -363, -284, 179, 280, -359, -686, -128, 532, 240, -260, -238, 280, 209, -258, -85, 533, 487, -191, -462, 160, 618, 370, -178, -153, 148, 198, 94, 106, 99, -126, -242, -26, 135, 32, -140, 2, -44, -330, -312, 153, 413, -46, -717, -268, 477, 388, -285, -390, 50, 248, -141, -245, 193, 352, -4, -427, -131, 326, 284, -2, -106]
2187a06L3K05M3J22j00k73p1L24J35k51k38J95K16l37k38L38M08k92o76J4P52
2208B03J97m87l64K40L23j17j98J03K39j48k06R8K49J43j00j46j9m0J87K29k3
2229C63l73j81L47L76k69m02R5K79k10m39K52M09j29n10j61M44L73k59l81Q5J76
2250a15J04q6l5J90j11oR8Q8J2L7qk5j53KL74Q8l87l43K79M15r2m84q7L01J9k82
2276b07r1K84J38l50j81J61L30K4k70p2J00Q9J12P9j41jo5J43O9j15n2J04P9j53
2300A4j57L11K18k53l43N2M08R8l71k23K02J00n7j72P6J66j71j07R0J27J11j04
2322A5o1l1j7J25J12l0j98j14J44K12q3k04J05J51j05j46O9K51k7l09m9K61K17
2345B88j15k37j7J41L5K0k5l3q0RL3P1j6m3mr5j9L3J33L4k45j52J05K16R0k73
$$ y = [-106, -73, 132, 175, 297, 197, -76, -147, 177, 312, 61, -177, 18, 234, -103, -341, -3, 405, 113, -563, -549, 203, 400, -87, -451, -211, 112, -5, -203, -100, 139, -9, -215, -117, 132, 275, 175, 29, 10, -30, 157, 386, 363, -10, -191, 156, 532, 263, -139, -44, 235, 25, -414, -162, 247, 118, -392, -553, -109, 264, 5, -376, -291, -115, -11, -97, -132, 58, -53, -59, 39, 127, 139, 176, 168, 143, -10, -8, 366, 454, 67, -276, 3, 418, 326, -158, -245, 56, 75, -207, -298, -14, 124, -226, -407, -246, 84, 108, -162, -234, -134, -45, 67, 146, 5, 4, -61, 82, 151, 36, -16, 88, 167, 14, -143, 168, 386, 133, -210, -158, 250, 348, -23, -246, -44, 56, -1, -173, -97, 69, -102, -209, -119, 8, 119, 15, -46, -77, -94, 31, 143, 113, -85, -199, -55, 157, 74, -130, -25, 126, 21, -125, -56, 195, 168, -141, -190, 71, 288, 173, -64, -81, 60, 95, 115, 90, 57, -23, -14, 19, 90, 74, 31, 27, -68, -87, -54, 79, 113, -132, -284, -179, 37, 127, -146]
2371a46r7J93O5j10KK34m9r5j28J84J57j1j04MMj2K7M0l2j52o8J12J16j11j11
2396h8O6N0j51k6Q7N9j0k21j0J72J31j20j27O1J28k8PJ16m7k8o1J14J21p6n4M6
2422A11p1m9J03J2K6j71j56J60J38m1j50j1N7KJ%O9%j00n3O5J64k8r7m7N2M0J0
2450C6R8r1j21OJ27Pnj06J13k2j17KJ04O0l3k12N0J87P7r9j13qJ17j7L1n7J5k0
2478Il0N8l2L3m0L7j07rP3O6q9j39l8J24J77j18j32N6J07Lq3J9J50M2j42q2J34
2505D7J26l3j19n3O3Q7K1r8l3k3K9L5j4l6q5Q8m2j22N0R0K5j30j03R8K10o4q5
2532g1o3P3J79p6q3L9J15M4j24L2J2J38p7q1p5J19L0qj57MJR2oj51l3O7O6j19
2560a13r2J18J15p8j62JJ75J37r0j49P4J46N6p5p7R3K9l0k3kO6O9j00j21L4L4
$$ y = [-146, -243, -50, 15, -95, -93, 141, 92, -3, -131, 53, 210, 199, 95, 99, 103, 91, 118, 158, 126, -26, -94, 18, 134, 23, -88, -22, 28, -123, -149, -62, -3, -13, -234, -244, -72, 59, -61, -188, -127, 1, -27, -20, 96, 49, 21, -40, 74, 195, 119, 65, 111, 40, -9, 94, 106, 132, -39, -195, -35, 103, 62, -88, -99, -42, -40, -39, -39, 30, 30, -70, -123, -58, 106, 78, -19, -66, -14, 26, 36, 134, 43, -78, -72, 55, 62, 57, -49, 64, 42, -75, -73, 31, 91, 58, -154, -104, 83, 160, 61, -52, -60, 57, 40, 71, 14, 29, 9, -21, 37, 5, 38, -2, 35, -72, -81, -8, 58, -31, -170, -208, -84, 93, -25, -157, -101, 6, 9, -74, -55, 95, 137, -5, -87, 47, 173, 140, 21, -32, 31, 118, 139, 41, 8, -15, 14, 49, 35, -1, -86, 2, -40, -162, -112, -22, 3, -127, -230, -132, 78, 14, -71, -134, -61, 118, 42, -41, -2, 113, 157, 33, 65, 77, 215, 138, 57, -18, 101, 131, 123, -34, -30, -29, 63, 57, -94, -127, -60, 6, -113, -205, -87, 28, -50, -212, -211, -36, 101, 11, -138, -64, 82, 138, 63, -14, 79, 108, 78, 55, 53, 119, 188, 88, -33, 1, 35]
2586C5J52j80p6m1J36O2j59j14J15O4K8j49n2J87rk5j36J03J12P6j62q5Q5R9O9
2611A35j86j7M0N3R9q1n2P7j0pq3r9K63K2k13J4J7J46l2j31n1J32J5l2p8o0J44
2638B5O4j54p9Q4M0J7j44L4j5J04K1p4l6L6J14kr9Q2R2K7l1o2L0J15l1j26%J05
2666A37L1k8j22o9Q7M1p3o2j5M0j3o7J4LL9l6p3QJ38N3q0k6n5J19O6j09RQ0J05
2695A42l5k6L1J4L4o8m0%R6M4j57q0O4L0kq5r5O7P5o9o8l1M0L5K3j26N7P2O0o0
2725e8k3P4L4O9m5r9M2R7L8j06J9QO1k0p7J9J3M6j53lN7R0j14q9N9K6M8j7p3n
2755h2O9J1j2j3o1J34j1m8q4L3Q5qr7j5P9R7k7o8l8N2L6j2k3M7J6j2n2L4N9kj5
2786G2q0N0M1j2Kj00PL0M0p5KNj9P0j33L3m4kM2Lj9M8L1l0q5P2O7R5o7k4K5J2
$$ y = [35, 187, 7, -69, -110, 26, 88, -71, -185, -70, -6, 22, -127, -179, 8, -1, -26, -162, -59, 53, 129, -33, -118, -33, 66, 135, -51, -68, -28, 25, 124, 43, -9, 68, 58, 51, -32, -131, 132, 154, -59, -45, -28, 118, 86, -45, -96, 36, 51, 19, -59, -119, 25, 89, -65, -144, -60, -20, -3, -147, -113, -128, -24, -3, -77, -113, -77, 37, 35, -64, 18, 110, 137, 106, 44, 74, 189, 158, 32, 32, 137, 168, 140, 18, -51, 36, 77, 4, -58, -73, -33, -46, -113, -99, -96, -57, -93, -166, -158, -20, 33, -47, -73, -128, -9, 57, -52, -43, 37, 142, 107, 81, 112, 126, 160, 92, 52, 52, 148, 192, 35, -45, 19, 49, 47, -38, -133, -66, 9, -60, -128, -159, -119, -84, -61, -187, -130, -58, 2, -58, -81, -7, 27, 96, 51, -48, -6, 91, 129, 23, 42, 50, 111, 91, 14, 33, 46, 92, -61, -64, -7, 83, -31, -120, -61, -35, 13, -4, -77, -82, -13, -2, -14, -27, -88, 46, 35, -13, -97, -64, 21, 13, -84, -99, -20, 77, 50, -18, -56, -4, 32, 20, -3, 44, 60, 48, -4, 30, 89, 87, 72, -8, 42, 83, 71, 73, -27, -20, 10, 50, -25, -23, -18, -37, 33, -100, -67, -111, -113, -71, -68, -87, -39, -8, -38, -123, -51, 16, 111, 44, 20, 45, 57]
2818E7M7l7l5N2J1Kn8J3Q9p5Kj00l0Q1K9r4n1K4O2m1j7r8J28k7l3L4m7Q6k6J2
2848d0K8J3L0lj3JL1L8qK8n1p5J06j8m4l7L0jK5r9JJ03n8n0o2R3M2n5p8O8k7P0
2880a2k4m2O4L5Jl1m0L7L3j3m1K0K5M0jl7j7pQJ6q1Q0M4j2o4PQ2l5L3p0j6R0k6
2913D6m0k2M1k4N4k3n4l9M3m1j4j7L3K2K0m7m9Q3O2p3n0P1J5M0m3J7M1J7K3m1
2943E1mO8k6j3m8RN3jr9K7o0N4mn9m4M3QL5p0n1N5J9qn9O2N3K9o5j2R1P5m4k2
2976D3n6J25Nm0l2O4rl8kk6n4K7j6L7r3Q9l5mm8j1J0O2m1n4NN0L5Ro9L4O0l0N
3009Bn8P6K2l0J9mK8j3l8pO1o0Q6p7K1m8oO1q8K1N2j4Ml9PJJ3n7L8K4KJ5n4K8
3043a2l4N8j7l5mO2L0p3M2k2j8K6L9o6o3J26mk8j8K7j6M7q1L9N5K4o7m7L6K9o5
$$ y = [57, 104, 67, 32, 84, 95, 97, 39, 52, 141, 66, 68, -32, -62, 19, 48, -46, -97, -73, -11, -52, -69, -167, -39, -66, -99, -65, -112, -26, -52, -40, -12, 1, 31, 28, 15, 16, 47, 85, 77, 105, 54, -21, 85, 67, 23, -14, 16, 15, 40, -59, -58, 45, -13, -63, -125, -32, 10, -45, -123, -55, -82, -12, -36, -78, -14, 21, 22, -9, -49, -12, 21, 8, -33, -13, 12, 52, 51, 14, -3, -10, -2, 14, -67, 13, 57, 45, -19, -12, 70, 35, 68, -2, -18, 72, 46, 6, -16, 25, 1, 55, 32, -22, -61, -18, -59, -73, -90, -57, -35, -15, -62, -111, -28, 34, -39, -89, -18, -3, 37, -6, 11, 52, 69, 92, 51, 47, 115, 89, 76, 28, 37, 90, 89, -10, 17, -43, 11, 7, -52, -96, -53, -45, -10, -80, -131, -76, -57, -65, -124, -62, -9, 20, -45, -57, 34, 109, 65, 43, -13, 112, 117, 77, 45, 109, 100, 62, 60, 34, -20, 7, -9, 28, -65, 24, -11, -15, -63, -74, -64, -2, -43, -97, -92, -42, -7, 2, -67, -33, 27, -3, 2, -56, 20, 42, 12, 31, 27, 55, 42, 4, -3, 58, -2, 84, 7, 28, -20, -26, 35, -53, -32, 20, 6, 10, -29, -22, -21, -8, -65, -27, -3, -1, 14, -40, -12, -46, 12, -5, -40, -44, 18, 48, -25, 17, -5, -23, 3, 42, -24, -87, 39, 35, 7, -11, 16, 0, 47, -34, 5, 60, 84, 17, -30, 6, 35, -30]
3074c0LM8ml4rk0J4M7m6%L0l3q0J32n8J6jQP7p3j9M5M5lr1P2J5J9k1K3k1nl3o
3108GkK2m6j8N2o6K2j8M4o3qJQ3k1m4M4K8l6N1n2K1K4M5p7rM8N2l4l2Omk5M3k0
3142A8J6k1K3l6q4P6j3rlk3l5Q4N9j35%P5J5L1k8mK3K6pk6j2L1Kp8J0MM1j2k2
3175a4kn5O3J9o6mJ6J4k5L1l3J11n8l2qQ6K4o2k7N1oL2o4J4O%N6l9l3K6k4J3l2
3208b2j8J8O0p5K8p0J17qq0M3l7M5j4knL0Q7p4k0k8M5O2m8m8M1J9q4L5k7L7j8
3239a1J3m7k1M7J7n2RJ1L1M6j2p2M5Q5o4%m4J9P9k6p9j8P0M3o2j3K9K0n5l2j8
3270f2O4j2n6N5oM8p4K2o5L3K3K6Ol6M8pl4J5KJ2J3l2KO5n4L2N1j05POL3j6k6
3303b2N2mmp6m2O6J5l1K7m5R8K5q8l2N5N5ko0K6RpQm1J1J05o6p3j2Q1l1K8j16
$$ y = [-30, -27, 21, 17, -17, -26, -46, -32, 15, -31, -31, -1, -34, -114, 18, -40, -24, -25, -17, 60, -13, -32, 13, 58, 55, -36, 36, 51, 70, 49, 72, 51, 46, 13, 7, 5, 27, -19, -37, 15, -51, -29, -47, -3, -66, -74, -73, 10, -11, -55, -11, 17, -19, 32, -20, 1, 25, 70, -7, -16, 32, 84, 50, 18, 24, 20, -5, 38, 18, 34, 13, 36, 0, -84, -8, -21, -30, -33, -56, -91, -7, 52, -83, -83, -8, 7, 38, 10, 6, 29, 55, 48, 22, 10, 41, 43, -35, -25, -21, 20, 8, -14, -16, -71, -8, 11, -55, -59, -43, -29, -54, -23, -56, 55, -3, -35, -43, 43, 67, 5, -22, 29, 23, 55, -9, 5, 11, 11, 67, 28, -5, 21, -3, 10, -22, -40, -22, 38, -37, -9, -79, 38, 30, -50, -7, -44, 1, -13, -15, -20, 10, 97, 23, 3, -25, 20, 82, 34, -14, 27, 46, -38, -3, -30, 7, -11, 2, -45, -66, -19, -2, -54, -45, -34, -3, 43, 31, -41, 4, 89, 25, 25, -19, 0, 79, 53, -26, -44, 26, 69, 7, -6, 23, 43, -12, -44, -62, 2, -10, -66, -11, -17, 31, -43, -21, -86, -53, -30, -4, 2, -34, 14, 7, -27, -12, -10, 2, 15, -17, -15, 50, -4, 28, 79, -26, -19, -13, 20, 4, -22, 30, 26, 22, -54, -96, -30, -15, -46, -19, -64, 34, 59, -29, -61, -6, 49, 47, -13, 13, 22, 15, 23, -18, -7, 98, 32, -41, -53, 28, -3, 25, -91]
3335i1L4Q6j0n9L4J5l2K2n8K5O8rL9j24L9N9j8M7p7K1mJ5qp3rJ30o9M5o6O0J4
3366D6q5L1j4J9L9p5L5K2K5m8M2p8N9L8k3L3o1M6m3J5j8J7J7Qmp2k4O7j7j14M9
3397f8kM9Jl7J0Lj1P0l3J7L6j2p5P1K6j5K1Km6Pj8J26j54L4J5k1pJ4j5J0k0m4
3429f6O9l2k0l2K1R0n9J6m5L3k9M4P2q9K2PK3QJ7l6K4Jk3jn9P6pn3N3n0J6K1n1
3462c9J1L4j3kl0lQ8r7N4RPnMk8K1J4m6%Q0m4J0j4Jj9nl0M7j4jM4k6l7mJ9kJ5
3498ak2J3J9K4n0L6K4L8j01LLJP2n3K6l1j5j4RM1K6l8l3m1L1K2J0nJ3n5R2pr5
3531e8N7M6PPk4k2N1k5k7J7K5j2qj19O3J0Qj9k2N1j0j1j3k4N9J5r2M0L5J1K7%
3563D3p2K0OM4OrK4J8k6n4J3L9j6m6JQj4J3jkj0M8j03O7l8K8K1j9mk9O2M6r2L0
$$ y = [-91, -57, 29, 19, -40, -6, 9, -23, -1, -59, -34, 34, 25, 64, -60, -21, 38, 20, 67, -10, 11, 7, 22, 14, -59, -68, 62, -7, 38, -28, 32, 46, -39, -8, -22, -3, 36, -39, -4, 18, 43, -5, 37, -41, 18, 56, 33, 66, 5, 51, 8, 23, 5, 22, 39, 47, 43, -29, -53, 14, -3, -117, -68, -70, -21, -20, -57, -47, -44, -55, 15, -18, -1, 35, 23, -52, 19, 45, 30, 51, 53, 7, 14, -4, 122, -32, 2, 17, -4, -11, 3, -12, -2, -22, -66, 3, -29, -49, -81, -60, 30, -29, -13, -58, -25, -54, -10, 62, -27, -5, 2, 25, 33, 50, 14, 38, 39, 16, 15, -44, 32, 25, -28, 25, -25, -9, 12, -39, -28, 6, -7, -9, -39, -42, 46, -51, 3, 12, 19, 14, 18, -10, 11, 25, -21, -21, 59, 15, 25, 11, 12, -7, -12, -42, 5, -9, -10, 34, 8, -29, -33, -14, -16, -1, -23, -10, 9, 33, -17, 19, 43, 81, -20, -17, -14, -13, 59, 6, 32, 1, -14, -28, -19, 22, 48, 10, -23, -64, -33, -11, -1, -6, 7, -48, 44, 37, -58, -1, 45, 52, 59, 35, 13, 64, 39, 12, 29, 54, 42, 34, -85, -22, -12, -4, -23, -45, 6, -4, -15, -28, -52, 7, 22, -70, -30, 5, 16, 43, 43, -29, -9, -3, 41, 47, 38, 62, 80, 54, 0, 13, 52, 36, -10, -9, -1, -15, -2, -3, -5, -15, 33, -70, -3, -41, -13, 8, -11, -15, -44, 18, 64, -28, 2]
3597BL3m6j0P5o6JL8Ko2J7M3k9Om9k3P2L9r5O4k4O6j12M7OLm6m1R7l7R1p2J7J2
3630A9m3J01p5K1JJ3On2o5N2j9O9Ml6k0KJ0q2qR2J5m1LK4J5M9o8l4P6m4L5Pl6
3663iO4o1L1k7L3K4j7L7j08M8K2K8j24K8pN1J9j21Q7J9oj0j6P9q1JK3m9N3m9P3
3694C5n4P8j6rl4K0m4K1J9%k5j7J3K2n3L1K7OJ3j03O3K3lj5l0N8J0o6J9M3qk9
3726enL7k7N9q2K2J8Rk5K1n8O5j8Oj9M0m7L6Qn0L2MJj5K4o5M6L4Jr6OL5K4k0p
3761a1K4j6j4NJ9m0K5n0O2k8J3J8j6Jj8L5j1k9j0Q3k2l6k8K5Q6k3o4RJM1m0L5
3793B6l7L3lj4l0k1M2k0n7L5R1n0L4l4k7K3k3k2K2N4m1J9On0M0L4m7K3l1M3N0
3824F8p6pL0j2j4J9n7O8L8o0kJ2km7P2l1r0J05n5QN9m6J9L2n0J6M2j8oj6jK1J3
$$ y = [2, 35, -11, -21, 54, -12, -11, 27, 29, -33, -16, 27, -2, 4, -45, -68, 4, 43, -52, 12, -12, 54, -58, -11, -5, -2, -48, -89, 8, -29, 62, -10, 7, 19, -24, 77, 2, 23, 24, 37, 43, -9, -74, -22, -41, 28, 32, -4, -24, -22, -12, -94, -102, -10, 5, -36, -33, -9, 6, 55, -13, -47, 29, -15, 20, 27, -9, 55, -6, 25, -2, 31, 55, 38, 75, -33, 15, 37, 65, -59, -31, -38, 13, 32, -89, -2, 17, 11, 1, -15, 64, -17, -16, 7, -42, 11, -38, 35, -19, 59, 43, 34, 0, 20, -24, -3, 16, 16, -9, -26, -13, 9, -44, -13, 14, 20, 33, -70, -7, 16, 13, -2, -32, 26, 36, -30, -11, 32, 24, -5, -10, 27, 0, 59, -23, -1, 17, 26, 1, 22, -36, 29, 11, 17, -2, 38, -9, 27, 35, -15, 17, 21, 22, 7, 31, -34, 12, 46, 47, -49, -43, -8, 16, -4, -11, 13, -3, -17, -12, 7, -33, -8, -58, 4, -24, -11, 7, -9, -8, -26, 9, -2, -31, -41, 42, 20, -16, -44, -19, 67, 44, -20, -11, -10, 31, -9, 26, -11, 22, 19, 5, -25, -46, -4, -24, -81, -46, 45, -5, 29, -5, -32, -9, -32, -54, -32, 22, -19, 0, 6, -44, -4, 30, -17, 6, -25, 18, 68, -8, -15, 15, 3, -11, 8, -49, 19, 57, -3, -5, 7, 5, -42, 30, -1, -91, 14, -41, -33, 26, -20, -1, 31, -19, -3, 39, 21, 15, -1, -2, 19, 32]
3857C2q7O9m0j9N8J7mm4O3k0q1M2N2L7j10K6M9l2L1o7J6L7j9Jp9R0L2o8j6K4Q1
3888G1n5on9M5RO8l4p2nL0K8om5K6J7m7OJ5K4M3o5LJ3J2l5P5o3pL5m5L9k3N4m7
3922aj1pN4q1P9n2pnJ3L3l1L7Ok6Mj3NMj4J6M6j6J1o1oL9J7J1qn1k0P7o5J04n7
3957B4lJ1j2p1P9Mn6J2k7M2j4K0L0j4m4k2N9m4K3K0l9K7k0k9O3k6J9Mk7J7nK4
3989B5p4M3N8p8k3L4j3M1K3n5K3L6MLj00P4Qj3j0M4k6J3k2Mj4K4n8J7j4O0o2J6
4021a2l6J1L1J2j3p4nJ19L0l6m3j0P7kj4k2k5RKj2L0K3l1n0N0k9O9ml2j9K0om7
4054c9rL5M0l1l4K2J5L7j6o3J4M2lNm1O0n9J2%j8P6l3J7l5k1O2ml6j6QM9o8k7
4087e9L0M4K4j4j7KM5m1N2j06L6Rn5P8l2L6k6j4Nk2K7n3j9P2k7l1N8n3M8k5J7
$$ y = [32, -55, 14, -26, -45, 13, 30, 26, -18, 45, 25, -56, -14, 38, 75, -35, -9, 40, 8, 39, -28, -12, 25, 6, 7, -72, 18, 50, -18, -34, -10, 71, 16, 10, -49, -4, 5, 73, 39, -33, -38, -8, 20, 14, -31, -5, 12, -35, -29, -14, 10, 53, -12, -9, 4, 16, -19, 56, -7, -14, 21, -24, 15, -8, 46, -1, -12, -19, 35, -46, 33, -19, -26, -31, -18, 15, -16, 21, 27, 1, 5, -8, -3, 1, -13, 3, 49, 33, 44, -17, -23, 16, 33, 44, 36, -15, -35, 42, -23, 81, 24, 21, 32, 20, -51, 28, 32, -24, -12, -39, 3, -11, 9, 39, 25, -19, -41, 18, -26, -3, 17, -22, 5, -15, -44, 19, -7, 12, 16, -11, 6, 1, 25, -49, -6, 52, -26, -49, -15, -28, 13, 36, -19, 4, 40, 44, 47, -53, 21, 29, 16, 6, 50, 24, 37, 15, 19, 5, 29, -29, -12, -26, 34, -28, -12, -48, -37, -6, 6, -7, -81, -86, 33, 63, 27, -16, -26, 51, 49, 35, 13, -12, -3, -1, -13, 17, 40, 9, -41, 9, -20, 49, 45, 13, -6, 14, 8, -39, -48, -13, 27, -4, -38, -16, -1, 36, 20, -43, -29, 13, 10, 15, -26, 34, -25, -13, -13, -31, 45, 12, 29, -6, -27, 35, 31, -5, -21, -13, 36, -32, -59, -29, 15, 39, 25, 8, 10, 55, 14, 66, -40, -4, 5, -50, 28, -4, 32, 6, -8, -3, -25, 2, -51, -70, 2, -25, -56, 2, -51, -3, -28, -11]
4118a1N2r2M2K7jJ5j2mll1J3M8pm1J7p0Q0k0k4L6m2K9m7N7j7l9J3K0L7l5l9P6
4150B7rl9M4n5O3nm8M5n4K3j0K4j6QL6L2p4j8Q2j9j9%nm4K4LJ9j5J4KJ1n4kP5
4184D6n5l6O9o5N0j2l8N4k1L4l0l8P4ok8jl6O1l0n7N3O9p6pN6o4N7Qo2KM2Pm6
4217b6L1L8lj1l6k5J4P2k6m6M1jj7J6k7NJ7r0P2l4N6M4j07O5k4K1m5N0qn4J7K8
4249Gj7jJ2%K1nl9j0N4l2J0o5O5M9m4j6M5p5M8j0j1L2jj0no2N7j1j5LK7K0oj0
4283EJ9k2k7M1o2P4p4LL1l3J6L8qPJ4JJ1j3m7PL9j0jk7K6LLj3j4J7k6J9j4k4K5
4318a6KQ6r5l1N1k2N2p0J2mM3Mn0O2k3k2L8J8j0M3k7l5L9l5P9r7l9L1PN6j04J14
4350E7l0m5kl0J9J4M2l5mJ2Pl9n6J03m2MpJP2%q4MK9N0q0J11n1l2L9Mj3%QK6l7
$$ y = [-11, 41, -51, -9, 18, 17, 32, 20, 16, 13, -18, -5, 43, 36, -5, 12, -58, 22, 2, -22, 14, -28, 1, -46, 11, -6, -45, -32, -12, 25, -10, -49, 27, 18, -21, 23, -32, 31, 26, -22, 23, -31, -8, -18, 6, -10, -2, 34, 66, -8, -26, 56, 37, 18, 18, 13, -31, -7, -4, 15, 0, 14, 16, 27, -27, -29, 46, -9, -45, 24, -41, 9, -3, -41, 13, -8, 26, -4, -42, 32, 26, -2, -3, -39, 22, -8, -65, -12, 57, -19, -26, 30, -34, 23, 31, -31, -29, 13, 20, -26, 5, 43, 40, 29, -7, -32, -18, 54, 28, -18, 23, 22, 5, 21, -6, -1, 16, -74, -2, -36, 20, 64, -43, 22, -2, 19, -26, 24, 16, -38, -21, 7, -10, -11, 1, 1, 22, 17, -22, -32, 22, -10, 0, -65, 0, 49, 5, -11, 34, -41, 7, -3, -14, 18, 17, 7, 2, -60, -3, -14, -29, -26, 1, 21, 15, 5, 24, 2, -25, 16, -46, 28, -46, -43, -12, -45, -29, 9, 1, 8, 22, 23, 34, 21, -26, -19, 20, 10, 9, -18, 8, 11, 14, 1, -13, 4, -22, -3, -17, -41, -16, -14, 72, -23, -54, -3, -25, 27, -43, -31, -35, 8, 12, -38, 24, 1, -21, 17, 35, 25, 68, 41, 6, 45, 10, 89, -8, -47, -16, -9, 47, -57, 57, 27, -18, -20, -50, -31, -17, 25, -10, -14, -2, 5, -34, -90, 13, -29, -25, -32, -31, 41, 41, -43, -39, -10, 40, -40, 71, 20, -12, 27, 31, 18, 18, 26, 52, 15]
4385A5nOrK1j0o9N2rM4K2o5K8l9N3p5J9j5J5K9n0N6k4On%K3k8J3j2kmK8K1n4J5
4420ij9K5Jl7K1oP0r8kN9Om8KQO8l4J7pRJ0n1j2RP5n2k5K1l0J04o9J0k2m7R2k9
4455A0o3P6m9L7mp8O4L1J7m0k8K6m6K9pJ4QNj1j1%K3j4k3rK8QK6j3l6K8l8J4N4
4489B8j7k1j5K5JL0q2M6kMp0Q9l9K7Qm2N2M3p8pM7J5k6j8K7l7M2n0J6K3jL5o7
4522a4KpmJ0j8J9J9Q3j10K2mk4j5N2l9J8l6Q5pm4K9K0l9On9M9j3nP1j8J5n0LK2
4556A9MM9k9m6kJ7kl7MK2Rkj9lL3J2k1J3J1j7j6k9O0m9N0p5Q9mk4K3l5m7Q8k2
4590B4o0M8j6RK5j6m4M6%PK2j6k9k5ONK7m1K0l0M2K3o4M9o4M7qJ7Nprj5L4M8n3
4625GN4k7J1kn0pJ2jMqO5kk6j7k5K4m7N3kJ9No0M1m4M0Qm7R1r0qM7n6Q6n6k7O3
$$ y = [15, 10, 16, 7, 28, 18, -51, 1, -8, 36, 58, -7, 21, -18, 35, -40, -21, -36, -21, 8, -42, 14, -10, -4, -9, -9, 14, -14, -1, -13, -15, -19, 9, 30, -24, -9, -28, -3, -2, -39, -18, -24, 46, -52, -54, 5, 11, -37, -35, -27, 41, 7, 24, 17, 26, 36, -15, -27, -18, 57, 5, -20, 1, -29, 75, 6, 16, -6, -53, 39, 10, -53, 23, -26, 11, 7, -71, -7, 24, 41, 1, -27, -1, -47, -18, -25, -11, -3, 2, -9, -20, -20, 3, -11, -34, -43, -15, -7, 19, 6, -30, -2, -40, -26, 28, 11, -10, -25, 0, 1, 31, -51, -5, -7, -3, -73, 16, -23, 4, 12, -30, 22, 65, -13, -20, 27, 42, 16, -2, 25, -12, 30, -20, -4, 19, 18, 53, -14, -12, -19, -23, -13, -31, -12, 7, 90, -20, 2, -2, -26, -41, 11, -28, -10, -46, 39, 32, -12, 17, 37, -2, 4, -55, -6, -19, -24, 47, 29, 44, -6, -3, 19, 23, 72, 43, -3, -5, 12, 10, -27, -23, -1, 8, 6, -13, -16, 17, 29, 8, 21, 32, 15, -1, -30, 30, -19, 31, -44, 45, 41, 17, 40, 5, -42, 46, 24, -36, 12, -4, 5, 30, 14, -30, 16, 16, 23, 45, 29, 0, -25, -19, -14, 13, -28, -8, -38, 4, 27, -37, 12, -52, -5, -13, 4, 9, 2, -7, -22, 12, 60, 7, 61, 34, 45, 43, -7, -14, -2, -3, 1, -7, 58, 56, 30, 13, -12, 12, -35, 18, 16, 35, 40, -20, 21, -23, 17, 25, -22, 69, -21, -29, 18, -38, 48, -8, -35, 28]
4661B8J4n5M9j1ln6L1J5Oj7L0ql1L7j8J5Nj5NMl0O1o2K6j6QRk5l1M4K9m7j7qO7
4696C3l7N4o9M2o9M9RJJj0j9jK1l7M2K6m4k6O6om1llO8n0J5j8L4j1O3q6K9%j5
4730HNl8RK3%ook5J9L0J9p6M5J2n2Q3l2j4ql4Q0m1l7M7M5n0M3k3K4m1k0K8%Mm1
4765b0J6K0Rj3j2K1j4K9m7j1K4k2Jl1N4J4rj1lOkN0l0m5J6Qk5l4L8K8K5l9M5p6
4799d0O2Lo0L7L0k2k5PJ8j3M3j2k1K1N0o4L3n8M8j6K1l2k6N4n3K4jNk8J2k6l0
4831e9P2j7L2q5O2j5m3K5L4QkK7j9J3K5j8m2Rj6K7J4k2m2K1J03m7qn9kJ2k5k4
4863f1N7mL4j5o0P1k5jk4K1Rl7J6L9j2L1n2O8n4rj3K2L7ql1K5j9L7l0pk7j6O2
4896B4n7l7N5lL8lJ2k3k7N9m4o7O0k8M2K2m8Jk0M9l6N0j7j2k8J9N4j0l5N4l8Q
$$ y = [28, 42, -13, 36, 25, 22, -34, -3, 12, 18, 1, 31, 23, -8, 29, 11, 26, 31, 16, 21, 25, -5, 56, -6, 20, 4, 12, 21, -4, -35, 9, 38, -9, -26, -34, 33, -4, 50, -19, 23, -46, 3, 12, 13, 14, 4, -15, -16, 5, -32, 10, 36, -8, -34, 32, 26, -15, -18, -21, 47, -3, 12, -6, 28, 17, 80, -6, 23, 23, 8, 13, -25, -16, 7, 7, 1, -5, -30, -11, 19, 38, -38, 7, 19, -33, 50, 18, 4, -4, -38, 42, 1, -36, 11, 56, 6, 49, 26, 50, 9, -11, 17, 17, 21, -20, -4, 16, 25, 12, 0, 21, 7, 36, -11, -22, 2, -20, -19, -50, 4, 18, 9, -2, -5, 1, -1, 49, 19, -26, -10, -2, -27, -61, -23, 5, 30, -9, 36, -40, 22, 25, -35, 2, 32, 10, -15, -8, 10, -3, 40, 28, 7, 28, 78, 14, 47, -11, 37, 21, 42, 10, -16, 38, -15, 9, 8, 13, -15, -3, -29, -59, 13, -4, 28, -57, 5, -10, -53, -28, 6, 14, 12, 39, 20, 33, 58, 40, -2, 7, -9, 18, 32, 10, -32, -11, 92, 45, 37, -22, -24, -12, -37, -61, -4, -8, 26, 11, -49, 22, -3, -4, -28, -7, 2, -35, -19, 20, 8, 39, -13, 55, 1, -8, -21, 1, 38, 30, -1, 24, 5, 42, 12, 5, -22, -38, 24, -33, -70, -15, -18, 20, 17, 29, 6, -21, 38, -6, -73, -13, -41, 1, 23, -25, -24, -44, 5, -31, 19, 2, -10, -38, -19, 35, 25, -10, 44, 6, 14]
4928A4K2mm0rM3L2r2L1J5On5N4n3R0p0J9NJ3j5k6pK0L5m5O0j26P5j2j8K3K5J4
4960B4k9K8j1%l5pN7l1K9M7j03M5l1L2J9k5%L2m1J4p0M6OK2j1M1l3j1J4n2M8j3
4992AK5m4L6j9nLLJ7l2L5l3Kj2L4M3m9j7M1m7L0K6k2j8RMm6J05p5k2L9n5L7K2
5025A6KL3p9P9k8o0M8K4n1l3K5KP7q2lJ2j4M4l1J9j1l1R3q1K8j0j2l2L1l4L7K0
5057bJ0j5m0J04l2j8o6P9l4L9r7N2M5j7nj4L7j7k6j5LJ6M1n4L8K6q1J1J7n2pP3
5089aK8m7m9Q4K7%k1J7m8P9n4j7K4L8k7L5q1K8%k1n1M1J6jj6kM3k6K9p5K4M2k5
5122gj8J1jL3rq3M0L6J4J6Ol4oM4n3PK6%lk9k4RM6rj4K6j0j0J1o5J1J7M4m8R0
5157F4j28Q2k3l5L1MJ2M0j4q0P3nlo5K9k6L2LM2j2K1l6j4J0j0qk8K1J5N9l5L3
$$ y = [14, 36, 32, -8, -17, 26, 58, -34, -3, 12, 18, -37, 17, -36, 54, -16, 3, 8, 21, 6, -20, -27, -7, 28, -17, 43, -83, -8, -20, -38, -15, 10, 24, -5, 23, 12, 12, -23, -30, 27, -4, 25, 72, -31, 14, -17, 15, 34, 9, 9, 41, 0, 14, -56, -10, -4, 18, 7, 48, 15, 4, 18, -34, 14, 1, 26, -18, 18, -1, -6, -3, 0, 17, -15, 20, -13, -11, -23, 11, 54, 5, -12, 29, -18, 12, 38, 16, -2, 7, 11, -35, 70, -5, -27, 12, -43, -6, 16, 18, 51, -28, 51, 23, -37, 11, 35, -16, -49, -24, -22, 55, -27, -30, -18, -32, 12, -19, 0, -11, -42, 51, -30, -2, -12, -24, -56, -25, -59, -22, -2, 8, -7, -47, 57, 25, 7, -59, 20, -14, 25, -72, -20, 25, 8, 3, -11, 26, 9, -17, -32, -29, -13, 28, -26, 12, 38, -43, -32, -15, -67, -74, -1, 27, -20, -69, 15, 42, 42, 21, 38, -10, 69, 15, -2, 22, 60, 33, 68, -13, 15, 15, -6, -57, -16, 0, -1, -17, -19, 24, -2, 27, -48, -24, 18, -7, -25, -14, -15, 18, 9, -74, -34, 2, 16, 32, 38, 4, -2, 42, -11, -4, 22, 22, 19, -10, -34, -25, 21, 12, -2, 24, 14, 4, 15, -50, -39, -22, 22, -26, 64, -64, 18, -5, -40, -9, -5, 7, 47, 33, -47, 26, 21, 18, -47, -18, -44, -12, -9, 33, 21, 42, 6, -8, 2, -8, -16, -44, -23, -8, 51, 16, 49]
5189D9q9M9qj2L1oj7M4o5L3k4K2m5L5J6l1N8n2P2p2j1RN0Nj4kj0k1j7N1j9J9p1
5222d3K6O0l6k6O5J6k6l9N0p9K1k5O5o3l1P7K1l5pLjj0J1J7J4j2k4QK6Kj8M6r1
5255c8L9n3J02q3M2Rn3P4q8NO9k0JqN0k4k5LrOqK2J5p2L0Ll8P8j04N5K2m1K5j4
5289b8PP7n7nJ7j0M3k3j3m9J1rK6oL8O2m9Mkk8N7j8m4j5P0l2K6o8j0J1P5o1j9
5322b2O9k2K4l5jpL2%p3L7J4ok1k8O0n7M6k0j5M4Lp2N2K7Ll1j6Q7m8j0rJ7l8j1
5356b7O4n0Q7r6N9nq1L5J9n5N1k3j2M4l8N2o7L4M5o8N8r8M6L1J5lqJ3o2L0N8k2
5388B6k1rJ5n8N9j4K2J4l0j4KK1n4M4J0k8M0n2M5j3kL5n2J7prOqK8k7KJ6lMj1
5423frK8Ko0N9m0P2m2M6p9M7Lk7L0j1j4L0j4k0J6J9K9q4lNL2l3%K3rM9k1l9l1
$$ y = [49, -40, 9, 1, -11, 20, 14, -3, 41, -24, 9, -15, 7, -38, -3, 13, -18, 40, -12, 60, -12, -23, -14, 36, 41, 27, 25, 15, -6, -23, 28, 9, 28, -43, -17, 43, 7, -19, 46, 62, 36, -3, 47, -32, -11, -36, 29, -34, -65, 12, 33, -2, -9, -6, -7, -17, -6, 11, 25, 13, -11, -3, 23, 25, 7, 53, -38, 1, -52, 50, -33, 9, 18, -35, 39, -49, -44, 25, 5, 6, -2, 48, 24, -1, 2, -7, -1, -9, 13, 28, -44, -14, -11, -49, 29, -75, -20, 2, -39, -14, -28, -21, 56, -1, -6, 11, 1, 44, 21, 8, -41, -30, -39, -13, -19, 19, 81, 32, 36, 34, 6, 63, 45, 1, -14, 56, 24, 50, -18, -28, -17, 58, -3, -22, 47, 25, 49, 14, 13, 6, 38, 38, -35, 2, 16, 10, -11, -39, 21, -36, 10, -10, -25, 19, 22, -50, 2, 29, 32, 1, -15, 72, 24, 14, 5, 22, -16, -27, 37, -13, 74, -22, 37, 32, -49, -14, 5, -50, 1, -22, -34, 10, -28, 24, -43, -9, 36, -32, 26, -72, -26, 5, 20, 17, 9, 22, -40, -10, 48, 26, 5, -4, 11, -47, 12, -2, 20, 34, 4, -10, -8, 13, -41, 3, 13, -15, 25, -27, 18, 5, 3, 38, -14, 3, -4, -13, -7, -15, 13, -14, -12, 4, 1, 5, -6, -15, 13, 15, -45, 14, -26, 46, 4, 50, -29, 18, 21, -6, 24, 13, -1, 29, 15, -5, 11, 30, 59, -25, -28, -23, 9, -24, -24, -1, -10, 39, 18, -21, -52]
5457e2N9K8o5K6m0R3Pp7O0j1j0K0l7j8L4Rm7L4l8N9Rn5J1M1j4j2l3oO2Lj1J1M
5490D4o5K1k2K4j8L7kkn6Q1q2M5nk1RN6l8J1lOJ0n0K1RJ0o5L5L1q%MnL4po3L5
5526A1j3K5l0J2J4J2kl6L1n0QO9n4L4k9ORo3J9Ml9J05q0J7K6m5Q0j9qk9O0q2J3
5559b4Q0p3j4k2L1PK4J0k3K4m9N8k6knjJ2k2K7j15J44mk3j01J23qpl3J2k9k6K5
5591c0NM4j3Lk2M8k5R8j31L3l0J8J8k9N7k5LJ7p2L1mL3j9J6rj1Qn7K4%K2L0n9
5624b8M1m5M6ll8JON6k5qJ0l6K7K9j1j6M7k6Rp5O1lK5J6o6L5k0nl3L0LqQl3K4
5659eO2q1M8l0mL4l3M0l5NK2m2M5k2M1ql3k6M7K3l0j3j0M5k3M2o8L5J5pk5ML9
5692E2lp7M5p1Q0K6p2J1p5R6j0K5k0k3J1jk8J7J3J2k4l6N3JN6n9o2L6N6N5q2N6
$$ y = [-52, 7, 35, -30, -4, -44, 49, 56, -21, 39, 28, 18, 38, 1, -17, 17, 26, -21, 13, -25, 34, 43, -12, -1, 40, 26, 14, -19, -25, 37, 40, 29, 40, 44, -21, 0, -22, 2, -16, 21, 19, 17, -39, 42, -40, 5, 0, -21, -12, 44, 6, 17, 14, 20, 30, -20, 1, 10, 20, -45, -10, 21, 13, 13, 17, 12, 46, 39, -24, 11, -2, 23, -7, 5, 19, 31, 29, -7, 24, -26, -18, 51, -3, 31, 2, 8, 17, -46, -27, -23, -62, 43, -37, -20, 6, -39, 41, 22, 14, -15, 45, -37, -24, 56, -17, -31, -53, -22, -15, 9, 19, -4, 20, -29, 29, 3, 1, -4, -5, 7, -15, 12, -103, 41, 37, 14, -87, 36, 28, 21, -12, 0, -29, -55, -30, -25, 19, 6, 9, -13, 35, 10, 108, -23, 10, -20, -2, 16, -13, 44, 19, 22, 39, -33, -2, -6, 27, 8, 24, 15, 4, 12, -45, -21, -21, 1, 31, -28, 13, -32, 14, 11, -27, -26, -20, 36, 11, 3, 13, -23, 4, 33, 22, 6, 53, 27, 36, -39, 22, 19, 44, 60, -6, 29, 9, 4, -29, 1, 4, -4, 4, -29, -5, 57, -24, 24, -6, -10, 24, -9, 31, -4, 1, 23, -19, 26, 4, 45, 37, 4, -22, 25, 48, 18, 5, -5, 40, 17, 59, -9, 26, 41, 34, 9, 13, 52, 49, -28, 17, -54, 26, 52, -20, -9, -84, 12, 2, 27, 7, -16, -5, -6, -34, -17, -4, 8, -16, -52, 1, 2, 58, -1, -63, -27, 29, 84, 2, 58]
5724E8nrm9mlM1k9k3L5m8P6k3k8jpM8o7kJ5M3l6O3l9m1K2M5q1K4K4j3L0m3O5m7
5758iN1n4Nj0J4L6j4lK0m9m2M8lJ0j8qL1M9r7P3m8L1NK7qn4MmL8l0J4k1O9n3J5
5793A5k7L3pPJ7p3K4J4pM7L3p2L7m3O3o7K5m2L7J4k1K0N9j9j08R0o0N1pl1K8n9
5825b9K5qJ8L0j7Ml9M8m5K0kk3k5J0M4J1k3J0On4P1o7R8j09N5J8J0k8%j0Qk1o3
5858g7J15J1k3k6j7mM5l6j2K3j1L7n8j9L3M0o3L1L5jm7J3j2MkK1Qk2M6K9j7k7
5890A7k3Pl9N9k6J2j5qJ1qL2KL4l2Jl5O3l2j7N3q0P6j03O7o2Q1n3J7j5k2K7k1
5922c2L0o1O1PPm1k9M9L2pmL7J6o8k4L2P9m5l4ok0LJ3N0o6j8P8o0j0rM5O0Ro8
5956Fk9RM8o2l0M3L2N2q7J6NN3rn1M9l3j5Kk0PL2K8n2oR%j3jJ3M9q1RJ1Rk1j7
$$ y = [58, 53, 44, -5, -9, -12, 29, 0, -23, 12, -36, 40, 17, -11, -12, -19, 29, -38, -40, -25, 18, -18, 45, 6, -35, -13, 32, -49, -25, -1, -14, 16, -27, 38, -9, 42, -12, -7, -17, -3, 33, 19, 16, 36, -13, -55, -7, -10, 0, -18, -26, 5, 54, -43, 30, -18, 13, 18, 45, 37, -17, -13, -17, 21, -9, 5, -16, 53, 0, 15, -12, 21, 14, 21, 38, -35, -11, 3, -4, 43, 76, 4, 41, -2, 61, -6, 19, -23, 14, 28, 7, 27, 86, 67, -41, 49, -11, 40, 33, 2, 30, -29, -4, -12, 6, 36, 19, 23, -16, 32, -13, 7, 5, -18, -43, -33, 11, 22, -1, 9, 15, -39, 32, -35, 63, -46, 9, 27, 37, 9, 9, -1, 7, -14, -77, 38, 49, 26, 0, -17, -21, 24, -12, -24, -1, -12, 25, -33, -52, -19, 21, -42, -11, 24, 23, -24, -11, -23, -19, -21, 0, 8, -14, 32, 61, 44, 17, -6, 1, -38, 21, -5, 7, -8, -16, -5, -13, 19, 21, 55, 23, 24, -11, 52, 20, 3, 56, -24, 52, -51, 16, -46, 35, -18, -1, -16, -38, -11, -32, -2, -63, -2, 5, 12, -29, -58, -9, 23, 16, 12, 49, 65, -3, -27, 5, 84, 39, 5, -1, -21, -18, -5, 45, -21, -39, 39, -21, -31, -40, 5, 65, 74, 6, -23, -14, 34, -28, -58, -15, 17, 69, -18, -2, 3, 56, 47, -4, 45, 12, -3, -1, -21, -14, 18, 46, -6, -12, -3, -3, -16, -17, -4, 45, -36, -27, -16, -7, -28, -45]
5992d5NP9l9rNmj3l0N9j6k8K3J5N2o7K6l3J4j6j6L7m3M8k3lLJ7K6L4l7m4J4K3
6025A4j7m0O2QJ5l8l0J8N8m8mm6P2J5o5J4N6n6Lk4L4n6N4j5m4O3k7J8j3j7j3O9
6057B0N2o6j1N5l3M2j6n6j1Q6j04QJ6L4Mk7k3K0M0m3OJ8Pk8J8j4jK4l6M0j5Jk3
6090a6N1k1J9p1N0K9l8J1j7N9n6m0K1J1K7mj1j7M9k5j3%J5j3k9JM2j7l9P1m0K8
6122A7l1L1kk8K8o1N8k8L0J6k5J0m6L5jLmk1K1lJ9pm3j2P6j1nN8n8j1K2m6L2%
6156A3m1m7O6JM4Ko3j9M2MJ6m9mN5M3l9m8O3m1j7k6rN9P5r2RqM4k6JrM2J8m2k9
6191a2K9j2o5NO7m0J7j1M3k8m1J5QM1n7rO0m8J9L2j0J7n1K2K3K4j2jJ4qj4j8N
6224D%l9O1k9m4N8%Rm4nqO4l7N7o5%k6oN2j0K8m0j2K1K3J9n1M3Rk3l0K7M5j00
$$ y = [-45, -40, 39, 0, -9, -4, -8, -21, -51, 8, -8, -36, -13, 2, 54, -13, 13, -20, -6, -22, -38, -1, -44, 4, -19, -22, -19, -2, 24, 58, 21, -23, -9, 14, -3, -43, 19, 27, 42, 4, -26, -8, 50, 2, -2, -48, 24, 39, -26, -12, 44, -12, -9, -33, 1, -55, -1, -16, -60, 3, -24, -6, -19, -36, -49, 20, 72, 6, -5, 50, 17, 59, 43, -13, -24, 62, -42, -34, -18, 16, 20, -7, -30, -10, 30, -13, -7, 11, 18, -10, 8, -6, -7, 17, -19, 21, 6, 7, -16, 35, 14, 33, -38, 12, 41, 3, 14, -3, 56, 0, -40, -19, -8, 19, 15, 4, -13, 36, 11, -2, -2, 13, 0, -29, -28, 14, -3, -42, 29, -11, 17, -14, 17, 15, -13, 15, -46, 12, -16, 14, 30, 5, 15, -31, 4, 3, 6, 2, -19, 2, -1, 18, 11, -32, -44, 32, 21, 16, 74, 16, 5, 27, -19, 13, 13, -28, -75, -9, -8, 36, 38, -25, -44, -2, 2, 18, -31, -35, 20, 63, 24, -24, 39, -2, -19, -45, -54, 5, 80, -12, -3, -11, 33, 7, 8, -1, 41, 59, 17, -12, 17, 5, -60, -55, 12, -28, -11, -22, 21, -7, -48, -33, -25, 16, -41, -50, 10, -38, -19, 13, 3, 20, -31, -9, 14, 38, 26, 25, 39, 31, 17, -1, 4, 4, -35, 26, -3, -47, 11, 11, 20, -24, -29, -37, 27, -10, 47, -18, -18, -44, -50, 2, -8, 20, -20, -32, -11, 12, 31, -20, 23, 32, 9, -21, 6, 51, -49]
6258d9PQ1m6J7Mj1PK5n6lL2j3J4k2O0n4l2J7N4n2pJ2K1Kj4j7pN8lk0l7N4o4L6
6292fK7jlj7nL4j2l8k1K9O2o5L2j1j8j0M9L4n8N1k6l1Kl%M9km7J8o9N6M1k7m4
6326c0jk3N7o4J03j9l6L9k6k1M1K6l6Om0K6O5j08K9o2P5K0Mk9J2m2K8m3O9Rm7
6357a8j2M3N3o4no2R7k9m2L6nj7K6%kj4N9l4Q5r6j0lQ1o7L5o8O3K1k5l3J4j4m9
6390e6L7j1P6n8j1J9Rrj9K7PL3m3K5o9NN8lj8Po3P9Mok8J3N8q0J2qL5J6k6r1P8
6425aJ3J7l0PM1k4o7J3QKK5l6L1K8K3l5K5m9l3O1kOj2n6R1j9Kk4m3J6L1o8P9N0
6459G0r9P4j4l0K7Mm1O4J8r7P3m7rL2o2M6%j0l6N3n7J5NK2j6m4K4O6n9N2l3N2
6491D3J8n0K4K5m7rPl8L3k8j4L4jK4k3L1k7ok9NM1p7KQ7k5%k0L0k8O0m1K5l7L0
$$ y = [-49, -42, 39, -7, 10, 14, 3, 10, 35, -21, -24, 8, -5, 9, -13, 47, -7, -39, -22, 32, -20, -27, -15, 6, 8, -6, -23, -30, 28, 25, 5, -32, 22, -42, -6, 21, 20, 17, 0, -5, 29, 17, -21, -42, -13, 49, -16, 16, 5, -13, -23, 26, 60, 2, 53, 27, -4, -2, -5, -5, 44, 42, -5, 13, -56, 0, 41, 14, -30, -31, -54, 3, -61, 42, 23, -13, 26, 0, -21, 20, 46, 10, 16, -24, 2, 67, -41, -12, -74, 1, 21, 25, -4, 8, -34, -6, -49, 20, 29, -18, -30, 13, 66, 2, -3, -65, 32, 3, -39, -3, -8, -25, 1, 1, -1, -15, 44, 10, 95, -1, -11, -14, 67, 0, 35, -33, 30, 51, 26, -7, 7, -7, -56, -19, -30, 46, -12, -23, -4, 5, -4, -23, 4, 11, 44, 1, 26, -43, -38, 20, 17, -1, 6, -57, 22, 26, 20, -8, 5, 63, -17, -5, -13, 22, 38, 12, -79, -1, 12, 29, -1, 6, 47, 23, -44, -31, -23, -21, 4, -32, -1, 27, 50, 15, 40, -9, -42, 19, 17, 23, 11, -45, 46, 27, 29, 5, -38, -22, 9, -59, 20, 70, -29, 45, 31, 1, 28, 32, -9, 55, 73, -24, 49, 2, -7, 25, -37, 9, 9, -1, -37, 16, -41, -26, -21, 1, -15, -59, -35, 31, -28, 24, -9, 43, 61, 11, 35, 60, 13, 4, 11, -27, 6, -22, -36, -2, -3, 21, -2, 29, 2, -4, -33, -28, 13, -64, -62, 25, 0, 0, -20, 10, -18, 42, 1, 26, -11, 19]
6525A9k5Km8M7j1N8n6PkK9rJ1k6M3k6NJ2q6P6k6rP1j9k8l0RK7L1j2l3j5J0KRj3
6560fk2K9J6J1l8NK5k2onM8j13J03j1k3M6Pm8J3Qk4j2J7J0l0P4j1k9j9K0L6l3
6592A6J9kk0ol1J5N1m7j7l2P4n5K5J4k6J2M8o4L3J0m7L4m8M6J4k0J7J6rl3QK0
6624A5o7M0K4Q6n1l4l5oM8j7m1j2O9j7qPll2M3Pk1Qo5Q4l5n0K6oP1m5L3l1JLN3
6659D2J3l1j6KMk2J3q9Q4L3m0L2l7k1L6mK9k0L6l1m6k8K0M2J9k5L7J2K6l6J1j3
6691C2j9m2L4K7oMp2P4l4R%j0MNKm3J1L2l9O0j6k2J0JN2j03L6P6k6k0Lo4J5JJ2
6726a6qJ0j6L6J3k0k5PO7l4J5k3L2p1J5L9p6M6k5L9%N1o0lj9oK9J9ln1P1l2mk
6760elJ3K8K5n3ol3M9k9L2l6L2Kl2J8l3O2qn7%M9m5OM3lo5N4L5n8L1%j5J9n7L7
$$ y = [19, -6, -4, -52, -5, -16, 42, -14, -7, -9, 20, 11, 22, -4, 39, 13, 18, 30, -56, 20, -6, -15, 56, 37, 9, -21, -12, 15, 46, 34, 1, -14, -4, -2, 7, -6, -28, 1, 17, 28, -10, -5, 20, -2, -8, -13, 35, -78, 25, 14, -9, 37, 44, -4, 9, 17, -7, -19, -2, 8, -22, 52, 41, 12, -7, 13, 49, 16, 35, 33, 13, 7, -24, -9, 42, -5, -22, -54, 20, -35, -10, 4, -22, -10, 38, -26, 7, 17, -30, 4, -44, 2, 16, -4, 13, 29, 20, -13, -5, 15, -52, -12, 12, 98, 47, 13, -22, -28, 20, 3, -38, -50, 19, 2, -6, 1, -2, -34, 9, 16, -5, 3, -62, 22, -13, -63, -37, -43, 28, -17, 16, -15, -14, -11, 42, 55, 24, 8, 10, 14, -8, 5, -84, 0, 33, -7, 25, -12, -33, 3, -1, 28, 8, 44, 13, -33, -61, -41, 1, 20, -5, 32, 44, 70, 34, 45, 32, 13, -29, 5, 32, 26, 30, -42, 32, -2, 7, 7, -3, 1, 6, 8, -35, -24, 8, -31, 29, 13, -9, 1, 2, 54, -49, -13, 63, 37, 17, 20, -44, -29, -28, -16, -24, -14, -30, 6, 19, -1, -26, -19, 48, 14, 29, 6, 38, -33, -18, 21, -55, -9, -34, 5, 5, 56, -4, -7, -26, -32, -3, 16, 13, -38, 33, 1, -3, -5, -8, 5, 33, 58, 5, -1, -34, 15, -14, 18, -18, 14, 16, -16, 2, -31, 31, 23, -34, -34, 15, -30, -24, 19, 16, -49, 5, 40, -18, 13, 13, -2, 17, -40, -3]
6795cN3o1JJJ4M1m0k4K5L6k2m2K5K2k7k8O0l3n1N6J5l1JJ3j1pJ6K8l1Rm2K0k3
6828d0n0J09l9L6Ok6j2M6n3J34j38k0L5OK8l9k1J8M8n3P9m3J2k1J4j6lJ1%j9k4
6859c5J3L3J7q7O5k0kL2k5J1j4R1n7k3rJ8J8%qj3J5rK2n7lrJ9pL4jo5M6OM4l8
6894Bl1N1o9J2K2K1j6j2QJ9K1no2P5J6p0K1k1L6rprK7l9K4j1l3M5J7k5o6P1O8
6927G1o6k0lL1J0nm7oJ3MM4m5l1J08n4j6kK6Nj4m5L1J0L6l5%K9J3l2l7l5O2K4
6960B4n1L4k2O9m8Jl7j2J02m7l0j2L0J4oo5RK3N9k0l4J2K2Npj8L7J1Mj8l7K3P
6993B2j6Lm4M7n5N6K5j6p4O8pJ1j9J5Oo2N3k4M2m5j7lL7l1J2L9j3m6j8N6kK3K8
7026E1m5jK2m8K2P1j38R1L2p4L5L2o5LNRM7r3M1k1MK9k8L1Pl5K9j8K9qk3l1K1
$$ y = [-3, 50, -11, -10, -9, 5, 46, 6, -18, 7, 43, 21, -21, 4, 26, -1, -29, 31, -2, -53, 3, 18, -13, -12, 1, -10, -17, -1, 27, -4, 5, -37, -17, -40, -90, 19, -20, 16, 22, -4, -16, 30, -23, 111, -27, -47, -12, -6, 22, -17, -38, -20, 28, -25, 54, 11, 23, 2, 16, 0, -3, 8, 8, -11, -35, -22, 11, 28, -59, 6, -14, -16, 16, -9, 2, -12, 79, 22, -1, -10, 8, 26, 26, 18, 5, 20, 11, 33, -24, -27, -36, -17, -24, 10, 9, -56, -10, -4, 40, 2, -29, 22, -47, -35, -13, 8, -8, -20, -12, 7, 28, 23, -39, 36, 52, -18, 3, -18, 18, 9, 2, -7, 20, -19, 5, -6, -39, 6, 23, -2, -68, 3, 71, 5, -15, -18, 13, 23, 18, -29, -35, -22, -18, 26, -19, -50, 58, 4, -12, -14, 12, 17, 3, -42, -11, -1, 35, 0, 0, 29, 42, 10, -27, -62, 0, 24, -27, 7, -15, 54, 6, 7, -30, -42, 60, 13, -17, -29, 1, 15, 9, -56, -47, -24, 35, 15, -19, -7, 15, 20, 13, -5, 32, 43, 47, 29, -8, 15, 22, 6, 9, -35, 12, -43, 13, 38, 22, -52, 16, 9, 20, 1, 16, 22, -40, 13, -11, 31, -14, -31, -34, 3, -28, -16, 23, 10, -36, -54, 2, 0, 23, 51, 6, 5, 27, -21, 1, 72, -66, 25, 57, -17, 18, 50, -15, -12, -7, 2, 49, -44, -3, -24, -20, 9, -19, 12, 19, -16, 13, -5, 24, 16, -7, -38, -17]
7059a7j3Q3n4j3Qk2M5m0JL9k8l0j0L2L3n2%j1P3j2l9K0M3n5K4L5l2On3J9M8m7
7091a9J0J3J5l7j2K0P9m1l3j6l8R3o9N1nl9M2Mm1J7L9n2M5l1J8M3o4K8Ok2j4J9
7123Il2MJ0J0MO2o9L7k0j6l7M8J1o1J7L2kK6p0N1Pm1O0l5j0J1n4P4m4L1k0K9O
7156B8k0qkL3pk1QM4k8j7K3rjk7j4Jj1K0l0M2K9j0K2p3oN2j7MrNk0j2JK3J4kJ5
7193B0n7O0j7Kn9J2KK1P1m2l2J9J9j0k8M5Oj4j1N4K4j22O9m7K9j5LJ7Kl6l3L6
7225a2K2n0Q2l0l4k2m2O3J8mK5jj2J9K4n9N1j5J5kln8P5m5j7J7j1J5J8n3L0J5
7257A9o0P6n3J5J6Nj2k0L8Lo3P1j4p2P6m6O9n4Jj0LJ9J7Om0Q0j13O4Oj1m7L3j6
7290a4J3ol6L7kJ8L3o2PL7J6l0k6J3K7k7LJ0rO2p6jNJJ5j1k4k1rO9J0j8l2P3n2
$$ y = [-17, -30, 53, -1, -14, -6, -28, 17, -23, -22, 17, -11, -41, -51, -19, 14, -38, -38, -49, 24, 12, -27, -7, 36, -19, 5, 40, 8, 14, -39, -20, 28, -19, -9, 4, 19, -18, -30, -10, 69, 28, -5, -21, -59, 34, -35, 16, 11, -28, 14, 18, -23, -6, 33, -19, 26, -5, 13, 56, -8, 20, 26, 4, -10, 9, -23, -19, -9, 1, 5, 67, -2, 35, 15, -1, -38, 10, 21, -40, -23, 9, 7, 33, -37, 14, 21, -20, 40, 5, -5, 6, -48, 26, -18, 13, -7, 22, 28, 8, 0, -2, 31, 24, 3, 11, 55, 27, 10, 33, 24, 23, -4, -18, -17, -28, -8, -38, 4, 33, 23, 45, -28, -34, 18, 1, 5, -4, 1, -19, -31, -30, -7, 7, 5, 20, -37, 23, 6, 8, -51, -39, -37, -16, 55, 13, -19, 0, 19, 9, -19, 26, 32, 18, 7, 61, 85, -37, 32, -15, 14, -1, 2, 19, 21, -15, -48, -12, 10, -40, 42, 12, -22, -44, -86, -23, -5, -9, 16, 15, 3, 22, 46, -13, 38, 23, 38, 36, 33, -25, 50, 5, -12, 5, -6, 9, 27, -26, 4, 19, -41, 35, -18, -3, 13, 18, 6, -14, 24, 27, -36, 35, 21, -51, 25, -21, 48, -6, -5, -15, -12, 7, 24, 30, -10, 70, -43, 21, 27, 16, -31, 2, -14, -1, -7, -43, -6, -8, 10, 43, -19, -12, 25, 41, 11, -15, -2, 25, -2, 1, 11, 2, 64, -12, -13, -8, -7, 8, -3, -27, -48, -57, 12, 22, 4, -28, 45, -7]
7325gj3N4j8M6o9k5J4M0J8m3k8O0n9N7l9Pj5K9m9K5J4K9j1m0K5l9J7L5m0L1L6
7356D2p3O3l2qOk7L6M9p2K2L2j00M2J1K4Jk1J6%qM2j3m4J8k7K0M3m1JJ5j1Jn2
7389d5P0k5L0o1M8m5L4KoL6Pp5k7L9N6m1j6P7k9k1n7M9j7k4NM3k5N6Mm0j2j4k5
7422d9M1k5O7J8p3N3n7M8n6K4N1j8k0m8L7N4m1m5P8n3M6k4oK9m8J5N0m9jK5M8
7453G1p5k8K7L9mk7RJ2l5O9n4J6m5L8L1m7jlP1p1l1N7j9L1n3L1K5l8ml6Q7n4p
7486a8ML3k8M7m9n8J43o3M4m5j0K6p3Q4k7Kkm9K0RJ9k6J6k2QJ7J0J4j4j4L6j4
7518B0j1j7l7M8j0l8LN9j7N1q7Q0l1K6o1J6lK3j8J2j7K0Pj5J0lJ6n4RP0j3%J5
7551E3ok0J2lr3J01n2n1J6j2M5J5JJ6kj8K0m0O5m9K8m3N7q6N0K2k3j7N0j8j1%
$$ y = [-7, -20, 34, 16, 62, -7, -32, -18, 22, 40, -3, -31, 29, -30, 27, -12, -5, -20, 9, -40, -15, -1, 28, 17, -23, 2, -37, -20, 15, -25, 6, 42, -31, 32, 0, -8, -2, -29, 7, 56, -16, 6, 38, -62, -20, -9, 15, 16, -5, 11, 11, 3, 45, 32, -12, 6, -21, -1, 42, 1, 2, 17, 6, 7, -45, 25, 0, 30, -31, 17, -28, 6, 8, 2, 38, 45, -30, -57, -18, 38, -3, -19, 58, 29, 8, -49, 0, -17, -41, -36, 7, -18, 38, 42, 2, -10, -24, -49, -8, -33, 34, 52, -21, 32, -25, 23, -33, -9, 42, 24, 4, -44, -7, 47, 6, -39, 39, -14, 32, 8, 2, 31, -17, -2, 48, -1, -2, 23, 71, -4, -32, -5, 34, 30, 3, 12, 24, -11, 58, 4, 20, -25, 13, 44, -3, -4, -7, 64, -7, -38, 19, 0, 31, -22, 9, 34, -4, -8, -44, 43, -11, -18, -14, 19, -9, 38, -11, -69, 74, 11, 55, 10, 0, 26, -47, 37, 10, 12, 10, -39, -19, -10, 9, -17, -1, -23, -15, 2, 12, 26, 12, -2, 34, 20, 9, -8, -45, 3, -7, -45, -42, 17, 0, 51, -36, 44, 13, 39, -22, -6, -9, 14, -4, 8, -9, 11, 18, 3, 13, 10, 26, -28, -19, 51, 38, 38, 53, 47, 27, 39, 36, -57, 44, -8, -59, -43, -55, -10, 5, 6, 22, 20, 2, 22, -18, 47, -2, 26, -17, 40, -46, 4, 26, 3, -14, 36, 18, 7, 7]
7583Gk9O4n8L6K3n6L4Rl9K7oo4M3L4JOk7j2J7j03M3Q2o3M2Ln2ROM3qn0O9m5L8
7617B4j2m9M9n7K7M1p5Q0m0rPl3R6m1N0l4j0j7l3P1k1l4M7Kk6N0r7L1L0N4j12
7648d1K0K0qj4j1M1lj0j2%j3N7m0N3o4J4J7k7K9m1K7L0k3j8L7Kl7L0K3o4R3k7
7680D0Oj01M9J9j5nO2k9Qo3j4j3M0M6r9Q3k6Nk3L2k2N5m2j1P0o0L4jL8m4K8l1
7712A6K5p9P3k6k0K7m5N8j0j0%k7J4K0q8P2j7lL2k9K3K2k7LM0ln2N9n1Ml5M5l4
7745b3%J9N1m6JooJ6qJ7J4j8l0J3M3L2l5o6NoM4l3J1MM1n2QM7Qn6L3n4K9K0Kl2
7781a3J3K4m7MK7Pj4j7J3L4o9J1K4l1L0jpJ8k0jOLK7J6l8NJp8J45o1k6M5m0qO6
7816D8l4j6m2O5j0m0J2L2m5K6L9n8M1L7n2jNm8N4J2j7lj7K6n4J5K5j7Rj5M8j5
$$ y = [7, -22, 42, -16, 20, 43, -13, 21, 30, -9, 18, 12, -52, -9, 25, 26, 32, 5, -7, 10, -93, -50, 32, -31, 11, 14, -38, -29, -23, 20, 12, -38, 31, -14, 24, 12, -37, 12, -45, -18, 23, -52, 28, -12, -21, -14, -47, 49, 8, 58, 24, 14, -3, -36, 35, 14, -20, 27, 29, 3, 53, -44, -13, 17, 71, -41, -21, -1, -9, -23, -34, 7, 4, -6, -18, -18, -31, 26, -14, 39, -25, -11, 6, -21, 8, -33, -6, 24, 1, -17, 20, 22, -15, 15, 38, -26, 67, 40, 46, -55, -6, 13, -2, -7, 55, 26, 34, -29, -43, -56, -16, 30, -69, 14, -12, -7, -30, 2, -20, 35, -7, -18, 52, -8, 26, 25, 63, 19, 47, 16, 41, -38, 35, 9, -11, 16, -29, 29, 19, 9, 9, -18, -4, 16, -72, 0, -17, -20, 12, -17, 6, 28, 1, 4, 44, 41, -11, 48, -3, 1, -34, 11, -23, -23, -4, 47, 1, 2, -4, -10, 6, -2, 15, 29, 11, -19, -6, 37, 69, 34, -32, -27, -33, 11, -22, -11, -7, 34, -18, -10, 37, 45, -11, 22, -32, -3, 17, 19, -13, 0, 24, -23, -19, 8, 15, 1, -16, -3, 31, -38, -27, -3, -34, -4, -5, -12, 6, -14, -15, -9, -6, 21, 37, -1, 4, 5, -73, 72, 11, -15, 30, -10, -18, 48, 14, -2, -44, 21, 11, -29, -17, 15, -30, -4, 35, -23, 18, 55, 3, 2, 7, -41, 13, 25, 8, 5, -12, 14, -40, -25, 0, -17, -8, -23, 25, 10]
7848A0nj6m5P5Kn0L8J1p2O7n4Q7l5m0jJ5L7pl2K9%o9O4J4Mm2j8M3mJ6L1m9l7J6
7882a7%L1k6M9m5jRl4M9L8l4m2K5kN3l0lj5nqPk1O1j0k7m1L3M7l7j1k8P4m1J0
7916HL3n7L3kNql4%J7M2o0LL7kj4LRj4k5O2Rk0Ol4j3k1J7k1N8n8M6lJ2l4L2L5
7952D7m4k7L9No2K2L3N1p1J3k2k0O1m8Mkj1QL4J5l9R%j3K3K5m0L2m2RJ0M8o9K3
7986AROn0LN8k5n5N0j4K1m3j7L6J7J7o5L1J0O6o2K8j2L2q2M9mk8j5L1K7k2k6K3
8019eRk3j2O9m8L5m7N7j8m0J0qK1OQj8ML4j4jl2QJ8l8k1Q7m1pK7%n7j8Q0Ok1o
8055Dj8L1j2O5p8k0P1l0m1L4J7m9n5Q6k2J3j0k3L6J1k8MM7j6m1J8O9l7jn9J18
8086H4q2k4QPJ9Ok6j7J1pOk1O0kp1R1l8PK2j7j7K2l2L3J9o4NJ7K0K0k9j7J2kN
$$ y = [10, 5, -11, -56, 19, 21, -29, 9, 20, -52, 15, -39, 48, 13, -27, -28, -13, 24, 17, -15, 14, 14, -55, 9, 23, 27, -15, -33, 10, 6, 22, 53, 4, -33, -17, -17, 14, -12, 37, -8, -9, 0, -34, 15, 53, 19, -23, 2, 0, 53, 23, 20, 5, 0, -8, -1, -22, 39, 29, 2, -39, -6, 41, 4, -7, -35, 39, -2, 8, 41, -16, 17, 15, 20, 12, -22, -22, -5, 37, -23, -20, 17, 15, 1, 4, 13, -1, -26, 36, 45, 25, 31, -3, -16, -37, -20, -41, 17, -41, 5, 2, 14, -20, 12, 47, 3, -24, 15, 20, -42, -20, 13, 64, -7, 6, -16, -36, 25, -23, -19, -21, -32, -24, 10, 25, -14, -5, -5, -18, 5, 30, -10, 22, -20, -11, -1, 47, -22, 1, 10, 16, -34, -31, 27, 2, -53, -3, -17, 4, -39, -56, -20, -3, 14, -51, -20, -10, 56, -6, 22, 10, 42, -40, 9, 5, -23, -38, -7, 20, -2, -28, -5, 4, -19, -31, 38, -10, 25, -22, 35, 17, -23, -13, -21, 0, 6, 14, -4, 0, 34, 20, 19, -13, -5, 13, -25, -46, 41, 0, -7, 20, 20, -37, -55, 25, 31, 10, 4, -14, 17, 5, 70, -8, -28, 43, 13, -28, 6, 23, -26, -81, 5, -17, -4, -14, -37, -1, 10, -18, -14, 33, 17, -24, -6, 63, 26, 25, -34, 84, 2, -22, -14, -7, 12, 18, -8, -25, -14, -21, -15, -36, 24, 22, -49, 42, 4, 11, 33, 16, -1, 21, -11, 22, 41, -23, -18, -1, 19, 39, 10, -7, 5, 3, 8]
8121HJ0l1Q3r1M7K0l8Qj9j6J4jl7O0o1O2K2m0m2L3K2Ok6j2RJ4LL3j3rj3J8q8N8
8155gPl8O4l1m3P3n5QN2jk6k4L7l0L1j1K2k8pQl6M3j6J7k1K1rM6l8M2n3j0l3Q1
8189C5m1J6
$$ y = [8, 18, -13, 70, -21, 26, 46, 8, 16, -3, -19, -5, -6, -43, 17, -44, 18, 40, 0, -42, -9, 13, 19, -7, -19, -10, 4, 7, 40, 27, 18, 5, 23, -65, -7, 0, -38, 26, -5, -48, 25, -30, -22, 30, 29, 3, -21, 16, -14, 17, 6, 28, 0, -7, 1, -35, 8, -8, 9, -12, 9, 0, 46, 8, 50, -3, -13, -46, 35, -6, 10]
8191A0
$$ Imaginary data points
##PAGE= N=2
##DATA TABLE= (X++(I..I)), XYDATA
0@%%%%%%%%%%%%%%%%%%%%%%%%%%%%JkMpQqQrJ2j5J8k3K8l1L3l8M2m7N4o0O8p4
50c8Q1r2J02j07J14j24J32j40J47j49J44j31J01l6r2L48r02K296o958M5922K46017
71B86635k41994l49237J38541K05536j37834j35377J48632Q8080j50647r3743
81b41408R8773Q6936R05q196k2049l2837M1644Q5972L5530J3540J0384o9004n2775
94e2585J37983J60845r8309j73594Q4741J61524r0857j33725J25487J22195j80170
105F3535j86490J28640J80209q6372j69322k401N1628l3944k3294M6386O456p9744
117a04713o3336L0490Q2289L6989n3890o4865K8860O6137j1810j6434Q9868N5429
129G5014j26199r8459J56120J82628q6122j61131O7461J39334n3386r1661R3617
$$ y = [0, 0, 0, 0, 0, 0, 0, 0, 0, 0, 0, 0, 0, 0, 0, 0, 0, 0, 0, 0, 0, 0, 0, 0, 0, 0, 0, 0, 0, 1, -1, 3, -4, 4, -4, 4, -5, 7, -8, 10, -13, 15, -16, 17, -21, 21, -26, 28, -32, 36, -38, 43, -49, 53, -54, 60, -64, 68, -72, 75, -74, 70, -61, 40, 4, -88, 260, -642, 1654, -5304, 40618, 286635, 44641, -304596, -166055, 39481, -98353, -233730, -85098, 2982, -147665, -241408, -142635, -55699, -54794, -62990, -85039, -117876, -76232, 9740, 45270, 58810, 69194, 190, -52585, 85398, 246243, 147934, -25660, 59081, 220605, 129748, -3977, 121510, 243705, 63535, -122955, 5685, 185894, 99522, -69800, -72201, -20573, -54517, -77811, -31425, -24969, -104713, -168049, -137559, -55270, -18281, -72171, -137036, -108176, -42039, -53849, -70283, 19585, 75014, -51185, -149644, 6476, 189104, 102982, -58149, 9312, 148646, 95260, 3599, 97216]
140I7216R5468j20195j38949Q0339J42698l4001j24979k0320M8832j3916m6578
151c4385J9411M6977l7990j03005k0720J00127O4278p6626r0926L3425O8297k6538
163e7675l2769P3970N4242r4364q4562J01481J38636l9099j12680K1423Q8555
174E7158j0369m4455N4737O7405o0157r7748L2930J11889J5575q7837m9667L0918
186B0379J6760l1426L23M5852j2632r4554l9698Q4432O8607o3870q4608K4881
198f5554N2849l1786l3899O2413M8574q2666q5432P0587J20555j3837r2025k47
210e0468O7975K840l6913L2747N9544l2049q1417J3183R8240L2124o8840m5488
222h522L2157J9601l4625j935N7536K283r4100n0092P9874P7146n4137q9262J4209
$$ y = [97216, 192684, 72489, -66460, 13879, 156577, 122576, -2403, -22723, 26109, 12193, -34385, -14974, 32003, -5987, -108992, -129712, -29585, 34693, -41933, -132859, -99434, -31137, -57675, -90444, -16474, 37768, -56596, -141158, -39677, 98959, 59860, -52820, -31397, 57158, 46789, 2334, 57071, 124476, 64319, -33429, -499, 111390, 126965, 39128, -10539, 20379, 37139, 5713, 6036, 51888, 39256, -55298, -94996, -10564, 58043, -5827, -90435, -65554, -12705, -44491, -78390, -15977, 32597, -50069, -135501, -64914, 55641, 41804, -50221, -50468, 17507, 20347, -16566, 16181, 75725, 43676, -37741, -24558, 73682, 105806, 36966, -8522, 23635, 43236, 8611, 6676, 64212, 66495, -27605, -77697, 2177, 79323, 25186, -64076, -49867]
235d9867N5476k1302m0378M2274N0331n7950q6026L4453J01572P967p4999k0810
247e9259M6421J1781k6552K2559N4731j7489p4865k904Q7584M4780n6228m9296
259a8737K9132K8731k9092j1453N2996K2414p1778n7609N5191P5994k7690p6948
271b8849n314L9848j0234k9907L0905M0374m4845p3807K0393Q3023J1070o4996
283c2339k4471L7334J0019k9361J4675N7944l613p4980k0368P9120N7839m3599
295B8200n5279K0928L6486j8080j4354M5315K9079n7154n9315L9064P1803j3003
307E3690o3676p099L4652q438l0473K5645M2897l6416p8150L131P7080K3774n7979
320b1362l4059L2294J7813k9549j335N0219J1345o3277l4673N9348O1745k4456
$$ y = [-49867, 5609, -15693, -56071, -13797, 36534, -21416, -107442, -72989, 28583, 36550, -38449, -59259, -12838, -1057, -27609, -5050, 49681, 32192, -42673, -45577, 42007, 86787, 30559, -18737, 10395, 39126, 10034, -1419, 51577, 73991, 2213, -55396, -205, 75789, 48099, -28849, -34163, 5685, -4549, -34456, -3551, 36823, -8022, -81829, -61436, 21587, 32657, -32339, -56810, -19476, -9457, -38818, -24143, 33801, 30188, -44792, -65160, 13960, 71799, 28200, -27079, -6151, 30335, 12255, -2099, 43216, 72295, 15141, -44174, -5110, 66693, 53690, -9986, -17085, 17567, 9129, -21344, 4301, 47198, 10782, -67368, -64237, 12843, 36617, -21362, -55421, -23127, -5314, -34863, -36198, 14021, 25366, -37911, -72584, -13236, 48509, 24053]
332B4053n0472R301L2988r118j2066L9383L2233m4974n7325K7935O9049j305n7384
345B298j2519L2651k514l1106J6237M5220k0590p5086j3266O6989L4305m7359
357d740m1380K1458J9848k5773q517M2703J6893n3836l9888M5623N9898j4100
369A8189m5149M425K8748q578j5092L4352L7212l3553n5973J8522O6629J0094
381E9826m8999j7200K8977K444k9768Q894M4283p411o6569k3102N6982M0690l7034
394A2013m4040J3177K1121k1604j4666L5582K2515m5474m6241L0652N7583m955
406A5663m3681l035K6814m452j6486K8034L9169k4183n6226P781O2253J7499m2522
419F628j8552K9503Q731k9592K019M5850N940n9772l3449M6749M8186k4270m5082
$$ y = [24053, -26419, -17118, 15870, 6752, -5314, 34069, 66302, 21328, -35997, -8062, 60987, 59682, 2298, -10221, 22430, 19916, -11190, 5047, 50267, 29677, -45409, -58675, 8314, 42619, -4740, -46120, -24662, -4814, -30587, -39104, 3599, 20492, -33344, -73232, -27609, 32289, 18189, -26960, -22535, 6213, -2365, -17457, 16895, 54107, 20554, -35419, -16897, 49732, 59826, 10827, -6373, 22604, 25048, -4720, 4174, 48457, 41046, -25523, -48625, 8357, 49047, 12013, -32027, -18850, 2271, -19333, -33999, 1583, 24098, -21376, -67617, -36965, 20618, 15663, -28018, -31053, -4239, -8691, -25177, 2857, 42026, 17843, -38383, -30602, 31651, 49150, 6628, -11924, 17579, 26310, -3282, -1263, 44587, 50527, -9245, -42694, 4055, 52241, 27971, -17111]
432a7111M360K1713j4219j7506K5161K3886l3445m4678J7131M8650J476l6778
444b1360p547J9970n941j7976K4807M1359j7135n6673j355O0587K6291l9664k6269
457b0906K7131J7768k6626r928M0720K0903m6164m1657L1709N1732q316m1427
469e061m566J8883q662j5771K0985K4581k7872m4763J2046M7697L754l7123q141
482b4013K3734m209k7193J4159M6033l609n6212j7221N1891L7587k8504l4036
494b1593J4490K0906j5550j2375K8352K1737l2234l7505J9902M3118j902l2020
506d674m491J5037r071j5100K3326L1236k2313m9109M005N0186J2519l8739j7103
519b4291K5136P479k6135O66M1279J0495m6962k9266L5927L9666j6427l3162N684
$$ y = [-17111, -12751, 8962, -5257, -22763, 2398, 26284, -7161, -51839, -34708, 13942, 15418, -21360, -28907, -8937, -14878, -32854, -8047, 33312, 16177, -40496, -41851, 18736, 45027, 5363, -20906, 6225, 23993, -2633, -12561, 28159, 49062, 2898, -38759, -7050, 44682, 36366, -5061, -9627, 9256, 594, -15177, 5808, 30389, 2517, -42246, -30200, 17497, 21251, -15872, -24013, -279, -4488, -31681, -17522, 28511, 24902, -31310, -48531, 3360, 40947, 12443, -21593, -7103, 13803, -1747, -14122, 14230, 35967, 3733, -33772, -13870, 29248, 27346, -4674, -9165, 5872, -3199, -18299, 5027, 36263, 13950, -35159, -31154, 19032, 31551, -7188, -24291, 845, 8324, -17811, -17145, 24134, 34629, -12333, -41599, -5672, 33994, 17567, -15595, -9911]
532i911J7857j1954j1979K4947K1600k8968l8407J5918M2586o7l1854m175J9006
545D599o853k1012J6892L6873j0628m8603p028M6040K3245l0127k3254J7964J2819
558A0927j8962m837L2601J5663l6426l2128K4949L9163p400l0399J6J6749q622
571A294j4828J8877K4042k1637m0305N911M0357P645k9336r478J7894j410k1137
584b2111Q665L4878k086m4438j4929L8871K7762k2243k3896J4090J4830j6082
596f689q302K8688J9890k9149l3189J8157L8764j072k7296k597J4706o712j4738
609i539J5954K5383j6236l9347L25L7066J0979k7863j3655J6302K004k1956J601
622a8982L3205P075l9295k3900L0113L2703j4345k7180O574J7389r552j1811K1693
$$ y = [-9911, 7946, -4008, -15987, 8960, 30560, 1592, -36815, -20897, 21689, 21622, -10232, -14407, 4599, -2254, -23266, -6374, 30499, 19871, -28732, -35760, 10280, 33525, 3398, -19856, -1892, 10927, -8035, -12872, 19729, 35392, -1034, -33162, -8213, 30950, 23550, -6849, -6833, 9916, 1294, -13534, 5343, 29385, 7748, -32557, -26646, 13711, 21356, -7980, -17458, 436, -974, -22111, -13446, 21432, 19346, -25092, -40021, -1150, 26612, 4369, -19527, -5437, 9393, -6689, -14991, 13697, 33587, 4438, -28751, -10594, 28170, 27098, -198, -2795, 11911, 5199, -9539, 6415, 31798, 15562, -23785, -23460, 13606, 24585, -3278, -16933, -631, 1373, -20583, -18982, 14223, 21298, -17997, -41897, -11784, 20919, 6574, -20606, -14032, 3357, -6195, -18006, 3687]
635C687K3203j9644l2701R753L6188N622k3164m824J4254l695j5495J1376K6750
648C1310q372l7862p404L3427J7487k2171j7991J1337N751j8237m290K6283J0867
661B0135l0907k5975K0048L0510p068k3578K093J3500p984j0952J8745K2918j5871
674E614l2091N575L4179Q989k1076o770J5090L45j6055O043K7066J90l3666j4115
688b0682K7501K1660j5970j8986P553P414j4925o962K2363J3703k5941k7652J4175
701a6749K9318l419k2963l84J3418o890j3972J3812K4680r091l1829j762L1315
714E484J4363j7418j1194J0985L882j3006J864K3876N949k6563j6234K0844K2395
727B5227r803j7956M212P413j1822q001J8933J6362j9684k8046P748K7252J115
$$ y = [3687, 26890, 7246, -25455, -15702, 20486, 26108, 2944, -1880, 12374, 8679, -6816, 4560, 31310, 22938, -14924, -22328, 11099, 28586, 6415, -11576, -239, 5512, -12725, -17015, 9268, 20135, -10772, -36747, -16699, 13811, 6743, -16835, -14742, -1242, -9226, -20178, -1433, 21485, 5614, -26477, -20902, 13277, 22266, 1190, -5580, 9510, 9855, -6200, -157, 26909, 27099, -6567, -20682, 6819, 28479, 12509, -6477, 1076, 8490, -6435, -13397, 8966, 22669, -3272, -30924, -16749, 12569, 9150, -13813, -14197, -779, -7669, -21641, -7829, 16851, 7760, -24069, -25831, 5484, 19847, 2429, -8765, 2220, 6102, -6904, -5040, 18836, 24785, -1778, -18012, 2832, 25227, 15424, -2532, 1680, 9093, -2729, -10730, 8203, 24565, 4881, -23165, -15417, 11835, 12950]
740A2950k0806m302J1752l796j4096Q617K2834l970k8939p503K5354J6116j3360
753H51j1695Q726M750j1467j54K1910Q758k3020j7614J7203K2779o015j6277L538
767B273Q731j0152r276J6527J8585j4839k8371K549K5634M839j8962p179J0163
780E22j050j3788L768K0952N81k5958j2255J9336J7232r312j2457N848N460r342
794a0463j929J9164J1188j8364j8233J2826K2179k421j4608K576R852p671j1136
807g040J3389K0397r507k7815k679K3763R118j6306r597Q138R53j2626k51J7693
821G630L656k2107j4160J4539J6515n890j1276L660M108r535l147J7845J2666
834A4504j5539j9107R758K2449L99j4317R78J1112m506j2247Q913K1211l019k5256
$$ y = [12950, -7856, -12158, -406, -4202, -18298, -9681, 13153, 9183, -19756, -27259, -1905, 14211, 851, -10844, -2118, 2632, -8835, -8989, 12921, 21679, -1341, -18955, -1752, 21027, 15012, -1265, 2273, 11004, 852, -8424, 8103, 26688, 11849, -16522, -13973, 11661, 16500, -2462, -9641, 522, -528, -14316, -10548, 10404, 10985, -14973, -27228, -7892, 9340, 28, -12429, -6581, -1121, -10463, -12392, 6772, 17960, -404, -18637, -5811, 16368, 13947, -661, 1915, 11767, 4096, -7040, 6349, 26746, 17239, -10576, -13255, 10508, 19626, 3320, -6277, 1861, 2814, -9812, -10063, 7630, 11286, -10821, -24981, -10442, 6073, 183, -11093, -7433, -3325, -12860, -16007, 1838, 14504, -1035, -20142, -10384, 12065, 12464, -1853, -875, 10237, 5731, -6516, 2397, 23608, 20589, -4667]
848d667p461J9721J2549j1514j0719N555K442j0468j745J4934N058j8816j5135
861b0266J0861J4862n023j0554L566M274j0443o519J6121J5384j3043k1882N351
874a7311K3127M205j4316k241J1693o76j1666M523K0243K771k0867j0021J5681
887E145J4122o738r721L390K312q906k070J3948O267j6559j5518Q172J4276m492
901C628j1394K461N394r886j0348J1884J7356q270k2955o06K1046Q283j2039n561
915a1007R818K426r908J660J7617N767j6333j0564J2516J4183l726p368L786K244
929A1111r228l145J4343Q727j5275j7092O871J5732k756j3266M66P235p876j3114
943a7267O957J7772l265k1920n983J7302J0363r418p183O733L199q051J13J5294
$$ y = [-4667, -12128, 7593, 20142, 8628, -2091, 3464, 5906, -4562, -6307, 8627, 13685, -5131, -20266, -9405, 5457, 434, -10120, -6554, -2280, -12723, -19242, -3121, 12263, -780, -22662, -17311, 5816, 10021, -4295, -6536, 5157, 4481, -7185, -2662, 17581, 20352, -515, -10536, 5145, 19267, 12529, 2808, 6198, 8510, -396, -2466, 11482, 17749, 1190, -14328, -6156, 8120, 3628, -7766, -5305, 89, -9797, -20145, -8261, 9095, 825, -22130, -22736, -1690, 6593, -5446, -11007, -1189, 1237, -8671, -7011, 10606, 16373, 40, -10524, 1992, 16175, 12449, 5081, 8867, 11111, 1883, -1262, 13081, 21808, 6533, -10559, -3688, 12044, 9288, -3978, -3512, 3723, -4153, -17267, -10310, 7462, 4197, -17723, -23706, -6404, 3959, -5459, -12642, -5909, -2710, -10761, -10648, 4646]
957D646P063j3005j0593R674J3568k159o565M153L797q297m734J3097J2307j1158
971A1794j8359L225J6511R47j3151k460P794m062j3286K606J6384N28j9630r390
985b0549J3222J0869p283p754M559K531p954j380J3926Q033j1797j1450Q363J3428
999F764j469p091M110N927p110o832J1203J5026o427j8308l95J6244M706j1315
1013E033m454P274p89j1721o05J4103L445j6221j1283Q658J0526m685p631K718
1027e632K200p631l057J1791Q785j0196j3005N547J3665J21p746K543P525m568
1041C42q662P734J6169j732j7056l807J4791Q028q616n518O126J120r767j932
1055b780J2464N185j3396j1679O508R692l784p552K124K679p584n352R739J0221
$$ y = [4646, 11709, -1296, -11889, -2215, 11353, 9194, 2629, 6782, 10579, 2282, -2452, 10645, 22952, 11794, -6565, -3340, 13171, 14118, 967, -1493, 6301, 2239, -11047, -8441, 7943, 8471, -11159, -20549, -7327, 3542, -3741, -11495, -6936, -4405, -12359, -13739, 187, 8220, -3577, -15027, -6664, 6764, 5295, -1796, 2314, 8241, 1131, -5701, 5502, 20528, 14101, -4207, -4602, 11642, 16348, 5033, 579, 7853, 7064, -4657, -5262, 8841, 12286, -3935, -15218, -6560, 3966, -719, -8350, -5632, -3432, -11063, -14120, -2329, 6456, -3740, -16745, -11198, 2467, 2588, -5158, -2615, 4910, 342, -8320, -586, 15583, 13851, -3205, -7012, 7779, 15807, 7191, 1673, 7799, 8919, -848, -2780, 9684, 14869, 1473, -10206, -3698, 5994, 2210, -5342, -3218, -539, -8123, -13475, -3736, 6485]
1069F485p869j4533K067J3434K254q225j74P634j679q724L872J5132K073j4374
1083b627o127J1857R446n493n274N006J954q217k395J1222O340j1251j1753N062
1097b250J0070k487p811J410L671o548p385P023J0996m903j4486j439J1837M341
1111B039p382k257O349k38q103J398J3128M109j1859p361R225R598l433n051M263
1126D425L085o771l535R759Q137q063j2141K500J0492O2p477k32M302m214p739
1141g410L882J0678k040j3446m039R647N336o046l336M897R3p879k80J1618M971
1156F646j0312q128P505R649k433n140L680M020n582m628Q136R765m863j1543
1170c228M70R989K388o425j393M013k429p161J905R546J49j1596n618P315N483
$$ y = [6485, -1384, -15917, -13850, -416, 1838, -6387, -6561, 1073, -606, -9330, -5458, 9674, 11747, -2627, -8754, 3103, 12549, 7056, 1782, 6788, 8742, 525, -1870, 9352, 15692, 4441, -7312, -2250, 7820, 5333, -2478, -1068, 2603, -3945, -11330, -4307, 6689, 1786, -12700, -14139, -2302, 2039, -5343, -7600, -1251, -1489, -9592, -8194, 4934, 9043, -2816, -10177, -952, 8646, 5213, 162, 4425, 7510, 739, -2796, 6963, 15100, 7037, -5104, -2604, 7888, 7950, 473, 241, 4543, 329, -7410, -3528, 7150, 5110, -8336, -12375, -2728, 2608, -3438, -6774, -1877, -1784, -9663, -9943, 1675, 6646, -3666, -11794, -4289, 5360, 2927, -2213, 1467, 5487, -95, -4723, 3413, 13178, 8315, -3228, -2758, 7231, 9619, 3194, 1801, 5814, 3385, -3776, -1871, 7675, 7824, -3772, -9390, -2075, 3408]
1185C408m817l926L525M61p437j844R895N795q681r054N215R764r09n581K355
1200a831M833l637n215N914J0037j951j0322j284Q827L860m502j845L393j480
1214D797o342J017Q730J213j0057n936N908N245m470m104L324J066p235l482Q397
1229a929P124o882r900K581R133Q33n485L93M632j826m913L653Q940L75q514k651
1245d436O873M475k903j497K860q37n680N08Q507K483r014o525N256N904l527
1260B447m778K849K344o192m947O098P785m333j0055q0P956K212m629j080L247
1275a156j014m424K149P739J033o923l009N484M174k192j116L325k04n566m00
1290b100Q356M157p529p159L937O668j859n098J602L280m168n501L742P403j972
$$ y = [3408, -1409, -5335, -1810, -1349, -8786, -10630, -735, 5060, -3621, -12675, -7460, 2304, 1395, -4186, -1831, 3002, -635, -5850, 64, 10101, 8150, -2172, -3456, 5371, 9231, 4729, 2884, 6277, 4797, -1545, -528, 8202, 9415, -642, -6578, -670, 4575, 105, -3999, -675, 391, -6844, -10326, -1929, 5195, -1687, -11587, -9006, 127, 960, -4525, -4132, 500, -1326, -6239, -2586, 6354, 6729, -1785, -4436, 2437, 6912, 4009, 2512, 5372, 4535, -1145, -637, 7870, 10353, 1339, -5186, 70, 5974, 2447, -2331, 518, 2862, -3330, -8277, -2179, 5606, 1273, -8782, -8862, -906, 1306, -3323, -4403, -1156, -2170, -6594, -4445, 3294, 4327, -2596, -5605, -121, 4053, 1861, 745, 4070, 3866, -1700, -2100, 6256, 10413, 2884, -4275, -338, 6330, 4471, -627, 975, 4255, 87, -5414, -1672, 5731, 3759]
1305C759q913k352N910L033l277j583K045j005l979J395O831J188o451l163M865
1320a697M094k248j337L886Q02n581j827P736N690n788p721K524O948l34m754
1335C93L76L305k431n155K030O607k88p253l141M161K900k195j195J578j258m098
1351e664R26O420J704o147l897M435M303k065k194L450J998m815l224N861O533
1366G624l499p698K74O418J555l762p17K628j276m150J031N540M95n797k844L376
1382h02K452j808p56K096j133m802J38O436K765n768m833L561N021j685l098K448
1398B32K824l522m163L886O493j483o921j315N040K409k640j058J906r78l519
1413b809R22N106Q05n202k672L194K403j798r12K501j93m743j246N897L893m588
$$ y = [3759, -5154, -7506, -1596, 1437, -1840, -3423, -1378, -2383, -6362, -4967, 1864, 3052, -3399, -6562, -1697, 2397, 149, -1188, 2698, 3500, -2081, -3908, 3828, 9518, 3730, -3991, -1467, 5481, 5147, 393, 769, 4074, 1643, -3512, -1482, 5125, 4837, -2416, -5557, -1396, 1504, -691, -1886, -308, -1566, -5664, -4738, 1682, 3386, -2761, -6658, -2223, 2080, 15, -2179, 1271, 3269, -1546, -4770, 1091, 7624, 4125, -3573, -3299, 3119, 4674, 912, 195, 2823, 1547, -2603, -1572, 3968, 4463, -1334, -4178, -802, 1650, -158, -914, 1182, 49, -4753, -4615, 1821, 4586, -1182, -6015, -2454, 2567, 882, -2216, 232, 3056, -466, -4629, -743, 5750, 4267, -2654, -3969, 1071, 3480, 840, -218, 1688, 710, -2809, -1887, 3219, 4024, -1178, -3850, -656, 1747, -51, -963, 1538, 1345, -3398, -4644, 1253, 5146, 558]
1429E58n561K158N227m51l405J286K793k338m004K323N695j89n738j797L756K140
1445B453j892o65J666j117l551P06N040J285m762l057K980K848j852j464K374
1460I92Q06m041k361M535M714k943n651N25M770Q20k890J36K458j196l557J318
1476a565N033O45m845k252L261J986j642n85J847o10l858k17M976K215m489l743
1492c843K405L385j526k188J861J689l354k944L217M830j575n313k84L933J167
1507A460k168J2K032q94l083J052M657R37m136k206K603K134j407q39J880j6l429
1524a411j206M047K935l161m325J049L429l85k283P68J698k198k945J969M344
1539B325m33m517j112L239J553j834j76K191n32l190L15M558J678l778k705K409
$$ y = [558, -5003, -2845, 2382, 1931, -1474, -188, 2605, 267, -3737, -1414, 4281, 4092, -1646, -3443, 313, 2453, 561, -104, 1562, 445, -3106, -2400, 2640, 3925, -837, -3894, -914, 1934, 82, -1382, 992, 1798, -2243, -4604, -69, 4645, 1702, -3949, -3424, 1346, 2166, -724, -588, 1870, 674, -2883, -1565, 3468, 4113, -732, -2984, 277, 2263, 621, 36, 1883, 1273, -2585, -2802, 2174, 4389, -100, -3843, -1438, 1947, 421, -1767, 94, 1783, -1571, -4515, -1298, 3532, 1957, -3356, -3640, 293, 1460, -708, -696, 1336, 442, -2641, -1589, 3068, 4005, -131, -2337, 266, 2400, 993, 154, 2034, 2018, -1411, -2617, 1430, 4365, 1204, -3121, -2072, 1357, 972, -1311, -543, 1155, -1043, -3988, -2019, 2325, 1892, -2625, -3737, -498, 1055, -779, -955, 1236, 704, -2486, -2171, 2387, 4065, 287, -2418, -9]
1555iK560j265j331J681Q24l012j903L177L354k174m276L07K997J22j873L96J537
1572A112j652k901J476M000m8l999j473K790J559j621l87K109j57k934m93L888
1588A269K319l011l107J507K751l32j541R95J186k033k005K152L163j066l628
1603a381l55K572M77j601L46J538j379k968Q49L921N32l883j863K484J771j524
1619d64j061J780N62k641j248K978K800k010l225N94K610L54j141N71J023j391
1635I1j733J620K963n12l106m52K236O01j570K33J719r96l004m3L567J242l316
1652d60k486J686K187r97j403R62R61j970j571J928K697r35k631j08K021O06p19
1669b32O05Q91j241j643J566K943k70k852o83K163P99j549k90J769j92k865q32
$$ y = [-9, 2551, 1286, -45, 1636, 2460, -552, -2455, 722, 4076, 1902, -2374, -2067, 930, 1052, -821, -425, 1112, -540, -3441, -1965, 2035, 1987, -2012, -3485, -695, 864, -757, -1144, 965, 808, -2126, -2619, 1269, 3588, 577, -2530, -1023, 1728, 1396, -145, 850, 2036, 3, -2002, 150, 3313, 2247, -1381, -1736, 836, 1313, -288, 58, 1596, 217, -2751, -1902, 2019, 2551, -1332, -3195, -711, 1060, -464, -1525, 255, 817, -1824, -3072, -94, 2706, 696, -2529, -1935, 675, 1029, -112, 459, 1482, 91, -1642, -22, 2941, 2429, -677, -1129, 1107, 1708, 138, 371, 2090, 1094, -1910, -1953, 1614, 2856, -460, -2946, -1260, 927, -70, -1473, -511, 450, -1520, -3091, -1163, 1534, 599, -2032, -2140, -119, 487, -232, 373, 1264, 23, -1620, -54, 2889, 2619, -233, -916, 1247, 2046, 497, 207, 1976, 1784, -1081, -1913]
1686a913L003J852k433k898P90K194k36j444K60Q68j155j404J049K228l53k167
1702a759l09J466N42m90O22J049j138j836J135L035L50k740j152K151J333j374
1718H85q45J516N68k267j386K132K213j362k712m3J686L62j005r0M11j042j035
1735b014R14J757m50j949k22J228K50p27O30J280q53k100O00L009R53k326j623
1752a643J628J869p38j112R77R37j289j394J200K089m83k092n73J111N24n00o0
1769D51J26j139j045Q19J652m75j986l53J302K13j120K35J386k20k082k49K594
1786A09J670j718j883R30J883R2r67L88R47p44r45P91J610j25j507m95P22K62
1804A020l11L05K91j164j432P10J808l05k134p58J267O03j163m16J291L07j668
$$ y = [-1913, 1090, 2942, 509, -2389, -1599, 595, 359, -1085, -825, 43, -1112, -2516, -1467, 761, 408, -1759, -2068, -602, -60, -550, 72, 1121, -17, -1853, -718, 2317, 2667, -73, -1225, 926, 2259, 885, 40, 1556, 2124, -143, -1529, 603, 2816, 1454, -1258, -1301, 385, 747, -258, -348, 63, -979, -2014, -1100, 657, 207, -1742, -1964, -736, -486, -1213, -583, 697, -156, -2256, -1656, 1353, 2306, -20, -1643, -15, 1854, 1116, 4, 981, 1918, 629, -765, 435, 2524, 2041, -51, -624, 487, 1011, 511, 451, 577, -562, -1607, -788, 864, 389, -1597, -1950, -648, -435, -1555, -1320, 66, -154, -2236, -2485, 109, 1779, 61, -1822, -892, 991, 1083, 116, 504, 1451, 707, -238, 553, 2163, 2038, 531, 36, 758, 1020, 709, 1014, 1305, 141, -1291, -581, 1227, 922, -1212, -1970, -703, -100, -1263, -1679, -388, -81, -1749]
1821a749q20J704J926q68j834K40J545M92n32K49M45m73o48Q11J252j28j171k38
1839B03P59om56M19O79r11j628K74J908K50j933j191R60R12p61p49P77O09j183
1858a068j016J048J561k39j481k15J079M90k27K70L26n84o11P34J237k03j152
1875e1j77R02J71n69K32Q77m04j484k26J648Q01j334j466N41J090l96o87L00N01
1894B69q38q42O57J231k42j167k21O76K87j61L28L23o84p54O24J331O2j270l48
1913g39J001M05o22OQ92J42j223m98J308R34p92j294K28P86m9m20J64J42o01q07
1933a037N53R66k63j028j35N89P7k84K29N57n15q71K84J325L74j061o22P81O04
1952E23l60j77O20L10q46n75R00R74n38r90M7M99Ml34J77L14o73p76M15J033j84
$$ y = [-1749, -2569, -865, 1061, 193, -1641, -1401, 144, 636, 104, 353, 798, 325, -323, 488, 1740, 1612, 441, 203, 962, 956, 500, 919, 1598, 687, -941, -667, 1241, 1491, -442, -1633, -673, 239, -522, -1271, -494, 115, -1068, -2084, -1036, 525, 286, -1195, -1410, -331, 159, -68, 202, 528, -56, -667, 67, 1304, 1101, -51, -228, 674, 845, 276, 508, 1385, 981, -503, -729, 919, 1720, 386, -1080, -539, 551, 155, -532, -232, 269, -569, -1411, -754, 477, 235, -932, -1153, -477, -190, -351, -23, 300, -384, -1138, -514, 817, 879, -391, -739, 262, 667, 45, 51, 943, 1085, -138, -636, 672, 1606, 814, -480, -252, 534, 485, 65, 229, 371, -230, -1037, -484, 482, 219, -809, -944, -355, -278, -562, -333, 224, -291, -1162, -878, 447, 821, -240, -862, -81, 523, 163, -14, 606, 916, 70, -505, 395, 1369, 831, -159, -112, 387, 391, 57, 234, 548, -125, -901, -486, 547, 363]
1973C63j043k37O21K84m43J01N81j12q81j18R82O82p17p54L90O61j62k09M02J48
1993E39n57n02P07P99m03q03P1N00p2l59K36L67n38q36L54R91J20q82m78N64L24
2014A42k16j86L99No25k58P85O25m72o50J07M27j10j01L70J50o25m15N92Q46l27
2035D63q62L1O24Q5m86J51M95k05p20RQ13M00o14o78K75M37o3k12J61L8n07j90
2057e55N70L55l47m85J42K59j80r4M16K57n73o75O61R10j43q46j69O74K90l68
2077I9o3M10R7n72k24N42M75l88n86rK88K3k2J39j19m65j40M78L61l94n26J55
2099d41M15j47k95M10M08l16p43K56Q62K21p54l81M61N05j66k54J65J70k47l18
2119a89L90L25j84l79j5O6m3K1K62l0o05k75N78M66l53n53P5N34o7l99J07N88
$$ y = [363, -680, -917, -296, -12, -455, -354, 227, 115, -766, -884, 98, 780, 63, -691, -301, 360, 198, -11, 391, 539, -18, -520, 187, 986, 583, -220, -149, 351, 279, -80, 156, 523, -15, -851, -497, 494, 614, -268, -746, -182, 142, -74, -260, 139, 144, -481, -739, 46, 671, 199, -451, -344, 83, -27, -128, 242, 392, -233, -648, -56, 790, 463, -399, -368, 256, 341, -145, 6, 501, 296, -424, -415, 398, 798, 184, -494, -219, 218, 155, -57, 104, 142, -365, -555, 15, 370, 23, -462, -320, -61, -241, -335, 81, 338, -235, -910, -249, 661, 518, -328, -497, 177, 467, 99, 36, 446, 543, -29, -253, 289, 764, 376, -210, -219, 69, 92, 70, 209, 90, -375, -515, -37, 324, -70, -596, -441, -26, -173, -468, -58, 350, 34, -709, -453, 409, 630, -124, -505, -44, 461, 295, 41, 206, 376, 129, -189, 201, 526, 342, -37, -52, 14, -29, -8, 254, 224, -381, -656, -78, 388, 35, -518, -443, 91, 24, -375, -268, 320]
2141C20r9o68p9O81M35m99n15J68M60R8k23rJ4j26m7J95K12j27k37R7Oj06J2L51
2165C14M0n49m17M80O63k09o80k8N24J39l62k07M13J30m06k91L49M21j32m35j12
2186c55K08K05M4m6q2j52rL62J91k65k21J05K40j97j78L55L67m22o08J87P34J7
2208D80o46k92L69L70k51k14Q5K23k26j87L8K45P8j78j46M5Q0J24K23j53l49K1
2230b61M12L51k99l67J93L46j46l09J22M15j60n28j65O10K34l84m09P6L31J7j53
2251g4j03NOn8O3J53m8r8O4j8m3J33J90P5l68j21L07M10j42m47qM27L4k66r1K84
2277B66M0l72k34K85K81j61k96p5J48J8O0m0j20n0R5J74K2n8j18J18N7j26m5K85
2301A54K05l01k68J67M17pm38j19K59J81k23l1L8J01p1j95R5J73m0k29o%K2J37
$$ y = [320, 221, -447, -526, 155, 590, 91, -424, -256, 204, 302, 79, 70, 84, -42, -89, 106, 318, 191, -46, 51, 57, -49, -37, 314, 354, -195, -612, -132, 531, 322, -358, -386, 138, 277, -85, -292, 121, 251, -155, -446, -97, 324, 192, -243, -355, -147, 58, 102, 56, -26, -178, -187, 175, 366, 101, -120, -15, 225, 28, -150, 205, 572, 150, -458, -271, 463, 480, -166, -458, -89, 281, 30, -184, -99, 124, -102, -289, -251, -6, 72, -106, -252, -207, -127, -3, 220, 67, -282, -261, 151, 502, 203, -164, 29, 375, 229, -80, 42, 457, 297, -231, -396, 214, 448, 64, -345, -269, 62, 79, -74, -177, -172, -166, -224, -161, -8, -56, -154, -90, -108, -151, -18, 172, 247, -121, -242, 65, 475, 333, -114, -122, 305, 339, 73, -18, 266, 306, -66, -300, -15, 266, 105, -191, -266, -118, -100, -40, -80, -200, -250, -155, 19, 41, -17, -135, -17, 40, -86, -131, 154, 359, 58, -210, -43, 374, 367, -71, -190, 69, 250, 27, -4, 34, 135, 64, -131, -36, 137, 97, -132, -138, -138, -116, 21]
2325B1N8o4j93l5K59J47j53k12O4K12m7j89R0J74o1l04j0L42Q6j93j80M7K29J6
2349A04k8k3o2k7RJ9J21nj01K2j5j6k1J59N0k07j43J02K59p0k59r9J51J41j86
2374a25m4R9Oj17o7J99J41j21j24N8O8R8kO3M7k53J00J17K1m6q9K8Q7n2j05J02
2400H9Q5q2k31J0J79L8j21j42L6N6O7j31LM9o6%J33P8q2j7L4kj1R5J12l8j15o5
2428c9J68J62j44j76j7J45O4j22%M9k0j29r5J14M5m1q8K1L3M8%K0o9l5lJ95K7
2455A13j26q0J06N8j30j2J18N3r3q0qK07j4j23j01O0J22L3j20l7O0QRk6Q6n4l6
2482gO3k1o5P5N0m6j35j7P3J69j91p4O3Q3J5j35K7L4k6n0o2J42J36q3j13j5J15
2509EJ01nl2o7qJ38O5o3p0L0N4j7j47lJ46k3j92k7P4J69j77j41l3M8J71j25p5
$$ y = [21, 79, 15, -178, -213, 46, 193, 40, -172, -108, 104, 57, -132, -42, 132, 71, -233, -243, 99, 185, -8, -188, -141, 88, 104, 76, 53, -9, -36, -27, -8, 113, 108, 7, 29, 14, -2, -23, 136, 186, -21, -164, -62, 197, 127, -132, -231, -80, 61, -125, -169, -70, -64, -181, -248, -49, 92, -29, -153, -95, -27, 71, 69, 132, 179, -74, 26, 143, 164, 118, 29, 57, 144, 92, -13, 89, 174, 92, -139, -129, 50, 88, -33, -175, -139, -83, -16, -147, -144, -95, -161, -161, -28, 50, -32, -49, -15, -17, -28, 67, 179, 141, 26, -39, 129, 291, 147, -29, -46, 99, 163, 41, 41, 90, 70, -59, -154, -40, 5, -36, -124, -103, -70, -22, -22, -2, -71, -106, -109, 86, 113, -13, -93, 13, 71, -59, -71, 47, 100, 7, -73, -81, 126, 112, -11, -112, -52, 70, 103, -17, -54, 6, 14, 23, -3, 83, 29, -7, 56, 35, -30, 45, 95, 49, -86, -103, -30, 139, -52, -126, -63, 20, 35, -100, -73, -39, -65, -115, -177, -35, 101, 18, -95, -110, 5, 106, 101, 69, 2, -6, 132, 197, 134, 64, 94, 148, 131, -16, -19, 127, 104, -88, -115, -41, 128, -49, -190, -223, -175, -4, -129, -204]
2536b04J7Q9J01j54J5J66M4m8o3L0O8J13m4o9j0M5J20k1j41pQ6j4p3j06L8J42
2562A20j21j25j3R8J27k03j39R9Q6J5l6o7N7L9L5m0L0L5K7M8j06KJ22P6n9j11
2588dM3M7J09j76r7N2J49p4n7OO7j6j38L8n6J67n2j11k0O0R0m2j13j4R4N5l5n7
2616h5K5JR9p4l2L4J14Pj38j4O7J26l4j37m1J56N5r2k7l2J01P6j04l2O2N2p5j00
2644d2k4M3O5n4j36j5R4O9l7j36j8J39po4KQ2M7o4l8QJ24Q8p0n5N0O5O6r4o4L6
2674F0R0J8j14rNN9q6q2jO2L6j29n6L8O0K7j24r8J37M1mj4nJ8J09j09L6LJ33j4
2704H7m3o8R9J32o5r9n5R7M8n0p2l3J04m8k4m5J3qon8K3o3J48J2o2p4O4N4n0o0
2734a02M5N5J3jm3K9R3n9k5j7M1N8o4n8L4K6N2o5m2M0M9l6j9l0mM3J3jq1O4M8
$$ y = [-204, -187, -98, 3, -151, -136, 30, 74, 26, -37, -7, 61, 174, 130, 61, 51, 96, 216, 195, 54, 47, 133, 119, 46, -60, -22, 120, -1, -126, -139, -41, 86, -117, -256, -157, -71, -56, -92, -159, -102, -63, -28, -68, -38, -3, 24, 72, -34, -32, 90, 166, 107, -4, 39, 86, 195, 19, -78, -26, 123, 49, -8, -2, 65, 49, -89, -51, -107, 60, 8, -103, -123, -63, 27, -15, -128, -142, -48, 7, -28, -85, -60, -59, 40, -34, -66, -32, 82, 89, -49, -63, 4, 130, 96, -41, -82, 74, 129, 37, 10, -22, 79, 155, 51, 19, 81, 133, 58, -42, -66, -23, 42, -12, -148, -163, -69, 0, -37, -173, -191, -52, -59, -123, -121, -39, 8, -56, -94, -86, 38, 126, 56, 1, 51, 116, 182, 88, 24, 60, 150, 168, 54, 45, 50, 109, 23, -59, -60, 2, 38, -91, -147, -109, -49, -22, -146, -244, -107, -66, -70, -84, -89, -71, 38, -71, -35, -32, 101, 87, 44, -24, 75, 207, 142, 43, -12, 85, 133, 83, 11, -22, 82, 34, 10, -35, -22, -30, -36, -94, -71, -134, 14, 26, -36, -110, -46, 8, -42, -102, -57, -2, 11, 10, -33, -4, 89, 30, 5, -12, 29, 87, 23, -35, -1, 25, 77, 12, -30, 10, 59, 23, 4, -26, -30, 13, 26, 25, -56, 8, 56]
2765E6k9p6J1J2J18j04p5oR3N4j17K5N6Mj1j29M6P4K8l9l1P5k6K4j5J0j3N5K3
2794I3k9p8L7J12l1k8n6K2J8m1m5m6R4l8n5MJ3L0m1M2k1oJ1m7kM6R9n3j6K4k5
2825a3J06k4k8l8L6L8M8l5q4Q3J2l9o7k1Q7p2J3o9m8P4J7o5P3m4L8k7J9p3M5M9
2855ij6k5KO8K8Kp7L2O9on5qL2M0n0o5K1qQ4Pj17J8O4j5p9K0j4M0K1n6J2N6PQ
2889C1r8J9O4M5l7j24J02j1P2p1n5L3P3p1n7K9Q6K8q7n4N8N3j0m8oK8M4J8q1j
2919b8N3L5j1n7qJ6Q1p2o9K1K7K6o5n2M7M1m8J9j05J06O8n9K7Kj7N1Ro5K5O6O0
2950A24p2n4L6L5K1n9o2N3O4o5n2oJ4O2m9o9J3K3j8pj00J26J0l6%j4R9j3l1K3
2980dP4m4L6k6mM8O8p2m2OJ0P2m3j9n6k6J10p1n4K8l3j2l6jN0J3j3m7J9M4kL9
$$ y = [56, 27, -49, -38, -26, 92, -12, -87, -93, 0, 54, -63, -38, 18, 22, 11, -118, -72, 2, 30, -9, -40, 35, 9, 33, 18, 28, 15, 70, 93, 64, -14, 23, 135, 104, 76, 20, 42, 60, 19, -26, -72, 22, -16, -71, -67, -54, -24, -65, -23, -44, -50, -39, -86, -88, -42, 57, 4, -12, 12, -13, 93, 69, 41, 3, 39, 77, 125, 90, 6, 89, 101, 62, -5, -26, 61, -11, 2, -67, -115, -41, -24, -89, -16, -60, -22, -49, -30, -103, -58, -9, -25, -50, -48, 20, 48, 50, -27, 5, 74, 68, 13, 5, 37, 77, 27, -38, -17, -25, 59, 66, -51, -33, 31, 16, -63, -43, -57, -17, 4, -52, -40, 16, 23, 31, -67, -48, 16, 61, 24, -100, 2, -9, 63, -8, -63, -30, 43, -28, -85, -56, 30, 58, -29, -83, -25, 28, 18, -30, -36, -8, 36, 54, -27, -28, 25, 60, 49, -8, -16, 0, 81, 9, -60, -39, -12, 14, -51, -103, -56, -15, -63, -44, -149, -43, 25, -34, -7, -5, -22, 29, 38, -27, -2, 64, 124, 52, -2, 34, 69, 90, 31, -31, 22, 86, 21, -31, -37, -23, 39, -10, -79, -66, -43, -61, -68, -168, -42, -32, -68, -68, -82, 17, 4, -27, -4, 70, 26, 62, 36, 32, 80, 148, 76, 34, 40, 50, 122, 79, 60, 4, -22, 88, 17, -37, -9, -42, -54, -90, -91, -41, -28, -41, -88, -69, -25, -27, 12]
3012A2q6O1L6R0o9j6l8L6N6k6l5PJ5M6p1NMK3Rj56R6J3K3k3o4K2J2l1J0J5K8j7
3044a3j7J0jL2j1K1m5rJ7M0o5lJ6K3N8l5j9l0J06k8n7L2Q2n9J9p3L2R8r4%o1N4
3076B0K4m8j8M4k0m1Q3q4J7M0q4O3n2o4N0M9Ll8k2Q4K7j03K4M0P3o5n7R6L2k7
3106D6m1M5ol6K0M6n1J1K6oj00Q5%l0j8j7r4M6L5n8K2o8J43Kk9j4Q8n5L2p3Q9
3137D0l3L2olJ7O1n9J1o1K5M6J2p3q9J25m5J9q6M0j0K9Mn2RJ14j18k4j2M8O4l1
3168fk1K9rN1l4m0J5j6N8L0l4j2%J1kn4L9LJ4k3nN8j9J7o1j8N7Qn6J3RJ4k8J0
3202bj1J2L1k8NlL5j3k1k8M5q5N8J5q3K8P2k0j5prN0o1l9qJ41n4ol6P8M2q3J4
3235A4N4n4K5l2k5K2j1N3n8%j7J7L3o5o8Q0M3j5m9m3Q0Q9p4m0K1N0L1k8k1K9M7
$$ y = [12, -74, -13, 23, 113, 44, 28, -10, 26, 82, 56, 21, 28, 43, 89, 18, 23, 27, 50, 59, -97, -1, 12, 35, 12, -52, -30, -18, -49, -39, -24, 4, -13, -30, -20, -21, 11, 0, 21, -24, -33, -16, 24, -41, -44, -28, -5, 53, 18, -1, -31, 75, 47, -10, 22, 104, 45, 64, -9, 23, 121, 27, 27, -34, 20, 44, -4, -22, 22, 2, -39, 44, -40, -23, 17, -67, -4, -56, -120, -70, -21, -18, -56, -78, 6, 33, -70, -46, -6, 67, 2, -55, 41, 73, 46, 5, 50, 44, 8, 28, 74, 23, 34, 60, 54, -46, 39, 39, 9, -9, -26, -120, -74, -39, -97, -75, -143, 0, 2, -27, -41, 47, -8, 24, -49, 40, 7, 39, 33, 30, 47, 108, 49, 60, -1, 24, 70, 82, 9, -80, 45, 0, 19, -67, -27, -37, -8, -4, -56, -47, 67, -51, -75, -87, -39, 25, -6, -27, 2, -7, 44, 10, -30, -15, -31, 27, 57, 23, 11, 11, 22, 20, -34, 5, 8, 22, -1, -6, 52, 33, 50, -11, -29, 28, 36, -20, -7, 2, 16, -12, -2, -13, -1, 30, 2, 7, 4, 39, 26, 5, -23, 22, -63, -5, 10, -73, -45, 27, 7, -8, -15, -24, 26, -35, -74, -82, 59, 5, -1, -37, 41, 83, 0, 14, 68, 14, 39, 7, -18, 4, -7, 46, -12, -12, -29, -12, 21, -44, -112, -32, 11, -4, -53, -96, -16, 73, -1, -41, -20, 30, 61, 33, 12, 41, 88]
3266H8j00J3jON3o6QLO1n8K8q1MK8j9Nn2L9j7L9o4L0O3k7M4q6j2J21j1p3j1J14
3298F9l4K2q7M8L0m5J0j0n3P3oMm8J0k1O5m5n4Q9J9L6q7M0nL1o7J8qK5Ro2j1P2
3331B7j7Qk6nK6qj7l1K6K0prJ1Nk4jP4r4K2N1k5m1J1L8K0n4M0q%j1qL6J8j6l5
3366dpl5O0K6j03j5N4Nkl4OL0K3Jrm1RM2k7JK9J6QMl4L3KL7q9k4J20j8m1l2K5
3401A6%No4K9N3o2Jj2l7N5J9J3j0m5K4J9N8l4m8K6L8o2j3J2O7o1nmPN1p5M0PN3
3435F1p6j3rJ7k5J3l5O6j5L8j7ok4K4N6k6m1L6Mk3kQm3J2K8%kl1KL1J2m4j4k1
3469e9k8M3O1p3N2oJ3P%p2P3QPj0J8Oj2Rk5lO4j06J0N6r4j5P7p7M6l0K8O0m9J1
3503a0k3O7o6j2P4M1n5l0K5pl6j2O2J8j5mm5M7K3k3k3k8M6j4J6k2L9m0K3l3j9
$$ y = [88, -12, 1, 0, 6, 59, -7, 1, 4, 65, 7, 35, -46, -42, -14, -33, -28, -80, -41, -58, -19, -83, -53, 10, -17, 27, -59, -71, 50, 39, -34, -45, 69, 35, 57, -30, 18, 48, 3, 13, 3, -50, 23, 17, 21, -27, -17, -38, 27, -18, -72, 17, 36, 72, -15, 25, 20, 51, -16, 2, -6, 19, 28, -34, -45, 27, 10, 18, -8, -13, 13, 5, -12, -43, -17, 3, -4, -13, -2, 3, -21, -22, 52, -42, -20, 31, 6, -35, -24, 14, 34, -20, 20, 12, 12, 1, -7, 29, 47, 31, -4, -11, -46, 14, 40, -63, -78, -24, -19, -21, -55, -49, -19, 4, 5, -4, -45, -36, 6, -21, -20, 9, 25, 33, 37, 3, 36, 38, 75, -14, -38, 82, 64, 23, -9, 16, 16, 21, -43, -14, 39, -23, -22, -34, -71, -16, 3, 16, 6, -39, -15, 4, 62, 28, -20, 6, 44, -18, -31, -19, 48, -13, -18, -22, -15, 36, -39, 1, 8, 61, -15, -28, -37, -20, -45, -32, -67, -1, -16, 22, 5, -1, -25, -1, 55, 29, -12, 24, 28, 5, 3, 11, -32, -20, 8, 8, 6, -25, -23, 8, 20, -24, -38, -59, -87, -44, 17, -56, -4, -10, 3, 10, 10, -62, 11, 19, 26, 16, 34, 40, 28, 37, 12, 9, 73, -33, -23, 33, -61, -76, 1, -76, -30, -60, -32, 28, -21, -10, -33, 34, -32, -44, 30, 71, 16, -14, 11, 4, -32, -44, 18, 36, 21, 17, -28, 19, 42, 19, -4, -32, 14, 0, 16, -6, 33, -7, 16, -17, -36]
3534c6M4o8O4j1Jq6O6M5k1j9lN3j0OLm8PK0j1pK1n3L0rJ1J5l3n2L9J1N4J9o8k6
3568e2P9k2J4j6M8l8Q0j02J4j4L6k5k0k7M8K5j8j1ok8K7j6n0P1j4j6ojJJ0J7n
3600a7J7k4L7K7l0K8m3M3Lm9M2JN9q1rJj5kK2lK0M4j66L8K9j1j4k1K3K0L0m1O8
3633B6pm3N9m9k5K5M8Rj2l3J4J6m7kl8J02j7n3K7J7l2J1q2O2J3k7K9j9J7J7j1
3664el6J5ON7n7K4n0J5R5l4n4k2O8l7L7n9K9K0pj1n0NM2kj1N3m4M1k5J0M5l7J0
3697C1n1K0K7pPk4QL4k1j9mjK7l7j2Ml7K5Mk1J5K0l1M6l7j5J04k5q1M1KPK2j7
3731DOl1O2j7k0m6M1M3j1rj9OL0j31O6MoN7n1j6J1O7n0j2OK5o3L8PM4m5J7P7n4
3765C0k4K7k1n3N1M9j0o3k2P0l3L1k9kK6L9q7K1pJ5K3l4K2j4J8M5p2MM6n0m2L8
$$ y = [-36, 8, -60, 4, -7, -6, -92, -26, 19, -2, -21, -24, 29, 19, 25, 28, -20, -13, 7, -4, -11, 10, -43, -13, -22, -11, 4, -29, -81, -42, -31, 23, 42, -26, -52, 27, 5, 19, 3, 51, 13, 93, -9, 5, -9, 27, 2, -18, -45, 3, 28, 10, -1, -7, -35, -8, -24, -74, -3, -17, -33, -39, -40, -39, -29, -12, -17, 0, -24, 13, 40, 10, 38, -5, 38, 41, -8, 34, 35, 94, 13, 4, 5, -10, -12, 10, 7, 27, 71, -95, -57, -28, -39, -53, -74, -51, -31, -1, -42, 26, 19, -24, 35, -14, -39, -14, 34, 43, 31, -2, 12, 28, -19, -21, -59, 43, 26, -27, 0, 17, -15, -4, -86, -24, -11, -38, -9, -28, -11, 6, -5, -41, -26, -20, 37, -20, 4, -46, -31, 64, 30, -24, -46, 22, -15, 22, -37, -8, 12, 5, -6, -56, -51, -9, -11, -22, 31, -13, 28, 3, 13, 58, 21, 31, -20, 0, 27, 20, 27, 3, 11, 45, 24, 5, 1, 0, 27, -10, -22, -18, -55, -30, -26, -47, -32, -12, -43, 3, -34, -49, 55, 30, -51, -10, -8, -1, 21, 4, 10, -21, 41, 24, 4, -42, -1, 42, 31, 22, 3, 9, 39, -92, -26, -22, -28, 29, -22, -38, -27, 40, -10, -22, -16, 9, -54, -16, -9, 35, -10, 7, 84, 30, 6, 33, 12, -41, 10, 59, 49, -14, -36, 34, 1, 32, 3, 1, 27, 66, -21, 0, -7, 8, 31, -3, 19, 5, 23, 68, -4, 0, 46, -4, -46, -8]
3797hLM9m3n4M7l2K6L7k3j5MJk8N5Pn0Pj4J1K2K1k2K3j3L9J0j4rm2Q3o0J3l1j4
3831a4K9N3j11J4R0n4j7J0PM1n0m7J0K2N7l8k3QK1m2J9L3j4lK5K1l3J1Qo2K6J4
3863A1j7M9n1L3kL9o0K6l6K0l2N2r2N1J3l8J3L7l9L1m2N0k5Q3o4K0K3p0J2k3O
3894b2J5lLO0o9L8m5L3l3J0j4L5mOMjK0J2J9o5M8n5o7R7K3rl6L4l8K8oJ2k1j2
3928cj1Okjj8PL0r2N6L3K3p5N0n1Q5MK1j5j0L0%n2K9m0K3LK3o4K8K4l5k8l3M2
3962a3RJ1k0rk1M1jj4kK5o3O8jk9N1o0L0lO2l3k9k8O9j2k7k7k4j2Q3Pj8j8K0J5
3996B7m2O5%j9k8Km0M2l2N0m7J1jj6k0O7L0q9J4N0o9J3L1MOn6R0m9rL6l9J2Q4
4029G8j03L4J5p2R4q0M3K3l2j8M5L5j5Nm0nJ9k5J4o5RL8J%o5P6RK3n6l8M2J8o5
$$ y = [-8, -5, 44, 1, -53, -6, -38, -12, 25, 2, -13, -9, -8, -36, 19, 26, -24, -17, -31, -20, 2, 23, 1, 24, 11, 50, 60, 46, 37, -5, 78, 18, 31, 0, -14, 15, 68, -43, -29, 61, 7, -10, 0, 7, 48, -2, -49, -39, -17, 40, 2, -21, -13, 8, -34, -15, 18, 4, 1, 26, 47, 14, 25, 33, -29, -3, 11, -6, 43, -8, 25, 23, 62, 2, 28, -8, 12, -20, 32, -60, -9, 4, -34, -21, 16, -23, 8, -34, 16, -9, 74, 10, 30, 53, -17, -5, -28, -22, -7, -10, -7, 53, -16, 22, -23, 10, -23, -13, -27, 8, 4, 10, 14, 13, 33, 45, 64, -1, 47, -8, -75, 22, 45, 36, 0, 34, -4, 24, 18, 30, 9, -3, -14, -8, -10, -11, -29, -22, 8, -84, -28, 5, 28, -47, 3, -48, 37, 41, 62, 47, 37, 67, 67, 15, 44, 4, 27, 30, 53, -11, 17, 41, 6, -22, -55, -13, -4, 7, -13, -22, -43, -2, -3, -17, -19, 6, -57, 11, 10, -19, 32, -28, 2, -1, 61, 28, -1, -29, 40, 28, 1, -26, -50, -62, 21, 28, 10, -8, 12, 27, -15, 50, 50, 31, 3, 5, -35, 7, -25, 25, -22, -11, -12, -28, -48, 19, 49, -40, -26, 24, -45, -32, -1, 3, 9, -47, 43, -6, -15, 21, -18, -6, 78, -25, 9, 24, -48, 46, -34, 9, 32, 0, -18, 27, 62, 47, 52, 12, 7, 26, 1, 15, -50, -41, -3, -2, -2, -67, 9, 18, 41, -15, -53, -11, 7, -58]
4062e8K1j6L5l3J19j08L2N1K6n9K9k3m1O6l3PoJ2nnK0MK3k9m7J6j8O7o4J7p5L1
4094d4K1M0l2Pl8J8K6l7N3pl5l4J8P6m7N7l4J1OJL8o2J9J6ql1K6o1j6M2l7P9Q
4127C9l6j4loL7J6m2K2om5l9J06l1J9Qn3M4m5j7R0p1P0q9J0k2K8P3k3k4K3k9k2
4159c2O3j00L7M4l2M2L3n8j8O3m1J7rK0J7k8j6l6O6n1J6n7O2k8M3k5m1N5j5L4
4189B5k5L2k9K9l4j6K0K0k6m1K0P1m0K3k4lmk9J2M1k0M8m9L5k9K3j5p9L0JM6j8
4221en8O2M6o9PL3m4K1j7l6L7L8m2N3o1jR7j4o8l7J2N0L8o3k3N4L5p4L0K6k5n
4253cJ0K8j5L6m6m8O6j7n0K3J1Nrk3k0NO5k5K2n8J0M5l3KK0J8pPj3M1n3LJ8k3
4287hK3M8l6J2p1O6nK6m2k7O7l8j3kN1l5Qq7M5Pj1k4J7LJ6L0k4l9J1J6oK2K8P
$$ y = [-58, -37, -53, -18, -51, 68, -40, -8, 43, 69, 10, 39, 16, -25, 41, 8, 15, 9, 21, 16, 11, 31, 35, 58, 29, -18, -2, -20, 47, -17, 0, -75, -44, -23, 17, -15, -8, -46, -28, -2, -39, 14, 7, -28, -62, -44, 32, -15, 42, 8, 19, 25, 26, 64, 2, 21, 37, 29, -2, 24, -37, -53, -11, -48, 31, 39, 3, -11, -14, -20, 17, 33, -9, 13, 7, -38, -77, 29, -2, 17, 25, -28, 16, -29, -46, 44, -27, 43, -46, -36, -58, -30, 43, 20, -4, 19, -10, -32, 31, -69, -32, 12, -20, 22, 55, -3, -21, 42, 1, 18, 9, 29, 46, 18, 2, -34, 32, -19, -3, -60, 2, -26, 17, -8, -49, 6, -9, 25, 0, 32, 3, 32, -2, -18, 2, 22, -4, -45, -25, 46, 6, 29, 5, 2, -2, -31, -19, 22, 2, 50, 1, 36, 7, 30, 15, -64, -34, -33, 13, -5, -63, -1, 45, -24, -17, 16, -28, -7, -24, -60, -23, 15, -27, 26, -35, -36, 61, 47, -21, -58, -46, 4, 42, -21, -44, 10, 45, -29, 1, 27, 2, -3, 7, 35, 20, 56, 10, -38, 28, 11, -39, -16, -5, 0, -9, -32, -52, -47, 18, -7, 15, -43, -33, 12, -21, -19, 1, 19, 12, 19, 6, 47, -6, -3, 15, -8, 15, 63, 27, 39, -32, 34, 29, 55, 13, -14, 53, 15, 2, 0, 51, 16, 24, -63, -18, -11, -22, -46, -29, -26, -10, 20, -4, -43, -32, -16, -22, 0, 28, 35]
4321C5L7J0p7k3K3RrK2Rl2M2Pn2J1K3K0l9p4M5J2K1n8PL9k1L2l9NJ1L2m4OjK1
4355A0k2L2m4oL5lL5Rk8K0n6k6K5J7k7K7l9K6JN2l7jM8j4n5n9R4%k0KK9L4oq2
4389b9OP6m3J3l3Jk1K6j8l3M6j2L5j6L5m1j9R3j15K8O9m4Kj7KK9K4j3o3P3j5m9
4421b3L9k4%j4Q4k5k9p0P8j6o4K0M8l7M9p7PL9jL5on1R6o2k6N1L1n1m2Q1k5j3
4453Bj9l2K3P1j4k6K0m6L2K3k0n2J6nmL4J6p2L2J5K0mm6M0k9N0o1M3j2k0L7m5
4485c3M0j2K2k4N0k9m3J4k5J17l6qm4rN6l3pM4n4J2m3K7K1k9L9Rk5L1j0K5n8M2
4517B7k4kJm6L8N7p1J6K6m6M7Qm8Lj8LP7m8K0Rk4M0l6kj2j2L2rK4m7K5J5j9k6
4551b2L3k0qJ8n2L8n2P0K2m3J1J8K6l4m4JR3n9N4p5m3N3L1k4M7k9MoNN3k8n9n
$$ y = [35, 72, 82, 5, -18, 5, 14, 5, 27, 36, 4, 46, 53, 1, 12, 35, 55, 16, -58, -13, -1, 20, -38, -31, 8, -13, 19, -20, -15, -4, 28, -16, -10, -11, 10, -12, 20, -24, -30, 5, 2, 37, 46, 18, 38, -18, -44, -19, -2, -29, -2, -41, -15, -14, 38, 1, 0, 48, 34, -21, -80, 14, 14, -6, -4, 25, 59, 53, -29, -23, 53, 10, 23, -10, -9, -30, -4, -22, -55, -9, -21, 14, -2, 33, -8, -27, 66, -49, -21, 48, 4, 6, -11, -9, 20, 44, 31, -32, 41, 26, -23, 16, -8, -8, -22, 62, 37, 8, -62, 16, 0, -64, -44, 4, -33, 16, -61, -54, -15, -16, 19, 13, -38, 58, -4, -30, 21, 52, 1, -41, 40, 15, 2, -17, -49, -26, 45, 31, 5, 25, -21, 11, 34, 14, -38, -22, -27, -31, 3, 19, -53, -21, -6, 14, 10, -36, 4, -25, 25, -36, 7, -5, -25, 12, -33, 7, -5, 17, -7, 43, 14, -29, -15, -40, 77, 41, 33, -11, -20, 36, 3, -4, 40, -14, -2, -45, -18, 3, -26, 13, 22, -3, 28, 18, 43, -15, 27, 3, 1, 2, -44, -6, 51, -20, -4, 22, -24, 23, 31, -17, -14, -32, -29, 48, 0, 20, 29, 5, 45, 9, 7, -5, -17, 15, 6, 30, -17, 8, 23, 4, -22, 11, -9, -17, 1, -51, -13, -65, 5, 27, -16, -5, 13, 39, 5, -39, -38, 55, -4, 50, -25, -68, -15, 16, -8, 39, 10, 14, 8, 13, 66, 38, -21, -26]
4584b6N4lm0nR3n9l6J7%M1l0K1p8M4N6n0k9LN3j4p3K6O8Jl9PO6r4LL7nn3K9J7
4618BNJ3J2k9LK2m4K2No7Q6o0J1JoMJ9M3k5k8K5kjm3M4l0j9Pj7lL9M5m0l3J2L1
4654Dl7K2N9k0j7j0pj5L4Kj3Pk1N7M2q9j6N6j0l8ON5n8JK4l7M4o7N3o8M0L3nj1
4688@l8N2l5K8n0P1m4N7o1j3RL3j9K7k9j0P1n5j3J9k5ON6p7P3o3N8l6K0Ml2OK4
4721A4k9J3N5k0n8QKJ0lM0op7Q7Mq1L4M0n4k9K4K9k5M3n7N2j0omK1k2L0Ll8L4
4755B4Kl6k6L5M7j8j6M1n3K3l3qK6nj5k4nk2L3J4N7o3KoN3j4o9K7J1N1o6lN6r
4789A1J8l3L9n7M2J8j4kk6jO4o7M4j2j6ll8J9n4P4k6PLk1pN7m4J8K2K1p7J9K9
4822GK4l2J1kl2mJj5N9p9Q8k5L3O2j00J8j7pj0RJ5LQK3r3N6J3m7P5o2K4pJ4J8
$$ y = [-26, 28, 25, -15, -20, 73, 14, -22, -5, -5, 36, 6, 27, -51, -7, 49, -1, -30, -27, 26, 12, -61, -35, 33, 34, -5, 2, 68, -26, -23, 14, 9, -44, -15, 2, 7, 20, 32, 3, 6, 28, -16, 6, 11, -56, 30, -30, -19, -18, -24, -20, -1, 42, 17, -11, 14, 12, 11, -32, 12, -18, -37, -30, -47, -50, -11, 34, -6, -39, -27, 4, -33, -11, 48, 28, 11, 1, -6, -21, 13, 15, 2, 9, -12, 45, 87, -2, -18, 38, 28, -10, -4, 51, -7, -6, 18, -19, 25, -42, 11, -57, -17, 16, 11, 0, -38, 14, -21, 7, -43, 28, -16, 41, -20, -33, -24, 9, -10, 17, -12, -22, 49, -6, -19, 0, -25, -19, 37, -40, 33, -30, 28, -8, 12, 16, -16, -10, 14, -15, -2, 53, 33, -25, -17, -15, -5, -8, 32, 26, -51, 36, 40, -41, -7, 33, -21, -50, -26, 3, -22, 21, -36, 16, 6, 0, -4, 17, -5, 25, 28, -10, 24, 26, -10, -36, -1, 46, 28, 12, 53, 0, 23, -10, -18, 8, 3, -12, -36, -41, -63, -30, -16, 41, -22, -20, -26, 27, 13, -56, -29, -18, 33, -33, -36, 20, 11, 29, -4, 35, -22, 20, 38, 24, 22, -4, -5, 59, -8, 36, 24, 8, 5, -33, -14, -68, 6, -20, -13, -10, -31, -38, 19, -25, -7, 15, 36, -41, -22, 7, 31, -1, 10, 8, -24, -28, -27, -42, 17, -62, 26, 1, 34, 96, -4, 14, -3, -10, -20, -11, 4, 7, 15, 38, -55, 1, 14, -33, 42, -20, 4, -3, 11, 29]
4856B9j5o6pN8l0K3KK5Ok7J3j3L6K0l3j3k7%KJ8K5k4P6q6j9O0p9R2l2K8k7m4L8
4889Ip5M2j6L9L6j6Oj8j9l2K6K3K5m5l7j9Q5m2rJ3P2n0L9k7l1J9j8L3j2M9n3n
4921hk3K6M3l1l0L7k7L3KJ1m0j9JRLj7P7n9lk5K8rJ8K2l2JR4q2K7j2j8L7J0o0
4955a6K7J7L2n1jN5n3k6M3ppQJ9klk5qm4J4j2L4K6J9m1Ok4LJ4J6L3m8j5J4o6O4
4990eNK6ol3j9K0L5m2N3m7N1j7jl5J4%M0l1Qk3OPmR3p7k6l0M6l0K0pK3k3rJ4K3
5026A9o8Q1m1k2K6l0M0k1M9l4l2l6M0L1j1J1jj1KN4j8j3lj6KRL4k9j9J9m2K3n
5059a2jn3M6J9L2rq4M1J9K6k4l1lJ5Nk0L6mk6K4J3kL3k5Rj17J25ok5m1N6J5RK7
5093F7q5l3Q8Ok3j6k0M3m8N1m1m1O1Oj1j3jj2K2rQj4j8M1k9J9NK8l6%M1k2L6m4
$$ y = [29, 14, -52, -59, -1, -31, -8, -6, 19, 25, -2, 11, -2, 34, 54, 21, 8, -19, -19, -17, 1, 26, 2, 78, -8, -27, 33, -46, 46, 14, 42, 15, -29, 9, -66, -24, -40, -1, 35, 19, 25, 7, -12, -44, -18, 5, 30, -15, -52, -71, 14, -28, -37, -24, 48, -2, 37, 10, -21, -2, -20, 13, 1, 50, -3, -8, -31, -5, 38, 7, -23, 14, -13, 20, 22, 33, -7, -26, -25, -16, -13, -30, 47, -12, -15, -40, -12, -21, -3, 19, -13, -12, 82, 0, 27, 15, -3, 34, 44, -16, 11, 28, 60, 9, 8, 63, 10, -16, 27, 20, 13, 21, 40, 38, 35, 10, 2, -42, -28, -40, -6, 20, 39, -2, 4, -20, -17, -3, 13, 46, -2, -17, -3, -69, -5, 0, 26, 20, -13, -32, -12, 23, -19, 34, -13, 38, 21, 20, -15, -1, -1, 39, 8, 16, -7, -1, 6, 2, 95, 18, -8, -38, 8, -22, -2, -9, 14, -9, -18, -4, 19, -49, 32, -9, -31, -5, -35, 5, -16, 33, -1, -33, -69, -29, 2, -9, 2, 1, -10, -8, 46, 28, 15, 12, -4, -2, 7, 41, 12, -7, 12, -30, -7, -12, -13, -66, -20, -1, 31, 22, -62, -21, -2, 24, 0, -31, -34, -19, -14, -34, 2, -2, -28, -4, 9, 7, 40, 15, 24, -93, 32, 26, 1, -40, 16, 31, 40, 67, -18, -51, 37, 43, 20, 4, -16, 27, -21, 30, -11, -52, 9, 15, 4, -9, -10, -22, 0, -9, -1, -15, -33, 8, -21, -2, 3, 31, -5, -5, 36, 14, 50, 6]
5127Fkn6O4k8M3j9K9%k3o8K2L4K7q0O2k3J03l5m7n5O9p9R3k5l8M5m3N2m2m9O0
5158cM9o1J3j4M9op2K2K6P0j06NK1P3k2k8LJ2J0m5Oq2Q6J6o3J8N6mk8L7q9L7M1
5191B7k5J0k3l0J5qJ6klL8n0K6OM4q7L0mK0l6N8k2NM7j4l9l9L3M7m0j6N1j3QK
5225C2K1n9KK7J0m9O1l0J8j1k5krP1j13L2jRKqK9mRj8k4mmjQ4l4J0K1K4n4m4O9
5261C7n5N7q7K9O7l8J8o7K7K5m1K8k8N8j1p2K0L5J6RNr1J10o6k1J8oO4q5N9o3
5292d9K9L2J8j1l3K7K5nk4Lj0O2o0Jl8P7o0k2K9nK9l1N1n9l6M4M0n0M9k9J1m2
5324c7K6l8J08l0l3j6K0k4%QL6jPkp0L1K0J0O1j05M8n6N1k6L7J7m8M1k3L1k0j6
5356Gk9J8k6M6J2l6K6k4NM9j49J11J2k4m9JM3qjM0r0N9J8Nn0j7K9K1j0K2m4J6
$$ y = [6, 4, -52, 12, -16, 27, 8, 37, 37, 14, -54, -32, 2, 29, -51, 11, -12, 91, 56, 9, -46, 23, -56, 37, 12, -26, 19, -24, 28, -14, -63, -3, 46, -15, -2, -16, 33, 27, -45, -23, 3, 73, -33, -28, -7, 66, 44, 16, 19, 31, 41, -4, 2, -80, 6, 22, -41, -23, 33, 29, 1, 38, -51, -14, 27, 2, 12, -11, -41, -26, -34, -18, -20, -23, 15, -35, -9, -3, 41, -46, -16, -20, 0, -36, 22, 0, 5, 52, 38, -1, -40, -7, 40, 0, -16, 35, 22, 30, 32, 53, -6, -4, 23, 33, -16, 45, 15, 33, 22, -3, -5, -14, 57, -56, -24, -25, -16, -14, -22, 7, 3, 12, -6, -30, -34, -38, -39, 45, 11, 21, 42, 66, 12, -32, 37, -18, 39, -48, -19, 48, 10, 28, -39, -12, 13, -28, 0, -28, 30, 19, -53, -33, 2, 18, 27, 32, -59, 51, -15, -36, -18, -24, 40, -45, 14, -49, -20, 12, 30, 19, -14, 13, 38, 33, 9, 12, 2, 64, 4, 5, -33, 44, -16, -38, -9, -14, 15, -16, 35, -24, -60, -16, 24, -26, 23, -6, 5, -37, -11, -49, 59, 29, -4, -20, 0, -24, -24, -16, 20, 19, 26, 24, -46, -15, 5, 15, 76, -29, 19, -37, 14, -12, 25, 42, -6, 35, 12, 43, 23, 7, -22, -4, -30, 16, 28, -8, 18, -6, -1, 48, -101, 10, 22, -2, -51, -50, -7, -15, -16, 24, -66, -7, 11, 16, -34, -51, -22, -1, -11, 11, -33, -17]
5388a7M0j8j7O5n2K1j0J3l0rN2l3qL4j9Lrn8N1MJm3KL5OM9k2l5J4n8N0j6O9n0
5422EL0j1l6k1M8Nm8NlJ9M2m0P9n0m0njL4l0N5M0k1p0K3PJ4K5o4Ljo2K3P1m5L8
5457A8N6j1n8Nr6P3PRK7k0Jj9jj4N3oNj7m1P5J1o8L0J2N3m3k3J9m4M2k4j6L8k9
5491Dqk5LmK1j8L4k3M8l9j7L5l4J1J3J1j9J3k4M0j7j5K0j7K8NN1m5l2jjM7l0l1
5525a6N0M1k0o4o0M4M1k7q5J11j7L0k5m1J0M6J2N2j02LK1J3Jj8K8k6k5l7Q3j6
5555GM5rn4O2l7o4N9j9QJ4k8oJ4L8K1j06M5j6L1J6o0K4PM0Jq5NK3K2Jr9R1J4L6
5589D1n9k1J3L2Pl4j9O4l3m7M6J3N1l7N1q1j8M3n1J10o4k5O4j9p6L4N1kk5m2r
5620d2L1L9p6K7j5Q4q2k3K8M5j2M4p3j5L5K5Ql8J7j1Q6o5J6r0M5J1J4k0K7%k5
$$ y = [-17, 23, 5, -12, 53, 1, 22, 12, 25, -5, -14, 38, 5, -3, 31, 12, 15, 6, -52, -1, 3, 4, -39, -37, -2, 4, 53, 31, -4, 10, -48, 2, -14, 55, 5, 35, 24, -12, -33, 15, 20, -28, -23, -26, -7, 35, -5, 74, 24, -16, -21, -22, 12, -18, 37, 77, 56, -14, 9, 16, 30, 55, -9, -6, -7, -69, -46, 25, -20, 18, 74, 63, 5, 10, -86, -13, -6, 3, 30, 10, 11, -8, -9, -23, 30, 24, 29, 12, -29, 46, 57, -11, 19, 31, 84, 41, 18, 37, -7, 35, 11, -5, 33, 4, -4, -29, -26, -30, -9, -27, 7, -16, 32, -7, -24, 11, -23, -12, 1, 12, -7, 6, -18, 22, 5, -10, 10, -7, 21, 26, 77, 32, 0, -1, -2, 45, 15, -16, 34, 75, 55, -9, -69, -25, 16, -11, -96, 15, -2, 28, 3, -38, -28, 18, 30, 82, -20, -17, 4, 17, 18, 0, 28, 2, -23, -60, 23, 7, 52, 43, -11, 51, 14, -50, 9, -10, -2, 12, -16, -22, -8, 30, 51, -55, -10, -26, 5, 21, -39, -15, -8, 32, 33, -52, -47, -24, -2, -1, -100, -9, 5, 41, -18, -39, -26, 6, 13, -21, -40, 24, -9, -56, -10, 3, 54, 17, 68, -13, -31, 12, -39, 71, 7, -18, 46, 27, -49, -15, 36, 34, 9, -33, -42, -11, 28, -48, -21, -36, 48, -34, -57, -29, 16, 4, 48, -25, -40, -5, 20, 28, -10, 7, -4, 82, 17, 33, -57, -12, -1, 13, -7, 20, 20, -5]
5651ekL4o2M8Qr2M9P9o8k5L5L4j5o2K9RM3kq5J5k1N3nJ9l0L4L8p5K4K6J9j6j2
5684A9n2L7J1m3J2LM0k0qJ3QrRK3j0%kn7K4oN0p3N3j5k8j3rJ2MN0j4om9k4Q9L1
5720E0k8m5K2P0n8L3m6K8O1j20KMO2k4J4Qp5Q2l1K5kl7K5l1q1O7K7j7j1k0M2k
5752frl2oL2rK9lJ7jJ1p0R5j5j4jl7L5Jk7M0rK2K8n9J5jo7N6om3M7l9K4Oj8qj9
5789d1M5k8J5Mj4O3o6%O3J0o7RkL5k3MM5pj7L5j04M3L0o8N4l5kL1j8J02o1n5N0
5822C0n4j5K0O5k9N3j57P2L2j8K8l7Mk6K8m4L6qK3m7K6L6J1Ll6Km3K1K6k7L4j
5854Hk5L0kJ4nN1n0k6J6L0l1j3lN1%j06L2O2j7n9M9J6m2K9p0NP2oKOJ2J6j5o4
5888c3k4P0k0K4J9n7O7l9lK5k7p0K3Q9r6J0P0J5K0l4l5m3N5pl7N8m6J9J9n0O6
$$ y = [-5, -7, 27, -35, 13, 21, -71, -22, 57, -11, -36, -1, 33, 18, -44, -15, -6, 37, 35, -50, -35, -56, -3, -8, 11, -19, 15, 53, -22, 2, 28, 47, 31, 19, -33, 4, 15, -28, -16, -13, 27, 7, -1, 12, 20, 11, 20, 43, 33, 33, 31, -26, -2, -8, 42, -31, 22, 7, -21, -34, -43, -31, -27, 23, 9, 3, -46, -70, 19, 50, 22, -23, -1, 69, 11, 44, -2, 26, 87, -33, -31, -27, 35, 11, 25, 33, -42, 40, 9, 34, 32, -5, 20, -11, -92, -25, 2, -15, -26, -46, -4, -6, -15, -47, -53, -21, -30, -1, -4, 13, 12, 23, -47, 48, 33, 19, 18, -19, 16, 17, -10, 30, 21, 43, 71, 12, 27, 26, -41, 15, 9, -34, 13, -26, -2, 4, -14, -22, -41, 4, -24, -9, -5, -19, 44, -22, -22, 41, 51, -16, -7, -9, 26, 3, 7, 52, 45, 28, 63, -41, 2, 32, -36, 18, -17, -19, 12, -6, 96, 35, -20, 30, -24, -39, -19, 46, 17, 70, -87, -15, 17, -1, 27, -10, -6, -32, -4, -48, -12, -20, 3, -44, -18, 18, 29, 32, -4, -2, -45, -24, 2, -25, 9, 8, -17, 13, 11, 25, 20, 71, 21, -5, 11, 41, 10, -3, -6, 45, 45, -61, -29, 33, 16, -43, 6, 22, -20, 9, -61, -56, 16, 10, 12, 18, 30, 46, 31, -33, -57, 13, -7, 17, 36, -21, 46, 7, 4, 29, 2, -68, -45, 44, -52, -42, 28, 43, 63, 29, -6, -49, 6, -1, -38, 20, -26, -7, 12, -38, 28]
5919B8o6J4L7j1l4L5nn3Kk4Q9j9J1J5J5l1M0m3J2M9l1r9J06J1o3L9p3R4l8%J5
5950B2j7ojK3k7Oj6J9jm2N1%J3k9J6m8P3m4k4j2M7M3p8N2l8N0k5m7K1O8n7M4P
5983D3nj6Lk5Kno0M9lO4o9J14r5o0K3K2P3j6l4m1N0Nl5KK7L3n9mljK3k1K5K4J1
6018D1qp4N5lK1Ro6LK3Ok7rR3o2K9l6MkL2n0L4l8M2j5Pm4l8R9o0N7l2l5K8Jk3
6053c8M3K5K3o9K7l6K5OLKL2l8L4N2q4l4K0N5j08R4L2k2m6JJ6K1l7m7N1j8mL2
6085A3m0RK2l4L1n7K2J7M2k1r9P7NK8k5KKNP0l7oj7l6Q6l7k0L9ron4M1o3K4K2
6119dl1J6J0J3m0L0Rj2l1%JQ1k4n1J2PM0Q5j31j6N8j2pm2J39r5nOkN3m8J6l7J1
6153aM5l0Km1L9l7P6k3k9KK6o7j8L9L9Mn2MoM9j5l4j7O6o3O3l7K9kL2pp5N0L6
$$ y = [28, -38, -24, 13, 2, -32, 3, -2, -55, -53, -77, 12, -7, 4, 19, 34, 3, 43, 0, 12, 61, 30, -69, 37, 48, -15, 24, -49, 45, 7, 7, 22, 5, -1, -2, 21, -6, 0, -16, 3, 2, -40, 11, 11, 24, -5, 11, -37, 36, -8, -32, -44, 3, 46, -32, 20, -18, 32, 7, -40, -19, 49, -8, 36, 43, 38, 22, 25, 0, 2, -3, -63, -14, -17, 47, -22, 92, -3, -63, -40, -18, 55, 39, 5, -36, 14, 19, -16, -14, 13, 46, -13, -17, -20, -21, 2, -19, 6, 30, 41, 33, -41, 14, 11, 32, 41, -25, -22, 1, 7, -20, -29, 64, 2, 31, -5, -1, -3, 29, -21, 13, -25, 17, 2, 9, -35, -73, 26, -34, 23, -9, -44, -16, -15, -38, 5, 30, 53, -16, 11, -25, 0, 6, 9, 11, 43, 5, 39, 91, 7, -27, -7, 48, -60, 34, 66, 44, -2, -1, 15, 36, -1, -48, 3, -15, -19, 13, -27, -18, 4, -30, 1, -56, -34, -17, 25, 4, -95, -18, -13, 15, -10, -8, -6, -1, 69, 32, 26, 9, -27, 59, 22, 2, 41, 32, 26, -28, 13, -50, -26, -4, -35, -19, -9, 4, -36, -6, 3, -9, -40, -40, -39, 42, 18, -33, -21, -14, 26, 111, -20, -36, 22, 10, 3, -39, 100, 5, 0, 6, 4, 57, 9, 25, -12, -1, 44, 14, 16, -25, 14, -23, 53, 30, 1, 3, 29, -38, -56, -17, 22, 26, -26, -22, -28, 21, 6, -28, -45, 21, -42, 21, -16, 13, 11, 43, 36, -39, 11, 47]
6187D7L7o4rM6k5m3O0k3O%j2J6m3K4k5j4m2R2L1m7k7Lj9K6K0n6k3P0m1k2K8J4
6219a5j9k3O7J0Jn9K5l3M9M9o8PM6lm7N7j1onn5Q8m6m7L8Ll1K9k3J6Qm9j4j1J
6253g1M7j6J4k2K2pK2pJ7k8RJ03q7OpJ3kJ1j5Qk5K5J0K9n9P0m3m3K0j4J7K0M1
6286E8m2m8QL4jj0J5Ml4k7L3m4Rk1M4OJ6J7l7M3j6rK6l1QK2ML5j8l7J5l0j4l1
6320e3R2j7l8J7J5l6MNlK6oQn6O2k1j2K1kRrpk%L1n3M4k5k7k0L4M6K4r8N5Plj0
$$ y = [47, 84, 20, 11, 57, 32, -11, 49, 26, 32, 32, 20, 36, -7, 17, -8, -22, -64, 28, 59, 12, -15, -12, -31, -5, 15, -41, -64, 6, -35, -57, -29, -15, -34, -57, 10, 20, 21, -38, -13, -46, 3, 52, -16, -9, 37, 34, -13, 44, 33, 27, 22, -33, 55, 9, -38, 0, 3, -28, 1, -22, -6, 2, -47, -61, -72, -71, -24, -40, -26, -48, -26, -33, -11, -18, -1, -29, -20, 83, -4, 2, -5, 8, 6, 17, 2, 10, -15, 10, 20, 49, -10, 60, 17, -26, -6, -20, -3, 17, 58, 16, -32, -24, 10, 9, -1, 14, 18, -16, -43, -10, -54, -45, -66, -22, -16, 0, 17, -20, 23, 7, -2, 24, -7, 1, 23, 27, 62, 44, 7, 22, -8, -22, -53, 39, 22, -16, 1, 16, -20, -16, -11, -14, 12, 6, 14, -42, 20, -1, -13, 8, 6, 15, 6, -1, -3, -3, 28, -25, 19, -6, -33, -53, -19, 27, 51, -47, 8, 15, 12, 2]
$$ [...]
8191B3
##END NTUPLES=NMR FID
##END=
