##TITLE=1H_Pr DCG
 CDCl3
 8 sc, 
 16.2.2023
##JCAMPDX= 6.0         $$ Bruker NMR JCAMP-DX V2.0
##DATA TYPE= NMR FID
##DATA CLASS= NTUPLES
##ORIGIN= UXNMR, Bruker Analytische Messtechnik GmbH
##OWNER= root
$$ XWIN-NMR		Version 3.5
$$ Thu Feb 16 14:56:42 2023 Russian Standard Time (UT+4h)  she@DPX200
##.OBSERVE FREQUENCY= 200.13135
##.OBSERVE NUCLEUS= ^1H
##.DELAY= (6, 6)
##.ACQUISITION MODE= SIMULTANEOUS
##.ACQUISITION SCHEME= undefined
##.AVERAGES= 8
##.DIGITISER RES= 18
##SPECTROMETER/DATA SYSTEM= spect
##.PULSE SEQUENCE= zg30
##.SOLVENT NAME= CDCl3
##.SHIFT REFERENCE= (INTERNAL, CDCl3, 0, 15.7039)
##AUDIT TRAIL= $$ (NUMBER, WHEN, WHO, WHERE, WHAT)
$$ ##TITLE= Audit trail, XWIN-NMR		Version 3.5
$$ ##JCAMPDX= 5.01
$$ ##ORIGIN= Bruker BioSpin GmbH
$$ ##OWNER= she
$$ F:/spectra/data/she/nmr/H-F/1/audita.txt
$$ ##AUDIT TRAIL=  $$ (NUMBER, WHEN, WHO, WHERE, WHAT)
(   1,<2023-02-16 14:55:24.76 +0400>,<she>,<DPX200>,
      <created by zg, POWCHK disabled, PULCHK disabled
       configuration hash MD5:
       00 E9 B6 7A A2 85 ED C7 34 08 36 98 17 FE 4E 26
       data hash MD5: 16K
       CA E9 BA B2 FE 3D 1B FF E5 E0 50 9F 52 09 64 DC>)
$$ ##END=
$$ 
$$ hash MD5
$$ 05 58 52 12 89 F2 1B 4A 33 32 0E F6 59 72 C5 F7
##$RELAX= 
##$RELAX= 
##$RELAX= 
##$RELAX= 
##$RELAX= 
##$RELAX= 
$$ Bruker specific parameters
$$ --------------------------
##$DU= <F:/spectra>
##$EXPNO= 1
##$NAME= <H-F>
##$PROCNO= 1
##$TYPE= <nmr>
##$USER= <she>
##$AMP= (0..31)
100 100 100 100 100 100 100 100 100 100 100 100 100 100 100 100 100 100 
100 100 100 100 100 100 100 100 100 100 100 100 100 100 
##$AQSEQ= 0
##$AQ_mod= 1
##$AUNM= <au_zg>
##$AUTOPOS= <>
##$BF1= 200.13
##$BF2= 200.13
##$BF3= 200.13
##$BF4= 200.13
##$BF5= 200.13
##$BF6= 200.13
##$BF7= 200.13
##$BF8= 200.13
##$BYTORDA= 1
##$CFDGTYP= 0
##$CFRGTYP= 5
##$CHEMSTR= <none>
##$CNST= (0..31)
1 1 145 1 1 1 1 1 1 1 1 1 1 1 1 1 1 1 1 1 1 1 1 1 1 1 1 1 1 1 1 1 
##$CPDPRG= <>
##$CPDPRG1= <>
##$CPDPRG2= <>
##$CPDPRG3= <>
##$CPDPRG4= <mlev>
##$CPDPRG5= <mlev>
##$CPDPRG6= <mlev>
##$CPDPRG7= <mlev>
##$CPDPRG8= <mlev>
##$CPDPRGB= <>
##$CPDPRGT= <>
##$D= (0..31)
0 1.2 0 0 0 0 0 0 0 0.06 0 0.03 0 0 0 0 0.0002 0 0 0 0 0 0 0 0 0 0 0 0 
0 0 0 
##$DATE= 1676544924
##$DBL= (0..7)
120 120 120 120 120 120 120 120 
##$DBP= (0..7)
150 150 150 150 150 150 150 150 
##$DBP07= 0
##$DBPNAM0= <>
##$DBPNAM1= <>
##$DBPNAM2= <>
##$DBPNAM3= <>
##$DBPNAM4= <>
##$DBPNAM5= <>
##$DBPNAM6= <>
##$DBPNAM7= <>
##$DBPOAL= (0..7)
0.5 0.5 0.5 0.5 0.5 0.5 0.5 0.5 
##$DBPOFFS= (0..7)
0 0 0 0 0 0 0 0 
##$DE= 6
##$DECBNUC= <off>
##$DECIM= 32
##$DECNUC= <off>
##$DECSTAT= 4
##$DIGMOD= 1
##$DIGTYP= 9
##$DL= (0..7)
0 120 120 120 120 120 120 120 
##$DP= (0..7)
150 150 150 150 150 150 150 150 
##$DP07= 0
##$DPNAME0= <>
##$DPNAME1= <>
##$DPNAME2= <>
##$DPNAME3= <>
##$DPNAME4= <>
##$DPNAME5= <>
##$DPNAME6= <>
##$DPNAME7= <>
##$DPOAL= (0..7)
0.5 0.5 0.5 0.5 0.5 0.5 0.5 0.5 
##$DPOFFS= (0..7)
0 0 0 0 0 0 0 0 
##$DQDMODE= 0
##$DR= 18
##$DS= 0
##$DSLIST= <SSSSSSSSSSSSSSS>
$$ [...]
##$SUBNAM2= <"">
##$SUBNAM3= <"">
##$SUBNAM4= <"">
##$SUBNAM5= <"">
##$SUBNAM6= <"">
##$SUBNAM7= <"">
##$SUBNAM8= <"">
##$SUBNAM9= <"">
##$SW= 18.05172834244
##$SWIBOX= (0..15)
0 0 2 0 0 0 0 0 0 0 0 0 0 0 0 0 
##$SW_h= 3612.71676300578
##$TD= 16384
##$TD0= 1
##$TE= 0
##$TE2= 300
##$TE3= 300
##$TEG= 300
##$TL= (0..7)
0 120 120 120 120 120 120 120 
##$TP= (0..7)
150 150 150 150 150 150 150 150 
##$TP07= 0
##$TPNAME0= <>
##$TPNAME1= <>
##$TPNAME2= <>
##$TPNAME3= <>
##$TPNAME4= <>
##$TPNAME5= <>
##$TPNAME6= <>
##$TPNAME7= <>
##$TPOAL= (0..7)
0.5 0.5 0.5 0.5 0.5 0.5 0.5 0.5 
##$TPOFFS= (0..7)
0 0 0 0 0 0 0 0 
##$TUNHIN= 0
##$TUNHOUT= 0
##$TUNXOUT= 0
##$USERA1= <user>
##$USERA2= <user>
##$USERA3= <user>
##$USERA4= <user>
##$USERA5= <user>
##$V9= 5
##$VALIST= <valist>
##$VCLIST= <CCCCCCCCCCCCCCC>
##$VD= 0
##$VDLIST= <DDDDDDDDDDDDDDD>
##$VPLIST= <PPPPPPPPPPPPPPP>
##$VTLIST= <TTTTTTTTTTTTTTT>
##$WBST= 1024
##$WBSW= 4
##$XGAIN= (0..3)
0 0 0 0 
##$XL= 0
##$YL= 0
##$YMAX_a= 84639
##$YMIN_a= -74385
##$ZGOPTNS= <>
##$ZL1= 120
##$ZL2= 120
##$ZL3= 120
##$ZL4= 120
##$ABSF1= 10
##$ABSF2= 0
##$ABSG= 5
##$ABSL= 3
##$ALPHA= 0
##$AQORDER= 0
##$ASSFAC= 0
##$ASSFACI= 0
##$ASSFACX= 0
##$ASSWID= 0
##$AUNMP= <proc_1d>
##$AZFE= 0.1
##$AZFW= 0.1
##$BCFW= 1
##$BC_mod= 2
##$BYTORDP= 1
##$COROFFS= 0
##$CY= 11.3945322036743
##$DATMOD= 1
##$DC= 2
##$DFILT= <>
##$DTYPP= 0
##$F1P= 2.36226072786647
##$F2P= -0.459571619588291
##$FCOR= 0.5
##$FTSIZE= 0
##$FT_mod= 4
##$GAMMA= 1
##$GB= 0.15
##$INTBC= 1
##$INTSCL= 1
##$ISEN= 128
##$LB= 0.24
##$LEV0= 0
##$LPBIN= 0
##$MAXI= 10000
##$MC2= 0
##$MEAN= 0
##$ME_mod= 0
##$MI= 1.114404
##$NCOEF= 0
##$NC_proc= 0
##$NLEV= 6
##$NOISF1= 3.799351
##$NOISF2= 2.8
##$NSP= 1
##$NTH_PI= 0
##$NZP= 0
##$OFFSET= 15.70392
##$PC= 1
##$PHC0= -19026.26
##$PHC1= 15.80078
##$PH_mod= 1
##$PKNL= yes
##$PPARMOD= 0
##$PSCAL= 0
##$PSIGN= 0
##$REVERSE= no
##$SF= 200.130013532006
##$SI= 16384
##$SIGF1= 3
##$SIGF2= 2
##$SINO= 400
##$SIOLD= 16384
##$SREGLST= <1H.CDCl3>
##$SSB= 0
##$STSI= 0
##$STSR= 0
##$SW_p= 3612.71676300578
##$SYMM= 0
##$S_DEV= 0
##$TDeff= 0
##$TDoff= 0
##$TI= <>
##$TILT= no
##$TM1= 0
##$TM2= 0
##$TOPLEV= 0
##$USERP1= <user>
##$USERP2= <user>
##$USERP3= <user>
##$USERP4= <user>
##$USERP5= <user>
##$WDW= 1
##$XDIM= 8192
##$YMAX_p= 0
##$YMIN_p= 0
$$ End of Bruker specific parameters
$$ ---------------------------------
##NTUPLES= NMR FID
##VAR_NAME=  TIME,          FID/REAL,        FID/IMAG
##SYMBOL=    X,             R,               I
##VAR_TYPE=  INDEPENDENT,   DEPENDENT,       DEPENDENT
##VAR_FORM=  AFFN,          ASDF,            ASDF
##VAR_DIM=   8192,          8192,            8192
##UNITS=     SECONDS,       ARBITRARY UNITS, ARBITRARY UNITS
##FACTOR=    0.0002768,     1,               1
##FIRST=     0,             0,               0
##LAST=      2.2672688,     0,               0
##MIN=       0,             -74385,          0
##MAX=       2.2672688,     84639,           0
$$ Real data points
##PAGE= N=1
##DATA TABLE= (X++(R..R)), XYDATA
0 0 0 0 0 0 0 0 0 0 0 0 0 0 0 0 0 0 0 0 0 8 -8 8 -8 8 -8 8 -16 16 -16 21 -24 24 -32 32 -40 40 -48 53 -58 64 -72
41 -72 80 -88 101 -109 119 -133 149 -160 176 -196 214 -237 261 -290 322 -360 402 -451 512 -586 681
62 681 -801 965 -1198 1555 -2159 3379 -6707 33022 84639 -61714 -48407 70901 5264
75 5264 -65824 33438 43619 -55448 -20744 54565 -2474 -36199 10995 8902 -9573 11630 -1425
88 -1425 -17394 11848 8807 -16464 11507 14339 -30680 -2132 44280 -12350 -39958 26984 23698
101 23698 -31881 1022 28492 -22296 -18261 33679 3991 -32962 7469 17989 -15211 948
113 948 12306 -19136 -5240 25290 -5630 -21301 13729 8017 -18136 9191 17587 -22663 -9954
126 -9954 29269 1517 -23277 7842 12751 -11193 900 12369 -9707 -8803 12923 2729 -8957
139 -8957 2754 -1393 -6300 10556 3621 -17414 86 16198 -7281 -11657 13041 2172 -17794
152 -17794 7789 18123 -15075 -13612 18346 8096 -15817 -620 13148 -4267 -8144 9452
164 9452 5531 -10372 -3349 9903 3966 -8665 -5134 7752 3838 -8495 -1857 7614 -3118 -8706
178 -8706 6598 7660 -11590 -6509 13518 2260 -12985 2318 9828 -5688 -5046 8840 1910
191 1910 -9119 2305 9088 -3451 -5345 4308 2708 -2443 -180 1525 -898 -1356 1027 844 -1289
206 -1289 -1561 -636 1209 613 -2718 -1092 1783 -530 -1219 760 -31 -1060 580 1663 -372 -1048 1297
223 1297 916 -96 997 -88 -474 1497 729 -862 -10 772 -248 -819 732 88 -1946 -18 1158
240 1158 -1190 -1364 179 265 -691 -890 512 245 -1108 177 1126 -46 -704 339 1663 -24 -1129
257 -1129 1552 1369 -1235 151 1766 -38 -1343 565 1541 -1238 -1322 1379 43 -1729 -194 568
273 568 -480 -1345 -237 886 -755 -1259 606 721 -664 -858 1130 1244 -1448 -204 2539 -110 -1552
290 -1552 1495 1796 -1191 -899 2139 673 -2289 417 1918 -1331 -1367 953 379 -1368 -970 859 54
307 54 -1731 -278 950 -350 -1203 -33 1344 -415 -1347 1555 1143 -1553 299 2065 -154 -1012 1190
324 1190 1291 -1018 15 1459 -758 -590 1097 -529 -777 582 -602 -965 572 -53 -1719 -69
340 -69 1347 -1506 -1289 1918 -365 -1926 1629 1022 -1780 323 1954 -448 -723 1564 311 -951
356 -951 1606 561 -1583 1247 1036 -1869 610 1580 -2159 -989 2594 -769 -3307 1772 1682 -3754
372 -3754 -46 3238 -2811 -2179 3693 -74 -3524 1954 2376 -2953 62 3700 -2013 -1839 4228 -24
388 -24 -3351 2870 1895 -3525 872 3476 -2967 -2061 4212 -559 -4426 2750 1934 -4720 522 3604
404 3604 -3517 -2185 4056 -615 -3858 2609 1949 -3905 985 3782 -3220 -1220 4634 -1034 -2962
419 -2962 3595 1226 -3778 1798 3475 -3613 -1212 4581 -1627 -3601 3688 578 -4596 1779 2818
434 2818 -4121 -1143 3965 -1782 -3395 3440 693 -4365 2074 3081 -3837 -389 4201 -1617 -2374
449 -2374 3614 853 -3409 2003 3038 -3302 -476 3846 -1711 -2289 3127 -26 -3227 1623 1734 -3162
465 -3162 -587 2749 -1836 -2188 2641 -329 -2997 1910 1388 -2795 241 2468 -1406 -1093 2571 5
481 5 -2090 2072 1521 -2367 764 2300 -1666 -525 2250 -666 -1764 1664 740 -2392 257 1673
497 1673 -1991 -930 1934 -1140 -1757 1526 276 -1904 492 1237 -1247 -358 1773 -567 -1123 1873
513 1873 413 -1389 1188 1104 -1178 287 1505 -631 -884 1361 298 -1535 556 809 -1449 -213
529 -213 897 -929 -802 582 -186 -886 182 299 -784 72 789 -670 -119 1082 -274 -287 978 280
547 280 -449 486 829 -274 -285 881 31 -611 495 99 -506 67 -161 -364 -26 -289 -422 -104 55 -512
567 -512 -468 546 -152 -885 651 503 -802 94 933 -2 -451 612 794 -448 -45 1002 -12 -364
585 -364 425 239 -128 -218 -47 129 -274 -333 -76 -172 -258 -448 -122 181 -564 -387 416 -72 -371 89 312 110
607 110 -177 328 521 -96 136 486 262 131 -102 295 492 -297 -160 393 -59 -386 -90 196 -335 -713
627 -713 178 134 -785 -246 248 -256 -318 7 144 -92 -181 371 186 -80 218 177 328 290 -89 300 397 -64
649 -64 74 165 78 -132 -198 251 -123 -553 -3 13 -325 -321 -271 40 -205 -448 215 44 -405 72 348 89 -271
672 -271 169 700 -128 -95 710 98 -160 459 339 -137 -91 307 128 -361 57 14 -437 42 -60 -516 -118
693 -118 -121 -258 -94 -156 -195 -124 139 108 -258 163 310 -163 406 424 -275 197 663 78 -170 341 353 -288 42
716 42 604 -510 -508 603 -29 -709 -89 90 -349 -313 102 -204 -542 141 140 -313 95 -105 -155 609 163 -448
738 -448 290 668 -43 -110 703 201 -702 695 946 -932 -414 959 -26 -687 208 214 -752 -219 616 -507
758 -507 -861 348 14 -367 152 -247 -395 423 368 -381 -96 563 -12 -90 865 21 -751 775 847 -630
778 -630 -178 560 -73 -229 360 -74 -811 181 497 -714 -252 199 -634 -16 650 -661 -838 683 520
797 520 -811 -24 850 -562 -255 1362 -38 -1099 668 1061 -321 -298 505 40 -235 551 104 -724
815 -724 62 225 -249 140 -382 -812 375 494 -815 -658 560 42 -770 550 494 -1178 34 1433
833 1433 -258 -892 603 727 -249 42 633 -201 -295 784 277 -466 -67 -8 161 255 -492 -573 249 179 -480
854 -480 -299 194 -490 -452 765 -37 -1124 261 815 -275 -296 374 147 -147 470 540 -439 -47 716 104
874 104 -6 101 -219 108 390 -65 -438 -94 177 -222 -199 83 -487 -396 475 -45 -579 -150 171 82 -130
895 -130 13 81 -65 266 289 -26 110 40 228 474 -88 -199 280 282 -72 -123 142 -65 -380 191 133 -643 -221
918 -221 316 -194 -334 -94 0 -143 -75 222 -100 -228 273 116 61 208 -22 172 364 70 28 147 155 24
940 24 1 269 -87 -341 272 38 -414 -68 23 -230 -224 -35 -22 -344 -162 198 -169 -114 113 -29 43 94 58 196
964 196 60 144 261 91 134 94 122 215 -62 24 109 -164 -7 62 -158 -180 -160 -48 -89 -246 -54 -78 -240 68
988 68 -38 -165 25 46 124 52 -41 198 97 92 270 90 94 150 103 193 -21 -35 145 -60 -13 17 -216 -84 -10 -163
1014 -163 -126 -223 -64 -76 -161 19 -129 -173 167 50 -109 125 79 72 112 173 160 -46 223 299 -116 99 231 -65
1038 -65 54 91 -79 -74 -41 13 -186 -200 33 -204 -192 83 -256 -181 158 -60 -124 41 145 -3 -56 271 57 -73
1062 -73 373 228 -74 217 180 -7 98 102 -16 -108 60 75 -222 -16 14 -313 -31 26 -370 -141 70 -76 -189
1085 -189 -38 113 -141 -45 274 -130 -67 385 84 -16 187 143 96 177 155 -35 -29 246 8 -184 128 -141 -251
1108 -251 182 -120 -408 -65 54 -169 -253 41 -75 -295 192 146 -334 24 285 -23 54 198 65 44 247
1129 247 252 -104 21 279 -58 35 241 -217 -98 231 -93 -261 -31 24 -218 -170 146 -281 -328 286 -6 -360
1151 -360 90 124 -86 52 181 24 -130 312 262 -149 147 233 -77 183 201 -164 -30 155 10 -147 -39
1172 -39 20 -231 -27 108 -348 -175 153 -204 -180 36 -71 -81 87 148 -97 -68 296 104 -65 264 44 -4
1194 -4 258 129 -28 77 86 12 -70 58 -22 -224 49 -11 -304 -20 -13 -221 -37 -55 -127 -104 28 54 -168 33 211
1219 211 -91 80 224 -46 115 247 42 44 109 157 -3 8 152 -98 -103 162 -113 -158 18 -135 -115 -40 -150
1242 -150 -149 -116 -3 -96 -147 77 -61 -84 219 -8 -98 254 130 -20 114 199 64 2 230 137 -202 174 210 -219
1266 -219 -29 112 -158 -115 21 -49 -244 -87 59 -184 -121 66 -179 -58 125 -103 -49 91 43 41 62 126 37
1289 37 81 260 17 -51 256 -5 -68 148 -14 -123 7 24 -123 -165 25 -56 -248 34 -28 -287 11 56 -141
1312 -141 -40 55 37 7 61 103 -61 104 177 -56 106 172 -44 107 137 -48 2 48 51 -93 -74 61 -173 -149 80
1337 80 -136 -249 26 -47 -106 -87 13 -6 -119 53 117 -85 88 144 32 111 104 88 125 90 124 25 28 114 -58 13
1363 13 51 -161 -75 31 -130 -122 -29 -82 -121 -105 26 -142 -173 117 -37 -148 111 30 -30 97 109 54 12 155 135
1388 135 -55 147 139 -121 96 118 -120 -32 35 -27 -114 -54 9 -170 -83 72 -177 -111 75 -137 -67 83 -50 -39
1412 -39 55 107 -29 -2 186 59 -33 239 81 -55 155 82 -25 -5 47 -3 -110 14 1 -188 -44 1 -179 -26
1436 -26 -16 -126 -30 -6 -50 -49 -16 51 -51 49 208 -34 33 203 13 27 125 72 44 15 124 23 -89 60 -28
1461 -28 -146 32 -83 -139 -37 -80 -103 -65 -35 -67 -90 -14 -6 -105 71 102 -53 80 111 1 63 137 108 20 70 159 -17
1488 -17 -1 112 -41 -66 68 -78 -86 -16 -70 -82 -117 -16 -83 -151 -28 -57 -112 32 -70 -7 65 -4 63 88 69 56 67
1515 67 125 88 -21 142 81 -45 98 35 -55 -2 -33 -4 -87 -82 -15 -140 -100 -13 -115 -29 -41 -82 21 -39 -28 35 9
1542 9 20 66 91 102 13 96 161 11 74 108 -17 43 37 -1 -18 -40 11 -27 -66 -15 -89 -98 23 -132 -111 25 -81 -31 16
1571 16 -39 11 -13 68 54 27 112 70 3 155 40 29 147 18 -32 44 46 -29 -66 48 21 -162 -6 3 -217 -69 20
1598 20 -105 -91 -39 30 -43 -51 80 31 14 90 -28 91 112 -6 113 155 23 52 77 97 1 -31 104 -57 -128 91
1624 91 -36 -170 -3 -23 -104 -99 -52 -13 -98 -13 24 -55 28 47 -24 97 58 10 118 61 18 76 77 100 4 71 103 -70
1652 -70 51 74 -101 -35 6 -74 -73 -53 -42 -106 -81 3 -107 -63 73 -67 -37 117 3 -36 58 94 32 -3 110 81 -6
1679 -6 112 75 -34 69 28 -31 8 -44 -49 -28 -40 -73 -110 2 -32 -163 3 12 -190 8 84 -93 -56 83 101 -68
1705 -68 40 161 -21 1 197 12 -1 73 61 23 8 -30 2 -14 15 -60 -86 27 -89 -125 19 -113 -131 12 -16
1730 -16 -92 -45 38 16 -66 92 79 -64 102 160 -25 73 104 59 35 59 104 -38 3 87 -67 -63 29 -79 -106 -28 -71
1757 -71 -106 -66 -39 -65 -80 -1 -36 -72 79 13 -46 106 36 21 67 87 28 23 102 89 -18 76 96 -77 31 48 -33 -24 8
1786 8 -41 -106 -32 11 -102 -120 72 -90 -109 43 -6 -45 18 43 6 -29 98 49 -28 66 85 -7 127 48 -33 37 32 7
1814 7 -1 25 10 -96 -12 35 -149 -64 47 -80 -73 9 -38 -72 -7 54 -37 -46 114 91 -10 79 38 19 88 85 54 11 32 50
1844 50 13 28 -27 -85 39 18 -110 -56 -37 -74 -45 -63 -53 -96 -26 36 -30 -53 81 8 31 99 14 30 52 115 65 -5 90
1873 90 67 -29 64 22 -54 13 13 -3 -42 -58 -11 -55 -65 -24 -88 -52 -12 -49 -31 -45 -24 43 -18 17 33 -6 73 81 -6 56 7
1904 7 52 128 13 15 24 66 61 -45 -29 15 -79 -8 29 -83 -79 -10 3 -72 -101 8 -23 -44 40 -9 -40 13 66 21 -4 10 75
1935 75 31 58 64 -18 28 61 2 0 5 -45 -2 -1 -39 -50 -58 -4 -40 -58 -2 -72 -50 24 -50 -32 28 25 29 -22 57 61 8 109 97 -21
1969 -21 71 68 16 24 3 10 -23 -11 3 -41 -66 -13 -56 -47 -28 -59 -9 -42 -71 -3 -10 7 4 9 53 -21 -12 113 18 10 75 40 41 27 41
2004 41 42 -22 34 71 -63 -29 15 -59 -57 -49 -9 -18 -95 -22 -22 -54 -12 -24 27 21 -5 64 38 -2 40 48 19 41 42 33 44 2 91 30
2038 30 -4 41 -15 -41 6 -55 -14 -29 -33 8 -71 -24 -11 -9 -6 -23 -39 69 -38 9 53 -7 34 55 18 36 39 55 22 28 53 2
2070 2 -27 52 -2 -31 -8 -17 -31 -36 -62 -6 -55 -21 2 -39 -34 -24 -25 46 0 -9 72 4 -18 33 28 45 39 43 66 -4 6 57 -1 -8 -1 0
2106 0 13 -52 -33 -3 -45 -41 -19 -50 -19 -56 -21 -6 -56 23 12 -27 37 20 12 54 50 65 71 15 57 72 18 57 -24 22 10 -55 -9
2139 -9 0 -14 -19 -22 -39 -43 -29 11 -30 -65 -4 -37 0 4 -41 13 55 30 33 32 70 49 4 99 -15 -38 66 33 -39 13 34 4 -34
2172 -34 7 28 -98 -15 21 -65 -40 -10 -49 -23 -3 -23 -33 -7 24 15 26 77 -9 18 88 -25 2 45 23 2 29 48 -20 -24
2202 -24 12 -4 -56 -5 1 -56 -20 -18 -43 -18 -22 -25 -21 0 35 -19 20 45 -20 39 62 -40 24 58 25 11 20 65 -4 -39 52 -17 -40
2235 -40 17 -31 -48 -18 -4 -6 -67 -26 -31 -54 -6 -2 -43 19 1 -10 32 25 21 54 -4 49 4 24 54 11 17 38 11 30 5 -34 28
2268 28 -11 -40 -27 -54 -4 -36 -30 -38 12 -55 -11 -61 1 10 -23 11 13 7 13 -13 22 24 18 44 18 15 44 28 44 -2 20 15 -21 -38 -13
2303 -13 -40 -10 -9 -57 -34 -54 -5 -13 -50 -28 39 -18 19 5 0 16 5 35 27 0 29 17 -8 8 14 -2 -26 -15 11 -18 -34 -9 -26
2336 -26 -39 -8 -50 -26 -16 -7 -6 -20 -8 22 -49 3 29 -7 31 41 5 25 3 46 57 -7 28 12 -1 26 -30 -3 35 -42 0
2367 0 -38 -31 -36 -54 -29 -53 -57 0 -39 -41 30 -24 -26 44 6 14 28 14 52 41 45 73 9 48 16 -4 31 -14 -31 -2 -12 -34 -31 15 -12
2402 -12 -20 -46 14 -46 -77 2 -7 -26 -6 -3 38 -1 11 -1 -7 36 19 6 42 20 27 20 -10 27 3 -2 -17 0 -13 -14 -28 -16 -22 2 -12
2437 -12 -50 -34 -26 3 -15 -25 1 7 -31 17 37 8 41 55 -16 1 1 23 -2 10 23 0 -32 10 39 -13 -12 -14 -20 -34 -45 2 -21
2470 -21 -15 6 3 -2 4 8 35 5 7 66 5 15 69 41 46 21 15 56 -8 15 18 -18 5 12 -30 -10 -49 -26 -28 -55 -6 -9 -46 -2 -43 -33
2506 -33 5 -30 7 25 -27 11 36 5 40 34 41 25 15 40 19 -5 35 19 -10 -5 -12 3 -19 -19 -1 -51 -20 -28 -67 -9 -42 -40 12 -20
2540 -20 0 13 12 -6 -10 24 41 10 35 59 4 26 31 7 -2 4 18 7 -5 3 -24 -33 19 -2 -30 -21 -31 -31 -22 -33 -12 26 -15 11 31
2575 31 19 -4 9 30 -7 -13 57 -5 6 27 24 -14 11 -6 -1 -28 32 -5 -38 -8 6 -59 -1 -3 -1 -4 7 5 -18 6 51 4 -7 45
2609 45 13 35 26 16 29 16 22 43 3 -14 10 22 10 0 0 6 -40 11 -11 -48 -22 -9 -9 13 -38 10 4 -17 12 -33 -10 16 19 -16
2643 -16 19 52 67 29 18 48 6 -15 24 2 9 12 -2 3 -36 -32 -16 -56 -2 -1 -49 7 -20 -37 11 -18 9 -6 -5 34 16 2 29
2676 29 5 2 19 22 8 -8 9 7 -20 7 30 -26 -12 -29 -23 0 -28 -23 -2 -54 -14 15 -42 -10 6 24 -36 5 18 33 -2 5 25
2709 25 24 39 8 19 -24 -14 11 -12 -2 3 -4 -24 7 -62 -13 -5 -34 -7 -18 -3 -23 -19 -6 -15 -23 7 23 9 7 7 18 13 0 3 35 -14
2745 -14 13 13 0 -21 -23 -4 -53 -7 14 -30 -32 -36 -26 -39 -35 -14 5 -8 -4 -33 -27 10 -16 -11 -6 41 41 32 2 41 15 43 49 25 16 0 -3
2782 -3 -17 1 1 -45 -30 30 -27 -52 -9 -13 -42 -12 -47 -10 -25 4 -5 -31 -33 23 4 25 20 -18 -26 9 -28 15 26 2 31 21 2 6
2816 6 6 21 -15 -7 6 -37 -28 -7 -36 -44 -24 -14 -5 -25 -13 1 2 16 -3 -23 25 15 20 12 17 -15 2 8 47 -11 -8 1 -6 -8 -22 -6 -3 -9 -23
2855 -23 -1 -7 -9 -24 6 -3 -37 -4 -1 -50 -5 24 11 0 1 3 25 6 41 21 12 0 1 -12 -6 -18 -20 0 -28 -39 -31 -25 -10 -26 -6 -20
2891 -20 -7 24 -10 0 -26 11 1 25 25 -4 22 16 10 2 7 41 5 29 18 13 18 -13 -14 -6 1 -1 -4 -3 21 -12 -6 -17 -37 -26 -8 -7 8 -21
2929 -21 -23 43 13 15 23 -12 19 12 9 28 1 5 26 -2 10 -1 20 8 -27 22 -23 -16 6 -18 -52 17 -6 -28 -1 1 20 -12 1 9 3
2964 3 -3 19 -16 19 36 -16 32 -16 12 -18 -15 7 -18 -12 33 -7 -19 32 -13 -28 -23 -3 23 -26 -4 -11 -19 25 1 -1 14 2 26 12
2998 12 9 10 22 -16 1 -18 7 -11 -2 1 9 -23 7 4 -28 -9 2 -38 -24 -14 -22 -42 -19 15 -37 -12 6 -22 12 -7 -39 13 17 20 9
3033 9 -32 -2 9 -11 26 26 -3 12 -4 0 -2 21 -6 10 4 -24 -25 -5 -20 -39 6 -19 -33 24 -26 -16 15 19 9 -7 -23 23 -6 -8
3067 -8 15 -2 19 11 12 10 -20 -5 10 -9 -3 -21 -6 -2 -34 -20 22 -1 -27 25 -9 -6 -9 13 11 -18 7 19 -2 8 33 -2 -5 19 -30
3102 -30 -2 -18 -5 -16 11 -3 -11 -7 1 4 -2 -24 -39 -5 22 -34 -14 -24 -15 -26 -6 31 2 -15 6 2 13 -12 -33 6 -26 -9 11 6
3136 6 17 -20 -24 -23 -1 -31 -16 -22 4 -5 -7 17 -2 -15 -21 1 -1 -19 -28 11 -29 -7 10 2 9 17 -5 17 -1 15 -16 -15 4 2 -14 -1 10
3173 10 -26 -1 -3 -9 8 -23 11 -14 -11 -2 -6 13 -5 1 -9 16 -21 32 -10 -11 12 14 37 -2 -2 14 19 7 -1 -3 5 6 3 6 -7 -12 -4 8 4 1
3213 1 -26 2 -17 -29 -25 -29 -21 13 -2 -35 12 2 22 5 -2 30 1 16 12 -2 -5 -7 9 8 -18 6 5 -9 -11 7 1 8 -9 4 -1 -1 -4 2 -7
3252 -7 37 -14 6 10 11 24 -18 -21 21 7 -7 -2 -17 5 9 5 -6 -55 -19 -24 -10 -19 -19 3 -39 -39 -3 3 -28 13 -6 -12 13 8 -16 -7 -16 -1
3290 -1 -6 -7 7 12 24 -2 11 45 27 -2 11 -19 -3 -3 -12 -39 -32 -29 -4 -42 -25 12 -32 0 -14 4 9 10 -12 -2 16 6 0 12 -6 -11
3326 -11 -8 2 19 39 -8 -6 9 35 2 7 -30 -21 5 -45 -1 -25 1 19 -20 -14 -17 -10 3 -10 -9 -11 -10 -4 8 2 11 10 14 -22 10 -7 -10 -17 -26
3365 -26 -7 5 3 -38 -21 -8 -21 -3 5 -8 4 -3 14 0 5 2 5 -5 6 16 5 3 21 -1 -3 3 10 5 -22 26 -12 19 -6 -40 -3 -14
3401 -14 -7 10 10 -35 13 -3 10 0 -16 26 -12 -8 -4 -35 -13 1 -9 31 18 3 18 -20 -3 -8 -2 -7 6 -28 2 13 -9 -16 -48 -23
3435 -23 -5 -23 -13 -18 23 -8 10 15 -12 -26 3 -11 -5 -14 10 -16 12 6 -10 19 13 18 -10 -22 13 -9 -23 8 14 7 -16 6 -5 -15 6
3470 6 -50 0 -29 -5 -24 -14 22 -12 1 11 -16 -11 3 13 21 41 0 4 17 -34 -13 -6 -15 17 -10 -9 -16 -8 12 -24 -26 -11 -14 -28 -20 -9
3506 -9 -25 9 1 -1 5 -25 37 0 3 39 -17 10 30 -9 20 15 19 8 -15 6 -19 -28 -2 -18 -25 -22 -41 -10 19 1 -4 0 -15 -24 -21 8 10 20
3544 20 5 5 -28 -2 -8 0 25 18 34 13 29 0 6 8 1 12 0 -9 -4 -20 -22 -25 -12 -29 -16 -9 7 -5 -17 22 -5 1 -20 -18 -24 15 5 7
3582 7 20 8 23 -6 -10 -25 5 -3 4 6 2 12 10 15 -20 1 -6 -11 9 0 -13 -2 3 1 -20 -4 31 3 4 27 27 10 46 -15 -16 -3 30 7
3620 7 3 -8 -9 -10 -1 -31 -20 -20 -2 -13 -13 -13 -5 4 -18 24 25 -10 -12 17 -3 5 -3 38 2 5 14 19 2 12 6 -3 3 31 -16 1 20 -20 -26 -4 -8
3661 -8 -9 2 -14 -38 -11 2 0 0 7 2 0 -15 14 45 6 23 -2 -16 17 -12 20 40 6 0 -8 29 10 10 -15 -3 -9 -30 -16 -10 -5 -1 -7 -5
3699 -5 -14 -19 -21 -10 -17 -17 11 -3 -13 10 -8 7 5 17 4 6 -2 19 -12 3 18 3 10 4 4 -20 9 -15 -5 -17 9 -2 3 -6 15 1 9 32
3737 32 12 -12 12 -4 -9 -12 -7 -2 16 12 24 24 -7 -6 -6 -23 -15 0 -24 -21 17 -5 -32 10 -15 -3 -29 -13 3 3 -6 10 -4 -13 -14 8 -4
3774 -4 -2 -8 1 0 18 -19 2 37 -42 -10 -19 13 0 -6 24 -26 11 9 3 -25 5 -10 5 5 14 -7 -4 21 0 19 0 31 -2 31 33 8 13
3811 13 -25 6 26 -13 18 16 11 -10 7 -3 -9 -16 -4 -10 -65 -25 -16 1 -34 23 -14 -20 -13 6 -12 12 6 24 4 -30 -10 17 -4 16 21
3846 21 -25 -9 -6 -4 -13 -6 -11 26 -4 -19 -5 -1 5 1 -41 19 11 15 -22 -21 -21 -18 -16 -4 -7 -16 18 16 -6 18 13 20 -7 -6 -10 11 -18 -11 -22 20 -22
3887 -22 -15 13 3 -23 -13 -18 -1 -6 1 30 -3 7 -5 12 15 15 -6 8 -16 12 -1 8 41 14 -21 5 -2 -4 -10 12 2 -3 -20 -10 -52 -34
3923 -34 -6 -8 -14 -9 -11 10 11 -7 6 -23 -9 23 4 20 16 3 14 13 -33 4 -7 4 -7 -9 -6 -19 4 -28 -14 9 -19 -39 -30 12 -24
3958 -24 -5 -6 -21 -13 13 3 -10 -16 8 -2 -5 30 -23 11 -25 -6 9 10 4 -4 -17 -1 -28 1 23 -17 -6 -4 16 13 29 3 8 4 3 -4 -7
3995 -7 16 -1 -23 15 -3 3 -20 1 21 7 -10 -11 -6 -16 -11 9 17 4 -20 -13 -38 15 -11 -30 -27 -2 -3 8 12 -23 22 -24 -23 3 -5 -2 11
4032 11 10 23 -16 -20 12 -17 -13 -6 11 -4 -19 -10 11 0 -11 -8 -7 -20 11 -23 6 7 18 -25 -10 2 -41 -13 4 26 -17 8 21 6
4066 6 8 40 2 2 35 9 -5 -7 18 24 -8 8 0 30 -19 8 -20 -42 -9 -37 -33 -14 1 -14 -4 -23 19 2 6 -2 -22 9 3 13 2
4101 2 -4 3 20 14 19 17 15 6 4 26 -12 -35 -4 8 -4 -9 -20 19 2 -9 8 -1 -7 -13 -16 -14 18 -39 -10 -14 -12 25 -2 -6 19 -18 28 -46 -6
4140 -6 23 25 -1 -5 -11 -17 -13 2 8 -12 6 -3 -8 -4 -1 -2 22 8 -4 3 -2 -19 7 22 -4 4 10 5 -3 -10 12 -4 0 -11 -25 -7 -4 2 9 -13 -43 -27
4182 -27 16 -35 -17 6 16 -16 -16 15 -6 8 17 7 22 -4 2 25 9 14 24 14 -24 -29 11 -22 -22 9 -27 -26 17 -13 -7 -11 -11 -33 -9
4217 -9 -35 8 -8 -30 0 -23 -22 -22 -24 13 -18 -9 -2 20 -2 0 11 -11 -11 -11 -10 -1 20 -12 -28 -10 -14 -24 13 12 -2 -32 -8 -25 -11 -6 -2 -1
4255 -1 -13 13 -21 -13 5 19 -14 -21 -32 20 8 -5 -12 -19 -17 -9 2 -28 10 1 14 -11 -12 -28 -12 4 -17 -15 16 17 -13 -1 9 6 19 -2
4291 -2 12 0 13 -13 -10 17 14 2 -17 -22 -9 3 7 28 -20 -13 -5 -37 2 -5 -9 0 -10 -2 0 3 1 10 -14 -4 8 12 -22 -4 19 4 -7 -14 -5
4330 -5 11 3 -7 -1 -6 26 3 -17 2 1 15 -31 5 3 -18 -6 -6 -28 -7 3 -3 -7 15 24 -4 27 -2 23 13 6 -18 8 17 41 -9 -7 10
4367 10 8 0 -7 10 -14 -2 -14 -11 22 12 -2 -20 7 -1 -20 -17 -40 -11 -23 -30 -3 4 -37 -2 -7 -9 9 -9 19 18 11 6 16 8 -7 -3 -5 -3 -10
4406 -10 -5 -7 7 8 14 -6 10 11 32 19 10 16 27 9 -6 -16 12 24 2 -6 -31 -15 -13 -18 -17 2 0 13 12 -15 -13 -19 -14 27 5 -19 -10 8 -18
4445 -18 -5 6 -27 3 21 -23 11 -13 -10 -6 23 23 -2 -19 18 2 -13 -1 -17 -10 -2 6 -5 -2 -39 -4 6 0 11 2 -1 0 3 5 -17 -19 -6
4482 -6 -8 10 10 -15 18 -3 -1 8 -19 29 0 -8 -5 14 9 0 -20 -44 4 -9 5 -13 -8 -12 -16 -23 -5 21 16 16 4 12 7 20 14 -5 18 1 1 -11
4522 -11 15 1 31 -1 -14 -2 -12 -4 -13 -1 -11 -14 6 11 11 -21 20 27 -15 -4 4 3 -9 -21 3 -12 6 -32 11 -16 16 0 -5 9 1
4557 1 1 -13 -12 -30 12 -25 -21 -7 -15 -27 -14 16 8 6 -16 -33 -19 -23 5 -29 -5 11 -22 -2 6 -4 19 9 7 22 -1 9 12 14 1 -12
4593 -12 -13 -5 -21 -5 -11 -11 3 -9 -32 8 -26 -15 4 -5 -11 -15 -5 3 -1 1 3 -1 20 8 18 -10 9 21 -3 7 2 25 29 19 -1 -7 7 -3
4631 -3 -27 -14 -18 -32 -8 -4 -12 -10 5 -30 4 20 -13 -6 7 -10 -5 15 7 -5 1 -17 -7 7 -24 7 14 -4 -23 -9 -6 0 -1 8 -12 26 11
4668 11 -26 -19 3 21 -22 0 -1 22 8 10 -10 -5 17 30 -1 0 24 5 -14 -20 -6 -17 -23 -18 11 -7 -28 -3 -15 -12 -1 -6 -1 16 -15 17
4704 17 18 -7 24 -18 2 9 -10 6 7 -8 26 21 -35 -5 24 1 -11 0 -24 8 -6 -14 -17 12 -30 -10 -24 5 -27 -12 -13 9 12 -7
4738 -7 -3 0 7 11 13 2 1 4 4 -7 16 -4 -2 24 9 4 2 11 -5 -21 12 -6 11 -5 -10 9 -2 -1 -7 29 -5 -26 -5 -9 15 4 -3 5 18 3
4778 3 4 24 -2 -2 -13 7 -17 -29 1 3 -3 8 -28 20 -11 15 5 -1 23 24 5 29 2 6 15 25 20 20 19 2 -7 2 3 8 -6 7 -7 -24
4816 -24 6 -30 21 13 33 -15 -10 7 -25 -41 -15 -6 3 -9 -4 -12 -17 -1 16 21 1 -4 -24 26 15 29 6 -7 24 7 20 13 3 -15 15
4851 15 -3 1 -3 -34 8 1 4 5 -6 -5 -12 -21 -17 7 7 -3 -9 1 21 -11 -6 17 -4 35 2 10 -27 -22 -11 10 -10 -9 -31 6 20 17 -5 -20
4889 -20 5 -32 5 -17 4 19 -19 6 -19 10 -5 -17 -3 8 -24 15 2 -13 16 -15 -29 21 4 26 -36 -19 34 3 8 30 17
4920 17 -8 -10 -9 -10 -12 1 5 11 -12 -19 0 9 -7 -14 16 -8 -15 0 -1 19 28 5 -3 -5 -2 -11 -3 3 0 -11 -31 -22 18 -7 -26 -28 33 8 -12 -2 11
4961 11 -4 -9 1 21 -12 -4 -4 11 11 -35 9 -8 -10 28 -9 -10 -24 12 -4 -4 -14 2 6 -22 19 17 5 -8 -11 -2 8 9 -17 -9 -21 -22 1
4998 1 3 -15 0 -2 -11 -13 38 0 19 6 17 29 9 0 -8 -16 4 -9 8 7 -14 -15 -5 1 4 16 -10 11 8 -15 19 -38 8 7 -4 1 13 20
5036 20 9 0 -18 -10 -21 1 2 22 -1 13 -19 18 -9 -4 -6 -11 -11 14 24 12 5 29 -2 13 4 8 -1 7 27 -18 -9 -1 10 4 6 17 -19 -11 14
5075 14 -14 -2 -3 -12 -6 4 20 -16 11 -2 19 -27 -3 -31 -24 27 -15 9 16 11 9 10 5 11 23 14 7 15 35 11 25 4 -3 15 -8 11 -14
5112 -14 -9 -6 4 -7 -6 -11 -3 -10 3 7 -9 8 -26 -27 0 4 18 -14 11 19 7 8 23 -8 -14 -15 9 24 23 -6 13 7 -52 4 18 14 -13 13
5150 13 0 10 -17 -26 4 14 1 0 17 -22 21 0 -2 -4 0 23 -17 13 5 -30 8 -14 8 11 17 22 1 -17 -10 2 13 29 -6 15 5
5185 5 3 15 12 28 -2 19 -10 15 9 24 30 35 -20 1 -5 -6 32 -4 -4 -13 2 -1 17 9 17 -19 -19 -13 -13 -21 16 -4 7 14 -15 -5 7 2 -21 1
5225 1 -2 25 28 -24 4 21 -4 17 -2 16 21 1 26 2 11 -1 -7 1 -22 -16 -28 -12 2 9 -22 -21 -1 1 4 -24 12 -1 5 0 -12 15 23 18
5263 18 5 9 18 -5 5 0 1 -9 -1 3 29 3 11 -5 16 13 0 11 -19 -27 5 3 -3 23 14 -14 6 1 8 -6 -14 25 0 12 11 7 -11 10 22
5302 22 -5 4 8 -10 11 38 -12 -35 4 -29 0 -5 15 -29 8 9 0 -21 17 -4 -10 -21 33 31 6 19 30 8 -4 5 16 6 -16 14
5336 14 7 -11 -30 -46 -25 -21 -21 4 2 24 6 25 -26 2 14 -12 11 12 2 24 21 27 16 -2 15 6 -15 -13 18 5 -42 -9 18 -20 -8
5371 -8 -22 3 0 -2 -2 -2 -11 -31 13 -4 24 1 3 5 -7 -10 -10 -1 2 4 9 -1 2 2 -9 -2 -6 0 13 15 -4 18 12 -1 -23 33 -13 -23 -16 -3 -5 -32
5413 -32 7 -5 -5 -9 -15 29 -19 7 23 32 30 7 -13 -5 23 -10 6 -23 12 -3 -13 28 0 15 -6 -4 -11 -5 17 -11 -22 24 13 -5 3
5448 3 32 34 8 9 20 28 -18 24 -8 6 6 4 -17 -6 -15 11 -17 -20 12 -21 -10 -14 -8 -12 -17 9 -2 12 -9 -2 9 -13 -1 2 -6 16 10 -3
5486 -3 21 12 5 3 21 -6 -4 -8 21 9 -20 2 -24 15 6 4 13 23 9 -3 -29 -12 2 -17 -25 41 19 -3 -25 -6 23 -23 18 24 7 9
5522 9 -1 22 5 21 15 -3 -3 18 -3 3 -12 6 4 -23 -18 -4 7 18 -1 -4 -8 -21 6 2 5 -5 -25 -8 -8 -2 14 -13 -6 -9 8 -16 10
5559 10 6 18 -21 -8 6 3 -10 -5 -8 33 -9 4 7 -29 -3 -11 8 7 9 -1 9 18 1 -6 10 -10 33 13 5 -19 -9 23 12 -6 13 10
5595 10 -4 -17 -43 -10 4 -15 1 1 -15 -19 1 -17 -8 -26 -14 -3 -14 -4 36 32 22 13 22 15 -15 10 17 5 -8 12 -5 2 4 33 -24
5630 -24 -3 -30 7 -9 -11 -12 -6 1 1 -8 -5 -15 -11 3 9 17 9 -9 6 -20 36 1 18 13 -21 17 11 -31 -2 -7 29 26 9 -16 -9 -10 -12 -3 -3 -4 7
5671 7 18 1 6 -3 -8 13 16 5 16 -28 5 8 -11 3 18 3 22 12 -9 8 2 10 -7 13 -15 10 0 19 0 -13 15 -4 -14 7
5705 7 12 -24 -10 8 25 -21 28 -4 -18 10 7 23 9 3 2 -6 -25 2 -25 -25 -5 -23 -16 18 -8 -20 3 -30 -6 -10 8 -6 27 -21 6
5740 6 18 0 1 33 10 -5 -39 -3 3 -12 7 23 -3 23 -16 4 -8 -6 4 -14 8 -33 18 3 0 -13 9 -4 -19 5 -8 -12 -23
5773 -23 -16 7 -12 12 0 6 5 -14 13 2 16 7 8 4 11 20 -5 -6 -1 7 -6 3 13 -28 -9 -22 -4 -12 7 -11 4 11 -11 -2 -1 -7 -9 5 0 11
5813 11 -30 12 15 21 11 -4 -7 2 2 1 -8 -8 19 -7 31 -13 11 1 -25 -31 11 9 13 14 -8 -1 -12 1 -23 -9 -5 -6 8 -15 -13 -12 -5 -15 2
5852 2 6 -15 11 -19 -7 -32 -11 -18 8 -21 -7 24 -12 -24 -6 -34 8 -14 6 18 18 -19 11 -3 11 5 -11 18 3 -4 7 11 -11 5
5886 5 21 4 -2 26 -7 0 -20 3 -24 -9 6 -20 -25 0 0 -34 -4 34 6 9 2 -9 6 -2 -1 33 19 -8 -4 8 2 -7 11 8 5 -17 14
5923 14 -5 -16 -5 9 4 -7 -17 -1 -7 -17 3 -6 15 -11 31 5 -16 4 -10 -3 -6 -7 -8 10 -24 -7 -15 15 5 -2 8 1 15 -4 5 -26
5959 -26 0 -21 6 -2 -11 -8 17 -20 20 -11 -6 16 19 -6 -16 1 -6 9 14 19 9 -1 2 2 0 -11 -25 -5 -5 -15 -17 7 6 15 0 12 8 -18
5997 -18 -5 -11 18 8 28 10 7 27 9 8 8 3 2 6 17 30 11 9 35 -14 -8 1 2 2 -4 11 13 1 -10 20 8 10 -6 1 -13 -5 -25 -5 -10
6036 -10 -8 7 7 1 -12 17 2 7 4 13 45 11 23 8 31 -22 22 -5 -10 -2 9 2 -9 -30 -7 19 9 26 -4 -18 -2 30 10 -7 8
6071 8 16 -5 5 0 5 -10 -2 -3 -8 -7 -5 9 27 -10 20 -12 20 4 4 16 -43 14 -31 16 -23 -23 -13 5 11 26 35 18 19 11 -8 -5 -3 -5 -7 -29
6111 -29 0 -30 0 10 1 -17 -22 22 -14 -13 -7 5 1 5 11 9 -3 12 -9 37 23 -11 -11 -8 -19 -1 5 20 12 9 7 2 9 8 9 -21 -11 27 4
6150 4 -32 -33 9 -7 -16 -34 -30 -3 4 3 -17 8 -7 1 -18 -12 5 21 12 -28 -17 25 8 -6 28 22 2 19 -9 10 25 -12 15 -14 -22 26
6186 26 -13 -1 -32 2 28 -15 -2 1 -21 5 3 -8 2 -11 30 -2 0 4 8 17 -11 8 2 10 -4 -26 -1 15 9 -36 -16 2 30 -9 8
6221 8 -3 5 -1 18 12 14 -5 -30 -2 13 -28 3 41 9 11 11 -16 13 7 11 0 -11 -6 -18 -3 -20 21 6 -12 -16 11 -24 -29 -2 -6 -13 19
6258 19 25 -11 -13 16 -3 4 -1 9 -4 4 -13 -6 9 5 0 -10 13 -5 9 -14 13 -3 -6 15 -24 -24 10 27 17 4 -1 7 -19 36 4 -29
6294 -29 0 38 11 -2 18 5 2 -3 9 -3 25 11 38 8 -36 5 22 -9 -26 2 0 -1 -13 3 -12 13 30 6 -7 -14 -14 -5 -17 19
6328 19 22 8 10 -9 -3 -11 8 21 -7 -12 8 -18 -46 -15 0 -17 17 -22 2 21 15 5 18 24 -26 0 23 -30 -44 17 3 10 11 -2 16
6363 16 -9 -2 -17 -6 18 0 7 13 -32 6 5 -1 -11 -19 0 -4 26 -19 -25 -30 2 2 12 -8 20 11 1 25 -3 28 36 11 -1 7 -28 6 0
6400 0 2 21 1 -7 19 -16 -5 6 -17 -16 -21 -25 1 12 -24 -26 23 -3 -1 -22 5 -14 19 11 8 -38 -7 18 3 6 40 27 -3 8 -1 17
6436 17 2 49 -23 23 0 7 25 0 4 12 -14 -12 -7 28 17 5 -19 -22 3 13 -14 -2 9 9 5 9 -6 29 -3 -2 26 -28 20 30 -27
6471 -27 -8 12 13 8 -16 -46 5 -9 10 8 10 41 -11 -8 -5 1 5 -1 12 18 -32 14 19 15 11 2 -19 -7 -3 -5 15 -31 25 -11 -5 -9 -13 -7 9 9 -8
6512 -8 -12 16 -13 19 -7 -35 -10 -2 -4 18 7 0 4 -24 -6 2 3 8 1 8 17 -11 -14 20 -14 -9 -5 4 -20 8 -11 -11 -11 14 -1 1 42 12 25 10
6552 10 28 -4 -6 -6 -4 -10 4 -9 5 0 11 -5 -9 9 -19 -3 -9 1 2 -23 -7 14 -1 -16 -17 -6 20 8 -25 0 7 -37 3 4 26 26
6588 26 14 2 -12 -3 -25 -23 -11 1 8 -3 -7 -25 15 -19 -9 -4 13 8 13 -18 -1 -5 17 3 9 16 10 6 9 -7 4 5 -15 -23 16 -7 4 10
6626 10 28 -20 -7 11 -6 12 3 -20 24 -21 -28 -36 -31 4 13 2 18 -14 9 13 19 9 -3 -3 -11 10 9 2 5 20 -3 12 6 -3 24 10 -7
6663 -7 -13 -13 -11 -3 -16 4 -23 -33 -3 6 4 26 0 6 6 30 3 -8 5 -11 8 -16 -9 -3 2 20 -2 -12 -17 -6 11 13 11 -2 4 -7 20 -17
6701 -17 -21 19 -15 6 -24 1 -12 14 3 -11 -15 2 0 -13 -8 -5 -9 -22 8 -6 7 -14 -5 16 -6 -2 -10 -35 -1 -6 -27 6 -11 0 -14
6736 -14 35 -13 15 -6 -9 -27 6 -16 -3 4 -20 23 -8 21 -28 23 7 -2 23 -3 5 -2 -5 3 -14 -3 13 8 -3 -15 -23 1 12 -18 12
6771 12 -12 -7 -1 1 11 10 8 -11 9 8 13 -1 8 19 21 -5 -11 14 8 27 28 4 5 -19 -47 6 2 -18 11 20 10 14 -16 -5 -22 -10 -5 1 -15
6810 -15 -41 -9 7 -8 -20 19 2 10 -2 -3 5 1 17 24 -10 13 18 -2 9 -20 7 -1 19 6 -12 6 26 -9 4 -4 -10 14 18 2 -23
6845 -23 -8 -10 3 9 12 17 -13 -19 16 16 -21 13 -3 -9 -10 -2 -16 1 13 -13 36 12 19 3 1 -3 -2 -10 6 -1 -11 6 11 0 17 7 0 0 -10
6884 -10 -9 16 -22 -15 6 6 9 13 18 -24 8 -4 -3 -27 -41 2 3 -5 -5 -5 18 -8 6 14 1 9 18 31 12 20 31 12 12 10 7 -6 -18 -8 -15 18
6924 18 14 -21 -25 -18 -9 3 -14 20 -5 -6 17 -15 -9 2 15 -14 13 3 10 25 -5 1 25 -3 -2 11 15 28 1 15 5 10 10 -19 -17 19 -16
6961 -16 -17 4 -19 -18 -21 -8 -26 -8 -2 5 22 2 -6 -22 1 -27 -4 24 14 -16 -18 1 -10 5 -10 9 -2 23 -12 24 -7 9 0 -10
6995 -10 -23 -43 -3 -10 5 -11 -20 -9 -3 24 22 28 33 6 22 0 19 0 5 9 6 35 -38 14 5 9 13 -17 16 -9 24 -19 20 -14 15 -5
7031 -5 -16 -10 18 23 4 -23 16 24 -12 3 2 2 -2 12 17 1 -6 6 6 5 6 -30 8 -5 -11 19 -4 25 1 -13 -9 -36 -11 -19 -17 6 3 -15 -2
7070 -2 -7 -2 17 6 5 25 -5 4 20 14 13 6 2 -7 12 27 -13 4 -4 2 -5 -17 1 6 25 -11 2 -4 1 2 -7 -39 9 -28 10 19 6 19 10 15 16
7111 16 4 -15 6 -15 19 -13 -17 -2 26 16 15 15 -5 10 9 1 5 0 8 30 16 -10 18 14 -34 -11 0 28 -3 11 -15 18 9 -11 -3 -4
7147 -4 27 15 30 4 -23 8 -31 -1 -4 -10 -1 -16 5 6 5 -2 27 -20 -13 8 2 -5 -3 6 17 32 7 -10 -9 -2 5 19 -37 -23 -10 8 4 -8
7185 -8 -2 23 1 2 -26 -13 -17 -24 -5 -4 -26 7 -7 12 -11 -1 6 -14 8 0 -21 1 4 7 19 11 2 8 1 6 9 -5 1 -13 21 0 -3 32 -10
7224 -10 22 8 -12 -24 -16 12 -8 31 16 -1 1 -3 38 -28 13 19 -6 24 -15 0 -24 9 -8 11 -12 3 -7 -8 -11 -8 -15 8 -14 10
7258 10 11 11 -4 -3 8 17 9 -2 -1 -8 -8 -2 -7 -11 3 -17 24 -5 18 -30 2 -11 -3 12 -23 -5 9 -15 1 -1 -4 26 5 1 40 -13 -14 7
7296 7 10 -1 -7 47 -6 17 30 1 4 14 -10 -10 -11 -5 10 19 12 -11 -18 -3 -9 2 -3 -12 -1 -8 19 -18 15 17 -7 -5 -11 2 12 10 14 18 14 0 13
7337 13 3 -30 16 9 15 20 11 7 -13 19 13 -8 -11 -7 -1 -5 15 15 20 -9 -3 26 -19 -10 5 8 15 4 6 -19 5 21 -4 -7 -7 2 8 -11 -2 12 -18
7378 -18 -27 38 0 7 -13 -20 2 14 28 -2 16 2 42 -15 -22 3 1 2 -9 -7 24 33 9 -2 11 -10 1 14 -19 24 -4 5 -13 7 -19
7413 -19 1 3 1 3 4 4 29 2 7 7 9 23 -14 22 -10 -2 2 33 -19 20 -23 11 5 -20 13 7 4 2 0 19 15 5 1 -5 17 -5 0 -12 19 17
7453 17 -2 -8 -8 -19 -18 -4 -4 -2 20 -2 6 9 -14 28 -1 13 -6 20 41 30 31 6 11 28 -7 2 1 2 -24 -19 -4 2 -30 -5 10 8 32 -1
7491 -1 12 -19 -1 -24 9 -2 -5 11 -5 10 30 -22 -10 -8 -42 -10 -8 3 22 15 19 -12 10 30 23 -8 -23 11 41 -21 -24 -18 4 12 -16
7526 -16 13 8 -11 -25 4 3 -10 -13 15 -11 -38 -16 -18 14 -10 -11 -13 0 -23 -38 -23 13 -10 -3 -4 1 24 -19 -3 -11 19 13 -4 8 2 0 -6
7563 -6 4 17 -5 1 -7 -17 6 -25 15 -13 7 10 1 -36 -17 0 -9 -18 -5 -3 -18 -12 -12 13 3 3 12 11 -6 -3 9 17 1 -19 7 0 13 -14
7601 -14 0 -5 3 -14 -4 -16 5 -19 -6 10 -10 10 -5 10 -12 -1 -12 5 5 36 11 24 8 7 -11 -14 -8 -22 -13 13 -7 -20 8 -4
7635 -4 0 3 -9 -8 -7 -17 0 5 -18 -12 -7 -17 -1 -26 -23 -5 23 11 6 17 -6 -4 -8 -16 -3 -28 -5 -5 -19 -31 3 -8 7 -15 -10 -6 -9 -9 -19
7674 -19 -18 15 34 18 21 -4 -2 2 0 7 25 9 4 7 25 15 27 11 -15 0 18 23 -27 -8 -4 16 -1 15 3 -21 14 -25 1 12 8 -32
7710 -32 -4 -17 -10 0 -25 -26 -14 -13 3 10 17 9 -9 -15 12 4 -29 -1 -7 11 -10 -6 -5 -22 -3 -14 14 9 -1 -3 12 -8 -6 -3 -22 14 5 -22
7748 -22 -27 5 10 -21 1 17 2 10 -14 -27 -16 -13 -17 5 28 -21 -9 -9 13 -25 -13 8 12 9 -14 3 -6 -5 -10 0 19 9 -1 22 0 16
7784 16 -2 -14 -17 -42 20 -1 9 -15 10 27 -9 -1 -7 1 6 -22 -5 -22 -7 -17 9 -18 28 -18 -5 -16 -13 -15 -6 13 11 2 -10 53 35
7819 35 -11 11 17 5 9 -7 7 21 25 11 -13 9 19 -10 2 -19 16 12 -19 -8 -7 -21 -11 54 -2 29 2 -49 9 14 -11 20 -17
7852 -17 8 5 12 -27 4 -8 23 -14 -17 -31 -2 -25 -17 -5 -4 5 4 23 -9 -8 0 -16 36 19 -5 -9 8 11 6 -7 -26 -2 8 -7 -14 -4 -13
7889 -13 -6 24 2 26 -24 -23 7 -17 -11 34 5 -9 39 -5 11 -20 10 -3 8 11 21 8 23 24 -21 2 -5 28 -3 3 0 -28 8 -6
7923 -6 -11 -8 -9 -10 3 -9 -5 -20 -22 14 6 7 8 13 1 -1 26 -7 34 36 14 7 3 3 9 15 -3 15 -25 -8 -2 -9 18 -8 4 -18 -2 5 0 -35 -32 -25
7965 -25 -25 4 0 4 -17 4 8 -25 12 -5 10 -14 9 17 25 22 -8 -17 4 -1 4 21 12 -8 4 2 26 3 -18 9 1 7 7 -3 18 31 -9 6
8003 6 26 -17 16 9 19 12 3 -5 -1 -3 19 -22 -12 10 2 -26 12 23 4 3 -4 20 4 32 -2 12 -17 -13 25 2 4 4 8 18 -3 -4 -12 7
8041 7 17 11 16 -11 13 -9 -9 0 -1 -7 -22 -7 -20 -22 -33 -5 -12 18 -24 -3 -9 -1 -1 -9 12 2 -4 28 -7 16 51 -9 16 2 39 21 19 0
8079 0 0 4 -4 0 5 -19 7 21 8 -6 40 -13 -21 4 -3 -24 -3 26 0 -6 2 16 -16 14 2 6 -22 23 -12 11 4 -2 13 8 -15 -15 27 -2
8117 -2 -19 -10 10 -34 0 9 -17 17 20 -6 -26 -15 12 15 11 1 -4 3 26 9 7 16 -4 -3 -6 1 17 -18 21 -5 0 19 24 14 13 -16 10 -15
8155 -15 -11 -5 5 8 -10 -11 22 6 -17 9 21 -16 14 4 5 18 19 -5 3 20 -17 -19 -5 -3 -15 -8 -3 -34 4 -34 -10 -17 -10 -2 -25 -12
8191a2
$$ Imaginary data points
##PAGE= N=2
##DATA TABLE= (X++(I..I)), XYDATA
0 0 0 0 0 0 0 0 0 0 0 0 0 0 0 0 0 3 -8 8 -8 8 -8 16 -16 16 -24 24 -32 33 -40 48 -56 62 -72 80 -88 97 -112
37 -112 128 -140 156 -176 193 -217 239 -265 289 -321 353 -389 429 -474 522 -574 634 -702 775
56 775 -859 957 -1069 1202 -1361 1553 -1794 2103 -2523 3122 -4044 5677 -9380 35283 -36167
71 -36167 -74385 74027 24475 -67089 14070 58162 -48290 -30705 56575 9051 -48465 8827
83 8827 21240 -11670 1441 4345 -17896 6696 13574 -15339 -386 16329 -22172 -9074 38770
96 38770 -4613 -44087 21012 33664 -29880 -11007 32115 -11807 -23124 30150 11959 -34516
108 -34516 2714 27064 -12070 -8719 14737 -11249 -9675 23206 -786 -25282 9370 14758 -17243
121 -17243 -190 18008 -17268 -14803 26929 5577 -27531 3626 18695 -9703 -5309 12795
133 12795 -5350 -10363 12888 6660 -11180 818 4687 -4659 6616 5675 -14607 -2105 17359
146 17359 -3862 -14889 9764 6718 -16383 2285 17923 -12568 -16850 16863 10564 -17819 -4551
159 -4551 14546 -1910 -10479 7406 7010 -9863 -3653 10894 4026 -8619 -4070 8633 5245 -7705
173 -7705 -2741 8229 -492 -8175 4682 8064 -9533 -7775 12409 4060 -14246 -535 11090
186 11090 -4670 -7907 7039 3122 -9390 177 9398 -3006 -7177 4403 4327 -2998 -807 2411
200 2411 66 -815 1531 1571 -894 -880 605 1428 770 -2093 -1200 2134 -82 -1983 200 -2 -1436
217 -1436 -183 880 -911 -1825 590 836 -957 62 98 -687 1164 967 -859 118 1262 421 -256
234 -256 889 922 -1031 211 1893 -563 -1251 707 570 -629 -892 189 181 -1341 -516 644 -652 -1301
252 -1301 -191 865 -340 -1634 711 1332 -1364 -351 1851 238 -1107 700 1938 -401 -1063 1799
268 1799 1067 -1335 218 1301 -107 -915 -51 934 -473 -1458 346 543 -1108 -1196 380 704 -1619
285 -1619 -1104 1821 -83 -2181 851 1764 -1144 -1103 1932 1194 -1856 247 2635 -537 -1264 1575 1108
302 1108 -896 -505 1182 524 -1429 -326 1122 -391 -1409 -263 833 -543 -1838 563 1003 -1955
318 -1955 -663 1706 -375 -1516 768 1345 -857 -390 1686 2 -696 1439 391 -644 1032 380
334 380 -609 774 539 -1133 -135 1420 -913 -1748 1463 139 -2466 670 1117 -2193 -691 1605 -636
351 -636 -1550 927 541 -1299 794 1070 -1492 669 1834 -1326 164 2235 -1074 -990 2744 412 -2883
368 -2883 1345 2694 -2916 -1054 3533 -1752 -3136 3103 701 -4161 667 2731 -2855 -1562 3198
383 3198 -1253 -3113 3256 1029 -3953 1726 2980 -3132 -163 3997 -1605 -2521 4062 1174 -4279
398 -4279 1928 3570 -3821 -653 4397 -2266 -3142 3777 546 -4422 1314 2703 -3784 -887 3793
413 3793 -2520 -2915 4007 -40 -4058 2456 2266 -3737 500 4018 -2501 -2213 4646 166 -4026 3140
429 3140 2478 -4143 862 3999 -3056 -2028 4148 -460 -4043 2485 1896 -4437 382 3592 -3500 -2101
445 -2101 3999 -897 -3638 2622 1602 -3682 668 3529 -2597 -1642 4075 -360 -2928 2944 1473
460 1473 -3055 1202 2837 -2291 -1054 3170 -644 -2735 2255 811 -3261 935 2005 -2853 -896
475 -896 2405 -1218 -2111 1803 404 -2582 968 1892 -2340 -304 2643 -1130 -1225 2367 171 -1753
491 -1753 1558 1616 -1812 -20 2362 -1023 -1302 2151 -168 -2048 1293 825 -2055 -142 1292 -1238
507 -1238 -1174 1302 -374 -1818 1094 627 -1861 410 1318 -1192 -256 1549 -230 -990 1306 969 -1222
524 -1222 411 1574 -838 -334 1433 -342 -806 790 189 -861 13 435 -786 -431 566 -720 -809
541 -809 704 -350 -931 524 160 -811 117 704 -261 -412 831 429 -534 540 644 -266 285 446 -57
560 -57 245 152 -132 108 157 -238 -428 345 -69 -1053 177 482 -1036 -457 653 -271 -843 168 574 -527
580 -527 -428 878 154 -540 486 554 -20 67 285 450 143 -46 336 170 -4 -88 -40 221 -383 -548 298
601 298 -98 -695 -186 -4 -226 -465 -121 179 -360 -285 279 68 -89 4 206 527 -39 -70 659 271 -143
622 -143 295 490 133 -315 346 507 -546 -291 418 -212 -456 -89 -57 -267 -440 -29 -54 -483 -127 -4 -71
643 -71 52 -227 52 399 -48 47 344 218 136 119 427 286 -212 284 407 -105 -62 1 111 -43 -392 39
665 39 34 -565 -212 143 -218 -513 -179 331 -255 -524 407 99 -431 297 356 -139 17 403 356 -148 193 453
687 453 -49 207 366 -221 62 223 -141 -66 -113 -240 -187 -62 -79 -470 -228 96 -405 -117 232 -483 -173 528
709 528 -50 -281 255 423 -116 54 745 -44 -419 810 461 -497 114 466 -77 -188 169 -23 -434 33
729 33 165 -491 -228 -69 -423 162 -32 -730 -43 445 -204 -414 369 290 -617 366 1068 -642 -440 1233
749 1233 407 -626 352 600 -292 -121 797 -108 -819 446 353 -548 -78 -99 -559 158 164 -632 -439 299 -89
770 -89 -487 348 60 -847 465 906 -636 -348 793 247 -201 431 289 -418 326 854 -370 -326 537 -211
790 -211 -131 603 -485 -882 513 483 -978 -545 655 -440 -773 857 41 -1364 370 1085 -463 -602
808 -602 503 313 -249 423 395 -485 157 705 -40 94 41 -441 450 684 -683 -686 574 234 -857 49
828 49 467 -1111 -449 1222 -328 -1351 329 757 -472 -336 474 -46 -368 645 435 -485 77 405
846 405 266 380 -157 -291 497 452 -313 -226 324 -115 -450 506 64 -1189 15 780 -507 -767 125 57
866 57 -396 68 305 -522 -291 700 142 -245 162 56 220 505 90 -199 131 453 82 -129 247 -129 -275
887 -275 460 76 -662 -156 201 -59 -318 -267 -82 -220 -68 77 -302 -177 4 42 311 -80 -288 352 405
908 405 -27 2 268 214 -88 268 411 -372 -139 563 26 -337 -12 30 -115 -211 2 -169 -405 28 28 -302
930 -302 -93 -146 -73 211 -49 -137 129 133 51 45 273 121 -169 373 353 -217 51 312 -33 -65 65 59 -215 -175 187
955 187 -182 -346 0 -157 -187 -84 -164 -109 -94 -128 96 -52 -53 70 55 195 54 47 266 54 80 251 35 24
979 24 144 92 59 -129 35 80 -211 -32 -36 -305 -125 -78 -135 -133 -262 -27 -45 -155 56 -26 -92 102 100 107 36 23 279
1006 279 109 48 272 1 93 220 23 -3 -32 -1 49 -139 -52 -87 -260 62 -55 -331 -84 -72 -157 -82 -70 -26
1030 -26 -147 -1 225 -139 -26 294 38 52 247 75 79 149 188 78 -30 186 17 -142 157 -111 -240 108
1052 108 -84 -236 -80 -60 -123 -220 -12 -30 -260 79 133 -270 39 200 -34 86 112 35 58 186 207 -58 48
1075 48 262 -84 16 220 -188 -128 191 -36 -253 -133 26 -177 -243 62 -200 -337 181 -6 -254 22 48
1096 48 -19 57 92 27 24 253 188 -92 259 172 -90 308 152 -260 62 214 -71 -194 -8 14 -307 -5 96
1119 96 -466 -224 201 -178 -213 0 -92 -112 73 133 -132 -76 323 79 -23 313 -21 -6 409 134 -138 118
1141 118 211 -16 -83 196 -89 -321 219 52 -439 -59 65 -278 -202 24 -147 -246 50 135 -305 -66 257 -113
1163 -113 10 232 -84 35 308 117 -7 77 218 39 29 246 -136 -153 266 -79 -235 28 -65 -187 -45
1184 -45 -18 -172 -250 93 -14 -289 59 46 -207 155 101 -118 110 167 98 23 125 168 -33 161 179 -159 66
1207 66 179 -106 -21 29 -133 -129 -37 -33 -208 -144 70 -190 -169 82 -177 -96 171 -55 -43 85 153 49 13 186 79
1232 79 -25 287 82 -78 182 61 3 110 -16 -44 -12 -13 -64 -162 -36 -76 -257 20 -101 -304 75 32 -224
1255 -224 -44 96 -11 -81 158 174 -153 130 353 -72 33 330 47 25 168 93 -50 -9 161 -55 -162 115
1277 115 -99 -169 69 -193 -209 38 -74 -145 -72 -33 -82 -46 140 -12 -148 196 111 -66 224 106 -48 135 188
1300 188 6 -40 133 128 -123 79 74 -212 -9 117 -170 -129 -41 -111 -116 -92 -26 -160 -108 105 -122 -83 113 -49 15
1325 15 147 15 51 167 128 43 22 189 18 -78 188 21 -148 86 39 -134 -80 -48 -49 -175 -63 10 -227 -103
1349 -103 72 -125 -96 17 -38 30 7 70 42 12 168 48 73 200 16 37 205 5 -33 74 9 -33 -50 34 -79
1374 -79 -217 48 -26 -250 13 -7 -203 -22 15 -103 -105 35 94 -114 46 171 -47 87 262 0 36 169 67
1397 67 43 70 118 -40 -70 120 -70 -134 87 -107 -178 19 -84 -153 -75 -49 -115 -151 17 -42 -165 98 90 -121 96
1422 96 146 -16 79 141 120 25 97 149 -2 -8 149 -38 4 59 -115 -25 7 -71 -96 -70 -16 -89 -91 36 -137 -135 107 -25
1450 -25 -97 84 57 -5 19 103 80 -18 130 157 -40 122 115 -16 91 37 -53 -8 -11 -21 -85 -64 -12 -164 -70 15 -168
1477 -168 -77 30 -115 -64 17 -5 -25 8 139 4 -28 191 75 -10 172 89 18 84 54 22 -22 23 31 -72 -4 -13 -163
1504 -163 -36 -58 -141 -55 -84 -100 -57 -67 -11 -39 -3 26 -65 96 79 -57 113 108 29 66 73 71 68 43 88 35 8 41 -11 -42
1534 -42 -2 -111 -56 -35 -165 -54 -63 -125 -81 -84 -12 -71 -61 56 -26 -45 103 27 41 95 42 60 78 52 72 25 82 30 -27
1563 -27 54 -35 -60 36 -64 -76 -16 -85 -76 -62 -28 -40 -99 -13 6 -90 26 -6 -73 105 34 -26 97 96 46 6 84 106 -79
1592 -79 22 132 -95 -38 95 -83 -136 -29 -16 -76 -130 -27 -43 -117 5 -66 -47 34 -73 5 72 -46 -17 110 66
1617 66 5 21 178 47 -60 165 98 -79 56 85 -35 -36 -14 -1 -66 -82 -4 -91 -93 -40 -127 -77 -43 -145 -11 20 -73
1644 -73 -16 49 49 9 63 160 4 57 177 23 24 133 13 35 43 37 2 -45 20 -50 -112 23 -81 -169 16 -69 -150 -5
1672 -5 -18 -76 -92 17 22 -72 27 59 -31 57 98 25 88 38 17 107 59 2 1 74 65 -83 29 36 -155 -51 98 -128 -136 6
1702 6 16 -132 -99 109 -54 -129 123 22 -94 52 75 30 3 29 68 50 77 29 -37 44 36 -44 85 11 -136 53
1728 53 40 -106 -71 2 -56 -131 -27 -1 -173 -46 74 -116 -47 86 8 6 28 105 19 28 156 35 -23 145 49 -18
1754 -18 55 -1 -33 2 12 -45 -78 -34 -36 -121 -8 -61 -153 -15 -5 -95 -25 -14 -26 -37 55 89 -29 58 119 -28 41 159
1782 159 8 22 92 55 4 18 69 3 -46 49 19 -128 10 -30 -123 -42 -49 -66 -73 -42 -6 -83 -50 39 -59 19 38 -32 9
1811 9 89 41 41 71 56 15 59 87 -30 -38 127 -25 -85 46 -3 -82 -41 26 -30 -154 4 34 -130 -33 6 -99 -6 16
1839 16 -25 -8 10 38 17 -2 64 -19 65 85 -28 2 53 0 -3 -2 -41 -73 -34 32 -75 -133 11 -20 -54 -19 -56 -50 -8 24
1869 24 29 -36 6 80 7 48 90 9 110 86 45 11 12 84 57 -38 39 -14 -70 30 -30 -73 -79 -83 -19 -19 -86 -26 -51 -6 -6 -53
1901 -53 -22 -10 6 75 13 -29 60 83 88 7 7 113 24 7 105 -20 -19 48 53 -3 -89 4 17 -107 -44 3 -135 -56 -12 -67
1931 -67 -32 -64 -11 4 -50 57 0 -15 80 35 40 46 3 64 42 17 35 28 58 29 -32 28 -22 -49 -10 -35 -77 -34 -35 -19 -60 -51
1963 -51 -1 -64 -7 39 -45 -1 68 6 30 33 41 1 46 56 21 -36 66 29 -7 27 -44 -30 -15 -54 -32 -31 -57 -10 -36 -19 -17 -55
1995 -55 40 -20 -72 55 16 -21 12 40 43 23 42 92 -9 22 81 25 15 41 4 3 -34 -16 9 -67 -58 -28 -65 -53 -68 -53 -3
2026 -3 -112 -27 -1 -63 14 -12 25 31 -6 50 71 -16 84 48 9 63 46 51 76 19 29 -12 -38 27 -53 -57 -22 -54 -3 -63 -53
2057 -53 -22 -68 -58 -6 -63 -22 -10 7 -8 -34 24 33 -19 30 51 -16 55 65 43 22 8 56 19 -32 22 -2 -15 19 -32 -8 -40
2088 -40 -94 18 -12 -53 -14 -39 11 -14 -34 14 -29 27 64 18 -4 36 24 18 -3 -10 69 -21 -36 23 -29 -29 6 -8 -19 -85 -35
2119 -35 -12 -61 -43 -2 -58 -5 -9 0 12 -7 32 28 18 74 1 14 71 -11 28 66 -17 31 39 6 10 -30 -2 -4 -53 6 -58 -44 -23
2152 -23 -58 -33 -18 -43 -53 -25 -13 -9 -23 47 26 -51 65 65 -10 45 77 37 13 42 59 -18 34 56 -15 -35 32 -18 -20 5 -51
2183 -51 -35 -25 -15 -43 -73 -12 -47 -78 17 -24 -31 39 14 -12 -7 21 2 14 44 28 -21 50 84 -26 24 36 -14 0 33 0 -23
2214 -23 -16 -3 -35 -34 2 -39 -36 33 -69 -18 42 4 -22 2 28 24 5 59 61 -14 43 27 -8 26 -25 11 -24 -6 6 -52 -39 15
2246 15 -57 1 -1 -76 11 -11 -30 -23 16 17 6 -14 28 18 32 47 28 42 52 43 54 23 -8 29 -2 -10 19 7 -35 -26 -45 12 -45
2279 -45 -32 -19 -32 -72 -32 -43 -44 -12 10 0 -26 11 14 -17 40 43 -13 25 35 70 24 7 46 25 10 40 7 32 -6 -23 -9 -11
2311 -11 -21 -17 -44 -27 -11 -52 -31 -40 -20 -5 -27 -13 7 -15 8 15 12 8 10 30 18 5 46 33 8 49 34 15 9 -5 -15 -20 -40 39
2345 39 -56 -47 2 -6 -31 -6 -14 -14 -16 -22 49 7 -1 9 5 24 17 35 25 0 28 14 -15 18 2 8 10 -18 3 -4 -32 1 -43 -25 -10 -4 -12
2382 -12 20 -35 34 6 -1 37 3 22 30 1 24 32 -9 67 27 -3 15 23 24 -18 -10 33 -26 -39 -6 -43 -41 -11 -46 -39 -37 -19 -1 -36 -24
2417 -24 27 8 -17 -11 11 25 -8 42 50 34 57 28 34 32 9 41 10 -22 5 19 -21 10 11 -26 -38 -39 -8 -26 -34 5 -45 -43 -20 -44
2451 -44 -14 -2 -12 25 13 11 4 -13 28 42 -25 8 23 17 12 -22 30 8 -27 14 8 -40 -3 22 -18 -22 -50 5 -14 -45 10 -10 -25
2484 -25 4 11 -6 18 29 28 11 4 55 -9 28 28 0 -9 -25 -17 3 -11 -6 -25 -29 -8 -37 -34 17 -40 -33 17 -2 2 9 -9 13 22 30 40 1
2521 1 48 53 8 86 28 30 11 -19 1 -5 6 -28 -35 -17 -21 -56 -21 -39 -76 -25 -2 -47 -27 -1 -13 -23 -8 41 -21 36 65 7 19
2554 19 40 44 40 43 46 15 -5 39 -4 -11 40 -5 3 3 10 -42 -10 -41 -5 -24 -34 -14 -46 -11 -5 -29 -1 -19 1 38 -6 -12 4 20 1
2589 1 8 37 41 -20 29 46 -29 -12 19 26 -30 -10 21 -5 -51 11 -16 -53 -9 -13 -30 -20 -3 6 2 -3 25 -23 -23 30 -14 -9 23 0 1 10
2625 10 -10 -8 -22 -10 1 -33 8 14 -26 -3 -31 -25 14 -22 -6 -14 -5 2 -5 4 -4 8 3 12 -9 45 -8 -7 20 50 37 17 4 26 2 3 31
2662 31 -6 -9 -11 -38 -27 -41 -39 -9 -44 -17 -23 -29 6 -70 -16 37 -3 -13 21 13 14 32 30 52 32 -2 44 34 26 11 9 17 -15 0 35 -26
2698 -26 23 -3 -43 -33 -32 10 22 -28 -16 -32 -48 4 1 -15 13 0 27 13 23 32 1 29 46 12 29 24 15 14 46 -11 -16 -3 11 23
2732 23 -39 17 1 -27 -3 -10 -23 5 -13 5 1 0 24 22 2 -19 -5 28 -1 5 38 -6 -22 12 27 23 -22 -41 -6 -43 -20 -7 -5 -24
2766 -24 2 -38 -15 9 24 1 19 26 8 5 -19 25 8 38 18 20 41 11 24 14 -18 2 -12 26 4 -17 -21 -10 -60 -6 -9 -17 -34
2799 -34 -77 -28 -30 -32 -21 -42 17 28 3 35 19 24 39 13 12 42 -1 39 18 12 26 28 0 26 -9 3 -4 -22 5 -21 -15 -28 -42 -21
2833 -21 -15 -19 -4 -46 -12 22 -35 -6 -8 -23 17 -3 22 -7 11 6 46 10 35 4 36 33 8 -6 -8 13 13 7 -22 20 13 12 1 -32 -14
2868 -14 12 5 -10 -14 -4 -28 -16 14 27 -10 12 -20 6 10 -29 7 7 -7 17 -1 -5 -3 -24 9 -27 -17 4 -12 -32 5 -4 -25 19 2
2902 2 5 5 12 39 1 42 53 15 7 7 16 36 6 22 6 15 41 6 -39 -7 -22 -20 -23 -12 -26 -32 -55 -31 -38 -26 -5 -10 4 0 17 12 -12 -11
2940 -11 36 -9 30 29 47 20 32 31 44 12 2 -40 26 8 -6 -18 -4 -26 -32 -31 -17 -18 -37 -29 18 -21 -12 -5 -47 -18 3 -2 -13 8 28
2975 28 49 18 17 11 16 38 12 39 31 7 7 5 16 2 -8 -7 -12 -16 11 5 10 14 12 -13 28 -1 -1 11 12 -3 19 21 28 12 -19 32 -34 16 18
3014 18 -29 18 12 -14 -8 0 -2 -4 -2 9 27 -9 7 0 -12 14 -12 18 21 33 -1 -9 33 -4 -2 17 33 -10 16 38 -8 16 10 -2 17 -23
3050 -23 -27 -7 -18 -10 -8 -13 -24 -40 -20 -13 -18 -33 -18 2 -8 -10 24 17 -11 40 -14 43 27 23 60 23 25 17 18 25 14 20 40 -17 -20 6 -8 9
3088 9 2 -36 -6 -21 -18 -15 -19 7 2 -10 -11 8 1 2 42 22 4 3 28 2 23 21 1 12 -6 -1 17 -10 -3 11 7 33 16 -32 29 -20 -15 21
3126 21 8 -1 25 3 6 -19 5 39 -4 11 1 15 -23 26 11 -29 17 8 7 -38 -2 10 -10 -4 0 12 14 -12 -13 -5 -31 1 -3 -10 -20 -3
3162 -3 0 32 1 26 14 1 30 9 6 23 15 14 6 -20 12 -24 18 -9 -13 -2 -23 -22 2 -10 -25 -11 -7 -11 24 -3 5 28 -8 14 3 32
3198 32 8 7 20 25 3 33 23 27 15 -9 16 12 -7 11 11 8 1 -24 -3 -29 -16 8 -12 -31 -11 -15 -18 -15 -10 8 -4 -2 -7 19 -22 16 -4
3235 -4 4 20 30 24 13 -12 0 4 42 -9 3 10 -7 -11 10 -5 -4 -25 11 -14 -2 -7 -8 4 -9 4 7 -5 8 16 23 -2 9 5 -8 22 -19
3272 -19 14 -19 -6 -13 -16 4 -21 -2 -10 -5 8 -16 -7 -27 -12 3 4 13 -6 4 6 27 29 19 3 19 0 -1 24 -9 22 23 -9 6 -15 12
3308 12 4 -10 0 -26 -26 -10 -13 -6 -15 4 -28 -5 -23 8 -7 -14 34 2 13 25 10 28 7 59 33 28 35 36 17 12 -5 10 -16 4 0 -4
3344 -4 -22 -14 -18 -13 2 -17 -12 -3 -20 -3 -12 7 18 -8 5 -3 -7 25 3 3 33 29 13 11 27 -5 29 22 18 3 45 5 14 26 -24 -6 15 3
3382 3 -12 18 -20 17 8 -1 22 0 -5 19 -9 0 -30 -5 28 -26 -6 0 -24 -28 -18 4 -4 -32 -6 -19 -32 34 -10 -39 2 4 -9 19 21
3417 21 -16 13 -10 20 13 8 25 -4 9 -1 26 1 -17 -14 22 -30 19 14 -18 22 13 -24 -12 -20 -11 -17 -10 -28 -24 -31 -16 -17 -6 -8 -22 17 -2
3454 -2 -9 3 4 54 16 -2 5 15 1 18 9 -10 42 -2 3 28 13 3 -28 -4 6 4 -13 -2 -26 -20 1 18 -3 -24 3 8 -28 11 0
3489 0 -15 -5 20 5 -7 6 10 -12 11 32 23 7 33 3 20 27 25 -7 33 1 2 33 3 17 5 28 -7 13 13 -21 3 28 -18 5
3523 5 -2 -4 10 -27 -19 -14 -22 16 1 -31 -10 -30 10 0 -15 12 -4 -17 -3 -10 -13 39 -2 19 20 6 17 19 12 19 17 20 9 15 38 -5 36 21
3561 21 12 -1 -9 0 0 -2 -3 0 -8 2 7 -27 -12 -30 -10 -34 -18 6 -18 2 -7 -22 21 6 10 29 29 15 11 -7 25 3 18 39 1 -2 9
3598 9 9 16 -3 -8 -10 2 -22 10 7 -10 -4 -11 -15 -25 -5 2 -29 -22 -5 -18 1 -7 29 0 10 -4 48 -9 -7 32 0 19 2 5 23 5 -13
3635 -13 23 3 -2 12 -11 1 -3 -6 16 -12 11 8 -24 37 22 0 -12 -7 15 -9 12 1 15 14 13 18 -26 -14 -2 -5 13 -28 -2 -1 -1 -12
3671 -12 10 6 -5 11 26 4 17 22 -3 -8 8 20 4 10 -1 19 -7 5 1 18 -13 16 3 7 -13 -40 -37 -21 -12 -21 -48 -24 -12 -24 4
3706 4 -18 -12 -11 -15 11 9 1 33 -13 17 3 2 34 24 19 32 25 -22 -19 15 28 -18 5 -10 -50 1 0 -21 -27 -44 -6 14 -9 -9 -17 -28 1
3743 1 23 -4 -8 8 13 26 22 28 -8 20 26 32 3 7 -3 30 15 7 13 1 25 22 8 -2 -5 -5 -9 3 7 -10 -16 -2 -50 -20 2 -10 -8 38 14
3782 14 -8 -4 -19 -10 11 -21 10 -11 -5 14 -20 -27 -16 4 14 15 -10 15 -5 12 4 -32 26 18 23 27 28 45 7 1 13 24 44 30 5 31
3818 31 32 -13 -7 11 8 -9 2 31 11 -6 3 -19 2 -19 -7 -31 -11 -15 7 -14 -8 14 -5 4 13 12 34 7 15 33 25 7 42 6 -10 13
3854 13 32 31 0 -2 18 -2 17 7 -7 14 -47 -7 16 -25 -4 -10 -3 -22 -13 41 2 -2 -13 14 22 5 16 16 10 16 -9 18 9 14 28 5
3890 5 -14 21 7 -2 4 13 -7 8 13 0 26 -16 -6 -15 -9 -11 10 -17 0 -7 -26 0 11 27 5 -14 -3 -20 -14 -13 -2 -7 -18 -16 -8 8 -19
3927 -19 23 2 -8 -19 13 -18 -2 13 -1 7 4 13 24 37 16 -4 -2 10 32 12 -20 -12 1 -18 -9 12 -14 -6 -13 -4 -17 -23 -14 -11 -50 -19
3963 -19 -33 8 26 17 26 15 2 1 4 9 25 -25 27 16 7 49 15 27 26 7 38 17 -25 20 4 -2 6 6 20 -9 -16 -6 22 7 -14 -26
3999 -26 -31 3 2 -5 -12 -38 -4 6 21 4 8 -8 42 1 -13 20 11 8 21 12 3 -1 17 10 31 31 7 -7 19 -15 15 -4 16 22 -16 2 11
4036 11 20 -10 7 -11 -19 -21 6 11 11 20 7 -39 -42 -15 -22 -63 -10 34 4 13 -12 -10 -3 27 3 8 7 -4 -10 33 4 13 29 8 16 6 18 7
4074 7 -10 13 27 -3 10 -9 -31 -31 1 -7 -13 -6 7 -6 -17 12 -13 -18 -20 -32 -5 -22 -5 4 -8 4 -26 11 12 5 50 25 13 -5 4 17
4110 17 19 34 -4 5 -15 7 10 2 -14 -7 -1 7 -9 -7 -37 -6 -13 -19 -6 -5 -4 11 -17 -18 -7 8 -15 18 -16 17 7 -16 -9 0 -4 -16 23 29 20
4149 20 -11 1 9 0 0 13 7 11 -14 -15 -2 -24 -22 -31 -21 13 -33 10 -34 7 21 -28 -3 -14 -24 -15 8 -15 -3 9 -13 -1 -35 -4 5
4184 5 -17 6 -22 -2 17 -20 11 -19 -18 7 -5 25 -3 1 -25 1 15 29 40 7 5 -6 -6 14 15 26 23 -27 5 -18 -28 7 -16 -30
4218 -30 -5 0 7 -11 -15 7 17 5 8 7 12 -6 24 12 0 58 0 5 5 15 21 2 4 31 24 1 -1 22 9 0 -3 9 -11 12 -17 -21 12 13
4256 13 -17 -2 -11 0 -34 -26 -1 -25 -17 19 -1 21 2 -18 18 16 -7 18 1 23 20 11 -12 4 -6 7 11 -18 -13 -29 -11 25 6 13 7
4291 7 -28 -20 -2 11 9 -19 -9 -38 -20 -28 -7 -10 -24 -28 30 2 7 13 -18 4 17 -8 5 -30 21 22 -24 -10 3 16 31 32 -6 7 -3
4326 -3 15 17 -2 8 22 -12 12 9 10 18 9 1 -15 -7 -27 -29 -16 -27 -14 -22 -26 -33 14 -13 0 -6 10 -30 -4 2 -9 -9 0 22 17 1 36 -2 8
4365 8 -3 11 37 15 -1 20 32 40 10 -2 17 3 3 -6 -15 -17 1 1 -15 -37 -24 -5 -40 -21 -27 -8 1 -3 10 24 -4 17 9 21 -6 -5
4401 -5 18 0 21 40 -12 -13 34 -8 4 -11 -17 -15 4 -28 4 14 7 3 -20 7 11 0 4 7 -16 -21 -35 -23 -16 -29 -32 -4 6 20 -18 -22 0
4438 0 -29 19 -12 1 25 -7 -7 -12 5 25 -15 18 6 8 16 9 23 -15 -9 5 48 13 -8 29 -22 -4 20 27 1 9 2 8 6 -18 -10 -10 -43
4475 -43 -22 17 -19 2 -44 -7 -23 -20 -19 34 2 4 15 21 -5 16 9 20 -3 19 28 27 21 7 24 11 3 0 -8 26 -10 2 21 -23 -18 -17 -25
4512 -25 14 -25 6 -11 -24 6 -6 -9 -4 -18 -14 3 27 13 -12 12 -12 15 31 14 18 31 17 -5 15 12 15 9 1 27 39 11 7 13 3
4547 3 29 5 -14 7 -20 -26 6 -6 -2 -9 -5 -25 7 -7 -20 -5 -6 0 -17 -6 -6 5 -40 3 15 -19 -15 9 -8 17 -2 -2 -2 -19 1 -2
4583 -2 20 -7 30 36 30 27 5 3 20 9 -16 14 11 1 -5 -10 -6 10 18 14 -6 2 -15 2 -16 -6 -32 -12 -24 -20 -7 39 14 15 18 7 15 6 9
4622 9 30 21 18 26 -2 43 26 33 30 40 0 -14 -6 13 12 -5 -17 -11 -7 -18 -14 -26 -31 -18 -4 -5 -5 1 9 8 -17 -28 -4 -9 -1 -12 15 0 31 -10
4662 -10 33 30 -1 3 2 -21 11 5 -25 2 -22 31 -4 18 -11 -19 -15 15 6 34 -9 -4 -1 1 -7 18 9 -6 -12 7 -22 0 3 -1 -18 -14 23 -23
4700 -23 4 -9 0 -7 10 12 -1 -3 19 42 -2 -17 26 5 10 10 7 0 19 28 9 -13 -1 21 8 13 -5 11 -17 -7 -20 -47 -11 -10 -15 -27
4736 -27 -5 -12 -1 -12 -23 -16 -5 15 -1 -20 -18 7 18 36 18 7 23 -12 14 18 19 6 18 25 15 16 -5 10 -5 22 4 2 -3 10 -32
4771 -32 -22 -37 -15 -20 -18 -43 -22 19 20 -10 2 3 -10 -6 -5 -26 -4 33 6 23 -7 8 -6 13 -6 5 3 9 -11 -21 -3 -4 -3 -5 13 -21
4807 -21 -2 2 0 12 16 -5 -6 9 -24 -8 4 -22 -21 18 -25 -23 -29 -7 -12 -9 -2 -8 11 5 -9 24 -2 -32 -4 11 -10 15 -1 10 10 -12 6
4844 6 -20 -4 7 -13 4 7 18 6 8 8 5 2 -19 1 14 -20 -31 -9 -10 5 -44 2 -10 2 7 -11 -12 10 1 -28 2 -4 10 20 -2 14
4880 14 4 4 28 1 28 15 26 15 39 15 -12 19 -9 15 -1 -16 12 -16 -18 -11 -18 1 -19 -20 -25 -3 17 -16 -23 -17 -1 -11 5 -4 2
4915 2 2 -8 2 12 27 14 16 6 10 -9 7 -3 21 12 27 34 -3 -6 -18 1 1 -10 10 -11 -33 -22 10 -4 -8 -14 -10 -4 -8 2 10 -6 -11 -10
4953 -10 -24 -7 -23 2 -1 13 -9 -15 20 5 -20 -11 55 23 -13 -9 47 21 12 -6 -16 17 21 28 -19 36 20 -10 8 1 -16 10 7 -3 -3
4988 -3 -13 -16 0 -33 -8 -36 -8 -6 -50 8 6 8 -4 -11 20 10 6 16 31 -5 14 32 17 20 11 -1 14 23 9 -8 -9 16 10 -21 9 0 -27
5025 -27 9 6 -19 3 -25 -11 -14 -37 -26 -7 -6 -7 -2 -24 -6 7 -19 -7 -10 5 -6 11 18 22 16 0 5 18 0 8 -19 47 1 13 11 -14
5061 -14 11 -13 -10 -2 -16 -9 2 -4 20 -7 -9 -21 22 -3 -15 46 0 10 -12 19 5 -17 -1 -13 -26 10 16 -27 -14 -14 3 2 4 0 10
5096 10 -10 20 6 28 37 30 13 21 20 -29 -2 33 20 -6 31 -3 -20 -4 3 -8 9 -16 -15 -47 9 -22 -1 -2 -18 -23 -14 -5 -18 4 -5 -22
5132 -22 2 16 10 2 15 15 31 0 19 -11 11 12 6 24 10 10 23 10 -1 -5 -14 -3 -18 -23 -12 14 -15 -17 -23 -1 -39 -13 -11 -35 -15 -8 -11
5169 -11 17 -25 -8 11 -21 -10 -10 5 -15 17 -5 16 12 -18 40 18 31 1 8 -6 -1 -31 1 12 -2 21 12 -29 -10 -7 -19 0 -12
5202 -12 -35 -5 -9 -8 3 -2 -11 11 11 -28 5 13 2 4 -3 1 18 14 15 19 10 15 9 1 -8 7 9 33 -6 1 19 -3 2 19 5 2 6 -4 18 -21 -9
5243 -9 -3 -4 18 -19 -19 -25 -26 -22 -23 -24 -10 -17 3 -1 15 -20 34 -18 2 -24 3 -9 -1 14 20 19 18 10 39 41 -7 -4 21 4 -8 14 -3 -9 -13 -4 -24
5284 -24 0 -3 -8 -31 -8 -19 -21 -27 2 -23 -8 -22 -7 -24 -36 3 -8 -9 23 12 -5 11 3 16 -4 10 16 3 5 35 5 -11 12 8 14
5319 14 -9 3 -4 9 4 -4 -9 -22 1 -25 -23 -21 0 -10 -2 -22 -15 6 -17 -8 11 0 7 -4 -3 -23 -16 5 -18 11 -1 -14 13 34 0 8 -6
5356 -6 9 11 6 9 32 -2 27 10 6 3 25 -11 31 -13 -8 10 17 -14 -22 -16 -20 -40 0 3 -21 -3 -30 -32 -9 13 2 0 -4 7 15 6 -14 -1 14
5395 14 22 -2 -25 13 36 5 6 -6 37 14 17 21 5 13 2 -5 9 1 19 8 -20 -31 -25 -33 -31 -29 1 -27 -13 -2 9 -14 1 -9 -8 -21
5431 -21 -3 24 5 4 -6 12 10 8 -4 -24 18 11 -9 4 4 0 12 -5 -6 -22 13 -9 2 -10 -18 -2 -19 -15 -1 -1 5 8 -3 1 0 -7 2 -2 -13
5470 -13 -13 -19 -13 -22 -9 0 9 -1 8 -14 -10 3 14 26 15 8 6 17 5 24 20 33 22 25 17 -3 -3 -2 7 -1 3 -31 7 16 -11 -24 2 -11 -17 2
5510 2 -21 -18 -63 -21 -32 -31 0 -29 8 -15 -8 -1 15 29 15 27 8 9 11 29 39 5 17 27 10 -2 -2 22 -11 -8 5 -2 -16 -6 -25
5545 -25 2 -17 -35 -26 -3 8 -7 -3 -14 -18 -19 -7 -14 31 1 -4 -3 -6 23 -10 16 -1 10 9 16 12 12 31 8 -9 18 -3 3 4 -14 13 3
5582 3 1 -25 -19 -7 8 -7 -6 -32 -12 -5 -20 0 -10 -23 -23 -10 17 -11 -2 -15 -16 -16 16 0 -7 6 -16 13 -9 11 5 14 -6 9 4 15 0
5619 0 33 16 1 34 19 -3 1 9 -23 0 0 12 19 -5 -1 -30 -7 -22 -5 -35 -16 -6 -14 3 0 -5 -33 -41 21 16 16 4 0 0 9 26 1 35
5657 35 6 -5 14 9 30 12 1 32 1 1 -10 -6 6 3 12 1 -21 -40 -27 -29 -9 -21 8 -8 -43 -27 -29 -32 -38 -13 -16 6 10 -13 -3 8
5693 8 -1 5 43 19 -13 10 -5 30 0 6 1 1 11 -18 7 2 28 4 -13 -6 -2 -20 -32 16 -14 -10 -32 -25 6 -36 -13 11 -8 -27 -27 -11
5729 -11 -2 -34 10 5 -19 7 31 1 -16 -20 -7 -4 -7 6 -5 -20 20 28 -2 11 16 -11 26 1 -1 -6 17 10 -7 2 -14 -2 17 3 -6 5
5765 5 -21 0 -18 -35 -40 -19 -12 3 -22 0 -22 -13 -1 -22 -13 1 9 -9 -3 15 11 12 4 25 21 -16 15 30 12 -3 20 -16 10 -30 1 2
5801 2 -22 -27 -23 6 -5 4 8 -37 -35 -20 -38 -35 2 -8 -4 -39 2 13 12 0 9 -15 3 14 9 2 1 14 16 29 4 7 5 1 26 12 30 25 -6
5840 -6 20 2 -28 3 -3 11 -5 -31 8 -11 2 -14 -2 -14 -2 -8 -12 6 -29 -14 -50 -5 24 13 13 6 -5 -2 10 5 28 15 0 -9 12
5875 12 9 10 10 14 2 24 6 16 1 -17 -18 -9 14 10 -12 9 -17 -12 -5 -11 -27 -8 -30 -9 -25 -21 -21 -15 -1 -24 -15 5 -20 10 32 -7 20
5912 20 27 15 9 9 1 21 21 15 28 26 5 14 9 12 9 -17 27 -24 -17 -53 -9 -5 -23 -5 -6 9 3 -4 -6 -11 -8 -5 -14 -26 10 -21 5 -19 -16 -18 9 1
5954 1 6 6 13 2 8 16 10 -12 9 -2 -7 10 -14 -9 15 -7 -24 15 -8 5 -8 -22 1 -12 -3 -16 -18 -13 -19 -2 -16 -15 -24 -6 11 -37 -4 -3
5992 -3 6 20 -31 -3 13 10 16 -19 13 -3 -19 8 29 -5 -11 7 -11 19 44 13 0 4 10 4 11 -4 -13 2 -15 -22 -41 -22 -14 -6 -55 -20 1
6029 1 -16 -2 -27 -27 5 -8 -43 1 -13 10 24 14 6 10 25 -15 30 34 33 20 18 16 6 15 12 -8 -21 -22 -7 -8 -8 1 -8 -7 -13 1 1 -19 -15 -25
6069 -25 -45 -18 -45 0 0 -26 -11 6 -23 10 25 29 -7 17 2 43 28 -12 29 6 -19 10 10 -16 5 9 -4 -7 -30 -6 -29 -16 -7
6102 -7 18 -15 -9 9 -12 10 -14 9 -5 -5 -34 -13 -7 -10 11 -28 -1 -40 13 -18 -7 -24 -2 -4 12 -3 22 5 -16 2 11 1 -11 8
6136 8 15 2 15 6 15 -16 -7 -6 -9 0 5 -23 -4 -19 -39 -9 -12 -12 35 -4 -10 2 -12 -27 -25 -7 7 -8 3 -17 -6 -1 14 41 26 28 10 26
6174 26 28 30 20 22 11 8 14 15 12 19 8 -7 -2 -14 -22 1 0 1 3 -15 -18 -33 -16 -32 5 -9 -13 10 14 12 -18 8 8 -1 6 -18 26 11 3 6 14 22
6216 22 14 23 8 16 -8 6 7 -8 33 -10 -11 16 9 9 -13 -15 -4 22 0 -5 -8 -7 -7 -9 -1 -12 11 -11 -6 -8 3 2 -6 -10 12 -22 8 5 9 29 17
6257 17 26 -18 -17 27 10 0 11 -12 4 15 -24 -1 2 35 17 2 -18 -13 -9 25 19 -11 1 -30 1 -13 -28 -21 -30 -3 -5 -18 -32 -1 -8
6292 -8 -9 15 14 -15 13 30 16 -5 31 34 17 34 16 26 30 4 5 23 -1 20 24 0 -16 25 0 -14 4 -15 -31 -14 -32 -14 -31 -20
6326 -20 -28 -17 -5 -44 10 -16 -40 -2 -18 -7 -9 20 22 0 14 1 9 13 -15 -7 9 4 6 1 32 11 15 -8 3 -7 15 8 -22 -37 -3 0
6362 0 -27 -34 -7 -6 -7 -21 -8 -2 -37 -29 -25 -17 -18 -23 -1 -5 -9 1 -12 2 8 5 7 12 18 22 -6 18 49 -2 -5 -4 27 28 3 15 12 9 3 -14 -22 -3 10
6405 10 0 9 -11 -16 -25 -30 -33 -18 -20 -25 -29 -18 15 -7 22 -3 -16 -2 23 6 11 -1 44 4 4 -11 -13 35 -3 10 10 0 2 3 5 11 21 -2
6443 -2 16 18 3 -20 -29 -20 6 3 -24 5 -39 -35 -9 -12 -10 -22 -10 -9 -17 10 0 -9 15 -6 2 8 33 16 1 21 31 11 -5 16 8 -3 0 -10
6481 -10 9 -29 -20 2 -17 -11 -7 8 6 -25 -16 2 4 0 18 -19 -1 5 -41 -2 -17 -28 -19 10 -31 -12 23 13 18 -34 24 -5 7 2 -13 4
6517 4 11 27 15 3 12 17 -13 -13 23 14 9 32 0 5 0 -15 22 -41 -26 -6 -8 3 -4 -7 -24 -27 -19 11 -1 -12 -1 -15 -16 -10 0 -6 6 24 18
6556 18 -6 12 0 23 28 22 25 32 35 25 -8 25 5 -8 18 8 1 -7 0 2 20 -29 -11 1 -18 -18 10 -16 4 -22 -36 -15 -26 -22 -18 -6
6592 -6 13 18 -16 13 -17 4 -17 1 6 -8 -6 13 -7 6 -18 6 12 1 8 -9 25 -3 -6 13 -2 9 -13 18 -26 3 -17 -13 -4 5 -15
6627 -15 -14 15 8 31 22 -7 7 20 -2 -5 -18 -9 -1 -32 0 15 12 41 -14 -2 7 3 -13 5 3 34 15 -4 11 4 -8 11 33 -4 35 12
6663 12 -7 2 -8 -7 0 -27 -21 -11 -2 -31 -59 -33 6 -28 -6 -22 30 1 -22 -29 -4 4 -5 3 6 5 6 4 27 40 14 9 -4 22 1 12 6 -1
6701 -1 -6 -3 -11 0 8 18 -5 -23 -18 17 6 -8 2 -30 -19 -5 -4 12 -22 -43 -26 3 6 1 0 -4 23 19 0 26 21 13 29 16 14 2 29 5
6739 5 32 1 -15 16 -12 13 4 12 -16 -14 7 5 -13 14 -4 -10 -19 -20 -8 11 -4 -17 -13 -16 1 -10 11 -5 -19 -2 -7 -2 -18 14 -9 11
6775 11 13 19 -20 18 2 -20 16 30 15 -8 11 6 -1 -9 -2 10 2 -10 -17 -9 1 6 -14 -37 -30 -18 -24 -3 -13 -18 -33 8 -12 4 9 -19 3
6812 3 -5 -5 4 5 13 16 -13 -3 1 14 15 -3 1 11 -2 10 8 25 -12 -11 13 -36 -32 -8 -22 -38 -6 -35 1 -25 -14 -13 -3 25 -23 6 -5
6849 -5 -29 -26 14 1 -29 -12 -19 1 -1 10 4 0 -4 3 -1 1 19 -13 -11 -8 -11 -5 -22 -9 2 -27 -7 0 -39 7 -11 3 -20 0 5 -29 9 -14
6887 -14 -32 -10 -7 -23 -3 -4 -13 -12 4 -26 5 -3 -6 -9 -6 -6 19 -5 10 12 13 -12 11 26 -10 13 -18 -28 5 -3 -15 19 10 -4 -1 -26 -8
6924 -8 -22 -21 -12 13 -17 -33 -30 -7 16 -3 -9 -31 -15 -26 -1 -8 -29 -11 -17 -6 -2 -16 35 18 17 -6 6 0 1 -7 -4 -1 0 7 10 -10 -9 -18 -12 13
6964 13 0 -36 -50 -22 -26 -16 -21 -19 -33 -12 -18 -30 -36 -38 -9 -7 -3 -12 -17 12 -3 17 -7 -12 -2 0 19 -9 16 12 5 13 18 9 14 -8 0 -26 -3 -6
7004 -6 -20 -1 -17 -8 -13 -3 -15 -25 -13 10 -9 -27 -9 -16 10 -18 -14 -10 5 16 -18 -15 5 1 -16 35 25 -4 -3 23 -4 -16 -2 35 -12
7039 -12 16 21 13 25 -14 -10 18 -4 2 3 -6 5 -8 7 -13 -5 -26 -31 -36 -33 -14 -19 -33 -35 -28 -22 19 -7 17 -4 7 13 -11 2 -2 2 13 -6 22
7078 22 29 19 12 24 -29 -2 12 4 -4 -1 17 6 -23 -22 -9 0 -3 -1 0 -8 -10 -35 -1 -2 -26 -46 -7 -18 -28 12 -29 9 -18 14 1 -21 1
7115 1 21 2 17 17 21 29 33 25 -21 9 11 8 34 -16 20 -1 -11 33 9 34 -6 0 -17 2 17 2 -7 -17 -17 -27 -14 -6 29 -27 -13 -15 -44
7152 -44 -26 -28 10 -11 -1 26 -17 16 -12 -9 -3 16 22 4 -21 31 22 5 16 -5 2 18 9 -4 4 12 -22 -2 -6 -30 4 4 -7 -18 4 -16
7188 -16 -12 -22 -22 -3 -6 5 8 16 -25 -5 -1 -3 25 -8 6 10 10 20 28 -12 -6 -1 38 10 19 -1 31 15 14 24 -5 -3 -15 7 -31 -8 -27 -12
7226 -12 -25 8 -31 -27 -29 3 -5 -27 -7 -21 4 -16 29 -6 -23 -4 1 7 21 8 -17 24 21 2 16 -9 -2 8 13 -19 11 0 -6 10 12
7261 12 -33 8 -13 -13 -14 -11 24 -11 19 -35 -30 -40 -36 -3 -14 0 -21 8 -3 -23 -2 2 10 1 -23 6 -4 10 31 9 -9 20 -11 -14 -8
7296 -8 -5 11 7 -15 17 20 22 -18 18 12 4 -7 23 -28 4 -30 -13 -3 -19 3 -32 -16 -18 -30 -18 10 3 -12 7 20 -4 -18 -20 -2 8
7331 8 -28 4 -1 -14 28 -1 10 -1 25 16 8 16 -3 21 -7 2 2 3 -7 -10 -23 -20 -24 -4 -13 -15 -15 -30 -26 -33 -26 -16 -20 -8 -13 0 -21 -4 7 -15
7371 -15 -2 -3 20 -2 3 3 16 11 29 -3 6 10 45 7 4 19 23 31 7 -7 3 -29 18 -7 -11 -8 -28 -6 -22 2 -11 -12 -13 5 -11 7 21
7408 21 -10 -32 -15 -23 -7 -14 -14 7 7 2 12 -3 -2 24 -17 14 22 20 11 4 22 -3 -3 14 1 -19 -8 -22 0 -11 -14 2 -13 -24 -1 -1 -12
7445 -12 -27 -13 -37 -7 -27 -29 -9 0 -34 -23 -17 -10 -8 -12 -4 -17 27 -5 8 18 3 -5 -2 -7 32 -18 -10 -29 -10 -7 -30 -5 -11 -3 8 20 -23
7482 -23 -10 -12 -12 -15 -11 -18 -18 -8 -18 -18 -7 -5 -16 -11 -12 -33 -13 6 -6 35 8 12 12 6 -3 45 8 5 6 -13 -12 19 23 -9 5 -21 -13 -15 4 -4 -40
7523 -40 -21 -10 -43 -23 -2 -7 -17 -30 -2 -16 20 -26 -20 16 -14 -11 -9 -7 2 -13 8 1 -5 -3 1 -9 39 2 14 -23 -13 24 8 -3 -8 33
7559 33 14 -1 -10 11 -3 -8 -9 25 -13 -13 -20 5 -18 -9 -7 -34 -25 -13 -13 -45 10 -24 -4 -6 -10 -4 -1 -21 -6 10 -28 3 7 9 -1 5 19 14 27
7598 27 44 27 23 5 9 5 -2 29 -3 -10 -36 -15 -21 -10 0 6 -14 -16 -13 -23 -1 -23 -26 -4 -28 -6 -23 -19 -37 15 -32 -9 2 38 -9 15
7634 15 13 26 -1 10 -3 -13 1 -15 -10 -17 -13 -21 -10 -14 -21 19 -15 -7 7 10 -35 -26 -23 -5 -20 -11 -36 -15 23 -10 -18 -10 -31 -3 -20 -11 4 3
7672 3 -2 12 -4 22 -16 32 21 -5 15 15 -9 15 0 7 14 -20 33 -9 -11 -5 -7 -7 7 -2 -29 15 -9 2 5 -17 -20 -11 -33 -1 -29 -10 -10
7709 -10 -24 -24 7 -12 7 -2 -1 27 -5 11 11 4 3 -11 46 36 15 41 26 35 11 -11 4 19 -6 16 -16 22 3 0 -11 -6 -11 7 -17
7744 -17 -42 -31 -7 -12 -3 -22 -17 -29 -3 -23 9 1 0 -14 -19 -2 0 9 -1 9 8 13 27 35 4 12 -6 12 25 0 3 3 -19 5 15 19 2 -9
7782 -9 -5 -4 -17 -8 7 -8 -14 -24 -5 -43 -28 4 -20 -25 -20 -9 4 -17 -30 -10 -7 2 5 -24 13 19 -21 12 24 -13 5 19 14 10 11 20 5 15
7820 15 6 12 20 1 14 20 8 -32 12 9 -22 -11 -28 -17 -14 -33 10 -7 -17 -5 8 -28 -21 -2 18 15 -15 -5 20 -4 -4 9 26 16 37
7855 37 9 38 30 9 3 18 6 -2 53 13 2 19 6 11 -6 25 13 -8 -25 -13 5 -18 -7 -15 -17 -37 -4 10 -30 -15 3 7 10 -17
7889 -17 10 14 6 -4 37 15 22 -2 14 33 -10 20 28 5 -24 12 2 -11 38 12 -17 -8 12 19 11 -6 -8 13 5 -1 -17 7 -12 -15 -16 6
7925 6 17 -5 6 -5 -8 13 1 27 20 42 26 -5 0 -4 -7 8 2 11 26 -2 34 4 16 31 6 15 9 3 -2 -13 -11 -23 -13 -16 7 5 11 1
7963 1 9 -7 -16 -19 -6 -1 -6 -2 -27 -2 -3 -12 1 37 7 20 13 -4 42 11 12 19 50 26 24 5 40 14 15 11 13 2 -16 -13 -11 -18 -35 -17 -14 -16 -6
8004 -6 6 -5 -19 -21 2 -19 -16 -12 -22 -8 5 0 1 10 -11 -4 -5 22 -12 -9 12 29 -6 26 12 6 12 -22 7 12 -3 7 4 14 18 -19 -53 -19
8042 -19 -30 -3 -7 13 -37 -6 -17 -6 -24 -32 -31 7 16 12 8 -9 1 3 9 4 12 9 -4 -1 15 -2 6 5 6 -8 28 7 7 7 -5 5 26 21 11
8081 11 9 2 20 10 -15 16 3 -34 -2 -30 -22 0 -18 1 -10 -3 7 0 24 3 -25 -12 17 -7 -1 25 11 26 1 -1 22 26 4 -1 1
8116 1 32 3 -11 27 5 -6 10 9 1 8 11 -9 7 11 -39 -4 -11 -3 -14 -9 -7 -19 -2 -5 5 -4 49 -11 -3 2 -7 4 7 9 7 13 11 24 25 23 27 30
8158 30 41 19 25 34 -10 -8 -1 3 -12 -28 -14 -10 -29 11 -17 -26 4 4 -21 -8 4 -1 5 4 -13 12 -1 3 -11 -12 9 15 7
8191G
##END NTUPLES=NMR FID
##END=
