##TITLE=1H_Pr D6-T
 200.13MHz, CDCl3,
 8 sc
 
 26.5.2025
##JCAMPDX= 6.0         $$ Bruker NMR JCAMP-DX V2.0
##DATA TYPE= NMR FID
##DATA CLASS= NTUPLES
##ORIGIN= UXNMR, Bruker Analytische Messtechnik GmbH
##OWNER= pz
$$ XWIN-NMR		Version 3.5
$$ Mon May 26 14:55:25 2025 Russian Standard Time (UT+4h)  she@DPX200
##.OBSERVE FREQUENCY= 200.1313
##.OBSERVE NUCLEUS= ^1H
##.DELAY= (6, 6)
##.ACQUISITION MODE= SIMULTANEOUS
##.ACQUISITION SCHEME= undefined
##.AVERAGES= 8
##.DIGITISER RES= 18
##SPECTROMETER/DATA SYSTEM= spect
##.PULSE SEQUENCE= zg30
##.SOLVENT NAME= CDCl3
##.SHIFT REFERENCE= (INTERNAL, CDCl3, 0, 14.3821)
##AUDIT TRAIL= $$ (NUMBER, WHEN, WHO, WHERE, WHAT)
$$ ##TITLE= Audit trail, XWIN-NMR		Version 3.5
$$ ##JCAMPDX= 5.01
$$ ##ORIGIN= Bruker BioSpin GmbH
$$ ##OWNER= she
$$ F:/spectra/data/she/nmr/H-C/1/audita.txt
$$ ##AUDIT TRAIL=  $$ (NUMBER, WHEN, WHO, WHERE, WHAT)
(   1,<2025-05-26 14:54:04.60 +0400>,<she>,<DPX200>,
      <created by zg, POWCHK disabled, PULCHK disabled
       configuration hash MD5:
       00 E9 B6 7A A2 85 ED C7 34 08 36 98 17 FE 4E 26
       data hash MD5: 16K
       E6 A3 36 CA A7 97 1C 1D 85 43 51 FC 39 89 6A 0D>)
$$ ##END=
$$ 
$$ hash MD5
$$ 5C 8C A8 6D 03 E6 1C EB 26 8F 04 17 31 AA F6 45
##$RELAX= 
##$RELAX= 
##$RELAX= 
##$RELAX= 
##$RELAX= 
##$RELAX= 
$$ Bruker specific parameters
$$ --------------------------
##$DU= <F:/spectra>
##$EXPNO= 1
##$NAME= <H-C>
##$PROCNO= 1
##$TYPE= <nmr>
##$USER= <she>
##$AMP= (0..31)
100 100 100 100 100 100 100 100 100 100 100 100 100 100 100 100 100 100 
100 100 100 100 100 100 100 100 100 100 100 100 100 100 
##$AQSEQ= 0
##$AQ_mod= 1
##$AUNM= <au_zg>
##$AUTOPOS= <>
##$BF1= 200.13
##$BF2= 200.13
##$BF3= 200.13
##$BF4= 200.13
##$BF5= 200.13
##$BF6= 200.13
##$BF7= 200.13
##$BF8= 200.13
##$BYTORDA= 1
##$CFDGTYP= 0
##$CFRGTYP= 5
##$CHEMSTR= <none>
##$CNST= (0..31)
1 1 145 1 1 1 1 1 1 1 1 1 1 1 1 1 1 1 1 1 1 1 1 1 1 1 1 1 1 1 1 1 
##$CPDPRG= <>
##$CPDPRG1= <>
##$CPDPRG2= <>
##$CPDPRG3= <>
##$CPDPRG4= <mlev>
##$CPDPRG5= <mlev>
##$CPDPRG6= <mlev>
##$CPDPRG7= <mlev>
##$CPDPRG8= <mlev>
##$CPDPRGB= <>
##$CPDPRGT= <>
##$D= (0..31)
0 0.7 0 0 0 0 0 0 0 0 0 0.03 0 0 0 0 0 0 0 0 0 0 0 0 0 0 0 0 0 0 0 0 
##$DATE= 1748256843
##$DBL= (0..7)
120 120 120 120 120 120 120 120 
##$DBP= (0..7)
150 150 150 150 150 150 150 150 
##$DBP07= 0
##$DBPNAM0= <>
##$DBPNAM1= <>
##$DBPNAM2= <>
##$DBPNAM3= <>
##$DBPNAM4= <>
##$DBPNAM5= <>
##$DBPNAM6= <>
##$DBPNAM7= <>
##$DBPOAL= (0..7)
0.5 0.5 0.5 0.5 0.5 0.5 0.5 0.5 
##$DBPOFFS= (0..7)
0 0 0 0 0 0 0 0 
##$DE= 6
##$DECBNUC= <off>
##$DECIM= 32
##$DECNUC= <off>
##$DECSTAT= 4
##$DIGMOD= 1
##$DIGTYP= 9
##$DL= (0..7)
0 120 120 120 120 120 120 120 
##$DP= (0..7)
150 150 150 150 150 150 150 150 
##$DP07= 0
##$DPNAME0= <>
##$DPNAME1= <>
##$DPNAME2= <>
##$DPNAME3= <>
##$DPNAME4= <>
##$DPNAME5= <>
##$DPNAME6= <>
##$DPNAME7= <>
##$DPOAL= (0..7)
0.5 0.5 0.5 0.5 0.5 0.5 0.5 0.5 
##$DPOFFS= (0..7)
0 0 0 0 0 0 0 0 
##$DQDMODE= 0
##$DR= 18
##$DS= 0
##$DSLIST= <SSSSSSSSSSSSSSS>
$$ [...]
##$SUBNAM0= <"">
##$SUBNAM1= <"">
##$SUBNAM2= <"">
##$SUBNAM3= <"">
##$SUBNAM4= <"">
##$SUBNAM5= <"">
##$SUBNAM6= <"">
##$SUBNAM7= <"">
##$SUBNAM8= <"">
##$SUBNAM9= <"">
##$SW= 18.0517328524113
##$SWIBOX= (0..15)
0 0 2 0 0 0 0 0 0 0 0 0 0 0 0 0 
##$SW_h= 3612.71676300578
##$TD= 16384
##$TD0= 1
##$TE= 0
##$TE2= 300
##$TE3= 300
##$TEG= 300
##$TL= (0..7)
0 120 120 120 120 120 120 120 
##$TP= (0..7)
150 150 150 150 150 150 150 150 
##$TP07= 0
##$TPNAME0= <>
##$TPNAME1= <>
##$TPNAME2= <>
##$TPNAME3= <>
##$TPNAME4= <>
##$TPNAME5= <>
##$TPNAME6= <>
##$TPNAME7= <>
##$TPOAL= (0..7)
0.5 0.5 0.5 0.5 0.5 0.5 0.5 0.5 
##$TPOFFS= (0..7)
0 0 0 0 0 0 0 0 
##$TUNHIN= 0
##$TUNHOUT= 0
##$TUNXOUT= 0
##$USERA1= <user>
##$USERA2= <user>
##$USERA3= <user>
##$USERA4= <user>
##$USERA5= <user>
##$V9= 5
##$VALIST= <valist>
##$VCLIST= <CCCCCCCCCCCCCCC>
##$VD= 0
##$VDLIST= <DDDDDDDDDDDDDDD>
##$VPLIST= <PPPPPPPPPPPPPPP>
##$VTLIST= <TTTTTTTTTTTTTTT>
##$WBST= 1024
##$WBSW= 4
##$XGAIN= (0..3)
0 0 0 0 
##$XL= 0
##$YL= 0
##$YMAX_a= 344652
##$YMIN_a= -397532
##$ZGOPTNS= <>
##$ZL1= 120
##$ZL2= 120
##$ZL3= 120
##$ZL4= 120
##$ABSF1= 10
##$ABSF2= 0
##$ABSG= 5
##$ABSL= 3
##$ALPHA= 0
##$AQORDER= 0
##$ASSFAC= 0
##$ASSFACI= 0
##$ASSFACX= 0
##$ASSWID= 0
##$AUNMP= <proc_1d>
##$AZFE= 0.1
##$AZFW= 0.1
##$BCFW= 1
##$BC_mod= 2
##$BYTORDP= 1
##$COROFFS= 0
##$CY= -3
##$DATMOD= 1
##$DC= 2
##$DFILT= <>
##$DTYPP= 0
##$F1P= 0
##$F2P= 0
##$FCOR= 0.5
##$FTSIZE= 0
##$FT_mod= 4
##$GAMMA= 1
##$GB= 0.15
##$INTBC= 1
##$INTSCL= 1
##$ISEN= 128
##$LB= 0.25
##$LEV0= 0
##$LPBIN= 0
##$MAXI= 10000
##$MC2= 0
##$MEAN= 0
##$ME_mod= 0
##$MI= 1.114404
##$NCOEF= 0
##$NC_proc= 0
##$NLEV= 6
##$NOISF1= 3.799351
##$NOISF2= 2.8
##$NSP= 1
##$NTH_PI= 0
##$NZP= 0
##$OFFSET= 14.38212
##$PC= 1
##$PHC0= -1531.82
##$PHC1= -5.807837
##$PH_mod= 1
##$PKNL= yes
##$PPARMOD= 0
##$PSCAL= 0
##$PSIGN= 0
##$REVERSE= no
##$SF= 200.129724274929
##$SI= 16384
##$SIGF1= 3
##$SIGF2= 2
##$SINO= 400
##$SIOLD= 16384
##$SREGLST= <1H.CDCl3>
##$SSB= 0
##$STSI= 0
##$STSR= 0
##$SW_p= 3205.1282051282
##$SYMM= 0
##$S_DEV= 0
##$TDeff= 0
##$TDoff= 0
##$TI= <>
##$TILT= no
##$TM1= 0
##$TM2= 0
##$TOPLEV= 0
##$USERP1= <user>
##$USERP2= <user>
##$USERP3= <user>
##$USERP4= <user>
##$USERP5= <user>
##$WDW= 1
##$XDIM= 8192
##$YMAX_p= 0
##$YMIN_p= 0
$$ End of Bruker specific parameters
$$ ---------------------------------
##NTUPLES= NMR FID
##VAR_NAME=  TIME,          FID/REAL,        FID/IMAG
##SYMBOL=    X,             R,               I
##VAR_TYPE=  INDEPENDENT,   DEPENDENT,       DEPENDENT
##VAR_FORM=  AFFN,          ASDF,            ASDF
##VAR_DIM=   8192,          8192,            8192
##UNITS=     SECONDS,       ARBITRARY UNITS, ARBITRARY UNITS
##FACTOR=    0.0002768,     1,               1
##FIRST=     0,             0,               0
##LAST=      2.2672688,     0,               0
##MIN=       0,             -397532,         0
##MAX=       2.2672688,     344652,          0
$$ Real data points
##PAGE= N=1
##DATA TABLE= (X++(R..R)), XYDATA
0@%%%%%%%%%%%%%%%qJ6j6J6j6J7k5L2l3M1m8N6o5P3q4R5j08J22j38J56j75J94
37A02k19K46k73L03l36L71m10M55n01N53o09O71p39Q13q97R89j093J209j341J494
57G88j670J876k123K423k798L280l925M835o205Q490j2969K4811j13227l01118
71c97532K85727L46783p4732k61814l1974J56813O0365n2925p964m7330p4629
82i9212O6872J34979k1300j58197m8214J66796R7908j36700j14062O4887Q7703
93D1460P133m2357k5349j283P438M9006K3454q6719n4049P8200O6328m1995o2922
106d1655K0898N0847k4049k3903L4870j3877n0343L1222O5576j2235p4833p733
118d5215Q1730J1395p6807p273N5533j113l9593J5089M9854l1895p5657M2247
$$ y = [0, 0, 0, 0, 0, 0, 0, 0, 0, 0, 0, 0, 0, 0, 0, 0, -8, 8, -8, 8, -8, 9, -16, 16, -17, 24, -24, 32, -33, 40, -44, 51, -57, 65, -73, 83, -92, 102, -117, 129, -144, 159, -177, 194, -216, 239, -262, 291, -318, 353, -386, 427, -470, 519, -574, 635, -706, 788, -882, 994, -1129, 1294, -1504, 1776, -2149, 2686, -3519, 4971, -7998, 16813, -96414, -397532, -111805, 234978, 160246, -101568, -133542, 23271, 83636, 30711, 22747, -24583, -99212, -32340, 102639, 81339, -76858, -125072, 41724, 139632, 2932, -111130, -46243, 41460, 48593, 6236, -19113, -20396, -12958, 36048, 59502, -27217, -81266, -3066, 63262, 21267, -41655, -20757, 30090, 6041, -17862, 17008, 3131, -47212, -15990, 49586, 37351, -37482, -45215, 36515, 47910, -28897, -36170, 19363, 18250, -21343, -6254, 43600, 11705, -63952, -21705]
130b1705Q8745m1727r0043K1876Q9731O639p9220j7657N7116R196k9678L174P843
143D290j3234j712K9934J2533m5823k6460M6609K7488l5887k6593K0589K7675
155A9409r062j9356Q852K008j5965J2990J9292j6081j9878J5377K6442j4277l1389
168b1638J5453K4296k0333j6334K1434J5247j8591j8930J9866J9810k3695j6364
180a9779J9896R973j1942k596J4465j096k4396N219L3856r616m0167M735M1706
193B0258R346l8661k0600L1165J8824j8637j2986K702N340P466O771k634j9117
206a0763p909K7973J5079k7366k0183J7485K4959m104k5088k483J4741Q92j302
219A931O22r411l844J1843J4512p357k5387L154K7541N7k1456m175J3167R986
$$ y = [-21705, 67040, 25313, -64730, -42854, 46877, 53516, -25704, -43361, 13755, 22951, -6727, -3553, 4290, -8944, -10656, 19278, 31811, -14012, -40472, 6137, 33625, -2262, -28855, -8266, 19409, 10347, -9009, -157, 1851, -14114, -1124, 18168, 2087, -17791, -2414, 24028, 9751, -21638, -6185, 18111, -2222, -18556, 2878, 18125, -466, -19396, 470, 20280, -3415, -19779, 117, 10090, -1852, -4448, 10017, 8921, -15475, -10256, 23600, 13984, -26183, -21448, 20258, 29604, -9057, -29657, 1508, 20332, 1695, -11291, -8589, -3249, 4217, 10988, 8354, -10763, -18672, 9301, 24380, -2986, -23169, -5684, 19275, 15171, -9917, -12400, 2341, 3233, 1931, 2553, -6858, -10702, 1141, 15653, 8296, -17091, -13937, 13604, 13661, -7795, -11970, 1197, 11183]
233A1183p088p685L816k446k165R694m07j1644j148J0547Q384j0112j3669J0686
247b054J0667r392m676N161N201k829n560O238L557j1839j0J0555j494o222m93
262c190N128K865p520j649P246m246l574O317J637k504l404J583Q241n456r003
277g529P278N421m230k779P20M115j368o052N259J334p408K983N970j851l762
292a899j488N659K938q743k25O559j681k52l32p68K007k099m27L287n137k029
308d630O749R40l488k724J074O431k960o554M506K970k145Q43q68K78N65k090
324a103K907n86n491L670L747k779j441p08K188K161m633n76L909j265n4Q36n89
341A93O58j272J04K696l163j848M322J21j825p54J79J891j104l002K794n7j312
$$ y = [11183, 4095, -3590, 226, -2220, -4385, 5309, 4902, -6742, -7890, 2657, 11041, 929, -12740, -2054, 8613, -779, -5455, -294, 4907, 2078, -3482, 2756, 6313, -5526, -5536, 5019, 3525, -2697, -3190, 1938, 4803, -2717, -4366, 2880, -1366, -4940, 1377, 3014, 510, -2894, -1311, 6930, 1474, -7529, -251, 5170, 940, -1839, -1119, 2996, 1628, -4424, 835, 2169, -5239, -2256, 3714, 1863, -1899, -3387, 2272, 5210, -3533, -3758, 2801, 1120, 868, 536, -232, 1775, -324, -751, 2536, -2601, -4630, 2119, 3059, -429, -3153, -2079, 4352, 1392, -5162, -656, 2314, 169, 1012, 144, 422, 987, -1103, 1804, 1218, -4273, -603, 3144, 365, -1076, -1784, 404, 2565, -2068, -2644, 1265, 0, -54, 782, 193, 851, -421, -317, 2379, -784, -2632, 1690, 1811, -14, -768, -589, 1302, 198, -2804, -10, -67, -1379]
358a379K355n32j304R85o64J588k26l212K700J704j296m11j211R98J584k541n33
375a395J831j545N43J886j419l45p44Q67K024k250j345K606K72p7J79k034Q37
392a09M44l29R15j681p83K024M95o05o64j851J531K094j384n75q20L90K872j52
410A812k181r35J38L262K81l473j94J319R87K98j419k038R23J393J255J6l765
427b321l2L813J216j547l863p5N249P95l335j925L29L605L85k602r44m13Q19K913
445B067p53k932j050J702L450K65n018j292L532L170l57m920q68M559J385k316
461F24j617q34J700J487p61k18j394j345K428J852o46k697k162M001M184m109
477D93l514R83L494J741l629j510K217j52j97J747j091j535j709J900M545k191
$$ y = [-1379, 976, 444, -860, 125, -539, 1049, 823, -2389, 311, 2015, 719, 308, -903, 95, 1679, -862, -1395, 436, -1109, -566, 1320, -99, -444, -1188, -321, 1703, -547, -1892, 714, 986, 909, 1088, -946, -109, 335, 6, 921, -760, -1543, 481, 976, 371, -293, -2144, -613, 1481, 97, -478, -1298, -908, 1964, 1812, -369, -1304, -1166, 2096, 2377, -1096, -1290, 29, 1016, 1314, -105, -2143, -1220, 173, 1428, 1444, -2321, -2353, 1460, 2676, 1129, -2734, -2809, 2440, 3235, -100, -2025, -1696, 1909, 2294, -308, -1252, -1665, -846, 2067, 1314, -1618, -2668, -966, 2484, 2749, -2269, -3561, -29, 3141, 2784, -2136, -3004, 1555, 2940, 624, -993, -1827, -127, 1360, 599, 381, -1013, -2358, 70, 1922, 1276, -1421, -3583, 418, 4602, 493, -3021, -2038, 1456, 3197, -432, -1942, 275, 123, -74, 1673, 582, -953, -2662, -762, 3783, 1592]
493A592o452J584N717J978m093n456L248O168j913l441o54O86L164p0j681n98
509b21k553Q78N106o52m317k679K349P023j320p440q28N465L805k222o023N42
525c087N598J04j945j132j330J574Q18O34P00m007k257N228L578l714m977j56
541d371Q064J387p108j592L772K337o35k937O44J358k422J465L599k563m250j25
557c377M817L671n859n210M656N380j332l827k712L331L643k107p17j309p39K298
573F07J640l08k312l775K809N687j555n839j356L339N887k212o873M51M817K653
589C660j820m636Q42L855j0p03r55k444Q69K945J242j711n573J091P218k55n530
606a915k297K941M943j434m995Q95K624K64q0j025K4j21o79K266J113l401j538
$$ y = [1592, -4860, -3276, 2441, 4419, 326, -5130, -1882, 4286, 2373, -1068, -1722, -1036, 2128, 2058, 377, -221, -2774, -1896, 3210, 2558, -1759, -4438, -2089, 4934, 3614, -3826, -4654, 811, 4616, 2394, -3629, -3087, 2511, 2615, 670, -462, -1792, -218, 600, 1234, 1934, -2073, -4330, 898, 4476, 762, -4215, -4371, 3693, 5080, -2028, -3620, 152, 2489, 1854, -1083, -439, 919, -1503, -38, 3561, 998, -3252, -3377, 1440, 5111, -748, -5958, -1302, 4078, 2746, -1081, -3793, -462, 3181, 1074, 357, -952, -1691, 607, 2247, 1939, -373, -4148, -1339, 4348, 2793, -3046, -4402, -1063, 4824, 2612, -4261, -3810, 1007, 3660, 1840, -2796, -1954, 1901, 1891, 1188, 233, -2211, -1342, 1603, 2845, 1134, -4439, -3348, 3870, 3615, -1915, -4212, -1271, 3672, 2238, -2757, -1862, 762, 1026, 946, -79, -55, -176, -855, 1411, 2524, -877, -2415]
623b415K060J944j68l278o59K981P88q83p63j101J572J080j174M40k28j008J034
640B22J102l94p54k090J298K502r93j956r09J346K619j265k469L66J335R38K0
657I18j272n48Q55K80J540j055k488O77K020R39j695k654J284K759n33j764l46
674a083l9K094m31j113K68l03N38J571j397l49k64J98J436m53j536P18K13J36
692B04L49j384j95J024J3K87k37q60R97N1k14L02m93M4O72k71j6j00j038Q98L22
713C55m61J38o34m43J663m65m91K97p64R83J161j614K28R4L39J234j729n11R92
732C72m51O20j39j466R16N57p81O94q40q0J320o70n46N35n71R92L52j187O56J8
752C01n22J115j119m22J048k99K5l2j108R84P40j265N59k08m20J245n80m19R26
$$ y = [-2415, -355, 1589, 1421, -1857, -2516, 465, 1253, 370, -393, -1494, 78, 1158, -16, 424, 196, -812, 222, 1324, 930, 176, -1914, -616, 1886, 893, -1063, -1972, -626, 1993, 728, -1741, -1375, -40, 898, 918, -354, -902, -47, 233, 1773, 718, -1770, -1093, 927, 1866, 171, -2483, -1199, 1560, 1027, -737, -1083, -1122, 972, 541, -572, -304, -607, -69, 1502, 105, -244, -508, -310, 1126, 673, -863, -145, 68, 204, 553, -831, -1026, -2, 11, 298, 61, -799, 198, 249, 35, 337, -156, -112, 560, 289, 273, 173, -865, 33, 355, -106, 32, -602, -1045, 618, 153, -338, -41, -805, 178, 1339, -275, -47, 47, 386, 1620, -109, -620, 372, -79, 541, 402, -1064, -148, 409, -372, 322, -518, -598, 722, 52, -494, 41, -530, 462, 814, -373, 283, 301, -221, 894, -225, -647, 401, 102, 127, 95, -1013, -29, 711, -554, 5, -203, -623, 622, 42, -377, 549]
771E49n78M27N27j843R51N70r26P30m58r18J402n86l37M93o32O93Q75j740P85
790a6L17r08J285n31p50J228n45K8O79j544Q91J85p81M74J09q51J096k90o17P34
810A93p14K69R54j068L82O18r34Q59q5r65J100k29n02N00p05J97Q03j330M25M38
830B06r52O89K75q51J100q42K27Q51j075J67P04q47R13n65m80P38R5n55P12p52
850b42l02P86l44J25k83m87Q06M73r97R20o76K4J166o97k31L63n27L17N51j347
870f02PL48K17M70j047k15J000j51k3N8l73K31N93k04N0q64%J365m32p41M24o19
892e08P26j4n25Q3r6l35J135k36p18r3N48R65k43j708J034O94l73j00nk40Q7k47
914a69P18R6j629j3J388J24k45j050N0J115J77q62L09k88N19M18k92m97J31j77
$$ y = [549, -29, 398, 925, -918, 33, 603, -323, 407, -51, -969, 433, -153, -490, 3, -629, 64, 939, -801, -16, 301, -607, 678, 147, -603, 625, 80, 108, 787, -757, 134, 319, -462, 12, 121, -730, 366, 76, -541, 193, -521, -252, 702, -366, 16, 634, -300, 559, 474, -491, 609, 380, -122, 378, -327, -130, 673, -657, -232, 206, -746, -57, 218, -633, 467, -375, -148, 703, -372, -205, 499, -348, 565, 0, -480, 258, 353, -202, 510, -242, -544, 242, -102, 23, -260, -747, 59, 532, -465, 455, -221, -197, 969, 272, 41, 404, -123, 194, 745, -602, -595, -247, -30, 440, -607, -822, 178, 27, 4, 62, -311, -80, 513, 309, 359, -505, -505, 860, 428, -313, 111, -508, 218, 204, -321, -238, -334, -669, 466, 230, -488, -581, -33, 932, 689, -1019, 15, 709, 336, 236, 231, -9, 78, -169, 549, 645, -984, -997, 391, 515, 270, -780, -730, 385, 562, -300, 9, -279, 240, 658, 366, -131, 0, -177]
934a77J079m64j003K47k74O08N15j002l41L18R58N43j410j046J169J093n74k25
952A4q16R45N38p09P3M28j144K87R50O7q59j428J254K010j554j580Q73J164M99
971A012j410n11J721l42o94R19m25n47l47O64O80j24j827P46Q90r1k16r74P06
990a70R71l55p61J81j82O22L32p22K59J04o35P58j47k97l11q32J450J272k005
1009d68q37R55J209P0j795j29J912k32j250O27L66L4p40O3J464j056j612J556
1027A37R40p96j144j31J605L16j950L77R86j44j88j43R8M75j071L92J109p57j92
1046h1j7K66L86n74p46O44L19o03O29p65K4J133n35m54L19o2L84j57o52J126k96
1067B88p71Q48R3l04p92k79J517M84k229P29R27k32l89k86M85O02j081J05J167
$$ y = [-177, 902, 438, -565, -318, -592, 16, 531, -471, -812, -494, 464, 1007, -403, -1449, -280, 813, 239, 14, -802, 143, 681, -28, 45, 473, -671, -384, 566, 633, -226, -1654, -400, 1610, 56, -1524, -651, 513, 1012, -398, -909, 812, 470, -224, 695, 270, -277, -624, 40, 720, 596, -1231, -485, 405, 314, 98, -876, -170, 801, 446, -315, -134, -316, 306, 638, -84, 175, 279, -356, 402, 255, -42, -353, -1185, 265, 1537, -468, -1305, -350, 859, 929, -866, -995, 917, 685, -565, 62, 428, 462, -278, -215, 1249, 193, -1419, 137, 1077, 281, -863, -994, 611, 927, -1023, -646, 340, 196, 8, -135, -37, 438, -633, -241, 868, 111, -81, -98, 168, 554, -20, -766, -122, 197, -406, 223, -542, -518, 615, 80, -374, -55, -117, 267, 110, -542, 584, 288, -483, 365, 458, 154, -638, -917, 600, 1084, -1145, -416, 511, 279, -110, -396, 89, 691, -390, -285, 882]
1086H82q64n10N95O63k19j425K55J884p44q11q1O91n1j18n20P82l84p10Q45K8
1106A88o06K31K09M98m02o40K49P08n66L69k60l04L20j31J03j37n95N87R02j219
1126d96K44N36k28j30l65M79K39o80M04N75k42k99l34M46K93p36k86R76j73p33
1146e10M59K90q3m51k25R97p1j083P83O94o71m43p7J045m75p92O89M96j037J69
1166b96O1L22k8o97P43L08r04j16P10K45l28k87L34J84l96P6M10m34k58N70k31
1187a2kk88l82J109k32p30L54L32k4j42J43K05k31m86P11o4o96L09N14m32K62
1208B18m89N20J4p28L97M29o42l4K71O3M43p35Q0P87m85n36P71k5k3m65K90L01
1230D22l32o96O85o2l16J17m1O32m38m99Q10p2o70N37K58l73L9m72P05J55r85
$$ y = [882, 18, -492, 103, 766, 547, -878, -623, 1261, 517, -294, -375, 316, 265, 147, -373, 409, 25, -685, 160, 188, -418, -187, 22, 520, 118, -522, -273, 435, -131, 238, -22, -326, -6, -137, -34, -171, -766, -179, 723, -496, -252, 284, 56, -74, -439, 40, 279, -401, 3, 578, 336, 37, -297, 149, 442, -294, -580, 396, 223, -510, -51, 239, 156, -295, -520, 477, 406, -677, 106, 800, 129, -314, -391, 654, 179, -613, 76, 572, -465, -296, -235, 87, 59, -638, 105, 413, -491, -607, 103, 348, 20, -267, 67, 251, -145, -69, 341, -93, -351, 219, -12, -14, -302, -684, 425, 193, -537, -183, 149, 125, -17, 126, 331, 100, -386, 325, 261, -435, -126, 388, -44, 218, -271, 249, 263, -465, -68, 361, -281, -315, -44, 19, 462, -273, -193, 594, 109, -427, 344, 319, 296, -169, 121, 422, 90, -606, 79, 17, -299, -182, -223, 409, -29, -528, 282, 210, -460, 77, 335, -38, 1, -471, 234, 389, -596]
1251e96R44k37n16N12m03J85O8k35q6P94m39l77O24M6j99j43J56L57m49n0R05
1272H61p86o43M54J58J31l29n67O53O82j105M81l8j19O6M5L38J39r50P61K52n90
1293a06p2L48k9O5o48L20N64o56k91N17J7k46L02k58M77q0n28P33m22l13M00k12
1315a18K79M0k28L53j14p25K16K16k21J65J13l27O91p15J1M58j97k0N69o04K80
1336A22j39J2M45o79K06L25n31J38L09n52O56k33k92M49L5m31L05k37J26j15j70
1357b51M05J40o57M95Q4m47O40m54j52K16%l57N99j56j44P3l97M30l75N9L25k42
1379a66m7M76m74K33K76m02K17k76J61l7j65Q3K03j41k4J86n78M52J47j36r3K45
1401A40l71L73r5N9J87m16J80mk6J91o76L32K53j83k85L33q5jK25m56NN85l82
$$ y = [-596, 348, 111, -405, 107, -296, -111, -43, -278, -364, 430, -9, -386, 238, 284, 85, -58, 98, 455, 6, -44, 861, 75, -568, -114, 44, 175, -154, -721, -68, 614, -491, -10, -48, -167, -101, -56, 282, 421, -529, 232, 484, -106, -178, 170, 141, 206, -442, -122, 442, -214, -505, 12, 29, -217, 85, -173, 304, 224, -304, 429, 7, -306, 94, -118, 161, 201, -27, 326, 212, -513, -297, -81, -302, -137, -24, -351, 340, -375, -364, 94, -103, -123, 446, -158, 122, -17, -5, 440, -239, -33, 292, -239, -101, 208, -344, 312, 79, -213, 236, 271, -160, 145, -92, 34, -81, -251, 154, 294, -363, 132, 216, -231, 409, -45, -197, 19, 19, -338, 261, 105, -39, 34, -363, 67, -308, -249, 76, -166, -213, 263, -211, 22, 298, -104, 113, -163, -2, -39, -204, -121, 82, -59, -83, 103, -475, -23, 124, -12, -105, 140, -231, 142, 47, 106, 293, -123, 57, 53, 27, 218, -458, -126, 127, -56, -341, -8, -93, -94, 131, -325, -320, 265, -117]
1424a17N5K06m14L24k24O33k89k97k9J05J70K4k92j20K82Pj81r6K78r4L53o51
1446c67P22O5m66J93j5j57L13m79J03N52o85k1K04k79J91q8k75N01K12n87M10
1467D7j23N3L47n41P21l50l06M0J85j26qk82K74L03m83J6K57j49L03o9j96N19
1489D32j30l18J26J58Qj65J1K6K10j046L14L97k9Ll19J50L13l25j52M68j48j04
1511a20J27m86O87k6n94N29L04l94j78p9K50L84l57o5J61o9j66rN9K15j79k63
1533b69M77j22j84J69J12J93j90o42M90L65o20N20j68l3k47k59K07M50l75J71
1553D5nK1j09k8q5K54O4k27j87K75J60j66j87O1J38l59M48k59j08P41l80j41K93
1576B59l61k7Q4m7M71m49n19Q76j79r8K6j66M73j85l10K43n5k30J68M6Q2J1j82
$$ y = [-117, -62, 144, -270, 54, -170, 463, 174, -123, -152, -47, 123, 147, -145, -265, 17, 24, -157, -253, 25, -69, 284, -367, 355, 420, -46, 147, 132, -25, 288, -191, -88, 464, -221, -242, -38, -317, -126, -214, -489, 12, 224, -363, 47, -76, -23, 324, -217, 504, 154, -152, -112, 73, -53, -61, -343, -69, 234, -249, -233, 24, -125, 178, 109, -87, 432, 302, -16, 110, 268, 276, 111, 122, 148, 358, -688, -374, 23, -6, -3, -322, -172, 141, -184, -336, 132, -16, -120, 7, -479, 208, 182, -412, 117, 421, 27, -151, -230, 20, 404, 47, -18, 143, 74, -92, -101, -42, 173, -6, -269, 208, 86, -98, 71, 183, 376, 186, -456, 34, 399, -221, 299, 131, 98, -149, -408, -201, 249, -126, 45, 40, 61, -48, -76, -161, 93, 157, -70, -257, 18, 178, 12, -175, -114, 24, -335, 113, -146, -254, 487, 107, -34, 259, -102, -129, -45, -92, 379, -70, -589, 287, 108, 10, 36, -130, 343, 158, -152, 91, 36, -194, -26, 20, 102, 113, -69]
1599f9l6L08l53J67L73l18j94J04j31J47r2J65J0lM3l8j96M9Jj96M33l23p2J17
1623a04J22oJ81k54KP7l36M76om02M98m98K03k47J03J64K21n15M1K66j02l8J4
1646a40n1K15Kk00M83o14M75q5j47M1J07rl4J45l29M7j32O3k5k42N22k65p6Q5
1670a64K81p8j70J97J48k54k0K70O2k07J3k42P9K55l29r8M12o40M76j8J0M3Q0
1693A06j22L2K54j56J92l12j80J58p7j35K59k51K22j19q4J20K85o77M95O7j76
1714i9J04J41j50k3j71N4J88o4Q3j33qJ67m70K42M18l40P9jj02Q8j30J45J07l38
1738b13K99k36P6K32Lj93J48M1l01L45j48j5K24k72m4j93pM47l13j30N40k27m7
1761A6j43j0J14k0l44N17j7j43o7Q1j90N44m71r6K94m20K98J79j64j8J15k65K00
$$ y = [-69, -105, 203, -150, 17, 390, 72, -122, -18, -149, -2, -94, 71, 81, 78, 121, 83, -113, -64, -63, -259, 174, -149, -221, -104, 18, 12, 193, -61, -59, 18, -318, 158, 152, -250, 248, -250, -47, -294, -191, -27, 194, -321, -280, -14, -116, -154, -140, -191, 24, 26, -174, 309, -305, 170, 85, -62, -21, 86, 77, 43, 188, -141, -94, -226, -163, -188, -430, 92, -173, -249, -164, 117, 39, -131, 66, 214, -40, -60, 210, 272, 65, 78, -164, -85, 170, -159, -257, 155, -485, -9, -27, -17, 26, 106, -16, 16, 270, 114, 306, -6, -186, -28, -105, -240, 19, -232, -10, -129, -213, -93, 192, -485, 10, 77, -99, 5, 146, -4, -27, -198, -144, 44, -20, 63, -70, -78, 89, -381, -139, 279, -61, 18, 17, -85, 3, -127, 18, 125, -213, 86, -150, -74, 158, 161, -32, 116, 157, -144, 201, 53, 38, 262, -10, -54, -247, -254, 193, -120, -250, 290, 63, 16, -127, -137, -23, -43, -387, 130, 113, -30, -97, -16, -206, 338, -133, -229, 65, -355, -57, 122, -42, -60, 55, -210, -10]
1784a0N1p2N8l64J66O38m65O5N9l36M02j00n01M96R1m21J56J21r4Q6l95M64N7
1807A52l51P1K26l4p7p3J55K56k62l9J7j03l87P12l37j02J22J3J49k74j38N73
1829B69l63J82q5Q6o9O9j90L57Mj85j80L6kn9j48L63L0l06L94n7l28J54L93l13
1853E2K28m95J87L48m72K63j1k88J34N0L7N5k60n6L71k5k01J09q5J2L03m1j8J07
1877C04n71K01J62m28M25Q3j32K05o31L38P1k02J33M1J44k95O8n2J42J0L0J0n
1900E1qp1O6lJ00j20K06j09J5rl75N78k74j3Q3j15j04P5K32j65j1J11mr6j3J3
1926D0l63K44J59j85k37K06K69k27M46m18k9K8r7J56Nk37K82M0k78J88L1L86m77
1949f8L77j20q9l49P19n35n1J73k79j13N5M77k40K88n45K87L04j3m5k88J98j92
$$ y = [-10, 41, -31, 27, -337, -171, 467, 2, 67, 126, -210, 192, 92, -409, 87, 178, -243, -87, 34, -60, 26, -369, 95, 152, -199, -128, 98, 64, -13, -86, 69, 325, 63, 24, 41, -62, -449, 263, -74, -176, -54, -41, 108, -166, -304, 269, -94, 88, 3, 89, 20, 89, -101, 256, 260, 75, -105, -69, -71, -130, -278, 85, 115, -191, 203, 146, -182, -28, 365, 52, 280, -215, -28, 320, -152, 111, 100, -188, -54, -4, 33, 88, -172, -228, 143, 118, -83, 26, -59, -47, 256, 215, 197, 304, -267, -66, 96, -332, 93, 176, 44, 249, -382, -44, 27, -175, -42, -1, 143, -152, -84, -136, 6, 16, 46, 56, 51, 43, -28, 38, 35, 135, 15, 221, 112, 127, 118, -257, 321, 47, 34, 117, 2, -102, -27, 205, 40, 29, 140, 136, 40, 27, 40, -323, -79, 80, -105, -342, -136, 133, -94, 352, -66, -95, -67, -164, -8, -3, -240, 42, 82, -196, -8, 23, 409, -68, 309, 189, 100, -249, 470, -65, -116, 57, -222, -335, -280, 197, -43, 245, -300, -13, 291, 278, 233, -55, 143, -49]
1971d9J49j38J10k10K73r5m7J03m37N33j65j18q3L86j49NJ45l21R5L55k81m26
1993c65L70K25k8n18N46m58K03l97P52k64N0l81j31K55J60j71K93j45R8Qk15l5
2015a48M72m44K61j20l70L93R9k91K36j06p6J71j91L30k1k29J30j6j57L69k69
2036B3j20J51Q1J10j80j53MLM8n4Mj72M27m41o8M98j57j47K78l41M33k92q6M58
2060C07j81j49J67l80M55k59R9j16L6m7j59J1K82L5k71K92O2k40O4j20j3L65k05
2083C5J07o4K8p5K40j34n09L01J15L7j62Qm2l4K19J77k50j64L43n8j60k23K78
2106A3O5J60l21LJ02j88K59j80L38k66j4n7J63j73J03l77K12O0L7J16k52OJ62
2129b9L0k72L97j2j83o1J81K7R0pl91M44m5n2L1l73M88k65Q0j38K61k02r5J73
$$ y = [-49, 100, -38, 72, -138, 135, 40, -7, 96, -341, 192, 27, -91, -174, 212, 63, 68, 213, -108, -13, 342, 61, -365, 5, 230, 202, -316, 230, -228, -25, -422, 330, 66, 116, -265, -396, -141, 19, -152, 141, -4, 94, 102, -113, -148, 324, -120, 141, 21, -349, 44, 143, -148, 88, -18, -94, 77, -114, 216, 195, -34, 96, 80, -77, 292, 23, -97, 54, 135, 245, 65, -88, -84, -81, -33, -87, -83, -255, 172, -269, -337, 161, 4, -143, 135, -206, 227, -65, -151, 307, 126, -23, 144, -236, 219, -40, 59, -57, -21, -68, -227, -216, 66, 101, -170, 122, 184, -56, 8, -112, -125, 240, 35, 142, 78, 106, 31, 271, 137, -372, -71, 44, 81, -81, -73, -115, -149, 70, 247, -3, -167, 176, 118, -42, -265, 13, 78, 238, -83, -80, 22, -166, 93, -87, 251, -15, -29, -86, 77, -96, 7, -370, -158, -98, -61, 55, -197, -191, -29, 1, -271, 126, 114, -69, -130, 51, 78, 168, 161, -230, 214, 169, 117, 148, -225, 263, -2, 78, -60, 201, -1, -96, 77]
2153G7J9l83J87K90p6mj96M6K5j82J00K56q0k53K99J9M9m0n34L90r1j54L1K40
2177C5r8J8J92j69J29j05j55K11o0j4Q9P1l66K40j18J9m0K33N8k29J03M2q3o4
2201f1O5J01p9R7j99J23N4k64J09o4K72N4l99K32L17k99j33J63j84N90o21K94
2223A68j87n6j27K15o6N1Q2M6N5L1k54O7J08m27L11K05j61j31N8R7J61k51j62
2246a67J01j62J89k4R3j01J27l79M61j09m7O2J72p7j75N3Q9Nk27k51M20p0L82
2269C65l62O7j3j38L00l31J6L32m28L20P2j34Q5m7r8J56j36J14l6K5j03j8j66
2292a58L40k42k9j65M82m22j5M55k88l3J17j12J96l88J38M38l91M24l31O0J64
2313B40l20P1oj17P6j92K23j8j42q5K48r2k32J05L53n2k41K05K5j62j14L14j11
$$ y = [77, 96, -287, -100, 190, 114, 110, -86, -40, -15, -197, -97, 159, 79, -174, 125, 144, 193, 153, -381, 9, -82, -236, -205, 35, -63, -45, 147, -22, 107, 2, -153, 58, -2, -16, 73, 144, -222, 18, -100, -81, -121, 112, 170, -59, 44, 86, 3, -61, 4, 105, 26, 123, -76, 47, 101, -163, -54, -118, 154, 208, -191, 41, 358, 59, -74, 89, -95, 495, -126, 168, -19, -75, -202, 13, -53, -2, 80, 126, 181, 212, -42, 25, 133, -294, 17, 222, 61, -70, -12, 85, 246, -5, -167, -66, -228, -39, -63, 30, -71, 56, -323, 138, 29, -18, 44, 216, 139, -36, 17, 106, 111, -116, -367, 53, -17, 365, 3, 70, 57, -81, 219, -112, -96, 236, -192, 128, 200, 66, 151, 104, 6, 162, 26, 140, 104, 129, 26, 8, -158, 182, -60, -89, -254, 228, -194, -209, 246, -42, -75, 42, -70, 126, -262, -124, 314, -77, 347, 16, 76, 240, -80, -9, -15, -132, -56, -248, -25, -43, -185, -270, -22, -114, -346, -241, 112, 60, -181, 24, 49, -113, -227, 87, -24]
2336b4j12K19j09j06K18m13L89k41o3L33J63l85J47l0L6j84J0K65J79k90Lnj14
2359a14J5P8l96M37j05J9Q6m7J84p6L6k48O4j42M18j84o2J65J35o85M51k36K56
2382D9j44k02L18Kl12L03k57J64j67K62O2R8m9j60J12K5%j69K5J76j31o9J46l13
2406b31K12r3m0M0R7k62K38P0O1k13j41J82J24Qo5N9J45j72R2M0k88K7K6R7j61
2431a48M5J64j95K23o1j15q2K9m8N50l00k1o9J6q7P3k7j06K04n22J70L44j80K35
2455I2j74Llj42L55j36J50m2J54n16K80j19P0M31n36m2J18j24J20J49j65J63j88
2478a02q9K59j48J7J28o6j37M38o04K06L25j65l26J29J3J58j38k40M09n2j43q3
2500b11K83j28l5j14J83l1J00k04K13l93P44o17L10J59m57K87j74o6NJ48j91K72
$$ y = [-24, -136, 83, -26, -132, 86, -327, 62, -179, -242, 91, 254, -131, 16, -14, 22, -162, -152, 113, 292, 2, 5, 0, -114, -99, -21, -417, 20, -85, -66, 20, -27, 157, 81, 117, -131, -67, -209, 209, 25, -37, 128, 263, -422, 29, -207, 49, -95, -297, 21, 23, -289, 14, -243, -79, -246, 16, 78, 176, 127, -33, 79, 104, 104, -65, -40, 136, 5, -64, 82, -231, -19, -112, -152, -112, -15, -277, -39, 31, 92, -121, -262, -80, 44, 52, -13, 46, 191, 19, 111, 151, -137, -110, -84, 13, -148, -103, 61, -134, 89, 28, -87, -169, -140, -188, 362, 62, 41, -28, -12, -99, -26, -53, -159, 45, -477, -307, 37, -143, 92, -82, -79, -82, -224, 131, -5, 145, 103, 257, -259, 21, -98, -28, 403, -133, -175, -57, -181, -61, 88, -77, 86, -102, -191, 68, -80, -63, 65, -1, -138, 300, -304, -98, 227, 62, -264, -135, -122, 36, -102, -342, 67, 15, -128, -211, 72, -56, -91, -205, -22, -53, 47, -157, 56, -337, 407, -210, 100, 259, -198, 89, -85, -151, -146, 2, -189, 83]
2522H3l9j95L95k7m02p5O5K71J22m47J80K96j91J3k64J76J67J25j69N4l45L02
2544I5m6j12R3m3j59M62l71J78J03j74N4J19k55Q7J70k90R7J66m03K59k41K66
2566E5L9K05j53j64j51j46L39k8P0j56j10L37l1o6J59k59J47m9j94L26m31J15
2588a46n6J91j47J89k94L95j64j14P6J37K2J71j92K18k55k13J84k8n3j14L31k62
2610a24qK9R3o0QN3J7j56r0O2R9j75K62j93K14o6p2L78o9k19K10k43J11Qk47L40
2636A62R5l3nj63l51M6L18J88l0j43j18N3K47j02l81N5J75k23r6N76m62j5J97
2659a0J14l61J49j9J37Ok49M09k86L29j90j12L23n1k98K41K83o7l74J61J51j96
2681I0k02K74l0N4j18R8k63M44m13J08O6n9k74N46l74q1R4n6j53J69Nk1l1P8O1
$$ y = [83, 44, -151, 244, 217, -185, -260, -195, 76, 198, -249, -69, 227, 36, 49, -215, -39, 128, 253, 84, 138, -207, 95, 49, -63, 30, -13, -172, 290, -81, 97, 200, 26, 80, 199, -56, 31, 201, -89, 8, 174, -229, 30, -211, 55, 94, 299, 146, -18, -169, -315, 24, -4, 66, -90, -200, 137, 106, 40, 199, -60, 87, 38, -156, 170, -261, -146, -202, -11, -158, 31, -263, 132, -32, -146, -70, 67, 89, 260, 68, 286, 31, -182, 2, -26, -79, -193, 138, -124, -132, -103, -10, -70, -62, -9, 8, -148, -238, -176, -77, -252, 10, -183, 31, -35, -107, 271, 202, -17, 193, -50, 61, 69, -178, 162, 257, 224, 219, 56, -295, -249, 69, 257, 227, 84, -34, 19, 266, 164, -217, -162, 13, -210, -306, 270, -192, -207, -10, 104, -257, -108, -127, 10, 16, -233, 176, -110, 219, 29, -83, 240, 189, -109, 132, 415, 348, -26, 135, 286, 90, -112, 162, 132, 186, 68, 166, -97, 347, -66, 42, 108, 49, -225, 321, -53, -134, -40, -96, -249, -80, -75, -96, -127, -49, 12]
2706A2j4J19Jk17M81m67k01O88l23j84L93k16l1j12j47J90L61o16M50j06j4K8
2728G5m9Q1j5j07K5J33k93L66j21P5p0l02M3J72k7j73J73J09k17J81J69j28j16
2751a6J52N7j13j02j30L28l23K91m5m3J61k15J23n0l83K41J10j23M46n89K95o8
2773Dk09L23k44J79o6J84k84J57N4j55J56O5Q8M5j19l57pp8K68n4j81L89q2j92
2797a16K77j36J92J18j54oj25k75J66J59j47J65Q5k67m1J70j84K73k71J09n0j7
2819g5j12O5O7J00k29K81J19j89K4q9P7M67l59j14R9N5p8o6J77l48J03J62K31
2842C68j71Nj63l51L46L2j54K9J08J8O8j05q2L22k21j37K78k95R5K12l77J48Q8
2865F1j41J80m8J0q9RP3j85r5K09j13J54J88k55l4k67M50K15m15L94l30K94m13
$$ y = [12, -2, 117, 118, -99, 382, -85, -286, 402, 79, -105, 288, 72, 41, -71, -218, -28, 333, -283, 167, 61, 47, 75, 26, 107, 92, -15, 10, 143, -150, 216, 95, 170, 100, -202, -159, 13, -14, -187, -14, 95, -122, 59, 228, 100, -16, 136, 193, 80, -22, -152, 176, -147, 144, 99, 56, 217, 2, 125, 75, -308, -67, 43, -80, 366, -223, 72, 4, -205, 118, -126, 53, -13, 171, -113, 44, 98, -57, 99, 164, 252, 297, 178, -179, -186, -264, 4, -50, -231, 158, 76, -116, 161, 25, 217, 335, 181, 175, 50, -225, -59, 100, -47, 118, 203, -64, -105, 65, -119, 154, -117, -8, -58, -75, -187, -122, -55, 45, -184, 97, 216, 27, 51, -38, 39, 506, 147, 33, 132, 187, 109, 43, 220, -128, -25, 137, 368, 197, 202, 39, -312, 34, 66, -88, -59, 49, 67, 135, 30, -52, 270, 49, -88, 190, -105, -10, 202, -175, -27, 61, -80, 100, 52, 62, -27, -18, 55, -130, -225, -16, -129, 25, 213, -42, -76, -343, 107, 322, -93, 301, -29, 265, -148]
2888a48L24J0k71m2J60k0k46K93O9j43J94j19j54r3j7L86j1k05J21p5K18l16l8
2911a23J78L4j0M6j76J26r4j14K94j14K9Q8k21r1L53l73K66J24j64j33L87l32
2933b0J25m98J27K56m9j62M77k61M3K76l46K65l31P9j75J66R8j22o6l4K14J48
2955B10k14j02j08M2M74k83M62o14q9K83k46Q5P6r3O6N7q5R8l09J37RL27K15j36
2979B62j94m5K0L1K1k88M26n46J76J46N0Q0k17M3O3M3j66Rl2q1J34o6K9K18j28
3004a2J03nN2m1K09l39k93N32n5k22R0o6l13O40l86j1M96l85J49l4K4J9k38P4
3028a2J42j17L21l38j0K21k63rj45L61q9l3k69O5J01o6K59l2l01L05L8k2J94j73
3052A28n55M67k3O3L5k71P2l8K66j14Q1j45j2J87l45L49k08K33j35n6O0K29l14
$$ y = [-148, 176, 186, -85, -127, 33, 13, -233, 60, 129, -14, 180, 61, -93, -186, -203, 183, 172, -33, 88, 13, 231, -85, -123, 55, 89, 79, 125, -51, 75, -19, -133, 161, 47, 76, 164, -57, -148, 205, -168, 98, 222, 58, -75, 312, -20, 105, -393, -266, -10, -59, -221, 256, -5, 38, 314, -32, 233, -98, -19, -194, -28, 70, -52, -118, -152, 62, 210, -4, -106, -214, -172, 302, 19, 481, -133, -222, 61, -185, -100, -24, -117, -51, 6, -79, 19, -290, -153, -144, 183, 398, 262, 68, 23, 43, 74, 95, -193, 233, -313, -137, 9, 59, 139, -78, -35, 28, 71, -95, -86, -118, -199, -65, -131, -102, 116, -12, 91, 86, 138, 97, 306, -33, -326, 206, 151, -71, 19, -47, -360, 280, -106, -117, 379, -6, 143, 109, 133, 152, -86, -12, 130, 13, 334, -4, -14, 207, -56, -65, -210, 151, 62, 29, -240, -175, -74, -140, 119, 87, -214, 91, 129, 107, 301, 128, -427, 40, 17, 80, 115, -156, -84, -122, 144, 30, 111, -34, -46, 141, -204, 145, -63, 170, 35, -21, 39, 268, -46]
3075d6K35k67J46L39j28k18Jj17J31j55j18K23J69j53m9J54k84K85k03j46K07
3096FJ2m5K80k89K00k55j47L17o9l18L26j87J11J1q9l0J63jj10p8J19l1J44k80
3120b40K62l65M21J68k70P3Q3m39K74l5M0j43K04j90K03m17L49P6K35l77P6J56
3142A44j05L16k62l6j54K73k64P9l0J4k72L28J08q7j70K86l8r8Qj0k02j31J34
3165a69J67J11K16l75j73J08K20k39Q5J65mo2k62K99n5k1j57M4o9J83J4K10j51
3188H5n1P8k82J55L36o62K71K54j47j23o1J92J69l17N4O2n5J30j95O0k69K04M40
3211C28m71L30p4R7k48p4l8J23j2K1j05j57L94q7P4q9j1p7J52P9K35k65J6k84
3235a43J89j88k7J5K73l56J00J07j31J64R1k65J60K44j57l00L10l5J22k16l01
$$ y = [-46, 189, -78, 68, 407, 279, 61, 62, -55, 76, -79, -197, 26, 195, 42, -7, 147, -137, 148, -55, -201, 6, 18, -27, 253, -36, 164, -91, -238, 79, 10, -308, 18, -169, -58, -47, -136, -166, -3, -4, -114, -192, -73, -104, 40, -240, 22, -343, 78, 246, -24, 49, 132, -307, -33, -68, -28, -171, 33, -157, 46, -371, -22, 54, 289, -88, -12, 144, 39, 355, 93, 57, -97, 176, -88, -9, -39, -25, -297, 31, 139, 52, -118, 168, 130, 32, 40, 30, -172, -303, -169, -2, 109, 325, -50, -223, -115, 105, -134, -49, 116, 112, 50, -212, 87, 32, 11, -146, -102, -171, 12, 26, 236, 85, 34, 112, -170, -15, 321, -341, -70, 184, 37, -86, -147, 45, 214, -103, -49, 13, -42, 88, -107, -47, -316, -112, 328, -143, 187, 113, 210, -38, -112, -150, -27, -39, -18, -123, -280, 114, 27, 101, 12, 1, -76, 76, 155, 390, 125, 141, -143, 46, -142, -169, -154, 119, -237, -137, -30, -161, 3, 94, -171, -11, 233, 76, -224, 86, 51, 173, -43, -344]
3256c44K84J16j38K4K0K30k49L51k5m04K63p1qK2O6j48L7l9j11J55J13J53j47
3279A50n1J08j10k2j75J48j55J33J41l81J59L95m38J89Q1l19L66l05L3L37m68
3300a84R1q2N4K82Kj86O2J3l08J67l6P2m6J77J29k7q6n4n3J8K1l7O4j05J70q9
3326B9R8k06j37K34j10J46n02K41K43o8j32M25n5J02l62q5O8L1P4J81j07j14J50
3349A44N5k81pK1M6J8k45L25k46J6L71k16j38K46N7j1n37L4M47j82M8r0Q0J32
3373H7J97k22j03K94j31l90L23p4n7K64P0l63J46m4O1n4Q9r0Om5K87l73L63k52
3397a1k07L70j06j81J72j60K33pJ01l54N18m10jj37K31K0l92N43P8j30j58J29
3419A41q0j53P0J73j65n6k18M76l61K85j20k9K4k18M04o7l17r7L88l09R1J69K2
$$ y = [-344, -60, 56, -82, -58, -38, 192, -57, 294, 269, -135, 128, 57, 49, 71, 137, -11, 26, -13, -124, 31, 144, 297, 150, 99, 207, 97, 75, -100, 48, -107, 26, 167, -214, -55, 340, -98, 91, 172, -147, 219, -86, -53, 284, -184, -93, -175, -121, 161, 163, -23, 39, 52, -256, -89, -125, -53, -99, 78, 207, 180, 94, 40, -13, 5, 26, -11, 53, -52, 118, 29, 127, -79, -216, 18, -92, 54, -448, -207, 36, -32, -164, 261, 206, 308, -54, -139, -71, -40, 34, 215, 108, -6, 144, 199, -82, -89, -68, -22, -4, -249, 76, -170, -154, 217, 1, -137, 109, 166, 155, -382, -348, 99, -83, -35, -125, -45, 87, 284, 62, -41, 253, 122, -268, 55, -19, -76, 188, 258, -105, 41, -3, 58, 4, 93, 3, 9, -36, 251, -122, 241, -11, -218, 152, 46, -135, 37, -123, 110, 103, 204, -150, 368, -42, -43, -180, 51, 71, -321, 222, 300, 170, 12, 141, 61, -92, -22, 151, -14, -70, -288, 188, -173, 112, -8, -37, -13, -231, 173, 106, -211, -308, 80, -229, -138, 31, 53]
3442E3j33J51j19P0j3m3j15J7M26l55J46m15O59m30L7M6J87j81J86l09R5J52k47
3465a35K78m99M06J94k90J11Q4k08o7K63m53K62j1J09l77L36N3j5M4m4K38k87
3487hN7j43J16k0k21J24Q1O8J22j68N1p6k5J1M8k07M47o6o6l43J88J30j54J75
3511A21l00RK90j92l7L73k61J24j76m4m4l20J74Q1N2L70j73o2Q0K01j84N0k43
3534a11K79j78N8l7p8J03m4J85l88M60k25mJ28l89K35Kr9L73j76L3j78J15k31
3557a67j14K95k68L05K01k00O0Llk15J44L5J19k66P5J91k01J7R5p2o3J2K42k24
3581An1j05R0J12j56p0M86k55j16J50L04n03m0K63k6j93Q6L4m7j79J97j04r9M86
3605B65j90m00K28q6k12M96j16k73J28K18J21l64J78M61k25k26p0J66j23K56Q9
$$ y = [53, -80, 71, -48, 22, 9, -34, -149, -132, 294, -61, 85, -330, 329, -101, -64, -18, 169, -12, 174, -135, -40, 112, -135, 143, -356, 50, 244, -46, 65, 149, -59, -126, 137, -316, -54, -65, 44, -333, 3, 56, 41, 85, 41, 279, -8, 49, -94, 22, 2, -219, -95, -14, 54, 176, 8, 59, -17, -42, -31, 17, -190, 257, 191, 125, -218, -30, 100, -54, 121, -179, -170, 120, -72, -109, 264, 3, 127, -49, -93, -137, -457, -283, -202, -150, 220, 47, -15, 65, 266, 82, 132, -111, 168, -10, 48, 11, -67, 36, -8, 177, -211, 249, 24, 20, 148, -241, -6, -4, -103, 270, 94, 127, -51, 64, -167, -281, 14, -254, 51, 252, 52, 112, 115, 112, -103, 41, 76, 195, -71, 4, 195, -6, 11, 106, 34, -29, -17, 225, 1, -50, -155, -65, 47, -109, -179, 307, 52, -64, 86, 390, -113, -153, 110, 84, -109, -23, 11, -36, -215, -18, -122, -221, 265, 75, -325, -97, -183, -395, 101, -15, -288, -160, 58, 179, -185, -7, 454, 229, 3, -67, 99, -24, 232, 321]
3626C21n2m41k22M83j51N8J25j35J74j21J01o3L7k38K41k22J50j60P7J63k53k6
3648a54j43L59J8l9N8o0K6J3j59m2JJ59J59j49Q4L7l02J01P3k1j27M34l08j25
3672a07J96k20OL9M7M6R8l35J48j8Q9r8k31K78P1K45l05J13K1K7j51J59n5q2j59
3697a78O6L4K87l43M89k17k23O6j70K84m4j50r5J45J9l19L97j19L5J63m96N22
3719A53K09l11q3j00Q7M7m26M62j38P7K77j28o8k92K03N7R7j46O0m3J31k84J04
3742e5L6J45m7j65K07m7j68J34j92O2l5J33K26j12k77J41K69j01k31J2J08jq2
3765d0K91l62j15J72p8R8J16j02K56k34l6Q6o2r1K96o3j47p3J23j56J60Q6j27
3788bM6j4P6j40j69M88l60L27k77K69o2k4K1k56n1K53k03K2J64p7j4No2J59k56
$$ y = [321, 269, -172, -394, 89, -62, -4, 121, -14, 160, 39, 140, 77, 114, -124, 117, -105, 45, -115, -38, 125, -128, -154, -297, 62, 80, 41, 99, 39, 65, 78, -81, -123, -122, 37, 196, 47, 131, 168, -134, -33, 40, 19, -108, 326, 18, -107, 89, -131, -125, -86, -39, 7, 105, -230, -82, -100, -11, -109, -340, -62, 9, 254, -51, 62, 83, 110, -41, 118, 63, -19, -178, -112, -78, 209, -134, 355, 138, -85, -19, -189, 95, 51, -99, -194, -49, -30, -349, 48, -71, -36, 127, -369, 153, 362, 51, -32, -132, -45, 2, -424, 38, -100, -23, 254, 126, 58, -234, -31, 26, 123, -23, 37, -6, 125, -159, -55, -19, 126, 79, -86, 121, 74, -94, 40, -152, -90, -125, 8, 234, 122, -155, -14, 255, 154, -77, -65, 43, 42, -40, 251, -111, -226, -54, -132, -34, 82, -20, 236, 2, -34, 52, -10, -101, 195, 132, -15, -88, 35, -121, 39, 125, -2, 44, 30, 106, -34, -203, 285, -75, 252, -25, 244, 182, 158, 179, -77, -128, 125, -78, -56, 108, 31, 17, 22, -40, 119, -137]
3813a37J55k60K78k8L3k98L60j63J98p9l0J25l65J33j11J64rj8R9J10K8j45J22
3836A62j92j26K16J13l03KQ8J69j8j9J36l64JK18k98L78k28o0M84k95j58n9K59
3859A06j52J85k00J41R3k15m1J23j9K0L5J78m57K79n22L41J45J70j87k14J74m1
3881e8J04J7j20o3K43J80j15J12j75j17j8Q6j17J26k68K05L77l24j63q0K27j94
3903a35J00k1K72j45J3q9QoK76j09L8j88k15J92Q0j0m15K66J67j64O5j9J70q7
3927D4j92J07K83j22Rk99K48O4k89N0J37N6j00J70p7j26J34o9K63j83j08k81L92
3950A11q0j67N9K3l6L33m54P2N04l14j26r8J82k52M88m54jL00p6o0j41K50m7j30
3974a14j47J92J41J3P1l06K84l56K89k02J59R9j96K16m9J07l10Q3l02J63J80n2
$$ y = [-137, 18, -242, 36, 8, 41, -257, 103, -60, 138, 59, 29, 154, -211, -78, -189, -25, -34, -52, 47, 157, 185, 40, 162, -30, -156, 60, 173, -130, -128, -40, 129, 111, 92, 228, -136, -135, 83, -215, 163, -65, -125, 359, 64, -94, -153, 106, -46, 139, -61, 80, 173, -42, -83, 40, 21, 41, 76, 254, -203, 76, -446, -105, 40, 210, 23, -191, -17, -58, 46, 63, -57, -120, 123, 303, 188, 300, 125, 8, -10, 76, -41, 85, -183, 22, 399, 75, -88, -168, 59, -135, -35, -56, 216, 71, 84, -5, 3, -3, 273, 164, 202, 14, -201, -9, 71, 61, -354, -88, 79, -85, -20, -39, 131, 44, -148, -41, 242, 120, 129, -170, 78, 142, -147, -97, 40, 96, -4, 166, 89, -37, 97, 28, 291, 108, 0, -281, 111, 31, -136, -77, -54, -90, 243, -211, -139, 365, 51, -75, -173, 9, -243, 245, -209, -210, 90, 14, -46, -187, 63, 16, -114, -261, -69, 72, 85, 156, -150, 134, -222, 67, -135, 24, 123, -73, 143, 94, 201, -109, -26, -328, -165, 15, -37]
3996c7L6O9q9o0M0o9j21L18n4r1K4J0j6k40K30Np3J13j5p5J4R3p4r6K63L08nm27
4024a9j19P6j9J54PN6q6j31k08K17J10k2j60JL8K6r3L01j32m41P31k15p6J73k23
4049e4R2J85l9j87J20P5j94l2J20J6j45p5L92k67L8M8k56K29K7j02L69l80p0J93
4073A03q3m6K74l25j9K15l81L18j92k34N72l25N4K90k1j71j88K81o8r9M60l24
4095I1j4j50K91m33Q1R0N4J30j40q9lN6M9k2J17p1Lj43L95q3m61M95k15m0P2P7
4121A37qk06M4P6m0k34L57j16Q7j67J60J35l90J15j05J93l2%r0J67r0j40L75k41
4145a3l79M41o0K2j12J69r9j2j6k24J26J93J68j84j79K37k95K59r6j04o0J07j7
4168a28N4K69k90J14J83j50m4J53k93J1J21j27M37j35m12q3K95l0J90j27J1j40
$$ y = [-37, -1, 68, -21, -81, -41, -110, -231, 87, 33, -58, -34, -24, -40, -280, -50, -45, -118, -5, -20, -95, -81, 12, -62, -158, 105, 413, 408, -19, -138, -62, -81, 73, 80, 136, 50, -81, -289, -72, 38, 16, -144, -143, -105, -79, -172, 129, -3, -444, 287, 72, -4, 169, -54, 38, 223, 184, -3, 117, 192, -2, -34, 86, 102, -43, -118, 274, 7, 45, 93, -163, 66, 93, -9, 360, -20, -90, 103, 20, -26, 248, -77, -96, 119, -262, 56, -136, -370, 202, -123, -69, 221, 200, 29, -159, 122, 54, -45, 415, 91, 77, -73, 218, -215, -134, -44, 10, 140, 0, -89, -92, -36, 13, -9, 108, 37, 40, -103, 292, 209, -252, 243, 28, -12, 60, 137, 129, -77, -33, 43, 3, -231, 126, 10, 97, -70, 90, 225, -165, -50, -155, 38, 6, 6, -84, 83, -7, -147, 228, -13, -392, 49, -11, 11, -101, 68, -31, -43, -59, -283, -157, 36, 204, 20, -159, 78, -217, 42, -54, -158, -218, -111, -128, -74, 195, -95, 19, 202, 52, 8, 161, -132, -121, 0, -127, 310, 175, -237, -320, -25, -55, 135, 8, 19, -121]
4190a21K74m82M51o0r3m9MMP7L1l7j8J84r2j45k91L55P8j08J62q5QNK51l97R5
4216Ao9j23R5K61M2k87K27j32mj08K44m4J06j94K2J57k13j29J56j78M4J02J60
4239A36j61j1j04K25q4kj49J14M3J15JLj07l2l3J13J2Rk38K17p4r5J5j95J98M02
4265C18k88mP9o2j05J94j14j58P6N1j7O1j78L56l97L5n0Q1M5K11l7J2l34J61K05
4290A41j38J23m04L5K04pq6M11n33P2L75j6o4q9l74M91p1j88KK1K31l9j91Q3j98
4315b09J72P0j21K03K1l34Q6Lj60K66L6r2k62K47J77k17oJ70Q6q0l2k77L07P0
4339A24r9j78J28N1l3k1lj71M58l21Q5m19L74J82k69o7K91l9J16m31L34j95L80
4362B77l7j89o4K6K43j67k25Q7J81l52L80j01j59J92r0J10j13j60L65j47k48q3
$$ y = [-121, 153, -329, 122, 62, -31, -80, -76, -72, 5, 36, -1, -19, 165, 73, -72, -363, -8, 70, -38, 124, 39, 47, 52, 303, -94, 1, -68, -191, -96, 165, 207, -80, 147, 15, 11, -97, 147, 103, 209, 15, 37, 194, -19, -148, 8, -170, -126, -24, 136, -25, -36, -140, 85, 1, -1, -150, -36, 7, 122, 123, 126, 19, -13, -46, 67, 79, 88, -150, 67, -7, -102, -87, -282, -84, 318, 30, 26, 105, 43, -62, 132, 18, -140, -64, -13, -30, 31, -147, 209, -188, -153, -203, -122, -77, 134, 97, 109, -225, -64, 141, 3, 126, -278, -243, -39, -46, -132, 279, -254, -182, 193, 177, 113, 24, -350, 141, 70, -118, -116, -95, 136, 97, -94, -11, -209, -37, 33, -88, 115, 136, -198, -112, -109, -269, -3, 33, -59, -321, -74, 103, -114, -120, 50, 136, 56, 24, -253, 54, 124, 25, -153, -25, 26, -7, -28, -31, -202, 256, -65, 20, -399, -25, 157, -112, -179, 112, 73, 189, -242, 92, -103, 277, 240, 51, -13, 13, 256, 89, -136, -49, 132, -220, 160, 59, -100, 92, 2, 112, -1, -161, 204, 57, -191, -274]
4384b74M88l35K06N6k69K02j58Q4K18k77Q7k8K5r7K0j20q1K47j09J19K7oL44m91
4408a22J50L16n03M22m51L32k81j0J17m4R2j09r6K85k23K15k49J00J55K05o4l00
4430f3r4K02j00N1m1Q2q1K00r5j37m5j32L51o4l18J12J56Rj61J50J40j03Q8m1
4454F6j08J27k25j99M33j19J37O8j46K05l82J12j2J55j4j89K50l30K67j00k78
4475b82K06J68o8k36N49l13J75j65L2j65J15j27J99j93K29j48l69L15K92r2q7
4496C5p9j48J75l02L55l5n3L1J94j89o4J74k82K59j50J11k38L67j48j36Q6R1k39
4519a85M50j98j60J36o7J16l4N2k94K45l06K54K00o8k92J64k73J94K00L6k69L18
4541B19l61R1K8j70K11k17J99j97L66k28K44j20j64J45J32j82j06O6p1m2K05l83
$$ y = [-274, 214, -121, 85, 141, -128, 74, -84, 0, 218, -59, 28, 0, 25, -72, -52, -172, -253, -6, -115, 4, 31, 25, 369, -122, 28, 344, -159, 263, -188, 144, -137, -147, -30, -74, 18, -91, -187, 98, -125, 90, -159, -59, 96, 301, 237, -63, -157, 45, -55, -4, -45, 37, -44, 156, 61, -76, -121, -253, 98, 34, -284, -172, -16, -7, -168, -18, 122, 19, 107, 66, -42, 85, -140, -339, 94, -25, 112, 180, 34, 239, -143, -31, -43, 112, 98, -91, 159, -171, 96, -4, -282, -76, 92, 24, -212, 337, 24, 199, 34, 66, -99, 16, -111, 88, -105, 124, -24, -393, -78, 214, 122, 35, -44, -192, -17, -319, 36, 1, -52, -21, 173, -16, -80, 94, -188, 71, -79, 32, -206, 161, 13, -123, -37, 54, -185, 265, 67, -93, 43, -24, 92, 58, 110, -184, 61, -245, 9, 209, 141, -151, 13, -260, -66, 134, 170, -99, 219, -142, -51, -23, -193, 18, -199, 0, -197, 169, -59, 185, 65, -99, 46, 178, -4, -110, -44, -115, -157, 48, -335]
4563c35K86K88o6k19l20N33k85L27l10J23K95n84L35O6j50ml3J87j24P7K3k4J61
4586B47j71r9J04m8J41j88j97L54j60K18k42j38K03j04K7J30k22K89n5J32m16
4607a95J37n9R9J50j90M48m85J20j02J63l47P65n65J28J29k79K29L3m03M62l33
4628i5L5J98o8m5l17K01L15k93M0J35kJ05j99j20Q0K78k07j1Mk05L22q6k46L98
4652B17N9l64K80k40k2J51k17L97m09N9J44j54K52j67l60M33O9m23J40K25r2J13
4674I1r7J17J57j92j01K76k30J61l62J64L4O7n3K24l13Q7q4n7r7J30Q4M3j69L1
4698h9K8j27J56L9j33M8J08j49K12j17J07K17k25j14K24j78J2L7j33RL9J25RJ52
4722B57k91q0K46j99P6J27k91Q1M3J18j96j04L2N8Oj82J37J79j65J24oQJ9p1p4
$$ y = [-335, -49, 239, 173, -46, -366, 167, -118, 209, -101, 22, 317, -267, 68, 134, -16, -20, -53, 134, 10, 87, 110, 86, 247, 76, -23, 81, 33, 174, -14, -211, 143, -17, 201, -41, -179, 24, -80, -53, 77, -145, 144, 89, 221, -195, -58, -117, -18, 132, -58, 390, -95, 25, -77, 86, -261, 504, -61, 67, 196, -83, 146, 179, -224, 238, -95, -60, 138, 70, 25, -292, -91, 224, -69, -29, 106, 104, 209, 10, -110, -30, 248, 41, 30, 34, -171, 151, 65, -181, 217, 276, -88, 192, -48, -70, 81, -136, 261, -148, -89, 55, -99, 153, -14, -374, 59, 128, -295, -155, 70, -22, 91, -6, 111, 268, 76, -25, 251, 21, 182, -180, -16, 18, 85, 32, 256, -57, 30, -54, -111, -208, -78, 6, 49, -120, -89, -61, -188, -32, 7, -126, -78, 30, -119, 93, -24, 83, 300, 75, -39, 185, 7, 19, 56, -77, -68, -29, 96, 105, 257, -34, -114, 132, -67, 9, 136, -155, -74, -31, 87, -109, -213, -181, -123, -117, -299, -162, 17, -148, -24, -30, -22, -3, -74, -148]
4747a48J2K45j27Q8J59k51j9R9K6k96L42l5J5j43k09J24O5M2J11L2j53M1J79l05
4771a06K77n9k29R3P0o7J05p5j9L4j01J06k05O1J1J01P6Q7j76j06j86J60K23L36
4795D11l21J85n34N35l68l2K01j32RJ45P3l0j1j24l15M51o7J22k1j59K20l73J62
4818B7R8l32M44k15l05M19j46L9j50L59k40J04O0k13K21k63J46K41j39l1j96Q3
4840A1l3O4q1L09k25J0J00m1j51O0j22J56k1k00J45M9j38Nj33J50N7N3K52k37
4864C9o7p6O5k74J60J33o5J85j49J36m3k63L25k28K08r2k76L46l56M45j39JL7
4887E2j58K99j78K67m80K28j30L51k03J32k14q8J69j31K00j11O7j08J88j60L81
4908C73l79j0N7K1J60m41K68k34J30j64N4J84K20m6l28K94k48l4K72N3k3R5k86
$$ y = [-148, -136, 109, -18, 70, 229, -22, -41, 58, 84, -212, 130, 95, 110, -33, -242, -118, -53, -11, 100, 132, -21, 20, 199, -106, 171, 112, -117, -24, 46, -21, 84, 9, -10, 24, -77, 29, -176, -115, -104, -3, 73, 160, -16, -122, -308, -148, 75, 411, 90, 275, -259, 276, -92, -124, 77, -55, -46, 99, 172, 142, 131, 7, -308, 143, 76, 198, 177, 18, 238, -135, 27, 125, -207, 237, 22, -283, 136, -10, 29, -121, 238, -2, 102, 162, -51, 170, -93, 53, 294, 155, 124, -72, 11, -22, 42, -39, 270, 45, 55, 155, 114, -37, 23, -99, 57, 36, -164, -19, 30, -108, -103, -236, -86, -29, 24, 276, 39, -28, -104, -39, -313, -153, -20, -85, 100, -49, 87, 44, -219, 106, -122, 86, -6, -282, 64, -292, 153, 14, 15, 52, -106, 193, 15, 282, -198, 30, -100, 251, 48, 180, -34, -122, 47, -84, 116, 5, 72, -36, 152, -8, 373, -6, -16, 41, 62, 222, -219, 49, -185, -55, -219, -165, 19, 239, 193, -135, 159, -89, -123, 149, 202, 179, 274, -12]
4931a2N3j26p7r4m9K67L67n6j95k49L01k19K00k7N0o3K1n3M5p4M1mJ56J29n22
4956a90M93j03m15j17L04L97l50N7n2k19M2j23K58J79k44j50J88j58M72l99J38
4977HO8j89q0J97k6q6K67l62O5Q8k78L94P6m7K45l75Q8O8j23m0j0j00M9q9J88
5002dL4K16m32k2M5J77K4J57j79j59L23j55j52K17o6j82LP1J36j95K91k21J45
5025G2o4L05l29r9K41m0Q6m99J47K02Q2k82J46K29k14P0j40K7J34l94L42k1J36
5048A37k06J00j37R8J98n1j90N7l44M03j25OK01j17L1Q6k20J02J34j37POl38K78
5072b1P1m63M91l3R8rn2j01j37n1K29K3p5l3p4J23o9o3J61o9J05n05M37J93j68
5097Hq0K0k09K21JO4J63j05J65n22L35Mo7j06k4J03K54j89K4R6l11J38P8r2K7
$$ y = [-12, 41, -85, -162, -256, -305, -38, 329, 273, 78, -171, 130, -89, 111, 84, 134, 71, 92, 39, 84, 10, 51, 47, 203, 332, -190, 303, 200, -215, -332, -28, 369, 19, 76, 24, -195, -153, -276, -18, 161, -83, -233, -45, -203, 269, -130, 8, 76, -113, -193, 4, -22, -108, 159, -203, -138, -50, -328, 66, 142, 95, 340, -35, 53, 121, -2, -42, -52, -152, -103, -192, -4, 30, 246, -186, -208, -163, 14, 38, 195, 16, -143, 180, 25, -127, 90, 24, -158, -155, -84, 52, -143, 148, -73, 72, 8, 313, -16, -115, 126, 86, 172, -327, -180, 22, 104, -178, -32, 197, -17, 53, -87, -60, 74, -320, 22, 1, 137, -69, 31, -106, -8, 190, 139, -51, 6, -338, 65, -60, -54, 147, 30, 61, 147, -73, 29, 163, 26, 33, 39, -299, -21, 50, -413, 78, 45, 143, 134, 82, -19, -156, -207, 22, 45, -30, -63, -137, -14, -83, -146, 15, -54, 51, -454, -17, 176, 8, -72, -52, -261, -40, -39, 25, 188, 83, 248, -274, 61, 65, -2, -108, -132, -29, 225, 36, 60, 156, -155, -17, 61, -31, -4]
5122do8K23j54K22k12k11K49j03K29k9j91NJ93k22J32n4J80j58p3K42jr1k69K52
5146H7L8L7j41J06p4J99m29J47qk9o9J66J32l60L08J19k11M7O6k85M43j97j06
5169a4J47K0k37K38j30k71L0J79J76J16m8l34k9p6K77K92m18J30j41L24J15k46
5191A00j71n5J89J4n4j99L30j07J34k5j43o4K76k37J9K83l16l7K30m2k67K3J20
5214AM9j93J14j57j7J71j02m6K6L09j95K05j32q8m4L7p6K81k24R3J26j79k82K82
5238d1J93l7j33p6L54j38q2J29l02L36J37m94K75n4K91l18j21J04L1pj07M4k03
5261b19Om9j00K89J09J53j33j87j8L38m06RJ53R4K34j70JPk83L42j55j10K60k5
5285A40j87N5j12J91j5k94M57j64l7N0J13j67K3q9K7J75j58J25K7J0J69l78j8
$$ y = [-4, -72, 151, -3, 219, 7, -204, 45, -58, 171, 142, -49, -44, 149, -73, 59, 5, 185, 27, -46, 196, 195, 104, -165, 87, 125, 162, 21, 127, 53, 252, -177, -30, -38, -67, -136, 30, 162, -198, 110, 229, 18, 65, 131, -154, 289, 92, -14, 133, 153, -84, 154, 24, -247, -217, -38, 138, 254, 206, -128, -157, -233, 44, 336, -82, 48, -93, 231, 346, 100, -71, -126, 63, 77, 23, -176, 154, 47, 181, 156, 13, -51, 225, -12, 7, 290, -26, -63, 167, 125, -142, -119, 1, 50, -143, -29, -186, -203, -32, -134, -180, -154, 155, -40, 165, 33, -55, -99, -62, -138, 143, -81, 12, 138, -41, -323, -41, 152, 115, -18, -94, 260, 122, 40, 169, -133, 203, 340, -154, 121, 67, 358, 40, -81, 23, 54, 47, -60, -16, -219, -213, -262, -362, -73, 36, 189, 56, -131, -149, 189, -217, -208, -55, 39, 273, 103, 104, 111, -172, 170, 15, -95, 165, 140, -47, 8, -104, 87, 72, -222, 235, 71, 34, 84, 197, 30, 53, -36, -9, 166, 8, 133, 160, 170, 339, -39, -57]
5308e7O6k2J01m38K33R3j01J59k8Q8j67q5P3N4M8o6Q3l2j00K04r5J26k72J86k3
5333B8J26k98J81r8rJ22r6J63k14J50j26K0n1J63Q6j76M5J72j32j42O9Q9q9P6
5357E9J34j93R6l92M38J74j84m3n2Po9J14j86J30K07k22J21k20K67k63J05j27
5379i9j27O4k9K17J8k23N1P0J45k4j18L7k91L93J53l91N4P6J27O6k90L08l49J52
5403a0K00k18k41K17j35j75K67K38j06j06l54L97J73j21j3j21L23m6k25J5o3J
5425a03N3j10J9j52L39j97K56k59J41KK5j05J70j00R5q7l68M40k7L7L3m14K17
5448i5J30j04J59j22j4k21l8J06L97j97J36m13L44K13l51j2J00J55j09k5q2K78
5470B35j17j27r2N1m9KJ50l7J6K69j79k80K12j46L2k2m1K58J4k80R3j0J38K3q5
$$ y = [-57, 9, -13, 88, -350, -117, -24, -125, 34, 6, 94, -73, -158, -85, -31, 17, -49, 34, 2, -98, 106, 11, 137, -135, 51, 28, 154, -144, 37, -61, -70, 52, -44, 119, -95, 55, -71, -51, -102, 61, 147, -29, 16, 188, 56, -86, -17, 72, -17, 59, 193, 0, 96, -296, 142, 316, 132, 89, 37, 44, -25, 89, -97, 33, 240, 18, 139, -81, 186, -77, 28, -99, -226, -162, -191, 26, 44, -179, -128, -58, 87, 63, -55, -18, -309, 84, 237, -154, -100, -24, 103, 169, -121, 187, -162, -10, 190, -28, -269, -52, -187, -362, -95, 143, 37, -69, -423, -26, 147, 26, 13, -108, 215, 169, -56, -41, -104, -103, -50, -160, -141, -293, 46, -151, 105, -154, -13, -11, 14, -91, 79, -21, 74, -13, -381, 59, 32, 69, 102, -312, -95, 35, -69, 90, -32, -46, -267, -305, -199, 198, 1, 137, -276, 68, 281, -70, -82, 18, 173, 64, 39, -43, 235, 118, -9, -101, -50, -99, -97, 53, 16, 32, 301, 122, -158, 54, -92, -60, -82, -123, 135, 149, -131, -38, -48, 90, 113, 28]
5495B8J99l83K01l84M55nj91J31j55L39j85k54J9J86OM4j88K43k32M98l85L4K00
5518B21l48k00J79r0M41r2P4J8l82J36p7N0oJ28N2l76M26l01O8J37No9J12K56
5542C62l33j06j28M11l38k7%K07Q9l5j91p3K35j55K04Q8l16n9L09N6m8j03q8J32
5566I3j70J39l34L91jK98l65j1O3j88J92j58L77n45J81J96o3j63R6M9J1j24J41
5589A05j77j03J58m23M58N6k54J70j5K92m47K75j30J44k1j83N7l7J18J47l3k01
5611d4J64k06Q0J67l64J76N0M1j33J37j52J92K3l50M09lk4j09L00m46K60l15J14
5634c3j61L33L7j70j34L4O3k1k6J52L13m31r9K61k72j0L67n1Kk70J59l4K3k67
5658b35K93J01j94q8r4j3K43r2L78k37K4K4j15n9J38j09O3l17M24j26rK52k05
$$ y = [28, 227, -156, 45, -339, 116, 111, -80, 51, -104, 235, 50, -204, -185, 1, 7, 51, -137, 106, -126, 372, -13, 21, 221, -127, -327, -148, -238, 203, 111, 185, 203, -179, -43, -120, -70, -76, 52, 104, -272, 154, -147, -79, 58, 63, -6, 106, 362, 29, -77, -205, 206, -132, -159, -159, 48, 137, 102, -89, -162, 73, -82, 122, 210, -106, -165, 144, 200, 152, 49, -39, 93, -77, 62, -272, 119, 118, 416, 51, 40, 103, -85, 107, -51, 326, -219, -38, 158, 95, -68, 28, 77, 88, -36, 105, -72, -175, -17, -440, 18, 74, -180, -10, -25, 267, -180, 95, -35, 109, 88, -95, -38, -75, 43, 190, 157, -44, 120, -86, -6, 161, -203, -27, 23, 64, -69, 68, -84, 108, 131, -219, 190, 187, 163, 54, 354, -92, 168, -147, -33, -194, 139, 176, 6, -128, -94, -31, -52, -78, 74, 387, -44, -143, 118, -154, -164, 203, 152, 154, -116, 43, 9, 32, -235, 58, 159, -35, -123, -217, -230, 13, -79, 299, 62, 86, 110, -5, -64, 74, -35, 28, -289, 135, 9, 0, 252, 47]
5681D7j93j3k6J9N4J72j96q4N02l04j53L37l15L35Jl34R3m5j4K80J0j95K57j61
5705G4k00MK88l21L74j41o4MJ08j37J07j02j3J82j33J28q2l51K65J04m11L39k8
5728fr4K3L44j27Mj89K6l0o9O28l08k06k9M4Q3J22j67j14J23J81J5l08r3K9J47
5753B9j75K84M0j50l59L87j17k20K35j8J30N6j52l7J72J09k38J68j09Lm09K61
5775a10J29L4R6j64r0n5M2K88L4k21Q2l6J38K2k22k77K22J95j63L3J12R1j80l6
5799c6k4j17L6J89q3J35Q5k83J74K6j37r2k15M72o3k05o5K24m10L45K25j65j0
5822FJ5j5rK6J14p7k04L67L9n47K20N7J60m4j64J15Nl4J20j30j57K99l00K30q6
5847FJ18k4Q8j91j5q6K13j97j32O3N6O3P6k70K47K7k5J79k66P1k5po6J08K52R3
$$ y = [47, -146, -159, -185, -166, -112, 60, -136, -220, 282, -22, -175, 162, -153, 182, 183, -151, -58, -103, -117, 163, 173, -22, 235, 74, -126, -122, 166, -155, 219, 78, 14, 18, 126, -11, 96, -6, -19, 163, 30, 158, 76, -275, -10, 94, -317, 22, -6, -100, -77, 267, 140, 144, -45, -19, -49, -118, 510, 202, -4, -33, 11, 94, 216, 49, -65, 58, 239, 254, -54, -147, -118, 29, -146, 138, 178, 28, -331, 56, -61, -281, -46, -64, 66, 122, -30, -67, 105, 214, -24, 144, 35, 38, -371, -110, 19, 53, 149, -15, -105, -160, -118, 170, 204, -17, 65, 29, 167, 189, -33, -310, -88, 107, -56, -23, 89, 180, 0, -36, -60, -177, -141, 48, -35, 100, 185, -98, 76, 102, -35, -127, -342, 130, 67, -138, -203, 21, -389, -44, 181, 16, 6, 21, 6, -3, 23, 137, 60, -144, 223, 262, -285, -65, -8, 152, 108, -56, 59, 64, 30, 150, 20, -137, 162, -138, 92, 6, 124, 100, 188, -3, -18, -104, 109, -88, -220, -157, -101, -38, 38, -232, 15, 42, 17, 196, -70, 1, -24, -31, -97, 11, 263, 356]
5873C56k58j03N5j47k09K70k0j21L3L46K98l55j32K05k18nq5l4J20JJ19j39K31
5896B08n9k72J09J52n0k72M0L03k67J91j39K27o1l02K13j10L59m33j7K14j43K9
5918h0N6P9k33N05m19J21J93q0l1j71L69n22K39J98k39j62Q7K67n33M78j54j7
5940d9J32k9k60J95K06l3l01P9J49k05K64m4n6j49M27j77o4rn0k46J37r5L37K09
5964C68k64r5J97l21o0L21k60L8j07J50l0j31J68K45k24k70L04k16J42j98J72
5985g1L05l15K4k6R2j02o9K60Mr3l26L88Nm1K08k57j23K58ok0q1P3M2l28K93j02
6011hM1j46L8r9L22j44m5J35l9R3q5M1k06j64L71J64l3m6k42J18j32J26j10N8
6035Hr1J04k40J51qK02Nj99m04N46m8j7R8J32k74q0K39j2Q8m60Q8P3k0o4p5K12
$$ y = [356, 98, -5, 50, -97, -306, -36, -56, -177, -144, 202, 500, 145, 13, 218, 0, -5, -90, -124, -4, -3, 116, -23, 208, 149, -123, -14, 138, 88, -184, -144, 159, -108, 83, -56, 171, 110, -192, 21, -89, 270, -163, -180, 34, -109, -80, -24, 55, -178, 327, -92, 29, 222, 142, 111, -60, 309, -213, 26, 224, -15, -177, -90, 177, -356, 122, -32, -49, 83, 54, -206, -11, 195, 162, -139, -60, 89, -116, 148, 104, 48, -101, 326, 149, 85, 76, 26, -220, -83, -178, 159, 368, 104, 9, 206, -115, -175, 146, -114, -76, -183, -33, -63, -194, -26, 219, -5, -275, 29, -187, -45, -243, -71, 234, -81, -57, -83, 9, -93, -162, 98, 102, 9, -317, 71, 76, 35, 243, -14, -137, 121, 115, 95, 14, 87, 129, -199, 94, -8, 33, -113, -75, -174, 148, 4, -41, 94, 55, 148, 63, 104, -102, -266, 105, 269, 236, 190, -52, 66, -66, 60, -50, 8, -83, 21, -219, -68, -76, 126, 131, -68, -472, 74, 26, 9, 107, 239, -35, -115, 124, 112, 200, -260, -172, -99, -119, -183, -258, -46]
6061d6J30l04L13k38J14J33J88m64M62j68j50K29J52j72l38P1M3l1p5J83j45j32
6083b45K69Q0o3j35J02l0j71N4R2J09n0o0J55Mj58J36P5j76r1Q5o6O6J66o2k88
6108b02K79J3J9k52L37J20j10k93K53j4l35J52r4L31l38Q0q1O3j72L19j42P5q5
6131g7J23N3k70K49M7n3Mjj15j06L49j42l01J41J34K09l24r8L11k66j0mj80M32
6155A05J06m0j25k5Mj76m8K24K32m98O78m34j31K50p2K97l79p4K56k66J51j49
6177a14K84j86j3J52n8J2k22K70j29Q4l12M15l33J14J40j65Q9Jj52K09j88L49
6199B47j55j12l3M8J83m81J96J92N6j10J35o9j54MJ1J06l27L02j38K02k9j76K52
6222A50j97K6j93M18k65j46K64p0k38M81qk10J68l26J72k75M86l66O2j23K79K7
$$ y = [-46, 84, -220, 93, -145, -31, 102, 290, -174, 288, 120, -30, 199, 351, 179, -159, -88, -45, -76, -151, 32, -113, -245, 24, 104, 41, -94, 8, -22, -193, -139, -47, 62, 12, -48, 107, 111, -47, 89, 164, -12, -103, -18, -84, -18, 148, 86, -202, 77, 90, 109, -143, 194, 314, 204, -89, 164, 150, -185, -33, -127, 204, -134, -54, -135, -72, -244, 75, -67, 8, -77, 46, 99, -171, 78, 125, 72, 76, 75, -40, -146, 203, 61, -240, -99, 35, 244, -80, -178, 133, -133, -143, -147, -327, 105, 211, 171, 46, 21, 25, -151, -199, 25, 257, -241, 437, 3, -128, 122, 50, 347, -32, -106, 150, -116, 35, -114, 170, -16, -29, 123, 65, 77, -145, 125, -4, 80, -232, 183, -150, -36, 104, -61, 28, 29, -123, 86, -102, 247, 92, -20, -53, -5, 178, -303, -107, 85, 141, 31, 166, 97, -57, -53, -42, 64, -263, 39, -99, 103, 74, -102, 150, -47, -21, -214, 204, -61, -207, 57, -13, -251, 230, 222, 12, 180, -146, 26, -249, 237, -129, -67, -190, 89, 116]
6244A16o1P6l45K93k18L19p7l5j25k3K01l59K37k46J69L93n72K99L6j24P4J2r2
6267e2j23J52k11K29j74K27K24m17J84j63K12P4l75J79k5K4j92L21m9j97J58J34
6289A40k44J00J20m7R8p8J1k29M7M8J45l60L82j45J36Q9l08p9m2J88J30j41l7
6312g6K9Jj59P6J58o2OJ38p3Q7k6k99J47k8K98j26J47k85LJ95k39J86l28K34j9
6337a5j81N88m61k47N40j56J02j43K5j91K19k17J1R7oL00k91j21qJ64K81k19l07
6360b36K35K28l87K30q5n4q1q3J00k5L85k73q3L06N3j1P1m16k3J01J97j44Q8k06
6384a13K98j78k9J4J05k30N9J82k47L03r9j39K46J9j94l74L86r2J26K72p10L76
6406a9J09j03K22j43O6j81L61j19k71J32R1j97K7j0L8n6o4K4J50m4R2O6k26K14
$$ y = [116, 55, 131, -214, 79, -139, 180, 103, 68, -57, -80, 121, -238, -1, -247, -78, 315, -257, 42, 78, -46, 28, 40, -52, -175, -23, -234, -5, -179, 48, 272, -145, 39, -124, 88, 162, -213, -34, -59, -35, -227, 94, 45, -152, 6, 140, -104, -4, 116, 69, 167, 89, 100, -129, -82, -34, 111, -249, 133, -12, 124, 213, -95, -174, -216, -28, 102, -39, -76, -47, -46, -205, -129, 29, -33, -27, 111, 38, 125, 99, -200, -53, -81, 217, 91, 238, -47, -44, 151, -88, 98, -230, 4, -15, -196, 392, -69, -316, 224, 68, 170, 27, 52, -139, 80, -137, -126, -29, -35, 265, -26, -147, -155, 9, 290, 71, -236, -1, 227, -160, 70, -15, -69, -150, -233, -133, -158, 227, -46, -129, 177, 230, 219, 290, -126, -149, -48, 149, 5, 93, -113, 185, 7, -22, -8, 97, -133, -74, 108, -139, 164, 65, -74, 172, 191, -3, -377, 9, -83, 43, 315, -395, -19, 90, -13, 209, 66, 132, -49, 312, 193, -78, 54, 145, -52, -25, -35, 3, -53, -117, -93, 57, 13, 105, 171, -55, 159]
6430A59j87j09J07K33k78q6L5k46M02l21N44k49J38j60K21k91j07L17k11K3j02
6451a68J35N2k82J71l5l8J22q1K94p9k10J96r2J30j75L02K5k13J14l83L88q4K78
6474C67q7k37J25k37P7Q7Q5q5k26K07j9J80j84m0Q4P7J37j66k69Np4L43M9M9k57
6499i%j3j0K5Q2j75Q6l5J57j94M9j02j17J83L40k25j43Q5m3P0K29m88J89K48j68
6524B1O9j37J07Q3l3k11j8J42k24J46n8J40q8J16J14k09J37l65O0L68o5j75Rr
6548h0J2kM0L5j7n8LK48j04r0j6r2L58k45q6J16j22J07P6k65R3J04k32J83j76
6573b10L41l53J99j05K58j65pJ83k34J56k25K8k0K74k79K95J03L8m55J48J47n4
6595F3Rr6K33n55J39K20j7Q1j82K89k6k56j63J27J00N0j2K7k14Q8J87K1j10n4
$$ y = [159, -28, -137, -30, 203, -75, -161, -126, -372, 30, -291, 253, 4, 142, -18, 203, -88, -195, 122, -89, -66, -168, -33, 19, -263, -92, -127, -165, -43, -124, 170, 91, -119, 77, -15, 115, -60, 242, 267, 54, 168, -215, 173, 89, 367, 280, 43, 168, -69, 8, 95, 180, 95, -131, 76, 57, 237, 53, 13, 97, 174, 311, 145, -124, -119, -193, 150, 199, 248, -9, -9, -22, -32, -7, 75, -100, -14, -49, 108, -86, -37, -139, -256, -73, 267, 42, -101, -16, -59, 11, 240, -248, -59, 189, 21, 90, -47, 60, 143, 110, -101, -119, 23, -201, -55, -113, 27, -61, 55, 169, -40, 97, -268, -208, 160, 95, -80, -71, -80, -68, -70, -30, 5, -12, -70, -67, 181, 77, -13, -29, -121, 237, -8, -94, 22, -100, 7, 83, -182, -89, 15, -217, -34, -210, 131, -222, -23, -128, 130, -35, -42, 141, -93, 63, -162, -134, -154, 120, -159, 136, 239, 277, -178, -30, 117, 63, 72, -24, 209, -346, -207, 13, -4, 77, -105, 184, 158, -98, -261, -134, -34, 16, 4, 31, -183, -95, 92, 113, 3, -51]
6619e1K88l8l97J96q1N9k89N85j38kj34L09n15J81J91l66N26k76K76k77L6j40
6641e7J51R9m12J62J22j40j10K65O4j97p7r3J35J87o9l04J50J20p9J22l04Q3O
6664a76J50J60j67J88k17K20l62M20j2j75L15k85K1j70J27OJ71j94k6J19K6k30
6686i1P7jJ59k35J66q6K4R1K4l59J3K71J1k41J73kl9J51k14J55k71J46o6L03n16
6711c57R7L62j09Oj86Q7L59k42k2Pj8J15Pj85J70M2j59K19k59J24k12Q6P2o6L2
6736c0k2j88K15R7o3q1L28l86O5L15qk77q4K69l52M03j47l74N93j59j57K4K96
6759B77J9k14N3J8k85r8L90l78M22k73l07L85q4J5p0m0Q8J21O5o8l9J3K67l06
6783b9L3j63K7J2k8L06P0l32J20r0o5J96J66R2n60K19k37J97KJ90k6k47R1K69
$$ y = [-51, 237, 199, -198, -2, -83, -24, -313, 272, 134, 132, -2, 307, -208, -27, 164, -202, 324, 48, 324, 47, 83, -57, 94, 193, -219, -57, 65, -75, -185, 80, 144, -53, -130, -223, -88, 99, 30, -274, -124, -4, -83, 39, -265, -182, -176, -26, 134, -33, 155, -62, 158, -204, 216, 204, 29, 344, 59, 80, -90, 37, 43, 214, 20, -6, 113, 139, -91, -14, -15, 144, -91, 75, -11, 13, 104, 128, -231, -218, 53, 64, -177, -4, -6, -45, 106, -108, 47, -224, -78, -144, 159, -357, -260, 102, -7, -1, -187, -100, 259, 17, -5, 2, -16, 99, 106, -79, 91, 133, -26, 193, -66, 58, -154, -68, 4, -62, -30, -52, -240, -25, 72, 9, -72, 256, -130, -65, 250, 242, -35, -119, 150, -202, 201, 54, -320, 273, 114, -43, -19, 277, 296, 82, 135, 153, -132, -230, 160, -218, 204, -69, -376, 9, -75, -60, -130, -170, -82, 39, 104, 36, -3, 10, 277, -29, 4, -159, -132, -120, -148, 158, 228, -104, 16, -74, -139, 57, 223, 315, -245, -26, -263, -66, -64, 126, 100, -147, -56, 213]
6807B13N4j89k50J12K88q0n8j15J05k52L61k55Qj75K38R2J52j63j38K95k6k82
6829f5R5kj66K40j38R7l08J63L9j21K24k97J43L70p3j59rQ1j28P7Kk20J51k69
6853b73N56m81K49J98l09m5N7K01j02q0P9j18o2K30j33M6j11J24k69M35l6o7l12
6876b23K54K39j69j77J20j90Q8J77j49R0O5j14q5k6J1K83n06M37k5k32J13j03
6898a22K42L7k99R7j69J93m3j7j62M27l20K03L5n1K11j53k60o7J61J83q1k06J0
6921a51J64o6k4p3K45l39p0P0M08l98K64j11k06K12L1j43M0J22J1P5l71O05l82
6944h7j25Q8J67l6m7M9L34m30M19l96P3P9j28R0k15J46J96j71k3K23j43j55L4
6967e8L7J78M0j30k91K73O2k76M01j88j94o6K16k6j62K11J35j15l23L29j62j57
$$ y = [213, 267, 78, -172, -60, 228, 148, 90, -25, 80, -172, 189, -66, -58, -233, 5, 97, 249, 86, -52, 243, 217, -65, 30, 28, -138, 102, -36, 61, -247, -84, -45, -166, 58, -239, -96, 274, 201, 42, 33, 114, -14, 63, 65, -155, -4, -273, 283, -198, 51, 249, -60, -105, -48, 153, 51, -29, 50, -68, -130, 100, -33, 13, -98, 26, -243, 192, 156, 89, -223, 31, 270, 101, -76, 44, -146, -58, 119, -30, 60, 125, 11, -74, -100, -89, 194, -312, 125, 100, -132, -19, -122, 120, 157, -142, -45, -214, -21, -64, -81, -243, 184, -136, 67, 102, 51, 262, 109, -151, -218, -57, 126, 45, -161, -151, 13, -53, -77, -150, 95, -244, -314, -244, 164, -234, 30, -81, -287, -75, -44, -187, -147, -25, -14, 61, -310, 295, -87, -212, -124, 43, 7, -40, 9, 343, -87, 332, -64, 9, 88, -40, 50, -165, -19, 177, 6, -17, 206, 63, -92, -58, -21, 157, 197, 67, -224, 49, 111, -165, 236, 48, -146, -212, 4, -22, -184, 27, 162, 47, -276, 53, -109, -266]
6989b66L42k60J25L34l09j00KQL58m2r1P8m8Jj12K82k14N4m14K63j19P4j51J79
7013b6J39m7J53j88k23K06K69k82K29j34O8m2k41J13L7n6L61l52j53J47O9O9J18
7036B34rr7j39LJ50j25k5J35j94K26j6O5r8j10k5r8J16J76j43k07J25K07j72J27
7060A06p2Lp7O6j12J91Jk13L01m67L61j7k72K28L69l07l6k9k69M84l31m8M7J51
7084E8o1J21l00J20R2r2N8L71k43J81J10l33J23j44k9J1K89l24J30j34j96J84
7106hp7k01L83J51l91K6J32n7L79k91j25r5J97n5pN8k65K60L0k05K75k3l00K10
7130AP2j27j28J43p4K05k06P7J50l27L52k85n0L25L1l39Q0K48O4l51J10L43j58
7153A56J78j93j24l5j2M3J84k98J95k38J03J6J03k66J0n5M51N1m58K91m6M8n6
$$ y = [-266, 76, -184, -59, 275, -34, -134, -132, -124, 234, 192, 101, 179, 131, 132, 20, 302, 88, 142, -272, -9, -128, -54, -205, -26, 113, 66, 219, 31, -192, 14, 283, 1, 230, 96, 164, 122, -119, -6, 31, -25, 336, -16, -169, -22, 47, 116, 234, 225, 128, -11, -8, 142, 17, -8, 127, -67, 159, 143, 208, 110, 0, -25, -123, -7, 169, 26, -181, -56, 151, -21, 106, 34, 37, -40, 26, -86, 105, 106, -107, 194, -273, 88, 71, -201, 27, 396, 89, 53, 24, -245, 239, -92, -140, -93, 58, -3, 118, -182, -62, 30, -62, -4, 367, 124, 305, 415, 82, 205, 61, 32, 43, 332, 8, 138, 4, -192, -8, -85, -286, 97, 248, -143, -117, 15, -42, 337, 46, -79, -174, 23, -32, -39, 19, -246, 14, 44, -161, 114, 91, -209, 1, 73, -54, -182, -39, -113, 92, -114, -37, 113, -214, 138, -147, -197, 128, 159, -180, -100, 148, 212, -139, -29, 314, 156, 334, 141, 17, -18, -30, 13, 197, -101, 94, -144, -41, -25, 78, -188, -178, -233, 218, 269, -189, 102, 56, 104, 48]
7176D8k51M99j86J7j47K5m9k28M65O1l33q9M0L04j48j76K08kk51J95Rp4K1M6P1
7201G5q4q0K13jp3n5l4J37m4O1j04j0K19l40J07K8o1q6QJ16K85l07K64m58M47
7226B23l8k89n3J05K0r0L83k05J1k02K98k16J58k13J65k89P0J36L91l02R6L3j62
7249C0J03or4n5mo4rK58M3m52K10p4J6J98j85J75k07J17J77j93k27R4J60j18J20
7274A3K00j51K2k5l30L18j79Q8J46k30K99L6m14J29K06J88m68OK48J7j28j62K61
7297I0l92K43k05Q7n4L63k59M14k51j40qmJ63JL55p9j32l88J92p2J48p1k81J81
7321i9J72J33k08M12l37N8l9j39P2j50O5J60J0q1kj1k00K11K9k59M13m31L24j23
7345b0K5J09l36K82p6R4j58j64L66k85K79k36K7O0K17Q6j76k49J12P1n9r2J35
$$ y = [48, -203, 296, 110, 127, -20, 5, -44, -272, 193, 254, -79, -168, -128, 176, 28, -148, 60, 58, -193, 2, 11, -63, -42, 4, 75, -9, -89, 124, 123, 50, -5, -39, 98, 54, 115, 11, 1, 220, -120, -13, 15, -46, -132, -124, -8, 277, -30, 234, -224, 223, 185, -104, -157, -52, -32, -122, 261, 56, 67, -135, 163, -53, 105, -108, 57, -232, -162, -26, 365, 63, 159, 192, 30, 133, 127, 33, -22, -26, -90, -99, 159, 202, -250, -40, -114, -98, 100, -85, 90, -117, 0, 177, -16, -243, -149, 11, -107, 13, 213, 62, 84, 59, -271, 47, -132, -44, 102, -128, 171, 207, -207, -78, 128, 316, -152, -146, 102, 119, -9, -171, 90, -302, -59, -264, -177, -231, 132, -127, 287, 36, -104, -112, -116, 47, 48, 403, 324, 192, -196, -4, -76, 72, 1, -280, -99, 73, 206, -2, 410, 73, 131, 92, -47, 25, -125, -60, 100, 110, 29, 27, 16, -184, 27, 56, -203, 210, -221, 103, -20, 5, 114, -222, 60, -16, 78, -80, -244, 122, -163, 116, -120, -93, -33, 184, 270, 94, -155, -43, 28, -31, -123, 12]
7368A2j11j7L7Q8J5j45J18P5j16J31r3J67j30k75K48J21J08k21J10j23J50k84
7390a35K08k76r6L40L22k64o9P3j25k1m3J06J84k51K42j51Mn1m8j66k0N1n4L58
7414A18p6n7j12K2q6M78j54l7k24N4k03L24L9J56N8l38O3J46k76j2OL1J50oj95
7439a31Q7OK35n8j25P9K8j27l1J08j88Q1Q1q2J19k28K66j80j99K56r6O3J65r0
7463C9J71O6m23J62k61K67K23k90o2K53L0l6l01J32M0L9k88L22No5R7j06o3j53
7487b02L81j59J82j91K42k98k8K44J6l10K73l11J89J22m08J88m0r3L91P1o96L63
7509g4n0J81k17P0J69k04K54m8J25j67k01J42k4K15j51j41K65j11k26p5O3J77
7531b8J01k43Q1R4j62J67j18p8L07k64J04k8J39j96l4L94l24J29N2O0k29K7K48
$$ y = [12, -99, -116, -79, 9, 24, -121, -3, 72, -44, 87, -6, 161, 31, -244, 4, 125, 233, 12, 122, -1, 149, -135, 73, -203, -299, 41, 363, 99, 30, 103, -22, -43, -86, 20, 204, -47, 195, 44, 48, -3, -51, -217, -237, -186, -240, 118, 42, -15, -127, -105, -191, 287, 133, 96, -128, -74, -277, 47, 86, 242, 300, -38, 25, 171, -105, -117, -111, -80, 70, 64, -131, -44, -38, 197, 139, 14, 93, 121, -6, -37, 71, -117, -36, 45, -37, 82, -146, 120, -60, -259, -3, -99, -36, 129, 39, 210, 276, -147, 15, -246, 21, 244, -46, -108, 145, 175, 139, -162, -30, 10, 49, -239, 83, 88, 23, 120, 14, -49, -202, 179, 20, 202, 11, 253, -45, -73, 171, 187, -123, 150, -161, 28, 150, -258, -70, -110, -203, 188, 259, -437, -74, -124, 57, -160, -90, 79, -125, 129, 81, 206, 39, -162, -20, -44, 171, 20, -121, 144, 33, -193, -268, -205, -28, 73, -170, -89, 5, -157, 10, -108, -186, 121, -143, -39, -67, 72, -124, -158, 236, -88, 41, 93, 153, -76, -49, 199]
7554A99l26J73j9k01K07j43Q4J42p7N10n88J71j71M9o3j58K07j20K68n50N13j89
7576h2j17l5J31J16K7q4n1q1Q7K07o2q6M4L8j08k46M17J20L7m32Q4Q6J67j63j0
7601Dp8Q8j37L10O7m93J74j68K10O5p7K42k05j7j32K32L0j58J38P6j40j38j43
7624b50K7K72K16k28q1K4j35K12R3L3j0k57J76Q4j04J71k22lk97L19j00J11j26
7647g5J64k76J69K41l33J63O4k99N51l73N1o6J44j81j29J51J86j75K56j64k60
7668a91J71j82L02M2j12OJ00J34l78l6J24J42K7k94Q4Q0j25J19k01rK67M8j04
7691A4j16R5K94n58J69K09L80m47j44j21N7K11J1n3k13K72n9j29J20k6kP8k65
7714b23J93N5R1m06L30J5j04j8N6K97k07j80m2L20R6k78J54J98o27M67k67J3L80
$$ y = [199, -127, 46, 27, -174, 33, -110, -26, 116, 39, 549, -39, 132, -39, 10, -53, -211, -4, -124, 144, -406, 107, -82, -199, -234, -103, 13, 40, -44, -95, -176, -89, 118, 56, -30, 14, 52, -56, -302, 115, 235, 272, -160, -76, 10, 177, 14, 4, -74, 14, -123, 187, 254, -239, -65, -233, -23, 42, -35, 207, 2, -15, -147, 85, 115, -43, 95, 171, 31, -107, -250, -223, 49, 265, 37, -44, -20, -155, 57, 150, 183, 173, -84, 92, 176, 72, 243, 21, 18, -279, 40, -60, 51, -75, 89, -187, -18, 223, -110, 53, 117, -182, 369, -4, 47, -19, 125, -56, -185, -34, 152, -23, 233, 69, -191, -20, -202, 100, 142, 30, 36, 136, 270, -108, -144, -20, 122, 149, -145, -61, 19, -106, 13, -188, -197, 70, 118, 14, -102, -7, 287, -271, -102, 107, 487, 40, -104, -225, -168, 43, 54, 1, -212, 60, 1, -128, -8, -34, -36, 42, -223, -30, 25, 116, -290, 40, 55, -49, -67, -11, 286, 79, -101, -143, 177, 273, -5, 149, 347, -280, 187, -80, -67, 313]
7737C13n73N16j09J4j27m2k7J08j1J34k30j08J62k14jr2J97P3K84o94P11k75n7
7760d8j84J57Q1j50O0K22j8l99M80J88m17mJ14J4K5j39J59OOo0J62l07k7L1nJ0
7786d3O3J25j06j0K00l59P7L11l76J71k09Q4k10K94K1L90m57P0R2k64q2J19J9
7809h0O0k1M7Q1q6J85l37j22L42J30j10l27j9L68j54l3L26j20k04L15l40J70k47
7832a76l4J61K12k36r7K35J70j14L3l92L55j92N4j80j14K30K58l05K38j20k78
7853b92L18m9L8o9J30j31l40M82j32R7o7P4J52k53K21l36J17n8M4L10j11l18L87
7876B14qk19O5j03J0j28K44k14k7J43M8k55M31l01Or7L75m4l98K88P7Q2j61R9
7900A27l33K84K1J87p6k02j62k6K54l7j51k15M70j55Q7k2l29M34l81L47j00l9
$$ y = [313, -260, 256, 147, 161, 34, -8, -35, 73, 62, 196, -34, -142, 20, -194, -195, -287, -90, -17, 267, -427, 284, 9, -48, -232, -75, 6, -144, -84, 138, 120, -279, 201, 389, -28, -32, 82, 96, 121, -18, 141, 147, 153, 93, 255, -52, -79, -48, -53, -43, 20, 145, 39, 29, 229, -130, -53, 258, -118, 53, -156, -72, -282, 12, 33, 423, -34, 36, 128, -136, -218, -99, -80, -20, -41, 6, 87, 1, 186, -151, -273, 69, 199, 89, -238, -257, 111, -43, -76, 250, 130, -74, 241, -99, 71, -176, -210, -49, 163, -73, -170, 65, 235, 121, 154, -238, 117, -75, -21, -201, -315, -85, 173, -132, 106, -14, -292, 26, -23, 15, -54, 76, -55, -395, 87, -45, 52, -15, 59, 211, -42, 179, -157, -40, -98, -54, 256, 145, -173, 214, 206, -13, 52, -51, -41, -169, 75, -139, -166, -23, 25, -230, 201, -100, -94, -191, 184, 140, -258, 30, 107, 189, 28, 127, -206, 78, 99, 286, 210, 8, -154, -180, 74, 37, -114, -329, 141, -14, 73, 51, -278, 156, -225, 122, 22, -17]
7922a7J01j26N2J10m7J07j16q8j86J70O2j55p6J58j32L29j90j18J20L3PJ06OJ06
7946B16k38p1L78l19K50j17k4l15K17k9K44j51j12P0j94M50l74k64O37k80P6k51
7968b01K03p0p6J10M4N9k25k6L48k66J78k11R9n3M5K21n5N6Mj83L5Nj16J18J67
7993B10l58N0j1k1l5L67l90M00j15j82K52j99J37Oj2j94j6j6K73q4k58L82l49
8016a63J83K3K1P8k30J30j4j30k84N62n0j43O5J14j59j39K74m6j39M6J56K47n15
8039a13P8J54m62M43M1k52J86l60M53j71k50J30n4K01J68j21m10M23K73n70p6
8060b89J97K4J10J77l09K72j09k24L16j42j42J6P1j75L32k43Q6k97K85J77l35
8081b02J47J88l91J02J25n8K93j0l11N7j74K66k00J67j85m0j14J30k1L22k70J30
$$ y = [-17, 84, -42, 10, 120, 73, 180, 64, -24, -210, -40, 22, -133, -209, -51, -183, 146, -44, -162, -42, -9, -2, 104, 110, 216, -22, -93, 285, -34, 216, 99, 75, -240, -23, -52, 192, 41, -71, -1, -195, 255, -119, -383, 254, -26, 50, -201, 2, -68, -144, -34, 10, 69, -156, -182, 166, -100, 78, -133, -34, -87, -42, 179, 124, 180, 184, 1, 36, 41, -75, 43, 210, -148, -98, -109, -130, -165, 202, -188, 212, 97, -85, 167, -32, 105, 111, 99, -95, -111, -127, 146, 62, -196, 186, -163, 20, 43, 64, 142, -88, 42, 28, -102, -386, 176, 126, -17, 48, 162, 3, -136, 138, 92, -47, -1, 155, 402, -113, -35, 119, -343, 100, 141, -111, 75, -285, 168, -3, -253, -123, -177, 24, 192, 71, -339, 84, 357, -213, -289, -92, -68, 42, 219, -90, 182, 73, -151, 165, 23, -119, -103, -32, -207, 125, -118, -32, -329, -44, 133, -202, -55, 133, -258, -156, -31, -89, 204, 194, -117, -60, -234, 32, -168, -1, -186, -226, -340, -210, -231, 91, -179, -49]
8103d9J45j86J87j43K1m52L55L2P4P1Q6l36J03N4p8K18k2l46K74J85j82L03j71
8126A43L3K0k08J01n1L7l3Qj5j67J79q4J06j85j0K04l7P1L0l59K31N4J61k13J14
8151A30j81l02M34n4k33J74K7m04J98J5Q5J45L9k26M9J04k29N9j49J83J27j08
8173a17P6k5J82K1j69M9j07J00j27J92j19j57J15l2K51k96J12K90
$$ y = [-49, 96, -90, 97, -46, -25, -477, -122, -90, -16, 55, 141, -195, -92, -38, -116, 102, 80, -266, 8, 193, 11, 314, 143, 176, 196, -12, 89, 38, 75, 42, 50, 35, -132, 47, -37, 69, -116, -126, 78, 41, 112, 142, -217, 14, 68, 229, 16, 130, -51, -353, 81, 27, -206, -32, -5, -409, -211, -196, -111, 34, 73, -153, -104, 0, -229, -170, -319, -136, -9, -117, -41, -66, 116, 137, -32, 17, -90, 10, -117, 75, -44, -201, -86, -118, 133, -163, -51, 239]
8191B39
$$ Imaginary data points
##PAGE= N=2
##DATA TABLE= (X++(I..I)), XYDATA
0@%%%%%%%%%%Qj6J6j6K4l2M0m8N6p2Q7j03J20j37J61j91K23k56K95l42L91m46
32b38N08n74O48p32Q24r23J032j152J285j430J587j760J949k154K379k626K892
49A515l184L509l866M259m699N189n736O360p072P894q861J0008j1397J3127j5348
64h302J8317k2517K8949m0159O5220k25617R9372M29389k13466k78412j3045K28552
76F8281M1351r3098n3140P850m1929P5777J02292m4328j56137r263J59871P9915
88A37442j62360j07687J01197J07657k6296o3251k4455K3056J7703K6405O558
99C5969p0162m0717R0096O2331n9618o6893K7844N7102k0426m0994K8942L637
111G111m2163K6450N8732k4673p0757J087P9320J1688q0820r289O8355L732m4688
$$ y = [0, 0, 0, 0, 0, 0, 0, 0, 0, 0, 0, 8, -8, 8, -8, 16, -16, 24, -24, 32, -40, 47, -56, 64, -73, 88, -103, 120, -136, 159, -183, 208, -238, 270, -304, 344, -388, 436, -487, 545, -607, 678, -752, 835, -925, 1024, -1130, 1249, -1377, 1515, -1669, 1840, -2026, 2233, -2466, 2723, -3013, 3347, -3725, 4169, -4692, 5316, -6081, 7046, -8302, 10015, -12502, 16447, -23712, 41508, -184109, -84737, 344652, 131186, -147226, -160271, 68281, 109632, 16534, -36606, -28756, -70685, 5092, 107384, 63056, -93081, -102344, 57527, 137442, -24918, -132605, -31408, 76249, 49953, -13298, -37753, -14697, 3006, 29411, 35969, -34193, -74910, 15186, 77517, 17899, -48994, -21150, 35952, 15526, -25468, 3474, 7111, -35052, -8602, 50130, 25457, -45300, -44213, 35107, 46795, -34025, -43314, 25041, 28773, -15915]
124a5915P564M1256k3870o3219L8323Q3000m4079r0502L3638R0156p259q6202
136c7109j5547O9287J5175m3033j850J7825p353k002K1069N818l8799k0395M8100
149A1186K8231m2740k7003K7772K7333j3956k5941P255J1093j2654P046J8213
161A5835j5080j8638J6423K2899j4987k9569J4122K9683j7750j9774K1843J4453
173A9460k0475j7225J8208J9069k2007j8950K2475J3919j5622n846J1694M19j8716
186a3597L175L0244p459l7386Q795M1841J956m0957j6214L5099K0537k6280j6057
199a6303J0202R527L624L58p191j2934k551K4781J1784k8335j6920K3796K3009
212B2847j0336k6258n50K0754K349q560L25n144j864J1159Q662j0648k0416M724
$$ y = [-15915, -8351, 32905, 9035, -54184, -15861, 67139, 23060, -67442, -33804, 56352, 49093, -37109, -52656, 16631, 31806, -11227, -13077, 4748, -2605, -4607, 16462, 22280, -16519, -36914, 11186, 39417, -3323, -30326, -2554, 24779, 10823, -15118, -7863, 3230, -9424, -2378, 15835, 755, -17883, -1460, 21439, 6452, -23117, -8995, 20688, 2938, -16836, 5007, 19460, -1015, -18240, -32, 19037, -2970, -21920, 555, 14474, -1148, -6994, 4700, 5119, -13597, -10422, 19822, 12363, -25023, -16228, 25613, 27569, -13388, -29602, 5497, 26034, -246, -16303, -6101, 3426, 7050, 7408, 217, -12717, -15268, 9513, 21297, -7038, -23958, -162, 22847, 12511, -13747, -14297, 6457, 8806, 246, 571, -4573, -6437, 4722, 13384, 2736, -17680, -12956]
226a2956K7501j043k5030j295J6995P899r554r844N130L363l387O932J061j1167
240e395j5J0775M240j0236j2460J0529J2919j0618p507P937M516m146m841M200
254a02N254r615j297J2315j443q369J407M656J789o650k803P899j808n704N928
269A457K138m687k344J773N837l402q845P055P634n791l055J839L185m72n517
284c195K827M086o800J204O853l482m446j11M203K418p524j359Q216m21l451J073
300I1l16Q85k27j751L552k460l178O420J288n584j180J399M302j972p048M342
316a437M832l413n23O87q79J133j186J469Q46m381K616M865l872k310R81J138
332E66J612l358j837M651p10k247J867j168Q8J01j032K617r09k612M305O03l423
$$ y = [-12956, 14545, 13502, -11528, -12823, 4172, 12071, 2517, -7327, -2197, 1166, -2221, 4711, 5772, -5395, -5410, 5365, 9605, -631, -13091, -2562, 10357, -261, -7768, 169, 4685, 539, -4302, -102, 5152, -4463, -5760, 6555, 5112, -3257, -1850, 2806, 4595, -2055, -4858, 3041, 1233, -4471, 1457, 3595, -1092, -3436, -1663, 4174, 772, -8073, -1018, 6616, 825, -2230, -391, 2794, 2322, -3195, -368, 3718, -3082, -1878, 4975, 1493, -2953, -3064, 1139, 3557, -3967, -5326, 2890, 2469, -982, 91, -225, 660, 433, -1318, 2234, -226, -3404, 3016, 4304, -1280, -2460, -1061, 3241, 1269, -5779, -1437, 3395, -18, -541, 146, -733, 400, -786, 683, 1529, -2852, -236, 4629, 757, -1553, -572, 566, 2178, -1180, -3017, 1634, 924, -1323, 544, -624, -536, -435, -1467, 1150, 241, -2371, 1934, 2537, -886]
349h86M33O67J018l47k853K151J357k377J439j56k069J104J78J4O53k312J690
366b96K763k184j037L55K59J782j680j451K578q04l96J407j378j002M90K55J468
383A129j565j834K814N61j126L94j270j33J765m83L60l72j077J923N63j401p74
400e26j331J462K309j977j419M01O80K059p14k628l44J478K029N29l191n54K959
417A222N43m26j686j458J368J724M70p31l516M56L803L54k665k503O09N051L76
434B991m165j365J701L120J87l316r81J499R04J872p67l457j08K142K128q76m556
451c047k46M211J798j344l664j366M882J683l319j262L22K060J782j739r20n58
467g27j097K444J752k112k060o89L207L040m273l481K294L716M71l297k014L490
$$ y = [-886, -453, 214, 1232, 885, -1968, 183, 1540, -837, 602, 446, -1623, -519, -341, -327, 326, -1986, -296, 2467, 283, -754, -399, -140, 1642, -38, -1489, 1089, 285, -111, 1296, -82, -1084, -594, -339, 1129, -436, -2270, 544, 1105, -21, 373, -897, -1030, 735, 252, 612, 240, -837, 1086, 1649, 248, -526, -1857, -395, 1914, -63, -1482, -1081, -401, 1658, 944, -1684, -2028, -550, 1479, 2008, -1183, -1737, 1222, 1765, 1339, -347, -1805, -437, 1287, 1757, 1026, -2490, -2034, 1769, 2123, -542, -3045, -2436, 2615, 2991, -1174, -2539, -838, 2282, 2469, -847, -1828, -329, 575, 2447, 1680, -1777, -1885, 257, 2385, 1509, -3047, -3293, 918, 2716, 1372, -2292, -3658, 1224, 2907, -412, -1674, -1352, 708, 2490, 751, -169, -727, -1824, 620, 2372, 260, -1800, -2489, 718, 3758, -515, -3996, -1702, 2014, 2485, -812, -2826, 664]
483F64J002j438J295q00k189O62J452K870k066o359K464O216m42n019l504L752
499a440O331l004m553R80J417J816M84k221o30n66Q29M152p82n275r45L099N203
516D895j884q312O55O921J806l162n083R04O306l14l589o84J20J712J714q71k29
533I05k401j604N191K528n182l503J372O320J424q258j538N589J700j699k667
548a823M16K520j149m36L284k099m287J890M283J737n001n083N634N447l613m527
564b807j046L787L281k477k790O07J14K596J601k583j633j210K312M937k339o063
580c713L09M572L643l203o946K093O120O07l471l668J131M871l24k329m56j494
596b258J678L035j63k023l502J039O524o42o544j084M169L629k095n601J630L780
$$ y = [664, 1666, 228, 1523, 723, -1466, -804, 648, 3518, 1452, -4907, -2443, 3773, 3331, -1688, -5192, -1440, 4891, 1887, -2666, -1686, -269, 1547, 2031, -190, -820, -1386, -557, 3595, 2813, -2462, -3407, -308, 4895, 3011, -5301, -4646, 2275, 4081, 919, -4164, -3260, 3046, 2732, -857, -1541, -1421, 291, 2005, 1134, 905, -1496, -3100, 2091, 4619, -563, -4066, -2694, 3626, 5050, -3208, -4746, 843, 2543, 844, -1823, -1407, 1113, -36, -472, 2812, 713, -3574, -1684, 2599, 4336, -665, -5748, -114, 5333, 1720, -2807, -3853, -66, 3215, 738, -2052, -1445, -1331, 1265, 2866, 283, -1350, -2560, -248, 4689, 2350, -3713, -3404, 1168, 4811, 1608, -5338, -3245, 2875, 3482, 11, -3657, -2526, 2345, 2021, -308, -764, -2258, -580, 2455, 2292, 269, -3233, -2194, 4330, 3688, -2856, -3940, 229, 3858, 1763, -3838, -2208, 1572]
612A572l95j036r12j95J003k37J033J295l472p48K986J124r23k348q99L259O40
629A747k002q37k12R07J563j394m28M89n71J186R56j201p40n32O70K758j198k562
647a401M03J512J591j251k968O13K183K24l16j804j96J699J33N40n73k210J116
664g05K403Mj949j732J520L057j440k156k27P62J485k27j577r3N64K94R17r37
682c7r99P50M71P70j04j870P92J004l74K08r62n86J093J72j57j28r52P96N82q52
702c83K86l10K5R07m18P2M2m93K79J067j059O6j12l69J355o14q97L90l68L92Q44
723G02j371r2O15l4R58q53j216J483N00o90N18j025K85J338j090j47j54m08J166
742D85l36j060Q87l81J83J130j595O1R36l94O83l78j015J322J87p91O83j136L30
$$ y = [1572, 1177, 141, -771, -966, 37, -200, 833, 2128, -1344, -2092, 894, 2018, 1095, -1253, -2152, 1107, 1747, -255, -1092, -1304, -397, 1166, -228, -656, -167, -738, 448, 1404, 203, -537, -1069, -399, 2359, 1161, -1401, -998, 514, 2105, 854, -2114, -1501, 682, 906, 590, -1214, -1410, 289, 422, 962, 389, -1821, -705, 1698, 1702, -247, -1979, -459, 2598, 1158, -998, -1225, -463, 1022, 795, -782, -875, -311, -17, 900, -37, -1036, -286, 185, 955, 851, -1019, -227, 777, 403, 611, -351, -937, 156, 328, 171, 43, -909, -113, 469, -383, -97, -407, -382, 525, 107, 179, 221, -272, 7, 1074, 15, 81, -31, -400, 955, 341, -556, -166, -534, -142, 702, -669, -761, -146, -180, 778, -75, -1291, 192, 692, 2, 520, -505, -220, 1118, 28, -119, -273, -681, 485, 149, -911, -24, -405, -222, 908, -687, -626, 310, -84, 599, 221, -794, 528, 715, -76, 607, -529, -199]
761a99J118j091n19J109p95N27J02r93Q60m10j47O50q04N3J366q99K33J52r71
780f58J373O7j364R40j68o22J244j452O3J082j212O68K85j106J051K69p98Q78
798E40p01J53R09q97j7N13r08R43K0j136R70k99p32J155r56J1P07n79J50N70j260
819h44J130N22j135N67R2k96M70k79m82O60r96N27M12j051P91r4o81R81n47n86
839h39J083p9m79M99n22L53P65q42N18l15r08J096L5p71K04j52M41O06j336L98
859b45L19n33P06j38p45O88j29N64K55q51m03J104k64l26M9o52J147j28q02M18
879C4o10j24J133k80l06m04N7J111J20r77L88J16j31N90m74n59L50k77R50Rj611
900h95J19Q74L38k05j134N56R76o31r4N42m83P6L18j5J84j019N5J195P1q63o58
$$ y = [-199, 919, -172, -691, 418, -377, 150, 252, -741, 119, -291, -438, 212, -592, -539, 827, -72, 161, 313, -658, 715, 782, -582, 358, 190, -432, 812, -640, -577, 505, -707, -39, 246, -860, 191, 460, -338, 540, -161, -8, 901, 4, -13, 500, -408, 535, 555, -581, 389, 90, -642, 513, -443, -432, 275, -304, -154, 416, -844, 286, 808, -327, 240, 332, 36, 506, 227, -255, 405, -591, -64, 348, -703, 88, -6, -687, 294, -253, -839, 244, 165, -314, 185, -337, 16, 781, -61, 457, 142, -766, 330, 365, -406, -202, -354, 87, 693, -643, -245, 74, -459, 247, 109, -636, 52, -77, 487, 742, -109, -512, 592, 328, 2, 51, -601, 546, 418, -384, 34, -576, -700, 433, 153, -153, -557, -500, 611, 731, -246, 142, 258, 127, 717, 243, -316, 34, -243, 707, 716, -895, -776, 98, 436, 231, -903, -347, 629, -2, -96, 446, -37, 39, 357, 342, 526, -493, -438, 757, 828, -35, -693]
921f93P5R92K26j205NN7N34M76l49m42L12o5O45J56j245L68M15O8M18j180q30
942a262R60J013k01p49j252J289J157p80p04m50J018O96p65j49P59j015L98O89
960F52K91j038r07Q48K167j834j843J292J437o14o99q08J714k27r21N66L37n78
978a65r5J94P79j78j647J047J105m89p66l95K52J092o23m92J10k56P29L12q78
997c64J54M18j53K70j6m21J16m40Q91R45j665r48J415P56o02j275k69J833p4j343
1017g72O09L97n9k78j87R68j29j872J296J652j221j306L48J261K80j933l75K153
1035H32p60k89J43j06L41n37q7J133o48m93O47N00l00k84p89O70Q16r13J59j90
1055a55q5R39p73m56J87q2P21k00p39P23J19o98N77N71l62p56L05J078j47j575
$$ y = [-693, -618, 374, 600, -605, -600, -543, -9, 467, 118, -324, -12, -77, 568, 724, -521, -153, 262, 330, 748, -432, -1262, -302, 711, 510, -239, -1491, -202, 955, 175, -529, -979, 39, 735, -30, -179, 580, -435, -37, 652, 943, -95, -1002, -154, 2013, 179, -1664, -372, 1065, 451, -248, -1056, 658, 431, -490, 76, 413, -165, -260, -66, 713, 535, -1112, -65, 1040, 551, -215, -610, -358, 734, 111, -381, -271, -527, 202, 514, -364, -210, 208, 55, 325, 309, -112, 4, -436, 455, 1400, -265, -1213, 202, 958, 356, -919, -1188, 645, 571, -772, -163, 234, 175, -103, -290, 678, 549, -1323, -27, 1625, 404, -902, -554, 707, 987, -946, -1321, 832, 72, -217, -74, -180, 161, -376, -463, 670, 22, -471, 176, 676, 376, 92, -697, -27, 789, -124, 35, -155, -240, 699, -74, -530, -343, -425, 296, 96, -643, 80, 199, -499, 78, 649, 287, -469, -164, 914, 767, -808]
1075h08L58J410n38p34j46M12P86j174l23J411p38p16P85M83J53j151k80J688
1093H78N5j626M61P30k93P5p17O05J26q71P77J83o16R5O4J5P6n87M51P66m70o16
1115d39R52o56o0N21k13k75l68L90J033j107m01P24o2j82k45J58O62n56m89R49
1135C36K0p66J73P16j85k15n97P86lo76R0M25J0k96k74M91K78j065N07R31o68
1156A8l34k2M35J4m00J79Q98q96m01P18K55l57k56K21L99o78n06J025n7o69K24
1177a90Q8M6J34m51Q02j61n57J08O19k01k30l06R19l59p77M66K06k39J52k29J75
1198A5r3l80N23L86o49j10N73l61K46k76M92J43p83L0R72n87p17M34L12O3p14
1219d81j53J008k33o94M72K14l20O5o7N46l07n44O00M69o60J92j53q0J18m01M04
$$ y = [-808, -450, 960, 422, -312, -458, -46, 740, -434, -757, 654, -84, -800, -15, 468, 621, -530, -810, 878, 933, -693, -232, 498, 205, 280, -437, 168, 294, -577, 200, 383, -233, -138, -74, -59, 17, -570, -119, 647, 177, -439, 513, -143, -203, 318, 105, -170, -538, -148, 885, -222, -623, 101, 39, -143, -388, -230, 432, -124, -613, 336, 356, -410, -237, 479, 294, 79, -518, 268, 265, -411, -321, 104, 114, -182, -456, 35, 313, -752, -245, 686, 18, -316, -338, 97, 111, -289, -110, 788, -108, -509, 209, 464, 107, -149, 72, 471, -207, -713, 312, 255, -414, -190, -102, -56, 78, -373, 429, 268, -289, -181, 438, 237, 7, -299, 620, 261, -516, -50, 156, -83, 69, -160, 15, -78, -458, 65, 451, -198, -308, 265, -96, 150, -126, 366, 509, -274, -244, 728, 141, -576, -142, 170, 233, -481, -634, 374, 141, -553, -81, 133, -187, -122, -189, 357, 50, -494, 106, 575, -85, 107, -46, -126, -8, -409, -5]
1240eL27r42K78P34m25K5k78M26O7l07l49R95m09k71K81J21r4n4l77Q29o01n76
1262f05R62m01k18K00k79M89J27p37Q00j80l23M20M6m27K04m56O49J09q44M38
1282b6N81p43Q3j67l8M29l42k07P70o28R9O45n65M05m13O0P36l88p44R96n63k25
1304b45L01l02M80k09l68L73J25l61K70j62k21K42o6j56P11o83L40M93q06K94
1324E0K32n95O08n17k18O30j86n42O86k11j67K25j16L63l62k12O06m17l1J71l6
1345c9L16o0n77L78J46p20M52K81o16M05j10J71J85o43N20K78l79OJ66l22K86
1366A24j21l23O20l55K04N0k95L1J57l20M57m08k13L84k15L1M02k39J02M50m81
1387D2J26R9l99LL28k61ml03L81J63k67P2n5j70K98L0j51K41k18n6K20j85j16
$$ y = [-5, 322, -620, -342, 392, -33, -8, -286, 140, 207, -100, -449, 546, 137, -134, 147, 268, 174, 120, -257, 572, -29, -605, 357, -44, -262, -62, -341, 148, 275, -462, 338, 158, -165, 255, 301, -126, 78, -378, 271, 380, -464, -26, 555, -188, -105, -272, -310, 119, -223, -430, 340, -288, -189, 456, -109, 296, -117, -57, 679, 291, -453, 543, -20, -245, 56, -246, 234, 25, -343, 30, 155, -206, 64, -98, -319, -77, -143, -299, 412, -271, 69, 562, -244, 50, 282, -313, 295, -222, -440, 190, 4, -538, 148, -63, -230, -5, -121, 242, -120, -332, 274, -143, -174, -3, -39, 277, 217, -360, 18, 164, -556, -104, 177, -439, -34, -144, 27, 212, -431, 89, 367, -12, -6, 160, -162, 124, 3, -320, 300, -55, 149, 199, -96, -65, 92, -228, 229, -179, -392, -8, -223, -192, 210, -29, 73, 523, 42, 168, 267, -132, -129, 199, -62, -66, -369, 12, 175, -92, -20, -75, -245, 53, 83, -68, 173, -45, -101, 119, -66, -182]
1410a82J68j26L45J1m20L63K2o8J57k81P3r7k64J99J58l70L48m6j61K34L1k40
1432a46P47n78K66n01j14N33j82k57L09j53j27L64k74m7L58m38L24q6o7K97k55
1453b7N7L89k71k03M38j97J88l99l88O41j34p66L41M06l0k7k00R7L53n74K22M61
1475C77j72n68k02M29N50m08j65N37k56n23K83r0L07l7j84J14J87l36l05N04n
1496C7J89m02L06L10n62J50J6l24M81k24l92L34K49k28L13m02Q3j73l72O41K46
1517B76j46p9r5J85P0l22o1N22l13j79J14k29N00l4m42M35k8l32J46o1L56m11
1539a28l39O48o5j34j10j35L94K64l78o1M6m4Q4L4k96M12k69k20K84r8k08N52
1561B33l27O4K73m01R6J40j07N7l9K0K28j64j89M33l87j31J98k80L21P5l37L30
$$ y = [-182, -14, -140, 205, 216, -204, 159, 181, 113, 270, -11, 62, -35, -299, -100, 58, -312, 36, -10, -171, 63, 94, -146, 601, 23, 289, -212, -326, 207, 25, -232, 77, -76, -203, 161, -113, -160, 198, -240, 84, -2, -69, 228, -27, 30, 419, 148, -55, 383, 186, 374, -25, -413, 228, 94, -672, -331, 75, 45, 18, -182, -85, 268, -306, -84, 377, 205, -363, -565, -136, 414, 6, -159, 378, 122, -401, -118, -208, 99, 62, -122, -8, 179, -157, -462, 42, 37, 226, -176, 130, 440, -122, 28, 44, -280, 201, -23, -415, -81, 168, -60, 253, -149, -66, -239, -611, 30, 276, 130, 51, -44, 141, 211, -111, -172, 350, 37, -142, -28, -257, 243, 209, -233, 202, 174, -158, -12, -73, 283, -128, -467, 181, 116, -18, -128, -263, 131, 395, 17, -44, 2, -42, 42, 76, -220, 192, -77, -297, -13, -111, -319, 233, -94, -30, 243, -158, -62, 78, -29, 28, -11, 9, 237, 73, -116, 317, -70, -201, -3, -283, 38, 113, -224, 106]
1583A06K8n93M01L16j64J25k31j44L86k79p9K06j02J6l06M29R8j82j08J77k31
1604a31J7J23k7P9j03m3K45j06j56RK33k63j79M16J36j82k64K14O6n5n7K6j56
1627a58K37k15K81m8m41L34K21j31j60J66j62J71j8r3L17l48J15oK1j80J72k74
1649a99N03k19l12M00j55MJ19n8K95m55K2j0J62j4R7k41K01k38j14L18j06j06
1671a06J45J41j33k97K12L42l60k41N08j50j81m9o2J76k4kp0K80m81J50K26j1
1693A3j53K04N2n6j69j04L19p2J1l7K26l03J09j32K75Lk95J57k9j82J8j6K9N29
1717C97p34M21K13n42M02l16K38J83o01L87J89k17J35j05j91K85j38k05K07m5
1737c7j63L34j61l40K18J6K79l41J73J44j98j60K75R0j14M8r6L41j63l86K06Q1
$$ y = [106, 134, -459, -58, 258, 94, 219, -12, -156, 230, -49, -128, 78, -24, -8, -314, 115, 213, 31, -77, 100, -131, -114, 9, -18, 61, -42, -85, 160, 54, -102, -93, 140, -123, -302, 114, 250, 68, -196, 18, 84, 29, -28, -2, -158, 79, -136, 145, 97, -344, -10, 211, 80, -80, 86, -76, 95, 77, -16, 301, -47, 68, 62, 83, -97, 75, -199, 304, 85, -227, 173, 18, 22, 141, 83, 378, -77, -55, -65, 97, 83, 180, -61, 140, -98, -212, 106, 0, -106, 39, 180, 47, -250, -38, 304, -56, -297, 211, 61, -120, -169, -231, -55, -79, -81, -151, 129, -352, -202, 24, 13, -140, 64, 116, 60, -109, -213, 106, 34, 45, 8, 234, -69, 40, -92, 183, 186, -109, 48, 19, -163, -145, -161, -132, 397, -337, 84, 297, -245, 157, -159, 79, 262, -339, 48, 237, 20, 155, 50, -141, 144, 6, -199, 8, -37, -200, 134, -27, -367, -149, -133, 146, -195, -22, 122, -76, -236, 39, 129, 15, 63, -33, 308, 145, -241, -35, 46]
1759D6l73L32rk75K94J6M1o3j87K11J87k87J05N2j58L37k01m13O31m47K31K8j44
1782d6P2P3j19L96k42j78J9K26m35L00K85r3j59k56N74l66j70nL20j33K60n58
1804b35K15K35m03J59K47k53j98J30k58O48n49RK58j02l9L27j64k27L07k45J92
1825E4j92k53M58N5m77M08J0j64K44j93J38K52n61M15j06P6j3O9m05M09j45l56
1847b77O00m34J08j64K28p8k86NM77j38j65J77K2J8j23K28L9j44J69j96j50p0
1869a54o8J94k66k1K07J48J9l56L49j55qr0K97J55J26l55K38o0l31j18L80qr9
1892B4qK3J15k73j69L27j0k2J13l96M09j23k00L88P4n38L86q9k01K88j40K7r9
1915i4N0k37N36l28J86k24J04p2m5J69j94n5M94k23l92J38N7J33K75l65J23J94
$$ y = [46, -327, 5, -4, -279, 15, 31, 72, 9, -178, 33, 220, -67, 38, 90, -68, 269, 68, -345, 286, -161, 70, 98, -46, 26, 99, -20, 376, 134, -44, -25, 201, -234, 66, 351, 258, 99, -157, 417, 51, -119, -124, 196, 63, 323, -235, -20, 215, -188, -29, 218, -35, -233, -103, -361, 287, -262, -253, 5, -97, -136, 191, 27, -200, 107, -138, 54, -138, -391, 67, 122, -355, 53, 63, -101, 143, -50, 88, 340, -221, 194, 88, 164, 151, 220, -185, 224, 79, -277, 323, -111, -3, -167, 61, -17, -303, -298, 179, 41, -124, 53, 75, 93, -30, 198, 237, 93, 262, 66, -84, -154, -222, -28, -294, -315, -108, 40, 59, -297, 52, -103, -111, -201, 96, 251, 377, 22, 260, 200, -131, -249, 131, 123, 24, 16, 39, 154, -119, -288, 39, 29, 7, 120, -276, 133, 10, -190, 198, 272, -266, 120, 31, -170, 118, -22, 5, -94, -44, -281, 255, -73, 113, -111, -7, -79, -124, 45, -149, -204, 290, 67, -325, -187, -130, 3, 278, -87, 36, 230]
1937B30l39K52k37P2R4j55Q8R8k58Q2K40k63k4n6N7J71K13l42L15l51o5K63l33
1960b48n3K88k23P5M33l58q7J28J72L53m30L5J00k77P8L7J98k90J59l31K96p8
1982b3j47K99p0L5J01k72qL92k32j90K91l10Q13q40l83O76O5n19K93L08l00n3
2004g4k59M67l7j82J54j78j6K72l92m0O32m66J6k9J34M2n5j98M83l66K92jj71
2027B8k60N5j6K38J12m51L77j34k50K63jN5K52k80p6k6K40n3j10qJ21J33n06K86
2051a1q2m2K57p87P88k20O7R9k94M8K88O8j10J0qJ00J66l2k03j62q8M50k42k49
2075a89J76p2L0L34o28M01J16k92K76J03l13K35j91J25P2j05l36L68j01l7Rl11
2097c30L89j00J06J01Oj85P5m2j38L60n51J94L72m18K49k5P0P4k34K16j19j39
$$ y = [230, -109, 143, -94, -22, 72, -83, 5, 103, -155, -73, 167, -96, -120, -176, -119, 52, 265, -77, 238, -113, -178, 85, -248, -301, -13, -236, -161, 272, -86, -173, -45, 127, 480, 50, 85, 185, -92, -14, 23, 221, -69, 90, -241, 55, -23, -170, 129, 59, 94, 195, -77, -85, 307, 75, -115, 176, -134, 679, -161, -544, 132, 197, -322, -29, 279, -21, -74, -333, 134, 97, -85, 69, -109, -125, 147, -245, -285, 347, -119, -103, -132, 2, 44, -11, -209, 274, -92, 200, 199, 28, -232, -177, -193, 45, 157, -294, 83, -51, -301, -38, -39, 16, 268, -12, -88, -114, 126, 73, -37, -45, 76, 209, -297, -11, -93, -135, 122, -665, 123, -97, -30, 69, -225, -177, 111, 179, 69, 79, 71, 171, 337, 305, 102, -60, -148, 302, 60, -189, -13, -85, -55, 279, -349, 52, 168, -124, 152, 255, -58, 177, -14, 111, 183, 78, -258, 110, 9, -28, -19, -330, 59, -41, 65, 166, 172, -13, 62, 20, -118, 242, -309, -115, 257, -161, 88, 63, 133, 207, -27, 189, 70, -69]
2119f9j16M59m42J16q4K26r9J58j89L7k28L14j91J98nj1m29J66K91l12L08k84
2141a86k1K30k17J52J36n09M29J03k47J45R8j98O1O4j13J77j13j01L41j55j26
2162e0o9j4J85k61NL55k33P0j4P4j08K84j67P4j79l2J32J72l26J85k17J27L64
2185C57n3l58j6M0l7J27j57P7l91M60J42o44M22l4K43o3p7J00J18n0qj59l48K80
2209b9N6M2k43K13k59N52l85j48K74j83J7M55j24q9M3N6j3j55m56N15k24K78k14
2232b1k3o9K86k34k2J19k39N1K98jj05l34K91J25j29j28N52n57J92J27j90K53
2254B42m67K1L41j74R4K9k3j12J62m1J39j86R0jj54j19M37m15qM55j84j03k9l7
2278d3K91n5k33J48p9%O9p1m3q5Q0J63p7j22P1k31P7K80j52j32K33n6o0r0j50
$$ y = [-69, -185, 274, -168, -52, -136, 90, -9, 149, -40, -3, -231, 83, -108, 90, 85, 74, -355, -189, 102, -210, 98, -186, -207, 23, -194, -42, 94, -415, 14, 117, -130, 15, 113, -85, -24, 40, -73, 104, -9, -110, 231, 76, -50, -119, -133, 52, -209, -204, 151, -82, -12, -26, 48, -60, 224, 57, 131, -48, -80, 52, 224, -102, 83, -134, -7, 357, 304, -54, -70, -30, -67, 60, -97, -20, -411, 49, 191, -453, -31, -65, 178, 115, 38, 138, 256, 206, 198, 39, -309, -29, 27, 69, -174, 39, -220, 332, -53, -201, 73, -110, -93, 362, 238, 149, 192, 248, 235, 80, -376, 139, -85, 193, -21, -44, -113, 173, -61, -83, 36, -203, -152, 146, 145, 40, -294, -3, 122, -7, -135, 417, -140, 52, 179, -11, 242, -225, -204, 137, -37, 57, 86, 63, -49, 113, 72, 211, 25, 115, 114, -40, -159, 278, -137, -145, 310, 126, 23, -6, -43, 248, 193, -40, 108, 29, 29, 98, 27, -16, -101, -21, 142, 65, -57, 14, -217, -140, 140, -12, -144, 89, 33, -27, -117, -267]
2303b67M08k06Q2j37K30l50L77j77lK66l97K71k49K99l65J70j18J35qJ28J21k18
2325hJ55m14K55j77J3J88K68m85Q3M73m83L20j09k79L56k11l8Q1j83M2L00j01
2347D6l0j99J02L10l79L25k75K56k34j67K05k2J33k26J21J69j69l3j31J31j58
2368b25K39k73N13l24kn9q8K85L7l07L67j82n5K65k20k27L01l06J71r0J94j28
2390a14o9K12j10J61m23K00oJ0n7P0J72j3J90j58k6J96Pjl74J78k14J04L09m45
2414b01K7L49n44L32J26k94M18O7N4l39j98J57L67o06J39K28k65K75l3N4K1r7
2436C7nJ0l2m26M29M4k01l4K87J29j73l41K15j31K39L9j71M70j46m20k6M37l04
2459g4L23m16j32M67n39nN61k29L43l39j65J10R4k80L97k01j34M50j98J79j51
$$ y = [-267, 141, -65, 17, -120, 110, -240, 137, -40, -43, 223, -174, 97, -152, 147, -218, -48, -166, -31, -39, 89, 210, -8, 147, -267, -12, -189, -176, 12, 280, -205, -122, 351, -132, 188, 79, -200, 156, -55, -93, -12, -195, -153, 147, 46, 16, -183, -81, 229, -150, 175, -100, 156, -78, -245, -40, -62, 71, -155, -34, 135, -34, -67, -198, -67, -225, 14, -259, 254, -70, -72, -131, -219, 66, 103, -204, 163, -19, -74, 191, -29, -256, 45, -261, -90, -180, 14, -114, -183, 29, -81, 80, -343, -143, -149, -139, -196, -126, 46, 33, 223, 65, 39, 235, 242, 241, -133, 45, -169, -65, 244, -201, -174, 175, -369, -37, 89, -205, 213, 280, 334, -5, -203, -46, 321, -285, -146, 82, -183, 92, 59, 113, 134, 37, 32, 42, 10, -416, 13, 57, -144, -178, 109, 238, 65, -276, -61, -192, 47, 86, -85, 385, 239, -181, -207, 230, -74, 249, -167, -299, 168, -371, -376, 185, -44, 299, -40, -205, -95, -1, -281, 116, -85, -219, 231, 33, 212, 61]
2480F1q5J78J44j55o0k9N6J30o35L65J23l41K85k85K25J04o4J03k39K66j46K09
2502B10l18N9K88n36M50j77p9M0Q2k49M15m12J50J47J45k52J33j33m2K69m69M08
2524A29p3M3o0j45p1N08n52L67o6m88O05m6l55L99k02P1L5m8j99k7N0J09J42k02
2548g6J11J17k67K63q6j10R4j35n3J50r5J58j5J60O6o7k39J04j04o6J89l31M5
2571a87j9K39L4m3l5Rm01N11l3R9j67j08N7j35K93k02N7K88l74K21j48L12p3m05
2595b10J55K64j39j41L3J10N0J45R8m14J24L4l15K27l48L62m00L39j2K54k06l27
2617c17K24K23j73Q4j07j57L76K24m29L11k36m3j47L8K5Q4m46L36N4J00j28J9
2639h5K06k41N9N9K2j62OJ41k04M26j14j91L06l12k18J84L16k51J35k71L24j02
$$ y = [61, -24, 154, 298, 143, 83, 54, 110, 240, -395, -30, 93, -248, 37, -248, -23, 81, 17, 120, -119, 147, 1, 210, -108, -49, 239, -297, 153, -24, -103, -63, 19, -230, 185, -227, -77, 70, 215, -37, 96, -37, -79, 190, -279, 129, 56, 99, 39, -106, -177, 331, -221, 146, 80, -408, 197, 151, -204, 195, -7, 64, 99, 51, -148, -175, -125, -16, 126, -76, 35, 152, -115, 148, 62, -48, 46, -89, -142, 8, -87, 71, 56, 216, 282, 215, -24, 80, -24, -90, 99, -232, -187, -206, 33, 67, 24, -11, -2, -403, 108, 75, 174, 7, -101, -44, -179, 114, -88, -31, 257, -117, 104, -44, 268, 195, -210, -55, 209, 70, -71, -38, 72, 122, 267, 365, -49, 75, 109, -206, 21, -327, 35, -365, -26, -38, 216, 10, -317, -93, 130, -43, 41, -66, -223, 153, 377, -52, 259, 23, -20, -167, -129, -104, -20, -466, -130, -76, 24, -104, -85, 121, -120, -61, -2, 20, -142, -136, 5, -199, 227, 113, -78, 228, -84, -302, -118, 198, -53, 82, -189, 135, 33]
2661C3j5J16m4nM6j10k19L15k18P8P0k18L29j48k2N6r2l22M99nj30J36l43L02
2685H9N9k13K34n0k07N83o91p6K39K26k77K97j43L6j90K4L1p5J22j34K89l13K96
2708A56k97m8L33l68M02n8k70L90j98L2o3J1j57L69k73j1n0pJ42R8k17O6j9pL14
2733B70k61l54M31k27J61n4j39K85j14J36o3P6j64J01k32J37l45K72J56j30M7
2754a1j05K54m57J44K85K14j02j99K01l41L02m3j47O6K1j52j60J43L16J59k97
2775I1j8lo4k02K30N0k51J73k7k43K34K15k44J65m19N06j25m13L27P5j8j67Q0
2798d8n5J21K9K5P0l27m8K37R3n1jJ7J59l02J19K25j83n7J63k41L69l10q0P9j63
2823a60J3P6K1K5O7j82J61L21l60K09k01J37p5J34k15J26l49K60j56J21j07J38
$$ y = [33, 18, 134, 90, 85, 131, 21, -198, 117, -101, -23, 47, -171, 158, 10, -12, 44, -48, -370, 129, 124, -6, 130, -213, 89, 148, -65, 169, 119, -88, 495, -196, -272, -33, 193, -84, 213, 70, 106, -84, -60, -29, -104, 18, -116, 173, -140, 156, -141, -189, 144, -224, 178, 120, -150, 240, 42, 74, 11, 22, -135, 234, -39, -50, -100, -107, 35, 133, -84, -18, -37, -44, 270, 9, -345, 86, -141, 20, -34, -173, 112, -2, 134, 71, 147, -17, 84, -148, -11, -356, -84, 72, -58, -11, -116, 138, -319, -175, 110, 324, 222, 23, 224, -117, 185, 142, -5, 61, 82, -70, -230, -87, 229, 388, 91, 73, 70, 6, -196, 34, 84, -167, 6, -21, -264, -30, 185, -59, 106, -313, 193, 68, -345, -18, 57, 39, -128, -48, -103, 18, 47, 72, 142, -185, -233, 4, 97, 46, 45, 62, 221, -81, 38, 263, 80, 23, 186, -55, 314, 4, -76, 3, -160, -147, -71, -50, -25, 42, -140, 21, 342, -18, 191, -10, 127, 52, 186, -29, 97, -252, 8, -148, -27, -134, 4]
2845DP5j7j03J74j49j1j9L46l48J51j31l0R8J30j18q0Jk4K61j38k11P4J84j07
2869A2M4j66K22J33m63L44k8M9k55j14L28o2j07k06P3K56O4Ok45j5M7J49R8k91
2893a27N4j0J96J41m40L54j47J93p6k43p7oL64l22J30nj04K36nk16k4K01j47j04
2917a84j30M28Ol47J54K96j34j08R7p1m7J79K8K9j73j07J61j95L95j39M5j42m0
2940AJ66j23j35Q5J30o8L42m01J24rK3l6k18O7J95j49j44R1PJ22j97J4j96K99
2964a0M2PJ19l03K0J69j19k31J54J95l10j4K33J46j07l69K34J87J08j9k43J45
2986C4j35K19k90K16p2M13k70j40Rj22K08j97j07J79q2R1Q1m6P1j00Jm1K43l82
3010b19K56O4Q4k72l3J85p7J21l03j30K22R1J20k99R0p7J51M8k25L03j70K6O7
$$ y = [4, 79, 62, -41, 133, -16, -27, -46, 300, -48, 103, -28, -58, 40, 170, 52, -28, -27, -51, 210, 72, -139, -65, 119, 12, 56, -110, 112, 245, -218, 126, 98, 147, -108, -222, 106, 44, -63, -269, -196, 60, 124, 130, -115, -130, -83, 66, 164, -127, -73, -83, 113, 254, -186, 168, 21, 214, 138, -105, -182, -188, 176, -146, -16, -21, -125, 111, 106, -110, -134, 67, -80, -184, -314, 114, 120, -227, -73, 223, 89, -19, 78, 7, -40, 139, 167, 196, 23, -84, 77, -118, 277, 138, 183, 41, 1, 167, 44, -91, -6, 124, 56, 398, -3, 121, 112, 135, 99, -119, -52, 143, -6, -150, -59, -52, 70, -127, -113, -309, -10, 32, 39, 158, -145, -125, 44, -75, -306, -152, 43, -267, -281, -48, 98, -9, -378, -144, 43, 151, 132, -111, 34, -101, 118, -172, 44, -28, 385, 115, -25, -16, -138, 70, -127, -234, -55, -137, -46, 35, -11, 60, -40, -39, -80, 163, -219, 37, 101, 185, -87, -120, 65, -12, 109, -194, -324, -102, -11, 109, -190, -100, -177, -26, 22, -203, 100, -70, -44, 23]
3033B3P4j23m6K08j71J44k5K37n88J60j29L92l03m7l9K34q8J28N7k29L36l21P0
3056d6j91K77j59K07k42J07m1j01L02k62M35m66J55J30Rj49j37K64l8N1l0p2P6
3079G9j78j1K42j84J19n4j53k44M03K2K06k24j57J52OP0p5P7k61L06j19P2N4o0
3103H8j36p1J05j8J66j11K16m04J80k49K37N2j16r4L12l27K80L7j64J47k20J97
3125A07m5J8M5J34j92J37M5r9pk72J40J43j49L3r6K5l8Lr5n7J10J51k13K81k81
3150a72M03o23L45R8J65l09P1L27m69j8J87K24j37j02m6J83M9q3r2K87l99l5R4
3173e2J55qJ03q4N5k71O1j8L27k88J05k82J81L8k28K55l05M68k07J71j91K7L7
3196D9k04PJ7J06J70j8m7k01j87N10k05R9j29j65J62K14k17l1r4M6J80k10J73
$$ y = [23, 97, -26, -72, 136, -35, 109, 84, 321, -267, -107, -236, 156, -147, -194, -233, 1, -87, 41, 98, -131, 205, -116, -46, -237, 40, -119, 88, -154, -47, -88, -189, 113, -149, 286, -180, -25, 105, 114, -35, -172, 92, 54, 105, 75, 3, 79, -99, -110, 132, -52, 67, 13, -140, -384, 19, 41, 247, 23, -134, 18, 24, 94, 19, 96, -165, 141, 22, 94, 148, 88, -48, -119, -14, -32, 134, 23, 239, -165, 15, -234, 3, 55, -61, -155, 157, -170, 110, 147, -17, 130, -90, 107, 62, 80, 125, 259, 67, 204, 249, 150, 143, -129, 11, 154, 5, 38, -58, -33, -71, -68, -163, -220, -110, 41, -172, 109, -172, 231, -392, -47, 51, 216, -93, -22, 305, -164, -182, 5, 229, 92, -10, -56, 127, 176, 93, 1, 288, -111, -146, -52, 103, 95, 198, 114, 169, -102, -41, -59, 268, -20, 85, -197, -16, 22, -206, 49, -256, 212, 5, 176, -15, 12, 49, -155, -148, -131, -25, 145, 127, 80, -121, -308, 202, -3, 96, -33, -198, -36, 178, -39, -70, -164, -118, 62, -148, 25]
3219B5k1J13k49k3J38j46JK79m9L9k34J24j8j05L63l39L3J48j07j5j00M5RJ10
3243B1j4J12n2p5P2j31L31l75j65O2M99m81J41J99k05j4q1M32j92j09M72n92J87
3266D2j88J2P4J13P2l82L06m7p0N6J8L7Q9j21K25j98j75K16m89J59L05k01K97
3289A50j91L2r9L24l19N1O6k83M57n9k83J93j97k2J97J70j65J32J1j99L74l72
3311c2m2M67k63k00K35k28J73l80M12j74P5L5l51L01L92n70J39j40L45k78J59
3332G5j28K50l17K45j02Rj01L4Q5n5L64l02J7k57P2J03J45n2n0m2J13k6j02%m5
3357f7OJ26k6J9r4qQ5j47K48Q1j93j04R3m0M1k05K19J1M9j40M7N2l40K81J51j72
3383b7K73l02J20r8j11n6L49j17p9J98k0k95R6J21O7j98jj48J51Q7K00m16mL52
$$ y = [25, 4, 117, -132, -155, -17, -163, -162, 117, 68, 107, -127, -3, -21, -126, 237, -102, -69, 79, -28, -43, -143, -98, -89, 21, 7, 119, 67, -8, 64, -67, 264, -111, -276, -214, 285, -196, -55, 144, -61, -75, -156, 276, 84, -25, 447, -145, 42, -146, -134, -60, 53, 125, -257, 49, 2, -68, -12, 6, 43, 132, 11, 236, 38, -137, 79, -410, -251, 54, -147, 150, -41, -9, -108, 216, -103, -52, 14, -269, 188, 129, -154, 39, -158, -180, 17, 187, 22, 154, 165, -34, 340, -32, -74, 393, 130, -70, 165, -63, 110, -270, 142, -32, 43, 78, -273, 28, 420, -150, -11, -151, 194, -84, 75, -53, 197, -120, 125, 23, 32, -69, -35, 50, -5, 359, 57, 74, -183, -111, -8, 137, 85, 35, -7, 106, 80, -22, -22, -67, -61, 65, 39, 58, -36, -44, 41, -106, 142, 223, 30, -74, 19, -21, 20, -185, 34, 45, 94, -46, 1, 53, -287, -6, 145, -27, 246, -56, 64, -34, -145, -201, 148, 31, -48, 150, 130, -165, -69, 52, 119, -79, -80, -228, -77, 10, 210, -206, -210, 142]
3407A42l12L73l75J6L79m58K51K40m91L69j99j5rJ91N8q7k96M5K87j98K3K24k54
3430i6J43J13k05r1K88j44j55J17j89K10J55k59J03J75j53j09p9q6P50p73P0J43
3452g2O3J14m04J83L72m48J33J95j80q4J51Q8PL41l87L6j57j89K2K19P4L0KJ6
3476A25k01k7K12k42J21J37k34K10k64J85J15N6O7k7l12J85qJ1p5L5q9O1k32L41
3500A50l05n8M04p6n7j24j13J12n9K90J0m09N09k63P7j22o9Q5k74K91r7M2Q1J34
3524A59j10l7J17j4p4j17J80l2Rj70K00j24l64L54j01L28m22K61J94j91l34M01
3546A13k52N3j80N24l20J37l6j07O3K20k06L8J23j60Q7m96M82k03j27K77OQ4k51
3569a31K18J23l16K96j34K5j02J21j26j4J7J2L2j50Q1K35j56j48N6L1m2J35mk08
$$ y = [142, -170, 203, -172, -156, 223, -235, 16, 256, -235, 134, -65, -80, -89, 102, 160, 73, -223, -178, 109, -89, -66, 158, -96, 47, 160, -45, -136, 152, 8, -147, -30, -219, -9, 146, -113, -10, 165, 12, -97, -176, -262, 488, -285, -215, -72, -9, 105, -299, -116, 256, -192, -59, 136, -44, -128, 23, 111, 118, 459, 72, 108, -49, -238, -216, 3, 77, 107, 109, 125, -76, -103, 109, -133, -12, 125, -109, 101, -163, 22, 137, 193, 260, 233, -79, 106, 98, 109, 34, 69, -20, 41, -191, 150, -155, -213, 191, 115, 58, -66, -179, -67, -126, 164, 174, -235, 274, 11, 88, -34, -103, -18, -292, -1, -98, -56, 25, 159, 49, 12, 129, 115, 41, -76, 104, 72, 81, -89, 111, -13, -377, -23, -124, 204, -218, 43, 237, 46, -288, 113, -139, -86, -266, 258, -62, 75, 39, -68, -5, 215, 9, 47, 170, 10, 97, -399, 83, -120, -247, 30, 36, 120, -131, 87, 210, -106, 190, 56, 81, -21, 100, -26, -40, -23, -11, 21, -129, -48, 187, 31, -117, -61, -30, -72, 63, 59, -149]
3593a49Q9Q3q6J91j03K4j62K56j89j52K09j36r8K47j80N8K16j22P0n5k74K10L09
3616B56n44L70k40J63J10J49j3k40p3m9M0K77m87L99j04K70k60kj27M23l79J57
3638I6l39L15k3l79N81m81L22Kn7o6L4m52M10q3j29K40O6mj14j49P2M59j89l46
3662b14J18J81q1q9J43J21k72%PPK33j58j48p4K27J07J06k84l6P0q0k3J00K08
3686A69m07M86m90J46pK26O8j14k5p5P4o4j16J03L1m3J27q3J04j8k78M12n50M37
3710A13k89P3M05l25r0j10M37k85o2J43k73K32l8M8J02j04O9j97M6K36l33L10
3732A08q6l8J93k11J5j1j88K80k13J55j08p2O6J26k3q0Kr1j5L32k58K83n7J3o3
3757E9L2l39J13K79j21l09j8L47m8K09k07J72r0j38J32k33P2J69j75J15L9l38
$$ y = [-149, -60, 23, -63, 128, 25, 49, -113, 143, -46, -198, 11, -125, -223, 24, -156, -98, 118, -4, 66, 11, -263, -53, 256, -288, 82, -158, 5, 115, 264, 251, 11, -62, -111, -71, 206, -281, 118, 14, 284, 24, 22, -105, 318, -61, 96, -243, 72, 49, -330, 251, -230, 92, 94, 37, -29, 5, -447, -37, -120, -249, -9, 57, 53, -61, -210, -138, 321, 132, -214, -96, 85, 4, -85, 58, 179, -93, -93, -86, -79, 154, -4, -152, -226, 1, 108, 214, -70, -106, -36, -116, -139, -39, 169, -238, 248, -242, -96, -103, 123, 191, 77, 52, -23, 51, -13, -129, -26, 5, -38, 89, 6, 110, 92, -186, 226, -324, 113, -176, -103, 302, -23, -113, -223, 214, -71, -133, 10, -263, -31, -69, -21, 81, -23, 46, -151, -105, 131, -202, 108, 22, -16, 177, -34, -19, -30, -218, 62, -151, 4, -104, -176, -110, 16, -7, -87, -85, -176, -191, 141, -117, 166, 109, 122, 59, 91, -248, -135, 144, 23, -286, -304, 43, -5, 204, -3, 169, 79, -59, 73, -160, -88, 81, -94, 21, 60, -278]
3779b78M48k74N3o3j44J74k6K29N6N4n04N19k89L83l15r8O9r0l9J76k4k62l4J95
3803h4O5N0K03k31j26K05r8j33K70j55J37k13L1P4j13J56p8N8k25L13k65K88j
3826A28m23K13J63j08J42k05K67j58j04P7l21M38j08P9mqL2k63j22O21m69J21
3848a2j3O4m1j52K01l35K80L9p8JO2Q9l01L37m9K37k27j27l1K12j91o2K77N4j52
3873H2j80L11l09L30k16Q1%k04J65N5k2M3L9k66L24r8k76J01o9P0J67mqO7k86
3898a03Q7M5J58k94K16j44r8J42j27M2K19j04k29K28r2J27qj30M74l64K0R3p7
3921H1qj2l9J0r7K30k24J51K37l92n8J00J0K59J03o54L64n3J01n1L3j78N8r8J9
3946a08K20l66k69O57l22L27k05q9M1L9J1N7L97m27K49k33J6J34j51j77K10j38
$$ y = [-278, 170, -104, -51, -114, -258, -84, -110, 119, 175, 229, -275, 244, -45, 338, 23, -75, -6, -96, -135, 41, 17, -245, -279, -84, -19, 31, 234, 3, -123, 82, -16, -149, 121, -34, 103, -110, -79, -5, -118, 38, -40, 18, -207, 106, -159, 129, 128, -295, -82, 81, -27, 115, -90, 177, 19, -85, -8, -329, 109, 1, 80, 76, 68, 100, -163, -285, 336, -133, -12, -25, 39, -2, -154, 47, -288, -8, 31, -47, -46, 16, 105, -196, 141, 92, 329, 102, -25, -56, 156, -35, -97, 180, 234, 82, -98, 213, -96, 234, 18, 99, 99, -105, 60, 115, 93, 136, 175, -91, 233, 135, -141, -40, -109, -39, 128, 124, 116, 183, -103, -16, 29, 187, -107, 109, -35, -133, 9, -118, -76, 143, 39, -190, 38, -54, 73, 65, -65, 409, 45, 65, 158, 81, 73, 61, 22, 32, -65, 165, -59, 92, 329, -63, -121, -21, -11, 248, 351, -303, 61, 8, 109, 58, 91, -87, -29, -127, -108, 112, -254, -523, 134, -188, 139, -66, -155, -114, -75, -64, -7, 390, -37, 212, -21, -5, 129, -22, -199, 11, -127]
3968a27J98m9J57j75j34J39L18l32R0Q4k26l2K28q6L3j92o2K43k68M98k60j41
$$ y = [-127, 71, 22, 179, 4, -130, 9, 327, -5, 85, 169, -57, -89, 139, 53, 86, -106, -168, 75, -193, 305, 45, -96]
$$ [...]
8191A54
##END NTUPLES=NMR FID
##END=
