##TITLE=1H_Pr D6-H2O
 200.13MHz, CDCl3,
 8 sc
 
 26.5.2025
##JCAMPDX= 6.0         $$ Bruker NMR JCAMP-DX V2.0
##DATA TYPE= NMR FID
##DATA CLASS= NTUPLES
##ORIGIN= UXNMR, Bruker Analytische Messtechnik GmbH
##OWNER= pz
$$ XWIN-NMR		Version 3.5
$$ Mon May 26 15:10:22 2025 Russian Standard Time (UT+4h)  she@DPX200
##.OBSERVE FREQUENCY= 200.1313
##.OBSERVE NUCLEUS= ^1H
##.DELAY= (6, 6)
##.ACQUISITION MODE= SIMULTANEOUS
##.ACQUISITION SCHEME= undefined
##.AVERAGES= 8
##.DIGITISER RES= 18
##SPECTROMETER/DATA SYSTEM= spect
##.PULSE SEQUENCE= zg30
##.SOLVENT NAME= CDCl3
##.SHIFT REFERENCE= (INTERNAL, CDCl3, 0, 14.3821)
##AUDIT TRAIL= $$ (NUMBER, WHEN, WHO, WHERE, WHAT)
$$ ##TITLE= Audit trail, XWIN-NMR		Version 3.5
$$ ##JCAMPDX= 5.01
$$ ##ORIGIN= Bruker BioSpin GmbH
$$ ##OWNER= she
$$ F:/spectra/data/she/nmr/H-C/1/audita.txt
$$ ##AUDIT TRAIL=  $$ (NUMBER, WHEN, WHO, WHERE, WHAT)
(   1,<2025-05-26 15:09:04.87 +0400>,<she>,<DPX200>,
      <created by zg, POWCHK disabled, PULCHK disabled
       configuration hash MD5:
       00 E9 B6 7A A2 85 ED C7 34 08 36 98 17 FE 4E 26
       data hash MD5: 16K
       EB 2B 2B A0 9A 6E F8 BC 31 39 FC 88 6E 11 C9 EF>)
$$ ##END=
$$ 
$$ hash MD5
$$ 1E 80 35 F6 20 30 F8 6B 75 11 46 FE 1F 46 49 D4
##$RELAX= 
##$RELAX= 
##$RELAX= 
##$RELAX= 
##$RELAX= 
##$RELAX= 
$$ Bruker specific parameters
$$ --------------------------
##$DU= <F:/spectra>
##$EXPNO= 1
##$NAME= <H-C>
##$PROCNO= 1
##$TYPE= <nmr>
##$USER= <she>
##$AMP= (0..31)
100 100 100 100 100 100 100 100 100 100 100 100 100 100 100 100 100 100 
100 100 100 100 100 100 100 100 100 100 100 100 100 100 
##$AQSEQ= 0
##$AQ_mod= 1
##$AUNM= <au_zg>
##$AUTOPOS= <>
##$BF1= 200.13
##$BF2= 200.13
##$BF3= 200.13
##$BF4= 200.13
##$BF5= 200.13
##$BF6= 200.13
##$BF7= 200.13
##$BF8= 200.13
##$BYTORDA= 1
##$CFDGTYP= 0
##$CFRGTYP= 5
##$CHEMSTR= <none>
##$CNST= (0..31)
1 1 145 1 1 1 1 1 1 1 1 1 1 1 1 1 1 1 1 1 1 1 1 1 1 1 1 1 1 1 1 1 
##$CPDPRG= <>
##$CPDPRG1= <>
##$CPDPRG2= <>
##$CPDPRG3= <>
##$CPDPRG4= <mlev>
##$CPDPRG5= <mlev>
##$CPDPRG6= <mlev>
##$CPDPRG7= <mlev>
##$CPDPRG8= <mlev>
##$CPDPRGB= <>
##$CPDPRGT= <>
##$D= (0..31)
0 0.7 0 0 0 0 0 0 0 0 0 0.03 0 0 0 0 0 0 0 0 0 0 0 0 0 0 0 0 0 0 0 0 
##$DATE= 1748257744
##$DBL= (0..7)
120 120 120 120 120 120 120 120 
##$DBP= (0..7)
150 150 150 150 150 150 150 150 
##$DBP07= 0
##$DBPNAM0= <>
##$DBPNAM1= <>
##$DBPNAM2= <>
##$DBPNAM3= <>
##$DBPNAM4= <>
##$DBPNAM5= <>
##$DBPNAM6= <>
##$DBPNAM7= <>
##$DBPOAL= (0..7)
0.5 0.5 0.5 0.5 0.5 0.5 0.5 0.5 
##$DBPOFFS= (0..7)
0 0 0 0 0 0 0 0 
##$DE= 6
##$DECBNUC= <off>
##$DECIM= 32
##$DECNUC= <off>
##$DECSTAT= 4
##$DIGMOD= 1
##$DIGTYP= 9
##$DL= (0..7)
0 120 120 120 120 120 120 120 
##$DP= (0..7)
150 150 150 150 150 150 150 150 
##$DP07= 0
##$DPNAME0= <>
##$DPNAME1= <>
##$DPNAME2= <>
##$DPNAME3= <>
##$DPNAME4= <>
##$DPNAME5= <>
##$DPNAME6= <>
##$DPNAME7= <>
##$DPOAL= (0..7)
0.5 0.5 0.5 0.5 0.5 0.5 0.5 0.5 
##$DPOFFS= (0..7)
0 0 0 0 0 0 0 0 
##$DQDMODE= 0
##$DR= 18
##$DS= 0
##$DSLIST= <SSSSSSSSSSSSSSS>
$$ [...]
##$SUBNAM0= <"">
##$SUBNAM1= <"">
##$SUBNAM2= <"">
##$SUBNAM3= <"">
##$SUBNAM4= <"">
##$SUBNAM5= <"">
##$SUBNAM6= <"">
##$SUBNAM7= <"">
##$SUBNAM8= <"">
##$SUBNAM9= <"">
##$SW= 18.0517328524113
##$SWIBOX= (0..15)
0 0 2 0 0 0 0 0 0 0 0 0 0 0 0 0 
##$SW_h= 3612.71676300578
##$TD= 16384
##$TD0= 1
##$TE= 0
##$TE2= 300
##$TE3= 300
##$TEG= 300
##$TL= (0..7)
0 120 120 120 120 120 120 120 
##$TP= (0..7)
150 150 150 150 150 150 150 150 
##$TP07= 0
##$TPNAME0= <>
##$TPNAME1= <>
##$TPNAME2= <>
##$TPNAME3= <>
##$TPNAME4= <>
##$TPNAME5= <>
##$TPNAME6= <>
##$TPNAME7= <>
##$TPOAL= (0..7)
0.5 0.5 0.5 0.5 0.5 0.5 0.5 0.5 
##$TPOFFS= (0..7)
0 0 0 0 0 0 0 0 
##$TUNHIN= 0
##$TUNHOUT= 0
##$TUNXOUT= 0
##$USERA1= <user>
##$USERA2= <user>
##$USERA3= <user>
##$USERA4= <user>
##$USERA5= <user>
##$V9= 5
##$VALIST= <valist>
##$VCLIST= <CCCCCCCCCCCCCCC>
##$VD= 0
##$VDLIST= <DDDDDDDDDDDDDDD>
##$VPLIST= <PPPPPPPPPPPPPPP>
##$VTLIST= <TTTTTTTTTTTTTTT>
##$WBST= 1024
##$WBSW= 4
##$XGAIN= (0..3)
0 0 0 0 
##$XL= 0
##$YL= 0
##$YMAX_a= 425801
##$YMIN_a= -469368
##$ZGOPTNS= <>
##$ZL1= 120
##$ZL2= 120
##$ZL3= 120
##$ZL4= 120
##$ABSF1= 10
##$ABSF2= 0
##$ABSG= 5
##$ABSL= 3
##$ALPHA= 0
##$AQORDER= 0
##$ASSFAC= 0
##$ASSFACI= 0
##$ASSFACX= 0
##$ASSWID= 0
##$AUNMP= <proc_1d>
##$AZFE= 0.1
##$AZFW= 0.1
##$BCFW= 1
##$BC_mod= 2
##$BYTORDP= 1
##$COROFFS= 0
##$CY= -3
##$DATMOD= 1
##$DC= 2
##$DFILT= <>
##$DTYPP= 0
##$F1P= 0
##$F2P= 0
##$FCOR= 0.5
##$FTSIZE= 0
##$FT_mod= 4
##$GAMMA= 1
##$GB= 0.15
##$INTBC= 1
##$INTSCL= 1
##$ISEN= 128
##$LB= 0.25
##$LEV0= 0
##$LPBIN= 0
##$MAXI= 10000
##$MC2= 0
##$MEAN= 0
##$ME_mod= 0
##$MI= 1.114404
##$NCOEF= 0
##$NC_proc= 0
##$NLEV= 6
##$NOISF1= 3.799351
##$NOISF2= 2.8
##$NSP= 1
##$NTH_PI= 0
##$NZP= 0
##$OFFSET= 14.38212
##$PC= 1
##$PHC0= -1557.239
##$PHC1= 14.79216
##$PH_mod= 1
##$PKNL= yes
##$PPARMOD= 0
##$PSCAL= 0
##$PSIGN= 0
##$REVERSE= no
##$SF= 200.129724274929
##$SI= 16384
##$SIGF1= 3
##$SIGF2= 2
##$SINO= 400
##$SIOLD= 16384
##$SREGLST= <1H.CDCl3>
##$SSB= 0
##$STSI= 0
##$STSR= 0
##$SW_p= 3205.1282051282
##$SYMM= 0
##$S_DEV= 0
##$TDeff= 0
##$TDoff= 0
##$TI= <>
##$TILT= no
##$TM1= 0
##$TM2= 0
##$TOPLEV= 0
##$USERP1= <user>
##$USERP2= <user>
##$USERP3= <user>
##$USERP4= <user>
##$USERP5= <user>
##$WDW= 1
##$XDIM= 8192
##$YMAX_p= 0
##$YMIN_p= 0
$$ End of Bruker specific parameters
$$ ---------------------------------
##NTUPLES= NMR FID
##VAR_NAME=  TIME,          FID/REAL,        FID/IMAG
##SYMBOL=    X,             R,               I
##VAR_TYPE=  INDEPENDENT,   DEPENDENT,       DEPENDENT
##VAR_FORM=  AFFN,          ASDF,            ASDF
##VAR_DIM=   8192,          8192,            8192
##UNITS=     SECONDS,       ARBITRARY UNITS, ARBITRARY UNITS
##FACTOR=    0.0002768,     1,               1
##FIRST=     0,             0,               0
##LAST=      2.2672688,     0,               0
##MIN=       0,             -469368,         0
##MAX=       2.2672688,     425801,          0
$$ Real data points
##PAGE= N=1
##DATA TABLE= (X++(R..R)), XYDATA
$$ [...]
1921d02m84Q10J53l44J071j172j11J147j215L28R93p67O65j7j198O58k84m95Q27
1940A63M22o08J63p99M40K5r45P05R28r01J098l35j178J556o93n77J629m18l43
1959C32k01l40N31r66o03J623k41q15M56n04R1J451j498Q06J704j723K95L11j133
1978d24O68l25n02R83m86n78J57j99Q32J94j487J806Q56k551P00N55j058J076
1996B17p6j12Q76j117l49R69m36O32k82q27K006j280j781J519n57k59J285j077
2014f49J55J156j485O16O23o59J306n67l18P08r11o32J002r80R62J39j916J641
2032A91M76k248J366M27l30O44o43n2Q92j489Q10M84l04N17m32l95J204j201j566
2051a649K094k04q91N74m50K17K55j124J298P35p38N78p04P1K23r82O30R28j461
$$ y = [-402, -886, -76, 77, -267, 804, -368, -479, 668, -547, -219, 774, 7, 672, 655, -543, 115, -169, -664, 163, 585, -23, 140, -659, -219, -194, -1139, -434, 494, -407, 691, 356, -822, 734, 41, -536, 1093, 675, 332, 131, -209, 322, -644, -1247, 376, 135, -680, -224, -728, -637, 814, -684, 122, 1826, 103, 398, 709, -424, 244, -81, -583, 400, -86, -664, -507, -706, 126, 320, -1167, 639, 1495, -1056, -356, 199, -859, 217, 141, 29, 905, -212, -561, 408, -28, 604, 322, -505, 1501, 221, -1560, -41, -598, -857, 428, -649, -494, 662, -823, -207, 416, -243, 1063, 496, 178, 886, -25, -657, 345, -635, 327, 466, -1450, 191, 667, -1581, -215, 212, -118, 526, -117, -169, 723, -766, 44, 528, 224, 741, 309, -86, 1118, -83, -1649, 445, 241, -650, -76, -526, -309, -54, -1178, 120, 855, 117, 695, -9, 62, 285, -697, -67, 861, -600]
2070f00N56N88r52J94N86p30N48J50n67K79q08K80K67m88Q42P2p94J259p07m62
2090d87J506k87j067P40K46n87m81k20O28l87o38O89L35r3%l10J043J82j125O50
2110C37R20j311l11N71m11M61q28L62P27m68k47%J78J40m33k33J312o63p74J202
2130E31m29n34N69R8J83l94J0J07k72l13P82l67j54J43p06P68r4q86J125O11j176
2151c98J44N10j09l39j49Q10J99r44M45M1n62R05r84l9J154j544m8J392p37o39
2171h92O93K16K33k32j77R28o55k75O88l60n9J92j052R76rr83P37L21r39N05M26
2192B82m67J75m35M55N39r59N29N69j125O88m09n4J083j315l29J550p46o80R82
2211C33l32m85M3p9Q57l35r32J247m28J37M89m13M84q7j425J314O03j789P43K77
$$ y = [-600, -44, 544, -408, -214, 372, -358, 190, 340, -227, 52, -756, -476, -209, -697, 145, 217, -577, 682, -25, -487, 1019, 732, -335, 405, 651, 64, -417, -637, -9, -396, -1034, -345, -10, -103, -103, -413, 630, 812, -313, 337, 1257, -54, -365, 206, -205, 256, -572, -210, 517, 49, -198, -198, -20, 120, -313, -546, 766, 103, -671, 531, 102, -432, 137, 235, 418, 24, 34, 141, -131, -444, 338, -29, -183, -40, -746, 22, -72, -958, 167, 778, -398, -254, 256, 147, -192, -341, 469, 668, -276, 169, 210, -352, 553, -431, -470, 684, -860, -908, 484, -253, -892, -199, 17, 250, 18, -159, 769, 114, -161, 527, 167, 108, 300, -752, 224, 215, -768, -31, 290, -649, -144, 282, -185, -10, -445, 10, 549, -410, 119, 688, -437, 251, -158, -212, 871, -444, -773, 777, 31, -649, 333, 1, -484, -441, -520, 337, 2, -930, 317, -111, 26, 515, 102, 586, 499, -926, 388, 991, -798, -55, 222]
2231B22n12K56m81K61M71r76L44R47p33N73j41n91J063p60j12J292j062n15J269
2250H15p80m28K60o01R59l35o31J430o00p50J059o21J93O14j126Q62O82j366M11
2269D7O39p14P6K5m8J60p71Q2J030j223P38K10o58O51l76m82J185m85n71J301
2289H16q00j61O64m32j0O4o84P28l19o50R09l74R7L36r79P40Q36j245J84J156
2309H76j073J89K23k57N62o24r5O17m57R0j03j84L57k31n75J113m14j086J153
2328H1m40j63R51l06lo8O8J34J08n00Q30p69RJ72o84O48J65q45P50Q1o74K67L17
2351A29j73o2L51j54K19j39j55J09q2L93o42k9Q00p90m32R07k82n13N38n5J10
2372D8j00k46M61J2N0L00m80L21n0p86P70J70r58J078m33l91O4J82j20Q4n3O8
$$ y = [222, -290, -34, -515, -254, 217, -759, -415, 532, -201, 372, 231, -360, 703, -57, -169, 1123, 61, -454, 815, 35, -393, -133, -734, 225, -110, -741, 689, 89, -661, 398, -223, -30, 584, -542, 320, 1002, -364, 47, 686, -28, 48, 73, 25, 185, -586, -504, 526, -697, 41, 251, -407, 244, -132, -614, 571, 86, -485, 816, 16, -145, 519, 87, 77, 141, -543, 185, -134, -784, 125, -249, -152, 184, -795, -55, 781, -464, -280, 876, -197, -8, 215, -42, 520, -104, -199, 418, -39, 51, -52, -236, 121, -110, -685, 428, 14, -1072, 81, -359, -522, 429, 123, 120, 52, 120, 254, 362, -138, 692, -77, -68, 104, -580, 68, 233, -612, 138, 219, -455, -188, 129, -44, -106, 245, 91, 310, 171, 16, 125, 43, 436, -206, -235, 565, -225, -657, 250, -32, -545, -7, -62, 48, -52, -298, 163, 175, 225, 525, 45, 366, 316, -470, 300, 470, -488, 590, 157, -234, -170, 12, -108, -24, -77, -9]
2394imn45N34l40p5O73l82K51N33r11K62N16m73l65O76n22K66m26o23R03j20m99
2416f80N69j04N20j10m42O81p2q12P97J38o48K67r2m19M51k23J61L83q17P78k95
2437C1o54Q68k58n42Q70l58l6L75q34N42N64n91M45M8o18N03m69k50N01m05R0
2458a78M94r44O51K61j027J081K11j075N48L63n80L21k79M0L27k33J59P2n88L68
2478hk49m44J030l56m97O41k87q3N11n44J50R21p51K05j25k20Q68p96l7L42l88
2499a17k70O30r83Q70J13n35K96M56q46P17j90k85N79o40L95J75n96L61O3m07
2519b14K79J70o01O77j22m43M06n77K98K02l44K0N53p44N17j53n5O68n92K31M35
2540F11n80l71O84n32K56n1p00Q03l75k65N17o0j5M38o06N92O5o27J46M03l70
$$ y = [-9, -13, -558, -24, -364, -439, 234, -148, 103, 636, -275, -13, 503, 30, -335, 341, -181, 85, -341, -964, -61, -181, -680, -111, -215, 305, 195, -247, 434, 362, -450, 347, 485, -163, 104, 12, -407, 44, -179, -18, 365, -452, 326, 31, -623, 245, -13, -555, 315, -43, -79, 296, -538, 4, 568, -23, 422, 470, -148, 355, -114, -364, 137, -268, -178, 316, -628, 23, 284, -743, 338, 549, -526, 22, 385, -195, 126, -153, -113, 214, -19, 140, 212, -376, -8, -257, -701, 329, -27, -524, 117, -170, -253, 258, -286, -136, 785, 34, 239, 114, -106, 762, -34, -71, 271, -117, -387, 243, -740, 130, 243, -292, 4, 460, -386, 331, 141, -144, 435, -205, 190, 365, -231, 130, 193, -214, 65, 235, -366, 311, 189, -254, 152, -425, -127, 75, -269, -249, 304, -440, 77, -76, -131, 537, -55, 176, 611, 31, -340, 344, -188, 68, 17, -683, 120, -255, -520, -3, -63, -78, 360, -246, 346, 411, -216, -70, 333, -37]
2561c7K22K14l62L88p58j5M33l29r1M88k76J64m81OO16j92j04O55l28k11M95p39
2583b42L97O1k70K39j88m06K95l2J8m1K36Q4K7m17K41R7n21M09J13K73j76k09
2605a2o8K93l32K38j6PJ20l60m2K54p52K80K59J01P5j23j63M25j7m63N36L52n66
2628B6K37m61L51J57o44K86k3k47K97k40R8J05o1k08L88r9P9J61n71M29K0l12
2650b32N43l78L16J15n43J20L38l27l85O39m92L19m69n9O99k19j16O32n26K02
2670A77K3m48R05j78r49M86L10m97J35j5J64L08p52N1O43q10O77o1l37O97o50
2691a21L26R4m52L8L92k35P7L34m86J08k9n95O11j88k29M37l45ON94o50N28L21
2713E36j078Q97L60q23J69K52m22K85l37J39J83m20O4O98p24j73J84m7O59m28
$$ y = [-37, 185, 399, 37, 425, -333, -348, 85, -244, -335, 153, -123, 41, -440, -434, 182, -10, -114, 541, 213, 2, 497, -242, 155, 216, -54, 185, -3, -409, -114, -146, -128, -169, 67, 151, 178, -239, 2, 99, -422, -13, 100, 373, 197, -12, -80, 213, -119, 119, 103, 110, 230, -130, -172, 82, -670, -390, -131, -30, 45, -78, -241, 184, 167, -296, 240, 592, 26, 263, -198, 153, 310, -334, -48, -71, -318, -21, -261, -163, -58, -119, -327, 61, -38, 41, 202, -369, 60, 80, -232, 311, -67, 249, 364, -179, -59, 279, -48, -433, 206, -286, 33, -436, -495, 204, -15, -131, 501, -25, 177, 200, -248, 657, 479, -470, 16, 326, -171, -36, -51, 113, 421, -331, -280, 363, -447, 230, 169, -168, 529, -121, 205, 299, -153, -115, 277, 42, 119, 453, -33, 75, 46, -549, 62, -126, -355, 82, -263, -257, 337, -313, 215, 536, -542, 355, 715, -108, 61, 313, -109, 176, -161, -22, 161, -259, -195, 503, -221, -394, -210, -257, 402, -26]
2733b6n40R97l99Q2J21j04p2m6J50J13p2m84M47n7m03K67m28K33L37n59N24L10
2755C91r04N94J98l80K59n22N77L27m37J2K49o02R6L39m36K35K08l54M25l91q9
2776b05K93j79j52Q8J12N05n08k78P55k72k72K31k17M75l64m04N93k10l73K64
2796a18K47n01K13L5J95Q6m90O80L51n64k5J71j04Q5m42r3L89m60r1N84P5l78
2818a55J03R5J61k62k31N33j28l21L03j94L11K28m49j83N76q00M20K61o89N51
2838A30L9k23K18m89J08L37k66L1L44P1l22K26m10M31j6n99N95l1m40L65k11K12
2860A00p8j79N53n91j18K90J50l50M52p01L72O34q77K57J8J57M4m6p3R6m39L97
2882F8R4m09L60l36J17K98j81j92L72J9l04K50q4n8N5l5R9q8k64N10o79J59N00
$$ y = [-26, -566, 431, 32, 114, 235, 131, 59, 13, 163, 276, 204, -280, 167, 110, -293, -26, -454, -221, 116, -443, 81, 391, -513, 81, 279, -101, 158, -364, 213, 540, 103, 115, 364, -238, -142, 197, -239, -4, 204, -150, 275, -116, -205, 88, -91, -243, -155, -43, 462, -46, -324, 431, 159, -113, 118, -99, 376, 12, -392, 201, -9, -382, -118, 129, -372, -159, -124, 71, 157, -333, 347, 698, 134, 109, 280, 176, 261, -181, -274, 115, -345, -436, 148, 223, -155, -52, 43, 204, -58, -289, 244, 116, -205, 98, -96, 215, 443, -6, -189, 387, -413, 7, 268, -421, 130, 169, -54, 164, -325, -217, 120, -146, -115, 229, 300, -22, 204, -206, 225, 209, -390, 205, 174, -266, 99, -112, 100, 22, -157, 396, -195, -313, -23, 127, -223, 229, -472, -100, 534, -343, -86, -68, 89, 133, 87, 14, 110, -329, 68, 162, -247, 113, -223, -106, 192, 11, -181, 191, 210, -94, 156, 72, 14, 69, 34, 133, 45, -219, 291, -388, -229, 271]
2905B71m90J88l6m85N52R9n33L03O59p42J58kL09J10m15K95K38o62K72J6P9P3
2927B57n43j35R20q42p4P14m52J36R9q2K6J59k67K66n8j66K83n84K1N90o88M35
2949A5J37p51P73k77m31P00J99n72M69n16J87K51m41M69Qj60n6j69J17J99k83
2970a32j97N46j39n88O58l62P4R0l8L01j28j33L41m07R8r4J14nK83o03N11N1n55
2993c14L29j09j13K57l51j59O90n23L27J92m63N87j64m69N43l60J26N65m82k84
3013a75N73m55J46mp7Q3K48m21K37j55k51M16l21RM19l78K82K88p05L54j77K48
3035A84k27J48j18J07lj52l22K9J79K20l44O12j70m14M62j25p5M37n48J36L65
3056C81j53k90l2L2K19j76k50N47l70o8J20p5M5m2J77l6K72l96K99J01l40o4N2
$$ y = [271, -219, -31, -67, -552, 0, 99, -434, -131, 528, -214, -56, -58, 251, 361, -54, 241, 479, -183, 89, 105, 184, 257, -286, -421, 499, -343, -417, 297, -155, -19, 80, -2, 24, 183, -84, 182, 124, -42, 241, -343, -322, 268, -420, 15, 152, -599, 174, -103, -534, 166, 365, -207, 262, -254, -67, 184, -257, 212, 220, 60, 4, -165, -48, 151, -132, -329, 217, 78, -510, 148, -214, -140, -50, -88, 213, 85, -48, 293, -114, -16, -110, 4, -1, 282, -321, 190, 241, -314, 15, -94, -207, 50, -301, -460, 230, -293, 34, 226, -237, 350, 186, -283, 260, -100, 26, 591, 109, -175, 398, -57, 89, 85, 8, 91, 339, -82, 155, 0, -251, 165, -156, -147, 272, -106, 176, 464, -241, 113, -64, 184, -43, 105, -13, 94, 91, -61, -383, -354, -175, 45, -299, 313, 143, -271, 191, 66, -9, 428, -120, 16, 381, 228, -62, -94, -62, 157, -19, -269, 278, -92, -160, -40, -115, -70, -112, 65, 29, 301, -95, 204, 305, -35, -99, -47]
3079d7j51L42r7N6N4l15K06m85L6N38l7l27K64k18L30K8r7o7J2L1j42m7J43j61
3103a51qJ03J49l26K24J62k93K15j44q1J29K2m2M2L2K8m0q4K08J62m08M81n58
3126a78k8k4M9N8K05m47L71K27p58M88J82j55K34k70P0M3n76O74rl68K87J32l73
3149a66K12o8k84L84j60J80L6l9l92K57L8J32j91k51N22J17l94L39n01J49L29
3170B49l12J31j79k4K14j69j4K08j70l1L13m22R2J51l92M06L33n32M54P6l53K92
3192C21Nn32M23l35J83J98n64L19j64j79L45J17j21J91J54k32p2k62J30O29o76
3213a22J5R5l58K18l6n1N05k44k34N14m76Q5L28k09m1K9k80K38J29k12L58q1M1
3236B11k2j13j24J87k05J55M0m27M71j51l08J70J25m60N74m4k56M17p9j46Q4l78
$$ y = [-47, -198, 144, 47, 103, 157, -158, 48, -437, -401, 137, 100, -227, 37, -181, 149, 177, 80, 13, 25, 56, -86, -133, 10, -151, -159, -56, 93, -233, -9, 153, -140, 75, -69, -150, -21, 1, -41, 1, 33, 61, 21, -63, 145, 307, -101, 380, -178, -206, -230, -181, -123, 82, -365, 6, 233, -525, -37, 145, -10, 224, -46, 24, 67, -509, 165, 156, -212, 75, 207, -166, 46, -22, -306, 78, -82, 98, 134, 95, -297, -40, -2, 130, -61, -312, 210, 327, -67, 272, -229, -80, 249, -63, 68, -111, -135, 79, -90, -104, 104, -66, -97, 216, -206, -114, 37, -355, 51, 384, -148, 306, 382, 29, 321, 326, -206, 217, -118, 65, 263, -301, 18, -146, -325, 20, 137, 16, 207, 361, 129, 57, -205, -75, 554, -122, -107, -12, -370, -152, -188, -239, 266, 22, -212, 302, -174, -89, 239, 30, -11, 18, -262, -24, 105, -107, 251, 170, 211, 189, 76, -48, 139, -66, 89, 129, -298, 173, 22, -286, -116, 9, -451, 123, 79, -177, 240, 161, 15, 99, -279]
3258b79N54l23j74M92n33M2K33k01K58o2l76P15k50k63L82k98k48O29l25K21%
3279A94k15J03J18j51j2k2l65K70j61k14N76j62M2J14j32K55p5k4K31l59p7n5
3301a21Jj64L63O8l32j26L09K0O1m38N79l80K74k45K3J34r1M1k3J27N2rn7l17
3325b51N66l73k18L11J46O5j15m56J54j7J66K46k48o2J66k06q0M92j31j21N6j1
3347G9P9k05m2L12l86K95J60n28L0L70q1k1k0o6J81K8k43J34J24j34M75p21M37
3370B57n7l97K85j81j54J69J06r3M8k40J1M28j10r2k1L00j47k09J1M67l41o2N3
3393C1k44O01k64k45L19j8L8l29M6l3l34L71k52L41j00K30J39n00M52J56m17J5
3415Cj46K10J49l74J09O40p10J77k03p1K25k20j69N56j84j42L13k8j68Q3j62J48
$$ y = [-279, 275, -48, -222, 270, -263, -221, 12, -189, 69, 7, -369, 346, 96, -167, 215, -83, -331, 298, -27, 194, 194, -21, 82, 200, 49, 37, 15, -350, -80, -241, -455, 121, -41, 1, 115, -17, 238, 163, 139, 370, 11, -66, -121, -120, -284, 79, 147, -185, -311, -2, 18, 79, -359, 220, -160, 114, -131, -108, 26, -65, -24, -47, 80, 132, 123, 66, -251, 315, -58, -276, 35, 181, 246, 131, -325, -171, -188, -22, 224, -24, -86, 80, -126, -206, 286, 155, 34, 90, 79, 158, -47, -89, 223, -163, 132, 292, -236, -206, 164, 83, 62, 42, -24, 157, 185, -58, 76, 200, 66, 541, -180, 257, 200, -197, 88, -93, -247, -78, 28, -65, -17, -257, -246, 182, 72, -20, -41, 259, 112, -97, -86, 381, 40, -22, 31, -213, 388, 124, -121, 198, 180, 218, -111, -65, -98, -432, -61, -313, 28, -72, 158, 297, -203, 249, 405, -12, 3, -143, 67, 216, -158, -49, 591, -119, 58, -145, -216, 9, -211, -380, 176, -8, -150, 163, 135, -33, 50, -112, 36]
3437C6R2j57n6K13k13k44J23J68L70m63l8L22l41J79L3k76L71K38k47O4l14j62
3459c02N34o75L92M24l35j98J91k63M62l82j40L36On6J70l27K63N9n43N83m3j27
3481B9q7NJ67j29M1j97J18q7J44K91l66L59l55m4K99k91PJ69O0j16J68l05L6J47
3505F3lJ1o1N3P3l00n2L04k14J35L03n20K20Qq8Q5L76m12K72m47K80N8k4k7r8
3530eq0K18k28j61L34k29J3J32k8j6K00l80K73l5k31K81J09j35n3m32M17L41n89
3553b84l7N26l03j59j02K92K68j43j82K81j74L70k62j0K64l65j66K29K39k76n9
3574e3m5J65j4j36l1K27j88K11k63JJ64n7k9L24m24J39K07M0K0J3l71J28J38o5
3598A01k80Q0j30K88k0l80M12l1o8J15k97M92r5n76L22n6j5K33j86Q3p1J7J50
$$ y = [36, 128, -29, -85, 128, -85, -329, -206, -38, 332, -131, -169, 153, -188, -9, 24, -252, 119, 357, 110, 174, -140, -302, 232, -443, -51, 373, 38, -160, 31, -232, 230, -152, -292, 44, 50, -6, 164, -163, 100, 159, -384, 199, 156, 29, -58, -53, 114, -15, 26, -171, -53, -140, 4, 295, -71, 288, -67, -111, 188, -103, -96, 73, 133, 17, 185, -120, -84, 63, 60, 71, 10, 63, 136, -164, -216, 88, -126, 9, 312, -208, 12, 20, -68, 17, 393, -19, 253, -194, 86, 144, 120, 93, -5, -85, 133, -95, -256, 78, -151, -138, -6, -34, -50, 150, -230, 43, 8, -223, 58, 167, 32, -21, -453, -36, 305, -284, -321, 205, -98, -257, -359, -67, 201, 58, -124, 157, -17, 353, 91, 81, 345, -20, -186, 43, 282, 6, -53, -98, 67, 53, -83, -114, 113, -75, 136, -127, -126, 38, -19, -48, 276, -148, -9, 198, 238, 258, 271, -100, 28, 166, 101, -179, -99, -229, 59, 39, -341, 71, 40, -28, 87, -210, 282, 187, -389, -67, -123, -138, 95, -91, -8, -79, -62, 88]
3621H8n9j39Q4J18k16Q7k7N2K40l49O6K26l07N39m84k03O92k60k87J10J85M3l07
3644a08P4j33K89l80J23Q7k81M74l38Q4K71j51l3J51j61P2K0k94L38j37J20o3
3666B4J20j54K07m86R2M94n51K12L45l26Nj94K49L3J03j99L39l75J0o8J2N7P5
3689B4j32M6J15k30L49l34j31O05j97j95K72j17k8K8m0K50k30k54L32j86l21O87
3711C13m10Q2M3j88K93J50o16O43j50k74O2K4N4P4l47L32K24m76J60K25k94mM2
3734c8J37L3j67j08K99l92J2K27m1rK03l2j34m2n0L14k45k5J36N2q0j85M4L31
3758B40k91j40l9L30j47n5j20K82k13l0L26J85m27L75r1m28K98j72K20K1N3m61
3780b84K51o6K3k6J66N9k50J32K55l80J35L66n31J49j30Q3K92j68l95K73j82K73
$$ y = [88, 29, -110, -26, 92, -124, -37, -64, -12, 228, -121, -55, 171, -136, 403, -81, -284, 408, 148, -139, -29, 156, 199, -108, -34, -167, 122, -258, -135, -48, -329, 145, -193, -109, 162, 11, -22, 129, -32, 40, 60, -234, 104, -33, 87, 24, 144, -10, 197, -289, -197, 297, -254, -42, 303, -23, -18, -212, 37, 70, 173, -26, 313, -62, -52, -120, -108, -51, 24, -108, -62, 53, -177, 172, -162, -293, 312, 115, -80, 192, 75, 47, 75, 35, 285, 55, -199, 133, -53, -374, 313, -97, -15, 28, -160, 133, 283, -333, 310, 160, -114, -52, -28, 26, 100, -247, 85, 309, -167, -7, 218, -76, -80, -38, 99, 132, -35, -143, 156, -236, -224, 3, -38, -47, 156, 124, -10, -52, -102, 212, -33, -58, 78, 130, 50, -135, -91, 240, -51, -191, -230, 100, -47, -102, -222, 60, -153, -183, 143, 328, -99, 276, 185, -243, 55, -117, 103, 124, 177, -284, -33, -99, -76, -102, 64, 123, -127, 5, 260, -120, 15, 381, -150, -1, -131, -48, 244, 76, -319, -46, -228, 45]
3802D5L6k56K39jk32p6K05J8OJ13k53N4qK34N4m03K17J44j04K8k46J00J18J09
3826A41j94K71m51J11K75j61M5j00P4m3q6oN4p1L5R2k62N33j88M2J71j59J15m17
3850a79L05l24K56j83Q3J1o2K81j17l8N4K16m46M46l70n6J10K2o5K25k29Q8K04
3873B32l76L12m38J11L06P3j01J8o2j14J7J17j4l0j41K78Pm10J53K20k82L18l10
3896a16m8M68o22K44K68p6L07n12K23j92jJ83r4k6K9P6l72L46p8L0K41k22k41
3919a85J15J95n6K10p7j71J27k17K15k7l32N92n97J18J77k77J68J87k86L13k13
3940b1M6O8J68k63L20m84Q7M70p6j61J96l82J01j98q4L54J22m74K57O2k6J05k02
3963a5J49J61o81L35K47m19L53l77M47k13R4j89L93o4j38p5j52R9P7K18j28m41
$$ y = [45, 81, -175, 64, 63, -169, -245, -40, -22, -16, 97, -156, -102, -110, 124, 178, -225, -8, 136, 32, 60, -186, -86, 32, 141, -53, 218, -233, -122, 153, -8, 37, -63, 11, -32, -118, -124, -70, -141, -106, -14, -276, 257, 69, 111, 282, 123, 238, -179, 126, -198, 58, -125, -42, -31, -93, 188, 71, 33, 87, 303, -143, 303, -67, -123, -13, 9, -56, 169, -60, 28, 232, -144, 168, -270, -159, 147, 220, 119, 137, 75, -39, -22, 95, 81, 51, -90, 188, 195, -215, -62, 158, -124, 194, -116, -164, 304, -318, -74, 194, 118, 425, -87, 136, -56, -57, 126, 32, 6, 35, 111, -261, 85, 7, 37, 278, 56, -185, -70, 125, 69, 279, 202, 31, 158, -59, 156, 129, -203, 389, -208, -90, 87, -190, -22, 165, -121, 192, -21, 25, 93, 261, -2, 318, -166, -79, 391, 315, 154, 350, -32, 69, -129, -213, 141, 263, -211, 46, 108, 82, 187, -15, 134, 295, -386, -51, 196, -223, 130, -247, 200, -13, 81, -108, 285, 221, 83, 8, -144, -45, 32, 250, 122, -319]
3985c19L25j58j44O4L47k33M2l7J41P1O6k74K17o3k4k34L99j69K4L2j11L2j58
4008a64J15r5K06j25L05m5l13LK70J28j03m37J90J73m9j41R0J96j47L7j92j13
4030b11L29j98j23J80k01J8K17J19k88K08j59n1K14k40J97j41J45J70l1m38K47
4051c7l6K00l84L69r9N7j5o1L20k27J94j84j18J33K12l92K28k58L01q5n03L17
4073f8K5o6L02j72L7j4J1L4k69Q5J67J85n16K40J23l81K92j29P8m2j62M50j84
4096B6p5K75l94P4L23k46J38Nk20K91j77j66J50M5k80L96Q3l81J91K2J83j46j80
4119f3j4n8k1K94m5K2J77k62k75L18j07o3L63m44K14j68Q1M7Q6Q9O3n51J32M05
4143B20k53J14J6r4J18J21j02j43M7q8J81l82J42K14m9k11K32n61L86q3K56j55
$$ y = [-319, 6, -152, -296, -232, 115, -118, -76, -113, 28, 99, 165, -109, 108, 45, 21, -213, 186, 17, 41, 73, -38, -6, -164, -49, -144, 62, -63, 242, 197, -116, -113, 157, 285, 182, -255, -65, 108, 59, -82, 8, 204, 57, 94, -98, -211, 118, -80, -203, -23, -224, -206, 11, 130, -158, 50, -109, -160, 54, -186, 11, -130, 15, 185, 154, -284, -37, -73, 127, -257, 112, 13, 70, 55, -6, 314, 87, 281, 97, -21, 112, 324, -68, 160, -98, 203, 118, -385, -68, -43, -109, 193, 21, 58, 44, 55, 89, -180, -95, 72, 257, -259, -19, 104, -277, 15, -114, -36, -78, -240, 210, 26, -49, 226, -168, -94, 229, -17, 121, 126, -94, 197, 20, -146, 4, 49, -231, 165, 248, -133, 58, 80, 263, 117, -63, -77, -135, -156, 138, 93, 115, 292, 30, -245, 73, -34, -97, 266, -178, 36, -132, -51, -4, 82, 171, 234, -317, -185, 220, -33, 81, 97, 3, 121, 242, 140, -3, 44, -44, 137, -245, -103, 111, 62, -149, 83, -478, -92, -175, 81, -74]
4165g4R0l8N3k26J13l1J36m3N5K4R4n3k46K47n4Q3l9p9l37O18n95J65M61n75K31
4190b0L27k59J75n17M45j74l2q3N26n53J69K12r0k80L54k97L92j82m47mJ81J97
4212D0J73j00j19L14j91rj88j68L88q1q8L45m73R7j05K56n8J2R8m21M97j01k0
4235I8p7j54L97n01J85L09l79P3J90k67L43o1k18J44O5K3j00p7L5K23k12J63K
4258B04m03L98k33RK06j82l37L59J17K45k43j80n0N5J12j17R5q8m9J74j68L03
4280B27n48M93n7r4j75P2N5j42L30l44M4r5K41j51J08J24Lq4j02K57l16p1J51
4303g4J24r6P9K22j6m66J81p8K6K57p3q1K18j62j38p2n3K65L2L9m0r3n0K40k69
4328g8Q0Q7p3o8R8Q8J7j10q9M4K6j50nJ74j03M5N9k10L30k71J73l8o8L12l79J50
$$ y = [-74, 16, -22, 31, -195, -82, -113, 23, -20, 35, 59, 153, 100, -146, 101, 47, 130, 91, 12, -325, 293, -302, -137, 324, -251, -20, 307, 48, 223, -294, 151, -23, -55, -138, 388, -165, 4, 216, 126, -154, 200, -97, 295, 113, -334, -338, -157, 40, 213, 113, -6, 308, 117, 108, -80, -248, 140, 59, -29, 316, -157, -60, -165, 91, 33, 45, 143, -278, 219, 118, 98, 21, -133, 264, -237, -52, 257, -122, -49, 141, -126, 217, 156, -62, 82, 147, 170, 70, -7, 28, 251, 39, 202, 204, -199, 199, -34, -25, 181, -1, -338, 21, 138, 383, 140, -40, -90, -35, 77, -40, 55, -33, -82, 92, -76, 227, -321, 172, 115, 21, -154, -82, -27, -169, 161, -183, -139, -234, 7, -144, -36, 88, 91, 7, -95, 162, -154, -225, -74, 50, -46, 33, 255, 239, -227, -46, -124, -98, 159, 86, 5, 223, 61, -77, -149, -202, 63, 95, 134, 94, 1, -49, 191, -78, 2, 89, 16, -52, 46, 134, 151, 41, -48, -4, 22, -128, -133, 41, -62, -17, 42, -168, 162, -109, 64, 26, -42, 270, -109, 41]
4354D1J88r9j24K14k71J09J18j61n0N1l10K08p0J20K15j24J27R8k94J13q8J63
4376A74j84j52M07J46m67J52K22k61Q9n9Ol06J78j93P9J59l40M21j67N2L98l91
4398c7L5m2J10m3pl8k55Q7J05q1j47K16k5J51R3Q9k93K04O3l44J76JR6J38j83
4423F9K35l79O8J3m28M39K06J4k76j5LM7K88n32J35K35k41L54l88K72N2j38q5
4446e2J94j48l9O9p3K12k95J48K6r8M8L63o65K45J51M3q7J47k43L4P1q0j60K77
4470H8P2k61k9L62k1j67j98J69n7J61j22L22j85J34k92J66k91J91Q7m75L94n5
4492gQ0l21L75n21K69L88j72l14J84j4K04pj01J9n0k69K91k15M24m20k9L39k20
4515h7K27j45O5R6k10J6P8M8j66k69K25Q9NJ07R2k83N6m5j04K42j59O5j82L13
$$ y = [41, 229, 130, 6, 220, -51, 58, 176, 15, -35, 16, -294, -86, -156, -36, 179, 55, 182, 280, -14, 99, 11, 174, -10, -162, 245, 391, -76, 76, 298, 37, 126, 67, 73, -233, -55, -248, -169, -10, -350, 71, -96, -44, 354, -37, -2, -44, 66, 23, 16, -22, -277, -190, -85, -166, -313, -97, -122, 29, 122, 211, -82, 122, 185, -159, 17, 18, 114, 252, 69, 304, -75, -7, 6, -422, 17, 223, 237, -39, -54, -51, -4, 284, -248, -113, 122, -119, 235, -153, 119, 171, 33, -52, 142, -6, -45, 24, -49, 163, -132, 16, 42, -56, -8, 355, -310, -65, 86, 129, 42, 189, -54, -20, 51, -29, -189, 88, 160, -101, -130, 232, 211, 44, -154, 15, -42, 119, -3, 319, 134, 268, -24, 142, -149, 42, 129, -346, 48, -7, 73, -248, 127, -394, -125, 263, 91, -223, -39, -53, 151, 144, 43, 62, 12, -257, 34, -181, 243, -177, -206, 133, -87, 140, -5, 60, 156, -54, -38, 40, 88, -78, -347, -122, -33, -28, 79, 171, -112, -56, -101, -205, 37, -122, -57, -239, 74]
4539G4j66K21k7p5l7j74o2J20L20j40M1l32J90L99n50L30j03P6J37l68J49j97
4561a74M04k38M3n6j37kJ12JK68j55o6m3K17k61L0L6L5k7O0J77k34k7j62J09L11
4586B21j53M0J99n51K94K69m25m3K15r1L21m14J83j58l6K05O1R8pj71kl9M2L6
4610I4j21LL8o3N6q1J07k6L85l51JJ98j69q0Q2k76K13J22k3L7k29j44l9P7L37
4635A48NM3j85L16k43j76j7J67Rk21L76m69K39q2J89k02J68K38k33q2J33l76J01
4658a54K89l11j50M19k77P9J50K8N9l10j55N31j07j14L0J75n1k86R5j57J99n5
4680g3K15j28q6M6L4j45N62n43Q9K99j11N3p9j90Q8m8p9J13p5J26j36k36M24k99
4704a79K53k68L08k34J49n9O4J25k46J17O3k47L29j94l30M41op8j43j33K44K33
$$ y = [74, -92, 129, 102, 27, -10, -184, -246, -126, 194, 54, 95, -237, -47, 352, -198, 132, 29, 105, 242, -126, 23, -174, 230, -8, 35, -21, -158, -160, -48, -47, 221, 66, 0, -43, 174, -87, -57, -21, 14, -13, 47, 224, -10, -37, -199, -90, 221, 68, 108, 307, -244, 50, 319, -106, -149, 66, -25, 296, -118, 65, -93, -129, 76, 137, 235, 228, 57, 55, 16, 58, 94, -27, -24, 14, -49, 7, -74, 33, 7, 392, 41, 42, 240, 71, -9, 73, -203, 10, 132, 109, 146, -83, -227, -266, -189, 148, 153, 196, 11, 327, 84, -92, -109, 58, 67, -154, 222, -247, -8, -90, 99, -103, 65, 303, 70, -12, 121, -255, -154, 135, -176, -326, 93, -184, -105, 45, 73, 132, -178, -333, 198, 91, -23, 7, 182, 131, -155, -60, -217, -18, -73, 142, 14, -72, -26, 8, -137, 425, -118, -29, 270, 159, 212, 133, -57, 31, -17, -96, 17, -58, 68, -68, -304, 120, -179, 74, -194, 114, -120, 29, -30, 34, 159, -87, 30, 93, -154, 175, -19, -349, 92, 86, 8, -135, -268, -24, 209]
4726B09m54J19J07n8J4K7NLk22M67j03j36P8J12j49P8l15L56P4j42n0p2q4k3J51
4751hk83N28j96LO5k08J5J4J43l00M47j81N7k40nJ70j44L28n33L63j11J44Ql24
4775b48K99j0J35l33K0JK62j9%j23K4n5r2R4K35l20Q3k51R6K55p7j18M16r8j49
4800B7J15l5j69J18j59L06j57J94m78L59l19L3L25j68J83k45L24l00K06l20m9
4821b09J14J70j41K00j71lK8j35n9R5N8J02j51j08j81N34q7lp2R1K31j10j13j46
4845f6j23P5J65M1P2N8j57j74M59n48K45r9r5K9K85o9L0Pj21n0j41K32j34j68
4869b47J89k6j94M45k04rK04j04j75J55k11L15m0N6Kj01j96K76l9k5j9nK85m22
4893i0k52N68p2K9j68K3J60l35q0L26J06k63o5L3N1O1P8k62n7K00J62j67J91J35
$$ y = [209, -245, -126, -19, -77, -63, -36, -31, -28, -250, 217, 114, -22, 56, 168, 19, 97, -218, 138, 212, 70, 20, -52, -136, -159, -8, -291, 237, 41, 44, 109, -99, -84, -70, 73, -227, 220, 39, 96, -144, -149, 21, -123, 205, -328, 35, -76, 68, 76, -248, 51, 41, 176, -157, -137, -136, 126, 107, 107, -16, 8, -47, -139, -45, 190, -130, -47, -298, -202, 53, -24, -142, 274, 176, 27, 142, 107, -62, 56, -103, 203, 46, 240, -238, 121, -198, -165, 160, -8, 175, -70, 254, -46, 160, -160, -209, -95, 75, -66, 134, -37, -40, -12, -147, -206, -111, -53, 49, -102, -210, -391, 143, 56, 53, -19, 72, 303, 193, 80, -66, -189, -114, 51, 92, 164, 222, 65, -109, 350, -198, 47, -52, -147, -118, 167, 98, 128, 135, 14, -36, -177, 55, -79, -247, -58, -84, -278, 167, -37, -46, 158, 54, -121, 34, -177, 138, 98, 154, 156, 55, -141, 135, 96, 71, 52, 47, 332, -90, -342, 226, 154, 183, 15, 38, 198, -137, -217, 109, 215, -48, -113, -80, -29, 32, 110, -152, -209, -9, 153, -14, 177, 312]
4917C12k43j13K3p6P5k02N1K43J4o1R4J1q7l32J82QK28l55K9P9L1Q6M3N3k03M92
4943C82n92K36R8k86J77L6o4Q4Ql62L89j4Q9j89k95N14k55L05k16m40M27j65J54
4966B1l6P8M1j04M0j41K40Ok55nK59j67K03k28n2K95r1j98j40k7J74L51n20J18
4990a38J68j99J45O3O9k95K69J8j22j46P8l0R6L46j44j2j36j45J65o1n7RK2n0
5014h7N8N8J64j38q0n2J11J44j23J3k47N38l07k22M07j40n8j13k50M22j11K21
5036B08l10K75j72j73L87n4p5Q6j65K56l20J87M9k49O2l0q0K74l71J27J64j87
5058a11M81m76M7K28k46J42n7N2k07K82k87l6J09j45j21L35j81M59j20m36L85
5079I7J26q4k86L40j93q4l8N0K43j17n6j12J14p7j41Q4J78R0l6O7j94l3K64k85
$$ y = [312, 69, -44, -21, -97, -22, -224, -173, 70, 84, 23, 117, 128, 41, -291, -109, -101, 127, -228, -199, -120, -89, -3, 40, 93, -110, 382, -210, 26, 124, -162, 15, 51, -13, 71, 79, -283, 106, 92, 181, -8, -303, 211, -44, 261, 45, -395, 32, -133, 21, -15, 63, 104, 0, 40, -101, 139, 145, -110, -115, 144, -23, 180, -48, -100, 195, 104, -94, -234, -261, -87, 264, -256, -138, 30, -169, -24, 39, 108, -187, 82, 100, -22, -168, -90, -120, -24, 322, 178, 166, 30, -115, 50, -11, -68, -59, -37, -87, -29, 29, 193, 55, -25, -77, 34, 178, 55, 68, -179, 359, 52, -170, 237, 97, 39, -74, -324, 98, -13, 208, -102, 173, 1, -172, 215, 161, 86, 172, 7, 263, -57, 130, 179, -70, -8, -38, -118, 156, -215, -88, 76, -111, 370, -106, -59, 169, -77, 65, 8, 60, -147, 135, -152, -188, -79, -224, -345, -10, -191, 268, 148, -288, 97, 223, 139, -147, 193, 0, -84, -122, -72, 171, 54, -2, -114, 0, -77, -218, -134, 44, 134, 98, 165, -29, -62, 202, -83]
5103h3L8Q0j37j55L70p0R0l04K58R4m3k45Q5j40L04j75L4k04K46o5m9O1J44j48
5127a4k86K49p8J55l64M31kJ50j79j51K63K4k93M83o94M40l14L22L4j67j81J97
5149B5j33K41l1k15J00o7L32j71k57O8J09J67m00J88J70k56M9L2J33k57k42M32
5171A7j9p4L44L1k13K6l06K00J28l04K43l47J15LJ01J06kJ34k2o86M60J11k64
5194b18J63J26j38K7l08N35l14J42o9q8K22nk78K15J56k96N1P2RL13m82J36K23
5217A94j99p5J53p1J01j29J01j35lK34l34K78J04m26K71K2k08K02k32K31k20L36
5239A95k50K6k6J34r1nj16L69j70M7j17j9j05L58j05j61R5j12Q9j63n2K18j4j81
5263a56L19k72j06P8J00q9L06j42k71M08p4j9r9P1j22L36l43k01N27k1k98J11
$$ y = [-83, -45, 35, -102, -257, 113, 43, 133, -171, 87, 181, 138, -107, -22, -162, 142, -33, 1, -203, 43, -22, -71, -10, 134, -14, -300, -51, -129, 26, -338, 93, 91, 241, 62, -89, 174, 198, -95, 388, -306, 134, -180, 142, 176, 9, -172, 25, -108, 133, 102, -113, -13, -80, 252, 81, -176, -108, 1, 168, -232, -44, 126, -130, -81, -49, 84, -173, -415, 17, -2, -76, 268, 299, 86, 112, -194, 6, 134, -170, 73, -274, -159, -156, -55, 51, 49, 183, 161, -525, -65, 46, -218, -55, 71, -67, -40, -348, 187, -127, 15, -54, -142, 80, 75, -203, 12, 168, -128, -77, -5, 4, 317, -165, -29, 194, -5, -80, 73, 2, 103, -26, 75, -60, -63, 171, -163, 115, 219, -207, 64, 86, -122, 80, -152, 79, -141, 195, -55, -29, -55, 79, -12, -17, -133, 236, 66, 113, -4, -23, -128, 230, 125, -36, 59, -53, 36, -127, -179, 39, 25, -156, 163, -109, -215, -137, -37, -126, 180, 38, -233, 175, 101, 82, -17, 54, -68, 268, -75, -276, 251, 230, -68, 43]
5285D3j73N5K15j14k10L27K45n53K02k40K36L8k26k53N20p1j9R2K7M8j30q5j81
5308b07J77J8J3j52K31l58K87j49K58j77K49r7j06K1J31j48J41l18K28P9l49K65
5330C7n77L76m7J79J22R7l93J80n0l10M96j37L21l60mJ0J02m4k8J49m81M18lj15
5354f2j70M11l83M97k30p0J94m28J88L30l22L96n05o7K50j11K8k5J45k06K77j42
5376eO1j75J42j76O9L92l99j16J24J67k82M7L31l54L08k74q0K08m6J85O2j52J09
5399A46Nk73K12Ln4J4J82l58j9M03k97J99j48K24k19k55L4L62l36L50P9l23J39
5422G0j56Q7o3P8l74O21m29j23M33k99O74m11k74L72m30J75J07n7pk2M10l00Q5
5445A67j27o2L9r6J2J23P6j16Q5k8J07j00n7m2m7k69K92J3P1l37j56N41k60P6
$$ y = [43, -130, -75, 140, 26, -184, 143, 388, -165, 37, -203, 33, 71, -155, -408, 112, 41, 22, 114, 141, 189, 59, -26, -207, -30, -12, 1, -151, 80, -278, 9, -140, 118, -59, 190, 93, -13, 8, 139, -9, 132, -186, 42, 121, -228, 37, -540, -164, -211, -32, 90, 187, -206, -26, -76, -386, 110, -27, 294, -66, -70, -60, 42, -2, -30, 119, -362, 56, 53, -62, -232, 179, -204, 293, 63, -7, 187, -241, -53, 277, -45, 351, -154, -221, 29, -82, -54, -79, 66, -140, 137, -5, 56, -119, 23, -153, -84, 308, -91, -207, -83, 84, -198, -151, 180, -174, 134, -140, -220, -12, -58, 127, 189, 37, 146, 151, -122, 90, 93, 39, 53, 235, -123, -142, 261, -36, 163, 15, 239, 20, -235, -201, 161, -175, 175, 254, -69, 70, -86, 1, -62, 16, -358, 263, -166, -289, 144, -155, 519, 108, -166, 206, -224, -49, 58, 1, -6, -28, 382, 82, 167, 40, -22, 17, -79, -67, 56, 132, 16, 101, 73, 180, 80, 23, -19, -66, -335, -43, -30, 41, -296, -452, 89, -171, -95]
5469i5j08j7L74r2j09n3R6j9J56JN7j50l0N1J25l20Q4qj39L13k39K02K08j92j71
5494g5K85k68k38L58k76R6J01j21L4J41n4j09K59l08M2k20M00k36p8K59q4P6J05
5517H9K5j01o6K34j35r0K94j09j6j09J94r6p7L2j70Kl6K66J49m26J36J21k49J08
5541c0N0k80J74R3o1j44L99j12l72J40o5L49Kl20M00m45K03J81j28K0J31j66j19
5564a00K4J85j92K02J48l3k87O2J35J86q3k2j89L9L22l10J96j87k1k47J95J95
5586B18j76j9K2J27l23L41j6J0l0j52J65R8l82k41J91R2K05k41L17j87m3J36J84
5609B96k66n2K14m32J2K00P0J34k72J71l33M39k01O7l05KJ86j98J97j36L4K27
5631E4l8j64N29k83k03M8j64L22k8k06L61l66p1L9J23j13J04L12l78J0l6l0K96
$$ y = [-95, -203, -220, 154, 62, -47, -100, -4, -23, 133, 134, 191, 41, 11, 62, 187, -133, -49, -57, -196, 117, -122, 80, 288, 96, -75, 210, -58, -296, 62, -214, -118, -17, -138, -104, 37, -17, -126, 133, -175, -133, -353, 47, -189, -267, -8, -92, -16, 89, 114, 13, -53, 181, 46, -44, 250, 141, 125, 16, 210, 114, 37, 69, -101, -99, -135, 131, 280, -146, -10, 111, -138, -30, 20, -260, -86, 7, -54, -198, 201, 89, -283, -143, -208, 141, 143, -177, 223, -222, -19, 162, 34, 54, 185, 19, -100, -76, 109, -83, 119, 267, 234, -53, 9, 144, 330, 247, 225, 36, 75, 397, 87, 283, 96, 75, -172, 23, 218, 42, 23, 45, 172, -151, 190, 174, 184, 154, 2, 167, 265, -117, -358, -167, -75, 130, -111, 206, 19, -24, 112, 296, 30, -22, 192, -240, -228, -28, 42, 176, -96, 75, -258, 181, -20, 47, -258, -256, -70, -268, -71, -207, -173, 54, 16, -148, 381, 98, -105, -57, -221, 101, 73, -133, 228, -138, -209, -170, -47, -160, -56, 256, -122, -112, -148, -178, 118]
5654A18J3k29j23J46J54l14J19J65Q1m6j82P3n5j08M3L41l20N2J48p1J14p6K2
5677F5k55L19j55L9K07k95j03J36J08k17j67K77P0j97O7K24k92m3O4J61J96n37
5699c28L27p6K50k26n8J45j89L71j81j0n1k03J45O5J16J52m65K10J3m3P3K13k50
5722@M9P5n8J58j43k01Rn6J68q0L7J13l0j68L86k18LK9k14J45R1l09K24p4K16
5747A52j64l7K72k48J0k79J99r8K03j81L75k49Q9K4k16J00P8J87p5l42O7l8J9
5770a52J97R6n1k94O3L25j28j87J10k32J57J13J27l68K09k60K63L8r4J14j52M1
5792f5Q0l97K96O7k61J60R2J66j45j05J3m2q9p1J77J49k11J60J10J4K08l21pK21
5816A99m04L41j15m5K28l90J73m4Q8Q2L8j53j61J12j99K56Q5J51k74M3pK82l79
$$ y = [118, 131, -98, -221, -75, 79, -235, -116, 49, 130, 84, -98, -25, -80, -188, -145, 196, -124, -72, 76, 5, 119, 43, 65, -190, 129, -26, 13, 220, -75, -178, -42, 66, -151, -318, -41, 29, -168, -101, 123, -169, -212, -148, 13, 209, -328, -1, -77, 173, -53, -111, 34, -155, 216, 35, 25, -26, -229, -84, -19, 97, 249, -216, -6, 7, -36, 37, 250, 0, 49, 124, 66, 224, 81, -120, -111, -167, 1, -79, -42, 71, 41, -127, 259, 41, 44, 73, -141, 4, 95, -214, 10, -64, 152, -12, -49, 223, -25, -15, -294, -95, -193, 10, -171, 204, -45, 44, 68, -148, -48, 30, 217, 142, -200, -133, -171, -152, 45, 141, 90, -204, -141, 184, 56, -131, -21, -253, -96, 17, 144, -224, -15, -275, -12, 26, -68, 46, -106, -65, 15, -382, -86, -19, -280, -120, -28, 138, -7, -112, -99, -141, -230, -301, -124, 25, -186, -26, 84, 98, 306, -15, -22, 199, -205, 136, 21, -24, 204, -186, -13, -57, 31, 113, 151, -2, -163, -51, -250, 6, 91, 242, -32, 11, 4, 286, -93]
5839i3K2K30j64j22J94j98N4J92k87n8J70j1k3m55L20K20m7J81l28J43J71k85
5861a74L62J51l78lL06k57K2j17n2O8j08K13K3J30m21Q6L13k98K1k4K92k15k21
5884b81L56J34m0j29m01L66j02L75k66j25K22o8L7J8j9J45J75k69j39K9R9m52
5906c35M57j13P6on9mJ19k06N5j08J0J96k32K6j27L79j46j34J80j30J95k36J43
5929@L1q7R1k47K72j50N3j51J46J38j57K10l70K12q8M9l6j54J52J80j26k90L18
5952dJ25j82k9k07M77l13K0J9kJ16j04J27j30P3j48L34Q0j54n9n8m2Lj4k4L30
5977B34j6l28J74O5q1Q5J6k72O1P6p7K49n8k57oK36K01m24K55r5k2j14K72k60
6001h6J20j57L52l98K19p3J55p7l24J15J77p2pJ77rq9R0j65J87J81k25j13l0%
$$ y = [-93, -71, 159, -5, -127, 67, -131, -77, 115, -172, -230, -60, -71, -94, -549, -229, -9, -56, 125, -203, -60, 111, -174, 188, 339, -39, -42, 264, 7, 29, -88, -140, -72, -180, 33, 56, 186, -235, -149, 164, -134, -113, -137, 155, -60, -281, 75, 209, 169, 40, -361, 5, -97, 278, 12, -113, 109, 41, 78, 96, 77, 222, 397, 128, -11, 18, 117, -335, 122, 9, 85, 79, 20, 16, 135, -71, -16, -124, -114, 82, -150, -124, -251, 128, -18, -152, 28, -102, 93, -143, 0, 31, -56, 35, -212, 60, -90, -37, -188, -42, 96, -61, 149, -221, -9, -97, -48, -84, -238, -86, 94, -32, -322, -4, 121, -61, -90, -297, 180, -133, -113, -94, -96, 20, -84, 43, -87, -14, -162, 172, 252, 98, 39, -19, -61, -58, -72, -96, 234, 218, -110, 64, 129, 48, 133, 149, -123, -62, 14, -63, 186, 128, -129, -135, 101, 302, -122, 133, 38, 16, -98, 174, -86, 34, -123, 229, -169, 50, -23, 132, 55, -269, -154, 23, -49, -56, 121, 112, 23, 113, -52, 135, 316, 91, -22, -52, -52]
6025e2l2P5l1Q8r7J14J85k80o2j47K06l2P6P2k04K09j41j3P3K32k15n3j79K01
6049gJ04j96K09k55J80n6J23k04K62m20K64R4J74j20j32J66n0m0k15K23n6k11
6071a63K44k99K21N3k55M77n13K05N18m89r0K02j05K72l40L35m48J54j86M38j20
6092A11j64K13l19K87n6m63L28n5L6R9m0j17L41m46P0K56k62K76Q7j99L38j80
6114A41k02k25P8Q8K75k01k31J01n8q5N47Q6l90N5R1j41J26k52K32j9k95K71k59
6137b67J48o5J35J56O5k52J7L6j50J73J52J3j96R9Q8j82l4L24l01J12k46p7K19
6160c3o4K14j81L47l43jK29K4l84L45Km12M7J78Q1J34m9k80K0Q6J50m13L49j37
6184i1KM6J69r4Oj60j6L75k11o8k8J50j90q9l7J39K36j30j12ml14J95q9J39K07
$$ y = [-52, -84, -9, -40, 48, -49, 65, 250, -30, -92, -239, -33, -65, 11, 83, -121, 88, -53, -66, 7, 239, 24, -29, -208, -7, 97, -99, 110, -145, 35, -21, 102, -102, 160, -260, 4, 98, 272, 152, 20, 186, 136, 96, -119, 104, 48, -163, 81, -218, 3, 56, -199, 278, -235, -30, 488, -1, -91, 111, 6, 278, -62, 273, -175, -21, -207, 231, 111, -53, 160, -159, 128, 72, -391, -63, -118, -82, 17, -23, -140, 201, -245, -175, 81, -181, 95, 182, -17, 321, 141, -61, -286, -208, -120, 155, -46, -277, -176, -234, -319, 228, 314, -76, -21, 70, -71, 55, -197, 35, 16, -279, -8, -267, -119, -184, -49, 107, 172, -80, -63, -27, -177, -4, 148, 161, -35, 64, 152, -30, -64, 260, -41, 71, -175, -252, -33, -97, 117, -64, 283, -60, -61, 168, 192, -192, 153, 155, -257, -210, -32, 49, 183, 134, -146, -126, -40, 110, -303, 46, -91, -89, -43, 126, 32, 38, -122, -138, 237, 26, -42, -70, 80, -110, -199, -236, -97, 139, 9, -103, -107, -421, -226, -315, -176, 31]
6209C1k40M48m6m62J87K23j53J16k3j45N4J5j09P6Pn1P2k4J47l66J59RO8J65j07
6234E1j01m6j32O9L1J03q5P0r2j8K89J8R7k05j17J34k97K10j58L11k2Oq4N4L5
6259A21RK4l72L07L4lj44k40L06j44K68k53K95l9r5N7j84NK69q3R0j50kl4K8j52
6285h2j04M46l57J92R7l56L36k94j5J21j23Q0l3J69l49K42L8k5K77j60k02p6K73
6308I5R7N3k13J46j98j3n1l35N00l8j45J48j31r6L33k23L18l23K11j98J44q5J98
6331A94k69k25L53m03K68L60j91j31N55m35j51P1m3P5j23l15M06R6n8M2J4k91
6353b01K40n05M67J43j60k0l7n3K18k60O8O3j81L29q4j94K71l27kK66r6j15K66
6376I6j36L5j09K66m26L3Q9K16J02l78K47J64j84q3R7m56P52m74K7Q1j83K43K46
$$ y = [31, -209, 239, 193, -269, -82, 141, -12, 104, 81, -64, -10, 5, -104, -28, -21, -72, 0, -24, 123, -243, -84, -75, -7, 158, 51, -50, -96, -228, -159, -128, -25, -110, -40, -132, -150, 139, 157, 254, 49, -68, 66, -231, -21, -179, 132, 110, 116, 32, 86, 121, 130, 154, -218, 89, 123, 120, -24, -264, 42, -102, 166, -87, 208, 169, 74, 131, -53, -48, 221, 138, 228, 78, 76, 42, 70, -82, -186, 260, -97, 95, 192, -164, 172, -122, -137, -16, -139, -59, -92, 77, -272, -30, 8, -17, 260, 100, -102, -178, 95, 192, 245, 32, 178, -20, -33, -84, -419, 81, 43, -102, 46, -85, -181, 152, -71, 247, -76, 135, -63, 81, -4, 194, -75, -300, 53, -350, -82, 278, 87, -44, 511, 76, -75, -4, -47, 28, -95, -410, -4, 92, 34, 76, 90, -201, 39, -466, 1, 144, -16, -36, -73, -126, 92, -168, -100, -37, -218, 111, 27, -167, 104, -223, -225, 41, -55, -170, 96, -40, -5, -114, 152, -274, -241, -152, 64, 166, -212, 35, 199, 15, -68, 29, -427, 325, -149, -122, -41, -224, 19, 265]
6399B65p7k57l0k41K99j17J3M7RL84m72K05K12m40Q4j11K06l9M43n95N6K54K4
6422A22k39J08j28n8K34k40K51L0k67K37r8J94j84J53J3k6M7p4J8o0J92k28r2
6445i5m2L11%p8q0K96k24r7j63K00n2M27n35J04kL03j53J99o34M57n3k47K01k59
6469b16P9O3K66l69J30m86M35J19j8Jk19J79K78k81Q2Mq8j5j28J64k21M09k96
6492a28O0m5j5Q9m69N54j92J37N0j28R7k76L04RJ75l98L24O0k27M1K48j55j11
6515DJ34j97MJ61J08j2k58j70J90J23l36L8L15j77j26K24j20k33M21l8j55q7L7
6538a50J45R1o7J76m74M67M2l63RM4L07j31q2m8L6J40k91J08K16l37K43j51o7
6561a37n1K73k59L50J4kl33K07j51L73l48k11L49O6k77j74L19j94L22k08K14k20
$$ y = [265, 188, -69, -99, -340, -41, -158, -145, -98, -89, 295, -177, 28, 240, -200, -116, -227, -21, -60, 383, -212, -156, 98, 122, -117, -9, -137, -195, 39, -201, 50, 80, -187, 50, -48, 146, -38, 115, 128, 102, 149, 75, 93, 33, 225, -3, -95, -137, 174, 174, 96, 16, 312, 88, -9, -172, 28, -24, 403, -132, -28, -30, 273, 120, 319, -315, 142, 89, -158, 43, -216, -137, -74, 192, -177, -47, -533, -98, 21, 3, 4, -215, -36, 242, -39, 43, 47, -41, -56, -184, -20, -241, 168, -128, -68, -113, -128, -39, -508, 46, -146, -9, 41, -87, 10, -266, 38, 47, 222, -176, 148, 208, -19, 22, 270, 115, 4, 138, -59, -55, 106, 214, 202, -56, -226, -36, 87, -249, -211, 104, -73, -199, 25, -95, -328, 93, 55, -100, -187, -150, -5, 86, 19, 195, -279, 188, 230, -133, -124, -80, 227, 96, 14, -34, 2, 142, -149, -41, 175, -162, 81, -70, -137, -188, 85, -174, 176, 190, 188, -145, 62, -89, 284, -64, -275, 74, 140, -137, -311, 8, -186, 136, -72, 142, -78]
6583g8j78O1K68J9k67K58J70j07l29K33j61q8R2P1o8J01l25K64P5J3j01J73o2
6606C4J58l10L53k03r4J40k2r2q0L74j35j36L1p3K3Jo7Q9j19J59R4j2k0J75j59
6631A09k17K69q6J6J44l66J06M2j83L99j81K43k92j16J22q9P7J78j79R8q0j49
6653a35M2P4O1j02N4k7J35m0q1Q5r8K79o5l22R9Rj53J19J14o5L5K67j33j03P6
6678A25j17p4lJ34N6j5q5J04j49J62k74J18Q5k5l20K77Q8J1Q9m02J88J58M0N2
6702B23l95K14%j04J83k34L43k22J48J08J47k68l92k2K72j48K97p6NLk34l6L70
6725A82k20JL5J53N4J2k71nP9p2m7mj1j3J0J04j18R4m8j14K58j53K15l40M3K12
6751C6P1j42j73J21%J49j26K7j35Q4J95p2L1p1r6k4O0L36l09j81L93j87J18j09
$$ y = [-78, -256, -195, 73, 92, -175, 83, 253, 146, -183, 50, -111, -199, -107, -36, -104, -3, -328, -64, 11, 24, -77, 96, 34, 192, -118, 235, 32, -62, 78, 56, -36, -116, 258, 123, -13, 18, -55, -32, -31, -98, -9, -128, 31, 125, 113, 93, 268, 109, -108, 161, 75, 91, 235, -131, -25, 17, -166, 233, 52, 295, 3, -113, 9, -80, -3, 175, -4, 94, 14, -135, -93, -19, 42, -60, -6, -33, 102, 62, -19, 66, -32, 247, 182, -140, -41, -32, -185, -66, 48, -17, 18, 285, 152, 49, 125, 8, -66, -69, 65, 121, 106, 21, 125, -24, 138, -136, -18, 67, 42, -278, -1, 87, 98, 187, -215, -27, 131, 171, 223, -172, 42, 42, -62, 121, -113, 230, 8, 156, 264, 411, 143, -249, -271, 1, -147, 150, 74, 79, 82, -152, -188, 182, -38, -37, -2, 151, 205, 217, -54, -59, 20, -52, -99, -103, -114, -127, -117, -13, -131, -37, -85, -199, 59, -94, 121, -219, -176, 36, 107, -35, -208, -87, -87, 62, -64, -37, -172, -88, 107, 35, 66, -5, -101, -125, -65, 271, -38, -219, 174, -13, 105, -4]
6775dj62L22j71l7K5L3J16q4L8l13J0J16K32J30k82Q7l64L40j16jJ34K29n30L69
6799A17j57K32k40N2m8N7m0k3j13Q1O6L0M3k75J16K18j47J31l8j11J80k99L45
6822A77j57M9J74k88J11r0R9j04M9J0p9J21j70J14k75K21K53k14J97k18j38K59
6844A01R5j60k20J40L6j90J39J08Q0k44M57l49J57l46L31l10K17K55k24j53j1
6865i1j6J97l53J98M1q7M94m18j03J0q2M5K20q0J42k28Q9J2KK1J22k5j50K36n12
6890c16N46l64M5k0R3K58m77N6J92k86M15j46K44n25J96J92j66J16j81K9J53K1
6912G5l87M03n7j42q2Q8O8m6k8N1J95l64N37j88l41N31j94k88J95j59K05j37L6
6935b9O5j03J44k23J5j0K84l41J33J93k31K47L3j74J03j57km6M38m46J28k79Q9
$$ y = [-4, -166, 156, -15, -52, -27, 6, 122, 38, 76, -237, -227, -111, 121, 251, -31, 56, -308, 32, -84, -85, 49, 278, -252, 117, -40, 192, -48, 4, -44, 13, -27, -50, -163, -82, -16, 14, 57, -218, -102, 116, -31, 100, 62, -49, 131, -168, 177, 20, 69, 243, -45, 66, -24, 75, -29, 20, 30, -49, 72, -98, 16, -259, -38, 215, 1, 198, -20, -158, 101, 196, 36, -184, -44, -8, -198, -59, 49, 129, -115, 342, -7, 150, -196, 135, -175, 42, 297, 73, -80, -91, -107, 90, -263, -65, -24, -111, 383, -35, -138, -128, -210, -165, 55, -25, 117, -111, -22, -10, -8, 13, 135, 110, -40, 196, -316, 230, -134, -89, -109, -16, 242, -235, -179, 13, -273, 142, -4, 240, -285, -89, 103, -63, 53, -128, -99, 54, 75, -312, 91, 34, -108, -190, -102, -34, -80, -108, -57, 138, -226, 311, 123, -218, 313, 119, -169, 26, -133, 72, -65, -29, 36, -67, 77, -146, -131, -141, 143, -198, -65, 128, -103, 144, 177, 3, 106, -51, -53, -99, 339, -107, 21, -258, -169]
6958a69K82j33L1J36m1k13K38J2l40K71j39kJ05k70N03o98M17j85L24K9m06R4
6980a54Q8K96j83J10l14K23k37J68K3j83J51k95M66j10q5K66k84L04k53j43qQ7
7002f7J99k19j10L91j58j07N5J34l10K41j94K58k63OK10q1K45Jr1j69r2K03p3
7025IJ59J4qj60M5L25l20o8K00q1k79L81l16L17j21j25L6j26K71k35k01L07L1
7048E5l03L14j66P1R1j86k3K19j72k95M46K02j51j2k94R6K81j90K98j69k25N6
7070e7J66Qj22j1R3q0q3P7j12j52M90L5j12m02L09k84K27j8K9k13J49O6O3J56
7094B22k00J82l23M34l65j46K10j58j26K43J07%l93J93pK21n05M59m73L16J97
7115H8k80L24j38J09k23J15k8J58j90J35j83j6M0J03K2O3m8J41k35K14r1J69j41
$$ y = [-169, 113, -20, 11, 147, 106, -107, 131, 143, -197, 74, -65, -67, 38, -232, 271, -427, -10, -195, 129, 158, -248, -154, -66, 230, 47, 157, -157, 66, -171, -3, 20, -163, -12, -307, 159, 49, -36, 230, -54, 250, -3, -146, -154, -67, 132, -87, -197, 194, 36, -71, -16, 118, -192, 49, -145, 113, -150, -144, 66, -15, 230, 231, 140, -29, -121, 82, 9, 168, 182, 174, 14, 59, 384, 64, -4, 196, 115, -164, 217, -99, 218, 97, -28, 8, -118, 153, -82, -283, 24, 55, -248, 66, -100, -29, 62, -124, -147, 72, -100, -395, 51, 253, 102, 90, -204, -108, 173, -17, 281, 112, -113, -57, 109, 117, -5, -16, 77, -3, -86, -9, -121, -273, 217, 252, 140, -262, 47, -237, -10, -28, 1, -212, -63, 3, 66, 222, 22, 204, -119, 315, -50, -196, 14, -144, -270, -27, 80, 80, -313, -120, -127, 94, -411, 48, -425, -109, 88, -192, 132, -6, 103, -120, -5, -33, 125, -65, 70, -113, -129, -89, 14, 36, 99, 51, 192, -43, 171, 80, 249, 108]
7138A08Nj14J02K3j84O3l5J91j56nr6N8J56j99N8J5J83k41L33j48o8J16n19K63
7162i1j68L09j46J6L10j48k3J70Ol10jJ02K69l47J60j88Qj86J91K60l26J15Q3
7185F5m2p5L22n05M0L25j32k89L49k3Q9k55J38M3J77J23j65J2j66L4k47j43L03
7208b2n1j0j34K51j50Q4j43J42j02K55J37k70Q4j32J00p1K1K19l45J45m7j68L16
7231A09K6J01m06P5K22k29M30m28J40k21J5M45l02j88L67J68k98j42K07m3K81
7252C29k55k00J32q5L38j22k70J45nJ52l83Q7K20j60K52l3k59L40q3k65J35j07
7274i7K11N0j64q4j72K44L9r5J59j72J38L34k33k35nJ41j64L4K26j98j80K43P3
7297I3j91J59R3K71k04q5m2r7K04j18M4n3j49k3o2K26j21L74l22K29k13r4k7p
$$ y = [108, 113, -1, 101, 124, -60, 3, -32, 159, 3, -2, -98, -40, 116, -83, -25, -10, 173, -68, 265, 117, 49, 165, -354, -91, -259, 50, -96, -80, 230, 82, 59, 229, 235, -75, -76, 26, 295, -52, 108, -80, -72, -258, -67, 193, -133, -18, 65, 23, -52, 270, -235, -195, 130, -2, -291, 58, 35, 124, -131, 7, 50, 227, 350, 185, 197, 31, 65, -182, -325, -22, -73, -83, -217, 34, -116, -32, -175, -33, -135, 120, 257, -13, 71, -61, 39, -32, -11, 208, -137, 8, -39, -207, 109, 135, 236, -170, -95, 127, -102, 328, -100, 40, -181, -166, 279, -23, -211, 156, 324, 26, -116, 91, 48, 329, 74, -126, 6, -79, 259, 137, -133, 12, 7, 159, -224, -137, 83, -77, 175, 142, -117, 223, 140, -125, 10, -97, 114, 164, 0, -84, -256, -12, 27, -68, 91, -81, 57, 391, 158, -77, -82, 59, -105, -71, 155, -43, -223, 20, 93, -98, 61, 154, 425, 221, 136, 94, -3, 201, 83, 127, 74, -75, -98, -160, 66, -55, 319, -3, 226, 13, -81, -108, -115]
7321a15J82J17k25J54J89l89J62n8K30k39J7l87K99KJ41R0l14M02n51L19m8j48
7343a70K27j20m2K32k18Q5N1j59J57j77J30J29l2r0k4n7n7O0J02M0J35n14M26
7366A14j43p5K71j79K7j2L01l06J05J5L39m68K39j37mN0j53J12j50J05j66J37
7388B2J3M5k21K51k78K85k51O8J14k07K26n8j06J02k64K26o2n6j75L84k64Q7N6
7411f3k4L29l32Kj97M19J7k79K11k62M08J5k72K63j81J46j19j84L30k19L8j30
7433h4R2q4r8J56J97j7k53p0J49J16j5p7J2j76Q3M3P3J1j38r2qJ85r0K02r6l80
7459c59M06J09J16j89j17O1l6R3l06L07r8j46Q0K58k12J95j56J34j91k08L51M4
7481A36j14J31J42j17k96m4J06r7J85M2o6j82L19J51k22n7k32RO1R6M8j8K35p9
$$ y = [-115, 67, 184, -41, 113, 302, -87, 75, 17, 247, 8, 25, -362, -63, -61, 80, 170, -144, 258, -293, 26, -22, -170, 57, -63, -105, 127, -91, -6, 45, -114, 43, -134, -4, 125, 93, 3, -21, -78, -135, -75, 27, 67, 202, -312, 114, -29, -104, 167, -12, 15, 3, 304, -2, 103, 118, 457, -11, 228, 91, 87, 137, -16, 96, -54, 51, -115, 22, 35, 80, -141, 110, -168, 117, -134, -66, 48, -159, 67, 9, -97, 5, -259, -33, -95, -151, -326, 58, -206, -119, -63, -87, 242, -90, -88, -285, 134, 151, -128, 83, -179, 229, 244, -28, 235, 54, 200, 81, -103, 227, 8, 46, -84, 8, -76, -174, -18, 179, 162, -91, -161, -12, 104, 89, 12, 24, -152, -69, -26, 47, 58, -80, -172, -180, 5, -85, 117, 21, -359, 47, 156, 272, 83, -34, 27, -9, 84, -222, 85, -13, -159, -79, 179, -33, 162, 6, 140, -51, -259, 92, 136, 22, 153, 295, 178, -118, -162, -56, -153, 32, 74, 8, -174, 145, 296, 74, 17, -215, -206, -145, -49, -1, -19, 216, 137]
7505A37Q2k32R6j50q4K41j47J65k11R7m6J88m35M49l68J77o5l7J26J37j06m6J36
7528A04j01J24q7l2Oq4J37j28K07j80q2o9J89NK8J97j42j15n0o3K54J25j54o1
7552B8j77N78l38J74m79Q5o7K21R1l57NM07n78M14j7R3j20J42r4J56l39J91J2
7575C1k59L81K9j19j09l11J56L95j87j26L23j97K2%k7M2J62k65R2k3n8K15j98
7598c1l26K60Mr5L77R4m41j14M99l36J19mP6J37k59K99m7l63J16o1p7K75m4m3
7622A5K4m5J99j30N0k89P7n5J19j13L4N3L2N7o2k02lJ48O4j22j60J70J66l2L24
7647C19j96rj85n0M1l6R1q9Q6K04n4k05o1O5J04K9O2l58J33M8R5K24m1j99J73
7672A91k38J32J18m50K66j9J3j22%R4p1K09rO8M3k64j48L64k14o3K49p5m12K77
$$ y = [137, 219, -13, 83, -67, -151, 90, -57, 108, -103, -6, -52, 136, -299, 150, -218, -41, -106, -143, -17, 120, 14, -32, 104, 3, 127, 40, 8, 14, -70, 67, -61, 146, -34, -116, -185, 4, 9, 37, 234, 92, -23, -73, -136, 118, 243, 89, 28, -149, 429, 91, 265, -214, -129, -196, 25, 116, -241, -236, 171, -407, 7, -10, 83, -37, 105, 11, 167, -172, 19, 31, -228, 153, 182, 63, -46, -357, -201, 194, 7, -119, 204, 7, 29, 29, 2, 44, 206, -59, 33, 10, -48, 167, -31, -357, -97, -93, -188, 189, 283, -158, -272, 227, -109, 10, 6, 82, 219, -40, 259, 212, -151, -35, -96, -173, 102, 58, 15, 39, -6, 193, 63, 113, -176, -99, -154, -35, -148, -114, -61, -29, 28, -34, -236, -239, -91, -27, -149, -309, -139, 27, -5, 319, 123, 114, -71, -121, -80, -116, -25, -114, -28, 176, 122, -83, -144, -79, 25, 54, 116, -242, -109, -61, 34, 258, 217, 18, 191, -47, 85, 203, -247, 19, 0, 13, -109, -109, -15, -86, 123, 114, 182, 225, -39, -187, 177, -37, -100, 149, 74, -338, -61]
7696f1j7o4pN0K09l20J83RQ9J84l55k11L48J25j41K20k28J48k17K28j85Ql4k31
7720b70K50O1p2Q3j27J5j73K05K49j57n2K28m35L60k25K19Kk31L67r6k90M2L6
7743a1J68r0j93ML37k77k31L81J29k59k9R6r1j86J20K22k57K46l15R9K10O6k69
7766a30J58p7j14K84j13Ok45L56k70M7J8j4J4K7k5K44j15o9M6j65K36k88K46R1
7790A48k30K30k48J49l18M38k7l28L91Q2k78k69K11J29l5J66j43p4n9K72j45K2
7812H4p9q1J39j02Pk33L37k7k10J82j15J82m4K93j45j50j38K80j79J11k59J98
7834E1j67N2q9L21k49J18j07j97L83l7J16j02J25j68k63K99j88J79l65K92N3k36
7856a79J28k80L03J20j08J72j95k85L21j40r2L41k14K10k4r7J3K36m53L23j30
$$ y = [-61, -78, -142, -149, -99, 110, -210, -27, -18, 71, 255, -100, -311, 37, 162, 21, 241, 13, 161, -56, 172, -13, -5, -39, -270, -20, 41, -31, 52, -75, -60, -233, -28, 221, 64, 12, 240, -195, 165, -60, 159, 161, -70, 297, 201, -89, -47, -11, 157, 67, -126, -122, 215, -62, -293, 88, 217, -42, -71, 25, -66, -252, -132, 90, -167, 79, -236, -137, 73, 139, -130, 28, -49, -163, 121, 8, 14, -231, 125, -145, -98, -80, -94, -80, -53, -78, 166, 51, -18, 28, -137, 99, -189, 57, 148, -82, 148, -100, 49, -269, 169, 142, -186, 205, 287, 9, -260, -49, 80, 45, 211, 68, -6, -65, 207, 62, 84, 5, -76, 63, -39, -32, -265, 72, 45, -165, 17, -98, 84, 40, 333, 188, 38, -100, 180, 1, 112, -147, 51, -116, -64, -153, 168, -81, 37, -70, -267, 116, 79, 195, 93, 218, 50, -213, 86, -102, 77, -288, 4, 57, -179, -51, -331, -28, 92, -16, 156, -39, -324, -3, -143, -235, 106, -108, 102, 78, -19, -6, 230, -223, 100, -30]
7877c0J80l8k09p8Q7J87j22R4N3k58k36K75J67J09j89J69k7R4m35J15J67k92J30
7900h7q5J89k48R5J76m6n0M5r1J57J76p3l71K3K12j1k14L43l59J87N8L33l09k2
7924B8M8j29lj43N31k30k87L0L9J30J40j50n2K06k82K1J22J23k0K9l48J89r2n9
7948a59K81l11m1L73l79J26L47m30p1O5M2K49j21K06o3p5k14o9O9J91j08m8J18
7971b2lk7O6j72r2L10j54K29l8o1Op7PO0p4K77k81Qk5K94j47L8k3l03M25pk68
7998e4j7j59K30Q7j13m0K34n6P3o6j31M2p1j86K34o4m94N62k48K05j89J23N5O
8022c7o4j77M56l43M18k07J24j78jm7jN0j29KQ7J02p5n1m1JJ40j64P4J68n5j72
8048a20p7p4J62K78k65J3J63L3j23K3j00J43rJ8j3pK8j17J91j34K12k68J03l09
$$ y = [-30, 150, 112, -97, -175, -88, 99, -23, 71, 124, -134, -370, -95, 72, 181, -8, 161, 134, 228, -207, -92, 75, -217, -87, -172, 17, -231, -136, 40, -6, -56, -11, -102, 55, 231, 158, -213, -190, 22, 11, -203, 140, -219, -32, 26, 359, 50, 28, 76, -53, -56, -199, 332, 102, -185, -155, -116, 14, 154, 4, -48, 158, -124, -103, 19, 142, 122, 151, -197, -8, -100, -159, 122, -189, -230, 143, -236, -110, 237, -193, -264, -199, -157, 92, -29, 177, 114, 39, -175, -244, -175, 16, -92, -140, -22, -25, -52, 14, -158, -250, 60, -94, 135, 97, 36, 42, -35, -28, 32, -42, 235, -46, -38, -63, 231, 84, 122, 99, -204, 221, 214, -54, -71, -230, 0, 87, -26, -66, 168, 112, 185, 119, -12, 30, -41, -227, 7, -57, -551, 11, -237, -32, -221, -98, -43, -37, -101, -278, 178, -165, 253, 46, 170, -8, -9, -56, -57, -7, -136, -134, -47, 55, -20, -71, -112, -111, 29, -135, -61, 107, 52, -120, -197, -271, -109, 169, -96, -83, 80, 113, -10, 13, -87, 56, 47, 65, 52, 45, 73, -44, 147, 13, 225, -43, 60, -249]
8072b49K51J63n3j71J93k86J78k15L38k41L21k46K8k5M7P9k06R1o5J83o1J26k62
8095h2r2N7K8J61l75K48J17k73J52n1Q9RQ2J92k15k7k75O38k15k98L12P6j0k90
8119d2q0p5K20l3Q8j35j53l%K88j06j2L10l19J10Q1L7j48p0m8J12L4n5j26J63
8144C8J45O0l21J50r7N7J3n2R1j21K54j13J57j73n1jK10j68K6K16p58K77J81j92
8168a72k9L19j61k9K8l09L47J01J7k9j50R5n1J22p7k73J61J87k0l11K41k36J27
$$ y = [-249, 2, 165, 112, -59, 134, -152, 26, -189, 149, -92, 229, -17, 11, -14, 33, 112, -94, -3, -68, 115, 54, 180, -82, -174, -117, -89, 72, -303, -55, 62, -211, -59, -110, -21, -12, 70, 262, 47, 20, -255, 383, 168, -130, 182, 258, 248, -42, -122, -197, 23, -10, 78, -57, -210, -213, -213, 75, -31, -43, 267, -52, 58, 139, 176, 28, -42, -90, 22, 56, 1, -125, 38, 183, 243, -78, 72, -25, 32, 45, -7, 84, -37, 217, 104, 261, 88, 37, 36, 246, 78, 104, 320, -438, -161, 20, -172, -201, 118, -43, -72, -44, -353, -6, 95, 112, 83, -67, 28, -23, 99, 22, -251, -90, 97, 77, -234, 7, -229, -102]
8191a02
$$ Imaginary data points
##PAGE= N=2
##DATA TABLE= (X++(I..I)), XYDATA
0@%%%%%%%%%%Qj6J6k4L2m0M8n6P2q8J04j21J45j76K08k40K80l27L76m31M94n63
32b99O40p26Q21r27J042j167J306j460J628j812K011k228K466k727L010l319L661
49A920m033M441m894N395n948O565p261Q050q949R987j1203J2649j4401J6574
63H892j9360K3079k8313L6282n0028Q0183k65201J95491M44776m37707k09691
74b21597J59127J62317n3248j3762m4942n6226K5437J64624M368j50294j40602
85a64798M8340K20915P4099k51706r0282J84342Q9566p7933q6273k5844R1725
96A2151N9485k9779k9058o2912n3794J12331J14681j04454j43769J13272J45284
107A33438j41919r2920J63753k3093j46382J35551J06038j77463q3058J29668
$$ y = [0, 0, 0, 0, 0, 0, 0, 0, 0, 0, 0, 8, -8, 8, -16, 16, -24, 24, -32, 40, -48, 56, -65, 80, -96, 112, -128, 152, -175, 201, -230, 264, -299, 341, -385, 436, -491, 551, -616, 690, -770, 858, -954, 1057, -1171, 1295, -1432, 1578, -1741, 1920, -2113, 2328, -2566, 2829, -3119, 3446, -3815, 4235, -4714, 5273, -5930, 6719, -7682, 8892, -10468, 12611, -15702, 20580, -29448, 50735, -214466, -18975, 425801, -11906, -221597, -62470, 99847, 46599, 32837, -12105, -68331, -42894, 121730, 126098, -24196, -164798, -116458, 104457, 178556, -73150, -163432, 20910, 110476, 32543, -53730, -79574, 12151, 71636, 41857, 12799, -50113, -103907, 8424, 123105, 18651, -125118, -11846, 133438, -8481, -101401, 62352, 39259, -107123, 28428, 134466, -42997, -126055, 3613]
117C613P1503o6548n7384L3037M5452q994l7943l583N6068j8915r5395Q3304J31737
130A35952j36534j41276J29029J32680p4266j35745J5987J36218P283j19270l581
141e3523P6031k1269l9673O6166L4597j06712k0022J40606p63j33102J4210P5962
153C2508j0393j6520j3221k2864J6848J5205j1931J2213J2802k9566M80O1847
165D7408j6440r0864L5959R0437n6741n8280O4759J8624o8842j2155O2349K6773
177D2987m7864k5035M7478K0192n2281k2422M7771J0937n0353J8484O0389n4725
189d442p3926O3512P6395l3501n7364N152N4668J9476n7122m5236M2378N0032
201D0022k6380l2392K0697j4460l4884N6110M3373p0494l0295P3201K9489n8123
$$ y = [3613, 75116, 8568, -48816, -15779, 29673, 20679, -17264, -20847, 35221, 16306, -79089, 4215, 135952, -582, -141858, -12829, 119851, 45585, -90160, -74173, 62045, 69328, -49942, -53523, 22508, 1239, -38434, 27732, 62329, -44383, -64405, 76201, 75438, -57664, -43454, 32508, 22115, 5595, -7626, -30490, -13642, 1563, -10368, 1845, 14647, -14919, -14439, 47408, 30968, -59896, -23937, 66500, 9759, -48521, 16238, 34862, -33980, -46135, 16214, 42987, -4877, -29912, 17566, 37758, -14523, -36945, 10826, 21763, -28590, -10106, 50283, -4442, -78368, -14856, 61539, 28038, -29326, -24174, 30494, 49970, -7152, -52388, -10010, 40022, 13642, -18750, 1947, -12513, -47397, 8713, 52086, -18408, -48703, 24498, 53987, -4136]
213d136l9794L3622L7671j1850j1107K048j7556q964K0270K1127j6403l8460K3884
226i648N2531l0120n2246J4554L2563J3854j1808k3785J1499J5053j4881k002
238d436J1690l423j0720Q231K4626k5143m3847M0563L7214m5474j1502L7010j815
251A2974k4576m373K2380Q553k8609L795K9379j4636j6865O745P415Q659j0724
264A17o347K0057q977j5807J3454p39m205j397r617J9296N680l2700J0567K7357
278A6739j4483j1469R546J5043o893k1762K1726J2601l9704N276L2786j7819j4721
291a3134O650P433P584j6216o340K0743k908l430O088j2037M847O040j0485J0402
305E237n64j4565J6225N411j4445n781j569K0542N577l2689Q273K4101k1340o590
$$ y = [-4136, -43930, -10308, 27363, 15513, 4406, 6454, -11102, -20066, 204, 21331, 4928, -33532, -9648, 42883, 12763, -39483, -24929, 7634, 21488, 9680, -14105, -2606, 12447, -2434, -4436, 7254, 3831, -6889, 1342, 25968, 825, -43022, -2459, 34755, -10719, -22221, 14789, 12974, -11602, -15975, 6405, 14958, -13651, -9856, 19523, 4887, -11978, -5233, 2182, 10841, 117, -6230, 13827, 4850, -10957, 2497, 1758, -2447, -3844, -13461, 5835, 11515, -21185, -10618, 16739, 2256, -9213, 333, 15376, 8483, -13279, 8447, 21048, -18656, -13380, 19406, 1587, -13134, -6484, 949, 8533, -7683, -14023, 6720, 3812, 382, 6470, -5567, -720, 5320, -5165, 5237, 4673, -9892, 6333, 11744, -2701, -8482, -10051, 10491, 16068, -16621, -8348, 15753, -5587, -12177]
319a2177J3853j894j351J35Q986J534k3717R135K3696j7716m454J1313q027M338
333C654j545j3437R350N017m242L058o673J616M140r808J1750N463j7760J1522
347B105J2000j6915l973O213P165K207j5534M306J2148j5764L18J1408j0775R59
361d132P741k106j887p896L499J2885p819k258O574q218O151O558j3507K257P973
376E815n201J277K60n011k653l51J2474K04k0306O589J4087p887m04K248n276
391d135N433O223k175o397p417R346J0556p551o265l260l23J0977J77j0507j949
406g267K809Q666M053j3424n585Q983O467N314n106j2874J897J2019N048r908
420A092r254O873N961k297K674r060j3387J4879J7751r211j5820j062J1586P264
$$ y = [-12177, 1676, -218, -1569, -1434, 7552, 9086, -14631, -5496, 18200, 484, -3970, 7343, -684, 3654, 2109, -11328, -1978, 3039, -1203, 1855, -4818, -3202, 938, -8870, 2880, 8343, -9417, 2105, 14105, -2810, -6783, -570, 6595, 8802, -6732, -2426, 9722, -6042, -5724, 5684, -5091, -4132, 3609, 1503, -384, -8280, -4781, 8104, 285, -1973, 4601, -3617, 2534, 9092, -4415, -2158, 5815, 614, 1891, 2151, -2860, -5513, -5864, 6610, 6814, -13492, -6903, 7184, -703, -1107, 1141, -4135, 1298, 7521, 5346, -1051, -8468, 878, 11434, 3883, -2382, -5642, -5965, 5012, 5189, -5318, -7267, -4458, 4208, 8261, -5163, -10748, -1765, 4702, 10016, 4910, -7964, -6067, 5952, 11000, 1092, -8162, -1289, 4672, 2375, 5049, -4011, -17398, -2519, 15232, 6021, -9799, -10861, 725, 7989]
434G989k765p466p478Q947J5621p346j4365L70K890Q530Q246j0493j3329J347
448i302J2471R313j2010j6425N464J7574P282j4339j6742R734J4348K073q79j3748
462e186o558K0150N591j5718l700J091J002Q000M383j0618j7231Q813K4971o090
476H900j8502L695M660P152O320j6092o946J3616K021j61J41p279l245J081Q969
491D330P756j6150j0510J2273J1754K375j9217j4709K4413J2972j6533P63m75
504i58q422J3658Q761j0483r579K83J2912N722q470q487j3110J0649L1289j4610
518I155l1079J1248J6050L726k940j9484J093K2789K240r243q142k749P805K977
532C446M409l73j8937K258J8596l501o680j0050o121K8913Q663l2031m028J8171
$$ y = [7989, 5224, -2242, -9720, -773, 14848, 7502, -6863, -6493, -3603, 4927, 13173, 2680, -10649, -9302, 3169, 12482, 472, -15953, -10489, 7085, 14367, 28, -16714, -6980, 7368, 9441, 8562, -5186, -11744, 8406, 13997, -1721, -5421, -4330, -3328, 4672, 9055, -1563, -18794, -9981, 14990, 8900, -9602, -5907, -1247, 5905, 12225, -3867, -10813, 2803, 4824, 4663, 4804, -2475, -5720, -4639, 4330, 12086, -4064, -14574, -2301, 9453, 11828, -7389, -22098, 2315, 15287, -1246, -483, -958, -9380, 4278, 13039, 2556, -7023, -6740, 6172, 11894, 3424, -5063, -18173, -7524, 23765, 9155, -21924, -10676, 5374, 9100, 6160, -13324, -12231, 10558, 12798, 3555, -4587, -7336, 469, 3446, 7855, 7482, -11455, -9197, 9399, 5898, -782, -10832, -16953, 11960, 20623, -11408, -15436, 2735]
546B735K450l636r13L250k784p158J1996M405j5020k560R37R597J7215k2104k3269
561b4859K2815J2412q563k102o656J553J2441l30p198p372J900J1197J490K183
575H911n347k2141J1901K8059j5453j7506M478M939J3787q22k6019l808K2146
588C125J2043j0387j6040O234J0391m385L228j094r457O652N530l49K285j8531
602a0755p655K9291M882k4286l088J2475M089m612m088J462j325O489P203j1237
616a155k177P265r849L525J6861j2481j2283J0945N457n158m909j221L471L740
630B031K439l312p690K601M054p16N937k679q513P932M366n827Q53m910l236J4736
646H066M218j6772q351J1845O888q197j835M177k871L755O573j1227m244J0525
$$ y = [2735, 5185, 1549, 636, 3886, 1102, -6056, 5940, 10345, -4675, -7235, -6298, 3299, 20514, -1590, -24859, -2044, 10368, 1805, -297, -6953, -5400, 7041, 6711, -487, -7859, -5959, 5238, 6728, 8911, 3564, -18577, -6676, 21383, 5930, -11576, -7098, -2159, 11628, 10806, -15213, -19021, 3125, 15168, 4781, -11259, -5025, 5366, 981, 4209, 3115, -6342, 310, 5840, 5491, 7776, -10755, -18410, 10881, 15763, -8523, -11611, 864, 4953, 341, -3747, -2285, -3610, 2879, 10082, -1155, -3332, 3933, -5916, -2391, 14470, 1989, -10294, 651, 6108, 950, -3959, -5180, -1709, 2031, 4470, 1158, -6532, -3931, 123, -593, 5344, 2665, -5848, 2084, 6450, 623, 1476, -3434, -6670, 8066, 12284, -4488, -12839, -994, 5894, -2303, -4138, 39, -2832, 923, 7496, -3731, -7975, 2550]
660B550J36j81M966o699q261O962P787o397q474O265O538k874k387m588j793P652
676A202J526l394K993l569k985O811M92o575J243O527Q11m096q0j160n123O095
692G18M703q075R21M458o617M79N189m734n22N992R91k610k069J632j602q15P729
709E768j421q091N007J840n314J631j698o00N943k293k797J546l779J248M635
724A625q27k52j130K292L358o252j14M390n085M666M044j1042j31O050m250R99
740a659J397k446K989J056o2k055m468P095L862q208L767J689o176N378o25o011
756d477N519J067q34J742n623J203L613m822K108J138l796L894j197k707L503
771C31l011L185N982p323J315N531p483J912L320p108K464K526l328J04k843K520
$$ y = [2550, 2686, 2505, 7471, 772, -7489, -527, 7260, 863, -7611, -1346, 5192, 2318, -69, -4657, -6450, 1202, 2728, -666, 2327, -1242, -4227, 2584, 3076, -3499, -2256, 4271, 5082, 986, 906, -254, -5377, 718, 5421, -2654, -1733, 2725, -3892, -3413, 1776, -2958, -3480, 2512, 3503, 893, -1176, 456, -1146, -1961, 5768, 4347, -3744, 1263, 3103, -2211, -580, -2278, -2878, 3065, 772, -2025, -479, -4258, -3010, 1625, 798, 546, -584, 1708, 5066, -1186, -1300, 3090, -1995, 2671, 6715, -4327, -4458, 1592, -2658, -1659, -262, -2708, 281, 1337, 1275, -780, -5248, 1847, 5709, -2499, 1268, 2957, -3219, 2159, 1534, -4477, 1042, 2109, 1275, 3017, -2606, -1403, 2210, -2612, -504, 634, -3162, 732, -465, -3172, 331, -2680, 505, 6487, -836, 479, 6010, -1473, 439, 3759, -3349, -885, 1641, -1687, -1583, -4426, -1906]
787a906L698o029M436M070o952M957K118q085M729K327m339L330k795j130L440
802A869m386J199L436n197M297J336o517L823J5k212M062l326J147M363o572K218
818d45N058p405K260N454n500Q92P05j957Q42k477K110K390n760L517L022o553
834c847L457K684n945M942J646m965K625k87q5K339k920J628J443l638K675m0
850A712n654K830N81r68J724m579J891N452m997R58M747m524J593M502l324j980
866c6o00J178J692m175K46R19k878M491N43o129M224L640m097K600P95m483J098
883i72K724j81k613j734M098N22k598J870j117o44K718j132j75L68n485K163O122
900C934n266m045M436K834j074j044P43N26p64K916p70k867J920j730k139N736
$$ y = [-1906, 1792, -4237, 199, 4269, -2683, 2274, 4392, -3693, 1036, 3363, -976, 2354, -441, -1571, 1869, -2517, -1318, 2118, -3079, 1218, 2554, -3963, -140, -125, -2337, 1725, -1601, -454, 3909, -2663, -445, 4613, -2792, -532, 4922, -578, 314, 1019, -938, -96, -2573, -463, 1927, -3833, -316, 2706, -3847, -390, 2294, -3651, 1291, 2937, -2028, 597, 310, 225, 2564, -356, 1272, 2715, -923, 1752, 1712, -3942, -1112, -531, -1499, 225, -4354, -2463, 2989, -2008, -1050, 3697, -827, 766, 5268, 1944, -36, -636, 542, 2234, -1941, -1695, -776, -3654, 837, 1380, -4749, -525, 3115, -982, 1618, 2413, -2070, -972, 1752, 1571, -1042, -2776, 1322, 1844, -754, 1116, -1, -645, 2073, 941, 766, 1134, -4351, -2188, 3934, -1332, -5377, -941, 1893, 819, -225, 518, 1044, 280, 3196, 2426, -441, 1479, -251, -2390, 3346]
916C346k018q199M327O391k956m501J205L120n47M24J308k980M56L395j816L31
932A286O48n123L568M181m292k202R00r68J744K463l183m551L051P327l092o717
948d960M573K380k012M027l410l390N283j338k760N041k363o737L546P898j737
963D041j1359J210J1887k452o600J028K75M112R95p416M083M423p695K942P315
978F789n385n661J974O549O66q131r06L890N07K507n112n207R713N99n879O031
994B944j809m636O640O48l833M40o03K5O92J232K87q355J686J1728n581p151M495
1011a151O1L481J758r492K756Q131o055j561M759o73l883j221P624K549j2435
1026e352j86R856o20k988o020k54J2244l552j1382Q534K923o926L374L656j773
$$ y = [3346, 1328, -6871, -2544, 3847, 891, -3610, -2405, 715, 168, 592, 1900, -1080, -624, 2771, 955, 1286, 1934, -3189, 379, 4560, 268, -1934, -1034, -2002, -258, 2205, -978, -5529, -2478, 4849, 1757, -4960, -387, 1993, -19, 4008, 598, -2792, 2491, 1153, -1607, 3434, 1071, -5666, -2120, 5778, 4041, -7318, -6108, 5779, 3327, -3273, -2245, -1970, 2142, 3137, -4279, -196, 4227, -3468, -526, 6789, 1404, -4257, -2283, 4266, 4932, -3199, -4105, -215, 292, 2799, -2313, -7520, 2193, 2792, -3087, 2944, 1135, -3501, 3139, 3787, -46, 394, -209, -184, 508, 1740, 2027, -6328, -4642, 7086, 1505, -5646, -1151, -1090, 2391, 4149, -5343, -2587, 5544, -511, -2072, 2687, 2014, -1869, -3090, 4534, 7083, -5352, -5538, 4318, 3698, 710, -5310, -5564, 6680, 3128, -8254, 280, 3203, -3723, -349, 3307, 1534]
1041A534l248p1O438r88n966J814n82J252N034q755k729R697l842k575N174m185
1057a998p16N428r35j840j691J684L332m267O73L968o148k04N439j722J69l467
1073b295j863R617j962j0908N300N704m348j709J650K273k236k776O486Q48n575
1088a794J644P70K174J996q802p70J0675m138p192L939K411k111j423K228K654
1103B261m290j92O339j623m009J109J077K751j614m765M031J092n114K751K083
1118A887l769l57K764R26k438k654L739J891l059P71P84K17P96k399J018L755
1134C872m319k509N359m4m890p22M001J636m458k75M972k222k986K606J416k67
1150A170k668o8M274j278n013K694L818j379k602J141K976k331k976K699Q79l362
$$ y = [1534, -1714, -1785, 4653, 3665, -2301, -487, -1069, 183, 5217, -3538, -6267, 3430, -412, -2987, 2187, -1998, -2714, 2714, 1779, -61, -1752, -68, 3264, -1003, -330, 3638, -2510, -2714, 2725, 1003, 1172, -2295, -4158, 5459, 3497, -7411, -2111, 3593, -755, -2464, -814, 1459, -777, -3553, 2933, 3781, -1794, -150, 620, 2794, 4790, -4012, -4782, 5893, 1755, -5437, -1498, 913, -1198, -2621, -393, 2261, -2029, -2221, 4118, 2495, -1514, -405, 672, 3423, 1809, -2956, 1075, 2167, -2947, -196, 1887, -1882, -2239, 525, 1451, -987, -3641, 98, 1989, -1070, -299, 485, 702, 1498, -901, 117, 3872, -447, -2956, 2403, 2359, -2531, -3253, 748, 2384, -2074, -2349, 2623, 401, -2585, 21, 1437, 1170, -1498, -1566, 2708, 1430, -3583, -889, 2929, 1550, -1052, 89, 3065, 734, -2242, 457, 1336, -2026]
1166b026m9J671P29j376l062L325L583l111n67L341J172k385j834K319Q54m754
1182b170J67M314l205k455J254J526J392k381L70M296j854k553K518%j140q94
1198h15K87L184k793l555M635J199l716R06J813N60j098l004L059J070n190K088
1214a370K885j792q63o57K297K218m910J536N108l787j775K359p34L57k144k37
1230a509L987k722k753L510l84j017l7n66L481p03m339M168J565m693K166J978
1246B132n07k32k255J732J325n079J556K988l784J031J98m14K159k768M88N167
1262C737l115j210L562j968m46l20j823L345j543l313L799n77k165J974p24J873
1278A086P84m029L366J566n999K212K365k492P82p61J094J969l754J455L504k943
$$ y = [-2026, -2075, -404, 325, -1051, -4113, -788, 2795, -316, -883, 2458, 3630, 1245, -589, 1730, 2584, -2170, -2003, 2311, -894, -3349, -2095, -569, 823, -1558, -1188, 3108, 1254, -1299, 1219, 1219, 79, -815, -528, 2656, -137, -3692, 943, 2142, -1574, -668, 1145, 1705, 607, -2397, 662, 1732, -3458, -1370, 1515, -277, -1140, -1797, 500, 2718, -2192, -656, 4452, 665, -1110, 1249, 515, 872, -1272, -1509, 2478, -244, -2997, 513, 129, -888, -925, -1491, 1990, 1287, -3052, 1116, 2681, -2012, 154, 2132, 1625, 1393, -862, 870, 2195, -2884, -1328, 1660, -2124, -1093, -895, -1309, 850, -1918, -1430, 3737, 622, -588, 2974, 1006, 560, 240, -1583, 1762, 219, -3094, 705, 128, -2037, -63, -787, 1086, 1870, -2159, 1207, 2773, -3226, -1014, 1351, -1141, -359, -1120, -26, 1943, -1811, -356, 3148, 205]
1294B05M17J038j952J454k205k252M210j855k523L871n70q36J130r83K833N39
1310B521l455K861O02l277Q51l73l76Q29k296K134J204m112J755K672k854J351
1326C7Q04q13J174j383o42K470j738M9J609j170J66o14j085K569j673j777K867
1343H50l44k086J455j453J146J398j977K091R39k837P90N01o53L82j130J594J214
1360A880k951M90J274j626J353O44j809J050k04j474O85n81k56J158N48P72q49
1377A04j27J574j063L9K305k211j042J580j632r83J32p19J161J146p67l77L38
1394e42Q97L22l35J170M1j385J359r60j789J076l68m58K306q71j999P27J412n81
1412B2q83N17J327q15j11J72k082J249K161k519J112K254k732k92J647l71p55
$$ y = [205, 622, 1660, -292, 1162, -1043, -3295, 915, -940, -3463, 408, -162, -998, 132, -851, 1982, 2521, -934, 1927, 2529, -748, 103, -270, -646, 183, -2113, 21, 1225, -2887, -1132, 1540, -1314, 37, 841, 28, 1202, -181, -823, 1647, -91, -42, 1567, 397, 563, -51, -1136, 1433, -240, -2017, 850, 506, -1580, -125, -1578, -432, 966, -1011, 1080, 2019, -818, -28, 473, -180, 202, -928, 666, 1880, -1071, -581, 693, -933, 420, 1064, -745, 305, 101, -1373, -688, -1269, -1525, -367, 181, 953, 104, -23, 1551, 488, 527, 2832, 621, -421, 1159, -473, -1456, -1324, -2043, -882, 264, -503, -880, -542, 355, 677, 342, 1512, 1553, 168, 1527, 567, -1222, -146, -514, -972, 1334, 463, -1536, -809, 603, 22, -861, -344, 983, 168, 57, 229, -1853, -604, 1557, -962, 150, 2404, -328, -620, 1027, 656, -99]
1429i9l93Q16O05j348p05l42j43K685j125j885L500p62k164K358q26j037K540
1446A675j173k68J293j206j387L73J381R64l148J16K926k804l64J771k146J904
1462i3K201l194J304K143l322M74J881J73r49j814J578J443l224j48P62q9K684
1479A810k408k360N159j392l735L807M24j530R81n14L09k53j353R18M86P73M63
1496A585l586R47M394m654j136M015k077q8J593k863R08J753j803R63R68K58n52
1513F25j859K630Q44l820J408J357j833K023k312k543M890n50m036L369J433k131
1529e05l31N87J611q22k035K538J25r62P32k959J579L812m967p42M279j839j666
1546a565J544l61J84P0p58J451n39l46L56r13K404r4l470L143J048l567J731L52
$$ y = [-99, -492, 324, 929, -419, -1124, -1466, -1609, 1076, -49, -1934, 1566, 804, -1360, 998, 172, -865, 1675, 502, 234, 1527, 321, -1066, -693, 688, 1652, -1496, -1380, 1546, -1258, -1622, 149, -1997, -93, 2108, -1086, 218, 2361, -961, -487, 1394, 1567, 618, -1196, 382, 1825, -1399, -1547, -785, -874, 1810, -598, -2958, 2201, 809, -2926, 881, 1305, -225, 756, 242, 551, 298, -1055, -137, 349, 1122, 1585, -2001, -1054, 3340, -1314, -2450, 1565, -512, -600, 993, -1870, -962, 791, -1012, -49, 919, 1177, 625, -1234, 1396, 2240, -1580, -172, 1185, -648, 1375, -937, -3480, 1410, 860, -3176, 193, 1626, -505, -836, -249, 1362, 540, -1495, 1043, 1168, 206, 938, -2021, -442, 3370, -1597, -2339, 1940, 101, -1565, -21, -382, -198, -128, -886, 565, 26, -320, 36, -877, 1527, 1433, -2037, 1106, 2154, -1413, 318, 670]
1564F70k366K285L25k477R65O43o12j94Q8J386q33o13J899p20p91J639j977O93
1582A0K710l327j271L424j050j832Q76O70j46j020J48J534j166J77K82o36K175
1599A558q04k779L116J298l633P56J843r48p91K06J52k2o63M66M38o55K44q86
1617a104Q21J569k035N0K381j707o43J877r53q52J162k1l98k96K0j76j17N18j96
1636a00j102J978j038j086J637K03j793J242J554j386o73R81J011j379p93J412
1652F68l00j053M22l29N17K94j853J451J168j868N1J483j89o69O6P75O83j645
1670c28M21K05o81P76n39m32J655j243j657K375m03j659J356P62p18k86k74J234
1688E64p27n95J616k38n36O94q94K73P31j892R55J479k644M89Q05j190L55L31
$$ y = [670, -1696, 589, 914, -1563, -598, 45, -567, -761, -673, 713, -120, -733, 1166, 446, -345, 1294, -683, 10, 2720, -607, -1878, 1546, 496, -1336, -460, 210, 64, -956, -808, 726, -440, -263, 19, -617, 1558, 754, -2025, 1091, 2389, -1244, -488, 1355, 407, -384, -178, -26, -48, -711, -245, 193, -462, -218, -1104, -283, 1286, -749, -699, 1682, -25, -668, 1209, 256, -596, 566, 545, 147, -149, -129, -305, -422, 96, -100, -1202, 776, -262, -1348, 289, 492, -1301, -59, 1495, 109, -564, 417, 1428, 49, -744, 668, 368, -685, -263, -592, -75, 219, -1634, -183, 985, -883, -832, 651, 462, -207, -141, 634, 1317, -328, 93, 298, -383, 393, -146, -578, 1077, -166, -1823, 552, 149, -1510, -154, 608, -110, -396, -670, 564, -163, -758, 858, 620, 84, 778, -116, 157, 888, -1004, -49, 1430, -1214, -725, 80, -1110, -755, -424]
1706d24M07P28j395N58J238j390L99N21o30J420r06j526K054q24j924K191J11
1723F08q87L65p96R05j24j519J529Q35j541J368p29j69P70j328P38J808k343M75
1741c5R55j580J01K83m47J353o84o97J564j639k18J264n84J037R7j287J464k04
1759G43k311K059N20j481J122l52n88K06j356J242Q10j536R34P09j202M91o82
1776f72J49J955j736M37J580j962k10Q15p74R11l32o65J464r68j701J710o28L26
1794c01N37r22J484n03j947K215L36j700J316K32M6Nj498O63R66j525O97O87j144
1813c56K26n67j82J196j067K4J924r17q50P58m57N90K6l18R20j4j256O95n93n18
1833g36N54j16N82p2j370R52N44j250J028L83m80K94l28k9Q17r19R8Q41n49Kp01
$$ y = [-424, -17, 711, -684, -126, 1112, -278, 121, 642, 12, 1432, 526, -1000, 1054, 230, -1694, 497, 608, -279, 86, -710, 195, 71, -1448, 81, 916, -625, 743, 14, -155, 615, -713, 25, 1833, -510, -35, 920, -660, -559, -276, -723, 630, -54, -751, 813, -826, -1044, 220, -364, 673, 770, -517, 947, 743, -1568, 491, 1011, -470, 652, 300, -288, -82, -1438, -196, 614, -922, 12, 721, -481, 10, -672, -523, 1432, -304, 133, 1713, -249, -459, 356, -418, 493, 161, -504, 960, -8, -1709, 1, -627, -301, 236, -686, 798, 295, -1652, 563, 899, -801, 515, 747, 793, 798, -700, -37, 929, -596, 101, 788, -356, -130, -697, -879, 317, -750, -726, 1198, 281, -569, 189, -268, 322, 348, 30, 950, 936, -320, 375, -218, -736, -182, -298, 284, 212, -1158, -206, 338, -912, 116, 499, 19, 313, -15, -44, 773, -146, -48, 793, 244, 246, -455]
1854d55j03R48q31n94J924n94r02O15R4m46n50K40J191j50p32Q45m51l82L83K26
1874B76O63j40j019N96l62j138O39N15r8j14j82M57l43n25P19N11k04M98k82q9
1894C78L17j142m8J316r53n34N40P2q5q44K51J225n85pQ42q14Pl69m99J350K98
1915G16j133J048o2o69L06k56J46L77k22n1m32o43O92k99l68J515p19L5O09r36
1935c46K92N42p56Q62J73q50J79j07j49P19q99o8J711j441k00N9q05J034J09j072
1955a013J825k68j234J014J47O0p2o67Q95M76j788M51j53o92J034m79n33J645
1973F48r31p64J420n01L86P31r14O97j29j267O53l86J98P06j462J052R51k067
1991i79K74J464j094P26K26r88R61q69q79R21J52O3N98p65J088L1k068J650N17
$$ y = [-455, -558, 390, -441, -1035, 889, 295, -607, 8, 102, -344, -894, -654, 537, 387, -345, 500, 49, -333, 50, 276, 939, 799, -220, 376, 14, -1124, -485, 30, -68, -182, -364, 93, -250, -775, -56, 455, 251, 749, 467, 378, 695, -447, -495, 821, -132, -666, -126, -54, -139, -983, -732, 493, -92, -99, 743, -71, -64, -433, -932, 418, 716, -417, 631, 569, -100, 206, -50, 96, 473, 251, 200, -232, -875, -183, -482, -850, 665, -54, -19, 590, -346, -54, 488, -268, 594, 767, -83, 96, -11, -160, 559, -340, -408, 1303, -138, -338, -279, -1084, -50, 59, -1013, 812, 544, -690, 324, 471, 531, 459, -208, 687, 1163, -625, -174, -327, -1019, 15, -464, -997, 648, -283, -1047, 373, -128, 258, 989, 75, 772, 643, -624, 29, -357, -159, 547, -915, 137, 1088, -979, -705, 759, -335, 391, 617, -371, 590, -279, -1158, -237, -85, -22, 576, -189, 899, 930, -1138, 512, 1029]
2010A029j081J074q71j079R62p84j78R57m36L45L72q32R76l66l74J085m41%P25
2029A083j631K33J230j968K60J198n76k6j2m36P06p07J66J069n69J45J76j127
2047g86J668m23j539K107R7j518L58k3m21M27q64N23J007j094J72Q9L0M07l99
2066a82j41J624j355m00J194j370L65R67p16M2N27l80J20k38j99O50p42M9J61
2085b4p98N94J34j187J526K20r12R16O53j054J00K72J50j86p86N84R1q79k0J3
2105e93M2O71n85K89J141r84k87O13J62L8m77K06J54p07j87N80j5K62k44p71J083
2126C91o42o92R51R3q21P08K15m61J82j76N89m76L2P38k15j83J08k98k14M56r30
2147f45M00J122j271k55N53nJ2l50N53M81j031M36L02l88L27j75j46J143p02q48
$$ y = [1029, -52, 1022, 151, -928, 34, -750, -928, 29, -407, -62, 310, -522, 454, 88, -286, 799, 358, 358, 1083, -548, -315, 915, -1053, -793, 405, -171, -197, -209, -645, 61, -646, -480, 589, 20, 165, 341, -786, 882, 459, -1080, 1027, 1124, -394, -36, -59, -480, -53, -917, -394, 613, -481, -309, -220, -190, 217, -182, -323, 1301, -54, -454, 740, -630, -265, 702, -14, 28, 555, 175, 295, 57, -142, 508, -234, -185, -24, -822, -228, -94, -1281, 245, 465, -447, 469, 1122, 68, 168, 440, 590, 404, -382, 202, 293, -586, -606, -593, -551, 120, -465, -176, 965, -19, -306, 307, 469, 507, 30, 236, 390, -317, -504, 76, 61, 323, 79, -692, 391, -251, -943, 8, 101, -720, -12, 203, -258, -76, -252, 337, -139, -107, 631, 416, 233, 341, 43, -171, 285, -645, -245, 877, -394, -649, -96, -101, -89, -439, 114, 595, -436, 0, 302, -86, 241, 66, -80, 1063, 361, -487]
2167d87J174k30j405Q46J50j38m56k61J106l14o85J129k0j79L49n15j4P98j200
2186c52M94P25j519M04K62l39K08k33O2L81m49P1P35r49L36L66o23J055n64p06
2206f35J395m95j180J440R1n66O2l67P46n31r81J302j22o60K94J37j17Q19j234
2225f02M05J385j448p5R77p07Q5J79k08N76p07l91R38p63o2P75q10M29J59j011
2245h76J324k51r57J239j02n65M34J7j03M02j108O56L48q78M08j01k67M89n79
2264d70L55J036j592K30J145o12j69O28m44M59m32l09J034q41m20R31n73J10K0
2283H6o52O93o5j035J156K80q75O21j08l9M2k67L59O15j163L51K30n80M21k67
2303a97n3P71r53j84J225q87k77P80m39L80k45l64Q93k97n17O31J49j12j65k56
$$ y = [-487, 687, 457, -948, -102, 48, -90, -546, -807, 299, -15, -700, 429, 409, 230, 579, 64, 50, 848, -352, 142, 867, -652, -248, 14, -325, -117, -350, -288, 93, -356, -285, 450, -499, -163, 203, -420, 635, 71, -635, 760, 265, -915, 525, 616, 50, 112, -255, 491, -40, -1021, 281, 159, -501, -207, -70, -187, 632, -602, -197, 1188, -260, -335, 642, -65, 20, 199, -9, 567, -140, -531, 407, -356, -418, 357, -453, -24, 135, -876, 448, 197, -760, 479, 377, -188, 246, 263, 160, 562, -546, 110, 458, -420, -12, -113, -380, 109, -470, -115, 921, -671, -441, 704, 92, -77, 551, 107, 566, 134, -175, 859, 18, -402, 529, -44, 66, 86, -566, 127, 62, -973, 183, 463, -412, 209, 101, 62, 104, -163, 196, 811, -352, -1, 229, -351, 70, -197, -250, 521, -432, -616, 609, -278, -555, 225, -214, 166, -79, -443, 450, 153, -364, 267, 416, 304, 139, -117]
2323a17L74j39q29Q33L15r45N14r4j22L11o90P70N1k65L57J66q17L70j40K67O9
2344B39m53j41R07r48k17Q44m8l79J06k91M55o16J94M69l79K57j2k07N03j75n72
2365d64R11pp18N05k82r3j13k14M60K49l87P0j07J71K57l23K58K27j58R0J63n44
2387d9k62L95k58K38N08m71L63q61P2K11k37M09L8n08N11k60n51J057k62j31N11
2408D63J32j19j08p12N35J59p61M57j47J06m4o31M35O18j027N48P65r28M01J36
2428B78n69P80k28n46N14m86N2M48q78L65N67p83Q42j4q83P31m42j10R64m76k13
2449h7L83m41M0L84j94M55k16q20N81j56j55O93q92K76P45j145L04M38k93QK83
2470A91n88P71l74k77Q17o70L26L25p14O80J16j071P72k10n89N44m86q3O89o22
$$ y = [-117, 257, 118, -711, 122, 437, -508, 6, -88, -210, 101, -589, 181, 232, -33, 324, 490, -327, 43, -97, 170, 239, -214, -355, 552, -396, -613, 231, 183, -196, -90, -381, 74, -542, -348, 121, -258, -1, -13, -220, 283, 108, -464, 447, 440, -278, 227, -55, -148, -261, -475, -15, 234, -153, -83, -190, -19, 238, -85, 173, 400, 242, 332, 495, -49, -311, 84, -174, 64, 572, 101, 464, -397, -325, -114, -351, 58, 96, -412, 99, -161, -712, 345, 83, -48, 463, 595, 476, 368, -344, 191, 350, -411, 46, -101, 5, -39, -670, -235, 383, -644, -96, 669, -259, 142, 278, -291, 489, 261, -285, 229, -257, -205, 243, -635, -270, 297, -486, 356, 342, -541, 190, -252, -362, 602, 126, -87, 296, -145, -105, 279, 85, 540, 324, -496, 85, -71, -226, 467, -425, -149, 596, -549, -245, 193, -100, -92, 191, -397, 374, 0, -277, 540, -130, 196, 521, -193, 487, 603, -468, 304, 94, -495, 49, -437, -520, 169, -453]
2490d53k90Q63k98L60J17j26K92P4j205J131n71j48O64p39J09O21r43j9O75l73
2510b59M42k58J96J43k98j98L76l45J90O11r67O28N1p26N10J82k86K69L0l66L43
2531B68l97j07J55l61N28j15o79R95j50n65Q68l42J38L8k14J39J90o34J26L99
2551B80m21K23l88K13K61p75K89M69m23K45K37j63J40p4m64P44m0n17K15J09M8
2572B08l25k76K05K94n73M91p9l37N92n9k79K99o1j3oj34L80j85l62P6K12QK74
2595C50o94K35L04j75m3L04j72j15m60R5O19j05m30P83k04l88j84K67P23n25m69
2616b84O81l18m53K94l45M76J1j50n4M20n40M21p2n7M54l09P2K56n04N0N2l59
2638b58K04k8p1K44n19K4M98m73L06M27m36Q3J66N0O5m30J9O62r0o32N72o00Q3
$$ y = [-453, -743, 120, -178, 182, 299, 173, 465, 539, -666, 465, -106, -254, 410, -329, -220, 401, -542, -561, 114, -259, 183, -75, 121, 264, -34, -232, 144, -201, -11, 600, -367, 261, 312, -414, 96, 278, -8, 261, 291, -75, 268, -129, -236, -81, -442, 86, -29, -708, 287, 137, -428, 440, 98, 236, 274, 60, 199, 389, -245, -119, 280, -141, 82, -306, -93, 168, -607, -318, 151, -272, -27, 210, 47, 187, 113, -351, 393, 353, -164, 51, 160, 208, -117, -393, -188, 106, -467, 24, -55, -392, 200, 141, -138, 161, 100, 87, 81, -53, 327, 142, -220, -144, 68, 76, 350, -344, -109, 195, 20, -23, 281, 109, -6, -466, -371, 248, 143, -287, 496, 292, -96, -280, -13, 710, 185, -284, 397, 79, -374, -80, -425, 51, 62, -88, -142, 278, -262, 159, 87, 30, 484, 175, 247, 503, -1, 49, 101, -258, -54, -82, -153, 91, -428, -404, 94, -379, -73, 354, -82, 1, 167, 217, 282, -148, -129, 533, 443, -189, 383, -217, -134]
2661a34J64m28P55m47m23K91L15l98J81r9K80M36q33J93Q18q92L85K63m27M20
2681D20m86j04O81q85J19O37o70J36K72n32N42n2n87R55l02m92O76n75PJ90K50
2702B00Q2p5m26M30J0m08O2j51n9L64k73K76N73r88Q8M63Ll8k52K34L46n40j33
2725b12P69q63R7L56m38O37n86l96P98j23p10Q95n32J89L08l30K77L8m37N64J57
2746D58p87N34m3j77Q7l73K81M00q42M16L10n92J29M65m52O20m02KM24l02k45
2767h9J65k81M93m38j64N82m5p70P24L14q59J92q3L00K92n76K53L74o81M55j55
2788CJ98J08m33K7K56k74K0M98n20K6J12m20M95k78j72O17l36j84L10J9j2K86
2810C46o36O46p6m64M52p6n30K78K18k03n8j52NM50n07j8J93j4J85k89K21M26
$$ y = [-134, 30, -398, 357, -90, -513, -222, 93, -305, -124, -223, 57, 493, -340, -147, 671, -221, 164, 427, 0, 420, -66, -170, 511, -374, -255, 382, -288, -152, 120, -412, 130, 78, -509, 446, 144, -348, 328, -247, -240, -50, 200, 282, 207, -219, 211, 221, -187, -125, -276, -335, 29, -244, 32, 605, -383, -295, 168, 171, 133, -119, 115, 461, -79, -212, 557, -306, -209, 147, -291, 346, -240, -636, 162, 39, -671, 224, -308, -119, 189, -141, 136, 174, -263, 301, 458, -329, 205, 162, -15, 72, -301, -20, 380, -462, -46, 264, -328, -199, 266, -186, 434, 32, 34, 458, 156, -89, 76, -205, 288, -150, -314, 268, 223, -547, 177, 491, -368, -176, -259, 41, 333, -243, 10, 384, -297, 158, 3, 201, 309, -124, -97, 159, -115, -95, 403, -117, -91, 21, -399, 96, -182, -354, 263, -73, -257, 53, 72, 60, 346, -290, 356, 280, -184, 268, 192, -338, -60, 158, -45, -103, -255, -250, 200, -307, -325, -132, -146, 39, -250, -29, 397]
2832C97l74m2L73m29J54m9J49j04j44j50K42J12l79K63p5q0k8n3O99n82k61O88
2854C27j87l29J38K52r8K02j77l12J60k13N8K61m5q5j19K03L39o42k43P94k11
2875G3j15j0K9P1j18L6J92j21Q2L5j17m03J68l02O72l85j39M59k46l32M19J25
2897G3O7M2j10J94j46l19K72P3l17M76m94K37kk16j01Q23o58K5o0j24M57k42k6
2920g6N37o75j28Q46n42J9R8k24O19m34k61N51k65k57J3M9n1k6j41M73J5k00K44
2943A84j47m30R06l79j75K21r0k1J73n71J80L62n08L31l11J49K44p2k19N37m37
2964g3J77m1m42N85K1n08O80l08k95L20j74J18j20j25K50O6o70M48J11j69L80
2985B31k22k35Q48n10k68M68n20M13M23o79K54j57j85K32P1l10K97o71L38M17
$$ y = [397, 23, -19, 354, -75, 79, 30, 179, 75, -69, -219, 23, 135, -244, 19, -56, -136, -164, -217, 482, -100, -361, 327, 140, -189, -51, 201, 103, 305, 128, -184, -24, -237, -179, 82, 37, -48, -167, 36, 375, -267, -510, 284, 73, -42, -52, -23, 48, -70, -34, 158, 37, 119, 154, 37, -366, -198, -500, 172, -213, -352, 107, -139, -471, -52, 73, 140, 182, 72, 266, 120, -199, 73, 146, -171, 305, -189, 48, 46, -170, -271, 552, -106, -81, -141, -265, 192, -50, -76, 461, -214, -342, 504, -38, -19, 79, -145, 474, 40, -221, 330, 65, -192, -179, -130, -181, -207, -348, 125, 140, -60, 184, 37, -393, 513, 134, -41, 180, 90, 69, 242, -329, -149, 213, -295, 36, -275, -126, 118, 46, -173, 364, -73, 104, 63, -379, 206, 227, -281, 399, 91, -204, 116, -58, 60, -60, -185, 65, 131, -539, -91, 20, -149, 231, 9, -226, 622, 112, -156, 312, -208, 205, 628, -51, 203, 46, -139, 93, 164, -146, 151, -520, -182, 235]
3005B35n43J82J40j33N45l01k46M23k05k73L20l37L00Qn50N74k36jq6K29m53O39
3027B31n75L46L24o20J00M64l96j44L69k4K1p2q6J43q3J46j30n33O34n3m78P50
3049C34j92m85K93O4q4K28Kl36M08r9J14p4k11L03k52r0J30q9j38J95J09j04J96
3072B22l76R7J01k2J04l52M18J99n7k31l4m6K88l40l87N44k36k00L75N3k57J86
3094D9j95J56J91j88L2n7P2J84k21J5M94l81r0J49l34L02m82K89J06r6m43N84
3116A36l77K64r7q8K32O3l65J93L17m97K57M3k41M11m00j41K28N5J89k24j24M01
3138B35N4n43J15j42K10M21k89k16M20k95k11K89m60Q61n10k81L38p3k3q6R1P7
3160a8k3m02M04j34P6L01j80Qj93l2K59L82n78J56K87j32k45j66K63o7J3k8J14
$$ y = [235, -308, -126, 14, -119, 426, 125, -121, 302, 97, -176, 144, -193, 107, 115, -435, 139, -97, -98, -184, 45, -408, 231, -344, 2, 326, -294, -194, 270, -126, -270, 99, 75, 96, 24, -62, 81, -2, 144, 14, -519, 115, 62, -416, 334, 142, -343, -50, 14, -70, 158, 160, -176, 232, 133, 247, 173, -38, 265, 13, -77, 53, -36, -174, 21, 130, 26, 222, -154, -57, 44, 22, 126, -226, 192, 391, 334, 103, 69, 23, 311, -29, -416, 128, -108, -308, 67, 120, -137, 49, -146, 10, 201, 13, 45, -12, 60, 244, 23, 38, 532, 151, 61, 210, -124, 178, -304, -15, 91, -5, -448, 136, -241, 23, -74, -162, 70, 133, -232, -39, 278, -219, 38, 81, -160, 251, -149, -290, -62, -7, 182, -42, -166, 235, 289, -254, -139, -281, -71, 350, 61, -155, 265, -30, -241, 48, -412, 449, -61, -342, -4, -77, -100, -186, -95, -18, -41, -443, -39, -173, -97, 204, 24, 32, -161, -193, 66, 448, -130, 26, 313, 181, -64, -230, 33, -34, -21, -49, 65]
3183F5l55P7J93j0RP5k95J48K18k57K86l1o5J61n97K20N14r17O76k61m71M95O0
3206f2l75J50k0P1N21j56j00K46j22j45J17j80L37k84k4J50p4l67K78j07m8K50
3228E6k10M40l79j60L01M5j54K21L1l09K63j45j43N18k83k08L67l52J66K8l18
3249b25M1m5K19K78n48J96K18n6M8K64n78L44n8p7M12k79m42K88M5l0nm47O39
3272B02N6n45K82K29j78K11Rk35J72k92N0M17l50J44j9m86M11p1m37J59k4k11
3294e06N59l2P0J09j85J51K53p69O64m57k20O47m06J87J31l80J81J85k67q5M21
3315B51k13l9l69M18j35q2J83m0j31M7J96k07K96j00K6K18Q7l49l4O3Q4k28j36
3338a94p8j0K62k6k86J64L98k85J29m9k13J42K85m70L10J3k71L71k07L2J96l60
$$ y = [65, -290, -213, -20, -30, -21, 54, -241, -93, 125, -132, 154, 123, 58, 219, -378, -158, 356, -561, 115, -146, -617, -122, -62, -437, -287, -307, -236, 285, 129, 29, 275, 153, 8, 125, -55, 282, -2, -26, 124, 50, -317, -39, -146, -194, 56, -154, 286, -93, -253, 48, 93, -61, 160, 191, -118, 145, 0, -143, 375, 92, -116, 251, -101, 65, 93, -225, -184, -229, -10, 268, -280, -84, 134, 78, 126, 390, -188, 156, 98, 21, 433, 154, -288, 0, 45, 15, 10, -437, 202, 258, -287, -5, 224, 46, 257, 266, 31, 203, -89, -39, 378, 28, 172, 153, -333, 78, 7, -430, -271, -295, -506, 53, 21, 91, 200, 15, 166, 419, -350, 314, -143, -363, 284, -122, 65, 196, -184, -3, 182, -85, -170, 251, 38, -1, -370, 48, -87, -169, 14, -26, -157, -110, 86, -121, 175, 75, 101, 319, 406, 57, 23, 86, 170, -58, -194, -272, -282, -20, -46, -332, -168, 230, -55, 74, 25, -188, -46, 239, -231, 79, 92, -179, 192, -15, 17, 213, -147]
3360a47j0M25m72l7J3K90K19k18J91l61J3n9K85O7L6k57j55J60k14J57R0L81l68
3383B9j86k2K15Q5j35L02l1n22K33K12k2J7k97n3J50RJ13J87j25Q5k12k02L39
3406A69l34J02L34k73k72M59l53J51K44r9J16j97j00N4j56L3M70j15j32k95O4
3427a30K32j82J1K19l36K34L04n22j3L32j95K98J23n27L61j25j78M98j86l06N10
3448D22n78J20nO6n2Q1m62N28m0j73O0K76k96M39j32j42j48M9J71l5j36J00q5
3471B8j99L40l26Q9M03o16J16L23l55M52j09k24L43k00p2J30l44K95J29l2N7l5
3493A93l86L4L7J2L11j43m87O71j36j68K63j97J58kk10J33j45l88N62l70J28L86
3515B56k96j94K02J4j32L59k92lk0r4N3L06j41L72k56k74M66m04L5Q7k15N5J46
$$ y = [-147, -157, 268, -204, -241, -228, 62, 281, 63, 254, -107, -94, -153, 132, 199, 235, -22, -177, -17, -231, -74, 16, 397, 29, -157, -179, 36, 121, -14, 288, 257, -265, -32, 180, 158, 175, -122, -175, -25, -16, 97, 284, 159, 244, 32, -170, 169, -165, -63, 271, -2, -274, 185, -168, -17, 227, 128, 244, 47, -53, 1, -155, -122, 348, 233, 101, -194, -130, 102, -80, -69, 150, -186, 48, 352, -170, -183, 149, -46, 252, 375, -152, 209, 84, -94, 404, 218, -88, 422, -156, -36, -41, 25, -27, 54, -408, 120, 80, -93, -33, 243, -53, 386, 254, 112, -36, 13, 184, 149, 13, 113, 28, -171, 169, -157, -68, 335, -281, -165, 158, -197, 255, 146, -78, 265, 65, -7, 123, -221, 74, 203, 171, 228, 193, -193, -159, -122, -110, 201, 58, -429, 242, 106, -62, 201, 4, 162, 160, -50, 83, -62, -450, 112, -258, -130, 256, -40, -234, -32, -18, -150, 209, -83, -86, -106, -200, -147, 159, 18, 390, 134, -140, 326, -78, -43, 44, -171, -116, 30]
3538C0R8O2m75K74k03L02k08K17o5k20M53l72J52Jl1n2k8L57k47o2o2L51n20J02
3562a46J47j00j7J19J13j09j60M5K06l68L45J70l42j03M11m96L94k61P4Q5j33
3583a26J78j81L50k94K94l54q3J87j39L71j08K06k60j39L25q5k87M3J50lJ03j49
3605aK10m34K7L41j83P5j30K90k36K48j66k20M27l59j02M53l02L07k73R3J84o07
3627c58O3K20m4l8J13O3j38J73k50J93J61l17N86p18M97j9k21j78K48l30J61J87
3649E4m25L40k6m9K18l44K13j40J10pj22J62l9K88m25K65m4Q9P8l15J30N6m45
3672c78M7K90k24J63L12m50J54J31l26J99K22l44L40j43O8j21k09J10L27k22K56
3693B02k67K32j98J37j75L22m16L70J66n62J09P7p0K10k3m01N15j91p8R7J26k2
$$ y = [30, 128, 190, -285, -11, -214, 88, -120, 97, 32, -188, 265, -107, 45, 46, 15, -37, -65, 292, 45, -17, -79, 272, -248, -146, 1, -99, -116, 3, 116, 7, -153, -108, 98, -270, 75, 245, -97, -200, 211, -285, 109, -152, -78, 7, -126, 52, -129, 221, -73, 221, -133, -216, -29, -168, 203, 95, 301, 41, -98, 227, 142, -145, -102, 48, 45, 148, -1, 209, -225, -198, 143, -40, 35, -95, 195, -41, 207, 41, -179, 248, -111, -213, 240, -62, 245, -28, 65, 249, -358, -295, -75, -119, -157, -44, 19, -119, 54, -196, -3, 158, -159, 427, -291, 206, 187, -34, -212, 36, -294, -133, 54, -371, -31, -57, -106, 112, -232, -19, -159, -49, -56, -178, -16, -55, 233, -192, 73, 29, 118, 196, -119, 11, 67, -378, -331, -41, -265, -102, 210, -240, -86, 45, -281, -82, 140, -204, 136, -7, 61, -60, -269, -159, 168, -54, 202, -65, 167, -31, 106, -69, 253, -163, 207, 373, -189, -80, -3, -73, 137, 114, -287, 228, 37, -41, 56, 182, 160]
3715A60j34j35o7J96m61N27q6k74M06k25j1J51r8M6K22k87P9K27j64j34J81k93
3737a74L54m31P4o2L8O0J87p4r2M89n25N47k89k54Q3J3J3K16m64J42L92l03J03
3760D3K17l82K59k15K8j85J55j42K64l07K95J30q1N2J02j37j47%J00K22l64K15
3782A22n6k90l8K20j23K08m2r0J93L9j32j78P5O4P2P1l09J63O5j36P4j90J03O
3806a09M5l9j89L85m1k20K93j16j43K01j20L17k07P6O1j02k11J28J70j12J47k08
3828Fl5n0J46j09R3l15K56j12J15L92k75j96r1L99l83L81j49P7q6m6m9j64K74
3851G9Q3k90N1J66k52j95L15J33l48K96p7N6j09O4J00L5m05K41q8N8K1n3K52Q0
3875B13n77O92l97q6M61j78j17J21l26J56N4o5o5L15r0P2k33j58N90o06J82J88
$$ y = [160, 26, -109, -176, 20, -441, 86, 0, -274, 132, -93, -104, 47, -51, -5, 217, -70, 9, 236, 72, -62, 119, -174, 180, -251, -177, -239, -201, -141, 46, -28, -120, 369, -156, 391, 102, -152, -69, -56, -43, 173, -291, -149, 243, -60, 43, 260, -122, 137, -78, -50, -235, -80, -222, 42, -265, 30, 160, 79, 131, 233, 96, -51, -51, 49, 271, -93, 122, 66, -224, -262, -42, -165, 43, 1, -89, 104, 143, 11, -167, -92, -28, 44, 115, -194, -31, 34, -102, -28, -218, -115, -109, -64, -103, -292, 93, 52, -168, 125, 9, -134, 67, -53, 264, 57, 133, 194, 92, -119, 9, 179, 67, 214, 6, -29, -79, 67, -42, 51, -264, -8, -120, -5, 387, 112, -84, -175, 224, -159, 222, 73, 150, 64, 18, -31, -195, 79, 162, -128, -77, 89, -163, -358, -43, 90, -258, 38, -39, 17, -92, -28, 72, 107, -298, -57, -145, -87, -66, -119, 133, 213, -364, 328, -69, -155, 306, 128, 11, 132, -194, -38, 16, -49, -114, 201, 111, 183, -50, -208, 382, -224, -42, 146]
3897A46k12k3J87j65Mr7J06J43r4j17J25r5L24o2k06j2j1N6J22j44l39J65n8J05
3921a52M16k30j03o1m2R3J93Q8m6j82N1P9j43j33L98j73j08P4o3J32o4j42n2K00
3945C0m02N32j81J1o7J42M3O8k42K49J16k37J53K7q6j56q0j43K08q4L15N2k76
3968hJ71M8j85K7k38j63N15j18k04J10J48o2J46M0k21k9O2K7K65l15R3m43M04
3991G0J0n9j01p9K93L5K1j87K31l16N3P6N5j07j90m8K45J23k45L5L9J12l3N4j03
4016a6J14j74J25N2j2k21j68L53J09K0k98K0R5j76J18j68K19J63j03p4K05j09
4038G4L95m80J10jO3l3j50j23K48M8n69L14J34j67J67o9j61J49K7p0k79N27j28
4061B6j79K20J50k33j86K76n5L9j53k9K00K1k56ON8l25N60j80R3K27k76J39J0
$$ y = [146, -66, -89, 98, -67, -63, -160, -54, 89, -5, -122, 3, -92, 232, 170, -36, -48, -59, -3, 119, -25, -364, -199, -257, -152, 264, 34, -69, -130, -172, -79, 114, 202, 156, -26, 25, 104, -39, -172, 226, 53, -55, 19, -44, 88, 24, -118, -170, 30, -372, 160, -21, -10, -77, 65, 108, 176, -66, 183, 299, 62, 215, 242, 156, 0, -80, -223, -15, -99, 216, 268, -8, 163, 211, 26, 53, -185, -348, 167, 49, -155, -45, 103, 41, 187, 227, 6, -23, 39, 66, 331, 16, 109, -334, 70, 80, 21, -80, -159, 134, 169, 190, 3, 234, -82, -29, 47, 102, -5, -195, -243, 2, 125, -120, -85, -46, 66, 33, 87, -16, 98, -76, 49, 101, 89, -132, -300, 53, 162, 182, -116, -96, -1, -177, -59, -227, -8, 155, 52, -22, 183, 74, 469, -11, 99, 98, 161, 128, -22, -145, 103, 151, -418, -104, 30, -137, 30, -39, -200, -51, -24, -94, -373, 154, 26, -153, 67, 217, -16, -202, 74, 19, 58, -95, -124, 76, 97, -159, -153, -95, -420, 140, -40, 53, 280, 4, 143, 153]
4084A53k22K13K08m52K15j44j69M15j34j45k20J07L53l5l31K09J42l44k3R6l1
4105a39j23Q1K30k45K13J27k30O3m2K16l8o0j90m6K37k27L64j20l30O54k29m85
4127c19K33J31k36k8Q8K68K3n0J05j05q4O6k67P8l8N8k26K77l2Q4j0j52K38R1
4151A93l61J92Kj38M5J73k54J68O3o4l45L75J39q3j06J47o2j99J59j90K2J42j64
4174a46J13J58j65n2q9K73j66J51j23pQ2k37K46k3k62R6j5J7J97l15M68k81n1
4197a31J77K37l37Mp5J00L72p60O06j98K1j27P4k64L36R9L6k47rJ73J41l55N67
4220D40m47j26kJ67k94K34J68k55K71k85J80l07M01j09j49j36M50k21K16k37j78
4241b19K34L5l71L37L23m50K15r7P3n2J68m7k02n0k7K74k85L43Q0j63O0k31J7
$$ y = [153, -69, 144, 352, -100, 115, -29, -198, 217, 83, -62, -282, -175, 178, 143, -188, 21, 163, -181, -204, -108, -139, -262, -181, 49, -196, 17, 144, -86, -23, -65, 151, 113, 53, -137, -183, 54, -173, 191, 71, -259, 395, 166, -319, -86, 45, -191, -219, -131, 137, 160, 110, 215, 110, 26, 92, -175, -97, -135, -77, -303, -26, -58, 26, 16, -136, 102, 193, -168, 24, 26, -112, -67, 106, -148, 20, 83, 19, -326, 49, 188, 105, -1, 146, 84, -115, 44, -146, -124, 18, -146, -33, 125, -40, -92, -181, 92, -74, 77, -46, -53, 29, -208, 38, 15, -247, -151, -166, -149, 48, -267, 201, -80, -131, 46, 283, -54, -50, -125, -25, 347, -413, 193, -5, 16, -111, -37, -301, 35, 134, 170, -77, -86, 87, 228, -127, 440, -7, -133, -135, 32, -262, -28, 140, -115, 156, -129, 51, -256, 145, 36, -113, -249, 201, -20, 196, -41, -219, 15, 50, -321, 16, 339, -111, 104, 7, 80, 28, 196, 149, -53, -103, -130, 144, -141, 202, 282, 119, 179, -52, -35]
4264c5K4r1N1J67l02L37J4r4j13K31k98L34j1l2k32J34j51J49j64p5m2n8L25r1
4288b3KKm8K60j59q7j51J37M5l1J52j69J73q0j70q6J37k8K23j64k64J93J26k5
4312c5O4m2O6L6j96p9J69j41Q0J43k13J2L2K59j35j7j15Rj60M14j94K2Kj21q6
4337b26L62o4J46k53j76N10k82j40M0K11k94O5J19p1K5J69J44m22J45K27n6j41
4359C8L8m0j04J34k84M38l28k09M62k67r9K54l6Q7j09r4J60J19k64R0J00j04k6
4382d4J34J2J4k18Q3K2m0kJ56m1k01J9Q9No3K65p1N8j26K7K21l26J6j29J35j88
4408a93M74Rl19J7j95J36j89N2P3J18j76L27k2k28K8L38k31J69r8J3J33m80Q9
4431a55L18k29R4p1J33J7k30r0Q5L62m23J13L8J08PR7l09K12j83J45j47J16k52
$$ y = [-35, -11, -102, -51, 116, -186, 151, 165, 71, -42, 189, -109, 225, 214, 182, -50, 84, -67, 82, -82, -157, -199, -257, 68, -23, -21, -19, -67, 193, 34, -53, -204, -67, -22, -53, 99, -70, 103, 23, -147, -233, -96, -124, 99, -65, -329, -136, -10, -35, 29, -13, 53, 89, -107, -186, -17, -158, -78, 65, -148, -136, -104, 155, 20, 3, -112, -103, -263, 151, -43, -21, -19, -140, -226, 136, 72, 218, -35, -211, 299, 17, -123, -83, 128, -166, -101, 18, -53, -28, 141, 285, -137, 8, 235, 179, 38, 76, 36, -68, 66, -218, 220, -108, -317, 145, -122, -221, 33, -3, 84, -25, -119, 41, 160, -104, -14, 86, -18, -44, 90, 102, 116, -102, -19, 3, -37, -39, 117, 76, -125, -106, -17, -12, -75, 190, 119, 177, 51, 78, 299, -27, -11, -140, -5, -193, 281, 290, -29, -12, -207, -71, -260, -208, -135, -17, -193, 134, 112, -116, -88, 250, 19, 188, 90, 103, 236, -244, -155, 163, -66, 28, -43, 90, 107, -123, -213, -128, 234, -189, -76, -38, 70, 77, 174, -135, 77, -106, 39, -108, 8, -244]
4454b44L74n8j81K31J9k00J24j01L00k83K6J15j32J22J12m44L36j13J3k1l0j13
4476a48L8k2P3J47m03qL97j05j76L17j20j97J75J7K58p4J39j02j50k65J31o1J3
4499a26K7J53j35j40J03rK08q9N1M2P0l5j48n7O8k0j04kJ45R6o1k05L49l8R9n43
4525c01M65j25N7k29K30J84k87J11j21p3J44j05N2J21j61K18k09L45l18L1k28
4546a99L57l28J32J92l14J98n5K09p1m08K35J9N6J80j82P7j27K75l73L88l81K4
4568i6P1qP0o1L67k83l28K64K01j72q0L2RM8j64L28k3r6K25n54L77j04j08O3j01
4593a23N49k96j74oJ65j10j65K10j93k91N85k24j06K80k03K5J87Jk6k03LmJ7O1
4617d1j78N3J87KJ0o9P8j22J68kmP8R5k00J65j56P5j37M7J4j13k1L72j59k48K62
$$ y = [-244, 130, 72, -109, 122, 141, -59, 65, -36, 264, -19, 7, 122, -10, 112, 224, -220, 116, 3, 16, -5, -35, -148, -110, -132, -59, 88, -315, -323, 74, -31, -207, 110, -10, -207, -32, -15, 243, 169, 308, 206, 56, -209, -78, -139, -126, -99, 54, -81, -221, -118, -127, 81, -8, 43, 85, 155, 120, -28, -85, -17, -37, -141, -143, 2, 98, 37, -168, 181, 143, 242, -301, 164, 39, 96, -133, 97, 281, -6, 105, -16, -89, 55, -50, 2, 123, -38, 180, -29, 316, -2, 29, -199, 158, -170, -38, 154, -160, 38, -17, 192, 121, -287, -52, -33, 23, 203, 21, 98, -29, 246, -127, 261, -120, -96, -25, -33, 37, -24, 343, 60, -268, -4, 197, 25, -55, -23, -14, 34, -130, 198, 175, 79, 304, -250, 127, 23, -85, -22, -123, 426, 130, -44, -50, 115, 5, -160, 50, -143, -434, 151, -73, -179, 101, -102, -77, 110, 111, 85, -118, -115, -119, -102, -41, -219, -166, 21, 23, 33, -36, 42, -80, 88, 86, 82, 160, 255, 55, 220, 64, 139, 2, 49, 63, -50, -71, 301, 142, -106, 156]
4643A56m15L69j17M8n5l9L17j61N6n7m8k13p6J37n0K37k14m5P2K81j68J44j56
4666Cj9J94j77n6K91j97j28J05Q8l12K62r1L29q8o53M54j11K62N2M5l47K6L8J75
4690A45j87J79%k07K26k52K55q5J55j84j68M24l85K67o7j05J8j48m1K72r0%l07
4713b85M78j57JL0n9j36OJ19K13n72L97J14o56O72j12k46L59lk67K4J02j66J89
4736D5L8L5p9M4j7Q6r0k55j32J80K8l8J15J19j45J05k24L26j43j93J10q4O4R4
4760a1m8K39q5j88K2l5P0O0O9r5J18j12R7j27m2o8K38J87j76j77j54J30J04J24
4784A40k14L46l86K89j45j28k15K84o7J79j52j16J62O6k15J71J61k81M56l92L29
4805B72l10m9K51m4K6l02K69j4K25l23j54M13l56n7J40Q8K29l71J68k60j12L60
$$ y = [156, -259, 110, -7, 41, -14, -53, 264, 103, 159, 102, 54, -159, -235, -98, -148, 89, -125, -170, -98, 183, 15, 159, 3, -16, 178, 1, -55, 236, 39, -89, 16, 104, -208, 54, -37, 292, 204, -449, 5, -106, 156, 208, 253, -94, -68, -30, 145, -42, 137, 137, -70, 156, -96, 159, 74, 229, 45, -123, 301, -84, 183, 116, 11, 29, -119, -160, 112, 22, 22, -285, 193, 36, 37, 67, 8, -128, -122, -3, 210, -362, 35, 149, -507, 165, 53, -193, 166, 163, -104, -80, 22, -144, 45, 83, 118, 39, 83, 66, 152, 62, -193, -325, -145, -117, -155, -40, 79, -66, 39, -185, 141, -2, -195, -85, -169, -105, -11, -59, 180, 95, -93, -71, -106, -36, 24, 93, -2, 116, 4, 101, -26, -68, -136, 102, 289, 113, -64, -218, -88, 16, 140, -74, 272, -114, 175, 30, -98, -313, -29, -96, 83, -69, -185, -23, 43, -172, -1, 160, -121, 335, -57, 272, -38, -87, 164, 120, 146, -156, 113, 99, 324, 1, -153, 260, -96, -153, -13, 75, 304, -67, 101, -159, -271, 89]
4827H9j58j60oJ49K4K60M4k60P8m7R1k21J74M9r2P8o1j06j14K10J88l00K42j39
4851A2q0J72m9l0N6k6K9l7k7r0L6K67J3k56m7j33K42N6R4n8p3nL9J0j72J74J10
4878B27o00N17l2n8m19M14m2l48J02L89k20L38k63j5j54K12j29M7p9K26P4k40
4900e3K09j79j25j2J46R0j82J66R0k44m6J86n5o3m6K32k03J53n6P6L49o04K70
4923I9p7K26J2k85K03j21j30N2j39j40M82J70m46k26N09J37n59K33q0K80k61Q9
4945B8p4k26J24R7J9J73m23L29K0M5l6kQp5J13k21J15k4k36L24J57j64J95k23
4969D3j48K58k23p6M7J38O8k28K8J62J01k90J40q7P2J45j7k45J73j48Jp5K22J8
4993G9K22m73K48k20k2k5K75O8m37K64K34m26M07k10n5K28k70K73r6q9j14K44
$$ y = [89, -69, -229, -235, -86, -62, 198, 242, -18, 60, 13, 104, -117, 57, 106, 14, 92, 31, -75, -189, 21, 209, -91, 151, 12, -68, 104, 55, 25, 81, 55, 84, 47, 20, -70, -34, 233, 246, -10, -57, -190, 52, 108, 202, 144, 71, 66, 105, 115, -57, 117, 227, -373, 144, 112, 54, -365, 49, 7, -341, -239, 150, -70, 268, 5, -10, -164, 48, -81, -34, -113, 113, 187, -53, 156, -23, -148, -160, -14, 76, -106, 60, 150, -94, -140, 46, -9, -72, -118, 114, -89, 64, 8, 84, 433, -171, 99, 22, 248, 260, -25, 178, 57, -73, -21, -160, -300, 182, 352, -94, -320, 189, 326, -233, 0, -80, 200, -61, 28, -46, -272, -148, -51, -32, 141, -282, 47, 67, 112, 76, 74, 82, 7, 120, -101, 14, -10, -246, 78, 235, 71, 266, 43, -105, 153, -70, -146, -99, 39, 107, -121, -93, 69, 170, -120, 20, -67, 5, 150, 133, -112, 61, -87, -86, -161, 61, 79, 301, -172, 76, -144, -166, -191, 84, 152, -285, -21, 213, -213, 194, -16, -71, 157, -113, 160, 64, -25, -139, 105]
5015A05j16k51L13j1O3r9Rl7k00M79j55r7pJ76nj25j1l01K23L54l19p2J6j8L59
5040B73k93j03K71k05k25K66j6J63l56L33R5m23K03K33q4j16j77L81r3J1j82J7
5062b7J15J6k0k01l8J92l2J65p8p9k45O9J61j0J86n5j30j51K23N1k37J17k02J16
5086i4K09j88j80K31j47K63j74N4l4K4k8j9J30J4j83K43j14o5L25l28K7n1L35
5109B50l16j74J05l0J41K5J37k58J06j08k6J39P2L8j72l1N0J32j53J51n9j64J57
5132A2m9J59j55K2L34l05p0J86j61K34l06j62L35J42l54L80j09j51Q3J4m09J96
5154a34M8k18L07j77J26J8p4J25P2O7j81N4J48o4k76K30k04l4M78j89k09P3k84
5177b98L69K50n74K21K4j5J66j52Q8L5j25J47k0p9P6K3Q6l07j6j78K14J05k28
$$ y = [105, -11, -262, 51, 40, 103, 4, 13, -24, -224, 255, 100, 3, -4, 172, 167, 42, 31, -270, -47, 307, -12, -84, -68, -86, 273, -20, -123, 148, -57, -282, -16, -32, 131, -225, 108, 203, -220, -17, 216, 132, 16, -161, 220, 127, 138, -44, -27, 88, 104, 84, -117, -155, 37, 5, 170, 92, 13, -232, -163, -2, -12, 174, 119, -11, -162, 61, 112, -125, -8, -210, -94, 115, -73, -253, -22, -169, 94, -80, -26, -60, -36, -64, -83, 47, 61, -122, 121, 7, -58, 267, -61, -34, -85, 250, -66, -240, -135, -165, -24, 1, 138, -120, -14, -122, -148, -9, 63, 101, -71, -102, -52, 80, -73, 78, 19, -145, 12, -37, 122, -33, -11, 323, 18, -52, 134, -27, 207, -99, -261, 74, 216, -138, 242, 133, -18, 65, 79, -330, -134, -86, -304, 3, -174, -48, -30, -104, 21, 93, 160, -21, 33, 181, 117, -159, 71, -133, -167, 311, 122, -87, -14, -298, 71, 321, -253, -32, -8, -23, 143, -9, 79, 114, -11, 136, 116, 37, 113, 136, 222, -85, -101, -279, -65, 40, -188]
5200a88J11o6K12j13J08k16J99k15K33K01l11j05J20J22J4j94R1j64J95l2m6P5
5222C1l89K62Q1j2M5N7K5j83j20K9K11r3P7j74K65k36m0N8l5O3j01n3L03n8o3
5247e0m5N0j56N1J56J25l15K38l14K42P6j14J1j77O0M3K45J1r3J36k4j75N2k66
5271b33J04K76j31l61M92l7l36K45K27m29J44J29j6j29M76m54J62j07Q6m61J67
5292a86J80L58l95J31o3j6J2j48J21j55O2J95k38J4J28k6oJ24Q3k41O3o5K04Q7
5316B23n04j04M43j3p2k32K89j32N6m7L2k02L17k60K27j6l8L07k28p5L8n3l2O6
5340a0J0Mk4J92j35j29J65j63K93p5k50j27L59J3j50J43Q2o6r1o5P1J50j50j34
5364h7K7K59l39J43K72l59j13J55j15L72k14K7K57j73j4j89Qp0l5K41j03K03k05
$$ y = [-188, -77, -143, 69, -44, 64, -152, 47, -168, 65, 266, -45, -150, -30, 92, 106, -88, 3, -161, 34, 2, -44, 31, -358, -96, -15, -27, 18, 75, 100, -83, -203, -174, 37, -56, 21, -153, 112, -124, -164, -106, -141, -78, -179, -232, 71, 13, -50, -95, -45, -201, -150, 6, 131, -184, 54, -260, -18, 58, -56, -45, -222, -162, -119, 126, 137, 44, 180, 156, -19, 33, -233, -129, 147, 16, -345, 147, 110, -226, 19, 246, -183, -39, 90, 74, -55, 421, -33, 129, 22, 108, -353, -186, -6, 352, -43, 88, 25, 9, 21, -127, -6, -161, -99, 96, -142, -128, 0, -26, -32, 92, 175, -66, -3, -68, 136, 223, -281, -385, 58, 45, -27, -259, 30, -102, -46, -93, -61, -263, 54, -206, 21, 5, -33, 274, 46, -29, 9, -44, -76, -10, 0, 4, -20, 172, 37, -92, 73, -90, 203, 128, -122, -249, 110, 123, -27, 116, 198, 132, 41, -24, 47, 197, 47, -87, -60, 199, -140, 3, 275, -84, -197, -42, -157, 215, 1, 28, 285, 112, 98, -91, -83, -153, -188, 53, -50, 153, -52]
5387e2rK31k26K71k32N7K8o2K68k06k52M2J56k8m9J02q9OR6Nk15m5L65OP4l15
5413g3J37J58k96QO6n0J6m7K6K2k07K50l08L97k91J15j1J25j88J59K7j11j01M2
5437a35M26j23j07n6J94N1L9l20M9p8o6K99K8k07o2J67j35J96l07L50p4j47J29
5460A11J22l7j63k14K16p6m4l5J80j58K49l33J37J20J21l53J76K94j56j75l8o
5482f2O3k26K83P2l4L1j8L0m5J66O3l93J01J65j99J30R0O5l27K9O7L6K7k03J75
5507H6l5j38P8J2r5m0J56j25P1j41J8J73l9M7o0j43M0P9M5K85J7j75J29k22Q9
5532A12J6j96m9o4K06o3L3Q8Q1O5n0k24J86q3Q3Nkk72J74K3N6j33j4N9j17K01
5558A21Pl94k0N10j31j76j67L58k84K63m6k08MK60J10m45K3Q2K6J9nJ54K4j39
$$ y = [-52, -61, 170, -56, 215, -17, 40, 68, 6, 274, 68, -184, -142, 14, -14, -63, 39, -50, -44, 52, 57, -158, -203, 162, 168, 242, -73, 64, 222, -74, -66, 0, -50, -34, -81, -55, -33, -240, 10, -298, 99, -192, -77, -88, 37, -151, 8, 35, -76, -177, -135, 291, 168, 61, 5, 199, 250, 289, -31, 18, -60, -126, 173, 201, -6, -68, 99, -36, 160, -147, 203, 129, -18, 111, 233, 196, 33, -181, 35, -41, -85, -120, 60, -98, 151, -182, -45, 75, 196, -157, 19, 313, 157, -18, -56, -62, 1, -225, 58, 130, 96, 127, 109, 139, 94, 260, 323, -70, 31, 196, -3, 127, 217, 282, -45, -16, 51, 87, 114, -89, 86, 51, -87, -9, 3, -92, -132, 24, -101, -30, -171, -153, 20, -19, 28, -32, -175, -135, -56, -11, 274, 291, 116, 245, 23, 112, 128, -68, -117, -181, 25, -38, -5, 83, 164, 229, 179, -45, 141, 58, 141, 146, 144, -128, 46, 69, 125, -8, -22, 37, -80, 121, 128, -266, -286, 224, 93, -83, -250, 108, -176, 87, 41, -167, -163, 97, 207, -238, -215, -133, -107, -88, -93, 61, 85, -54]
5582e4j4R6j39K10q5J81l63m2L63m00K74n2L6K29M7l41q0M22m64J65j2J4J43q0
5606E4l18J64J40o6J20j82J80p2k21J85Q8j88K77P4l57L08l72K35k22j2Q2O8J04
$$ y = [-54, -68, 28, -111, 99, 14, 195, -168, -210, 153, -247, 27, -25, 11, 240, 287, -54, -134, 288, -176, -11, -23, -9, 134, 54, -264, -100, 40, -26, 94, -88, 92, 20, -201, -16, 72, -116, 161, 235, -122, 186, -186, 49, -173, -185, -103, -35, 69]
$$ [...]
8191A46
##END NTUPLES=NMR FID
##END=
