##TITLE=1H_Pr D5-Bzl
 200.13MHz,CDCl3,
 8 sc
 
 7.7.2025
##JCAMPDX= 6.0         $$ Bruker NMR JCAMP-DX V2.0
##DATA TYPE= NMR FID
##DATA CLASS= NTUPLES
##ORIGIN= UXNMR, Bruker Analytische Messtechnik GmbH
##OWNER= pz
$$ XWIN-NMR		Version 3.5
$$ Mon Jul  7 16:09:35 2025 Russian Standard Time (UT+4h)  she@DPX200
##.OBSERVE FREQUENCY= 200.1313
##.OBSERVE NUCLEUS= ^1H
##.DELAY= (6, 6)
##.ACQUISITION MODE= SIMULTANEOUS
##.ACQUISITION SCHEME= undefined
##.AVERAGES= 8
##.DIGITISER RES= 18
##SPECTROMETER/DATA SYSTEM= spect
##.PULSE SEQUENCE= zg30
##.SOLVENT NAME= CDCl3
##.SHIFT REFERENCE= (INTERNAL, CDCl3, 0, 14.3821)
##AUDIT TRAIL= $$ (NUMBER, WHEN, WHO, WHERE, WHAT)
$$ ##TITLE= Audit trail, XWIN-NMR		Version 3.5
$$ ##JCAMPDX= 5.01
$$ ##ORIGIN= Bruker BioSpin GmbH
$$ ##OWNER= she
$$ F:/spectra/data/she/nmr/H-C/1/audita.txt
$$ ##AUDIT TRAIL=  $$ (NUMBER, WHEN, WHO, WHERE, WHAT)
(   1,<2025-07-07 16:07:59.96 +0400>,<she>,<DPX200>,
      <created by zg, POWCHK disabled, PULCHK disabled
       configuration hash MD5:
       00 E9 B6 7A A2 85 ED C7 34 08 36 98 17 FE 4E 26
       data hash MD5: 16K
       09 16 00 BD B3 77 CE 42 9C AD DC EB 6C D4 8E 72>)
$$ ##END=
$$ 
$$ hash MD5
$$ 24 EE F6 C8 67 67 A7 F3 86 91 40 8C 3D 26 4B 6B
##$RELAX= 
##$RELAX= 
##$RELAX= 
##$RELAX= 
##$RELAX= 
##$RELAX= 
$$ Bruker specific parameters
$$ --------------------------
##$DU= <F:/spectra>
##$EXPNO= 1
##$NAME= <H-C>
##$PROCNO= 1
##$TYPE= <nmr>
##$USER= <she>
##$AMP= (0..31)
100 100 100 100 100 100 100 100 100 100 100 100 100 100 100 100 100 100 
100 100 100 100 100 100 100 100 100 100 100 100 100 100 
##$AQSEQ= 0
##$AQ_mod= 1
##$AUNM= <au_zg>
##$AUTOPOS= <>
##$BF1= 200.13
##$BF2= 200.13
##$BF3= 200.13
##$BF4= 200.13
##$BF5= 200.13
##$BF6= 200.13
##$BF7= 200.13
##$BF8= 200.13
##$BYTORDA= 1
##$CFDGTYP= 0
##$CFRGTYP= 5
##$CHEMSTR= <none>
##$CNST= (0..31)
1 1 145 1 1 1 1 1 1 1 1 1 1 1 1 1 1 1 1 1 1 1 1 1 1 1 1 1 1 1 1 1 
##$CPDPRG= <>
##$CPDPRG1= <>
##$CPDPRG2= <>
##$CPDPRG3= <>
##$CPDPRG4= <mlev>
##$CPDPRG5= <mlev>
##$CPDPRG6= <mlev>
##$CPDPRG7= <mlev>
##$CPDPRG8= <mlev>
##$CPDPRGB= <>
##$CPDPRGT= <>
##$D= (0..31)
0 0.7 0 0 0 0 0 0 0 0 0 0.03 0 0 0 0 0 0 0 0 0 0 0 0 0 0 0 0 0 0 0 0 
##$DATE= 1751890079
##$DBL= (0..7)
120 120 120 120 120 120 120 120 
##$DBP= (0..7)
150 150 150 150 150 150 150 150 
##$DBP07= 0
##$DBPNAM0= <>
##$DBPNAM1= <>
##$DBPNAM2= <>
##$DBPNAM3= <>
##$DBPNAM4= <>
##$DBPNAM5= <>
##$DBPNAM6= <>
##$DBPNAM7= <>
##$DBPOAL= (0..7)
0.5 0.5 0.5 0.5 0.5 0.5 0.5 0.5 
##$DBPOFFS= (0..7)
0 0 0 0 0 0 0 0 
##$DE= 6
##$DECBNUC= <off>
##$DECIM= 32
##$DECNUC= <off>
##$DECSTAT= 4
##$DIGMOD= 1
##$DIGTYP= 9
##$DL= (0..7)
0 120 120 120 120 120 120 120 
##$DP= (0..7)
150 150 150 150 150 150 150 150 
##$DP07= 0
##$DPNAME0= <>
##$DPNAME1= <>
##$DPNAME2= <>
##$DPNAME3= <>
##$DPNAME4= <>
##$DPNAME5= <>
##$DPNAME6= <>
##$DPNAME7= <>
##$DPOAL= (0..7)
0.5 0.5 0.5 0.5 0.5 0.5 0.5 0.5 
##$DPOFFS= (0..7)
0 0 0 0 0 0 0 0 
##$DQDMODE= 0
##$DR= 18
##$DS= 0
##$DSLIST= <SSSSSSSSSSSSSSS>
$$ [...]
##$SUBNAM0= <"">
##$SUBNAM1= <"">
##$SUBNAM2= <"">
##$SUBNAM3= <"">
##$SUBNAM4= <"">
##$SUBNAM5= <"">
##$SUBNAM6= <"">
##$SUBNAM7= <"">
##$SUBNAM8= <"">
##$SUBNAM9= <"">
##$SW= 18.0517328524113
##$SWIBOX= (0..15)
0 0 2 0 0 0 0 0 0 0 0 0 0 0 0 0 
##$SW_h= 3612.71676300578
##$TD= 16384
##$TD0= 1
##$TE= 0
##$TE2= 300
##$TE3= 300
##$TEG= 300
##$TL= (0..7)
0 120 120 120 120 120 120 120 
##$TP= (0..7)
150 150 150 150 150 150 150 150 
##$TP07= 0
##$TPNAME0= <>
##$TPNAME1= <>
##$TPNAME2= <>
##$TPNAME3= <>
##$TPNAME4= <>
##$TPNAME5= <>
##$TPNAME6= <>
##$TPNAME7= <>
##$TPOAL= (0..7)
0.5 0.5 0.5 0.5 0.5 0.5 0.5 0.5 
##$TPOFFS= (0..7)
0 0 0 0 0 0 0 0 
##$TUNHIN= 0
##$TUNHOUT= 0
##$TUNXOUT= 0
##$USERA1= <user>
##$USERA2= <user>
##$USERA3= <user>
##$USERA4= <user>
##$USERA5= <user>
##$V9= 5
##$VALIST= <valist>
##$VCLIST= <CCCCCCCCCCCCCCC>
##$VD= 0
##$VDLIST= <DDDDDDDDDDDDDDD>
##$VPLIST= <PPPPPPPPPPPPPPP>
##$VTLIST= <TTTTTTTTTTTTTTT>
##$WBST= 1024
##$WBSW= 4
##$XGAIN= (0..3)
0 0 0 0 
##$XL= 0
##$YL= 0
##$YMAX_a= 190858
##$YMIN_a= -208059
##$ZGOPTNS= <>
##$ZL1= 120
##$ZL2= 120
##$ZL3= 120
##$ZL4= 120
##$ABSF1= 10
##$ABSF2= 0
##$ABSG= 5
##$ABSL= 3
##$ALPHA= 0
##$AQORDER= 0
##$ASSFAC= 0
##$ASSFACI= 0
##$ASSFACX= 0
##$ASSWID= 0
##$AUNMP= <proc_1d>
##$AZFE= 0.1
##$AZFW= 0.1
##$BCFW= 1
##$BC_mod= 2
##$BYTORDP= 1
##$COROFFS= 0
##$CY= -3
##$DATMOD= 1
##$DC= 2
##$DFILT= <>
##$DTYPP= 0
##$F1P= 0
##$F2P= 0
##$FCOR= 0.5
##$FTSIZE= 0
##$FT_mod= 4
##$GAMMA= 1
##$GB= 0.15
##$INTBC= 1
##$INTSCL= 1
##$ISEN= 128
##$LB= 0.25
##$LEV0= 0
##$LPBIN= 0
##$MAXI= 10000
##$MC2= 0
##$MEAN= 0
##$ME_mod= 0
##$MI= 1.114404
##$NCOEF= 0
##$NC_proc= 0
##$NLEV= 6
##$NOISF1= 3.799351
##$NOISF2= 2.8
##$NSP= 1
##$NTH_PI= 0
##$NZP= 0
##$OFFSET= 14.38212
##$PC= 1
##$PHC0= -1205.006
##$PHC1= 14.39238
##$PH_mod= 1
##$PKNL= yes
##$PPARMOD= 0
##$PSCAL= 0
##$PSIGN= 0
##$REVERSE= no
##$SF= 200.129724274929
##$SI= 16384
##$SIGF1= 3
##$SIGF2= 2
##$SINO= 400
##$SIOLD= 16384
##$SREGLST= <1H.CDCl3>
##$SSB= 0
##$STSI= 0
##$STSR= 0
##$SW_p= 3205.1282051282
##$SYMM= 0
##$S_DEV= 0
##$TDeff= 0
##$TDoff= 0
##$TI= <>
##$TILT= no
##$TM1= 0
##$TM2= 0
##$TOPLEV= 0
##$USERP1= <user>
##$USERP2= <user>
##$USERP3= <user>
##$USERP4= <user>
##$USERP5= <user>
##$WDW= 1
##$XDIM= 8192
##$YMAX_p= 0
##$YMIN_p= 0
$$ End of Bruker specific parameters
$$ ---------------------------------
##NTUPLES= NMR FID
##VAR_NAME=  TIME,          FID/REAL,        FID/IMAG
##SYMBOL=    X,             R,               I
##VAR_TYPE=  INDEPENDENT,   DEPENDENT,       DEPENDENT
##VAR_FORM=  AFFN,          ASDF,            ASDF
##VAR_DIM=   8192,          8192,            8192
##UNITS=     SECONDS,       ARBITRARY UNITS, ARBITRARY UNITS
##FACTOR=    0.0002768,     1,               1
##FIRST=     0,             0,               0
##LAST=      2.2672688,     0,               0
##MIN=       0,             -208059,         0
##MAX=       2.2672688,     190858,          0
$$ Real data points
##PAGE= N=1
##DATA TABLE= (X++(R..R)), XYDATA
0@%%%%%%%%%%%%%%%mJ2j6J6j6J6k0K8l2L3m1M9n7O5p3Q7r9J09j22J38j57J77j97
$$ 0 0 0 0 0 0 0 0 0 0 0 0 0 0 0 0 -4 8 -8 8 -8 8 -12 16 -16 17 -24 25 -32 33 -40 47 -52 57 -65 73 -84 93 -104
38a04K21k47K74l03L38l76M14m56N03n56O12o73P42q19R05r98J102j221J356j514
$$ -104 117 -130 144 -159 179 -197 217 -239 264 -292 320 -353 389 -430 475 -523 579 -642 714 -800
58h00J699j916K178k503K918l464M220n339P158j0598J9266q1820j39058K16368
$$ -800 899 -1017 1161 -1342 1576 -1888 2332 -3007 4151 -6447 12819 -69001 -208059 8309
72H309J45946r7423j38897J8172R9242J4057l4149M115n3173l4002Q9074P0477
$$ 8309 154255 56832 -82065 -63893 35349 49406 15257 19372 -33801 -67803 21271 91748
84I1748o8872j20078O070J57510L5695j40692n0614P8661N7119n440m7175j8432
$$ 91748 22876 -97202 -91132 66378 102073 -38619 -89233 -10572 46547 41107 -6068 -24500
96b4500J0360J0775M8738L513r1903j2085Q2489K2059n3368m0777L1792L4376
$$ -24500 -14140 -3365 45373 48886 -43017 -55102 27387 49446 -3922 -44699 -12907 21469
108B1469l6228O092M3660m7233m2226N8471N4511l1201p7807Q823R4748n076p9724
$$ 21469 -14759 -8667 34993 -12240 -54466 4005 58516 27315 -50492 -41669 53079 48003 -31721
121c1721P574M2130j0065k6565J7407L8569m8847o1081Q0422P1603p9953p4598
$$ -31721 -24147 17983 7918 -18647 -1240 37329 -11518 -72599 7823 79426 -527 -75125
133g5125M8827Q6337j3323q7567L803O3468q581j9515J0822j1536j7028Q338L5583
$$ -75125 -26298 60039 46716 -40851 -37048 26420 17839 -1676 9146 -2390 -19418 -11080 24503
146B4503P215o2835j6270O8806J8048m6538k5739K0867L6621j1267k6722J6813
$$ 24503 31718 -31117 -47387 21419 39467 -7071 -32810 -11943 24678 13411 -13311 3502
158C502j942j6180K7516J0372l1998j5000K2921K8928k5900l6311L6725K4681
$$ 3502 1560 -14620 12896 23268 -8730 -23730 -809 28119 2219 -34092 2633 27314
170B7314l9070j0154K9994J2868k3202k4748L0442K8386l5861j6754K6231M485
$$ 27314 -11756 -21910 8084 20952 -2250 -26998 3444 31830 -4031 -20785 5446 9931
182I931j1682l895J2126J662l2394R060M9700j8315n1274R755M7670J4299m6090
$$ 9931 -1751 -5646 6480 8142 -24252 -15192 34508 16193 -35081 -25326 22344 36643 -9447
195i447k7122M2826J9078k2582m112m590o306J3875J2557j434k8447j8574M2703
$$ -9447 -36569 6257 25335 2753 -1359 -5949 -12255 1620 14177 12743 -15704 -34278 8425
208H425K6618l6916k6287J3785L2109P033l2807o688K0225k764M705O573k1479
$$ 8425 35043 -1873 -28160 -14375 17734 24767 -8040 -14728 5497 2733 7438 14011 -7468
221g468j0127J4770K0727l060l9020j936M2857p69k5937j668R277J1053m723o862
$$ -7468 -17595 -2825 17902 14842 -24178 -26114 16743 15974 -9963 -11631 -2354 8699 3976 -2886
235b886J1901q244j1079K1274K710j7873n073M590J5515m686k4366J1839J5302
$$ -2886 9015 771 -10308 10966 13676 -4197 -9270 -4680 10835 6149 -18217 -6378 8924
248H924j4158j346P249J985k321r949J3760J4195k3673l335J9653m201o321k582
$$ 8924 -5234 -6580 669 2654 333 -9616 4144 18339 -5334 -8669 10984 6783 462 -2120
262b120L14P672j0440k711J4662j2251q691J4832K658k877p660l528K1248K09
$$ -2120 -1806 5866 -4574 -7285 7377 -4874 -13565 1267 3925 1048 -6612 -10140 11108 11317
276A1317j9449Q139P420l531R41o557L097K153j1359J0793M244k1020M726J3986
$$ 11317 -8132 7 7427 3896 4837 -1720 1377 3530 -7829 2964 7208 -13812 -9086 4900
290D900k641n061q698Q910J5721j3908m482J1280m860K807K636p834M330l591
$$ 4900 2259 -2802 -11500 -2590 13131 -777 -5259 6021 1161 3968 6604 -1230 3100 -491
304d91k754J1936j0553j1167J2561K742j747n025p586J5615M013j4514P900M356
$$ -491 -3245 8691 -1862 -13029 -468 2274 527 -4498 -12084 3531 7544 -6970 930 5286
318E286o486O232j395k338J850p136P862M290j6753L351Q412n394J664m384j203
$$ 5286 -1200 5032 3637 1299 3149 -3987 3875 8165 -8588 -5237 3175 -2219 -555 -4939 -6142
333f142J1309o680l335R422m925P20M182m906M502k331n651J0874m488j0012Q743
$$ -6142 5167 -1513 -4848 4574 -351 369 4551 -355 4147 1816 -3835 7039 2551 -7461 1282
348A282K9l420J315m886O057J885q899P502K393p127O737l56l523M958n217J359
$$ 1282 1311 -2109 -794 -5680 377 2262 -6637 865 3258 -3869 2868 2512 -1011 3947 -1270 89
364H9O161q624N91L684m977M365j723m074P354n092k589R543m649l316M966j695
$$ 89 6250 -2374 -1783 1901 -3076 1289 -434 -4508 2846 -2246 -4835 4708 59 -3257 1709 14
380A4L501j703o561P574O2n097N307m832k906P306k869j72P32n917O222L773n671
$$ 14 3515 1812 -4749 2825 2887 -2210 3097 -1735 -4641 2665 -204 -376 356 -5561 661 4434 -1237
397a237J986k473q2Q604n473m545L773k622M287K413r545N90M066J440L260p943
$$ -1237 749 -1724 -1806 6798 1325 -3220 553 -2069 2218 4631 -4914 -4324 -258 1182 4442 -3501
413c501k685R973k117j166K860o333K271M704k653J413n228l542R765l38n356
$$ -3501 -6186 3787 1670 504 3364 -2969 -698 4006 1353 2766 -2462 -6004 3761 3423 -1933
428a933j323l416P802N732j0534l02M922m86L786k769k989M592l751J202N860
$$ -1933 -3256 -6672 1130 6862 -3672 -3974 948 462 4248 1479 -1510 3082 -669 533 6393
443F393p836k185L084o75M679l877q395P007M552j532j276n683N541P148o964
$$ 6393 -1443 -3628 -544 -1219 3460 -417 -8812 -1805 2747 1215 -61 -5744 -203 6945 -19
458a9J54L539m301K752k28j708L484o551k864Q767j404m161k950q93J1120K00
$$ -19 135 3674 -627 2125 1897 189 3673 -2878 -5742 3025 1621 -2540 -5490 -6383 4737 4937
474D937j2548M172P326o22j72m640K935M710q360J908O600o771k612j61K324O804
$$ 4937 -7611 -3439 3887 3265 3093 -1547 1388 6098 -2262 -354 6246 -525 -3137 -3298 -974 5830
490E830r558p579J2296L804n266l628j073J0562J284j0863M925N006n024J293
$$ 5830 -3728 -11307 989 4793 -473 -4101 -5174 5388 6672 -4191 734 5740 716 2009
504B009j817Q60L599r048p49Q547l538l182j551P43R737n191r235R936M401m069
$$ 2009 192 1052 4651 -4397 -5146 3401 -137 -3319 -4870 -4127 5610 419 -8816 1120 5521 1452
520A452j148k416O859K258j1453K595Q090m391m364l328M232R130j1328p027J2558
$$ 1452 304 -2112 4747 7005 -4448 -1853 6237 1846 -2518 -5846 -1614 7516 -3812 -10839 1719
535A719K148n009k496N28R877l322r409R354L633q470j1J844M512n62j3474M606
$$ 1719 3867 -1142 -3638 -3110 6767 3445 -5964 3390 7023 -1447 -1458 386 4898 4336 -9138 -4532
551d532J2342o646p022k97N231Q285r208o242J1452P35m279J202k155L960P14
$$ -4532 7810 1164 -5858 -6155 -924 7361 -1847 -8089 3363 4098 -181 1021 -1134 2826 3540
566C540o942N236J881o578J293K64J833K966r710M85J1072l649n027K91K629P810
$$ 3540 -3402 1834 3715 -2863 -1570 -1306 527 3493 -6217 -5732 5340 1691 -3336 -3045 -416 7394
582G394n705q987R138M092m931k223k431O090K498j0368K293P335m940k000Q25
$$ 7394 1689 -7298 1840 5932 1001 -1222 -3653 2437 4935 -5433 -3140 4195 -745 -2745 -1920
597a920K604K878p569L73J0776n509o077L806K702L004n504o669R165K806p130
$$ -1920 684 3562 -4007 -3634 7142 1633 -4444 -638 2064 5068 -436 -7105 2060 4866 -2264
612b264m5J14L347K184p381K286N471n084J219K213k339J918k372j110N807l545
$$ -2264 -2309 -2195 1152 3336 -4045 -1759 3712 -1372 -153 2060 -279 1639 -733 -1843 3964 419
628D19l065K323j445L247J79o521L859L603l123R41j139O09L501m648R18M534
$$ 419 -2646 -323 -1768 1479 1658 -4863 -1004 2599 -524 417 -722 -113 3388 -1260 -342 4192
644D192m760j007J943m43K842m403m489P360J248m056m10q32M241J724n206K493
$$ 4192 -568 -1575 368 -75 2767 -1636 -6125 1235 2483 -1573 -1983 -2815 1426 3150 -2056 437
660D37J692l099L589K42l620P56j643K468K953o724j492M066k2J721k840l570
$$ 437 2129 -970 2619 2861 -759 -3 -1646 822 3775 -2949 -4441 -375 -397 1324 -1516 -5086
676e086O190J438k587J206k706K028M198l612n66n2k021M716j441n305K471n42
$$ -5086 1104 2542 -45 1161 -1545 483 4681 1069 503 451 -1570 3146 1705 -3600 -1129 -1671
692a671J30L060m103m86L243r34K617q33l623N254N74k975J999k695O41L587m530
$$ -1671 -1541 1519 -2584 -3070 173 -761 1856 1023 -2600 2654 3228 253 2252 -443 198 3785 -745
709g45p90J768k799K463l47l332L421p59p69L677l037J21M552k617L62R50k664
$$ -745 -1535 233 -2566 -103 -450 -3782 -361 -1120 -1889 1788 -1249 -1128 3424 807 1169 2119 -545
726e45L345o13l919L101k010j419L388m030j21L202k782J556J054k616L548P1
$$ -545 2800 2187 -1732 1369 -641 -2060 1328 -2702 -2823 379 -2403 -847 207 -2409 1139 1210
742A210j823L520k212p33M090l864j56K472m457J698O74l343K943r68k132L557
$$ 1210 -613 2907 695 -38 4052 188 32 2504 -1953 -255 419 -2924 19 -949 -3081 476
758D76k027k80L821l480J342L204l736K114M89k799L635j373k792K761k876J61
$$ 476 -1551 -1831 1990 -1490 -148 3056 -680 1434 1923 -876 2759 1386 -1406 1355 -1521 -1360
774a360L260m498N35K554k887K870J16l293M108m23j262K867l276N98L764m258
$$ -1360 1900 -2598 -2063 491 -2396 474 590 -2703 1405 982 -280 2587 -689 -91 3673 -585
790e85O01J392l869L290K90l697K775j227q45L646l495M29L393l177J879J048
$$ -585 16 1408 -2461 829 1119 -2578 197 -1030 -1875 1771 -1724 -1295 2098 -1079 800 1848
806A848l840L595N96l362K756k105q99L350l448K00K531l523K496R90l692L167
$$ 1848 -1992 1603 2199 -1163 1593 -512 -1411 1939 -1509 -1309 1222 -2301 195 1185 -2507 660
822F60M79k276L110k426n98L920l320K21J777l567K486Q03l745K884n25j959L679
$$ 660 1139 -1137 1973 -453 -1051 2869 -451 -230 1547 -2020 466 1269 -2476 408 -117 -2076 1603
839A603j883j171L044k079J439R67l883K906Q53l281L026j297k467L130j905J29
$$ 1603 -280 -1451 1593 -486 953 1920 -1963 943 1796 -1485 1541 244 -2223 907 -998 -869
855h69K076l475J564K126k784K267j31k020L704j544j443K717l009j78L033k518
$$ -869 1207 -2268 -704 1422 -1362 905 774 -1246 2458 914 -529 2188 -821 -999 2034 -484
871d84O8j35k135L642p52l051L408j112o40L266j868m00J285j736L312j56m637
$$ -484 -416 -551 -2686 956 204 -2847 561 -551 -1191 2075 207 -193 1092 -644 2668 2512 -2125
888b125K553J038j674J035l130J30L201k847O52J927l046J340J736j85J631l031
$$ -2125 428 1466 -208 827 -2303 -2173 1028 -1819 -1167 760 -2286 -946 790 605 2236 -795
904g95n61N419k114k484J267j424K014K07l805J720p25j267L544j524j859J945
$$ -795 -1356 4063 1949 -535 732 -692 1322 1529 -2276 -556 -1281 -2548 996 -528 -2387 -442
920d42j030J901K331l500Q27J446r08K798j861l692K880K21J55q58m490K678L651
$$ -442 -1472 429 2760 -740 87 1533 625 3423 1562 -2130 750 971 1126 268 -4222 -1544 2107
937B107m182M47R53r81J850m20J127K242n208M36O565j755l460j481J076N022
$$ 2107 -2075 -1628 -675 -1656 194 -226 901 3143 -2065 -1629 4936 3181 -279 -1760 -684 4338
953D338l344n878M036J547j913N04j486J560M47l032M854K450n936M86L041J078
$$ 4338 994 -4884 -848 699 -1214 -710 -2196 -636 -189 -3221 1633 4083 -1853 -1367 1674 2752
969B752R66n574l50N509k132j725j15k543L483Q68l682K135n70j014L496j184
$$ 2752 3718 -1856 -2206 3303 1171 -554 -669 -3212 271 1139 -2543 -408 -978 -1992 1504 320
985C20j45J648l845K142M115l094j297j736J084N700m347n817M641K170j273j447
$$ 320 175 1823 -2022 120 4235 1141 -156 -1892 -808 4892 545 -5272 -631 1539 266 -1181
1001a181k148M432L42n154M844K708n210n60K286L667q4q444J695P844l323m214
$$ -1181 -3329 1103 1445 -3709 1135 3843 -1367 -1927 359 4026 3942 -4502 -2807 5037 1714 -2500
1017b500K05J439L805l625k867N350j575l015M016L66p55j418k043N549R52o181
$$ -2500 -2295 -856 2949 -676 -3543 1807 232 -2783 1233 1599 844 -574 -2617 2932 3884 -2297
1033b297J050J294K01K321m023j802M241p98J03J30l214L647J236l757K620n1
$$ -2297 -1247 47 248 2569 -1454 -3256 985 187 290 420 -2794 853 2089 -1668 952 901
1049I01k067J843j077J756J096o352J439O129k626k956q14K221M637n068l005
$$ 901 -1166 677 -400 1356 2452 -3900 -2461 3668 1042 -1914 -2728 -507 4130 -938 -3943
1064c943O409n23l365J522O26J311k376l216O191M85o757J201L008R04q16m601
$$ -3943 2466 1943 -1422 100 726 2037 -339 -3555 2636 3121 -3636 -2435 573 1477 661 -3940
1080c940K945M260m223k23K891j872O86j81j54K239l401r22M635k539j683J329
$$ -3940 -995 3265 -958 -1181 1710 -162 524 343 189 2428 -973 -1895 2740 201 -1482 -153
1096a53j823J820P52k362J864j076o23M340j885k664L094m24P06p70k325L160
$$ -153 -1976 -156 596 -1766 98 -978 -1601 2739 854 -1810 1284 860 1566 796 -1529 1631
1112A631k60l858K985M82k983O46o6K196K17m778K689M501l723n65J688P05N48
$$ 1631 1371 -2487 498 980 -2003 -1357 -1423 773 990 -3788 -1099 3402 -321 -886 802 1507 2055
1129B055k735M90L799l947j626L292j177r96q82k44L544k053l109M344J37k091
$$ 2055 -680 -190 3609 -338 -1964 1328 151 -845 -1727 -1971 1573 -480 -3589 755 892 -1199
1145a199J560P4J205m10k407L365M74m282J950J177j930j1j262J043J457l593
$$ -1199 361 435 1640 1230 -1177 2188 2662 -1620 330 1507 -423 -434 -1696 -653 804 -2789
1161b789J320K766l214R97J705k37Q73j872L46L394k865j348K824j291p57j74
$$ -2789 -1469 1297 -1917 -920 785 548 1421 -451 -105 3289 424 -924 1900 609 -148 -322
1177c22r69K274k007k142M148j069k728K550N58L62l82j697L315M52l789K473
$$ -322 -1291 983 -1024 -3166 982 -87 -2815 -265 293 655 273 -1424 1891 2343 -1446 1027
1193A027J373k426L31p96N25J022l622J428K600l375L47J502j90J053j871L25
$$ 1027 2400 -26 305 -491 34 1056 -2566 -1138 1462 -1913 -1566 -64 -254 799 -1072 -747
1209g47L632k787j209L425j388o21M2p79K050j827k337L853j033k765K199k05
$$ -747 2885 98 -1111 2314 926 305 347 -432 1618 -209 -2546 1307 274 -2491 -292 -497
1225d97K35O16j898K451R06l512K487J001k001Q52p21M16J127l325J254K593l480
$$ -497 -262 354 -1544 907 1813 -1699 788 1789 -212 640 -81 335 1462 -1863 -609 1984 -1496
1242a496K31J595j378J345j152o4L213k907q67L709j716j012J175r94J540r07
$$ -1496 -1265 330 -1048 297 -855 -919 2294 -613 -1480 2229 513 -499 676 -318 1222 315
1258C15k429L386o83k554K277j89m16O81j930K296J102l885K163J680k444P46
$$ 315 -2114 1272 589 -1965 312 123 -293 388 -1542 754 1856 -2029 134 1814 -630 116
1274A16K1l53J659k908N14K847l362K67K002j503Q95n33o12K764j745j437L289
$$ 116 137 -216 1443 -1465 -951 1896 -1466 -1199 803 -700 195 -338 -950 1814 69 -1368 1921
1291A921j576q86J458j377J239k41k615K705k66k389K268n6j032J327j556J381
$$ 1921 345 -541 917 -460 779 538 -2077 628 362 -2027 241 185 -847 480 -1076 305
1307C05J334k831J752J313k643J605J24j246J305j950J50K092l041K40K265j923
$$ 305 1639 -1192 560 1873 -770 835 959 -287 1018 -932 -782 1310 -1731 -1491 774 -1149
1323a149Q65J65r59K542r49j626L003r86j201J639j283O64J51k366K060j91k423
$$ -1149 -284 -119 -1078 1464 515 -1111 1892 906 -295 1344 61 725 876 -1490 570 379 -2044
1340b044J948j08j105J357j107N22J822k261J477J115j894J360J28j402J787j253
$$ -2044 -96 -204 -1309 48 -1059 -537 1285 -976 501 1616 -278 1082 1210 -192 1595 342
1356C42r69J816k124j50J589j869N97M34j129J736k99j115K647r98q17J709q67
$$ 342 -627 1189 -935 -1085 504 -1365 -768 -334 -1463 273 -26 -1141 1506 508 -309 1400 533
1373E33J16Q48j982J352n1k103J451l24j194J253j097K25J463j814P49J433j116
$$ 533 649 1497 -485 867 816 -1287 164 -160 -1354 -101 -1198 -973 490 -1324 -575 858 -258
1390b58J039P3j288J995n51q77J243j603L0Q68j769P05M98j728R61J95n36J497
$$ -258 781 854 -434 1561 1010 133 1376 -227 -197 671 -1098 -393 105 -1623 -662 -467 -1003 494
1408D94j116p9K252j459j90J419j118R76l05j597J736m86j685J314p39k17J098
$$ 494 -622 -701 1551 92 -98 1321 203 1179 874 -723 1013 527 -1158 156 -583 -800 298
1425B98j897R37J356j642P23N86q09J703j145o18K280j215r76J197j252J070j08
$$ 298 -1599 -662 694 -948 -225 361 -448 1255 110 -508 1772 557 -419 778 -474 596 488
1442D88k288J866L60j744Q32k1K95J114k168P83K077j963kJ234o68J147j452j389
$$ 488 -1800 66 426 -1318 -486 -507 -212 902 -1266 -483 1594 -369 -371 863 195 1342 -110 -1499
1460a499L021r80j629J171o90P66Qk059K215Q95k273R06O03m87J193j753L03J884
$$ -1499 1522 542 -1087 84 -606 160 168 -1891 324 1219 -1054 -148 455 -32 1161 -592 -289 1595
1478A595j818k39R72j238J270o20j658K381j69j647J218k16N62O69k299J543J551
$$ 1595 -223 -462 510 -728 542 -78 -1736 645 476 -1171 47 -169 393 1062 -1237 306 1857
1495A857k517M57M97m83J208j865n40K854j493j142J322m15R03m21j898K904K90
$$ 1857 -660 -203 294 -189 1019 -846 -1386 1468 -25 -1167 155 -260 643 222 -1676 1228 1518
1512A518k659J382L73r3M25k353J337J770k871K19J222o74O85j127k57K603j432
$$ 1518 -1141 241 614 521 946 -1407 -70 1700 -1171 -952 270 -404 281 -846 -1103 1500 68
1529F8j209J977m55j8K41j538J927K10k314J476k07q61J091j346j12J878j669
$$ 68 -1141 836 381 363 604 -934 993 1203 -1111 365 158 -703 388 -958 -1070 808 -861
1546h61L7J141p74J267l87j410K356l32j581J286l83L36K07k326J285J271k508
$$ -861 -824 317 -457 810 423 -987 1369 1037 -544 742 359 695 902 -1424 -139 1132 -1376
1563a376L07P91l81Q57j308J99K447j696o33J813l22L6j82r67K156r34k145J872
$$ -1376 -1069 -278 -659 198 -1110 -911 1536 -160 -793 1020 698 734 552 -415 1741 807 -1338 534
1581E34m70p35M77j000O56P87k039J435J089j146R22p8k58J254j225k77J582j569
$$ 534 64 -671 -194 -1194 -538 249 -1790 -355 734 -412 510 432 174 1428 203 -74 1508 -61
1599f1J59P31j526O29K17j057O87m66m71J593j303J08J938j426J09R47p85J076
$$ -61 98 829 -697 -68 149 -908 -221 -687 -1158 435 -868 -760 1178 -248 -139 808 23 1099
1617A099m14j135J912r85j267R27l36m2k3j343J430N75k018J207Q94q45O18l75
$$ 1099 685 -450 1462 477 -790 137 -199 -241 -264 -1607 -177 398 -1620 -413 481 -364 254 -121
1635a21N82J071j795K89J504j699K37J81o98R68r89p66J734j100p52J598n69L98
$$ -121 461 1532 -263 26 1530 -169 68 249 -449 519 -470 -1236 498 -602 -1354 244 -325 73
1653G3J21o29J174j43j145J415o3j218J058p23L5M44j375J019K52j614J100N57
$$ 73 194 -435 739 596 -549 866 803 -415 643 -80 -45 399 -976 43 295 -1319 -219 338
1671C38j112R09k38P0J012j476N05J370j746K26Q01p87N53o94m07J527j337o25
$$ 338 -774 135 -103 -33 979 -497 8 1378 -368 -142 659 -128 425 -269 -676 851 -486 -1111
1689a111J609n66m01N64m96J144m40j110J695k04j270Q64m21J5M83j182Q99L97
$$ -1111 498 -68 -469 95 -401 743 303 -807 888 684 -586 278 -143 -128 355 -827 72 469
1707D69j651R97N81j078Q75m13q4J276j350M5J435j503K48Q07r31N78m71o44J648
$$ 469 -1182 -185 396 -682 193 -220 -304 972 -378 -333 1102 -401 -153 654 -277 301 -170 -814 834
1726H34j286o43J523p15j30Q02o63Q70n3j249J475j29j213J150l03n07N26j199
$$ 834 -452 -1095 428 -287 -417 385 -278 592 539 -710 765 636 -577 573 270 -237 289 -910
1744i10Q33O28j843R97P11j163R16k72RJ140j305J03J532j542N1J121j317M44
$$ -910 -77 551 -1292 -295 416 -747 169 -103 -94 1046 -259 -156 1376 -166 -115 1006 -311 133
1762A33j66p85J312r94n81J507q32k41R89r43R30L60j432J780l4j437J138j29
$$ 133 -33 -818 494 -500 -1081 426 -406 -647 342 -601 329 689 -743 1037 1003 -434 704 575
1780E75n22N19j067L39Q00j989N02J172j258L92J73j65J090q41n2J501j146r0
$$ 575 53 572 -495 -156 644 -1345 -843 329 -929 -537 -364 -529 561 -280 -332 1169 23 -67
1798f7J255j166M15J02r24Q93n56j038J472q62n18R82p22M99N53j131J269L92
$$ -67 1188 22 437 539 -385 508 -48 -1086 386 -476 -994 -12 -734 -235 318 -813 456 848
1816H48j303J041M84j086P62o86J26Q19j817M04J011j441J65L54m43Q48n83l37
$$ 848 -455 586 1070 -16 746 60 186 1005 -812 -408 603 -838 -673 -319 -762 86 -497 -834
1834h34J707r06k09J180q55M82J9r19J346m83j282J417o26p74P44n79M2O58r41
$$ -834 873 -33 -242 938 83 565 584 -335 1011 528 -754 663 37 -737 7 -572 -530 128 -813
1853h13Q20L01j121J131L25p97J018m64k72P31j132L27R74j694L82K59m87N96
$$ -813 7 308 -813 318 643 -154 864 400 128 859 -273 54 1028 -666 -284 -25 -512 84
1871H4m92l77J449j063m61J540p83K28J39m64J043n25r22J324l75o86N12m42j78
$$ 84 -408 -785 664 -399 -860 680 -103 125 264 -200 843 318 -604 720 345 -341 171 -271 -449
1890d49P64j145P58M01q30N30O4n24J030n84q5R47j094K02O15q59K58M20r82M37
$$ -449 315 -830 -72 329 -501 29 93 -431 599 15 -70 877 -217 -15 600 -259 -1 419 -563 -126
1910a26J0m08R96j008m4J179p91p7O62n96P21k08q22J085m26r08J156k02l33K93
$$ -126 -116 -524 472 -536 -580 599 -192 -269 393 -203 518 310 -512 573 147 -761 395 193 -140 153
1930A53r45R31M94j399O06O31n90N30p46J74J046r90q1O82q62M17j9p46J201m52
$$ 153 -792 139 633 -766 -160 471 -119 411 -335 -161 885 -105 -186 496 -366 51 32 -714 487 35
1950C5j077J239j47k29N12q26O91Q63j389N06L36n91N82n34o63J327r62m00P39
$$ 35 -1042 197 50 -179 333 -493 198 1061 -328 178 514 -77 505 -29 -692 635 -327 -727 12
1969A2l11oM6o30J350J5j460J248J01m01Q93j174M67R40j536K45N40r82O82l01
$$ 12 -299 -305 -259 -889 461 476 -984 264 365 -36 857 -317 150 1090 -446 -201 339 -643 39 -262
1989b62o92J320p36o33J164lk43M69p70R06N00j470Q51M56q57M84p79j44J125
$$ -262 -954 366 -370 -1003 161 158 -85 384 -386 520 1020 -450 401 857 0 484 -295 -439 686
2008F86j319m51J204p86K36J60o51J511k87j068J474n2m22M05q80P67L33j435
$$ 686 -633 -1084 120 -666 -430 -270 -921 590 303 -765 709 657 235 640 -240 527 860 -575
2026e75O98K71j105N81m38p4R12r81l1J322o84p8P03o93Q97J8r31R73l70o76Q16
$$ -575 123 394 -711 -130 -568 -642 270 -711 -742 580 -104 -182 521 -172 725 743 -188 785 415 -261 555
2047E55r33J79N55r61J65L76q33P91j05o81J606n90o70J215k14k11N24j018P39
$$ 555 -378 -199 356 -605 -440 -64 -897 -106 -211 -892 714 124 -546 669 455 244 768 -250 489
2066D89L92j644P92J24p19L58n95N72N28j344P32J023j056K20K98r1N93n40m77
$$ 489 881 -763 29 153 -566 -208 -803 -231 297 -1047 -315 708 -348 -128 170 79 672 132 -345
2085c45J300n24o64M52n12J95J96r05Q96j3q86R30j94k96O02n34L84M29p15M92
$$ -345 955 431 -233 219 -293 -98 98 -807 89 76 -810 120 -74 -370 232 -302 82 511 -204 288
2105B88M82j189O54J60p65M98l6m61O30q76L14R94j249L39M76l37M08m72j38J095
$$ 288 770 -419 235 395 -370 128 92 -369 261 -615 -301 693 -556 -217 259 -78 330 -142 -280 815
2125H15r00m63J242n00k80M5m69Q08Oj171J019K15q38O73k66M5N49j004N23P23
$$ 815 -85 -548 694 194 -86 -41 -510 298 304 -867 152 367 -471 202 -64 -19 530 -474 49 772
2145G72j170L62K92q60Q61n11j55Q57j080J88Q93q21J89M06n38O23k13l18R80
$$ 772 -398 -36 256 -604 257 -254 -409 448 -632 -444 449 -372 -183 223 -315 308 95 -223 757
2164G57q06l78R89o06j12K60m05O08k79q40J173l3r00Q67j4k98L74o65P32M31
$$ 757 -49 -427 562 -44 -156 104 -301 307 28 -812 361 328 -572 295 281 -17 357 -308 424 855
2184H55j194M88L95r36L45J5m26R09j000j46J123q45J46N28m18M61j44o21J307
$$ 855 -339 149 544 -392 -47 -32 -458 451 -549 -695 428 -417 -271 257 -161 300 156 -465 842
2203H42n25o89R84m73m52N35q81O39o1o70P37k1q70Q36J25k95P03p06N37M57j053
$$ 842 317 -372 612 139 -313 222 -659 -20 -81 -751 -14 -35 -905 -69 56 -239 464 -242 295 752 -301
2224c01O19N23j107M04j51l24P10j006K6J014r77k7Q98n07L54j63k88J048k64
$$ -301 318 841 -266 138 -13 -337 373 -633 -607 407 -570 -597 301 -206 148 -15 -303 745 481
2243D81p39J067l62n38L88n00J63K46j011O93L19j096M77K22l24N22m20L12O64
$$ 481 -258 809 447 -91 297 -203 -40 206 -805 -112 207 -889 -412 -190 -514 8 -412 -100 564
2262E64r86O03R23j228L78M3m63O27o56l26J169j276k3Q32o83K00K93m96N91l0
$$ 564 -422 181 1104 -124 254 297 -166 461 -195 -521 648 -628 -651 181 -502 -302 -9 -505 86 56
2282E6o56J314m52k19M21l92J95K86j137R13J24j054M66J42o93O86m68J78P62
$$ 56 -600 714 262 43 464 72 267 553 -584 329 453 -601 -135 7 -686 0 -468 -290 472
2301D72r30L94P88r47N02L04q10P78m71l01Q51q04k64Q35p94K2M04n60Q75l45
$$ 472 -458 -64 724 -223 279 583 -227 551 80 -221 630 -174 -438 397 -397 -375 29 -531 344 -1
2321an74R89k10n98J034n75J23K56q29N87K63j087N70J57m58L81l52j5O72o90
$$ -1 -575 414 204 -394 640 65 188 444 -385 202 465 -622 -52 105 -353 28 -324 -339 333 -357
2341c57k0P39p15L87K75m90N58k05m51P09n81K9O53q96J26L48l77L95L0m36N71
$$ -357 -377 362 -353 34 309 -181 377 172 -279 430 -151 -122 531 -365 -239 109 -268 127 157 -279 292
2362B92j76m49O79m11K5K95n62M82K63r95M97L90p58L80q2j91O72q49K24Q48p69
$$ 292 116 -333 346 -65 -40 255 -307 175 438 -557 -60 330 -428 -48 -130 -321 351 -498 -274 574 -195
2383a95J65L51m40M65k39m79R49n79l12O75n68J86J23o51N84K10n72P60j94l07
$$ -195 -30 321 -119 346 107 -372 577 -2 -314 361 -207 -21 102 -549 35 245 -327 433 239 -68
2403f8P31p29l8N62l83OJ81p36N30J03q71P17n5k48J96l91L52O05p78K21O19n05
$$ -68 663 -66 -104 458 75 81 262 -474 56 159 -712 5 -50 -298 -102 -493 -141 464 -314 -93 526 21
2425B1M33k34m06R11o77n23R26n70j93M28o90N05Kp00R63K1k63Q2p5J72O20q27
$$ 21 454 220 -186 725 48 -475 451 -119 -312 116 -574 -69 -67 -767 196 217 -46 36 -39 133 753 -74
2447g4J37N22n50K10k65k78M70l66n37Q69l20l06M49n10O35J62o20N74L43m58
$$ -74 63 585 35 245 -20 -298 172 -194 -731 138 -182 -488 -39 -549 86 248 -372 202 545 87
2467H7L93k99k62O93p10l20P40o00K15o4n30P20J0q99R25%k79M77k94K03N56q75
$$ 87 480 181 -81 612 -98 -418 322 -278 -63 -127 -657 63 73 -826 99 99 -180 297 3 206 762 -113
2489a13L82Q3n23M09k00l92O05o27j80N54l68J39L47o50O59K99q96P94J36n06
$$ -113 269 352 -171 238 38 -354 251 -376 -556 -2 -370 -231 116 -534 125 424 -472 322 458 -48
2509d8L75k59p4P23r70O5O34n89K2P0n69O82l18l09Q73l96n7M16l27M17J18p19
$$ -48 327 68 -6 717 -253 -188 446 -143 -121 -51 -620 62 -256 -565 308 -88 -145 271 -56 361 479 -240
2531b40N72K6m78L87m71n0M99p06J77N62o44K70J51m16M36O4m62P32j19m25M28
$$ -240 332 358 -120 267 -204 -254 245 -461 -284 278 -366 -96 55 -361 75 139 -323 409 290 -135 293
2552B93n25K17N91r27J53L85n74L58j18j29O14m21l40P34j81j54K52m20N10k09
$$ 293 -232 -15 576 -351 -198 187 -387 -29 -147 -276 338 -83 -423 311 130 -24 228 -192 318 109
2572A09n88Q97l48k59K62l57J20L90o36K92L84n94L03Q4k21N61k43k48N49n79
$$ 109 -479 418 70 -189 73 -284 -164 226 -410 -118 266 -328 -25 59 -162 399 156 -92 457 -122
2592a22j35N82n18P1K81n17M52l16j01M89k45j15O14m27j31N05m01K48j31n66
$$ -122 -257 325 -193 -122 159 -358 94 -222 -323 166 -79 -194 420 -7 -138 367 -34 214 83 -483
2612d83P46k13m36M08m3j37K48m86J80M51o32L45K76k29J31K1o6M83p77O6O10
$$ -483 263 50 -386 22 -21 -158 90 -396 -216 235 -397 -52 224 -5 126 147 81 564 -213 -147 463
2633D63n93j22L21n37O45k65m77P80j69l39M84j31l2L80n13K86J61n27M44j97
$$ 463 -130 -252 69 -468 177 -88 -565 215 46 -293 191 60 28 408 -105 181 342 -185 259 62
2653F2l32M07l42j55M26l53J8K42l89L80K03m67L17J91j01L50l64j85Q09n42k40
$$ 62 -270 137 -205 -360 66 -287 -269 -27 -416 -36 167 -300 17 208 107 457 93 -92 717 175 -65
2674f5L67m53L24m31j86O52n76k25Q33l11p7L32k83R2L70n72O29J53o78L37k13
$$ -65 302 -151 173 -258 -444 208 -368 -593 240 -71 -148 184 -99 -7 363 -209 420 573 -105 232 19
2695A9j68N36q94K08N12o86M18J94p04N14P4k15M00k94K33N21m34j94N33m74P1
$$ 19 -149 387 -507 -299 213 -473 -55 139 -565 -51 23 -192 208 -86 147 668 234 40 573 99 170
2716A70Rm04L77l78k89N73k06k58N66l00R9J22k04J84L74p12L95K12l68L04l58
$$ 170 179 -225 152 -226 -515 58 -148 -406 160 -140 -41 81 -123 61 435 -277 118 330 -38 266 -92
2737i2R0L84p76J18N50p17K44R4k90N94n51J7O78m63J15L10m03L87j22m36O64
$$ -92 -2 382 -394 -276 274 -443 -199 -105 -395 199 -352 -335 343 -120 -5 305 -98 289 167 -269 395
2758C95l00n20O33l62r5L10k65L19Qo39O19J18m78N26P8l44J03k04J4L63o38J88
$$ 395 95 -425 208 -154 -249 61 -204 115 123 -516 103 221 -257 269 347 3 106 -98 -84 279 -359 -171
2780a71M19o23K34K39m04M19k94j63P23k72l11N34m11J27J25m21N46j70n19O11
$$ -171 248 -375 -141 98 -306 113 -181 -344 379 107 -204 330 -81 46 171 -250 296 126 -393 218
2800B18j03l69L82l01lM78n08J94L08n81M36J24l86K05k11L4L50n63R3M63l97
$$ 218 115 -254 128 -173 -176 302 -206 -12 296 -285 151 275 -111 94 -117 -83 267 -296 -203 260 -137
2821a37m7K62j19J93j16l30O14l03k61M35p2p0J58m78L67R4n44M30l3l17N31m64
$$ -137 -184 78 -41 152 36 -294 320 17 -244 191 119 49 207 -271 96 190 -354 76 43 -274 257 -207
2843b07J20L48l81J66K18m20K70J87m10N16k29k26L21l04o0L93q28K01M35l39
$$ -207 -87 261 -120 46 264 -156 114 301 -109 407 178 -48 273 -31 -91 302 -526 -325 110 -229
2863b29J58j17L4M10l05j85O45k31j09K78k82O8l6n14M04J85n43L67j82o7K66
$$ -229 -71 -188 -154 256 -49 -234 411 180 71 349 67 135 99 -415 -11 174 -369 -2 -184 -251 15
2884A5m04K50M06n72M22J86k59K95j75k06O15l13m32L79k71J51O0o41L58L1k01
$$ 15 -389 -139 267 -305 117 303 44 339 164 -42 573 260 -172 207 -64 87 147 -494 -136 -105 -306
2905c06L52j64j97N28k06M0J28q3J20nk51M11k45l77L76j9m34J67n1k4J41m27
$$ -306 46 -118 -315 213 7 47 175 92 212 207 -44 367 122 -255 121 102 -332 -165 -216 -240 -99 -526
2927e26M71J50j77N3K20k16K97j99o2L01j97k77J96k74J26K28n31L87J44m57L97
$$ -526 -55 95 -82 -29 191 -25 272 73 11 312 115 -162 34 -240 -114 114 -417 -30 114 -343 54
2948E4j51q1K94l16M06J78n08K52J07k61K68k52k43M63l39k04L71m51M58N8l38
$$ 54 -97 -178 116 -200 206 384 -124 128 235 -26 242 -10 -253 210 -129 -333 38 -413 45 103 -235
2969b35J08K19j80L58k75K3N37o57m2O05m69JR8l55L96m39M5O55l36m14L16j25
$$ -235 -127 92 -88 270 -5 18 555 -102 -144 461 -8 -7 91 -264 132 -307 -262 393 57 -357 -41 -166
2991a66K98J18l70J36K10k85J19j27L3L78l72j71L66k93J14p7k40N14k30k22M17
$$ -166 132 250 -120 16 226 -59 60 -67 -34 344 -28 -199 167 -126 -12 -89 -329 185 -45 -267 150
3012A50N4l04M98n44l4N87n36J46K33k50Qj24j92L81j14l98O43k04N6M7j37K04
$$ 150 204 -100 398 -146 -180 407 -129 17 250 0 8 -116 -308 73 -41 -439 204 0 56 103 -34 170
3034A70J77o13N31j95j45K03k03j14M47n65K07L44m01J51n1j90N02j92o9M61l49
$$ 170 347 -266 265 70 -75 128 -75 -189 258 -307 -100 244 -157 -6 -57 -247 255 63 -6 455 106
3055A06J5J54k77J65M8l87M9P9k37M22j41k27L87k59LK38k58P6J52j71K34O8l83
$$ 106 121 275 -2 163 211 -176 -127 -48 -285 137 -4 -231 156 -103 -100 138 -120 -44 108 -63 171 239 -144
3078a44J08k2l6J71l12J92Q8k86p9M98l06K07m6N1J37j67k9M65n03J78K7l81J93
$$ -144 -36 -58 -94 77 -235 -43 45 -241 -320 178 -128 79 33 84 221 54 25 490 -13 165 192 -189 4
3101DJ58m89J79Q4k55M27j57k68O42m95J12M12k84L1K6j70M47k56l05L39j97p7
$$ 4 162 -327 -148 -64 -319 108 -49 -317 325 -170 -58 354 70 101 127 -43 404 148 -157 182 -15 -92
3123i2R4l38J30L48m33J94J42j66K10mk96O33o33K5N39m36K96j17j87N5r3r0K17
$$ -92 2 -336 -206 142 -291 -97 45 -121 89 85 -211 422 -211 -186 353 -83 213 96 -91 -36 -129 -219 -2
3146bk90k0L08k32rL86m69N16l5k89L75j3r4J07m4l52L50l98J80P2k57K47j62
$$ -2 -292 -312 -4 -236 -245 141 -328 188 153 -136 239 226 132 239 195 -157 193 -205 -25 47 -210 37 -125
3169a25o8J19m6j72N09k74oM80m95K04J99l98J84j6j50K54k50k24L56q0k17K86
$$ -125 -193 -74 -120 -292 217 -57 -63 417 -78 126 325 -73 111 95 -55 199 -51 -275 81 1 -216 70
3191G0k35J15J86m56N79j12k49L89k56J56J23m16J71j0j64K51q5l54K35Q4k84
$$ 70 -165 -50 136 -320 259 147 -102 287 31 187 310 -106 65 55 -109 142 57 -297 -62 22 -262
3212b62N48m23J72K25m60K33J70m20J79J82k51J62j36p1L19k91o6L92l24J49J04
$$ -262 286 -137 35 260 -200 33 203 -217 -38 144 -107 55 -81 -152 167 -124 -190 202 -122 27 131
3233A31l31L30J19k60J73k37r8K67j05P9p2j25O8J94k99K09K2n5J54k00J13K70
$$ 131 -200 130 249 -11 162 -75 -173 94 -11 68 -4 -129 -61 133 -166 43 65 10 164 -36 77 347
3255C47m02JM1k25J24J45j61J61K7l84L28q0j64M24l60J00L23l76L38K0k71L84
$$ 347 -55 -54 -13 -238 -114 31 -130 31 58 -326 2 -78 -242 182 -178 -78 245 -131 207 227 -44 340
3277C40k43k86M12k60j86K46j76m4K78m45J77L35n29M25J5k07L90l68J71K15j90
$$ 340 97 -189 223 -37 -223 23 -153 -197 81 -364 -187 148 -381 44 59 -148 242 -126 45 260 70
3298G0R4l2k98M43l42m7K11j86k07J95K13l30J26o3L73k9l33N08k87l31L09Nj4
$$ 70 164 132 -166 277 -65 -112 99 -87 -294 -99 114 -216 -90 -153 220 191 -142 366 79 -252 57 62 48
3321D8J17m24Q2L05k41J73l8l93L50o6j93N11l02J05L96m72O3J21k96K14J49k18
$$ 48 165 -259 -177 128 -113 60 22 -371 -21 -87 -280 231 -71 34 430 -42 21 142 -154 60 209 -9
3343iK88l72o4J72k06K3K55k37J26l5k52M63Mk80K79O2k68K20j65L4K63l92J58
$$ -9 279 -93 -157 15 -191 -168 87 -150 -24 -59 -311 152 156 -124 155 217 -51 169 4 38 301 -91 67
3366F7k9k11J23J08k31J64k11N0K52j30j5L53k78J72m7k74M45k34j47J17j02k25
$$ 67 38 -173 -50 58 -173 -9 -220 -170 82 -48 -63 290 12 184 137 -137 308 74 -73 44 -58 -283
3388b83K44j8r2K15k61K31J7l25J41J78j7K25k64R1K04l33Q7J42l46K19j65RP8
$$ -283 -39 -57 -149 66 -195 36 53 -272 -131 47 30 255 -9 82 286 -47 40 182 -164 55 -110 -101 -23
3411b3J3j17J88m37K35K73j98J76j5m5L77m11j09L36k38j87K41j2k6L3k97L29
$$ -23 -10 -127 61 -376 -141 132 -66 110 95 50 427 16 -93 243 5 -182 59 47 21 54 -243 86
3433H6j5m8R6j00l0J06j94M9L20k61N9R1k17Q8J8j86K06n2k54L54j83J57J48l14
$$ 86 71 23 119 19 -11 95 -99 -50 270 9 68 159 -58 30 48 -138 68 16 -238 116 -67 90 238 -76
3457g6L2J51j67o8J71j74L21r6j54K25k86q7J98j76K41R6j96O4J04k86L22k66
$$ -76 -44 107 -60 -128 43 -131 190 94 -60 165 -121 -208 -10 -186 55 151 -45 19 123 -163 159 -107
3479a07R6M69n93J65J16l51K72j07r5J73j09j59K94j33M5J11l25L03O2k75J67
$$ -107 -11 458 -135 30 146 -205 67 -40 -135 38 -71 -230 64 -69 -24 87 -238 65 127 -148 19
3500A9j7p8K75j98j67J62j44J68o9j87J27J90l03K02J46k49M72k05j88L12l30
$$ 19 2 -76 199 1 -166 -4 -148 20 -49 -236 -109 81 -222 -20 126 -123 349 144 -44 268 -62
3521f2N5L41l72R3p9m2J28p3m8J3k58KL40j16k0K03k83L30l7k66K19L2j67J60
$$ -62 -7 334 -38 55 -24 -66 62 -11 -59 -46 -304 -302 38 -78 -98 105 -178 152 115 -151 68 100 -67 93
3545I3j52q2K22j07p5K61l55K26j27O0J46k68L1L09n3k20J57r1K14j15j20J56
$$ 93 -59 -141 81 -26 -101 160 -195 31 -96 -36 110 -158 -127 182 129 -91 66 -25 189 74 -46 110
3567A10q6j68L09k0k59J57l23J38K93l58J38J12j29L83j09j72J65J8j54R4j46
$$ 110 24 -144 165 145 -114 43 -280 -142 151 -207 -69 43 -86 297 188 16 181 199 45 139 -7
3588gK1R9k34J9J75j62K9q7n6L93k56J05P0Mn9J10j40K53l8k19J90k03r9J04j17
$$ -7 14 113 -121 -102 73 -89 -60 -147 -203 190 -66 39 109 113 54 164 24 277 239 20 210 7 -92 12 -105
3613a05J34P7k30j6L31m45L97j65n6K04j25k9K39j63N9P1l42N6K02k11K55O3k76
$$ -105 29 106 -124 -140 191 -254 143 -22 -78 126 1 -28 211 48 107 178 -164 -108 94 -117 138 201 -75
3636g5M9j25o4L57k45J70J07j25l8m4o4K09j41p6J79j43j2J56k92K87n9l31J51
$$ -75 -26 -151 -215 142 -103 67 174 49 11 -33 -97 112 -29 -105 74 -69 -81 75 -217 70 11 -320 -169
3659a69J26p2J00P1k22M48k73r0K42j68oJ20k93J65Oj6lK3L0J94l48P6J15j77
$$ -169 -43 -115 -15 56 -166 282 9 -81 161 -7 -13 107 -186 -21 -15 -31 -34 -11 19 213 -135 -59 56 -121
3683a21P7K01m18K76M4l26M73k33k4Op8J07L5j63J60Q2k05R0N5M7N5j34Kq4k02
$$ -121 -44 157 -261 15 59 -267 206 -27 -51 -45 -123 -16 19 -144 16 98 -107 -17 38 85 140 6 8 -76 -278
3708b78K04K34l99J66j03J86J56j23j59J23N1J5R1j33J20J56m06P7J34k71L33
$$ -278 -74 160 -239 -73 -176 10 166 43 -116 7 58 73 164 31 151 307 -99 -22 112 -159 174
3729A74j34j47K53k65qR9j45K15M1k20J86j6j43L43k21J14M1k26O5L9o0N2M5k95
$$ 174 40 -107 146 -119 -127 -28 -173 42 83 -137 49 33 -110 233 12 126 167 -59 6 45 -15 37 82 -213
3753b13K12j2q6N7j56M8L47k50M6J70j92MJ99l20K69j64j69K96Lm9Kj28L6J76
$$ -213 -1 -13 -99 -42 -198 -150 197 -53 -7 163 -29 -25 174 -146 123 -41 -210 86 89 40 42 -86 -50 126
3777A26k56RJ32O5Q0jl02J87J0j57J69n9P4l0j04OK9j52J0K99l59Q5N8L3K40m24
$$ 126 -130 -121 11 76 156 155 -147 40 50 -107 62 3 77 47 -57 -51 -22 -174 -164 135 -224 -139 -81 -48 192 -232
3803b32J71J84j74Q6MJ6J26j99n4J59k73J74M5m2O5L5k93K70k1o7J69Jn2J00k29
$$ -232 -61 123 -51 35 39 55 181 -18 -72 87 -186 -12 33 -9 56 91 -202 68 47 -20 149 150 98 198 -31
3828c1J11Qj46K32k77j8J47J6j34Q4j52J98K4j28R4K3MMn1L9K77k84RQ3k58j1
$$ -31 80 88 -58 174 -103 -121 26 42 -92 -8 -160 38 62 -66 28 51 55 59 8 47 324 40 49 132 -126 -137
3854a37K47j45K7p9J19P8m4k88K60r3J31J0j36K6K04j98J81o9j30o4J14l1j14
$$ -137 110 -35 -8 -87 32 110 66 -222 38 -55 76 86 -50 -24 180 -18 163 94 -36 -100 14 -17 -131
3877a31L9K03L1l20J37P2n6R4J9j7l2p5K1J26j38j78L27j53K4j28J25O2j64N8
$$ -131 -92 111 142 -178 -41 31 -25 69 88 71 39 -36 -15 111 -27 -205 122 -31 -7 -135 -10 52 -112 -54
3901e4J11n0q2K24l82O3J73j15J66O2r0n3mk7J22p4m1pq6K02K0j67O1K02l83L40
$$ -54 57 7 -75 149 -233 -170 3 -112 54 116 26 -27 -31 -58 64 -10 -51 -58 -144 58 78 -89 -28 174 -209 131
3927A31n7K5K1J6k45J37j11O2K0l1k8P3p0O2L1O7r5J48r4r3J5J37o2j27J69j9
$$ 131 74 99 120 136 -109 28 -83 -21 -1 -32 -60 13 -57 5 36 103 8 156 62 -31 -16 121 59 -68 101 82
3953H2j96J56O0k30N0k3K45o3q3O7N7j08J9L1n1R3K8j31K34j89m6j57R5J07j32
$$ 82 -114 42 102 -128 -78 -101 144 81 -2 65 122 14 33 64 13 106 134 3 237 48 2 -155 -60 47 -85
3978h5K1M9l0j59K08R5k73K65j37J10J00j01j39J14J03J3q8j63K49k58L8P2J40
$$ -85 -64 -15 -45 -204 4 99 -174 91 -46 64 164 63 -76 38 141 154 66 -97 152 -106 -68 4 144
4001A44j09k8j21J89rj57J67j21J34j99K58k31J14k53K64R4k38J18j38lK45n8
$$ 144 35 7 -114 75 66 -91 76 -45 89 -110 148 -83 31 -222 42 136 -102 16 -122 -125 120 62
4023F2m7J95k89J61m3j89M51k83njq8Q9J19l10O9J40q5JR6j05J63j08j34J68J84
$$ 62 15 210 -79 82 39 -150 301 18 13 12 -76 13 132 -178 -109 31 -54 -53 43 -62 101 -7 -141 27 211
4048B11j69o5J52k82J96JN5j82L8J00l3p6J46j22L3q4J53q2J30j57J80N5l91J83
$$ 211 42 -23 129 -153 43 44 99 -83 -45 55 22 -54 92 -30 3 -81 72 -10 120 -37 143 198 -193 -10
4072a0K63j88O5k10O5m0k7J46%k04jK40k88J77kL9J30j70j19K64q6M9k3j46L0
$$ -10 253 65 130 -80 -15 -55 -82 64 64 -140 -141 99 -189 -12 -14 25 155 -15 -134 130 44 93 70 -76 -46
4097d6q6L3K0J65k65K51j95lL59k39R9j56Q0R2p1j41O8N2j00O9r4O8J22k38Q9
$$ -46 -132 -99 -79 86 -179 72 -123 -126 233 -6 93 -63 17 109 38 -103 -35 17 -83 -14 -108 -40 82 -156 -67
4122f7J33q5K05k88LJ18Qn1J85j73N0K96l19O4j47j07K34q9p2R3N4j70K37l15
$$ -67 66 -19 186 -102 -99 19 27 -24 161 -12 38 334 15 79 -68 -175 59 -30 -102 -9 45 -125 112 -203
4146b03J88J45j40J2J7M4r4J23j31K56j53k49L17k15QK8j21K48r6j8J57j02j64
$$ -203 -15 130 -10 2 19 63 -31 92 -39 217 64 -185 132 -83 -75 -47 -168 80 -16 -34 123 21 -143
4169a43O1O0L4K68k17r1NQ3r5J2j53L18j67j60K26p7n4J64j00R2j05p0J14j02
$$ -143 -82 -22 12 280 63 -28 -23 60 -35 -23 -176 142 -25 -185 41 -36 -90 74 -26 66 -39 -109 5 -97
4193i7L4K05k76K23m5j53K03k02n1O0J43j38J98k61l7K40N0j47K9N6m2Nn5M7M3
$$ -97 -63 142 -134 89 44 -109 94 -108 -159 -99 44 -94 104 -157 -194 46 96 -51 -22 34 -8 -3 -58 -11 32
4218C2j7J78k20R8q9m8L9Nl9M1q2o5P9J81k52K57j88M7J42l3j03K9k0Q9q0j6K7
$$ 32 15 193 -27 71 -18 -66 -27 -22 -61 -20 -102 -167 -88 93 -159 98 -90 -43 99 66 -37 -8 -28 61 -19 -35 -8
4245hJ6J26j51j9j74L77j61l2J83k13K48r5k05Q2J33l50K99jM6q3j38M1k10K96
$$ -8 8 134 -17 -36 -210 167 6 -26 157 -56 192 97 -108 -26 107 -243 56 55 101 18 -120 -79 -289 7
4269GM8j09N7J2J4Rj42m7K37j56N7J48k8r4M6L2j10N3p4J20N5j47K6m3P9n0J0
$$ 7 55 -54 3 15 29 38 -104 -151 86 -70 -13 135 107 13 59 91 -19 34 -40 80 135 -12 14 -29 50 0 10
4296A0L3J21j73R4J3j73J05r0j45L09j04n1M1J8j76K10%k73L17p1jn1l3J1R8o2
$$ 10 43 164 -9 85 98 -75 30 -60 -205 104 0 -51 -10 8 -168 42 42 -231 86 15 14 -37 -70 -59 39 -23
4322b3j18m1J87r4m9J99j3M0j1j10R1p8P1j05N4N2R2m5q9J09j59P8qm6o3KJ94
$$ -23 -141 -182 5 -89 -138 61 48 88 77 -33 58 -20 51 -54 0 52 144 99 10 119 -40 38 30 -16 -79 -77 117
4349A17j16O7m8N6o4r0J63j72J47p0R0j87L01j84k18J78j11L02p3j17K3OK0j4
$$ 117 1 68 20 76 12 -78 85 -87 60 -10 80 -107 194 10 -208 -30 -141 161 88 -29 -6 0 20 6
4373Fl3M5J52j1j90J63j29k3J06j21K9p9j16J55M4J8P1J61l19J0O9K0J04k03J46
$$ 6 -27 18 170 159 -31 132 3 -20 86 -35 -6 -85 -201 -46 -2 16 87 248 -71 -61 8 28 132 -71 75
4398G5N3r2J66j76k8k9Q5l4l8R9j34P4Jk7n8J05J68j25j0n2j70K12k37lK20k4
$$ 75 128 36 202 26 -2 -31 54 20 -18 81 -53 21 22 -5 -63 42 210 85 75 23 -147 65 -172 -175 45 21
4424B1m2K14q6j55p1J04k8K8J35q0L6j06r7K04k58J22k5Q7j4o5l6L8Q8o0N5o4
$$ 21 -21 193 107 -48 -119 -15 -43 -15 120 40 76 -30 -127 77 -181 -59 -84 3 -11 -76 -112 -74 14 -46 9 -55
4450e5J04%Rr5K4N9m2j22K17k6j53L5J60j74J30m7j74J90j2j81J58O7n2PJ15m7
$$ -55 49 49 58 -37 -13 46 4 -118 99 73 -80 -45 115 -59 71 24 -150 40 28 -153 5 72 20 27 142 95
4476I5j63Q0m5J2m6K75k58Q1Q5k57J00K2L9L5Q2k35K6PmN0L0P9J7n3j11L3j00
$$ 95 -68 12 -33 -21 -67 208 -50 31 116 -141 -41 -19 20 55 137 -98 -72 -65 -69 -19 11 90 107 54 -57 -24 -124
4503a24K00Jo4o0K0OK17k48K31j90j12K80k01J11q0N2l0K8J3r6K3N4L2J04k03
$$ -124 76 77 13 -47 -27 -21 196 -52 179 -11 -123 157 -44 67 -13 39 9 37 50 -46 -23 31 63 167 -36
4528c6j14R4M0L5j6Q6m6j84J25Q2q8J4r8J32n6Nj41L15k32RQ4L2o3M4r2J61k06
$$ -36 -150 -56 -16 19 3 89 43 -141 -16 66 -22 -8 -106 26 -30 -25 -166 149 -83 -74 10 42 -21 23 -69 92 -114
4555a14l9J20Nl8o5K29n0j70J52L2q3j03O5%MK8n1J55K3p1j01MJ14p9K05o0j39
$$ -114 -153 -33 -28 -66 -131 98 48 -122 30 62 -21 -124 -59 -59 -55 -27 -78 77 100 29 -72 -68 46 -33 172 112 -27
4582b7O9j59N7J75j57M9J35j72N8k1n3k27K10O0r4R9n2R4q2K7J81j28j35Q8L8
$$ -27 42 -117 -60 115 -42 7 142 -30 28 7 -46 -273 -63 -3 -97 2 -50 44 -38 -11 170 42 -93 -5 33
4607C3m2pMq2R3K9l2J19j14mp5K49k73K18j25np6J49j20O0K6j0N9j40o0J05P0
$$ 33 -9 -16 -12 -94 -1 28 -4 115 1 -3 -78 171 -102 116 -9 -14 -90 59 -61 -1 25 15 74 -66 -126 -21 49
4634D9j19J66o2J86j16j82K1K59p6j32j00K9J03m4J00L3l33J40J12N5j2k59J20
$$ 49 -70 96 34 220 104 -78 -57 202 126 -6 -106 -77 26 -18 82 115 -218 -78 34 89 77 -182 -62
4657f2J63J4q3mp1j27J56Qj2J3L8k5M4K5j2O4l05L04j80j5M0o7J54r8m4K23r9
$$ -62 101 115 32 28 -43 -170 -14 -6 -18 -5 33 8 52 77 65 129 -176 128 -52 -67 -27 -94 60 -38 -82 141 42
4684D2m2J12j54j8Pj00J03P5k4P6p2r6J35n8j32K33j68O8j19O6K25r9j40l1P2
$$ 42 0 112 -42 -60 -53 -153 -50 25 1 77 5 -91 44 -14 -146 87 -81 -13 -132 -66 159 60 -80 -111 -39
4709c9L2q7O8J75k15lO9k7l5j02K16q0J03l1k6k8m9j17J43r7L6l5J52K5N6R5k49
$$ -39 -7 -94 -26 149 -66 -69 0 -27 -62 -164 52 -28 75 44 18 -10 -59 -176 -33 -130 -94 -129 23 48 104 199 -50
4736e0J41j61K7n8Q9M0N4j04qR3k43K96Q2j65j1pn3j5K40j95j31K09r1j5R1P6
$$ -50 91 -70 -43 -101 -12 28 82 -22 -30 63 -180 116 198 33 22 15 -38 -53 187 -8 -139 70 -21 -36 55 131
4762A31j71J03j96K81o6p9Q2NL6j19K5k56N25m18M5J48m28M14K7k17K22o4k2k7
$$ 131 -40 63 -133 148 82 3 85 90 126 7 32 -224 301 -117 -72 76 -352 62 89 -128 94 30 8 -19
4786a9o0J80o9mK8k9j27O9N1j7k5M0O9Q5k46R7Jk50K62j01p0J56m3P4p7J44k11
$$ -19 -79 101 32 28 56 27 -100 -31 20 3 -22 18 87 172 -74 23 24 -226 36 -65 -135 21 -22 52 -25 119 -92
4813i2N4m9pJ51r2J30r4J23k69J98k50J71k7j1J18N2p3q4LJ34K6j39J33l5j9l2
$$ -92 -38 -87 -94 57 -35 95 1 124 -145 53 -197 -26 -53 -64 54 106 33 -51 -48 86 112 -27 106 71 52 20
4839B0M6j71P5J14j03k7R1q5M3k05P8K94r9p1pO2q3M6j4L1j78Q5J55m8j7jr3J2
$$ 20 66 -105 -30 84 -19 -46 45 -40 3 -202 -124 170 71 0 -7 55 -28 18 4 35 -143 -58 97 49 32 31 -62 -50
4867e0J60k15J4l5l3J2J50k7J29j76J17j16J77j10j6L9j29L38j73O6qn4m8Kn9
$$ -50 110 -105 -91 -126 -159 -147 3 -24 105 -71 46 -70 107 -3 -19 20 -109 229 56 122 114 60 12 14 -45
4892d5J23m9j19J37j41K31k42L23j38j28K54l22J76j41k9K58j01j48J1K5J0M0
$$ -45 78 29 -90 47 -94 137 -105 218 80 -48 206 -116 60 -81 -110 148 47 -101 -90 -65 -55 -15
4914a5k8j36K62k66J14J9k1K03j71k1P3K2n1rj05K08k6j09o2j1Q0j8j02J24J34
$$ -15 -43 -179 83 -183 -69 -50 -71 132 -39 -60 13 35 -16 -25 -130 78 52 -57 -119 -130 -50 -68 -170 -46 88
4939H8k12N9J02n0J09j60l8l2J61kJ6k1M7mN1r9j86J16J04j13m5K28k17L4P0k0
$$ 88 -124 -65 37 -13 96 -64 -102 -134 27 25 41 20 67 63 114 15 -171 -55 49 -64 -109 119 -98 -64 6 -14
4965a4L2M8j36R9m7Q8J45k37q2K07q3q9O7J24k71J13J96n6k87J72J17j69K1p4
$$ -14 18 66 -70 29 -18 70 215 -22 -104 103 20 -69 -2 122 -149 -36 160 104 -183 -11 106 -63 -42 -116
4989a16L09j81jJ44r6L9j21o8M0K06l13J61q8J82o1j64K66j29O5r3j24J37k6r0
$$ -116 193 12 11 155 59 98 -23 -91 -51 155 -158 3 -85 97 36 -128 138 9 74 -19 -143 -6 -32 -122
5013a22K25j61J49j54J22k3q9l0j44J50P6l4L5O9j83J70L4L8p6j30L4j9M7J63
$$ -122 103 -58 91 -63 59 36 -53 -83 -227 -77 -1 -35 0 69 -114 56 90 128 52 -78 -44 -63 -16 147
5037A47k05P4p3PL0R5j76p2R9J61m3j87J7K05q3M2qq8P8o4J1R1j3j93J65j25J40
$$ 147 -58 16 -57 -50 -20 75 -101 -173 -74 87 44 -143 -126 79 -4 38 30 -58 20 -44 -33 58 45 -148 17 -108 32
5064C2l2L2j52J49R0l9k2L9m3n2l6M3P3j08J04p1j40J85NL7j14K4K9J4j75L26
$$ 32 0 32 -120 29 119 80 58 97 54 2 -34 9 82 -26 78 7 -133 52 57 94 -20 4 33 47 -128 198
5090A98n7j0j68P7k0M6j46N3J22r8m5M9p9j18J79J03m2p7K11q8k40K19m9N5j09
$$ 198 141 131 -37 40 20 66 -80 -27 95 -3 -48 1 -78 -196 -17 86 44 -33 178 90 -150 69 20 75 -34
5115c4k7K13j85L5k7p0J83j00K7Oo9O4J0k5Q3j07J9J72k88J30k0L7J9mr4K10k43
$$ -34 -61 152 -33 2 -25 -95 88 -12 15 21 -48 16 26 1 84 -23 -4 168 -120 10 -10 27 46 42 -52 158 -85
5142h5N1N0Nm9om5J76j31K5J42j77J75r0N9k41K07k8l3R9m2j25R7P9m8j58L5M9
$$ -85 -34 16 21 -28 -34 -79 97 -34 -9 133 -44 131 41 100 -141 66 38 5 104 62 -63 34 113 65 -93 -58 -9
5169ir6N5K71k48p1J73j23J47%n6J14j89p0K06j77J46j64R5Rr0m9R6J02j19J06
$$ -9 -105 -50 221 -27 -98 75 -48 99 99 43 157 -32 -102 104 -73 73 -91 4 13 -77 -126 -30 72 -47 59
5194E9l1M4j53N0J31j37K01l15J16M0N6l4K6l0q9J3M5rj14K08p4J29k19K70j87
$$ 59 28 72 -81 -31 100 -37 164 -151 -35 5 61 27 53 23 -66 -53 -8 -17 -131 77 3 132 -87 183 -4
5219dk6O1nnm8r2J69j89O1R3J38j79q3R3J00r1r9R2L0k6R5j38J12o6p5M6P6N6
$$ -4 -30 31 26 21 -27 -119 50 -139 -78 15 153 -26 -109 -16 84 -7 -106 -14 16 -10 85 -53 59 -7 -82 -36 40 96
5247I6q5P4n2Q1O9o6o2j14L1k2O8J8J04j17l6J21q0j45O6Q9p8M9l2J18j26J49
$$ 96 11 85 33 114 183 117 55 -59 -28 -50 18 36 140 23 -13 108 28 -117 -51 38 -40 9 -23 95 -31 118
5273A18j94L3n6M7M4K7l3j78J92P0j03Nj88L88m2J9j95p9J26P3k2k2J4o1J52j71
$$ 118 -76 -43 -99 -52 -8 19 -14 -192 0 70 -33 -28 -216 172 130 149 -46 -125 1 74 52 30 44 -17 135 -36
5299c6o1K24j48j24K30j36J07M9j04J19k50N2K19j30ml0R4n1J6nK0N4j2j6J9K
$$ -36 -97 127 -21 -145 85 -51 56 105 1 120 -130 -78 141 11 7 -23 71 20 36 31 51 105 93 77 96 98
5325I8o6M0l92K25J01j36P7R3j16J47j36J31j26OJ00l2O2j08j5J10Qn2o7K5q5
$$ 98 32 72 -320 -95 6 -130 -53 40 -76 71 -65 66 -60 -54 46 14 76 -32 -47 63 71 19 -48 -23 -108
5350a08J55k9K7o4j4K07j90j42L3J85M0j03m9k20K49j05P3P1o1k9J72O7k50k1
$$ -108 47 18 45 -19 -33 174 -16 -158 -125 60 100 -3 -52 -272 -23 -128 -55 16 -45 -74 98 165 -85 -106
5374a06LJ11J45j30Kp8O4k5O8k33J41n5l6l6K02j7Q0j01J07q4j71J63K06j28j98
$$ -106 -103 8 153 23 25 -53 11 -14 54 -179 -38 -93 -129 -165 37 20 100 -1 106 22 -149 14 220 92 -106
5399a06m4j7K38q0N4j14l8J73j35jp6M0N0n1J39k4j98L08j70j9J00r7J37l8qJ4
$$ -106 -150 -167 71 -9 45 -69 -107 66 -69 -70 -146 -106 -56 -107 32 8 -190 118 -52 -71 29 -68 69 31 23 37
5425C7Mj4n3n3L6J27q2%nm2J44k30J45N0k24K25o4j9k9l7n4lJ38q6P2L3R5k74
$$ 37 41 27 -26 -79 -43 84 2 2 -3 -45 99 -131 14 64 -160 65 1 -18 -47 -84 -138 -141 -3 -89 -17 16 111 -163
5453a63L6J58N4Kj36p0J48L7j8q1Q4no7L6j59J55l6j0J38k24J72j87J63J44j80
$$ -163 -127 31 85 87 -49 -119 29 66 48 -33 51 46 -21 15 -144 11 -25 -35 103 -121 51 -136 27 171 -9
5478iJ2k4K42k47J58k4j35K2j33J02Q7q3N1Nk17J08K14j87L9M4J17k72O4J87m2
$$ -9 3 -21 221 -26 132 108 -27 -5 -138 -36 51 -32 19 24 -193 -85 129 -58 -19 25 142 -130 -66 121 79
5503G9j22m9J2QJ20j23J26r6n9M1L6J57l1L6r6j6M4n5L1o8L4j3p3K60j44k9j26
$$ 79 -43 -92 -80 -72 48 -75 51 -45 -104 -63 -27 130 99 135 39 23 67 12 43 -25 9 -4 -77 183 39 10 -116
5530a16J45q8J22o8JQ4p8o8M5J54l18K13m3L5M5M3j15j39K02M7j08k41M22l95
$$ -116 29 -59 63 -5 -4 80 2 -66 -21 133 -185 28 -15 20 65 108 -7 -146 56 103 -5 -246 176 -219
5554b19K24Q6j28J20k8j30O7R8kq1p9qJ16pP8j05p4J69k69J73o0M1K02j70R0j24
$$ -219 5 91 -37 83 55 -75 -8 90 88 7 -72 -80 36 29 107 2 -72 97 -172 1 -59 -18 184 14 104 -20
5580b0m5R8O8n3M0j79J01r2k4n1J28Q9Ok12K22L4o1M9j74KK7p7k1N1L3L20m15
$$ -20 -65 33 101 48 88 -91 10 -82 -106 -157 -29 60 66 -146 76 110 49 98 -76 -74 -47 -124 -145 -94 -61 259 -156
5607a56K43j46M0J6R9k62K45m9r9K41j47j48J49m8L5j61J79j70rJ42o4P7N4LK8
$$ -156 87 -59 -19 -3 96 -166 79 30 -69 172 25 -123 26 -22 13 -148 31 -139 -148 -6 -70 7 61 64 92
5632I2K4j19M7O1j21O8j23oO0J38O8k09J1J04p1N9m8Q6n7m9J45k10J8L6r7l5L75
$$ 92 116 -3 44 105 -16 52 -71 -77 -17 121 189 -20 -9 95 24 83 35 121 64 15 160 -50 -32 4 -93 -128 247
5659B47r7r3j09m9J71J9o0Q2L1j50J22p6q5R5k9R7j7j44O9l0lj8k7J18L0q0O8
$$ 247 150 57 -52 -101 70 89 29 111 142 -8 114 38 -47 48 19 116 99 -45 24 -6 -9 -27 -54 64 94 14 82
5686H2n9j14Q2rm7K0O9j02O9K5q6P7l3J47j29J71j65M4j8J28k06J12r4P0O2p0
$$ 82 23 -91 -9 -18 -65 -45 24 -78 -9 16 -70 7 -26 121 -8 163 -2 42 24 152 -54 58 -36 34 96 26
5712B6j36J52J2j78J55N9j06L1J45j43jJ53j60j4n0M8k5rN0R7j87J21o4R8m9j35
$$ 26 -110 42 54 -124 31 90 -16 15 160 17 16 169 9 -5 -55 -7 -32 -41 9 106 -81 40 -24 74 25 -110
5738a10K34j23r5J32Oo2J18o3j7q8M5jJ59k97K93j50Ro4R9O8m1m1l3q6J61j63
$$ -110 124 1 -94 38 44 -18 100 37 20 -68 -23 -24 135 -162 131 -19 -10 -74 25 93 52 11 -22 -108 53 -110
5764a10Q0L0k4K65j93R8m6q9O1j28k8J36J91k85J43pJ24k04O1p3j34RJ05K4M9
$$ -110 -30 0 -24 241 48 146 100 11 72 -56 -84 52 243 -42 101 94 218 14 75 2 -132 -123 -18 6 55
5789E5r6O6m9p3J07j50J61L1L2p4m0M2L6l6m8q8Q5J35q4l6Oj58K83r0j93J57J0
$$ 55 -41 25 -24 -97 10 -140 21 52 84 10 -30 12 48 12 -36 -124 -39 96 12 -24 -18 -176 107 17 -176 -19 -9
5816iN9j13N9K08k09j59K83l25J14K4O1n9Q0L6k4p9J7J7J39l6m4j06k1J18r8J43
$$ -9 50 -63 -4 204 -5 -164 119 -206 -92 -68 -7 -66 14 50 26 -53 -36 -19 120 84 40 -66 -87 31 -67 76
5842G6j9p6nrl3M6j9j11J91J62j16m5n8Q8j96L0J78N3k10o7K62k22K7K62j12j22
$$ 76 57 -19 -24 -33 -66 -20 -39 -150 41 203 87 42 -16 72 -124 -94 84 137 -73 -140 122 -100 -73 189 77 -45
5868d5m1K03j02P2j08r1J60j29M8k7r4K43o3j34k4Q6j0K36j13r2O1o1Q6j5P1j18
$$ -45 -86 117 15 87 -21 -112 48 -81 -33 -60 -154 89 26 -108 -132 -46 -56 180 67 -25 36 -25 61 46 117 -1
5894aO4j13K84k30j50O4O6O6q1M3J0j44J23J6R6q3r6J06j17J25R9j64J7J09j11
$$ -1 63 -50 234 4 -146 -82 -16 50 -31 12 22 -122 1 17 113 30 -66 40 -77 48 147 -17 0 109 -2
5919bRJ31j81R7m8O3j48K87j60oj22J77j37m7L4J4K7m3M3ON4K1j46rJ24j41L5
$$ -2 7 138 -43 54 6 69 -79 208 48 42 -80 97 -40 -87 -53 -39 -12 -55 -12 -6 48 69 -77 -86 38 -103 -68
5946f8n8J79Lm6j20K56j65j63J14l3K20l2j81KP2M8K9m5m1j9J88j09qj45K49q1
$$ -68 -126 53 56 10 -110 146 -19 -182 -68 -101 119 87 -94 -92 -20 28 57 12 -29 -48 140 31 23 -122 127 46
5972D6p7k2j82J22J14R7l6k04O3J70j57O3L3k27J85J06p9No1N5M5r3P1l8j46J01
$$ 46 -31 -53 -235 -113 1 98 62 -142 -79 91 -66 -3 30 -197 -12 94 15 20 -41 14 59 -34 37 -1 -147 -46
5998d6mj07J40K0o0L9M4l4J88j65j25J46l0P4R1k28l5K8J4J3k9p9L36n5k21J30
$$ -46 -50 -157 -17 3 -57 -18 26 -8 180 15 -110 36 6 80 171 -57 -92 -64 -50 -37 -66 -145 191 136 -85 45
6024D5n1K05j72O5k27K2M3J22j7J9q0j77J23j31K70k16L2O4J59j66K32k63l4J50
$$ 45 -6 199 27 92 -135 -113 -70 52 35 54 -26 -203 -80 -211 59 -157 -125 -61 98 -68 164 -99 -133 17
6048A7P1k56J31P5k23P9m5J51p%K3K4k31J92Q4N2q0p4Jr5J22q7J24P9k14J07q5
$$ 17 88 -168 -37 38 -185 -106 -151 0 -7 -7 16 40 -191 1 85 137 57 -17 -16 -111 11 -76 48 127 -87 20 -65
6075f5L1N1J21k41K52o3N4j45j23m2N3J48n8J00j94K20k74Q9J59j86J00J08p7
$$ -65 -34 17 138 -103 149 86 140 -5 -128 -170 -117 31 -27 73 -121 99 -175 -86 73 -113 -13 95 18
6098A8J32j03M3J09j89N1l6l5j02J73j0m3n7PJ9j40K55l4j09Q4k8J60k90Q2J45
$$ 18 150 47 90 199 10 61 25 -10 -112 61 51 8 -49 -42 -23 -163 92 58 -51 33 5 165 -125 -43 102
6123A02j60J37q3Jj5J68j69k0l7P2j00Q2J24n7j0p3l2q3R2J54n6j9k3k30J84O4
$$ 102 -58 79 -4 -3 -18 150 -19 -39 -76 -4 -104 -22 102 45 35 -38 -70 -153 -61 93 37 18 -5 -235 -51 13
6149A3lm7M6J19l7j27Q7j78R1J62j89N4m2M3r6P6J01m6j28N8rR4pr2P1n6n9J48
$$ 13 10 -37 9 128 91 -36 51 -127 -36 126 -63 -9 -51 -8 -104 -28 73 27 -101 -43 -52 42 35 -57 14 -42 -101 47
6177D7k11J41J30k05K3J14j12Q6M1q5J81K3k71L0L6K2O8j16J77Mk07j2R3k8q4
$$ 47 -164 -23 107 -98 -75 39 -73 13 54 -31 150 173 -98 -68 -32 -10 58 -58 119 123 -84 -96 -3 -31 -115
6202a15M6N8O5n7j79J39R0k8J65j79l4r3J05L6Q4j15J68k18l3K26k02R0l3O8N0
$$ -115 -69 -11 54 -3 -182 -43 47 19 184 5 -29 -122 -17 19 103 -12 156 -62 -95 131 -71 19 -14 54 104
6227A04k14K76j06q5J22m4P7k1q5m7P2r8R5r0l4oQ1O2j19J11kj42M3j55L14j25
$$ 104 -110 166 60 -25 97 53 130 109 24 -23 49 -49 46 -44 -78 -84 -3 59 -60 51 49 -93 -50 -205 109 -16
6253a6L2j04M2k3R1O3k30J65j25J34MQN1k25J78n5K5j48K06p5P0j64N9o8O5J23
$$ -16 16 -88 -46 -69 22 85 -145 20 -105 29 33 41 92 -133 45 -10 15 -133 73 -2 68 -96 -37 -105 -40 83
6279H3k01j5J2J37J0m0n7M3M8j38k45L68p3J70n1j04oK3QoJ38k03%P4l4M4J55
$$ 83 -118 -133 -121 16 26 -14 -71 -28 20 -118 -363 5 -68 102 51 -53 -59 -36 -28 -34 104 -99 -99 -25 -59 -15 140
6306A40j43qM8l6J07j60k18K39O9j05J09P0l8j96J00L1K6Rm7J08k17J56r0J2k6
$$ 140 -3 -11 37 1 108 -52 -270 -31 38 -67 42 112 74 -122 -22 9 35 44 -3 105 -112 44 -46 -34 -60
6331f0N5O1q4J79r3L8k48K73k35J53k11J74l4J53j8o5n5j22J54p2J27L0k34O7
$$ -60 -5 56 -28 151 58 96 -152 121 -114 39 -172 2 -32 121 103 38 -17 -139 15 -57 70 100 -134 -67
6355f7L5O6q3R8j18J10j16k1Q0N7j55K72j32O0J21j82R2j11l8J18r7O0o2n6N3
$$ -67 -32 34 -49 49 -69 41 -75 -96 -16 41 -114 158 26 86 207 25 117 6 -32 86 -11 49 -13 -69 -16
6380a6Nj16nK29n9K55l34O3n2K05k54M2R9j23kK49k20m0l6O5r3J19L8P4Q7j48
$$ -16 -11 -127 -132 97 38 293 -41 22 -30 175 -79 -37 62 -61 -63 186 -34 -74 -110 -45 -138 -19 19 93 180 32
6406C2K7o8O5q1O2j50O1J18ok3p8N6q3K90j04j64M4j56J97j2K3K0K7J66k81Q7
$$ 32 59 -9 56 -25 37 -113 -52 66 60 37 -41 15 -68 222 118 -46 -2 -158 39 27 50 70 97 263 -18 69
6432F9l2k7LJ04j08j0K29j17q2L3p8K5p2K3m8J5K0Q2j29L3L5m0J01rj59J94l7
$$ 69 37 10 13 117 9 -1 228 111 29 62 -16 9 -63 -40 -88 -73 -53 29 -100 -67 -32 -72 29 20 -139 55 18
6459A8q2K7L0j35L03j1j38O0j70J91p2L0K0n5k2J13j9j95Q8J53j16n1j36L01j87
$$ 18 -64 -37 -7 -142 161 150 12 72 -98 93 21 51 71 16 -6 107 88 -107 -19 134 18 -33 -169 132 -55
6484e5n2J19J10k77J83l1l8lJ6P0p5k6Q8O3k7P6j45M8k29J78pl5p3J14J36j79
$$ -55 -107 12 122 -155 28 -3 -41 -44 -28 42 -33 -59 29 92 65 141 -4 44 -185 -7 -14 -49 -122 -8 128 -51
6510e1R6M9n2j2j06k4J76k1n1j64J48l0M9M8j30j23K26rj19QO8L7o8J04p4M2l6
$$ -51 45 94 42 30 -76 -100 76 55 4 -160 -12 -42 7 55 -75 -198 28 19 -100 -92 -24 13 -55 49 -25 17 -19
6537a9l1j3J6O7R9k98K62m2%q1m6J96j27On2J71k8L6k35J1K11j60M1J05k2j3j03
$$ -19 -50 -63 -47 20 119 -179 83 41 41 -40 -86 110 -17 -11 -63 108 80 116 -119 -108 103 -57 -16 89 67 54 -49
6564d9J50j12O5j90J30Q6n2j04L1J16j71J14j01J03j31M8R8L2k0r5k0L1m7J13
$$ -49 101 -11 54 -136 -6 80 28 -76 -45 71 -100 14 -87 16 -115 -67 31 63 43 -52 -72 -41 -88 25
6588B5K1r7M4J30j76J11j30M2q1K25m4j58N3k2J12mPj86J9L62j50q4OJ73k27J09
$$ 25 46 -51 -7 123 -53 58 -72 -30 -111 114 70 -88 -35 -57 55 51 58 -128 -109 253 103 19 25 198 -29 80
6614H0j45J08l5J7o5MJ15o1j94P9k1L5J03J4K0j17QK58k29L1J80l64J76M2m5O3
$$ 80 -65 43 8 25 -40 -36 79 18 -176 -97 -118 -83 20 34 54 -63 -55 203 -26 5 185 -179 -3 39 -6 57
6640E7j42J74j95J30M9L9k26N8J15j95J25L8R4l11P5MJ62j15o0J06o3j04J22M3
$$ 57 -85 89 -106 24 73 112 -114 -56 59 -136 -11 27 121 -190 -115 -111 51 -64 -124 -18 -81 -185 -63 -20
6664b0K3Q4j05j2P5k43L48j4o8j63L4J54j57J49j3k90K39O5L6j40r7J24J64j61
$$ -20 3 87 -18 -30 45 -198 150 136 68 -95 -61 93 -64 85 72 -218 21 86 122 -18 -115 9 173 12
6688A2L8J38j57N9j48O3L6p6J3j1n6J26j17p0l2J27m2P4K1M3M5L6r6j43R4q1J71
$$ 12 50 188 31 90 -58 5 41 -35 -22 -33 -89 37 -80 -150 -182 -55 -97 -23 -2 41 86 122 26 -117 -23 -104 67
6715F7N0j95N2J73j17N2k28J47M7m0m5J12k11P0P0j10J19n1Q7J25l03P5J10p4
$$ 67 117 -78 -26 147 30 82 -146 1 48 8 -37 75 -136 -66 4 -106 13 -38 49 174 -129 -54 56 -18
6739a8j08N5J24j80O4r2R3K6J25L9p2k9j28J12m3J94j18k2%j04J89Q9j01p1q5
$$ -18 -126 -71 53 -127 -63 -155 -62 -36 89 128 56 27 -101 11 -32 162 44 22 22 -82 107 196 95 24 -61
6764f1p2O0M7n5J48j00Q0j33L0J40k12R4J88j63%m2Q5q1J41j3k53K44k14J40Q9
$$ -61 -133 -73 -26 -81 67 -33 47 -86 -56 84 -128 -34 154 -9 -9 -51 34 -47 94 81 -172 72 -142 -2 87
6789H7j08m3P9n1QK0L2J88k57M1l9j13J05J55p7j2m8l4J40j5j07J3j36O1J41J22
$$ 87 -21 -64 15 -36 -28 -8 24 212 -45 -4 -43 -156 -51 104 27 15 -33 -67 73 58 -49 -36 -172 -111 30 152
6815A52l04K40o7N6p5L0n5j52J46O7k4J35j74j12Q5J21nJ47j55j48K78n3j82K02
$$ 152 -152 88 21 77 2 32 -23 -175 -29 38 14 149 -25 -137 -52 69 64 211 56 -92 186 133 -49 153
6839A53k03J04j71J74k6J0j15K92j68l2j09K0J37K1K7k27Q9j9P6o1K7J84k46R5
$$ 153 -50 54 -117 57 31 41 -74 218 50 18 -91 -71 66 87 114 -113 -24 -43 33 -28 -1 183 -63 32
6863C2l0l5QN6j69R3l3kJ30k36K35j33K42j63q3O4kJ01j46J72j62J10n6R7n1j16
$$ 32 2 -33 -25 31 -138 -45 -78 -80 50 -186 49 -84 158 -5 -88 -24 -26 75 -71 101 -61 49 -7 90 39 -77
6889g7r6M26p2j20Pl2m0j82J76m8N2J19j86R8j8r1O5M9K5rMk6l9P6j56J4J23j35
$$ -77 -173 253 181 61 68 36 -4 -186 -10 -58 -6 113 -73 25 7 -84 -19 30 55 46 50 24 -15 61 -95 -81 42 -93
6917i3J36M7j55l3Q3Kj04J74m9M2p1N4n6J67j49k39K61M4p2k8om0J28KJ12j65
$$ -93 43 90 -65 -98 -15 -13 -117 57 8 50 -21 33 -23 144 -5 -244 17 61 -11 -39 -45 -85 43 45 157 -8
6943hL5j69j39L04j87J23J82l29L04j25Q4K08j75q6L0L6j0r4m5J76L3J57k59r9
$$ -8 27 -142 -281 23 -164 -41 141 -188 116 -9 75 283 108 22 52 88 78 -16 -61 115 148 305 46 -53
6967e3J11M9j04n1P3j08m5O0q5J39Q7m9k04L67l01L9k7Q2J11k39J55rJ7n9R6O3
$$ -53 58 107 3 -48 25 -83 -128 -68 -153 -14 73 24 -180 187 -114 -75 -102 -20 91 -148 7 -2 15 -44 52 115
6993A15j04L4p0J09j46N0r6J72o4j23J76R8j30K4Mko1M8jj20p4J01J61k09K09
$$ 115 11 45 -25 84 -62 -12 -108 64 0 -123 53 151 21 45 49 47 -14 34 33 -87 -161 -60 101 -108 101
7018A01n9j3J37k21R6J47k39P6j34O1J99k43K9P8j2om4O5k7%j24K36j44m7oJ97
$$ 101 42 29 166 -55 41 188 -51 25 -109 -48 151 -92 -63 15 3 -3 -47 18 -9 -9 -133 103 -41 -88 -94 103
7044A03j00o8P5l3jn5L3J26l8J38k37P8kK13k58k0r0J91n6R8J03j45p5Pk9L5J25
$$ 103 3 -65 10 -23 -24 -79 -46 80 42 180 -57 21 19 232 -26 -46 -136 55 -1 97 200 55 -20 -13 -42 -7 118
7071A18j27N7n5j66j0K19N5O0j94r7L43k86K18j04j06qR1R4r8k0%k9p5J83J1q1
$$ 118 -9 48 -7 -173 -183 36 91 151 -43 -140 203 -83 135 31 -75 -83 8 102 4 -16 -16 -45 -120 63 74 -7
7097gP5o8kJ58j27o6m9K63l9k30J4O2N1k07M5k4J62j9j12N9N3P8o0k7J12O3j85
$$ -7 68 0 -2 156 29 -37 -86 177 138 -92 -78 -16 35 -172 -127 -151 11 -8 -120 -61 -8 70 10 -17 95 158 -27
7124b7K6j8pl0N2j28J06Q3o4j10J66r6J19o9j8M9M1o8j03J13O4j01n4J11j09k2
$$ -27 -1 -19 -26 -56 -4 -132 -26 57 -7 -117 49 -47 72 3 -15 34 75 7 -96 17 81 -20 -74 37 -72 -94
7150i4J93k60J73J39j68n7L5J01j94N0K5j04J28K0jJ29j75L3O7Pm5j51M5J09O6
$$ -94 99 -161 12 151 -17 -74 -39 62 -132 -82 -57 -161 -33 -13 -14 115 -60 -27 40 47 2 -149 -104 5 71
7175G1j74P2P7j14K8L33l99J06O4J25k19n5R8q9R0k0K9p9J58p4k05J8L11k53J07
$$ 71 -103 -31 46 -68 -40 293 -106 0 64 189 -30 -85 13 -76 14 -6 23 -56 102 28 -177 -159 152 -101 6
7200Fj34K0J68j71Q8%R0o2j44N2J04N4k20O9J02j41J55k0l8Q9Q4r7k02K33k0k63
$$ 6 -128 -108 60 -111 -23 -23 67 5 -139 -87 17 71 -149 -80 22 -119 36 16 -22 67 151 54 -148 85 65 -198
7226a98J68r5J35j84J83J7j68J33M1m6K63k17j19J75p9P7l9j12J37%j78K10j31
$$ -198 -30 -125 10 -174 9 26 -142 -9 32 -14 249 32 -87 88 9 86 47 -65 72 72 -106 104 -27
7249b7p1J53j12M6P4l2j26J76k05J61O3j88J11j79J02J29L5o8rk21K11j87J46
$$ -27 -98 55 -57 -11 63 31 -95 81 -124 37 100 -88 23 -156 -54 75 110 42 33 -188 23 -164 -18
7272a8n3K98l2k32J47j41N1Q8q6j46J44L8k5j40K08j09N2l7o2J93j55L6N3P0j55
$$ -18 -71 227 195 -37 110 -31 20 108 22 -124 20 58 33 -107 101 -8 44 7 -55 138 -17 19 72 142 -13
7297a3K0N4P3j61J2KOJ9NJ53k43L1p7J88pQ7m8o0j17J4Q5j00M4J41P4k39K13k8
$$ -13 7 61 134 -27 -15 -13 -7 12 17 170 -73 -42 -119 69 62 149 101 41 -76 -62 23 -77 -33 108 182 -57 156 128
7325A28j95m3J05R4n6M3l33J55J09Q3r8j15J76p1N0j95Q7J14j02Q8J0L9m2j05
$$ 128 -67 -110 -5 89 33 76 -257 -102 7 90 -8 -123 53 -18 32 -163 -76 38 -64 24 34 73 31 -74
7349g4j00Q8j5K14n1m5Q6j61j12J24O6M1q9J18r0p5K7l1j65L86r6j82n8r5L91
$$ -74 -174 -86 -101 113 62 17 103 -58 -170 -46 20 61 -28 90 0 -75 -48 -79 -244 142 46 -136 -194 -289 102
7374A02l03L71j54j01J19k22L0K04M9J8j75J91pj8o0o9J8m7Q3J4m1o0O2L7L8j82
$$ 102 -201 170 16 -85 34 -188 -158 46 95 113 -62 129 122 104 44 -25 -7 -54 29 43 2 -58 4 41 79 -103
7400a03J41O0j35Q0q0J0Q9j36J47n7K0j68J36j09J60o2j0%O8k5j0J48j98K74k10
$$ -103 38 98 -37 43 -37 -27 62 -74 73 16 36 -132 4 -105 55 -7 -17 -17 51 26 16 164 -34 240 30
7425C0O7j69J9n5K15n4j45P7Q6j03J9P8N9k46L3P8o0K40j6l0p6j9K8k69J76P7
$$ 30 97 -72 -53 -108 107 53 -92 -15 71 -32 -13 65 124 -122 -89 -11 -71 169 153 123 47 28 56 -213 -37 40
7451D0Qm3N6j48N5K11l07P8J38j20P0Q0m2k05L7L7J93j08l2L4k1j00K46k11K12
$$ 40 48 5 61 -87 -32 179 -128 -50 88 -32 38 118 76 -129 -92 -55 138 30 -2 32 11 -89 157 -54 158
7476A58n8j09j38J02J81j23N0LO2j38O2j59K08j81J52k13O8J23l01K89J02j77
$$ 158 100 -9 -147 -45 136 13 63 66 128 -10 52 -107 101 -80 72 -141 -73 50 -251 38 140 -37
7498c7r8J51J1N1j06J5J27r6j00J72q4j4Q6j36J16n1L6L5q1k4N6l5M0M9q4N4k19
$$ -37 -135 16 27 78 -28 -13 114 18 -82 90 6 -8 78 -58 58 7 43 78 -3 -27 29 -6 34 83 -1 53 -166
7525a66J09L2oro1J08r9l4J74j14O3J7r1P6n0j35K37K7k07J80j53J97j41k3O8
$$ -166 -57 -25 -31 -40 -101 7 -92 -126 48 -66 -3 14 -77 -1 -51 -186 51 78 -129 51 -102 95 -46 -69 -1
7550aJ5Q3k30J94j8q2Q4j92J62Q8j07k3JMJ09o9J0j59J57J64j64L2j99L09k79
$$ -1 14 97 -133 61 43 -39 45 -147 15 103 -4 -27 -26 -22 87 18 28 -131 26 190 26 58 -141 168 -111
7575a11J67P5q1m5J0p5M7J1RP8q1j66R0k9J41K45l18j53K31k80K50q2N0Q1J7k00
$$ -111 56 131 50 5 15 -60 -13 -2 7 85 4 -162 -72 -101 40 285 -33 -186 45 -235 15 -67 -17 64 81 -119
7601a19J01J02L3J3q9J19k97J13J34m8k06K25j44PK24j16r6R8n8j53J14j54J37
$$ -119 -18 84 117 130 41 160 -137 -24 110 62 -144 81 -63 -56 168 52 -44 54 -4 -157 -43 -197 -60
7624f0J0m8N9k9J02j1N7r7j20O2J60j97LR4q9N9J7KJ4J10om8r3M9J05J0Jo4J08
$$ -60 -50 -98 -39 -68 34 23 80 -17 -137 -75 85 -112 -109 -15 -104 -45 -28 -26 -12 98 92 44 -49 0 105 115 116 52 160
7653A60r0r4l1K1J24p8m7O3k06M26j45m1j31J05r6M5J55m7q0N3j5j62%J09r6J42
$$ 160 70 -24 -55 -34 90 12 -35 28 -178 248 103 62 -69 36 -60 -15 140 93 13 66 51 -111 -111 -2 -98 44
7679D4q6j25K53k39Q5q6N1J09P8j0j63J25J8N0l10L10j65J33j14J55j47j00P5
$$ 44 -42 -167 86 -153 -68 -154 -103 6 84 74 -89 36 54 104 -206 104 -61 72 -42 113 -34 -134 -59
7702e9q5J00O0P8k68M00k68R3j53O0r9J32L2J9q6K63k91J09QL7j20J7j5l9K1J3
$$ -59 -144 -44 16 94 -174 226 -42 51 -102 -42 -141 -9 23 42 -44 219 -72 37 45 82 -38 -21 -36 -75 -54 -41
7728d1M9K4k1m5l8jJ58L8p2l14L53m7Q8L1j07J19k00L9Mn5J4p5Lm9K98k25K7j3
$$ -41 8 32 11 -34 -72 -73 85 123 51 -263 90 43 131 162 55 174 -26 13 17 -38 -24 -99 -96 -145 153 -72 -45 -58
7756e8J43j60L3O1j74J40n4P8n2J64r7P4l4j58J73M2j72J12QjN5l60O6L8J29O9
$$ -58 85 -75 -42 19 -155 -15 -69 9 -43 121 24 98 64 -94 79 121 -51 61 69 68 123 -237 -171 -133 -4 65
7782F5j26O4j59J30j7m1J27m0J20o8j3Nj14M1K4L0j49J01N2j13R6j06J33j86K25
$$ 65 -61 3 -156 -26 -43 -84 43 3 123 55 42 47 -67 -26 -2 28 -121 -20 32 -81 15 -91 42 -144 81
7807H1p4j09J1J08J3m9n1NnK7K58j85J66k38n0K48k54K12q6j16O7P2l5J21j54
$$ 81 7 -102 -91 17 30 -19 -70 -65 -70 -43 215 30 196 -42 -92 156 -98 114 28 -88 -21 51 16 137 -17
7832a7j28K79k49P8j67P8l6j11K45K8j76J01O9p7R5r3J1N3j1J14k0N6p2P2k02
$$ -17 -145 134 -115 -37 -204 -126 -162 -273 -28 0 -176 -75 -6 -83 12 -81 -70 -17 -28 86 66 122 50 122 -80
7857h0O9P0l9j67K61j41K41j86R9n9j25j12J55Q1j39J27l5o3n6P8j53K96j75o4
$$ -80 -11 59 20 -147 114 -27 214 28 127 68 -57 -169 -14 67 -72 55 20 -43 -99 -21 -174 122 -53 -117
7881a17R2J72r5j09O8j3K4q5j3p6R6J97Qn3k6p9N7P2J9j62M8j87K83j63K5l6J13
$$ -117 -25 147 52 -57 11 -2 22 -63 -76 -152 -56 141 149 96 70 -9 48 120 139 -23 25 -162 121 -42 -17 -53 60
7908F0o0J2P9m5J81j57J3j79J85j99J43J6nk36J68J08j99MR5J4p1nR6R9k65L62
$$ 60 0 12 91 46 227 70 83 -96 89 -110 33 49 44 -192 -24 84 -115 -111 -16 -2 -73 -78 18 117 -148 214
7934B14j61Q1J23k77K3J0J05j88k7K9J29q3M3j64R7n0P1P8n4p1k8J23qm1R4p7
$$ 214 53 134 257 -20 3 13 118 -70 -97 -68 61 -22 21 -143 -46 -96 -25 53 -1 -72 -100 23 15 -26 68 -9
7960iP5L7j42J62j10J50k85K30j05j3j09J00J37m5k0j75J13p2J89N2k04J5R2O0
$$ -9 66 103 -39 123 13 163 -122 108 3 -10 -119 -19 118 73 53 -122 -9 -81 108 160 -44 -29 63 123
7984A23j10j08K67j16Q4j27j43K13L6j67M2J35p5j50J37k08J11o3L2K0k5Mo0P7
$$ 123 13 -95 172 56 140 13 -130 83 119 -48 -6 129 54 -96 41 -167 -56 -119 -87 -67 -92 -88 -148 -71
8008g1O5MO6k42J68J24qj51p6J15r9p0K14qp4J28J7N6j40L5j2q8L9p3M7j14K08
$$ -71 -6 -2 64 -178 -10 114 106 -45 -121 -6 -105 -175 39 31 -43 85 102 158 18 53 41 -47 -8 -81 -34 -148 60
8035F0J0k76J80J68j87N5k04L12L5j74N7j25J24r9R7J30j04j78P4k1K6K53j13
$$ 60 70 -206 -26 142 -45 10 -194 118 153 -21 36 -89 35 -64 33 163 59 -119 -45 -66 -40 213 100
8058A00j69M5J56j41J11j86J4P9p0Q1p1k1q0K65j75O4J14j94K84k82O9N8p7q1
$$ 100 -69 -24 132 -9 102 -84 -70 9 -61 20 -51 -72 -152 113 -62 2 116 -78 206 -76 -7 51 -26 -107
8082a07K20r7J22Ok42R2jJ09k59J30RK1p1K8N7J82j21j48q2O1J09p2K37l9o7j51
$$ -107 113 16 138 144 -98 -6 -7 102 -157 -27 -18 3 -68 -40 17 199 78 -70 -152 -91 18 -54 183 144 77 -74
8108g4K21j39J3r6J89J05l65J58p5j14J33J78p9n2N4j75QP4l1J77j68o3O9K9J27
$$ -74 147 8 21 -75 114 219 -146 12 -63 -177 -44 134 55 3 57 -118 -110 -36 -67 110 -58 -121 -52 -23 104
8133A04k6OL5j60J62mj37m3M9J58r6m4M6j60J58j42J39P1j72K6N0j24R7J38r6
$$ 104 78 84 119 -41 121 117 -20 -63 -14 144 48 4 50 -110 48 -94 45 116 -56 -30 20 -104 -7 131 35
8158C5k06PL46r5o7oN0j70J52l6q7k1j5m3J90j65K58j15J09k66J46Nj15J83K9
$$ 35 -171 -164 182 87 20 14 64 -106 46 10 -77 -98 -113 -156 34 -131 127 12 121 -145 1 6 -109 74 103
8183A03p3M3k6m8J53j98NP0
$$ 103 30 73 47 -1 152 -46 -41 29
8191B9
$$ Imaginary data points
##PAGE= N=2
##DATA TABLE= (X++(I..I)), XYDATA
0@%%%%%%%%%%%%%qJ6j6J6k4L2l2M0m8N6p2Q8j04J20j36J53j77K05k32K64l01L40
$$ 0 0 0 0 0 0 0 0 0 0 0 0 0 0 -8 8 -8 8 -16 16 -16 24 -24 32 -40 48 -56 64 -72 81 -96 109 -123 141 -160 180
35A80l82M30m83N40o04O74p49Q31r22J021j129J246j373J516j672J841k027K233
$$ 180 -202 228 -255 285 -319 355 -394 437 -485 536 -593 653 -720 796 -876 965 -1062 1171
53A171k462K718l006L331l702M130m629N224n948O843p985R506j1644J4889k0465
$$ 1171 -1291 1427 -1579 1752 -1950 2180 -2449 2775 -3173 3670 -4315 5191 -6453 8436 -12029
68a2029L2641j08197R5090J83353j79522j28662M2253J34741j73o1194j2445m511
$$ -12029 20612 -87585 7505 190858 11336 -117326 -75073 59668 59495 -1699 -14144 -18655
80a8655k2647Q3985M6212q4140r9582L9253J38096J9150j60443m5532J10892N6133
$$ -18655 -41302 42683 88895 4755 -94827 -55574 82522 101672 -58771 -104303 6589 62722
92F2722m0172n2699j2602L5625J7880K1386j821p3044p474R3776J5591o8330l3759
$$ 62722 22550 -30149 -42751 -7126 10754 32140 30319 -42725 -50199 43577 59168 -9162 -42921
105d2921L8621M0212l3630j9222L9530l0384m4204N7917M6164m6467o3875J9146
$$ -42921 -4300 35912 2282 -16940 22590 -7794 -51998 5919 52083 5616 -58259 -39113
117c9113R0630k993r0128P908O1812q342l0202J1039K8809l1888n2044O5442O6603
$$ -39113 51517 48524 -41604 -33696 28116 19774 -10428 611 29420 -2468 -54512 10930 77533
130G7533q6538p3493O6482P9700k8915q8886O251Q0627m420m0980J1331J110j2152
$$ 77533 -9005 -82498 -16016 63684 34769 -54117 -47866 32761 28341 -12639 -1308 -198 -12350
143a2350J3954K4020j045n0765j4180O8565J5916o0871k1517L1667L2118j3048
$$ -12350 1604 25624 24579 -26186 -40366 28199 44115 -16756 -38273 -6606 25512 12464
155A2464l4487J4192J4522j6838J7847J3985l2162j0591K7365K1525k3112l5318
$$ 12464 -22023 -7831 6691 -10147 7700 21685 -10477 -21068 6297 27822 4710 -30608
167c0608L0359L1569m0351j6616L4938Q720k4607j8364K5721K9551l3887k3363
$$ -30608 -249 31320 -9031 -25647 9291 18011 -6596 -24960 761 30312 -3575 -26938
179b6938L3517R793j7736l174Q618L500k1547K097M2197j5780n3139J6564M9483
$$ -26938 6579 16372 -1364 -4538 4080 7580 -13967 -11870 30327 14547 -38592 -22028 27455
192B7455J788m6097k2778M6635K5957l4158j0647Q844j867J2314Q798r961k0448
$$ 27455 29243 -16854 -39632 7003 32960 -1198 -11845 -3001 -4868 7446 16244 6283 -14165
205a4165r766L6183K3466m3687k6946K6359K8495j341l2994q683K9369K977p000
$$ -14165 -23931 12252 35718 -7969 -34915 -8556 19939 18598 -14396 -23079 6290 9267 2267
218B267O178j4870p401K0557J3794q833l1138j698M2982p20l7130j1J5942O375
$$ 2267 8445 -6425 -13826 6731 20525 11692 -19446 -21144 21838 21118 -16012 -16023 -81 6294
232F294m675j0768Q586J311j1837J7695P932k0944j232J1105R734k870k2703P295
$$ 6294 1619 -9149 -563 748 -11089 6606 14538 -6406 -7638 3467 13201 10331 -12372 -5077
246e077K0672j5763q716J0243j256l671n972O537J4660j9052q618K5061n59j1915
$$ -5077 15595 -168 -8884 1359 103 -3568 -9540 -3003 11657 -7395 -16013 9048 8489 -3426
260c426K905K134O500m406p471J3040o127j3918J4729K903j0918l898k392J4935
$$ -3426 -521 1613 8113 3707 -3764 9276 3149 -10769 3960 6863 -4055 -7953 -10345 4590
274D590L332k1844N872J5055n934l95r50P61P271q272L671Q813j8585q7J7784
$$ 4590 7922 -13922 -8050 7005 1071 676 -274 487 7758 -514 3157 11970 -6615 -6702 11082
289A1082p045r706l739M812J3831j1845j1206J5053k46l183O282o344K289M515
$$ 11082 4037 -5669 -9408 -4596 9235 -2610 -13816 1237 991 -2192 4090 -2254 35 4550
303D550m651Q893m205j3461J2736N786r495l487n257R626O825j7400K523J0583
$$ 4550 -101 8792 4587 -8874 3862 9648 153 -3334 -8591 1035 7860 -9540 -7017 3566
317C566q363L495L498m989M314k033K856P844j3663o94J3625o638l408p0l650
$$ 3566 -4797 -1302 2196 -2793 1521 -512 2344 10188 -3475 -4169 9456 2818 -590 -660 -4310
332d310Q295l401r191R409j443m620O421l310Q38L690n899Q117J438j1733Q030
$$ -4310 3985 584 -8607 802 -641 -5261 1160 -2150 -1312 2378 -3521 4596 6034 -5699 2331
347B331M712p406J406k487J314M304r378K371O519r355L455M280o223M746n91
$$ 2331 7043 -363 1043 -1444 -130 4174 -5204 -2833 3686 -5669 -2214 2066 -4157 589 -2
362bj989P848o055k685P796m356M91K011o113M985r51o565Q464j788p384O627
$$ -2 -1991 5857 -198 -2883 4913 557 1048 3059 -3054 1931 980 -5585 2879 1091 -6293 334
378C34J72o02J327o007N780M209p250L578M2n234P445j040m786K456l958K564
$$ 334 506 -96 1231 -4776 1004 5213 -2037 1541 1583 -3651 3794 2754 -2032 424 -3534 -970
394i70N694p247l57K396j901O867k434p314O036Q27J7L384q406q12P665j269K0
$$ -970 4724 -2523 -2880 -484 -2385 4482 2048 -5266 770 1597 1614 4998 -3408 -4220 3445 2176 2196
411B196n039m308R921J88o139L355k810n6P083l097j119m16l414Q490J865r411
$$ 2196 -2843 -7151 2770 2958 -3181 174 -2636 -2692 4391 1294 175 -241 -3655 4835 6700 -2711
427b711K53K84L751N110j0427l664Q606q52j02o51m024M904M11j685O292m946
$$ -2711 -2458 -2174 1577 6687 -3740 -7404 1202 350 248 -403 -4427 477 888 -797 5495 549
443E49m292O845j51M03j361q125N473O251n987k634k671K582Q118o869l462O749
$$ 549 -3743 3102 2951 3354 1993 -6132 -659 5592 -395 -3029 -5700 -3118 5000 -1869 -5331 1418
459A418k462Q67L414k970K761k123l866Q762k1p956n32L07O425P77j3897K113
$$ 1418 -1044 -177 3237 267 3028 905 -2961 5801 5780 -2176 -2708 -2401 4024 4801 -9096 -6983
475f983J0513l027k538j602J125O799n240j141Q875m828m207M141J167L495o450
$$ -6983 3530 503 -2035 -3637 -2512 4287 -953 -2094 6781 1953 -2254 1887 3054 6549 99
490I9q918J1212M821j0261l219J150O813K664j1686K408R584n281j59K511p69
$$ 99 -8819 2393 7214 -3047 -6266 -5116 1697 4361 -7325 -4917 4667 -614 -773 1738 969
505I69M029m847k993R909k898p042J276L62N328l242j0954Q026P293p854j436
$$ 969 4998 151 -2842 7067 4169 -2873 -1597 -1235 4093 851 -10103 -2077 5216 -2638 -4074
520d074P41M111M627r254O10J1097m166n758R54L015O649q464r677J2265L484
$$ -4074 -3333 778 5405 -3849 -3239 7858 3692 -2066 -1112 1903 8552 88 -9589 2676 6160
535F160r476j932J902N961o90j0664P452P849r479l29N717J802J85r567K399J3457
$$ 6160 -3316 -5248 -3346 2615 1925 -8739 -1287 6562 -2917 -3246 2471 4273 4458 -5109 -2710 10747
551A0747o892j0337L307M757M441p471q696J1146L430q280J407J114J343L399
$$ 10747 3855 -6482 -3175 1582 6023 -1448 -10144 1002 4432 -3848 -2441 -1327 16 3415
565C415n810K386N501o855L68L670q19J850o647k244J1015l183q632K783L012
$$ 3415 -2395 -9 5492 -1363 -995 2675 1856 3706 -2941 -5185 5830 2647 -5985 -3202 -190
580a90M071l404r214Q472P290p554k009J242L482L790q939n71R548n057m510L231
$$ -190 3881 477 -8737 -265 7025 -529 -2538 -1296 2186 5976 -2963 -3534 6014 957 -3553 -322
596c22R46J674n427j959J0363l007q915N830M085k24l115n826P840N165r178r95
$$ -322 624 2298 -3129 -5088 5275 2268 -6647 -817 3268 3044 -71 -5897 1943 7108 -2070 -3065
612c065L460R96J533o148l85P228m344j924M359k570M94Q92k268N114j383n125
$$ -3065 395 1391 2924 -3224 -3609 3619 -725 -2649 1710 -860 -366 526 -1742 3372 1989 -3136
628c136L776L88k5J210n767J682N370m595p95R84p41L470k519j698N578k834k588
$$ -3136 640 1028 1003 2213 -3554 -1872 3498 -1097 -1892 -908 -1649 1821 -698 -2396 3182 348 -2240
645b240M463p45O53j496m587N881K741o733m56R42J863K027n582L34M648l469
$$ -2240 2223 1478 2131 635 -3952 1929 4670 -2063 -2519 -1577 286 2313 -3269 -2935 1713 -1756
661a756J756K506m067J376J374L79K993n161k876O020k37j405j820l921M843K677
$$ -1756 0 2506 -1561 -185 1189 1568 4561 -600 -3476 2544 2307 902 -918 -4839 4 2681
677B681n219M76q0K96M765k805k100K841q62L227P62n985K254K274k264K010l001
$$ 2681 -2538 -2062 -2142 -1846 2919 114 -1986 855 -7 3220 3982 -2003 251 2525 261 2271 -730
694g30k682L913j140o88N18l610L702K734m299J830Q28n76M051k331k569L962
$$ -730 -3412 501 -639 -1327 -809 -4419 -717 2017 -2282 -452 376 -200 3851 1520 -1049 2913
710B913j733j32J208m030J758P46l486K630j407k500M894j769j500K792j450K017
$$ 2913 1180 1048 2256 -1774 -16 730 -2756 -126 -1533 -4033 861 -908 -2408 384 -1066 951
726I51K069m171K600J351l087L126j738k733L852k476j513K468l475J266J881
$$ 951 3020 -1151 1449 2800 -287 2839 1101 -1632 2220 -256 -1769 699 -2776 -1510 371
741C71l305K385J75k078M538j367j995M428k540l79L079l420R55R78l685K678
$$ 371 -2934 -549 -374 -2452 2086 719 -1276 3152 612 233 3312 -108 847 1825 -1860 818
757H18o60l040L449k181j217M087l181J24L091k636K251J619l913L098o0k021
$$ 818 158 -2882 567 -1614 -2831 1256 -1925 -1801 1290 -1346 905 2524 -1389 1709 1649 -372
773c72L754l361j635L882l189l5K046m270K379J679l320K697r73j229M746k641
$$ -372 3382 21 -1614 2268 -921 -956 1090 -3180 -801 878 -2442 255 -718 -1947 2799 158
789A58j397L655k700R91K350m390J591R39k726L046k081k155L998k342o33K917
$$ 158 -1239 2416 -284 707 3057 -1333 258 1197 -1529 1517 -564 -2719 1279 -1063 -1696 1221
805A221l486J917K957m077J774J067k320L134j522k026L494k640o62K968l961
$$ 1221 -2265 -348 2609 -1468 306 1373 -947 2187 665 -1361 2133 -507 -1169 1799 -2162
820b162J339K350l482K040N1k044L734j485j762L318k401M05K697m107J239J847
$$ -2162 -823 1527 -1955 85 136 -1908 1826 341 -1421 1897 -504 -99 2598 -1509 -270 1577
836A577l481K706k93l170L213n14j143K483l157J227L064l839J818J310l285K618
$$ 1577 -1904 802 509 -2661 552 38 -1105 1378 -1779 -552 2512 -1327 491 1801 -1484 1134
852A134k5j966K386k427q50L472l057J73J813k826K464Q26l174L084m11j737L776
$$ 1134 1109 -857 1529 -898 -1748 1724 -1333 -1160 653 -2173 291 1117 -2057 1027 616 -1121 2655
869B655j611j576J899k146J820P66m333K124Q58k821K777p23k087K462j007J478
$$ 2655 1044 -532 1367 -779 1041 1807 -2526 -402 456 -2365 412 -311 -2398 64 -943 535
885E35J654m383J933L589k464M77j081j135L562k186j838K296k609l89K504j418
$$ 535 2189 -2194 -261 3328 864 1341 260 -875 2687 501 -1337 959 -1650 -2039 465 -953
901i53M54j105j473N236m41m136K761N36N04J754l510M35J778k227J950m36l782
$$ -953 -499 -1604 -3077 2159 1718 -2418 343 879 1383 3137 -373 62 1840 -387 1563 1127 -2655
918b655J829Rn70K438l390l95L211r63J547l8l335L082K555j751O7k964J234M281
$$ -2655 -826 -817 -1387 1051 -2339 -2734 477 -486 1061 1023 -2312 770 3325 1574 1641 -1323 -89 4192
936D192m223k176K512j585L10N65j093J894l177p49O707q77m540R02K249L479
$$ 4192 -31 -2207 305 -1280 -970 -405 -1498 396 -2781 -3530 3177 2300 -2240 -1338 911 4390
952D390j691o194L618L946l646m86o67k68J249k999K055K676n716j53N085J93
$$ 4390 2699 -3495 123 4069 423 -63 -730 -998 251 -2748 -693 1983 -3733 -3886 1199 1392
968A392l13k885p63O653r85l900J452r88J669J720m453L51J440k551K488k41k351
$$ 1392 1079 -1806 -2569 4084 3099 -801 651 -337 1332 3052 -1401 -1050 390 -2161 327 86 -2265
985b265K057j998N17N267l172k435J474R24M381k626o587N053L553l678j640j014
$$ -2265 -208 -2206 -1689 3578 406 -2029 -555 369 4750 2124 -4463 590 4143 465 -1175 -2189
1001b189K675J445n355K232M140n535q87M346J526m16n960R62Q985k815o326K192
$$ -2189 486 1931 -3424 -1192 2948 -2587 -3474 872 2398 1982 -3978 -3016 5969 3154 -3172 -980
1017i80K057J923k411m362M755P58n104L631J301k787J79j173L587K449o396K85
$$ -980 1077 3000 589 -3773 982 1740 -3364 267 1568 -1219 -1040 -2213 1374 3823 -2573 -2288
1033b288M381j105J044k271k741M696m1k377R57k475J749K822m297J156J936k812
$$ -2288 2093 988 2032 -239 -2980 1716 1675 -702 255 -2220 -471 2351 -1946 -790 1146 -1666
1049a666J870P87q31J968m353J21O900k985m772J379J864L051l633m746O248J474
$$ -1666 204 991 160 2128 -2225 -2104 4796 1811 -2961 -1582 282 3333 -300 -5046 1202 2676
1065B676n174J726J647j03o71k697M745K100p346R84M861r60j561l064J396M749
$$ 2676 -2498 -772 875 772 101 -2596 2149 4249 -3097 -2113 2748 1788 227 -2837 -1441 3308
1081C308m113k294M332j621o93J419p60J930j570j913M823q60l494K309n67J8
$$ 3308 -805 -3099 1233 -388 -1081 338 -422 1508 -62 -1975 2848 1988 -1506 803 236 254
1097B54J576l118N23N68j758K952n20l880L143J051j064P23j593K048J771m035
$$ 254 1830 -1288 -765 -197 -1955 997 477 -3403 -260 791 -273 450 -1143 905 2676 -1359
1113a359J806K514l559K95R51PL44m137R37N038l834k455L285L31O4j248k94M221
$$ -1359 447 2961 -598 -303 648 655 999 -3138 -2201 2837 -997 -3452 -167 164 228 -1020 -1314 2907
1131B907k113k810M567m87k383O16l42J948r87l944K848J741l771Q85P45j36N24
$$ 2907 794 -2016 2551 2064 -319 297 -45 1903 916 -3028 -180 1561 -2210 -1325 -580 -716 -192
1148a92j856K303K493m253J185L197k125j91N2j40J577k828n96L204k984j058
$$ -192 -2048 255 2748 -1505 -320 2877 752 561 613 473 2050 -778 -1374 1830 -1154 -2212
1164b212K529j093j01m11n18L276j334k116L719k01j482J097p71J444n28l172
$$ -2212 317 -776 -877 -1288 -1806 1470 136 -1980 1739 1538 56 1153 382 1826 1298 -1874
1180a874L099L57m264J754J389j426Oj239J988J649l616J644K792k623M49Q17
$$ -1874 1225 1582 -2682 -928 461 -965 -959 -2198 -210 1439 -2177 -533 2259 -364 85 902
1196I02j42J482k677j76L441l138j515K435n95l71q89r73L329j407k464L829j57
$$ 902 760 2242 -435 -611 2830 -308 -1823 612 17 -354 -1243 -2216 1113 -294 -2758 1071 914
1213I14j808J256j18J086J29k943L195N20m079J766R79j469Q06j650R13J646l296
$$ 914 -894 362 244 1330 1459 -1484 1711 2231 -1848 -82 897 -572 234 -1416 -503 1143 -2153
1230b153J250K515k518M29J011m42J690k206l27L590k845j627K926j372l39R7
$$ -2153 -903 1612 -906 -477 534 92 1782 -424 -751 2839 -6 -1633 1293 -79 -418 -321
1246c21j032K242j236k174L833n62k454K161k89L20M72k442K516R15l555J692
$$ -321 -1353 889 -347 -2521 1312 750 -1704 457 168 488 960 -1482 1034 1949 -1606 86
1262H6R61k088J261r64L29J911l195M68L126k600L5J399r19J472j535q35L446
$$ 86 1047 -1041 220 -744 -415 1496 -1699 -1231 1895 -705 -670 729 -190 1282 -253 -1088 2358
1279B358k429j516K884j463n33Q55j468K028m47k439L030J73k282K010o92n2J226
$$ 2358 -71 -1587 1297 -166 -699 156 -1312 716 269 -2170 860 1033 -1249 761 69 17 1243
1296A243k313J670J282l279J297J005k188J041p23J7J909k385J75K922k637M85
$$ 1243 -1070 600 1882 -1397 -100 905 -1283 -242 -965 -948 961 -1424 -1249 1673 -964 -479
1312d79J909j756J279m49q83K291j711j484K824j655q33J148j511J445j82k324
$$ -479 1430 -326 953 504 -379 1912 201 -1283 1541 -114 -947 201 -1310 135 -47 -2371
1328b371K483L59j975K207j51n21J252j710J231J266k876J116R63j978Q12o49
$$ -2371 112 471 -1504 703 552 31 1283 -427 804 2070 -806 310 1273 -705 107 -542
1344e42p10J916j912l38K262j982N33J650j442J247K06j241J808n66j330K274
$$ -542 -1252 664 -1248 -1586 676 -1306 -773 877 -565 682 888 -353 1455 889 -441 1833
1360A833j599m59R49j557N05L32j968J642K94k052K157r2p29J622j039O03J130
$$ 1833 234 -225 724 -833 -328 4 -1964 -322 -28 -2080 77 -15 -744 878 -161 442 1572
1377A572j909J268P21j930R01r5j268J339j282q83J906j263j5P87j119J439O00
$$ 1572 -337 931 1652 -278 623 528 -740 599 -683 -1566 340 -923 -938 -151 -1270 169 769
1394G69j714J798K4r48J775j447j79J757k053jJ005j520O18j77j605K186p27j259
$$ 769 -945 853 877 -71 1704 257 78 1835 -218 -219 786 -734 -116 -293 -1898 288 -439 -1698
1412a698K052p52K07J014j421J375Q66j918J137J54j119J148j422m12J924j863
$$ -1698 354 -398 -191 823 -598 777 1643 -275 862 1016 -103 1045 -377 -789 1135 -728
1428g28n04J209r12Q16M4j567K348L7j922J908j97m2J018k195R07J361k294K40
$$ -728 -1232 -23 -935 -119 -75 -1642 706 743 -1179 729 532 490 1508 -687 220 1581 -713 -473
1446d73R52q42Q47j475l69K474j582r97K026n65L25N6j405K329J59k381J341J46
$$ -473 479 -363 484 -991 -1360 1114 -468 -1465 561 -4 321 377 -1028 1301 1460 -921 420 566
1464E66o31P23j814Q82J807k654K13J478j069Q55o73o05K349j308j171J853o22
$$ 566 -65 658 -1156 -274 1533 -1121 -908 570 -499 356 -317 -922 1427 119 -1052 801 179
1481A79K00L76j986J754N11k313J017P41q30R12j905M93K355k072k36J516n84
$$ 179 379 755 -1231 523 1034 -1279 -262 479 -351 561 -1344 -851 1504 -568 -804 712 128
1498A28N32n50j296K607m92k445J569J03j96J58j733J730J296k930P15J698o59
$$ 128 660 110 -1186 1421 929 -1516 53 156 -40 118 -1615 115 1411 -1519 -804 894 235
1515B35L55j274M58K455k380q51K109j020O8m49j089K201m73k268K001M04j317
$$ 235 590 -684 -226 2229 -151 -1002 1107 87 155 -294 -1383 818 345 -1923 78 482 -835
1532h35R75q48Q41J375k192P40J171j290Q53n44q83J868j401j201J734q73K7M92
$$ -835 140 -708 133 1508 -684 56 1227 -63 790 246 -637 1231 -170 -1371 363 -510 -483 9
1550Ij685J847M55j966J307R18p23J017j500M68K203k455m32J489p73r3p16q07
$$ 9 -1676 171 626 -1340 -33 885 162 1179 -321 147 2350 -105 -537 952 179 86 -630 -1437
1568a437K251r90j900K214j31q81J021p06J483L35k295J620J148j655L69l85j8
$$ -1437 814 -176 -2076 138 7 -874 147 -559 924 1259 -1036 584 1732 77 446 61 43
1585D3R76j961OJ643j539k14J060j024R87j75p39J907p80n02J586r38j40J023
$$ 43 1019 -942 -936 707 -832 -1046 14 -1010 -23 -198 -937 970 190 -312 1274 336 196 1219
1603A219j361N08K25j182J140q20r12J363p28r01J402o09O04M47j302J613L84
$$ 1219 -142 366 591 -591 549 -271 -1183 180 -548 -1449 -47 -656 -52 395 -907 706 1090
1620A090j615J130N06p78N11j217M05R30j976J85J497j527OL93k84J185j169j73
$$ 1090 -525 605 1111 333 844 -373 32 962 -1014 -829 668 -859 -853 -460 -744 441 -728 -901
1638i01K099r31o87J297n00L28l7j082J354o58j426J504j34r95O67p99M47P70
$$ -901 1198 267 -420 877 377 705 668 -414 940 282 -1144 360 226 -769 -102 -901 -454 316
1656C16j256J065O62j459R73L48p34P19p23K55J024j854M19J124j591K60M44n87
$$ 316 -940 125 787 -672 301 649 -85 634 -89 166 1190 -664 -245 879 -712 -452 -8 -595
1674e95O33l84l69J488r62n01J615o91q7M30j005J140k73j424J493K0j406Q57
$$ -595 38 -346 -715 773 -189 -690 925 234 147 577 -428 712 439 -985 508 528 -878 -21
1692b1k80K60Q4j074J167O38j774J093N25q27O83o22P2J218j755Q1J451j507M57
$$ -21 -301 -41 43 -1031 136 774 -1000 93 618 -209 474 -148 -76 1142 -613 -532 919 -588 -131
1711a31K85p02R14p06n36J865j056n24J473r94K74K23r06J168k29j376J379l07
$$ -131 154 -548 366 -340 -876 989 -67 -591 882 -112 162 385 -521 647 418 -958 421 114
1729A14j122J162n35J45N23j208J069Q04j620P59O61j149Q87m13j99J235j556
$$ 114 -1008 154 -381 -236 287 -921 148 952 -668 91 752 -397 490 77 -122 1113 -443
1746d43j51J317j375K63M94q05Q18n05o57J912j040n27J626n96j92P32r48Q06
$$ -443 -594 723 -652 -389 105 -700 118 -387 -1044 868 -172 -699 927 331 139 871 -77 729
1764G29j34j408J473l00j300R05l28j16M70r69O94R53j509Q73P85j023P01m06
$$ 729 595 -813 660 360 -940 -35 -363 -479 -9 -978 -284 669 -840 33 818 -205 496 90
1782I0p0J252j255l68J579j561k14P36q85O68k94j054J668m76q75J519l59j05
$$ 90 20 1272 17 -351 1228 -333 -547 189 -696 -28 -322 -1376 292 -184 -1059 460 101 -4
1800dO32p64R01L88j420J016K1j328R27m02m38N47j010L78R90j644Q52J055j323
$$ -4 628 -136 765 1153 -267 749 770 -558 369 -33 -471 76 -934 -556 434 -1210 -358 697 -626
1819f26O37K38l14J074r80l2J419j409k05R73p89J6j63p82J076l73j183J409L8
$$ -626 11 249 -65 1009 29 -3 1416 7 -198 775 -14 2 -161 -943 133 -240 -1423 -14 24
1838B4n40Q09o61P71L98j245J146M90j299N35m4m76N24r86Q4Q68j568N29O95q94
$$ 24 -516 293 -368 403 801 -444 702 1192 -107 428 384 -92 432 -554 -470 398 -1170 -641 54 -840
1858h40O51K81o34J102o06m3J270j071l53J255q47J88Q0j120J180n09j279J524
$$ -840 -189 92 -542 560 -46 -89 1181 110 -243 1012 165 353 433 -687 493 -16 -1295 229
1876B29l24j016J116l44M16K70j199J024Q67j342P57M9m78N62q31r4R19r63P5
$$ 229 -95 -1111 5 -339 77 347 -852 172 1039 -303 454 503 25 587 -244 -338 581 -382 -307
1895c07N18r32P51no46J096m38o65J375q67p0J028j103M20K08n97N18m21o68J399
$$ -307 211 -721 30 25 -621 475 37 -628 747 -120 -190 838 -265 155 363 -234 284 -137 -805 594
1915E94o94q07J098l23K0L27q79J033J88j243J151qp41N15o54K12R19j542J30
$$ 594 -100 -907 191 -132 -112 215 -664 369 557 -686 465 457 -284 231 -423 -211 708 -834 -704
1934g04J376j041J38J81n28J231n72o81J330n00n23P89r19M49M90j395R04K15
$$ -704 672 -369 -231 -50 -578 653 81 -600 730 230 -293 496 -423 26 516 -879 25 240
1952B40q06N91l52j17R99j038n2J281j012M17L03q62J226m74q89J206k85o25L50
$$ 240 -566 25 -327 -444 555 -483 -535 746 -266 151 454 -408 818 344 -545 661 376 -249 101
1971A01o68N11N47j559N07R59q59M58P5m82J429r65l35J065n89p4M37r94R16j90
$$ 101 -567 -56 491 -1068 -561 398 -461 -3 72 -410 1019 54 -281 784 195 121 558 -436 480 290
1991B90j409J247q5p23M75m94K94J077j350J63J369q49L29J22p05J309p57q75
$$ 290 -1119 128 43 -680 -205 -699 -405 672 -678 -515 854 5 334 456 -249 1060 303 -572
2009e72J317o79n29M75p24P80Q1j437J133M93j049Q10j94n3J048j095K21J376
$$ -572 745 66 -463 12 -712 68 149 -1288 -155 338 -711 99 -95 -148 900 -195 26 1402
2027A402j327OM22o98N72m03p87J261n84q59Q47k84K10L45p82P53M77o94Q57k92
$$ 1402 75 81 503 -195 377 -26 -813 448 -136 -995 -148 -432 -222 123 -659 94 571 -123 734 442
2047D42m52R44o97o54J230r21k6J77r06Q96r4r61J084R3q48Q31m75M59Q66j356
$$ 442 -10 934 237 -417 813 -108 -134 43 -863 33 -61 -1022 62 155 -693 138 -337 122 988 -368
2067c68N16R62j128Q3K28l10O06q71m00J269r55n83Q98l09N88j46j113J604M5
$$ -368 148 1110 -18 65 293 -17 589 -282 -682 587 -368 -951 -53 -362 226 80 -1033 571 616
2086F16j085J061j72l63N68o83L70R4r83O15K45q87M30o2m30Q28m41j7Q75j053
$$ 616 -469 592 420 57 625 -58 312 406 -577 38 283 -604 -174 -236 -666 162 -279 -296 579 -474
2106d74M29R23j001K65K28m76N58n28m26J267j103k86J212o92j64K29k91P51o1
$$ -474 -45 878 -123 142 370 -106 452 -76 -502 765 -338 -624 588 -104 -268 -39 -330 421 360
2125C60r59J100p2o99N57l50L57N4r23P39M18j388P09K84o33O79q30M04R99j169
$$ 360 -599 501 429 -270 287 -63 294 348 -575 164 582 -806 -97 187 -446 233 -597 -193 806 -363
2145c63J14R09q42J24M66p58Q55m98o63J048m28m31P93p17K58K11n02Q33j53q29
$$ -363 -249 660 -182 -58 408 -350 505 7 -656 392 -36 -467 326 -391 -133 78 -424 409 256 -573
2165e73J063o3p48P00k92J84J82j068P58K72j023L79L32n38L64k79J00J025j209
$$ -573 490 427 -321 379 87 271 453 -615 143 415 -608 -229 103 -435 -71 -350 -250 775 -434
2184d34J53J045p46O6L91n89N79l22q53J146o65m33Q60m39L7N8n99R30J56j032
$$ -434 -281 764 18 84 475 -114 465 143 -710 436 -229 -662 198 -241 -204 -146 -745 185 341 -691
2204f91J144j6n62O84m06j30O59q37J11N05j049L60L24q72O84k95j54P81q01K50
$$ -691 453 437 -125 559 153 23 682 -155 -44 461 -588 -228 96 -776 -92 -387 -541 240 -561 -311
2224c11J092q90P2O98n87M24j64o34J111r75o37J137m78l69L08m10M01M00r86
$$ -311 781 -109 -37 661 74 498 334 -300 811 -164 -801 336 -142 -511 -203 -613 -212 188 -798
2243g98J128K54j072Q50Kk00P34r68J88N58r79L03M76q61J61j08k11Q05p20k39
$$ -798 330 584 -488 362 364 164 898 -70 118 676 -303 0 476 -385 -224 -332 -543 262 -458 -697
2263f97J190o58n9O46m80L63P6n13Q57m92n90Q53m05m44M33n55M38o7o46O58J74
$$ -697 493 -165 -224 422 -58 305 381 -132 725 233 -357 496 91 -353 80 -475 -37 -104 -750 -92 82
2284H2q48R25L1k43N54o56L74O96j045J75O17r32M34j05m97N56o35l05J044o54
$$ 82 -766 159 190 -53 501 -155 219 915 -130 45 662 -270 164 59 -438 118 -517 -822 222 -432
2304d32O5Q22q08N02K85q67Q96N4r30Q81j67m74O31q54K72M72j018O61L39j203
$$ -432 -367 455 -353 149 434 -433 463 517 -413 468 301 -173 458 -396 -124 348 -670 -9 330 -873
2324h73P64K03m13M38k51K00O57j092M78N27q37L34o5m46O70m70k17P78n51j96
$$ -873 -109 94 -319 119 -132 68 725 -367 111 638 -199 135 70 -376 294 -176 -393 385 -166 -362
2344c62P94p50K81M95p22M72m6n36P86l21m47R63q44R5L17m54L23J76q81P59K43
$$ -362 432 -318 -37 458 -264 208 162 -374 412 91 -356 607 -237 -142 175 -279 44 220 -661 98 341
2365C41n61L46n0q1O04q42J29O92q86L3N28o45O56l55n22R67m30m33R24n94K45
$$ 341 -220 126 76 -5 599 -243 -114 578 -308 -275 253 -392 264 -91 -613 354 -76 -509 415 -179 66
2386F6J81o60P60Rp80Q23j83m05N74q60K14N52p72M64J30n92P18k75n41Q66j77
$$ 66 247 -413 347 356 -424 399 216 -189 385 -475 -261 291 -481 -17 113 -479 239 -36 -577 289 112
2407A12m68Q34m78K28K28o32J50M73p98M35j48k90O27o76l65R28l76j35N96n16
$$ 112 -356 478 0 228 456 -176 -26 447 -351 84 -64 -354 273 -403 -768 160 -216 -351 245 -271
2427b71N30J10p22R15l2p73O36m38P9L31p80J76M97p10J95J42l56P47k03m20R08
$$ -271 259 369 -353 562 530 -243 393 -45 34 365 -415 -239 258 -452 -257 -115 -471 276 73 -347 561
2448E61j85m01O37n86L89J04p07M49J35p81M65l02j49O23q49J30P61o61K63K03
$$ 561 376 -25 612 26 415 519 -188 261 396 -385 80 -222 -371 252 -597 -467 294 -367 -104 99
2468I9l33O99j65p13J028l84k51N53o03J83J35r77O94Oo90O59k00j46P81p02L4
$$ 99 -234 465 300 -413 615 231 -20 533 -70 113 248 -729 -35 -29 -719 -60 -260 -406 375 -327 -293
2489b93P83n59K53J60l51L86J24p69O69k59m58M63n93K03N30j097M86O91p12K22
$$ -293 490 -69 184 344 -7 379 503 -266 403 144 -314 149 -444 -241 289 -808 -322 369 -343 -121
2509a21K31k96P14n28l12R72m05k37K10l39L14p4n33N21lo38L64P4k61N80o06
$$ -121 110 -186 528 0 -312 660 255 18 228 -111 203 129 -404 117 114 -524 -160 -86 -347 233 -373
2530c73M80L80p43M49K47n86L14p4l97P15m30j92L14m88J73K37o93P68j13j92
$$ -373 107 487 -256 193 440 -146 168 94 -303 412 -18 -210 104 -384 -211 26 -667 101 -12 -204
2550b04L45m1r0N60o30k30P67m73J7J43l89L06K2q23J008k83k53M02k62J37K67
$$ -204 141 100 10 570 -60 -290 477 4 21 164 -225 81 103 -720 288 5 -248 154 -108 29 296
2571B96o70M05N50p79J46J83m01M89n18J20O51p65j9N23n83M56J09m99N77k58
$$ 296 -374 31 581 -198 -52 131 -270 219 -299 -179 472 -293 -312 211 -372 84 193 -306 271 13
2591A3j36M37l64N3M78m96l2K90l44J73J55p41O19j41k44N45l58j6M59n66N50
$$ 13 -123 314 -50 3 481 -15 -47 243 -101 72 227 -514 105 -36 -280 265 -93 -109 350 -216 334
2612C34J58q21M66J62n20L88l87j03P45q16J4N36l22J10Q3k79N59j67l54P97l06
$$ 334 492 -329 137 299 -221 167 -220 -323 422 -394 -380 156 -166 -56 27 -252 307 140 -214 583 277
2633B77k87L55k77N0Nm34M58p9n81M41K4k92L77j78O8M12o44L84K42l83L48J61
$$ 277 -10 345 68 118 123 -311 147 68 -513 -72 -48 -340 37 -141 -73 339 -305 79 321 -62 286 447
2655D47n51M19l47n1K65m81oL54m36R8J86k95L69p1l77R72m60k06P44m08j32J19
$$ 447 -104 315 -32 -83 182 -299 -305 49 -387 -289 -103 -398 -29 -100 -477 495 35 -171 573 165 33 152
2677A52j12J92L4q24O28J76p93L19r7mM68o41K57M41n30N04J60k59M24m27lL41
$$ 152 40 232 266 -558 70 246 -547 -228 -325 -329 139 -502 -245 196 -334 170 330 71 495 68 65 406
2699D06m32j73M66k78m36L40k73M14j94k49N25l40j29P11l55k1N11m39J57K32
$$ 406 -26 -199 267 -11 -447 -107 -380 34 -160 -409 116 -224 -353 358 3 -18 493 54 211 443
2719D43q51O53J23n77L17k35j75L57m20k4O67o82K08N46m22L93k89j89N72l72
$$ 443 -408 245 368 -209 108 -127 -302 55 -365 -389 278 -404 -196 350 -72 321 32 -157 415 43
2739D3j60O28l50k90K93o00M20O1m81O99k60n62Q05l30j36M74j70J42J53m98M35
$$ 43 -117 511 161 -129 164 -436 -16 45 -436 263 3 -559 246 -84 -220 254 84 226 379 -119 316
2760C16j15m93M15M4l58J94l29K36L59o89K67M44n08K85J9o9N12m96j76N82m22
$$ 316 201 -292 123 167 -191 3 -326 -90 269 -420 -153 291 -217 68 87 18 530 34 -142 440 18
2781A8k08N34l45m3J29n14N64k9q04P94l6k03L96m53K70K66p67M05L27n72M39
$$ 18 -190 344 -1 -44 85 -429 135 106 -698 96 60 -143 253 -200 70 336 -431 -26 301 -271 168
2802A68j09l70M65k71LM57n84J23M60o05K02J85k74L80m02J62N32m23l75L90k11
$$ 168 59 -311 154 -117 -114 343 -241 -118 342 -263 -61 124 -150 230 -172 -10 522 99 -276 114 -97
2823i7Q8J14m72M93j40m70O30j15m5K2m1J76L33n85R9L85o63K64L05n93M12m19
$$ -97 -9 105 -367 126 -14 -484 146 31 -14 8 -33 143 476 -109 -10 375 -288 -24 281 -312 100 -319
2845c19J42K45n06K00M87l57J34K44o00N18Kl35N76m33k21O23l91q7J89l43K10
$$ -319 -177 68 -438 -238 249 -108 26 270 -330 188 190 -145 431 -2 -223 400 9 -78 111 -232 -22
2866b2q2m01O47j21l14M94p9L4K22n96M21L15n48J04K50m70Qj8j83O66n94j6M05
$$ -22 -104 -505 142 21 -293 201 122 156 378 -218 203 518 -30 74 324 -146 -138 -156 -339 327 -267 -283 122
2889A22l36K6J39j61N36k82k31N53j83MJ27k09j82L62m83J75O2o37M55l7k87M15
$$ 122 -214 -188 -49 -210 326 44 -187 366 183 187 314 105 -77 285 -198 -23 39 -598 -143 -180 -467 -52
2911e2q2J6J98j23K57O3m82O17k4l49K05k68o2M25n74J8M58l21k48L53k45K69
$$ -52 -134 -118 80 -43 214 277 -205 412 388 39 244 -24 -86 339 -235 -217 241 -80 -328 25 -220 49
2933D9l9l02O41k01k62N18m06O2L79o06L87J73o23K67m8l01M92k55l21O78m23
$$ 49 10 -292 349 148 -114 404 -2 60 439 -167 220 393 -230 37 -11 -312 180 -75 -396 282 -141
2954a41j66M71k41K09J44k15J48O5n15L91j72O6K32o73K39L19k83qm2j67L71j01
$$ -141 -307 164 -77 132 276 61 209 274 -241 150 -22 44 276 -397 -158 161 -122 -130 -172 -339 32 -69
2976f9n4L58r4k50L01k06J90l5l65N27j76k78J63%k63M45l74M5L66l65K82rk41
$$ -69 -123 235 141 -109 192 -14 176 141 -224 303 127 -151 12 12 -251 194 -180 -135 231 -134 148 139 -102
2999a02K78j32j91N06m70l1L31j63j50K84n89M18J20k78K14j02N6K19l4m45N32
$$ -102 176 44 -147 359 -111 -142 189 26 -124 160 -429 -11 109 -169 45 -57 -1 218 184 -261 271
3020B71l73P9K01k95L14o1n78N83l7k99J2l8J06M47n01J91K58l23L0OJ0J31p5
$$ 271 -102 -23 178 -117 197 136 -442 141 104 -195 -183 -221 -115 332 -169 22 280 -43 -13 -7 3 134 59
3043E9j74K66k41r7L42k14Q9j9m25N81M7l76L31j86r1M45l95J16L46l88j58K29
$$ 59 -115 151 -90 -187 155 -59 30 11 -414 167 214 -162 169 -17 -108 337 -58 58 404 16 -142 87
3065H7m36L73q1l34M56k81N6K88l53L77K14m98K67O7l43L76k70J05K32m15j77
$$ 87 -349 24 -57 -391 65 -216 -160 128 -225 152 366 -132 135 202 -141 235 -35 70 302 -113 -290
3086b90O85o45P2K88m40M07O6l53K10j3k04M33j89m6K29k39J5K31l12J38j18l37
$$ -290 395 -250 -178 110 -330 77 143 -210 0 -13 -217 216 27 -19 210 -29 -14 217 -95 43 -75 -412
3108d12M82j83k63M38j97j00K61n2J91Q1l78M51O3m54K49j09j51M87p45K19K71
$$ -412 70 -113 -376 62 -135 -235 26 -26 165 246 -132 319 382 -72 177 68 -83 404 -341 -122 149
3129A49m59K42o3j24J70q2n9K91M3j50L31k52J63K29m67J27M8j64R8r9j92L33
$$ 149 -310 -68 -131 -255 -85 -167 -226 65 108 -42 289 37 200 429 -38 89 137 -27 71 -28 -220 113
3151A13l73L4L69l32K8L66l70K96N0m05N01Ol59M64n71J16L68n24R5L83n31K48
$$ 113 -260 -226 143 -189 -161 205 -165 131 181 -224 277 283 -76 388 -183 -67 301 -223 -128 255 -276 -28
3173b8K1k97M95k83j94M50k08J79qj63M28r7k74K37j37m19M48k40N8K42m02R2
$$ -28 -7 -304 191 -92 -286 164 -44 135 127 -36 392 295 21 258 121 -298 150 -90 -32 210 -192 -100
3195a00J36l56K74J43k06K06j17j0L28j91j86J21p0k5J38l35J81J50l13L56p0
$$ -100 36 -320 -46 97 -109 97 -20 -30 298 107 -79 42 -28 -53 85 -250 -69 81 -232 124 54
3216E4k92M80m35J52J47q0k9N8k02M18j48m19M93k06j97L13l18R4J96l40J97R5
$$ 54 -238 242 -193 -41 106 26 -3 55 -147 271 123 -296 197 -9 -206 107 -211 -117 79 -261 -64 31
3238C1j58L00M0k08K52k87p1M23l13j77L00m22L35K40n46M41q2r0K11j58j51J24
$$ 31 -127 173 213 5 257 -30 -101 322 9 -168 132 -290 45 285 -261 180 98 8 219 61 -90 34
3260C4n9j5K76l58K78l2m28M66k01j51K76k13MK21l83K72K35m31L73L6n3j04o1
$$ 34 -25 -40 236 -122 156 124 -304 162 -39 -190 86 -127 -123 98 -285 -13 222 -209 164 200 147 43 -18
3283a8K5P8k50Q8J88j29l3q1j01K86k02PL27l58J36J29O8j82K06j18k1L08n04
$$ -18 7 85 -165 -77 111 -18 -51 -132 -233 53 -149 -142 185 -173 -37 92 160 -22 184 66 45 353 -151
3306a51L32j44j93L2k1M9J56l10J77j03j61L09K58m01M09k76J09J31k43L2K10
$$ -151 181 37 -156 -124 -145 -96 60 -250 -73 -176 -337 -28 230 -171 238 -38 71 202 -41 -9 201
3327B01j53r3j7k3m8jj45K84j70m5L67l79L29J67k06q4M13k91O3L8n12K51R8k81
$$ 201 48 -45 -62 -85 -133 -134 -279 5 -165 -210 157 -222 107 274 68 -16 397 106 169 207 -305 -54 44 -237
3351b37K73j75j18J73j67J91J06j58J94k57o4M48r6j38M32l80J8J64m00L03r7
$$ -237 36 -139 -257 -84 -251 -60 46 -112 82 -175 -239 209 113 -25 407 27 45 209 -191 112 15
3372A5r7K44l20l6J60k26J24Q8j60K47O3l29M26O8m50M15k10m6P8k51K9J43j11
$$ 15 -82 162 -158 -194 -34 -260 -136 -48 -208 39 102 -227 199 267 -183 232 22 -24 54 -197 -168 -25 -136
3395a36M5K2k51K45L4j51L50l1j86K12k14K07N6k40M1J6j81K86k32o4L25k79J8
$$ -136 -91 -69 -320 -75 -41 -192 158 127 -59 153 -61 146 202 -38 3 19 -162 124 -108 -172 153 -126 -108
3418a08J05l3J31o4m2P5m4j6J55j28q1L15l67J1J88j60j35M84j51P3j78k11K92
$$ -108 -3 -36 95 31 -11 64 20 4 159 31 -50 265 -102 -91 97 -63 -198 286 135 208 30 -181 111
3441A11k06M0K86j14j39K86m67R4P8j41J47j15p9K61L0j66K13k22Q5J02l61L67
$$ 111 -95 -55 231 117 -22 264 -203 -109 -31 -172 -25 -140 -219 42 72 -94 119 -103 -18 84 -277 90
3463I0j76Q3L1k8j55L74k95j00L34j32Km6j79J04J05k61L34j65j27N98m31J9L25
$$ 90 -86 -3 28 0 -155 219 -76 -176 158 26 28 -18 -197 -93 12 -249 85 -80 -207 391 -40 -21 304
$$ [...]
8191a21
##END NTUPLES=NMR FID
##END=
