##TITLE=1H_Pr D5-2
 200.13MHz,CDCl3,
 8 sc
 
 7.7.2025
##JCAMPDX= 6.0         $$ Bruker NMR JCAMP-DX V2.0
##DATA TYPE= NMR FID
##DATA CLASS= NTUPLES
##ORIGIN= UXNMR, Bruker Analytische Messtechnik GmbH
##OWNER= pz
$$ XWIN-NMR		Version 3.5
$$ Mon Jul  7 13:57:56 2025 Russian Standard Time (UT+4h)  she@DPX200
##.OBSERVE FREQUENCY= 200.1313
##.OBSERVE NUCLEUS= ^1H
##.DELAY= (6, 6)
##.ACQUISITION MODE= SIMULTANEOUS
##.ACQUISITION SCHEME= undefined
##.AVERAGES= 8
##.DIGITISER RES= 18
##SPECTROMETER/DATA SYSTEM= spect
##.PULSE SEQUENCE= zg30
##.SOLVENT NAME= CDCl3
##.SHIFT REFERENCE= (INTERNAL, CDCl3, 0, 14.3821)
##AUDIT TRAIL= $$ (NUMBER, WHEN, WHO, WHERE, WHAT)
$$ ##TITLE= Audit trail, XWIN-NMR		Version 3.5
$$ ##JCAMPDX= 5.01
$$ ##ORIGIN= Bruker BioSpin GmbH
$$ ##OWNER= she
$$ F:/spectra/data/she/nmr/H-C/1/audita.txt
$$ ##AUDIT TRAIL=  $$ (NUMBER, WHEN, WHO, WHERE, WHAT)
(   1,<2025-07-07 13:56:33.57 +0400>,<she>,<DPX200>,
      <created by zg, POWCHK disabled, PULCHK disabled
       configuration hash MD5:
       00 E9 B6 7A A2 85 ED C7 34 08 36 98 17 FE 4E 26
       data hash MD5: 16K
       C8 C6 42 21 A9 17 EF C2 6E DB 24 D1 76 DA 11 EC>)
$$ ##END=
$$ 
$$ hash MD5
$$ 26 FA 43 4E 7B DE F8 4D B9 FF 13 5E 06 CA 32 CD
##$RELAX= 
##$RELAX= 
##$RELAX= 
##$RELAX= 
##$RELAX= 
##$RELAX= 
$$ Bruker specific parameters
$$ --------------------------
##$DU= <F:/spectra>
##$EXPNO= 1
##$NAME= <H-C>
##$PROCNO= 1
##$TYPE= <nmr>
##$USER= <she>
##$AMP= (0..31)
100 100 100 100 100 100 100 100 100 100 100 100 100 100 100 100 100 100 
100 100 100 100 100 100 100 100 100 100 100 100 100 100 
##$AQSEQ= 0
##$AQ_mod= 1
##$AUNM= <au_zg>
##$AUTOPOS= <>
##$BF1= 200.13
##$BF2= 200.13
##$BF3= 200.13
##$BF4= 200.13
##$BF5= 200.13
##$BF6= 200.13
##$BF7= 200.13
##$BF8= 200.13
##$BYTORDA= 1
##$CFDGTYP= 0
##$CFRGTYP= 5
##$CHEMSTR= <none>
##$CNST= (0..31)
1 1 145 1 1 1 1 1 1 1 1 1 1 1 1 1 1 1 1 1 1 1 1 1 1 1 1 1 1 1 1 1 
##$CPDPRG= <>
##$CPDPRG1= <>
##$CPDPRG2= <>
##$CPDPRG3= <>
##$CPDPRG4= <mlev>
##$CPDPRG5= <mlev>
##$CPDPRG6= <mlev>
##$CPDPRG7= <mlev>
##$CPDPRG8= <mlev>
##$CPDPRGB= <>
##$CPDPRGT= <>
##$D= (0..31)
0 0.7 0 0 0 0 0 0 0 0 0 0.03 0 0 0 0 0 0 0 0 0 0 0 0 0 0 0 0 0 0 0 0 
##$DATE= 1751882193
##$DBL= (0..7)
120 120 120 120 120 120 120 120 
##$DBP= (0..7)
150 150 150 150 150 150 150 150 
##$DBP07= 0
##$DBPNAM0= <>
##$DBPNAM1= <>
##$DBPNAM2= <>
##$DBPNAM3= <>
##$DBPNAM4= <>
##$DBPNAM5= <>
##$DBPNAM6= <>
##$DBPNAM7= <>
##$DBPOAL= (0..7)
0.5 0.5 0.5 0.5 0.5 0.5 0.5 0.5 
##$DBPOFFS= (0..7)
0 0 0 0 0 0 0 0 
##$DE= 6
##$DECBNUC= <off>
##$DECIM= 32
##$DECNUC= <off>
##$DECSTAT= 4
##$DIGMOD= 1
##$DIGTYP= 9
##$DL= (0..7)
0 120 120 120 120 120 120 120 
##$DP= (0..7)
150 150 150 150 150 150 150 150 
##$DP07= 0
##$DPNAME0= <>
##$DPNAME1= <>
##$DPNAME2= <>
##$DPNAME3= <>
##$DPNAME4= <>
##$DPNAME5= <>
##$DPNAME6= <>
##$DPNAME7= <>
##$DPOAL= (0..7)
0.5 0.5 0.5 0.5 0.5 0.5 0.5 0.5 
##$DPOFFS= (0..7)
0 0 0 0 0 0 0 0 
##$DQDMODE= 0
##$DR= 18
##$DS= 0
##$DSLIST= <SSSSSSSSSSSSSSS>
$$ [...]
##$SUBNAM0= <"">
##$SUBNAM1= <"">
##$SUBNAM2= <"">
##$SUBNAM3= <"">
##$SUBNAM4= <"">
##$SUBNAM5= <"">
##$SUBNAM6= <"">
##$SUBNAM7= <"">
##$SUBNAM8= <"">
##$SUBNAM9= <"">
##$SW= 18.0517328524113
##$SWIBOX= (0..15)
0 0 2 0 0 0 0 0 0 0 0 0 0 0 0 0 
##$SW_h= 3612.71676300578
##$TD= 16384
##$TD0= 1
##$TE= 0
##$TE2= 300
##$TE3= 300
##$TEG= 300
##$TL= (0..7)
0 120 120 120 120 120 120 120 
##$TP= (0..7)
150 150 150 150 150 150 150 150 
##$TP07= 0
##$TPNAME0= <>
##$TPNAME1= <>
##$TPNAME2= <>
##$TPNAME3= <>
##$TPNAME4= <>
##$TPNAME5= <>
##$TPNAME6= <>
##$TPNAME7= <>
##$TPOAL= (0..7)
0.5 0.5 0.5 0.5 0.5 0.5 0.5 0.5 
##$TPOFFS= (0..7)
0 0 0 0 0 0 0 0 
##$TUNHIN= 0
##$TUNHOUT= 0
##$TUNXOUT= 0
##$USERA1= <user>
##$USERA2= <user>
##$USERA3= <user>
##$USERA4= <user>
##$USERA5= <user>
##$V9= 5
##$VALIST= <valist>
##$VCLIST= <CCCCCCCCCCCCCCC>
##$VD= 0
##$VDLIST= <DDDDDDDDDDDDDDD>
##$VPLIST= <PPPPPPPPPPPPPPP>
##$VTLIST= <TTTTTTTTTTTTTTT>
##$WBST= 1024
##$WBSW= 4
##$XGAIN= (0..3)
0 0 0 0 
##$XL= 0
##$YL= 0
##$YMAX_a= 352473
##$YMIN_a= -375352
##$ZGOPTNS= <>
##$ZL1= 120
##$ZL2= 120
##$ZL3= 120
##$ZL4= 120
##$ABSF1= 10
##$ABSF2= 0
##$ABSG= 5
##$ABSL= 3
##$ALPHA= 0
##$AQORDER= 0
##$ASSFAC= 0
##$ASSFACI= 0
##$ASSFACX= 0
##$ASSWID= 0
##$AUNMP= <proc_1d>
##$AZFE= 0.1
##$AZFW= 0.1
##$BCFW= 1
##$BC_mod= 2
##$BYTORDP= 1
##$COROFFS= 0
##$CY= -3
##$DATMOD= 1
##$DC= 2
##$DFILT= <>
##$DTYPP= 0
##$F1P= 0
##$F2P= 0
##$FCOR= 0.5
##$FTSIZE= 0
##$FT_mod= 4
##$GAMMA= 1
##$GB= 0.15
##$INTBC= 1
##$INTSCL= 1
##$ISEN= 128
##$LB= 0.25
##$LEV0= 0
##$LPBIN= 0
##$MAXI= 10000
##$MC2= 0
##$MEAN= 0
##$ME_mod= 0
##$MI= 1.114404
##$NCOEF= 0
##$NC_proc= 0
##$NLEV= 6
##$NOISF1= 3.799351
##$NOISF2= 2.8
##$NSP= 1
##$NTH_PI= 0
##$NZP= 0
##$OFFSET= 14.38212
##$PC= 1
##$PHC0= -1207.74
##$PHC1= 21.59238
##$PH_mod= 1
##$PKNL= yes
##$PPARMOD= 0
##$PSCAL= 0
##$PSIGN= 0
##$REVERSE= no
##$SF= 200.129724274929
##$SI= 16384
##$SIGF1= 3
##$SIGF2= 2
##$SINO= 400
##$SIOLD= 16384
##$SREGLST= <1H.CDCl3>
##$SSB= 0
##$STSI= 0
##$STSR= 0
##$SW_p= 3205.1282051282
##$SYMM= 0
##$S_DEV= 0
##$TDeff= 0
##$TDoff= 0
##$TI= <>
##$TILT= no
##$TM1= 0
##$TM2= 0
##$TOPLEV= 0
##$USERP1= <user>
##$USERP2= <user>
##$USERP3= <user>
##$USERP4= <user>
##$USERP5= <user>
##$WDW= 1
##$XDIM= 8192
##$YMAX_p= 0
##$YMIN_p= 0
$$ End of Bruker specific parameters
$$ ---------------------------------
##NTUPLES= NMR FID
##VAR_NAME=  TIME,          FID/REAL,        FID/IMAG
##SYMBOL=    X,             R,               I
##VAR_TYPE=  INDEPENDENT,   DEPENDENT,       DEPENDENT
##VAR_FORM=  AFFN,          ASDF,            ASDF
##VAR_DIM=   8192,          8192,            8192
##UNITS=     SECONDS,       ARBITRARY UNITS, ARBITRARY UNITS
##FACTOR=    0.0002768,     1,               1
##FIRST=     0,             0,               0
##LAST=      2.2672688,     0,               0
##MIN=       0,             -375352,         0
##MAX=       2.2672688,     352473,          0
$$ Real data points
##PAGE= N=1
##DATA TABLE= (X++(R..R)), XYDATA
0 0 0 0 0 0 0 0 0 0 0 0 0 0 0 -8 8 -8 8 -8 13 -16 16 -22 24 -30 32 -40 48 -52 59 -68 78 -89 100 -113 127
35 127 -143 159 -180 198 -221 245 -275 303 -334 371 -408 449 -496 546 -602 662 -730 807 -890
54 -890 984 -1093 1217 -1361 1529 -1732 1979 -2287 2686 -3223 3983 -5144 7114 -11088 22166
69 22166 -118570 -375352 10774 285274 92586 -174879 -132806 58781 87488 15531 17395
80 17395 -65646 -121576 31984 160083 36632 -166870 -141344 122501 169707 -72978 -148069
91 -148069 -1023 81100 53466 -14251 -40437 -26184 -3069 74044 75202 -74973 -87115 66517
103 66517 93551 -17071 -70553 -538 52716 -12983 -17298 51791 -15614 -82169 19570 92866
115 92866 8354 -97569 -43679 99432 55890 -86600 -40041 59724 13806 -49681 -898
126 -898 60105 -21333 -105403 21835 121194 -26131 -131379 -12759 104444 39386 -83126
137 -83126 -50680 50506 27037 -14933 14741 1373 -36813 -1351 60083 37880 -57533 -58439
149 -58439 55584 70008 -29614 -54553 6474 37013 5959 -15121 7503 -1134 -26505 17884
161 17884 45569 -16502 -45052 12154 43639 -5229 -37010 9934 28628 -26083 -29033 30996
173 30996 23548 -41185 -39353 28831 39105 -28872 -45810 14031 29198 -12883 -16062 15260 1676
186 1676 -28013 5843 47788 1582 -57237 -10285 64783 28935 -53420 -34268 37701 35010
198 35010 -12019 -21088 -3530 2799 9814 23679 2589 -40392 -15391 49266 37277 -32530 -47994
211 -47994 15025 56063 4946 -45540 -14575 20870 13982 1159 -11997 -20692 -11556 15169 29336
224 29336 -15559 -51820 2415 46231 5423 -34839 -19132 20916 22900 -12268 -9999 7683
236 7683 -5662 1353 17343 -214 -15940 -9803 14290 24097 -15921 -27255 16064 19957 -6815
249 -6815 -10436 1259 14428 663 -10986 15440 8143 -17222 6346 17157 -3666 -9740 -4191
262 -4191 12398 5978 -21168 -2249 14177 -10610 -9682 3096 1179 -299 -12674 -2348 17863
275 17863 -7038 -14551 10698 6438 -2498 -4158 -3363 11104 -1362 -11991 11655 763 -17057
288 -17057 5739 9720 -3125 -8077 -7559 15107 10768 -17869 2 14976 1160 3254 -1163
301 -1163 -1434 10025 -1392 1093 8819 -12087 -5759 12771 98 -6755 -10280 -3032 15712 -5156
315 -5156 -18148 7357 4629 -4237 3335 -3385 -263 2288 -2907 9186 -490 -15329 6269 8571
329 8571 -6617 -3657 -5906 1971 8004 -10499 -4900 7527 -2627 1149 3150 -2944 4885 1350
343 1350 1462 10699 -4666 -4825 12377 2445 -4759 -569 -523 6090 -1492 -10063 3820 1447 -5175
358 -5175 3630 -2413 -4568 3845 -116 1947 1981 -7002 3072 7081 -3493 -2132 -2562 -232 5654
373 5654 -4980 -6026 2281 -4118 -1742 4563 -3715 -4990 -1544 2398 7394 -1890 -6530 3850 4528
388 4528 3207 3605 -4319 -1821 5644 3634 2106 -3589 -6799 2830 6463 833 -4492 -8191 202
403 202 9677 2590 -5330 -5673 -865 8406 7748 -4194 -8979 -1217 9654 7078 -7159 -9986 185
418 185 5981 3737 -3206 -9220 -6166 4163 8754 49 -10830 -7453 6401 12946 1904 -12364
432 -12364 -6950 10507 13343 -844 -11937 -4502 9009 8309 67 -6305 -8340 1230 11001 5117
446 5117 -6686 -11970 -1616 14455 9382 -8452 -12916 -1521 15499 11991 -10787 -13207 2289
459 2289 10495 7919 -5229 -12406 -2232 4724 6520 2981 -11912 -11561 3843 10661 7017 -9961
473 -9961 -18408 5728 19751 3330 -11855 -11443 6358 16495 -109 -7861 -2301 -2904 5181 9270
487 9270 -1701 -7361 -9764 1349 19206 3090 -18951 -9594 9230 18200 1746 -20475 -3929
500 -3929 15311 6393 -318 -6212 -7284 5416 6239 3078 -273 -14632 -6585 13468 8365 -5601
514 -5601 -16890 -9609 19078 14585 -14939 -15005 782 14533 12081 -11539 -11181 5773 5584 6218 1905
529 1905 -10162 -4753 1193 7260 12337 -11240 -21671 5284 19574 7288 -15328 -20414 12381
542 12381 23139 -4106 -12022 -3497 4211 11313 1868 -3684 -1704 -9595 1785 17452 64 -16691
556 -16691 -13338 6200 22780 -1658 -26391 -5161 14801 10968 -1070 -14649 -4200 11787
568 11787 5864 2054 -3701 -10617 1880 10025 5105 -1794 -15761 -7551 17572 10415 -11047 -15886
582 -15886 -2977 18777 10983 -15772 -11326 6956 12064 6333 -8573 -7589 6593 4255 2512 2870
596 2870 -7980 -7654 3973 9287 4156 -14313 -14373 12184 14064 -6099 -13126 -4065 11084 9946
610 9946 -7130 -6735 2414 3125 4326 1276 -3741 -2513 -2870 2962 7597 -4671 -10410 -169 5755
625 5755 4486 -3841 -8155 1382 6026 2013 -17 -2678 -751 4316 2007 878 797 -2689 -1634 3127
641 3127 3795 -362 -7085 -4236 5785 4734 -3719 -6641 -1487 5481 4015 -3456 -3751 1266 3011
656 3011 2243 476 -1295 -2508 -352 4648 2680 -5099 -6044 1517 5905 -185 -6366 -3715 2146 3944
672 3944 906 -3501 -2140 2307 3217 2211 -959 -2554 1368 3705 1867 -904 -3970 -771 3830
687 3830 665 -2369 -1672 -1880 1539 2087 -1659 -1675 -1245 628 3455 -654 -1505 1532 -518 1277 2590
704 2590 -2111 -1212 251 -182 2567 -1167 -4381 193 666 687 829 -4433 -1112 3150 -599 671 -370
721 -370 -2872 3167 2953 -1136 367 -2072 1181 5137 -2285 -2303 1257 -1141 2440 1062 -4605 -197
737 -197 664 -439 2330 -2830 -2163 4019 -68 410 1162 -3332 2803 3925 -2856 355 -129 -1152 3765
754 3765 -1875 -3121 1437 -2145 542 1142 -5118 703 2582 -2472 1437 -714 -1726 4468 -47
769 -47 -1418 2734 -1694 1592 3191 -3662 563 1975 -2373 1356 -965 -3462 2799 -519 -1811 1449
785 1449 -2542 974 3284 -3109 1240 2191 -2271 3093 955 -2317 2593 -443 -886 2116 -3231 -834
801 -834 2102 -3171 74 72 -3510 2336 301 -2814 2465 -223 -803 3506 -998 301 2601 -1680
817 -1680 1824 1243 -3504 1582 508 -2257 1246 -1971 -1741 1943 -1698 -449 1563 -2238 1340 1829
833 1829 -1453 1993 506 -746 3315 -123 -1619 1846 -746 32 981 -2662 -374 -70 -1656 1738
849 1738 -1065 -3246 1617 965 -241 809 -1484 1027 2967 -771 398 266 -1157 2308 876 -1932
865 -1932 -614 -1748 143 2243 -2128 -2911 -31 710 1578 -235 -1933 1175 1456 991 2056 -1046
881 -1046 -1254 2240 2105 208 -1947 -1665 1494 1284 -1363 -1455 -1341 -610 594 429 -291 -1601 -1251 2505
899 2505 2706 -1100 -2659 1007 3913 1070 -2480 -735 1074 210 -246 -558 -628 -2022 -1341 2209 984
916 984 -2989 -2006 1169 3210 1075 -2991 -922 3005 1988 551 -1328 -1815 1739 1987 152 -584
932 -584 -2764 -651 2893 -267 -1206 -1500 -2239 1824 2802 -653 -1991 -2525 2400 6223 -1858 -5136 1342
949 1342 3677 2225 -1799 -3838 1959 1254 -2187 1799 183 -3846 -1360 1452 3863 -415 -7568
964 -7568 569 8009 122 -4048 -1838 2365 5091 -1956 -3268 2907 -600 -1456 2697 -139 -1476
979 -1476 -1991 -1942 4659 1223 -5872 -1022 2000 2088 1587 -4602 -1552 4943 476 -405 -717 -2654 3065
996 3065 2429 -2630 609 -657 -2057 1525 -136 446 -694 -5967 2245 6588 -3385 -4967 -33 4268
1012 4268 4741 -4779 -4496 6032 1933 -2441 839 151 607 -1306 -1881 5490 335 -8287 185 5674
1028 5674 987 -3515 -5343 3467 6452 -4051 -2907 2933 44 1306 796 -404 1933 -2306 -1299
1043 -1299 4925 -522 -3869 -613 -451 2516 887 -5187 -685 1845 398 1910 -2552 -2336 4230
1058 4230 1555 -1257 -47 -724 2298 1037 -2490 2182 369 -4693 914 3208 -534 -3327 -3668
1073 -3668 3379 4761 -5354 -3522 3926 2533 -339 -2166 458 3442 -1453 -1724 4354 108 -3934
1088 -3934 -413 2599 2167 -3498 -4644 3483 2859 -3394 -1794 770 1048 753 -737 571 749 -1470
1104 -1470 1842 2936 -1245 -1382 355 1337 963 -1697 -1419 574 -844 -178 920 -1667 -1768 696
1120 696 1780 495 -2278 -45 3625 691 -2020 628 1632 -84 -1117 737 1685 -1795 -2742 1394
1136 1394 1619 -1901 -2766 741 2200 -986 -2238 1155 1993 -489 -590 1601 1662 -1413 -1336 2591 1219
1153 1219 -2641 -1169 1445 787 -1723 -1878 1298 345 -2336 286 1721 -727 -858 421 2037 625
1169 625 -2208 962 2796 -667 -983 341 604 223 -1545 -164 1394 -2252 -1528 1911 -139 -1757
1185 -1757 -562 702 1597 -1016 -1588 2712 539 -1660 1596 834 -378 -266 -674 1718 -283 -3345
1201 -3345 1059 1675 -2151 -539 261 508 485 -2256 913 2754 -2092 -417 2528 -63 -263 -637 494
1218 494 2474 -2069 -1720 2959 -453 -1961 622 -444 442 -914 -2068 2186 214 -2626 1441 982
1234 982 -631 282 -862 1440 1663 -2356 811 1964 -2301 83 788 -568 501 -1883 -146 1981
1250 1981 -2469 -1106 2279 -1020 -717 645 -458 1614 -795 -1012 2932 -196 -1903 1953 86
1265 86 -272 311 -1104 1328 210 -2896 1086 997 -2094 100 -91 35 994 -1855 732 2194 -1996
1282 -1996 417 1881 -703 236 -78 -275 1593 -1672 -1186 2144 -1065 -1460 277 -792 394 -505
1298 -505 -1456 1988 56 -1812 1688 555 -338 838 -142 1225 922 -1847 778 1308 -1795 9
1314 9 -51 -960 209 -980 -413 782 -1431 -149 1560 -761 28 619 -99 1357 -193 -303 1300 -189
1332 -189 -580 926 -511 -778 -229 -675 656 -750 -1907 996 366 -936 149 -223 499 759 -84
1349 -84 882 821 -569 636 1073 -379 -355 -789 -140 788 -725 -613 148 -161 -170 -167 -488 154 359 292 835
1370 835 62 166 1068 530 456 -113 -291 380 -108 -121 -120 -726 -612 58 9 -530 -443 -592 1015 252 -297 140
1392 140 197 1044 614 -309 383 450 -289 437 -118 -541 -139 -742 103 201 -1019 -331 49 -36 879 -682 -764
1413 -764 1237 743 131 266 -231 1099 873 -913 571 81 -899 258 -42 -235 201 -1361 -47 1232
1431 1232 -692 -692 160 223 1571 -7 -1266 1187 477 17 768 -635 153 490 -1123 471 525 -1453
1449 -1453 -227 237 97 835 -1508 -791 2101 -119 -674 -28 -347 1767 232 -1627 1178 522 -1117
1466 -1117 584 -271 -16 168 -2013 582 1500 -1859 -1001 715 329 813 -1618 -895 2544 42 -1040
1483 -1040 688 -164 385 582 -1060 1236 187 -1691 584 415 -747 56 -1518 61 2082 -1425
1499 -1425 -1156 667 -142 1253 -292 -1205 1664 681 -931 840 -242 39 512 -1398 791 1185 -2240
1516 -2240 -477 970 66 -57 -1749 -263 2297 -654 -1310 924 226 563 27 -1011 1376 100
1532 100 -1612 1067 896 -690 -344 -977 886 905 -2462 -292 1340 -423 -130 -554 -450 1314 -181
1549 -181 -530 1230 -372 -116 1140 -210 572 165 -954 650 414 -930 -191 -472 -225 717 -904
1566 -904 -645 708 -41 650 -83 -668 981 412 -563 632 640 -430 -85 -352 850 97 -1622 -147
1584 -147 792 -531 -1006 -635 469 723 -1150 -110 1242 2 -205 550 756 172 -458 -111 1080 -288
1602 -288 -937 142 379 -176 -747 -488 399 -167 -603 488 222 -624 -26 575 674 16 -349 663 545
1621 545 -73 302 -155 -219 -209 -411 38 -572 -870 212 345 -834 -352 310 461 271 -431 864 596 -448
1641 -448 138 785 183 -453 -361 303 432 -1284 -746 622 -449 -703 -276 191 482 -517 -276 1295 61
1660 61 -642 895 575 387 -401 -594 1332 105 -1139 391 287 -888 -131 -494 129 66 -1019 319
1678 319 561 -832 135 602 72 540 -291 197 1132 -606 163 991 -817 -231 155 -370 126 -423 -777
1697 -777 867 -442 -912 984 -173 -169 463 -224 856 -58 -727 1308 461 -1128 249 129 -473 286
1715 286 -1166 242 930 -1536 -62 693 -818 111 60 64 1174 -759 -249 1674 -507 -211 865 -331
1733 -331 401 -42 -604 1007 -401 -1308 878 -124 -883 354 -503 270 319 -1079 906 779 -975 755
1751 755 713 -227 614 -436 122 1087 -1289 -1 1058 -1172 -248 175 -637 452 -544 -604 1037 -696
1769 -696 -550 942 -205 -62 125 -139 1023 263 -873 960 14 -1111 422 -95 -417 247 -801
1786 -801 548 365 -1396 172 843 -535 35 -28 151 796 -783 41 1387 -573 -105 670 -236 168
1804 168 -624 -438 744 -231 -825 650 -103 -353 -57 -439 417 192 -591 881 513 -533 256 366 176
1823 176 324 -442 274 62 -792 87 248 -746 -270 53 12 -162 -539 127 939 -425 -200 720 267 25
1843 25 0 435 189 -507 -513 595 50 -541 -379 123 225 -687 -798 602 203 -357 86 429 209 71 318
1864 318 875 330 -557 407 257 -97 -332 -349 -22 -83 -658 -173 209 -489 94 12 -216 -128 -255 744 457
1885 457 -318 316 632 -120 56 31 234 83 -918 10 618 -813 -779 154 -30 182 -384 -345 1049 129
1905 129 -192 873 -74 241 411 -215 494 357 -661 422 130 -422 225 -287 -147 266 -424 -261 349
1924 349 -459 636 241 -597 650 176 -232 720 -238 42 587 -589 -4 416 -981 -440 118 -343 385
1943 385 -661 -530 1286 -341 -594 454 -43 397 179 -843 945 591 -573 584 178 -264 465
1960 465 -874 -130 871 -1451 -571 317 -558 221 -430 -664 1209 90 -644 745 -1 -35 570 -667
1978 -667 603 678 -1156 152 319 -628 -17 -637 -222 1076 -1019 -784 752 -335 154 50 -457 928
1996 928 36 -757 833 266 -414 429 -539 241 533 -1085 -1 405 -519 -167 -210 -376 996 -321 -455
2015 -455 710 -102 41 162 -389 692 546 -700 353 275 -212 382 -674 119 595 -1100 -580 860
2033 860 -499 -172 -219 -188 657 -137 -657 950 147 -448 363 -164 677 -91 -784 718 436 -720 -86
2052 -86 79 124 108 -627 -1 497 -593 -167 381 -110 189 24 155 492 -128 -177 441 -271 6 208 -358
2073 -358 11 194 -499 -108 -255 -353 574 -131 -484 365 215 -107 -55 242 562 -15 -385 552 305 -324 -192
2094 -192 85 556 -184 -920 320 46 -424 -268 172 455 -159 -597 303 703 -325 -39 425 485 348 -376
2114 -376 133 592 -446 -284 379 -324 -78 -196 -194 442 -328 -252 506 -291 -3 427 125 106 352 -38 579
2135 579 -4 -469 551 -193 -404 162 -55 -171 -269 -420 418 -25 -766 311 486 -140 195 34 602 449
2155 449 -629 276 937 -646 -384 121 13 345 -740 -482 548 -547 -399 523 -488 -14 -34 -172
2173 -172 818 12 -504 937 225 -446 419 -252 21 269 -617 339 150 -813 306 173 -639 102 -183
2192 -183 97 467 -632 289 743 -641 197 385 -159 207 -168 -218 785 -687 -619 879 -384 -296 -83
2211 -83 -276 443 -299 -720 910 87 -475 793 389 58 310 -441 433 385 -907 319 602 -761 138
2230 138 -323 -254 495 -619 -104 667 -583 -88 651 -340 333 101 -180 748 -255 -224 1020 -198 -421
2249 -421 143 -306 192 -156 -546 494 64 -1063 514 -268 -492 243 -37 373 370 -672 348 619 -543
2268 -543 317 444 -29 364 -364 -109 437 -643 -50 378 -535 -183 234 -223 257 -329 -312 762 -38 -258
2288 -258 430 134 171 55 -288 340 -203 -507 289 166 -592 -5 -2 116 82 -729 254 232 -521 273 173 -157
2310 -157 68 -588 197 351 -371 -7 284 -39 -211 -270 -254 215 -215 -162 234 -4 -156 358 98 268 138
2331 138 42 576 -50 -233 491 60 -139 274 71 278 -177 -339 61 -311 -701 -54 112 -12 -107 -78 209
2352 209 25 -235 262 186 5 143 72 88 33 -528 104 294 -555 -288 -167 -148 232 -46 -275 240 -344 -138
2374 -138 257 -299 147 229 -6 466 191 -31 432 -9 -210 272 -406 -417 72 -332 82 -241 -625 350 312
2395 312 -379 264 177 149 466 -549 519 484 -467 121 436 -251 -148 -322 -280 493 -557 -599 247 -230 80
2416 80 -73 -397 290 143 -363 579 44 -214 535 -165 56 471 -510 -13 131 -484 111 -178 -599 460
2436 460 -40 -609 297 -168 179 328 -393 541 583 -363 263 242 -316 260 -379 -180 466 -656 -375 309
2456 309 -359 -57 -102 -443 519 76 -279 643 -271 125 518 -360 385 429 -398 209 325 -336 19 -321 -398
2477 -398 420 -527 -416 427 -254 -106 115 -423 598 152 -409 517 185 -74 257 -327 126 639 -663
2496 -663 34 277 -404 -196 -79 -272 270 -306 -522 476 -20 -73 99 -295 425 270 -391 283 335 -87 142
2517 142 -72 -132 435 -222 -360 396 -259 -39 87 -167 419 107 -381 212 133 35 159 -139 182 319 -201
2538 -201 183 363 -291 -192 -402 -17 288 -530 -237 108 -24 -245 -69 -122 246 -119 -249 515 165 -149 266
2559 266 -29 61 38 -232 135 148 -270 115 141 -312 73 -365 88 153 -1 147 200 -61 240 -7 -111 227
2581 227 81 193 165 -166 -118 230 -57 -62 -133 195 -84 -480 135 233 -469 -461 407 -38 110 -72 -19 530 -302
2604 -302 -196 540 84 181 95 -66 171 -59 -463 280 -25 -326 106 -3 235 152 -91 268 174 -214 286
2625 286 166 -74 376 32 90 179 -396 -84 173 -555 -200 122 -327 71 -91 -83 300 -400 -79 644 -240
2646 -240 -28 347 261 12 -43 -331 521 -249 -729 303 30 -95 46 -509 336 178 -510 311 476 -304
2666 -304 126 278 165 547 -220 259 850 -460 47 168 -436 101 -269 -590 347 -350 -467 494 -193 -124
2686 -124 352 -187 228 230 -241 612 11 -189 599 83 -556 219 -193 -287 32 -636 225 235 -649 259 199 -269
2708 -269 175 -117 303 466 -583 -72 786 -187 -81 254 -215 525 -542 -665 505 -407 -321 121 -368
2727 -368 -236 245 -39 410 46 -333 355 24 -4 404 103 179 208 -227 -18 308 -667 -78 210 -383 -1
2748 -1 -141 62 -5 -494 18 559 -241 -404 419 -1 123 -81 -86 292 -269 -318 476 20 -170 -15 -84 -158 -151
2771 -151 -367 246 163 -356 65 381 -48 58 -27 447 467 -433 22 246 -328 -88 61 118 -9 -383 -24
2792 -24 361 -156 -314 -96 52 -20 -189 135 441 -255 -319 414 136 -93 171 187 405 -274 -360 468 42 -357
2814 -357 -23 -54 -138 -46 -335 245 166 -420 191 262 -135 -27 -65 278 264 -259 57 -19 -138 -210 -24 -154 -121
2837 -121 -157 -25 178 -258 -220 335 67 -59 275 173 426 -65 102 431 -180 -59 255 123 -141 -266 -327
2858 -327 268 -46 -398 83 150 -117 166 -163 446 313 -261 317 454 -298 196 159 -5 94 -454 19 125
2879 125 -344 -37 75 -357 -24 171 -209 379 4 135 243 -120 87 526 3 200 -121 -49 246 -170
2899 -170 -324 432 -345 -405 110 -235 9 -63 -439 19 252 -328 49 245 -128 207 -130 148 524 -591
2919 -591 25 304 -338 -85 -44 -536 161 -290 -175 189 -328 -178 270 -90 227 455 -62 327 172 -235
2939 -235 373 -90 -375 298 -250 -578 90 -247 102 71 -527 14 -37 -399 190 194 -54 360 -203 220 632
2960 632 -176 36 158 -372 -9 -135 -330 294 -208 -324 223 -224 -317 149 72 -118 302 -287 521 273 -559
2981 -559 312 -12 -45 283 -235 -83 372 -86 -112 70 -423 218 -83 -285 346 -319 60 291 -184 171 465
3002 465 -207 259 214 -277 38 -157 -228 432 -352 -236 186 -129 -47 49 -424 298 8 -271 210 146 -103 225
3024 225 -309 369 284 -172 -67 319 -56 140 -27 1 219 -280 -319 86 -50 34 149 -15 208 52 -325
3045 -325 133 63 -157 150 -165 79 236 -208 -1 37 -147 -23 -126 -106 67 -242 -132 119 -209 139 -162
3066 -162 -47 304 121 -237 221 57 64 138 -195 119 107 -310 -362 -118 -183 141 -151 -36 196 -271 -298 231
3088 231 -159 263 83 -145 261 216 -128 85 65 93 46 -328 15 196 -289 -36 61 -169 -26 -242 -150 298
3110 298 -225 -27 27 -43 318 -43 -401 271 -60 -426 70 -187 -126 255 -409 -3 125 -337 58 -6 -428
3131 -428 184 17 -125 300 -25 -109 130 73 267 347 -334 294 362 -384 -206 -169 -160 15 -335 -197 192 -310
3153 -310 -220 79 -224 320 -238 -54 395 -116 -279 437 43 133 189 -193 144 -22 -401 94 154 -329 232
3174 232 -111 -389 248 -95 -62 382 -314 246 340 -47 424 146 -128 474 -176 -130 -13 -337 -298 276 -251
3195 -251 -84 -37 -350 210 -197 -351 476 -190 -184 209 -129 318 308 -195 276 286 -262 34 -87 -209 -7 -446
3217 -446 -77 310 -334 298 29 -203 322 239 42 431 -57 -172 328 -191 -15 364 -177 285 -258 -324 156
3238 156 -13 -435 95 -48 -156 251 -247 -144 188 -31 335 116 -222 283 24 164 86 -223 47 127 -339
3259 -339 238 371 -386 -69 161 -43 181 -19 -78 323 -195 43 281 64 -176 -119 -288 262 -75 -336 37
3280 37 -254 -169 -21 -143 -123 62 -267 273 -84 -67 134 2 126 200 -14 219 291 -63 63 -96 -196 151
3302 151 13 -67 -59 -277 4 38 -121 57 68 -209 -43 -32 4 213 -3 161 120 -175 83 195 120 40 7 -145
3326 -145 59 33 -147 245 -17 -118 9 -60 -160 209 -207 165 129 -78 256 228 43 407 -10 102 159 -424
3348 -424 7 291 -144 168 -267 -187 68 -302 -146 423 -146 -93 218 -140 40 59 27 173 65 -90 299
3369 299 79 -38 55 -276 151 -39 -179 324 -61 -438 50 6 12 239 -282 106 378 -201 36 -150 -329
3390 -329 81 140 -58 75 -132 -182 282 -289 -80 151 -36 6 -174 -126 260 -54 -86 538 -218 57 53 -204
3412 -204 -134 -36 -229 133 -231 -321 128 -289 -267 92 -9 23 246 -373 138 94 -366 -45 -38 -172 222 -188 -23
3435 -23 240 -324 -16 43 -266 -30 115 -315 107 -160 -166 163 123 13 385 24 211 282 -147 152 -32 -317
3457 -317 227 -44 -125 191 -362 -198 198 -74 90 37 -220 302 135 -151 260 133 156 317 -189 -230 366
3478 366 -65 38 57 -264 89 -135 -370 10 -210 -129 32 -264 152 328 -70 31 115 48 172 39 121 243
3500 243 -311 -173 30 -321 32 98 -151 250 153 -296 19 60 -6 287 -111 106 484 -201 -72 23 -349 171
3522 171 -41 -233 288 1 -56 64 -151 -117 -57 -222 16 104 -51 210 174 -74 148 125 -15 181 -162 20
3544 20 40 27 3 -73 12 127 -42 -153 172 134 147 -78 -192 -21 75 -35 10 -148 107 259 6 -235 134
3567 134 -35 111 -12 -56 123 -171 -194 171 -142 -85 -113 -43 -129 199 49 27 54 73 55 -106 -84 233 -64 -43
3591 -43 290 -168 119 -231 -44 126 -122 -218 170 -129 113 128 -48 290 220 -82 135 192 -140 103 -31 1
3613 1 282 66 36 223 -39 -87 111 -223 189 45 -335 -26 -72 -229 226 50 106 191 -308 227 233 -370 77
3636 77 128 -212 116 -82 -242 153 -372 -277 -19 -304 169 52 -37 391 171 162 253 -100 4 227 -224 -8
3658 -8 144 -197 124 148 -169 -111 -235 -216 191 -187 71 222 -56 179 93 -267 435 -33 -69 307 -136 -18
3680 -18 211 -210 -112 185 -224 100 83 -325 142 47 -3 273 149 237 45 -19 18 12 -168 178 71 -187 105
3703 105 88 -82 104 -330 -113 121 -124 45 264 -80 -11 -19 101 252 -24 -129 154 187 -54 76 -71 -168
3725 -168 32 -212 81 -99 -239 197 -160 183 90 45 115 333 -152 -198 225 -234 144 355 14 151 135 42
3747 42 -95 -266 -208 -17 -290 15 107 -198 24 -171 -207 218 8 114 10 122 343 -40 -162 163 142 -253
3769 -253 117 -175 10 -77 -126 33 -23 -229 -15 200 -103 100 146 -11 102 105 -113 267 133 100 21 -8 2
3792 2 -17 36 215 -354 -103 -19 -162 -44 28 41 87 67 70 39 125 -122 90 171 112 221 -165 -64 212 -5 182
3817 182 -114 -92 56 -203 -177 110 -159 -43 225 -281 -53 -20 -137 140 -125 78 55 37 -42 249 -50 68
3839 68 194 -303 100 58 43 14 -27 14 73 -4 -78 125 -75 128 -101 -214 -52 -3 -329 208 279 -138 212 -219
3863 -219 55 51 -334 117 1 -241 -100 -121 -77 35 -197 159 67 -22 124 66 -132 2 146 -110 38 -227
3885 -227 -206 99 -317 -113 -111 -129 121 32 -68 191 -42 -102 103 165 -149 76 -345 158 115 -344 72 107 -225
3908 -225 -141 19 -398 74 -88 77 175 -332 93 -117 23 -14 -101 -185 201 -52 -19 302 43 -151 5 -138
3930 -138 -89 -60 -230 -39 0 -218 55 66 53 172 -22 139 47 -224 35 59 -94 -46 56 -71 -88 -3 -65 109
3954 109 -186 -141 219 -192 43 118 171 255 -137 40 201 -78 -2 240 -46 53 79 -73 -166 160 -41 -291 18
3977 18 -118 -15 39 -48 88 -265 93 210 28 94 165 -85 111 152 90 -41 -260 -192 99 -184 -171 196 -173
4000 -173 138 -144 31 45 -117 -20 175 -205 -72 -35 90 169 -16 -38 96 189 -151 62 30 -64 149 -243 90
4023 90 37 -227 -18 -28 24 352 -153 138 199 38 -39 34 -215 32 22 -83 -53 126 56 -115 35 -60 156 -57
4047 -57 245 35 -89 -94 -172 -23 91 162 -184 -75 -90 20 -2 -86 33 90 -169 135 -112 -107 103 108 89 7 -157
4072 -157 -87 -2 -139 178 -90 98 27 47 -112 151 -172 -39 -27 -192 -109 26 -46 15 97 -123 91 59 17 95
4096 95 -173 141 26 -35 -9 11 18 127 -99 -8 273 -206 210 94 -129 -85 33 -91 366 -85 -328 -61 80
4119 80 163 276 -307 -14 135 -159 31 156 4 -5 -164 -150 204 -349 -131 133 34 104 -71 155 123 -59 -50
4142 -50 37 41 -36 105 136 104 378 -208 58 -5 -70 84 -37 -45 35 -108 -39 113 -4 211 151 90 146 -75 -108 -52
4168 -52 -135 43 34 14 -90 -59 -321 -23 221 -45 30 -44 109 161 146 -255 333 24 -48 165 27 11 73 127 -105
4193 -105 -221 -149 134 -29 110 156 -74 -21 62 -114 81 -48 -114 82 206 64 281 26 -36 -32 -176 -117 334
4216 334 -2 -10 99 83 95 -147 132 249 -62 -207 151 -59 36 -11 288 128 -12 10 206 -59 -144 159 -213
4239 -213 -8 -22 -271 -36 55 -185 -75 -62 -29 318 -256 -170 117 93 69 -24 -293 203 99 -235 -159 -64 149
4262 149 -61 8 -177 107 -3 34 -86 32 -55 -421 -71 135 11 84 104 -141 226 30 -206 -55 145 -317
4284 -317 137 67 -52 -65 -152 9 -183 -216 -358 -137 -268 -198 116 -131 14 128 115 99 3 131 93 -208 -44
4307 -44 -86 -57 22 -101 49 192 0 -26 -69 -60 153 19 -87 -62 -179 39 125 144 -53 92 74 132 -69 -23 59
4332 59 -187 54 -4 154 -112 222 51 -84 47 -135 144 -41 121 211 47 -98 21 -98 -213 171 -70
4353 -70 -4 -15 -151 67 18 -209 290 21 18 92 -245 -14 63 -69 34 -22 -75 7 156 -33 245 187 -75 -90
4377 -90 -41 106 -81 -182 60 191 -183 71 45 -123 143 -152 111 74 -54 -18 227 14 -98 66 -76 58
4399 58 -155 106 103 47 -32 266 -80 31 71 -240 -6 -75 20 121 82 -190 191 -156 6 174 -203 5 -16
4422 -16 -146 -110 25 94 -138 -12 -25 162 -130 33 6 -110 259 -25 -234 -26 -45 -100 130 -222 101 -116
4444 -116 -60 -123 138 44 -103 -97 -257 126 13 -82 105 32 11 29 -1 178 -115 -118 141 63 39 78 -85 -150 167
4469 167 -124 11 177 89 13 105 -205 -150 143 -104 177 -29 -50 449 -15 -39 26 -105 -2 97 -155 34 -25
4492 -25 35 83 -38 180 189 8 48 -35 -116 -100 120 -67 -99 -192 -76 -23 -128 16 135 -206 -88 -47 105 -93
4516 -93 -253 -22 281 -79 138 22 -113 -44 -81 62 81 86 -149 141 -81 23 4 -195 -5 10 -25 -63 -98 -87
4540 -87 156 121 68 -121 29 -37 94 27 -102 174 23 134 100 -4 -60 -107 -11 90 -107 109 -74 13 169
4563 169 248 -19 82 57 95 125 -10 -86 27 -147 240 36 -68 44 48 147 -38 -50 -173 21 -88 137 9
4586 9 -59 -81 92 -174 310 -52 -95 124 54 57 31 -132 5 177 -129 -135 59 -201 -160 -30 -93 118 15 49 -3
4611 -3 -137 -118 81 102 -167 -146 -132 266 -218 19 72 -44 -87 -28 -202 -79 237 -294 -101 66 -38 126 -176
4634 -176 60 36 -34 131 -66 -99 -42 226 -165 -50 -92 125 112 -219 155 135 -67 29 -61 -16 143 -20 87
4657 87 15 -24 88 -7 -103 111 10 -245 -24 123 -136 -97 -101 110 203 43 -144 133 -68 -75 279 -56 7 175
4681 175 -126 199 -129 38 80 -116 94 7 80 -60 24 -173 85 50 -62 -75 125 61 -130 -62 -6 148 236
4704 236 -154 -75 70 45 29 -55 -47 -246 160 99 -200 -93 -68 -12 13 -90 -124 -153 -9 -23 -6 167 197 29 102
4729 102 47 40 185 -32 94 70 -14 -35 46 48 -119 -53 -28 61 -197 -10 63 -101 187 -150 221 72 -151 44
4753 44 -127 96 -136 -41 86 -26 -93 -75 -55 -214 -176 -193 -171 4 35 164 142 -97 211 -62 -183 89 -31
4776 -31 -63 140 -61 34 -7 -134 84 -50 -99 -137 -128 85 186 111 51 49 -148 117 119 -11 -28 -58 -141 -37 11 -15
4802 -15 66 -82 137 -150 -124 -240 63 -91 310 -145 -332 -59 103 183 -15 105 30 25 -200 86 -107 -94 -121
4825 -121 -194 -75 37 25 35 -79 -12 0 40 26 79 -135 23 -91 -148 19 -128 123 -116 -110 66 63 -169 -132 107
4850 107 20 -164 119 83 44 51 -104 197 178 -49 220 307 7 47 -77 -281 -18 72 113 -214 86 -161 200
4873 200 90 126 75 -69 -51 56 112 0 63 -188 13 33 28 58 71 48 -162 278 123 -167 241 -186 1 -92
4897 -92 73 -23 219 106 -6 274 -19 -36 165 21 -106 197 40 340 -209 96 144 -57 56 99 -116 186
4919 186 347 -8 -45 -23 -48 80 -124 20 113 -106 22 -171 55 47 9 -132 41 163 44 -128 -31 -41 286
4942 286 2 -32 40 -8 -101 -47 -41 116 -120 -111 74 35 -161 -93 114 96 -24 -75 -32 189 -89 24 -81 17 25 56
4968 56 -145 19 107 115 63 -70 -76 -24 117 -26 34 -189 210 -72 60 74 77 37 83 -177 -18 182 34 -103 36
4993 36 135 114 165 -130 -13 -118 -44 -333 -59 138 -23 -13 129 -187 -40 -87 -34 -54 -189 -16 9 48 -142 122
5017 122 125 344 26 -85 41 107 51 23 45 -226 -39 -168 -131 44 33 94 106 27 32 -154 17 171 37 156
5041 156 81 -137 -22 -81 -132 -55 74 -32 117 5 146 -73 11 53 -7 15 -15 -43 -16 -1 124 195 -33 76
5065 76 193 13 156 71 55 73 -234 -29 -223 -108 -6 -192 221 56 -88 39 -157 212 129 -150 101 225
5087 225 -48 -135 -69 -45 391 -15 -154 217 -104 -168 156 -123 -59 -92 62 203 -204 -74 -9 119 177 124 30
5110 30 25 225 26 -42 6 -151 -55 9 -46 71 78 -9 104 22 7 -14 7 58 -63 -26 171 90 -100 154 127 82 -11
5137 -11 -60 -41 -18 -274 -108 -100 -52 70 13 -99 53 -56 -58 -109 -19 -140 -73 65 -17 76 -74 -241 -45 -177 -187
5162 -187 -11 -205 125 -218 174 -137 -74 100 -22 -47 105 41 65 -57 -34 112 -9 93 89 -40 35 -80 -193
5185 -193 231 -31 -133 143 196 -158 48 135 94 -33 2 63 12 35 -156 149 27 -66 130 -270 -100 -116 -230
5208 -230 -86 -185 -40 -16 27 -9 -145 -51 6 168 49 150 65 -142 134 -53 -100 150 -198 173 35 -15 -192
5231 -192 118 -194 -190 64 13 -217 -89 171 94 -109 93 185 84 20 148 -10 40 158 -151 88 46 -95 -71
5254 -71 93 14 140 27 120 41 -203 21 -57 -134 329 -9 -25 21 167 -95 -193 50 181 116 58 31 -39 -22 -99
5279 -99 20 -149 50 -145 -29 68 74 -59 -145 -21 225 47 144 23 -110 67 -319 -34 -151 -62 -118 -9 75
5302 75 15 148 30 -92 198 171 -110 -114 103 52 -112 18 106 5 -97 218 -105 -152 -42 -27 -215 18 -171
5325 -171 -44 -44 119 -17 94 129 -19 -1 39 109 -126 166 81 -65 293 -71 -31 112 -94 40 61 -181 -117
5348 -117 57 -191 132 -13 24 7 59 64 -37 77 7 213 124 75 5 168 -4 1 3 135 -72 6 -25 135 36
5373 36 -52 2 14 57 -98 -85 -122 -110 -84 58 75 75 -133 27 -39 -98 239 114 -2 -36 -143 86 -45 -106 33
5398 33 160 174 -65 285 78 99 71 145 3 124 -195 252 -34 140 85 -58 56 41 119 149 -5 144 2
5421 2 -23 124 275 10 -20 -15 -46 -27 141 -110 128 -56 -34 12 55 6 18 -229 30 89 98 -3 -18 -13 33 131 -1
5448 -1 -12 -202 148 -51 -241 54 -83 -105 125 -3 88 162 -30 51 72 -87 106 -61 -77 194 -149 36 73
5471 73 87 5 102 -130 -27 48 -138 -114 -191 -220 13 -96 -166 40 -9 175 -59 166 68 399 72 146 -154 64
5495 64 57 68 -99 -277 -66 -227 188 -65 130 8 -41 21 -89 93 80 6 140 -62 135 4 33 -136 -98
5518 -98 -141 37 231 -50 -179 -2 -72 -154 -49 -147 28 280 2 56 25 -110 19 -206 72 22 -6 -91 8 -192
5542 -192 153 -235 15 106 15 196 -101 -50 3 -119 -14 -32 -219 51 26 122 8 84 -146 8 -24 322 115
5565 115 166 -53 0 -193 182 221 80 75 -118 -112 -14 102 -112 -117 94 -52 -3 89 54 -72 -141 -28 -217 -155 -146 79
5591 79 230 33 26 91 63 95 -29 50 -11 -4 192 -180 136 54 -91 19 -1 143 130 -69 -43 38 20 231 -183
5616 -183 -17 113 18 51 299 8 27 247 10 -38 68 -297 155 185 -218 -75 -5 124 60 108 -46 210 0
5639 0 -284 -26 -185 -103 39 43 166 0 -80 -9 -151 -48 89 -30 46 -31 -141 86 -49 140 320 105 8
5662 8 179 -208 -112 189 145 135 -157 -65 176 7 -12 -156 -32 2 152 -60 39 36 -337 93 91 -136 -1 -39 72
5687 72 -64 -12 -118 -92 -61 77 21 32 12 -29 110 8 -110 -53 113 0 121 110 -197 41 125 125 -46 171
5711 171 -6 -32 152 -107 81 -22 -126 -125 -160 -279 -99 27 -251 -59 -27 -78 -79 -15 29 75 -37 273 36 94
5735 94 -39 -94 65 43 -142 11 -150 -6 -100 -138 -21 80 -135 -23 172 -98 -226 -24 -147 33 -19 90
5757 90 36 -220 114 5 33 155 22 26 -7 -162 -52 -210 -152 98 -3 10 -8 66 -102 -214 -216 233 80 63
5781 63 -99 44 24 73 -180 -58 5 37 -147 -2 82 -38 -34 71 -30 -8 28 -20 136 -59 168 130 -69 -61 31
5806 31 204 321 133 53 3 32 64 -45 -16 74 -70 -158 -50 -189 121 111 95 204 9 -7 1 -178 -33 63 -68
5831 -68 33 -176 -160 -2 -47 -68 -65 130 114 119 -132 -17 -8 -57 46 144 -120 -33 38 46 188 -66 -103 -10 227 -56
5857 -56 69 -110 -122 -7 -12 -45 -16 115 76 178 134 158 -165 -68 206 -90 -122 135 -199 -116 -189 -42 87 -77
5881 -77 -147 164 -37 -169 -40 11 294 115 -149 68 67 -110 -53 140 53 -20 151 -80 41 -199 -96 -33 -67
5904 -67 68 -27 -177 9 64 -67 -28 61 62 -77 43 -115 -79 -344 160 -119 -4 -82 -132 17 51 -246 -97 -10
5928 -10 52 -3 -100 95 94 9 -154 -36 31 10 -106 -40 -27 -83 -44 49 -10 38 -189 -1 -160 43 -48 -21 15 -79 -59
5955 -59 87 -218 231 262 28 222 78 111 137 -2 -13 73 189 -168 -49 -60 -97 44 66 -45 86 95 28 -42
5979 -42 114 -56 -36 -202 18 -38 -8 -85 44 192 75 -140 50 -170 -17 -85 -28 -59 -15 -111 -273 -208 147 -150
6003 -150 -16 76 -219 107 -14 -58 157 -240 -111 -25 -111 23 -110 -26 -109 103 -87 -105 104 -122 29 -98
6025 -98 -40 57 -4 -6 120 -30 20 25 -70 -107 217 -73 -146 67 -13 204 22 -157 56 68 123 -51 -24 239 53
6050 53 36 65 310 142 72 21 -71 174 -151 51 -44 -40 -52 18 4 107 268 -7 -79 111 128 68 -102 107 -223
6075 -223 -36 -168 156 -153 31 84 -86 -7 -41 102 -9 0 -26 25 -10 138 -11 -105 73 51 215 -170 8
6098 8 -129 -123 -32 34 -103 34 125 -1 -129 190 6 -83 -52 151 68 38 -18 -4 135 -203 -35 -4 -121 20 199
6123 199 55 -16 212 -17 173 -17 -90 91 -154 184 67 -174 145 168 60 -87 -176 76 163 -114 -72 43
6145 43 103 27 84 -106 -50 119 23 -16 7 -50 66 197 131 109 23 69 163 -44 58 -105 -111 122 -155 238 201 -83
6171 -83 -120 -61 -148 42 30 -34 45 261 -247 11 4 -87 -19 -193 52 -20 -13 211 105 -64 20 -161 -104 -23 -25 -170
6197 -170 97 -61 166 -29 24 93 43 -45 145 -17 29 -26 -156 -86 -43 -202 -81 253 -99 144 50 -130 -103
6220 -103 -61 -65 -88 -74 33 58 0 84 -98 -150 293 230 46 -47 -12 -121 42 88 13 -7 -100 -14 124 -19 115 -65
6246 -65 242 117 -41 -18 -115 -52 -13 -67 -61 114 70 81 70 -223 -106 -120 -115 -4 99 24 169 -2 -90 227 -26
6271 -26 -139 245 41 15 1 74 -5 123 -12 46 63 -82 22 -234 -109 65 -179 237 -7 55 9 -110 21
6294 21 -111 48 20 74 -1 191 -68 -100 121 -2 38 69 -260 -252 213 -117 85 20 73 -53 271 -81 274 -128
6318 -128 31 -41 257 -31 -31 36 -27 -27 -122 -176 161 -119 4 26 -77 -9 -32 -54 -202 53 8 175 18 96 -90
6343 -90 -54 139 97 116 34 -66 -5 3 -132 161 159 -166 -2 -138 -107 -215 9 -23 -74 -158 -1 -55 61 168 103
6368 103 -82 164 -171 20 -6 9 180 -2 -61 -78 63 -263 -73 -79 -171 165 -163 -153 137 159 207 -140 -103 -124
6392 -124 243 -14 -124 -157 -78 184 14 -34 96 214 72 341 -110 140 -25 -173 2 -84 -76 -78 -15 -172 -189
6415 -189 -79 42 121 -172 120 147 3 61 -135 -70 -257 180 105 -2 13 -278 22 -187 267 -37 -78 72
6437 72 -69 -30 26 -41 -11 9 -125 266 -24 178 241 88 -81 103 -87 -150 41 -64 20 -21 -194 106 -99
6460 -99 -124 129 -104 -107 82 141 75 -72 -105 115 -221 -130 80 45 6 -19 -44 101 6 4 -11 6 82 -72 87 -111
6486 -111 35 109 49 27 60 -170 -24 -92 -106 71 -88 -252 167 136 173 -86 -86 161 -151 59 -4 45 72 -92
6510 -92 -198 -21 213 32 17 -107 183 230 -33 81 123 -29 154 39 70 192 0 160 -83 -25 -157 35
6532 35 107 -19 -63 -107 6 -29 -73 152 -132 -23 -140 54 -121 68 -150 -35 72 -24 -79 -12 -83 142 -77
6555 -77 -28 30 -46 195 -6 -52 6 9 -39 117 27 -219 18 -115 41 84 -36 19 159 -65 160 93 -66 81
6579 81 26 144 137 -181 128 102 -165 104 -80 -367 117 -34 -80 27 -103 -12 198 -174 -47 -26 -113 0 13
6602 13 -271 169 234 144 243 13 69 67 -42 65 35 -183 120 -107 -313 -50 -246 -91 -88 52 -52 118 -217
6625 -217 30 155 -92 168 28 -253 64 -115 33 -67 -188 -47 80 117 -115 28 134 135 -56 -41 39 94
6647 94 14 251 -159 168 129 78 54 97 -203 -24 104 -224 241 -3 -213 -41 -127 13 -138 9 135 60 -6
6670 -6 266 -318 180 28 -32 36 -120 -137 -205 153 67 19 160 -9 273 -103 2 -176 -304 -64 -46 -101 114
6693 114 -47 89 180 -42 71 96 -112 98 3 186 195 62 -55 -146 -33 -134 -38 -149 -100 -48 185 105 78 -91
6717 -91 129 110 159 161 -12 150 75 13 34 56 -139 27 -96 -171 -111 -91 -119 188 53 14 21 -205 92 73 -74 101
6743 101 160 34 -118 44 -3 -23 171 -15 12 -72 -183 -5 17 -64 68 90 75 229 9 205 -12 -85 -37 -115
6767 -115 -37 37 -187 111 75 -99 237 136 -32 -77 17 -68 -9 121 143 -8 -30 -12 -80 80 94 -137 80 27
6791 27 -113 76 180 -145 2 -28 -256 -234 -230 11 -87 -235 105 -72 -198 89 -39 -66 -13 99 -228 122 -70
6814 -70 20 118 -16 -4 37 -78 61 103 -99 31 80 22 -41 -55 104 -126 -43 -39 -25 63 -60 -306 -177 205 94
6839 94 -138 88 176 -136 -109 152 -1 -14 132 -130 121 -60 95 -45 6 177 252 -84 176 -67 132 -158
6861 -158 -58 146 -66 -126 52 -66 -246 -144 -203 144 211 -12 84 -50 27 57 -180 72 -13 153 -34 162
6883 162 -243 217 87 -188 204 -123 -147 -70 -163 -15 -13 140 89 122 6 222 64 -234 229 -221 -79 -70 -121
6906 -121 -96 6 -7 -96 -97 -47 106 150 27 131 -80 19 233 24 2 -4 89 17 237 -149 -52 -368 -139 56 -126
6931 -126 98 116 -32 61 0 -125 46 152 -63 149 -117 43 88 -245 -63 161 -171 38 -29 -16 28 -237
6953 -237 -204 184 -55 -200 65 9 25 36 -231 230 185 81 -21 -41 42 78 -6 34 99 -141 -66 80 -209 15
6977 15 143 -51 144 -16 0 55 -162 -69 63 1 231 116 113 -142 -51 -199 50 39 -66 -59 -140 -254 130 72
7001 72 124 -192 11 -234 0 64 -60 -33 167 112 150 -29 -48 -117 23 -81 -165 176 33 -57 138 -25 18 -79
7025 -79 -130 301 179 27 -5 -111 -90 -60 43 125 -167 128 0 48 -68 20 49 -53 194 -6 -27 -112 35 15
7049 15 41 -48 137 7 -36 111 70 -154 287 -18 177 -69 -108 -110 178 -149 74 83 -47 -5 -98 126 61 -102
7073 -102 -58 213 -107 58 70 111 53 -156 -16 -29 -49 -34 57 -153 183 44 -211 58 -219 99 87 87 84 -1 132
7098 132 175 200 15 211 58 0 41 -26 -81 -15 186 -33 -2 -69 -159 -95 43 38 19 48 -30 -81 256 151 -54 -81
7124 -81 -44 109 -92 78 -279 -183 11 -140 146 12 -191 77 -2 -61 -69 -44 134 75 -89 -11 65 86 23 76 -97
7149 -97 -168 41 -302 228 58 122 47 -195 222 43 90 -42 97 97 -2 29 129 -74 -90 -30 -78 23 204 -7
7173 -7 -65 251 -10 111 -241 -113 4 18 -135 78 -52 -179 3 65 -61 -169 -55 -39 150 -104 -158 103
7195 103 -228 -166 -346 6 -9 -179 -195 149 -231 123 252 -67 69 -136 48 -14 72 -66 -106 6 110 49
7217 49 -175 64 -58 52 72 4 56 32 -89 -40 19 -25 221 -88 -123 -362 41 154 98 -8 131 -62 -139 74
7241 74 17 -58 -44 -66 -110 187 98 -122 164 98 -144 170 -265 131 108 -114 -55 39 -77 -80 11 -110 -167 -106 -99 51
7267 51 -155 -103 38 112 9 -96 62 -57 185 53 -9 -24 -119 89 -87 87 191 -44 -20 -86 80 40 5
7290 5 -223 87 -98 2 -37 4 -27 -35 9 -12 174 13 -1 -47 -37 30 -135 -4 197 -96 -59 88 -31 8 -14
7315 -14 -56 268 -132 87 129 -67 65 54 125 -172 85 -291 313 26 -150 -48 175 -136 56 35 122 -66
7337 -66 -162 126 161 0 89 -9 -109 63 54 6 202 84 264 20 33 -29 -43 -128 -57 74 -97 -51 -78 -209 85
7362 85 -57 16 11 0 -80 147 -90 3 182 203 75 131 89 44 -33 28 266 -77 -36 -187 -20 0 -65 -33 -25 -3 91
7389 91 60 -132 283 -56 -67 17 -34 226 37 -109 35 -58 -97 105 -73 -140 92 -25 153 201 50 117 -170
7412 -170 -99 11 -88 16 323 25 -112 64 164 -18 -125 -15 -18 18 -33 -3 -90 139 -13 10 97 227 139 -96
7436 -96 -144 -139 -33 53 3 -208 -128 -70 60 58 15 -1 -31 -6 170 50 -55 9 147 217 182 51 103 151 -231 96
7462 96 -141 231 144 147 76 194 61 56 -54 -109 -9 1 49 72 47 19 22 -1 15 -29 196 112 -235 136 124 -199 37
7489 37 -88 105 11 7 165 257 -90 72 -159 -94 55 223 -205 69 108 124 -6 5 50 8 -1 -121 48 172
7513 172 67 -20 160 64 -171 -68 -192 -167 69 95 74 129 -70 -77 193 212 -122 51 -237 -74 202 116 -119
7536 -119 248 136 15 73 115 137 62 -47 68 -128 70 112 42 29 -151 -37 3 135 21 -2 46 62 34 -128
7560 -128 -132 -166 -182 -242 86 194 -112 -57 -55 2 -47 -85 69 -5 113 92 -93 98 83 -113 -167 56 -94 -29 120
7585 120 29 48 -11 -198 6 129 -48 273 35 -82 -123 -51 -56 223 -30 -32 215 -162 61 -74 -70 301 -97 -53
7609 -53 -30 -37 294 24 1 85 131 82 47 -117 -247 86 -165 112 -201 -218 -62 -36 -90 116 114 -84 151 -145 91
7634 91 239 -70 202 -131 -95 259 4 105 -46 -148 101 11 -105 23 -99 18 64 14 109 -74 48 118
7656 118 243 -154 75 -29 45 -122 -55 -96 33 -14 -34 -55 -179 213 84 -26 -71 89 -195 168 -135 -82 125
7679 125 -43 -110 49 -207 -12 -38 -170 192 -82 -54 -5 143 -13 -152 -305 24 83 343 -232 -93 -227 102
7701 102 62 -128 180 -128 23 102 155 -54 72 -44 -122 -203 81 60 -155 34 6 -30 126 1 -87 180 27
7724 27 -51 -48 9 40 82 -10 -138 3 -16 -60 -37 -125 9 -93 -140 126 -32 -226 91 -128 50 47 -53 49 82
7749 82 -141 43 162 -137 -21 154 26 -154 -187 -66 118 4 -64 26 -130 74 79 -275 202 -113 75 -63
7771 -63 -135 56 152 -30 -40 -62 28 81 -8 -160 228 132 -154 -173 -39 129 179 53 -119 20 40 173 2 121
7795 121 -79 15 -37 206 170 221 59 152 27 2 -132 207 -119 -42 -2 125 15 171 -81 51 -101 -108 18
7818 18 223 236 -34 -60 130 132 -75 -78 -72 -109 10 114 -294 -128 -49 44 94 -122 -43 141 -11 -43 -151 -147 2 215
7844 215 185 166 92 -58 -102 -66 -158 163 -108 91 -85 -177 -14 41 -21 -27 -68 43 2 -101 66 61 -52 148 62
7869 62 -199 65 -108 -158 49 45 0 64 66 -159 131 74 95 -25 24 166 116 -114 -50 -90 -103 -155 -103 -4 72 -80
7895 -80 50 -4 -156 96 -151 12 -36 74 36 176 -37 -5 -98 207 253 -146 -61 -31 126 -64 107 26 42 166
7919 166 -124 91 -51 -223 155 56 -52 -107 -35 216 -12 -23 -145 -152 18 -117 -136 53 -7 29 95 194 23 -8
7943 -8 132 -43 78 -88 78 41 -2 -72 -39 -112 -129 -123 -186 48 -123 -3 254 -125 -62 -202 -21 -144 201 48
7967 48 77 -21 -163 174 -190 -134 -48 217 -19 -48 11 -36 -33 236 209 231 -16 192 31 11 129 -114 85 -47
7991 -47 230 261 94 -65 -63 97 -46 131 -95 -40 8 -14 -12 175 134 153 -137 -119 85 -62 -110 155 -21 -15 171
8016 171 -197 -91 30 134 100 -35 -68 -30 -36 -116 57 -61 55 79 75 51 53 -289 5 -97 -53 -101 148 -66 -25
8041 -25 119 -88 212 -120 152 255 -4 -107 27 -1 54 122 -206 16 118 -143 5 -23 22 -111 75 166
8063 166 128 -202 172 -5 -97 255 -145 43 63 -198 -4 -145 -183 -146 -195 -24 -73 -11 -39 249 -150 -20 181
8086 181 -287 287 -67 -248 -82 -172 -31 1 15 -54 -61 -131 -144 -26 -89 1 163 -174 -1 131 -48 63 10 -147
8110 -147 44 -235 -11 65 -81 51 -47 -60 -70 -110 -89 -170 47 -152 132 -155 66 -56 -223 116 27 115 -19
8133 -19 61 -284 -157 2 189 -92 -173 -243 92 128 85 -1 -170 -124 -260 -50 -91 63 0 94 -248 -62 -322 -14
8157 -14 125 27 -13 56 -87 -158 76 -79 100 74 43 -18 82 60 248 122 -119 -75 86 58 -28 -280 -94 -78
8181 -78 -32 3 -196 -170 258 -10 258 225 -111 1
8191A
$$ Imaginary data points
##PAGE= N=2
##DATA TABLE= (X++(I..I)), XYDATA
0 0 0 0 0 0 0 0 0 0 0 0 8 -8 8 -8 16 -16 16 -24 30 -32 40 -48 56 -72 80 -96 112 -128 149 -169 197 -223 254
33 254 -288 325 -365 410 -462 514 -573 638 -709 789 -873 966 -1067 1178 -1297 1432 -1578
50 -1578 1736 -1912 2110 -2327 2572 -2845 3158 -3516 3931 -4419 5001 -5718 6614 -7779 9358
65 9358 -11632 15210 -21683 37125 -155276 15221 352473 19966 -225487 -138581 119447
76 119447 112559 -10460 -40842 -38684 -72952 66818 151526 5785 -165324 -84501 150299
87 150299 170117 -99578 -162786 35710 118520 31748 -44907 -55563 -5916 22777 54372 43202
99 43202 -75123 -83513 78444 95526 -38519 -80011 6131 63917 -1777 -37876 29111 -5088
111 -5088 -74272 15906 82752 -15623 -101918 -33862 93840 48794 -98638 -52810 72157 26577
123 26577 -50343 -4595 53091 -7670 -78996 25793 118665 -24669 -127490 10387 120348
134 120348 28216 -94077 -49164 67627 42768 -31492 -4942 7181 -25042 5436 53443
145 53443 21863 -55998 -45994 62235 70148 -41967 -62318 17967 45441 781 -28641 -5275
157 -5275 2684 -21319 5735 32646 -23126 -50885 11367 42299 -9593 -41553 5674 32747
169 32747 -17497 -27735 30223 25964 -36451 -30587 35880 40149 -29271 -44078 20792 38531 -12711
182 -12711 -22753 12878 8850 -19610 4731 39941 -1078 -50566 -1898 65927 23160 -57386
194 -57386 -29705 49231 38231 -23334 -28360 2923 11914 7139 8278 -7563 -36107 -11471 43806
207 43806 23367 -45517 -45581 22112 52141 -5106 -53679 -10875 34465 15220 -8807 -13917 -12544
220 -12544 1260 19092 19955 -16635 -43065 8215 50208 158 -42019 -13134 27272 23083 -14692
233 -14692 -16489 12288 4882 -221 16433 1249 -14335 -663 17157 19671 -13520 -26930 16909
246 16909 23715 -13463 -15709 1396 9564 -1143 -15723 4997 8964 -18871 -1402 17746 -6286
259 -6286 -12742 604 10598 6914 -16536 -5194 18965 -5684 -13001 7209 2040 -3408 -8026 -4441
273 -4441 14428 -3435 -18968 9895 10703 -6375 -2134 809 10229 5642 -9362 9968 9960 -13244
287 -13244 5466 15233 -4979 -7567 -3151 9576 9297 -19246 -7843 15969 -2033 -6392 -854
300 -854 -4368 6861 1235 -5074 7378 -5728 -6962 15168 2230 -10614 -4572 -726 11660 -2326
314 -2326 -20851 4402 9087 -9389 -1454 -1727 -3950 4344 -1218 4131 3893 -11195 6460 15886
328 15886 -5061 -2901 2735 3510 9298 -5653 -7249 9583 -399 -4600 2621 -4723 -215 2105
342 2105 -3366 5464 -2259 -8103 10691 4786 -7849 1079 2933 4045 1101 -9124 2385 5644
356 5644 -7337 -250 -885 -7528 1468 69 -3646 186 -6433 52 8260 -3399 -3442 2289 2031 6615
372 6615 -239 -5148 5695 2000 -1707 5433 -1721 -5474 1085 2379 4024 -2691 -8840 2787 6015
387 6015 -687 400 -3329 -1898 6989 4121 -746 -2371 -3707 4371 7666 -1579 -6021 -5767 991
402 991 8332 -651 -10021 -5812 257 5869 3620 -7880 -9144 1980 9925 4982 -7885 -8177 4898
417 4898 9405 3092 -3859 -6471 -1170 7319 7601 -2708 -10992 -4632 8352 9894 -2706 -13636
431 -13636 -4704 12486 11347 -4643 -12020 -1193 12509 8170 -3586 -6597 -4038 4409 10811 1296
445 1296 -9953 -9501 1517 12556 4575 -13839 -12739 2307 13605 6800 -14354 -13749 7292 12437
459 12437 3373 -7125 -10731 2285 10063 4938 -136 -9637 -7962 8674 11102 725 -11319 -14197
473 -14197 7670 19670 -1993 -16312 -7744 9099 15942 -1983 -12480 141 3775 5430 8424
486 8424 -3399 -8696 -3272 4581 15101 929 -21256 -6900 13651 12376 -4428 -21612 -4731
499 -4731 18377 4583 -8145 -6332 -4388 6877 8585 -1065 -2443 -8585 -2874 16204 7589 -10878
513 -10878 -12665 -3105 17968 12193 -19341 -16082 7337 13716 6355 -13366 -12975 9930 9715 1479
527 1479 -74 -8244 -2118 8549 6986 6459 -9205 -17949 9370 21059 -764 -18526 -15588 12786
541 12786 22227 -10131 -19449 -139 7494 8495 0 -8406 -1028 -1842 2899 15669 -739 -17732
555 -17732 -5678 11358 18083 -4123 -27254 -3059 20297 6788 -8520 -14600 -3324 14225
567 14225 5278 -4883 -3804 -6343 4650 13364 2365 -4892 -9426 -2236 18798 9778 -15583 -13294
581 -13294 3196 16858 6564 -19632 -13017 11180 10754 -130 -10857 -8030 8571 7122 -1149
594 -1149 568 -5064 -4375 7986 8899 12 -12381 -10323 13211 14166 -11180 -15196 -187 10775
608 10775 6744 -10429 -9576 4898 4995 2175 348 -3835 -705 1885 4003 6891 -3378 -8819 3134
623 3134 8242 2066 -5531 -7731 1482 6634 -615 -3582 -3150 -1088 3903 1802 -1523 161 -1264
638 -1264 -247 4626 3415 -1488 -5079 -1769 6820 4566 -5633 -6671 -136 4981 2021 -6001 -5188
653 -5188 1696 2999 402 -1175 -1553 -971 1157 4518 2671 -4150 -3445 4321 6548 -551 -6424 -2175
669 -2175 3998 3187 -1229 -4359 -2340 2516 2283 -670 -2330 -2399 1471 4135 819 -1626 -2010 711
685 711 4828 989 -3161 -1125 80 1314 1809 -2559 -2772 -478 118 1784 -1371 -3513 1010 337
701 337 -494 2138 -1753 -1700 2274 1268 2005 118 -3532 1157 2969 -53 270 -2931 -1639 4078 -7
718 -7 -2203 -80 -2696 1521 3099 -2884 -989 -160 671 4535 -1164 -3646 3020 1066 1117 1968 -3920
735 -3920 -578 2757 -1065 528 -1953 -3588 3317 168 -2854 475 -2586 729 4172 -3032 -1281
750 -1281 2249 -642 2978 433 -3390 2630 703 -671 2197 -3625 -774 4033 -2693 -1525 672
765 672 -2589 2494 694 -3783 1777 353 -478 3410 -2035 -707 4222 -1037 695 1651 -3195 2371
781 2371 1389 -3477 844 -1165 -1424 2685 -3290 -1835 2461 -2603 382 2031 -3023 1582 1855 -1465
797 -1465 2605 -537 -1201 3889 -1238 -1187 1924 -2869 825 1664 -4001 582 363 -2876 1902 -706
813 -706 -1875 2852 -774 446 2788 -2207 1234 3508 -1772 1123 648 -1850 2415 -730 -2097 1273
829 1273 -2381 -953 1536 -2484 -264 1112 -2030 1912 750 -2473 2093 1341 -543 2142 -1161
844 -1161 -225 1883 -1189 832 121 -3664 801 1677 -2386 -452 -1513 -430 2225 -1167 -1186 1121
860 1121 -260 1928 1943 -1203 100 878 811 2918 -1078 -2959 805 1156 45 -1397 -2709 -82 887
877 887 -613 195 -1213 -1720 2442 2501 -605 -1400 -237 2632 2140 -1209 -1154 18 -23 701 25 -1411
895 -1411 -1995 -1103 1304 1280 -2390 -2975 977 3415 398 -2697 -486 2605 1477 219 110 -85 -540
912 -540 -191 2108 902 -3401 -2017 1723 1800 -587 -3711 -1512 2996 1514 -1028 -1510 -936 2201 2601
929 2601 -348 -793 -1194 102 3621 440 -2435 -771 -963 1119 2092 -2172 -3199 -1383 1525 4588
945 4588 -2461 -6203 1967 4887 859 -2000 -2850 2092 3674 -1671 657 1396 -2994 -495 2705 2011
961 2011 -1094 -6554 -339 7860 -691 -6444 -1103 2771 3718 -1621 -4213 3050 1933 -1852 2654
976 2654 960 -2055 -271 -481 3306 1607 -6040 -1357 3890 557 -459 -4080 -2372 5132 751
991 751 -2907 -170 -1389 2272 3506 -2913 -314 1618 -1187 2024 1455 -1008 295 -3514 1010 6642
1007 6642 -3827 -6526 1788 3455 2290 -4578 -5256 5628 3631 -4155 420 1262 203 532 -935
1022 -935 3798 1873 -7208 346 7366 -220 -4588 -3653 2309 5809 -4332 -5538 3472 666 -886
1037 -886 808 -1145 831 -93 -1267 4672 939 -4363 1022 1894 1718 1440 -4409 -1177 3356 -351
1053 -351 -419 -2004 -3141 3110 1970 -3408 -543 170 1179 1952 -1876 1200 2328 -3288 838 4583
1069 4583 -1061 -2959 -1856 2867 4014 -5230 -4962 4100 2190 -2474 -2549 -302 2817 -221 -2445 3433
1085 3433 1571 -3658 939 3794 1647 -2459 -3200 3521 4027 -3955 -2819 1431 394 -415 -1539 -897
1101 -897 674 -1471 492 2605 -1452 -1730 1754 1949 1196 -634 -723 1889 377 -289 1133 -1384 -1988
1118 -1988 977 1135 -877 -2752 -1058 3054 303 -2802 229 1974 64 -701 1084 2052 -767 -1925
1134 -1925 2081 2317 -1600 -2276 838 2078 -1465 -2881 600 1471 -1366 -1534 987 1069 -1302 -1117 2651
1151 2651 1991 -2155 -524 2852 1230 -1540 -1181 1609 1208 -2637 -509 1436 -1265 -1515 177 772
1167 772 -77 -2503 355 2733 -574 -1694 1120 1161 443 -347 83 1940 -844 -1554 2009 357 -2350
1184 -2350 -352 481 327 -866 -2045 1671 948 -2715 882 1390 -962 354 231 1310 1068 -2194
1200 -2194 835 2773 -1822 -1016 1091 0 214 -1840 -460 2681 -2019 -2140 2273 -108 -1536 62
1216 62 388 1990 -794 -2056 3014 722 -2203 876 781 -402 -88 -1586 1383 1028 -3422 354 1601
1233 1601 -1776 -101 -107 135 1327 -1942 64 2954 -1555 -631 2018 -210 173 -308 -553 2207 -1061
1250 -1061 -2187 2554 -471 -1997 961 -582 222 -158 -2040 1968 648 -2546 1640 1103 -987 806
1266 806 -464 623 1504 -2051 675 2357 -2168 -420 850 -667 279 -1332 -613 1974 -2085 -1323
1282 -1323 2205 -689 -369 564 -115 1331 -296 -1339 2817 260 -1934 1319 154 -358 63 -1562
1298 -1562 766 745 -2534 567 1114 -1578 255 203 116 990 -1198 294 2400 -915 141 1408 -711
1315 -711 743 113 -637 872 -1193 -1057 1384 -908 -1081 597 -437 217 80 -784 1125 740 -747
1332 -747 1309 217 -576 747 103 471 201 -1452 559 730 -1305 -431 173 -366 42 -823 -279 589
1350 589 -779 68 1287 -194 123 376 462 1417 -322 -490 624 -8 -418 -237 -723 -27 -108 -446 193
1369 193 -563 -631 514 368 -5 90 309 817 296 160 521 -76 -211 414 -3 -583 -433 -606 305 -289
1389 -289 -873 -461 -149 391 325 -701 183 689 54 556 439 77 576 97 319 560 -750 -531 444 -302
1409 -302 81 -655 -1312 971 448 -806 33 -253 647 889 -509 294 851 -418 580 514 -286 342 -707
1428 -707 -319 1183 -739 -1419 15 -199 562 -470 -1605 1229 901 -608 571 -77 -76 1458 -489
1445 -489 313 1246 -1238 -57 774 -499 329 -1221 -1535 1843 62 -1813 -38 -187 985 662 -1901
1462 -1901 730 1415 -878 465 597 -150 507 -728 235 2025 -1605 -1469 1250 72 -91 -1088 -1356
1479 -1356 1875 451 -2062 605 357 -37 734 -858 535 943 -1295 693 1463 -852 52 -497 -239
1496 -239 2019 -1037 -1804 1189 -39 -209 -146 -1624 1024 1068 -1286 625 407 -424 955 -848 302
1513 302 1605 -1552 -448 1797 -190 -253 -827 -692 1891 -499 -2413 776 665 -568 -31 -1014 815
1530 815 768 -1727 838 1828 -978 -52 329 764 1013 -1673 -685 1808 -357 -1233 -116 -571 762 -292
1548 -292 -1466 961 -189 -809 858 31 -115 581 -660 529 1258 -564 92 288 -19 747 -652
1565 -652 -1280 462 93 -421 -110 -1111 410 585 -1099 322 681 -334 123 222 609 625 -1033 166
1583 166 1418 -333 -965 -149 29 412 -1108 -856 758 -213 -937 250 455 -1 -197 54 1347 622
1601 622 -743 320 844 183 -243 -198 347 -172 -897 -58 91 -776 -443 179 -62 -179 -511 573 738
1620 738 -285 126 379 285 243 313 312 336 -506 409 283 -688 -455 104 163 -314 -750 -177 410 -502 73 877
1642 877 287 -188 -11 892 679 -546 -266 1139 10 -797 -8 -21 117 -668 -774 694 -284 -1203 253
1661 253 806 -203 -142 -285 1005 751 -996 467 936 -659 168 53 -182 179 -692 -51 787 -1276
1679 -1276 -525 700 -370 -35 -125 -458 908 -395 -426 1178 -162 -408 907 -64 -17 -17 -769 833 -3
1698 -3 -1274 549 315 -1055 233 -289 -66 288 -989 821 1056 -1198 351 1022 -276 550 -245 7
1716 7 1283 -922 -658 1206 -828 -546 277 -467 396 -334 -1071 1356 -380 -841 903 -24 -396 452
1734 452 -253 835 683 -1396 811 457 -1187 427 -223 -341 308 -949 -19 716 -1199 2 833
1751 833 -600 207 -155 -16 1058 -671 -367 1444 -452 -672 906 -359 -54 -166 -775 889 -189
1768 -189 -1188 839 -70 -924 226 -255 267 646 -913 721 730 -863 298 694 -208 197 -390 182 858
1787 858 -1231 -100 1112 -649 -533 193 -260 228 -535 -553 1008 -421 -666 1128 244 -23 116 -57
1805 -57 947 -31 -1012 654 405 -791 -206 -376 10 185 -861 370 425 -938 -156 447 -178 134 -30
1824 -30 159 460 -287 241 676 -315 -84 593 -67 -281 -345 -156 336 -510 -566 415 -97 -416 170 240 719
1845 719 -133 -258 888 467 -465 55 406 110 -611 -473 621 283 -945 -128 -74 -40 -309 -161 499 10
1865 10 -523 458 478 158 60 297 416 381 -257 132 213 -510 -238 352 -568 -233 -497 165 280 -620 58 727
1887 727 79 112 432 44 504 122 -167 1095 -417 -796 539 -119 -190 -676 -867 471 -79 -1053 64
1906 64 -13 -335 54 -93 309 403 -580 590 833 -378 296 223 -134 524 -390 -467 397 -405 118 203 -1017
1927 -1017 102 561 -365 214 182 -243 841 -289 -58 930 -498 -124 549 -252 308 -291 -698 1140
1945 1140 -202 -1306 414 63 41 160 -881 167 642 -713 407 776 -388 250 -72 -208 960
1962 960 -643 -853 706 -195 -325 -270 -796 598 156 -1107 395 -77 -331 374 -435 193 776 -922
1980 -922 86 1082 -356 114 43 -108 602 -540 -1039 901 1 -699 75 -634 398 509 -992 603
1998 603 569 -641 423 199 -284 837 -435 -108 992 -557 -194 65 -456 341 -178 -1122 497 -46
2016 -46 -470 340 -418 117 879 -835 183 772 -304 56 146 -197 761 -278 -649 1153 -174 -606 -115
2035 -115 -172 660 -236 -818 443 221 -999 42 218 123 325 -564 360 1040 -658 -19 685 194 114 -312
2055 -312 -102 492 -590 -451 503 -408 -60 -70 -253 283 70 -458 270 232 -57 772 -47 205 429 -102
2075 -102 -24 49 -250 307 -122 -699 17 -156 -345 -308 -292 300 120 -395 373 750 -499 -147 359 454 198
2096 198 -450 426 777 -282 -127 9 3 -220 -654 -105 275 -399 -392 305 219 -139 -277 249 655 -50 -211
2117 -211 619 379 -351 -86 -231 130 -170 -323 209 -243 -642 272 -221 -237 130 -80 301 248 -138 837 414
2138 414 -417 385 176 101 -37 -372 254 231 -822 -61 413 -517 -266 -72 220 382 -695 -301 1160 -304
2158 -304 -306 703 194 394 -148 -464 701 -394 -791 449 16 -318 -227 -572 229 13 -928 330 396 -499
2178 -499 329 505 -7 519 -300 267 607 -677 173 551 -685 -16 122 -435 360 -346 -340 677 -846
2197 -846 -456 773 -251 70 258 -182 700 -45 -703 873 346 -603 383 -208 -2 -44 -673 345 483
2216 483 -1122 -18 302 -338 249 -80 -19 861 -566 157 984 -364 156 420 -172 449 -227 -407 605
2235 605 -387 -545 655 -418 -172 331 -397 147 -58 -528 780 261 -602 692 277 -80 295 -506 268
2254 268 336 -656 302 391 -695 -53 87 -101 187 -741 54 796 -513 -95 614 -112 186 -68 -176 503
2274 503 -201 -339 602 -287 -417 232 -136 196 -155 -383 588 114 -510 464 20 -199 335 -152 385 147
2294 147 -462 224 582 -481 153 22 155 -22 -296 -74 423 -393 -312 483 -64 -217 111 200 288 -125 -242
2315 -242 613 -2 -94 260 -145 394 -102 -105 384 -133 -243 345 55 -247 -108 -216 63 -76 -204 299 17
2336 17 -178 117 270 61 64 -292 252 299 -441 156 244 -308 -217 -283 142 289 -233 -111 369 -273 -186 47 129
2359 129 269 32 28 725 -46 -265 261 -121 36 -191 -199 -31 -119 -438 211 -496 -329 65 -264 -35 319 -146
2381 -146 509 115 -230 499 -41 -151 187 62 232 -54 -759 135 135 -445 -186 57 -217 435 -218 311 604
2402 604 -488 11 675 -159 120 145 -250 718 -35 -345 311 -25 -306 247 -349 149 -4 -686 161 391
2422 391 -475 557 105 -258 578 -23 -132 367 -117 111 339 -461 378 198 -734 423 73 -383 71
2441 71 -558 -6 422 -630 14 496 -41 334 5 -215 744 32 -361 642 -243 -375 -18 -605 310 85
2461 85 -862 296 172 -559 251 -232 62 398 -458 40 784 34 197 348 -157 363 -280 -553 376 -55
2481 -55 -268 91 -305 204 327 -582 226 164 -173 318 130 61 931 -136 -196 674 -113 -167 283 -273 346
2502 346 -81 -726 176 -53 -183 100 -242 -84 447 -427 83 513 -359 450 202 -56 470 160 -269 454
2522 454 -76 76 -25 -350 211 -40 -540 286 161 -301 35 -99 77 453 -349 -33 486 -128 -12 29
2542 29 -141 281 -143 -426 470 50 -235 197 -301 244 -8 -732 266 231 -193 76 217 87 168 -60 180
2563 180 519 -245 75 284 -218 41 -65 66 155 -316 -314 -17 -518 68 148 -155 269 42 -65 186 6
2584 6 201 466 -140 1 296 141 110 -184 -15 224 -366 -481 161 2 -161 -137 15 262 29 -340 256
2605 256 231 -273 221 211 345 134 -176 310 440 -491 -40 74 -126 45 -477 8 265 -265 -18 270 -281
2626 -281 327 55 -95 220 95 -69 463 -433 158 451 -248 -162 118 -310 -36 57 -475 394 -96 -315 378
2647 378 2 -97 -86 -195 582 288 -542 302 415 -357 9 -45 -193 26 -470 -224 377 -457 -337 217 141
2668 141 193 -95 -360 628 -33 -135 427 -78 -32 312 -228 175 -86 -396 439 -21 -552 384 -52 -403 28
2689 28 -205 98 249 -323 420 248 -509 597 185 -107 464 -180 22 503 -420 -205 381 -484 -205 14
2709 14 -343 583 -259 -400 569 -146 -190 289 106 336 194 -288 494 127 -555 239 136 -465 22 -157 38
2730 38 43 -334 244 350 -248 -94 351 -99 305 -251 22 469 -198 74 651 -277 -152 -7 -225 135 -295
2751 -295 -370 374 -266 -333 434 79 93 90 -61 319 -155 -549 357 48 -412 4 12 202 -157 -400 232 374
2773 374 -347 -67 -68 -230 76 -27 134 340 -382 -12 471 109 138 221 -34 149 -493 -386 466 -142 -217 282
2795 282 -220 -325 122 -182 165 -85 -330 528 192 -409 -68 142 243 156 -206 266 292 -309 166 116 -202
2816 -202 41 -257 257 110 -306 -135 257 -368 -5 3 87 122 -108 84 221 -113 -188 208 -112 -2 8 -10
2838 -10 337 -386 -416 249 -82 -338 67 2 -150 -177 -200 396 21 -199 456 160 -156 -147 15 289 368 -326 -44
2861 -44 185 -321 52 -70 -118 119 -417 -196 303 -396 37 445 31 160 -47 152 333 -186 23 309 -438
2882 -438 -155 227 -367 -22 -104 -361 299 -97 -350 202 -105 -38 209 27 183 291 -349 386 136 -417 210
2903 210 110 -137 155 -311 104 210 -544 -72 260 -222 -5 14 158 427 -46 140 409 109 -236 304
2923 304 -251 213 90 -382 235 -46 -391 -102 9 -416 79 -384 4 399 -152 246 292 -284 346 113
2943 113 -345 325 -57 118 383 -428 -196 408 -588 117 437 -411 46 -183 -36 473 -372 -228 583 -99
2963 -99 -55 45 -62 384 108 -383 457 93 -409 66 -254 -87 15 -514 119 86 -148 -54 71 -65 153
2984 153 -182 -222 424 -135 43 155 -304 158 57 -444 6 -15 -493 23 -222 -515 246 -346 20 234 -47
3005 -47 63 96 -172 434 -173 -149 408 25 -95 248 -247 42 219 -476 216 93 -373 161 -156 -21 255
3026 255 -427 70 388 63 -35 283 -55 177 7 -164 163 -2 -56 197 -266 -224 162 -367 -108 129 -48
3047 -48 -25 -207 -48 149 99 15 207 6 32 -113 30 256 134 -165 83 -60 -376 -203 -148 128 55 -337
3069 -337 -7 57 -30 -22 -103 212 247 -27 -79 64 63 -112 -54 -137 222 14 -509 74 -290 -57 -21 -108 246 77
3093 77 -21 -139 282 -41 16 66 91 447 -61 -24 318 -18 -87 -143 -177 268 -127 -346 358 110 -408 76 -105
3116 -105 -13 158 -319 399 171 -104 210 0 -106 414 -158 -33 211 -114 121 -130 -271 -52 -28 -307 294
3137 294 -94 -98 148 -278 145 333 -176 177 92 -72 256 -78 -327 480 -143 -385 365 -366 -38 61 -395
3158 -395 400 211 -225 215 7 -30 38 -63 163 786 -127 124 154 -320 40 101 -175 -105 -208 -403 241 -402
3180 -402 -268 322 -264 90 124 -84 337 147 -19 138 -111 -101 525 -86 -276 138 -157 -95 -228 -553 55
3201 55 -228 -479 -22 -19 -194 163 -161 362 469 -403 20 208 -204 152 -201 -217 266 -487 -305 296 -353
3222 -353 -113 -151 -346 183 26 -149 345 -63 -116 283 129 199 412 -168 50 236 -188 174 -65 -285 109
3243 109 -319 -234 17 -271 -4 241 -372 33 165 -104 339 205 57 58 -138 46 102 -130 -149 12 -180 -163
3265 -163 106 -224 173 -371 34 319 -116 -161 117 111 290 -25 -127 300 12 -235 259 131 5 -98 -210
3286 -210 -22 144 -237 6 118 -264 16 76 -45 299 -120 187 156 -182 10 214 -183 -53 29 -165 51
3307 51 -182 -262 88 68 -237 50 81 40 8 -238 284 -42 -83 224 -62 277 335 55 -37 -30 -242 59 12 -16
3331 -16 50 -242 -76 213 -252 -86 202 -28 167 80 -76 91 -54 87 322 -133 -58 212 15 87 -34 92
3353 92 9 -40 -301 135 -243 -54 213 -179 37 122 -22 204 -63 -45 299 2 -66 98 39 -144 105 -197
3375 -197 70 149 -278 -124 -106 -137 47 38 -71 312 -93 11 340 -73 111 390 -41 -5 95 -215 312 -221
3397 -221 -180 -22 -252 -51 213 -40 70 -33 -400 282 114 -149 171 293 -16 361 -243 69 381 -227
3417 -227 308 99 -209 -11 46 -186 -46 -143 55 257 -373 71 204 -126 56 133 -308 140 -1 -129 280
3438 280 -39 21 222 -284 79 18 -366 84 -20 -233 96 -25 -23 266 -66 159 197 -134 167 244 -102 104
3460 104 206 72 231 -145 -221 128 -95 -160 144 -486 -57 111 -165 246 -75 -86 258 -35 120 348 -162
3481 -162 -23 97 -131 258 -36 -78 82 -248 -143 3 -291 123 -14 -330 4 -45 -281 131 385 -154 127
3502 127 -28 5 -12 -209 54 99 -72 145 -38 -86 57 -270 -273 112 -55 64 96 -166 -37 78 -45 291
3524 291 145 -221 115 41 -198 -217 0 119 24 -78 18 71 -150 253 203 -103 124 30 -1 104 335 236 -32
3547 -32 -356 161 48 -58 -38 86 -80 -28 -62 -65 106 -222 -23 189 -118 363 -198 -72 458 -123 208 -13
3569 -13 152 171 155 5 124 44 -227 186 -118 -6 206 -249 8 -127 56 5 41 101 -84 188 30 258
3591 258 81 -101 101 -22 58 40 -17 317 75 -451 -7 -191 -12 -158 -156 -3 228 -111 -89 222 183 139 277
3614 277 -223 356 -176 -19 76 8 148 92 -110 26 142 -210 63 56 -183 -78 -187 66 313 -203 161 215
3636 215 31 90 341 98 -8 -10 -135 191 -1 2 80 -337 -79 127 -272 102 -187 -49 266 1 -74 516
3658 516 14 -237 176 -118 74 8 -259 -23 135 -336 156 180 156 175 -141 62 300 -388 43 12 -281 321
3680 321 226 -91 76 -244 -33 187 -174 30 46 -267 -39 90 -123 75 98 -120 253 -240 5 334 42
3701 42 109 313 84 100 78 -45 303 -29 -302 364 -101 -229 177 -129 -31 147 -269 47 56 -65 73 24 60
3724 60 205 228 190 146 -181 41 28 -77 -122 -25 -271 42 -208 -180 96 -112 -107 -138 -37 -81 -6 -375 300 -14
3748 -14 -91 85 37 -264 164 -119 174 301 -93 231 -318 -231 105 -200 -61 -31 179 -13 43 -13 -123 70
3770 70 -146 -30 -51 -24 269 -20 62 73 -135 25 212 -61 -6 19 -254 215 12 -12 325 -127 -244 96 -46
3793 -46 330 -5 -146 52 191 -168 -16 -99 99 82 -182 204 246 -189 26 19 -79 -71 -95 347 188 -193 -46
3816 -46 146 -250 -118 105 19 13 -150 -188 146 -141 -45 117 319 -40 127 -77 -34 -176 35 97 22 -9 232
3839 232 135 -200 59 -240 103 -144 -41 145 -64 -215 197 -309 31 102 -123 185 224 -241 110 269 195
3860 195 153 -64 -61 223 -214 96 -5 -208 -116 50 6 236 -258 -178 63 19 -10 14 -6 155 138 -115 -136 74
3884 74 -206 238 162 -45 -119 -108 -88 114 4 40 323 -184 27 -65 -59 11 11 -121 131 -39 161 225 -8 -25 -3
3909 -3 -87 69 -220 19 -34 -17 -197 -36 -174 -157 54 -91 -44 92 -68 189 180 -32 231 93 -254 43 -184
3932 -184 -46 105 -429 162 -57 -417 -55 -91 -226 273 -40 -11 307 -124 80 304 14 119 296 30 253
3953 253 -18 -195 208 74 -163 61 -234 75 9 -204 297 23 -94 55 -29 183 -137 -34 42 120 -139
3974 -139 116 52 -90 -76 41 -257 -17 30 125 37 -281 -14 15 -46 -10 -42 166 181 -112 14 269 -185 87
3997 87 80 -182 -54 176 -1 99 -87 -42 150 -121 -212 85 -59 17 186 69 89 73 165 -151 -4 -122 39
4020 39 -144 -126 6 -23 -389 -113 145 21 -144 -21 132 -15 76 215 128 112 152 116 102 -57 56 309 -31
4043 -31 -201 154 -61 118 116 -71 25 59 -156 -114 -61 -194 32 81 44 136 -157 67 174 -277 80 -42 -136 45
4067 45 -257 -127 296 83 105 75 -121 -101 115 -34 25 53 -212 182 80 -92 118 170 215 172 -164 110 168
4090 168 -24 161 29 -36 116 -178 -247 -19 -148 57 122 -47 -32 97 -102 107 -23 -124 106 17 -11 137
4112 137 -75 -94 123 -368 80 -70 -213 -18 -171 140 175 -153 -110 173 -150 263 37 -64 -69 172 -28 53
4134 53 -74 -115 211 -63 -78 371 -223 -19 -263 -163 260 50 -144 244 -4 195 17 -151 77 36 -308
4155 -308 -99 76 -100 71 -145 -233 95 153 -48 53 -56 -60 166 21 130 -74 1 -2 -37 -118 115 -71 85
4178 85 372 -174 -69 87 -36 -86 89 -98 100 -104 123 59 -45 142 293 -67 -60 -97 52 37 -36 -100 223
4201 223 -77 -123 -19 -128 64 -107 -52 188 83 -116 -4 40 2 -18 -165 80 44 11 -50 178 -53 116 -58
4224 -58 -66 128 -163 86 3 -148 127 -166 -309 -65 75 -94 165 103 145 137 -23 4 78 -1 -106 51 21 167
4248 167 -54 -101 33 -11 64 29 40 3 85 -42 113 -175 -57 109 86 20 -119 19 -30 166 -197 194 -15
4271 -15 -158 51 47 -104 -50 118 57 149 -26 120 43 -81 -81 181 -82 42 127 34 130 63 -155 -36 -103 43 39
4296 39 -106 40 62 -73 147 123 -54 63 93 -149 -81 -72 110 -249 -85 66 -66 -243 116 -83 -6 297 88
4319 88 -186 -134 -55 112 113 -87 83 -78 -139 29 61 -127 182 39 251 -3 133 -97 -30 -24 154 -132 185
4342 185 143 -232 -88 -24 -98 -146 208 -295 184 93 -14 234 -83 202 163 -194 115 8 -122 109 64 -110
4364 -110 215 -20 -50 283 -1 153 149 153 44 81 -106 11 29 68 219 -126 -172 5 -273 -45 -23 -84 -29 -146
4388 -146 -277 -26 -109 -292 258 -63 -34 -4 -227 128 -14 75 42 -1 -86 66 34 -51 39 -156 134 151 -283 -173
4412 -173 403 -4 -34 135 -103 27 -102 64 215 -155 90 15 -20 80 12 -140 146 -189 38 82 52 -47
4434 -47 -170 -212 57 -79 -138 181 32 268 52 148 -51 55 -117 161 78 -143 -103 -1 43 117 85 2 -1 -190
4458 -190 244 76 73 45 209 78 -52 93 269 0 108 -42 126 -192 21 172 -138 -10 -123 -337 183
4479 183 59 -212 -27 -43 -16 106 -14 25 95 154 -26 -104 -91 -110 -145 -288 207 77 -8 -134 98 230 162 -143
4503 -143 131 169 -160 121 160 70 293 8 -175 149 -143 -20 82 -127 92 -4 169 -73 -78 226 57 253
4525 253 27 45 15 272 128 34 -136 106 -59 -85 13 236 30 -75 5 -16 -14 -70 -77 -28 169 88 -29 85 46
4550 46 261 14 95 -97 54 93 -66 58 -8 -32 51 319 -125 -187 89 -59 -80 55 99 130 -57 -46 64 30
4574 30 68 36 250 44 -266 -28 -221 170 162 76 133 9 -245 20 -90 -100 -39 -218 -17 -34 -76 332 83 -42
4598 -42 72 -320 -20 145 -241 -226 -176 77 5 -30 -17 121 -7 -13 -64 -45 -29 -32 -192 -243 51 82 175 -122 62
4623 62 235 -175 -181 -169 -75 160 310 132 -113 99 -31 -16 -8 64 150 -54 83 -223 -263 174 -4 -49 53 -41
4647 -41 -176 142 45 -198 -37 -342 10 92 -105 -30 174 6 87 27 -42 186 -52 -153 59 -206 -30 169
4669 169 -60 10 13 41 77 48 -100 140 -87 167 85 -164 76 -115 -82 -24 -61 -79 46 90 46 54 -65 -34 -34 -178
4695 -178 -145 46 -250 98 -179 53 -47 -42 -194 143 -17 -127 0 13 -141 197 301 154 58 111 -154 -53
4717 -53 136 -40 -203 -100 -53 -49 119 25 -5 96 -124 184 80 -16 76 -8 50 95 17 -72 -94 -135 -91 140 -45
4742 -45 -64 53 -89 -86 -167 88 14 248 -18 133 103 38 274 -36 93 -16 49 -16 133 -21 -148 -18 -68 3
4766 3 -55 -128 62 -5 31 84 -93 -203 248 85 8 -13 96 203 56 135 83 -93 -36 114 -17 -109 102 -95
4790 -95 -43 -99 62 -34 -7 -32 13 268 99 -42 -19 189 -127 -188 -31 96 83 20 -43 -76 -90 -12 54 91 9 116
4816 116 -159 -196 16 154 -255 83 15 181 12 -23 13 -22 -51 -147 -155 -125 -100 -55 193 -254 110 -11 57 -65
4840 -65 83 -5 36 39 -128 7 3 -108 -1 -109 -190 0 52 -23 -133 40 45 273 112 65 -42 -106 -59 64 21
4865 21 81 76 -86 247 -184 34 120 -5 -32 101 -119 -66 -8 9 100 -52 102 58 -162 -17 167 -294 49 38
4889 38 77 179 130 -1 5 -23 -245 -24 61 -83 24 135 47 36 -71 -84 -23 -20 114 132 107 215 -27 -87 -117 -143
4915 -143 143 -100 -56 85 94 -117 76 -7 41 11 -275 -48 145 77 15 152 -18 -152 -80 -183 -74 -137 17
4938 17 -192 76 72 -24 23 56 22 -132 93 -196 -197 -71 -122 -1 -132 -327 7 -22 149 53 -97 36 -3 -49 -99
4963 -99 -54 75 -75 -65 38 1 -136 -73 -21 51 185 92 -124 -69 105 -198 117 91 -75 -157 -24 -233 181 -92
4987 -92 -89 204 -41 176 16 -92 -34 23 -70 -133 177 166 -188 107 35 119 -64 164 -7 1 256 -141 -122 31
5011 31 -14 12 -77 90 42 -69 -13 -32 90 103 -23 16 -33 150 -154 -67 217 -158 188 -23 -18 107 -84 69
5035 69 17 -89 9 9 -146 57 -57 169 59 23 190 129 9 120 232 -65 59 73 2 96 64 64 226 61
5059 61 -288 -15 39 61 144 -74 140 -120 -103 -30 -180 -163 -44 -52 7 -214 17 11 -358 36 55 58 84 101 36 77
5085 77 141 -36 -28 116 25 138 61 80 58 215 43 -87 -12 34 -123 -99 225 79 153 -133 -27 -55 31 38 -168
5110 -168 -91 193 -6 284 -156 -111 -220 -42 -183 -2 99 30 99 -187 100 -127 172 -41 -173 62 -9 -96
5132 -96 228 262 3 -50 131 117 -38 -147 -11 131 -49 50 10 46 48 -215 -126 33 98 61 39 58 75 60 127 6
5158 6 276 5 206 113 73 109 -68 14 116 201 -21 -255 -144 108 58 5 -256 -95 58 77 -163 125 -1
5181 -1 -226 36 44 -83 210 -19 50 225 -36 60 90 -48 -25 -154 -208 80 59 -125 -106 23 -223 -34 -20 -46
5205 -46 52 -7 17 31 -48 252 72 -253 76 -111 -228 69 164 182 92 -75 101 56 -67 4 35 -199 58 256
5229 256 39 238 -149 94 -8 22 5 -30 -72 1 108 -139 237 27 79 6 -12 196 46 -237 -10 -193 -12
5252 -12 30 -146 248 -45 -43 239 83 -1 230 -83 -194 63 76 140 290 -62 28 20 101 259 129 -102 274 54
5276 54 -108 -53 20 61 -2 -39 -239 46 -59 -130 -98 228 112 94 -15 -29 98 -28 -111 -29 -155 -148 -112 -417 -100
5301 -100 65 175 -19 16 1 -184 -71 34 133 135 -44 -171 174 77 -74 92 -85 40 86 31 168 142 -243
5324 -243 83 -24 -141 30 -50 125 -8 71 -171 -43 50 -148 -103 -68 18 93 118 97 121 81 111 44 93 56 53 -11
5350 -11 -104 -89 -51 95 -80 173 -89 47 107 96 18 -26 -260 -62 114 -64 85 124 40 -71 -70 57 223 -174
5374 -174 -174 181 -44 155 -74 -10 121 -83 121 -25 48 138 252 -72 15 -89 37 9 75 2 142 -207 33
5397 33 206 -92 0 -23 -139 203 -54 -113 64 23 -61 167 -11 -99 214 -134 47 16 -366 -46 236 -89 88
5420 88 26 40 -75 -134 42 196 79 200 11 -123 -147 197 71 4 16 -106 -170 61 53 -72 -83 174 24 58
5444 58 -33 71 -73 27 16 -40 52 -220 75 182 -59 3 239 22 234 -12 -84 59 -58 -298 -111 38
5466 38 15 -13 104 -59 110 -5 -111 45 43 194 -117 46 28 -30 178 -154 -62 -83 -136 -30 11 -65 93 96 -8
5491 -8 143 28 -105 -26 -219 -222 225 89 -60 90 -32 -31 275 -32 -170 -7 63 144 7 -6 25 109 -69 234
5515 234 22 -84 132 -50 231 192 -41 -33 89 29 -2 -139 -135 -215 -38 134 46 -27 22 -39 19 60 -28 -84 133
5540 133 -192 -198 40 -84 28 40 7 111 217 95 102 -9 197 -85 82 -242 -129 120 -20 5 159 141 20
5563 20 3 -26 -130 85 -46 -118 220 -54 -178 -86 3 64 42 80 90 44 -72 137 166 -17 112 23 -142 148
5587 148 52 -89 -134 -51 141 28 -81 199 128 -161 9 76 260 -140 -87 57 35 -174 -87 12 179 38 65
5610 65 -14 17 104 -124 126 90 264 -231 -152 -119 109 -125 231 -79 59 196 -206 -148 43 -30 -24 -32 203 105 69
5635 69 6 -21 -61 -123 -394 -62 84 -154 -78 42 138 -58 111 -75 152 5 -252 -192 225 -5 65 -11 -36 -130
5659 -130 -13 110 100 -9 -19 -23 -119 -151 -206 120 -95 -19 -101 -63 -62 -65 21 -78 -92 103 -20 8 -152 72 57 86 -269
5686 -269 8 126 45 -128 5 139 5 -13 -115 121 -89 58 -106 -162 -79 113 -289 97 -85 -357 33
5707 33 -47 6 55 -178 45 14 126 174 34 39 108 -24 131 37 -62 -87 10 183 -36 105 -62 -133 -121 -71 71
5732 71 -33 85 -34 -71 239 -56 20 141 -55 -177 -151 -94 86 76 -105 129 176 283 30 26 67 -215 -5
5755 -5 -95 -155 64 -62 -124 4 -120 188 93 -117 28 -33 -48 -127 73 11 4 -213 7 -41 -67 -188 -30 -113 12
5780 12 143 9 -84 -45 105 20 157 2 22 113 -53 117 172 -22 -58 129 -103 -58 -4 -125 -51 -5 25 5 -189
5805 -189 35 227 58 144 37 -136 6 -69 3 -105 -29 -46 -209 70 -170 -94 -201 -49 -16 22 -155 160 -43
5828 -43 47 34 -162 178 60 -6 336 -17 103 57 150 12 49 -185 23 164 -35 70 4 -104 -28 -187 226
5851 226 239 -2 190 -47 -67 -65 -49 -98 -224 -3 76 -186 -89 -157 -52 19 164 -47 -35 151 98 -120 39 -182
5875 -182 5 155 -233 143 87 -47 10 -45 -275 -98 -83 -47 55 136 150 -52 16 -83 91 -335 298 -8 -68
5898 -68 179 -135 35 -9 82 105 -213 94 -24 24 -66 87 -22 52 23 -177 56 -53 -170 60 177 177 -114
5921 -114 -38 -58 107 -105 157 164 -16 -82 109 -128 168 202 -77 13 -165 88 194 -83 -1 -55 -273 42 132
5944 132 127 78 -65 9 -166 111 146 -196 16 133 -26 25 59 -166 -272 148 37 -44 20 16 -47 -13 126 -166
5968 -166 95 -4 88 -61 -58 16 62 56 -307 12 -14 100 -78 20 -209 -268 -18 -18 130 196 -180 -99 -13 -134 51
5993 51 -58 -90 -59 50 -201 -59 -37 -11 8 -227 -60 32 -53 88 -46 51 146 -116 61 153 5 44 -9 139
6017 139 111 166 -12 57 38 28 213 263 -206 -309 81 42 74 58 63 123 128 91 39 -9 -51 -202 10 -91 -23 57 96
6044 96 -103 -125 -34 -21 -54 -32 -76 120 -127 201 15 -90 -32 40 26 102 -11 -202 -21 -30 -76 63 91 122 -44
6069 -44 -104 147 179 238 5 -340 65 298 -158 -47 250 42 143 -4 -353 -14 -154 -58 -20 194 -60 1
6091 1 -58 -70 106 -122 74 76 67 129 224 -171 22 -51 26 174 -52 56 125 -170 -88 139 -15 23 -44 -120 120 14
6117 14 -6 183 -160 -186 52 207 34 -69 102 13 163 -152 -73 -114 -161 72 -130 23 19 -150 -75 82 -23
6140 -23 238 159 -17 99 -114 52 54 -202 -65 -44 -11 14 201 299 -67 -18 165 30 -38 -25 138 9 104 312
6164 312 31 129 -22 -116 8 85 -82 -85 -115 43 -82 -107 -12 -48 -294 127 -301 110 297 -324 58 465 36
6187 36 149 184 -96 206 57 -193 -5 -44 -375 -112 -131 -109 2 146 275 1 -174 124 -1 55 189 -123
6209 -123 54 86 -8 -16 290 86 117 165 -222 78 -66 93 72 2 84 138 -193 33 84 -88 30 -48 -90 51
6233 51 65 54 123 -97 -67 -186 -175 168 -91 -205 170 217 -249 -1 -12 -44 18 91 -158 -32 -2 43 130 -190 66
6258 66 43 -70 188 97 189 285 -195 187 54 -163 151 80 159 15 20 87 118 -308 93 291 77 -66 39 -126
6282 -126 75 -65 48 4 -54 -120 -70 23 113 -20 -29 157 -41 -30 -107 30 -82 91 -145 9 18 -44 78 198
6306 198 -52 -37 4 -111 -230 -3 -86 83 130 -89 61 55 2 295 129 206 41 2 -79 -238 6 55 -227 107
6330 107 109 -225 -99 42 -2 -19 -65 118 22 96 -14 17 97 194 -23 -66 -140 -119 -170 307 9 -158 178 -138 156
6355 156 -135 -40 -195 10 33 -26 63 -54 -57 -33 44 96 -267 44 7 -208 134 -58 -24 145 -43 3 -35 -143
6379 -143 -10 148 -18 223 -36 -90 52 220 101 139 -142 50 128 54 266 -149 -17 -188 -91 -30 68 18 -141
6402 -141 34 -127 -95 -14 36 27 268 -332 132 71 -21 47 -94 -85 53 -10 -6 -149 126 0 -99 -98 85 65 -227 -31
6428 -31 -42 -4 77 200 -114 -165 14 -94 192 -149 -81 74 -168 -89 -173 -112 32 30 109 53 -20 123 -35 -13 17
6453 17 -2 -64 94 189 -21 8 -11 13 81 45 -67 86 -183 4 -182 66 9 -30 255 141 -136 -35 -159 -11
6477 -11 199 -21 88 222 157 72 18 -109 16 178 -79 100 -146 -166 -67 -18 4 -93 223 3 -171 -144 137
6500 137 -13 -105 -161 -38 -93 144 -22 -127 58 -77 46 192 128 69 -20 -57 -24 -187 -117 217 57 -3 114
6523 114 -73 77 91 -29 -24 148 -102 138 -7 64 193 -147 -20 -2 -201 -86 -331 141 8 102 -48 100
6545 100 -122 87 142 -33 321 67 52 87 237 -105 62 -134 -131 85 -178 128 98 97 85 68 -269 173 127 -30
6569 -30 135 -27 293 52 -183 12 111 5 62 75 103 151 -140 113 -114 63 -41 198 115 -42 -7 33 102
6592 102 -84 135 -153 -26 -23 171 -50 47 -162 -100 196 -117 -69 72 72 -86 52 91 21 425 63 43 21 -129
6616 -129 102 -68 -159 137 -110 -156 -31 -115 -203 144 -66 46 78 180 -2 89 33 153 -111 -164 -14 70 113
6639 113 -113 71 -79 -44 28 14 -7 -184 17 -88 -70 291 -20 201 78 112 49 -89 -45 60 -14 -80 -51 161
6663 161 -140 76 -110 182 -54 -231 -52 -17 -27 52 47 -200 29 -120 -345 135 -32 -43 -140 65 98 -64 -123
6686 -123 -53 -204 -2 -65 -28 -32 -42 -74 -149 108 27 -57 -65 158 61 49 124 256 -88 227 -38 -131 113 -122 -114 110
6712 110 -69 64 -185 -157 -166 -153 9 -61 46 24 31 -131 62 227 55 -55 -31 -229 -8 2 134 -15 -11 -170
6736 -170 90 -6 10 -52 -64 54 65 -66 81 84 72 -36 108 20 203 -138 -91 -100 -45 139 50 9 119 -170 -201
6761 -201 -2 -44 -61 223 234 -63 176 -168 23 90 -63 118 120 -24 9 14 109 119 -40 9 13 -37 -189 -151 5
6786 5 159 -93 25 83 18 161 126 -117 -18 -31 -126 120 -236 34 132 -45 -42 170 -188 -18 -73 -174 42 63
6810 63 -40 203 -244 65 -104 134 -105 69 -14 -55 -156 -99 114 -39 7 40 -70 -100 62 -120 -79 17 9 114
6834 114 106 -323 25 151 -77 56 -17 213 -134 -104 -106 102 -9 -113 -60 -170 299 0 23 8 -45 53 170 13
6858 13 -10 51 -1 132 -141 -161 -18 27 20 -62 -176 -48 -21 -59 -24 -68 17 184 136 -78 190 114 110 -132 -96 28
6884 28 -10 8 -13 92 40 5 -6 56 83 14 -76 84 -33 -9 -74 230 131 194 -130 112 -22 212 109 -1 18
6909 18 -14 204 140 232 -210 -85 0 52 -71 -167 76 198 -122 189 103 120 -89 -191 -51 -202 125 -86 -145
6932 -145 120 -131 109 -97 65 69 22 88 26 -111 -116 -48 31 37 -84 164 52 -16 210 -205 -182 111 -111 24
6956 24 138 -174 43 189 -27 112 -139 -135 -13 138 -189 166 36 90 15 132 13 58 102 -148 71 28 47
6979 47 39 3 -78 59 15 -4 -77 -84 268 5 59 -114 -305 139 134 -33 -47 -154 -149 96 -28 -113 62 -13 -63 66
7005 66 -105 -125 -85 -25 -175 83 -7 164 -26 -107 148 32 -191 37 -76 -97 -37 73 19 -5 -15 -12 -114 -51 153
7030 153 86 134 4 -122 52 -15 48 87 -186 59 -197 -13 23 -73 46 45 14 -26 239 -100 -167 38 -38 159
7054 159 184 -110 163 5 -133 95 -22 108 -99 -43 -8 129 -5 -114 199 58 49 73 11 153 -302 62
7076 62 -97 -154 55 54 41 146 -47 -20 7 -21 -43 -51 5 180 95 74 135 130 -50 174 53 -205 -5 29 13 -185
7102 -185 101 -211 60 -8 64 -81 -61 171 221 122 161 -16 -209 54 -232 88 -6 -158 37 -162 -90 120 -12
7125 -12 28 107 -24 -217 108 -114 -137 143 -85 -51 -279 -216 102 64 -43 119 31 -155 160 80 103 176 55 273
7149 273 133 24 158 17 169 -50 -231 69 36 -128 24 6 -56 -109 58 61 1 -168 -31 67 -4 -218 50
7172 50 -61 -34 -18 -25 26 -38 -51 -179 30 83 -125 86 -114 31 50 -29 193 -139 -73 -98 -87 88 -107 -77 241
7197 241 -96 105 -31 -54 -24 -74 102 60 81 130 133 -100 44 -19 -90 -62 -31 45 194 -152 -148 185 106 -223 13
7222 13 -23 -90 -9 -235 -40 180 -40 118 3 -24 2 -172 -65 -219 15 -171 -137 -46 49 -59 171 87 30 -278
7246 -278 -42 -197 93 -105 84 113 111 137 19 -43 150 0 -72 -87 296 -28 -95 89 47 88 -257 -12 245
7269 245 -120 66 96 -101 60 21 -49 -96 65 149 -116 -4 125 22 213 246 190 -160 181 136 -65 54 39
7292 39 -292 13 96 -57 216 -111 -263 13 -274 86 140 -95 -370 76 48 55 102 -126 156 -122 107 -124
7314 -124 44 75 252 87 -22 -32 211 103 141 239 -48 -146 30 189 -29 -163 -77 -107 -83 -186 -183 -147 220 15
7338 15 124 -183 53 -103 -215 -102 -220 -40 -173 -75 196 258 -62 -43 -31 -24 -47 -29 -52 144 6 204 -25
7361 -25 -146 -134 254 -139 32 -27 26 324 204 -2 135 44 51 123 -222 -17 9 -145 12 -97 -110 -156 75 72
7385 72 -36 -63 77 -83 60 158 -34 -139 58 121 89 55 -17 -203 -102 -145 12 -36 -50 228 -40 -3 -32 -22
7409 -22 -77 143 -131 -216 61 -121 42 195 -60 -125 93 -33 89 45 -45 -93 27 -52 -78 -90 185 -2 18 204
7433 204 12 -20 134 48 -2 68 33 -2 -9 -69 -36 26 -202 181 -75 -5 154 42 -203 -27 -50 -80 86 -283 -10
7458 -10 -37 -52 20 111 151 2 -106 32 -63 -78 4 -108 -94 15 -42 -58 74 -162 -2 -71 -60 116 -154 143 274
7483 274 151 -88 99 -19 118 51 -80 -94 80 -102 50 130 -31 83 108 190 24 156 78 5 246 -39
7505 -39 29 17 49 190 -35 77 -25 37 -24 -47 -73 12 18 18 18 -121 42 -95 -74 159 -49 49 24 28 151 72 -156
7532 -156 136 179 -232 49 -80 -92 105 -26 -30 156 -30 34 16 -71 -81 63 -108 30 62 100 40 8 84 200
7556 200 -121 -19 138 -106 -25 -20 -130 61 42 -138 154 -50 -171 -33 -61 118 -50 -51 116 50 82 34 -89
7579 -89 -42 -118 -166 -185 120 -79 -120 -11 -17 51 -226 -47 126 147 -148 -94 77 -126 60 50 -61 35 -108 -88 63
7604 63 -105 -4 -119 -72 174 -52 89 -86 -31 -20 12 70 -83 113 258 19 -59 -169 193 25 91 79 -165
7627 -165 -94 63 264 119 11 67 172 183 121 130 -180 179 280 -314 -31 2 98 213 58 -158 -93 19 -134
7650 -134 121 78 -27 -10 160 -115 -103 -103 -127 -164 -79 194 -21 7 118 -149 229 -112 98 95 -82 -33 -43 -47 -354
7675 -354 73 44 -77 -44 -77 304 -58 2 60 -133 76 -45 79 65 8 108 107 -140 -107 176 -92 -1 -12 10
7699 10 119 78 158 116 41 87 -113 129 14 -63 38 -35 -147 -167 66 -18 97 35 -45 -94 13 -236 70 153 66
7724 66 -89 77 -19 34 151 -203 -8 78 186 223 97 76 -19 -15 106 16 -25 -2 -171 -66 323 -14 164 98
7748 98 -24 131 157 122 -52 -80 -30 -119 -207 -44 -77 83 -115 60 -236 -170 -70 -85 84 198 -108 81 61 -170
7772 -170 136 3 -4 82 86 -80 84 159 -118 -22 -118 118 -219 -125 -9 -19 23 66 -40 -15 -83 -89 60 -77 -58 104
7798 104 -121 -34 170 -156 128 -27 -177 -30 -169 -182 -38 33 -69 -38 -53 76 18 -21 114 31 -136 -120 139
7821 139 -21 101 89 -2 -5 -5 -4 282 132 107 50 -132 71 132 58 80 185 51 76 -81 81 233 21 -62 -54 -131
7847 -131 -36 -1 137 -119 49 -76 -100 -250 -391 -216 104 -134 163 39 236 31 -97 81 -55 110 255
7868 255 -25 53 -41 -169 104 -24 137 323 -44 -153 269 -131 40 40 131 -32 -14 -88 195 -170 -38 97
7890 97 -40 139 2 -145 36 10 -93 -12 -251 -202 88 8 -138 14 -48 -92 -64 -146 -17 31 23 -90 214 -61
7914 -61 -27 -118 90 32 -186 119 -34 -78 21 75 162 59 -267 214 -6 -153 84 29 -141 120 -171 65 -69
7937 -69 69 85 -63 -185 -87 -114 105 -195 12 -156 -80 53 -120 208 238 -66 39 184 4 6 -69 27 120 -203
7961 -203 85 -70 -112 -61 -194 71 -97 148 -1 -64 -13 -10 -2 9 -345 123 -86 81 -131 50 -3 -213 -64
7984 -64 164 -49 -13 103 4 -17 23 -272 75 -38 197 37 -154 -69 -12 -32 -37 27 79 100 -240 3 60 -175 -72
8009 -72 -7 -101 -61 112 24 129 -72 -39 -69 -5 -103 384 183 19 197 115 10 -109 -95 12 -123 -273 59 -15
8033 -15 128 -124 -37 73 -59 -166 -30 81 19 146 117 -41 110 -175 25 114 -255 51 -209 -228 189 -63
8055 -63 -52 -29 -200 52 0 44 -21 110 14 -31 -37 3 9 34 69 131 40 -227 12 -27 -30 -42 -6 48 -74 -213 186 21
8083 21 4 -28 -52 -79 -128 -14 0 -10 -5 -40 -130 -23 279 -4 -129 -100 -143 -72 57 33 -56 -51 62 -102 -5 59 -28
8110 -28 17 -37 206 81 233 11 21 188 -223 -143 -17 85 -180 138 -20 -10 -148 71 -71 75 4 126
8132 126 96 131 55 -33 65 -70 -37 53 32 38 -46 -35 -156 81 78 -32 29 -205 28 146 -69 -81 -88 -156 -75 -196 -206
8159 -206 81 61 25 192 -2 -207 94 -133 -2 -25 -49 160 -97 -187 -45 -59 -44 -47 -78 164 269 -107 -56 -48
8183 -48 -35 -105 -107 -2 132 -125 -50 21
8191B1
##END NTUPLES=NMR FID
##END=
