##TITLE=1H_Pr D4
 200.13MHz,CDCl3,
 8 sc
 
 30.6.2025
##JCAMPDX= 6.0         $$ Bruker NMR JCAMP-DX V2.0
##DATA TYPE= NMR FID
##DATA CLASS= NTUPLES
##ORIGIN= UXNMR, Bruker Analytische Messtechnik GmbH
##OWNER= pz
$$ XWIN-NMR		Version 3.5
$$ Mon Jun 30 13:48:04 2025 Russian Standard Time (UT+4h)  she@DPX200
##.OBSERVE FREQUENCY= 200.1313
##.OBSERVE NUCLEUS= ^1H
##.DELAY= (6, 6)
##.ACQUISITION MODE= SIMULTANEOUS
##.ACQUISITION SCHEME= undefined
##.AVERAGES= 8
##.DIGITISER RES= 18
##SPECTROMETER/DATA SYSTEM= spect
##.PULSE SEQUENCE= zg30
##.SOLVENT NAME= CDCl3
##.SHIFT REFERENCE= (INTERNAL, CDCl3, 0, 14.3821)
##AUDIT TRAIL= $$ (NUMBER, WHEN, WHO, WHERE, WHAT)
$$ ##TITLE= Audit trail, XWIN-NMR		Version 3.5
$$ ##JCAMPDX= 5.01
$$ ##ORIGIN= Bruker BioSpin GmbH
$$ ##OWNER= she
$$ F:/spectra/data/she/nmr/H-C/1/audita.txt
$$ ##AUDIT TRAIL=  $$ (NUMBER, WHEN, WHO, WHERE, WHAT)
(   1,<2025-06-30 13:46:51.09 +0400>,<she>,<DPX200>,
      <created by zg, POWCHK disabled, PULCHK disabled
       configuration hash MD5:
       00 E9 B6 7A A2 85 ED C7 34 08 36 98 17 FE 4E 26
       data hash MD5: 16K
       97 78 04 B1 9C AE FF CB 44 7D 30 43 F7 A5 EC 92>)
$$ ##END=
$$ 
$$ hash MD5
$$ 7B CF 70 74 FC 24 02 0D C6 DF D8 EB 55 03 59 88
##$RELAX= 
##$RELAX= 
##$RELAX= 
##$RELAX= 
##$RELAX= 
##$RELAX= 
$$ Bruker specific parameters
$$ --------------------------
##$DU= <F:/spectra>
##$EXPNO= 1
##$NAME= <H-C>
##$PROCNO= 1
##$TYPE= <nmr>
##$USER= <she>
##$AMP= (0..31)
100 100 100 100 100 100 100 100 100 100 100 100 100 100 100 100 100 100 
100 100 100 100 100 100 100 100 100 100 100 100 100 100 
##$AQSEQ= 0
##$AQ_mod= 1
##$AUNM= <au_zg>
##$AUTOPOS= <>
##$BF1= 200.13
##$BF2= 200.13
##$BF3= 200.13
##$BF4= 200.13
##$BF5= 200.13
##$BF6= 200.13
##$BF7= 200.13
##$BF8= 200.13
##$BYTORDA= 1
##$CFDGTYP= 0
##$CFRGTYP= 5
##$CHEMSTR= <none>
##$CNST= (0..31)
1 1 145 1 1 1 1 1 1 1 1 1 1 1 1 1 1 1 1 1 1 1 1 1 1 1 1 1 1 1 1 1 
##$CPDPRG= <>
##$CPDPRG1= <>
##$CPDPRG2= <>
##$CPDPRG3= <>
##$CPDPRG4= <mlev>
##$CPDPRG5= <mlev>
##$CPDPRG6= <mlev>
##$CPDPRG7= <mlev>
##$CPDPRG8= <mlev>
##$CPDPRGB= <>
##$CPDPRGT= <>
##$D= (0..31)
0 0.7 0 0 0 0 0 0 0 0 0 0.03 0 0 0 0 0 0 0 0 0 0 0 0 0 0 0 0 0 0 0 0 
##$DATE= 1751276810
##$DBL= (0..7)
120 120 120 120 120 120 120 120 
##$DBP= (0..7)
150 150 150 150 150 150 150 150 
##$DBP07= 0
##$DBPNAM0= <>
##$DBPNAM1= <>
##$DBPNAM2= <>
##$DBPNAM3= <>
##$DBPNAM4= <>
##$DBPNAM5= <>
##$DBPNAM6= <>
##$DBPNAM7= <>
##$DBPOAL= (0..7)
0.5 0.5 0.5 0.5 0.5 0.5 0.5 0.5 
##$DBPOFFS= (0..7)
0 0 0 0 0 0 0 0 
##$DE= 6
##$DECBNUC= <off>
##$DECIM= 32
##$DECNUC= <off>
##$DECSTAT= 4
##$DIGMOD= 1
##$DIGTYP= 9
##$DL= (0..7)
0 120 120 120 120 120 120 120 
##$DP= (0..7)
150 150 150 150 150 150 150 150 
##$DP07= 0
##$DPNAME0= <>
##$DPNAME1= <>
##$DPNAME2= <>
##$DPNAME3= <>
##$DPNAME4= <>
##$DPNAME5= <>
##$DPNAME6= <>
##$DPNAME7= <>
##$DPOAL= (0..7)
0.5 0.5 0.5 0.5 0.5 0.5 0.5 0.5 
##$DPOFFS= (0..7)
0 0 0 0 0 0 0 0 
##$DQDMODE= 0
##$DR= 18
##$DS= 0
##$DSLIST= <SSSSSSSSSSSSSSS>
$$ [...]
##$SUBNAM0= <"">
##$SUBNAM1= <"">
##$SUBNAM2= <"">
##$SUBNAM3= <"">
##$SUBNAM4= <"">
##$SUBNAM5= <"">
##$SUBNAM6= <"">
##$SUBNAM7= <"">
##$SUBNAM8= <"">
##$SUBNAM9= <"">
##$SW= 18.0517328524113
##$SWIBOX= (0..15)
0 0 2 0 0 0 0 0 0 0 0 0 0 0 0 0 
##$SW_h= 3612.71676300578
##$TD= 16384
##$TD0= 1
##$TE= 0
##$TE2= 300
##$TE3= 300
##$TEG= 300
##$TL= (0..7)
0 120 120 120 120 120 120 120 
##$TP= (0..7)
150 150 150 150 150 150 150 150 
##$TP07= 0
##$TPNAME0= <>
##$TPNAME1= <>
##$TPNAME2= <>
##$TPNAME3= <>
##$TPNAME4= <>
##$TPNAME5= <>
##$TPNAME6= <>
##$TPNAME7= <>
##$TPOAL= (0..7)
0.5 0.5 0.5 0.5 0.5 0.5 0.5 0.5 
##$TPOFFS= (0..7)
0 0 0 0 0 0 0 0 
##$TUNHIN= 0
##$TUNHOUT= 0
##$TUNXOUT= 0
##$USERA1= <user>
##$USERA2= <user>
##$USERA3= <user>
##$USERA4= <user>
##$USERA5= <user>
##$V9= 5
##$VALIST= <valist>
##$VCLIST= <CCCCCCCCCCCCCCC>
##$VD= 0
##$VDLIST= <DDDDDDDDDDDDDDD>
##$VPLIST= <PPPPPPPPPPPPPPP>
##$VTLIST= <TTTTTTTTTTTTTTT>
##$WBST= 1024
##$WBSW= 4
##$XGAIN= (0..3)
0 0 0 0 
##$XL= 0
##$YL= 0
##$YMAX_a= 244387
##$YMIN_a= -273769
##$ZGOPTNS= <>
##$ZL1= 120
##$ZL2= 120
##$ZL3= 120
##$ZL4= 120
##$ABSF1= 10
##$ABSF2= 0
##$ABSG= 5
##$ABSL= 3
##$ALPHA= 0
##$AQORDER= 0
##$ASSFAC= 0
##$ASSFACI= 0
##$ASSFACX= 0
##$ASSWID= 0
##$AUNMP= <proc_1d>
##$AZFE= 0.1
##$AZFW= 0.1
##$BCFW= 1
##$BC_mod= 2
##$BYTORDP= 1
##$COROFFS= 0
##$CY= -3
##$DATMOD= 1
##$DC= 2
##$DFILT= <>
##$DTYPP= 0
##$F1P= 0
##$F2P= 0
##$FCOR= 0.5
##$FTSIZE= 0
##$FT_mod= 4
##$GAMMA= 1
##$GB= 0.15
##$INTBC= 1
##$INTSCL= 1
##$ISEN= 128
##$LB= 0.25
##$LEV0= 0
##$LPBIN= 0
##$MAXI= 10000
##$MC2= 0
##$MEAN= 0
##$ME_mod= 0
##$MI= 1.114404
##$NCOEF= 0
##$NC_proc= 0
##$NLEV= 6
##$NOISF1= 3.799351
##$NOISF2= 2.8
##$NSP= 1
##$NTH_PI= 0
##$NZP= 0
##$OFFSET= 14.38212
##$PC= 1
##$PHC0= -1204.025
##$PHC1= 18.59222
##$PH_mod= 1
##$PKNL= yes
##$PPARMOD= 0
##$PSCAL= 0
##$PSIGN= 0
##$REVERSE= no
##$SF= 200.129724274929
##$SI= 16384
##$SIGF1= 3
##$SIGF2= 2
##$SINO= 400
##$SIOLD= 16384
##$SREGLST= <1H.CDCl3>
##$SSB= 0
##$STSI= 0
##$STSR= 0
##$SW_p= 3205.1282051282
##$SYMM= 0
##$S_DEV= 0
##$TDeff= 0
##$TDoff= 0
##$TI= <>
##$TILT= no
##$TM1= 0
##$TM2= 0
##$TOPLEV= 0
##$USERP1= <user>
##$USERP2= <user>
##$USERP3= <user>
##$USERP4= <user>
##$USERP5= <user>
##$WDW= 1
##$XDIM= 8192
##$YMAX_p= 0
##$YMIN_p= 0
$$ End of Bruker specific parameters
$$ ---------------------------------
##NTUPLES= NMR FID
##VAR_NAME=  TIME,          FID/REAL,        FID/IMAG
##SYMBOL=    X,             R,               I
##VAR_TYPE=  INDEPENDENT,   DEPENDENT,       DEPENDENT
##VAR_FORM=  AFFN,          ASDF,            ASDF
##VAR_DIM=   8192,          8192,            8192
##UNITS=     SECONDS,       ARBITRARY UNITS, ARBITRARY UNITS
##FACTOR=    0.0002768,     1,               1
##FIRST=     0,             0,               0
##LAST=      2.2672688,     0,               0
##MIN=       0,             -273769,         0
##MAX=       2.2672688,     244387,          0
$$ Real data points
##PAGE= N=1
##DATA TABLE= (X++(R..R)), XYDATA
0@%%%%%%%%%%%%%%%qJ6j6J6j6K1k9L2l7M5n0N8o7P5q8J02j16J32j48J65j86K09
37A10k34K62k91L23l60M00m41M88n40N95o56P23p96Q76r66J066j176J302j443
56g58J602j786K003k263K574k960L453m101N005o345Q529j2693K3290j00836j88483
71b73769K62598J91730j35329j47296O7561Q5857r430j3009l676q3105l0360J06225
83A7997P0411p6984r0529L1460J20221J9105j17913p4035O0108Q3457J464n9372
95a4610j4025K9210J4061K4540N796p7604m5913P6201O5015n3031n9455M7858
107a957N2045m8372k6592M3125k3514n9317M5930P9013l0273q0765K6634Q9936
119F5893k5703r0078J7886O0764k6880l7872M8814M8343o2731o3493P1636O8017
$$ plain form
0 0 0 0 0 0 0 0 0 0 0 0 0 0 0 0 0 -8 8 -8 8 -8 13 -16 16 -21 24 -26 32 -35 40 -48 54 -62 70 -78 87 -99 110
37 110 -124 138 -153 170 -190 210 -231 257 -283 312 -344 379 -417 459 -507 559 -617 685 -758
56 -758 844 -942 1061 -1202 1372 -1588 1865 -2236 2769 -3576 4953 -7740 15550 -85286 -273769
71 -273769 -11171 180559 45230 -102066 -34505 51352 41922 28913 25237 -57868 -88228 17997
83 17997 88408 11424 -79105 -47645 72576 91681 -26232 -100267 -40159 43298 44762 -14610
95 -14610 -28635 575 14636 39176 44972 -32632 -78545 -2344 62671 9640 -49815 -1957
107 -1957 50088 1716 -24876 18249 -5265 -64582 -18652 60361 30088 -50677 -24043 65893
119 65893 40190 -49888 -32002 28762 1882 -35990 12824 61167 -1564 -65057 6579 74596
131G4596p9134q3110N3420Q9227j3694p2875M99N6835K682l4460m773N848q078
144a3017M009L0544J2192m2205k4538M7640K6324n0996l8760L5217L8867k0794
156D483k2423K7655N876l1540J1653K9771l0178l4163L7717M0953l2334l5002
168b7532L7201K5855m2819k2611L3030J2663k8100r702K8644J4435k2339j1659
180a2934J4975K061j4539Q52J8879M41k4037N178M0983k294n4446j0636N3379
193A7862J9594n1818k6806M4747K7361k6862j7339Q735j212k657J6137N115k7695
206a4838r048L9013K1154l3725k9654J8680K9696q176k6760J051J7210L61o76
219D288K850j1541j4078J0238K4225o065l2201L810L7180M281k8088j0486J6124
$$ plain form
131 74596 -4538 -87648 -34228 54999 41305 -31570 -31071 25764 28446 -6014 -10787 -4939 -13017
144 -13017 -9008 21536 33728 -8477 -33015 14625 40949 -10047 -48807 -13590 25277 4483
156 4483 -17940 9715 15591 -15949 -4296 25475 -4703 -38866 -1149 39804 7470 -27532
168 -27532 9669 35524 -7295 -29906 3124 15787 -12313 -22015 6629 21064 -1275 -12934
180 -12934 2041 4102 -10437 -9585 9294 9735 -14302 -9124 31859 29565 -24881 -35517 17862
193 17862 37456 -14362 -41168 3579 30940 4078 -13261 -4526 -5738 -8395 7742 12857 -14838
206 -14838 -23886 15127 36281 2556 -27098 -8418 21278 13102 -13658 -12607 4603 4964 4288
219 4288 7138 -4403 -18481 -8243 15982 9917 -22284 -18474 18706 22987 -5101 -15587 537
232E37J2552j0597q754O828P32k454Q072J048j2485q528R112J4819j0280j9190
246a8588J3574K0370j0814j4728P435J3735q536j4286J3592J2599j7439m287J6614
259I241k32j2997k918Q361J196j0612K823J1351p002o134P706L408l414o470k80
274e973J2944K76j2297L341R714j232q006l736Q745o03j2536P381R918j1844m191
289h099J0764K936q374p408R809Q645j1033j933J0143j184k850J064k195Q12k212
304a115p45O058l828o821N964M570k362p383l311J2083K323j2647L270R654k855
319B855k695J219J292j385m550N873L759j1131J502Q637l022m532j633Q52M806
334A847l778m069O223J188j101O61j178K850j136m756O468R55p423L495M708l000
$$ plain form
232 537 13089 2492 -6262 566 1298 -1156 6916 7964 -4521 -13049 -3937 10882 602 -18588
246 -18588 -5014 15356 4542 -10186 -2751 10984 2448 -11838 1754 14353 -3086 -7373 9241
259 9241 9009 -3988 -6906 1455 2651 -7961 -5138 6213 -789 -6923 783 4191 777 -5693 -5973
274 -5973 6971 7247 -5050 -1709 8005 6773 -1233 -4969 3776 3173 -9363 -1982 7936 -3908 -8099
289 -8099 2665 5601 -2773 -10181 -372 8273 -2760 -4693 5450 4266 1416 2480 285 1097 -1115
304 -1115 -1860 4198 370 -6451 -487 4083 1721 -5662 -8973 3110 5433 -7214 -3944 5710 2855
319 2855 160 1379 2671 1286 -3264 2609 6368 -4763 -3261 5376 2354 -2178 -3811 -2959 1847
334 1847 -1931 -6000 223 1411 310 971 -207 2643 1507 -3249 3219 4174 -3249 246 4954 1954
350A954l847j009L890Q2o934L357M030m599L019K381l929M46J720L96J644l858
366a257k17M791J21p12l204k692N873k17p211K637J863k510K396K009j957l378
382c665j12P219O23q220K293N211o94Q83j450l649Q1K613J767k605n086K153M235
399A597m59l3l509m178N040N000j495l950j778M620N518j514m620m194J091Q153
415E289K2p563k600L141M749J416n441m841L7L724O588o23q452k261Q442R173
431A0800m251j3895p11J1912M512n773o496k53N542M387j390p889o916N824R352
446D755p41o213l210J622P936N595p823j1897K329J5562K392j2985k885P920J998
461D355j037j330o397l997N107P975j796o942N45L644J449M256l706j2856K529
$$ plain form
350 1954 -1893 -2902 988 1070 -5864 -2507 1523 -3076 -57 2324 -1605 -1159 561 957 2601 -1257
366 -1257 -1474 3317 3438 2726 -478 -3170 2703 2486 -4725 -2088 -225 -2735 -339 1670 -287 -3665
382 -3665 -3777 3442 4065 -4155 -1862 3349 2655 3538 2088 -1561 -1480 1133 2900 295 -4791 -2638 1597
399 1597 1138 1105 -2404 -6582 -1542 3458 1963 -1987 -3765 855 6373 4859 239 -3955 -2864 5289
415 5289 5311 -2252 -4852 -1711 3038 4454 -987 -5828 -5791 -2067 4521 3898 -4554 -6815 1627 10800
431 10800 6549 -7346 -8057 3855 8367 2594 -3902 -4155 1387 5774 4384 -3505 -10421 -4597 4755
446 4755 4014 -2199 -5409 -3787 4149 9744 1921 -9976 -7647 7915 10307 -2678 -5563 2357 4355
461 4355 3318 1988 -4409 -8406 -3299 4676 2880 -4062 -3517 127 1576 5832 2126 -10730 -8201
476h201J6381K979j3189n434J1593M278q732j125J619p493J073J1547K116j0024
490b612o148O829R305k560q617o869L065J7594L782j7542n627J3520O410p100
504C430q493q0J523M71R542K265j5091m299J3678P028r093j2086q4J3352Q034
519A0097l008r455o198J1517J1087j2500j2358N441Q305J471k373J06j993o709
533f570N396J0906j0296j3712O647J4300L134r058o966O065O492j728m895o590
547f875K279R250j013l029L024l505m922L303O647m467j4375L807K0737l15j5675
562e129k46P280K207j993m058k070M59N827P335n981q329L631K456j687J649m649
578c298o536O336J1548Q48j3482n476J3585O274j0790o002K478N606O109j528
$$ plain form
476 -8201 8180 11159 -2030 -7464 4129 8407 -325 -1450 169 -7324 -6251 5296 7412 -2612
490 -2612 -8760 -1931 7374 4814 -3803 -10672 -7607 9987 13769 -3773 -9400 4120 10530 3430
504 3430 -5063 -5143 -3620 -3149 6393 8658 -6433 -10732 2946 9974 881 -11205 -11289 2063 10097
519 10097 7089 -2366 -8564 2953 14040 1540 -10818 -5377 2928 4399 2026 2132 139 -6570
533 -6570 -1174 9732 -564 -14276 -7629 6671 9805 747 -6219 -154 6338 4610 -285 -6875
547 -6875 -4596 4654 3641 612 3636 131 -4791 -1488 5159 692 -13683 -9876 10861 10546 -5129
562 -5129 -5375 1905 4112 2119 -1939 -4009 -3550 2277 9612 3631 -4698 -1067 1389 -298 1351 -3298
578 -3298 -9834 -3498 8050 8898 -4584 -10060 3525 9799 -991 -6993 -4515 1091 7200 5672
592E672o057k449K501M686k627p302J53K646L558O537m420j0632L177J0253L04
607F000j1068n243J1824P641p461k558L228j379m27P22j024k982k340N160M419
622D512l986j822P89j625K256R86m041j571M240N150j105m443J686K301m722k2
638a417L608l254k254L216L420p17m138q66J028j013K784N95n608J729Q450k62
654E301o366q88L565j44k459K038Qm859L506P042m094p868J988M623j018l338
670b963M39J766J85K731J600n112j303M610Q7l127N84J803n79o27K802q75n227
687c206N91M528k384k934K175J595n58M22J621j732k339K552K305l047k51K519
703A857J24j425M20J60j820j748J796J510k328k51J695K0m9M60r99m61j33K344
$$ plain form
592 5672 -385 -2834 -333 4353 1726 -5576 -5423 -2777 781 7318 2898 -7734 -4557 5696 6000
607 6000 -5068 -10311 1513 9154 1693 -865 2363 984 557 1279 255 -2727 -5067 93 4512
622 4512 526 -1296 -507 -2132 124 1110 -2931 -4502 -262 4888 3783 -660 1026 3327 -1395 -1417
638 -1417 2191 -1063 -3317 -101 3319 2602 -1536 -2402 -1374 -2387 397 992 -4616 -2887 5563 5301
654 5301 -1065 -1953 1612 1468 -991 1047 1055 -3804 -298 6744 2650 -5218 -3230 1393 375 -2963
670 -2963 -2524 -758 -573 2158 3758 -1354 -2657 1953 2040 -1087 -503 1300 721 94 2896 2021 -3206
687 -3206 -2615 1913 -471 -3405 -1230 365 -193 229 1850 118 -2221 331 2636 -411 -662 1857
703 1857 1981 556 976 1136 -684 -2432 -636 874 -1454 -1705 -10 10 -39 421 -578 -1039 -1172 1172
721A172P73k277j10K390k12o26r44q96N28K75k53j02j753J413K015j645j330O09
739i73K09J152j13n5P20o29P74J777k740j038K210m51q99l60m01O39J69o41M80
758a70j843M14K852j604j090J456N60L24L8q39R33m97j67J455k323n53K353q20
776D79j958Q69m72P91L35j551R51J90l9J651j523o87K622j115OR60j446O95M92
795A250j197O59j120p99J651j172q18J559j285M72J538j758M65J419q61R77q0
812I00j086J711m96q25J020j600J82J457j898n16J069r79J028o53q86J653l28
829b47m83J868j261k13J712j209M72P94j999J142P68j589L39q21j64J448j636
846a079nJ194j994J242J762j354m35O79KJ740j067j124J409p14N20P97k225J97
$$ plain form
721 1172 1945 -332 -442 1948 1736 1110 166 -730 -202 73 -180 -282 -2035 -622 1393 -252 -1582 -973
739 -973 -764 388 275 220 940 311 1085 2862 122 -916 1294 843 -56 -416 -817 -178 -9 -650 -170
758 -170 -2013 -1599 1253 -351 -1441 15 575 899 937 98 1031 534 367 1822 -501 -1054 1299 479
776 479 -1479 -610 -1082 -291 44 -1507 -556 -366 -405 1246 -277 -964 1658 543 549 1509 63 758 1250
795 1250 53 712 -408 -1207 444 -728 -1546 13 -1272 -800 738 -1020 -555 864 3 980 900
812 900 -186 1525 1029 204 1224 -376 -194 1263 -635 -1151 -82 -1061 -33 -686 -1572 81 -247
829 -247 -730 1138 -123 -336 1376 167 639 1433 -566 576 1344 -245 94 -727 -891 557 -1079
846 -1079 -1084 110 -1884 -642 1120 -234 -669 10 12 1752 685 -439 970 256 776 1573 -652 -455
864d55J040r36L74m23j306Q39Q19k98K46j774J757J461j483J69Q06j355J068J463
882B012r89j441m17J737P90k675r17K027q46j18R80j016k88Q52M81J468j855j169
900a384J812J539o04q81j192J481J050j863q31M92k51L45o1J99K26k112J232K419
918A616j341k279J058K011J062j514q60J151l96j17Q57j361j104O82J322J08j844
935i49n30J100M45n80N43j231o70K567J879j065l085J037K671j34k305n97N81
952c23R90O29j220n09k91k23P04j82r2j022p20L662K330m244k759M172L146l488
970E60l416K633L068k567n67K433j765k994J552K186j404k340M58L209Oo65j86
987B01j495J244K068j938k029J687J680N36j579J82M51k288o6K339j744j775J911
$$ plain form
864 -455 585 -351 23 -400 -1706 -867 -48 -346 -100 -1874 -117 1344 -139 30 836 -519 549 2012
882 2012 1023 -418 -835 902 1692 -983 -1900 127 -719 -837 143 -873 -1161 -309 172 1640 -215 -1384
900 -1384 428 1967 1363 482 -710 771 1821 -42 -873 -381 -632 -287 -348 -149 77 -2035 -803 1616
918 1616 275 -2004 -946 1065 2127 613 -247 904 508 391 1248 -113 -1217 -535 787 895 -949
935 -949 -1479 -379 66 -514 29 -1202 -1872 695 2574 1509 -1576 -539 2132 1998 -307 -904 -323
952 -323 667 1296 76 -433 -724 -947 -243 -425 -517 -1539 -2259 1403 3733 -511 -3270 902 4048 560
970 560 -2856 -223 2845 278 -289 2144 379 -2615 -1063 1123 -281 -2621 -2163 1046 1052 387 201
987 201 -1294 -50 2018 80 -1949 -262 1418 1954 375 557 1008 -1280 -1346 993 -751 -2526 -615
1004f15J028P35l80j644n53P87J975J76m163P16O103q54m331R53J945j476l091
1021b689J768K884l687k075O165J429n788j415L274K360k325l032K490K542n88
1036A313Q67r18j996J510m80j417R48l06m91P18J825O18l969k047M811M84m159
1053b689R34K807J02Q8M35K78k845q89L888p43m672L376K550l062J55K517j868
1070C62m366J224M931j020n669L603N528l136k133J444l61r83l37J793N4j775
1086h41R12J864j444M4j183l007K818K751k943j687K888L145j998l742L047R51
1102A575m328J911M176k902k489L288K694l070l558J775J665k760L48K860j789
1117f04p52K925Q1j866j939J433J973j668k44K521q77n86Q64r45r26k87k64O14
$$ plain form
1004 -615 413 1148 768 -876 -1429 -642 1333 1509 -2654 -1938 4165 3311 -1020 -67 1878 402 -2689
1021 -2689 -921 1963 -1724 -3799 2366 3795 -1993 -3408 -134 2226 -99 -3131 -641 1901 1313
1036 1313 2180 1262 -734 776 296 -1121 -173 -479 -970 -252 1573 2191 -1778 -3825 986 1470 -2689
1053 -2689 -1755 1052 1154 1242 1677 1955 -890 -1779 2109 1366 -3306 70 2620 -442 -287 2230 362
1070 362 -4004 -2780 2151 1131 -4538 -935 4593 1457 -676 768 407 -576 -913 880 934 -841
1086 -841 71 1935 491 535 -648 -3655 -837 1914 -1029 -2716 172 3317 1319 -2423 624 1575
1102 1575 -2753 -842 3334 432 -2057 1231 3925 855 -2703 -928 737 -2023 -1675 1185 -604
1117 -604 -1356 1569 1650 -216 -2155 -722 1251 -417 -661 1860 983 397 1261 316 -610 -897 -1161 -547
1135e47N37l68J46j96J154N18l297J97K922q26j306J501K088j120k275J737J507
1152B372l822j418L493N11k711M70K564l99k590J32K242j669j487K541J309j451
1168H7J8J077O01j494q79N38K28k58L65o9r7O37j116o68J004o06j052Q87J688
1187H91N7j833J199J949j782j959K206M83j545m54J935K73k483M71J929j387k331
1204b381J722J183q12j005J463J178j457p82J843l01j443O29Q78L36n22o84P99
1221F44J07j210k22J71K03M4o53N68R17j165o6R94L21q07n58J345Q55j370o91
1240e73K179n96j647K85Q87m21j097QJ923j098j507J849K37j070L7O91O14n80
1258A21n77J647k37j287O69N80j028J8k56K40M43p97M8M86q62M60J36l63R74o28
$$ plain form
1135 -547 -10 -378 -232 -428 726 1244 -2053 -1856 1066 240 -1066 435 2523 1403 -872 865 2372
1152 2372 -1450 -2868 625 1136 -1575 -1105 1459 1060 -1530 -1398 844 -825 -2312 229 1538 87
1168 87 105 1182 1783 289 -590 -52 176 -82 283 214 117 754 -362 -1030 -26 -632 -1684 -797 891
1187 891 948 -885 314 2263 481 -1478 728 1211 -334 -788 1147 1420 -1063 -592 1337 -50 -2381
1204 -2381 -659 524 -288 -1293 170 1348 -109 -891 952 651 -792 -163 715 1051 529 -155 644
1221 644 751 -459 -681 -510 -307 -263 -916 -348 569 -596 -662 332 653 -154 -712 633 1488 118 -573
1240 -573 1606 1010 -637 -352 535 114 -983 -975 948 -150 -1657 192 429 -641 -604 87 701 121
1258 121 -456 1191 954 -333 336 916 -112 -94 -350 -110 333 -464 -416 70 -792 -332 -196 -559 415 -213
1278b13l68J621o12p29Q26K07l51n53l05J531j012j430J693J05j458K62J90O47
1296E1p3j240J420O04j181K06R74p24K19J38q7O98j090p14J557p07p78L98k98
1315f27O33j82q68J345j98j185J500k7k85J0k33O42J19p06O65Q0q51O96k25q54
1335e51O98o24j04P52j338N05R99q15M23K71m21J065q78j74J029j46r64R63m58
1354B32k38l01q1M32j37r52Q98K50o86O40m07J32Q90o95J56N63p25M50J76l93
1374B04J64k93l7M93j01p62J10n54l4P59l55J40p0QR43m28m64K44K07J78J66k26
1396B92l73L98K9O4n17l90J95j04K9K02j71n11R28L29l89k74O1R55l52n91O28
1417D38K3k70N08m32j30j67m89N87k8n47K1o6J98R07p71o35O05Q05j69k98k89
$$ plain form
1278 -213 -581 1040 428 -301 525 732 381 -172 -477 1054 42 -1388 305 410 -1048 -786 -596 51
1296 51 -22 -1262 158 762 -419 -213 761 37 256 394 307 1005 -85 -799 758 51 -727 -329 -627
1315 -627 6 -176 -1044 301 103 -1082 418 391 106 116 -117 525 644 -62 603 683 -168 528 303 -551
1335 -551 147 -477 -581 171 -1167 -662 337 -478 -55 216 -205 860 -18 -192 837 691 -273 690 232
1354 232 -6 -307 -388 44 -93 -1045 -147 103 -583 57 -350 -218 672 -23 133 696 -29 421 597 204
1374 204 368 75 38 531 430 -332 -222 -776 -810 -51 -406 -266 -336 -328 615 187 -277 -33 174 352 518 292
1396 292 -81 317 346 410 -107 -497 -302 -406 -377 -175 -346 -857 71 400 11 -263 -202 753 401 -190 438
1417 438 461 191 699 267 137 -30 -519 68 40 -507 -486 -552 -354 553 -218 -853 -248 557 388 90 -199
1438a99Q28J3o98M10K56q53J31K53j82j78l22M72L94k67K5l15q03J379L03j064
1458d17mJ303L67j314k25J209n74j298J009L28k57o04M52L87m80o04J55Q7J50
1477c30J133j290J36J619n3j361l63J340k41j492L46J878q44j844J866O03j726
1494f23r46R22N26m48J08R37j30m75J097q45j481J206J054j253k7J189K18j231
1512b02k04J404j105k202J574J142r03m7O42M75k53m32J26k76m93J370l7r90J337
1531I26Q50j721l47P11l61j992M36K517Pk708J029K250j502j061N44L13O0n59
1549f08J526L54j238N48O23j656K34L98j245L49R50K34o45n39J047K96j970K11
1567a131J534j008L50J224K5l94m12K01l11r50K57J048j249O45J685j374r24P34
$$ plain form
1438 -199 629 642 -56 354 610 -243 -112 141 -41 -219 -541 -69 325 58 83 -232 -1035 344 647 -417
1458 -417 -421 882 1249 -65 -290 919 345 -953 56 384 127 -477 -25 362 -118 -722 -567 -480 -330
1477 -330 803 -487 -351 1268 1215 -146 -509 831 590 -902 -556 1322 478 -1366 500 1103 -623
1494 -623 -1569 -647 -121 -569 -461 476 346 -129 968 123 -1358 -152 902 -351 -378 811 1029 -202
1512 -202 -406 998 -107 -2309 -735 407 -496 -543 99 574 321 -111 15 -261 -754 616 579 -411 926
1531 926 1776 55 -292 419 58 -1934 -1498 1019 1026 -1682 -653 1597 95 -966 -422 -109 -49 -608
1549 -608 918 1272 34 582 1205 -451 -217 181 -1064 -715 235 469 -176 -715 332 628 -1342 -1131
1567 -1131 403 -605 -255 969 994 600 188 389 78 -872 -615 433 -816 -171 1514 140 -784 -50
1585e0K20j183n77J435J274j599K58J863q45j434J072R1o38q06Q10J154p61n19
1603b35J077j126p67P60q27k52J028O86K4m2J09P32j568j17J306j059o78J871
1621I22M90j315j0O55o47r02l30J117o79m94J991Q1j690J042K57m08q88L58J116
1640F66m72n69J555k1j592N28J40m94o87N62J89J88l61J053m97p45Q57m01p07
1659h08Q30M83k90rP63K38j393m76J147n89j386J018J276q13p28J114K40j485
1677h68k76J724l86j405J071J432q03n98Q68J62j274o1O07j02q60R85K66q21K34
1696a05j9l51m14N85M79n45K01J052l27o46O65j47q47K47R38q00l89L93P83q90
1716a37q44R62J82j207N24R11j78o18M21P36p41l49N75N41j096K16O96m05l6p5
$$ plain form
1585 -50 170 -1013 -1590 -155 1119 -480 -222 1641 796 -638 434 525 -113 -919 -109 1045 284 -235
1603 -235 842 -284 -1051 -291 -1118 -1370 -342 344 368 326 435 1167 -401 -518 788 -271 -949 922
1621 922 1412 97 87 742 95 -807 -1137 -20 -699 -1193 798 879 -811 231 488 80 -808 -450 666
1640 666 194 -375 1180 1159 -433 95 235 -259 -946 -384 -195 -7 -368 685 188 -557 300 -101 -808
1659 -808 22 505 215 206 969 1207 -186 -662 485 -104 -1490 -472 804 -9 -737 377 617 -868
1677 -868 -1144 580 194 -1211 -140 1292 489 -109 759 921 -353 -414 193 91 -769 216 482 -339 -105
1696 -105 -124 -475 -889 -304 175 -370 -169 883 556 -90 575 428 -419 -172 766 -34 -423 -30 753 -137
1716 -137 -981 -19 163 -1044 -520 391 213 -405 16 752 11 -338 237 778 -318 -102 594 189 153 78
1736G8L22m58o76O32l34j38L86l7J33L55J44n21M89O6k28M2k38L94r5n95P63k07
1758B77q13M9L49j82o4l27L79N22o90L44O88o99O3K09K2K16l10J95L28q74K31
1779h7K07j81j29K2j53J21l40j71J053m52l51O89j53K45k77k88O40J01n49M76
1799D23k56m03O28o35K65J98q96l0J086n62l41N93k35M61n65N9Q66q55q1Q97m79
1820A38p7J79l57N98m74j94N76k10o65M54N4l89J82j31M03Q5n19L81O27o81K31
1841B11R5j30M22p14R0N58q61k2L14J05n92J28R6L59j98n77P71o0j3J07J59K43
1863D91nl72L69j07m14J93j68j11K07m39o4J08j30K30K52l09K26K27k37N30n67
1884i0L57ok62NN77p37J30Jk39L06j15m91N30K74q53J52O88n8l22j47O80R3o33
$$ plain form
1736 78 400 -58 -734 -102 -436 -574 -188 -225 -92 263 407 -114 375 441 213 255 17 411 316 -279 484 277
1758 277 -536 -487 -138 -320 -384 -711 -332 190 -500 -156 532 -167 -104 105 127 343 33 228 556 -318 -87
1779 -87 120 -61 -190 -168 -321 -200 -540 -711 342 -110 -461 228 75 320 43 -245 395 496 -53 423
1799 423 167 -236 392 -243 22 220 -676 -706 380 -182 -523 70 -165 296 -269 -210 656 -199 -280 617 138
1820 138 61 240 -117 481 7 -187 389 179 -486 -32 22 -367 -185 -316 87 172 -347 34 661 -20 211
1841 211 306 176 598 -116 -26 532 -329 -351 -37 68 -524 -396 -300 59 -139 -716 55 -5 -18 89 248 491
1863 491 486 114 483 376 -38 155 -13 -124 83 -356 -420 -312 -442 -212 40 -269 -43 184 -53 477 -90
1884 -90 267 261 -1 4 581 -156 -26 -25 -264 42 -73 -564 -34 240 -613 -461 227 169 -153 -300 380 473 -160
1907a60L22M79n65j09K72r6m2m70L3L08k90k9%j6L68l9k89K06K53J23k28j93K64
1930A02L32o17O98j52k77O8m41o9N5R5l1l90K92L45l08m24Q14L06p33k50N93L39
1952C47l15k88O29j90k85K98K06n08k60K73L9R5l17J48j59k26O67k26l47L29O86
1973E96k61l23L21L01p81l42R34j29p62Q7P36l39r6qK8n7j14K2q1j24O14J11o00
1996b67M80L14m47l19L77O3k74o29R66L61r67j77O78l04m17J56J52O5L03M17j3
2017E18q51L70O50j386N93O56l20k11J01N75p95q32P43R59j571M0J097n55L14
2036I5r8J19J27n00M8M95n38K41R95j015K49O93j301j75M07J30p16k08Q45Q06
2056F99j119j78J587p68r45N92K70l00j11P68O53j306j17R42r11m45J044o12n28
$$ plain form
1907 -160 162 641 76 -33 239 143 101 -369 -336 -28 -318 -347 -347 -363 5 -34 -323 -117 136 259 31 -162 102
1930 102 434 -183 515 363 86 154 -287 -356 -301 -206 -237 -627 -335 10 -298 -722 92 398 -335 -585 8 347
1952 347 32 -256 373 183 -102 196 402 -106 -366 -93 -54 41 -276 -128 -287 -513 154 -72 -419 -90 596
1973 596 335 12 333 634 -147 -489 445 316 -446 -359 377 38 -58 -66 -38 -95 -209 -187 -268 -392 222 333 -267
1996 -267 213 527 80 -239 138 201 -73 -702 264 625 -342 -519 159 -145 -562 -406 -254 -189 114 531 518
2017 518 -333 37 687 -699 -106 550 230 19 120 695 -100 -932 -189 770 -801 -761 336 -219 95
2036 95 -3 116 243 -257 -209 286 -252 -11 984 -31 218 911 -390 -565 -158 -28 -744 -952 -107 699
2056 699 -420 -598 989 221 -724 -132 138 -162 -273 495 1148 -158 -275 667 -244 -689 355 -257 -785
2075g85Q23L88J03j052M26M88p80p9R50l37m64N33N96l81m55j78M10o92j25R56
2095C45o03j45J128k75q06J7M70m79m60N81Q66o35m86J526k0j528J52N82k3j057
2115h50Q40O54n92m55J014n65q32K47O29m76J1Q80j5l93QP25o49p44Q17m7o09
2136d02N82N33n64m26L63k26m44n05J074o9q53J356J48o96%O60j10j082K80J038
2156F57l99q14J190M76j585p3R98p95k74j55R30j96q6O38k50o00J09K27k98L69
2176F9O7K23k55J06M07m99n49M44k1p28M29M27l13j47L20N59n61m17O04j5r67
2197h17P76P43n22k83L86J80p23l36Q56j0o15jR27m35n13N15j95M8n06N21J93
2218A89j00L75J94o67K61j68l06K89J26J12n12J00M92l99n77P66P1o69L9Q12j82
$$ plain form
2075 -785 38 426 529 -523 -97 391 -389 -468 482 145 -319 214 810 429 -26 -204 206 -486 -611 345
2095 345 -258 -403 725 450 -356 -339 131 -348 -808 -227 639 4 -482 1044 1024 -504 -352 230 207 -850
2115 -850 -10 644 52 -403 611 46 -786 -539 90 -386 -375 505 490 97 105 830 181 -563 254 207 -402
2136 -402 180 713 149 -277 86 -140 -584 -1089 -15 -84 -937 419 567 -129 -129 531 421 -661 -381 657
2156 657 258 -556 634 1110 -475 -548 450 -345 -619 -774 156 -40 -126 512 262 -338 -229 -2 -300 69
2176 69 136 359 104 210 617 118 -431 13 -8 -736 -307 120 -193 -340 -20 539 -22 -439 165 150 -817
2197 -817 -41 702 180 -103 283 463 -260 -596 260 250 -365 -366 561 126 -387 128 -67 -19 -525 -4 189
2218 189 89 464 658 -9 252 84 -222 67 193 305 -207 -107 385 -14 -591 175 246 -423 -384 428 246
2239B46j25k66Q30l13o73L30L97o29o9O19j6l79j5Lrl81P8M34k28J00K35o6O0
2262A63j70K40J01m38K38r5k14L02K61m42r8J6ll1M0j85K79j12R0J98m17K15K40
2285A78l10N6J98K10k29k7j64M00l48k45Q44p81k4L76j74j9l41J15N82l32l15
2306c50M91p9k78N89k37J98j4m94K77R4k39k69R0K49m6l17l8N11l06K32k97J73
2328f0Qo3m6N09k35j7L17j64m84P54m25j38Kk32L15p0k58K52P0k01K0K48j45M2
2352aO3J65L15m42l20L75Jl7j88K10K17o18j73N51m47K48L66l38r5K34j98J49
2374C7M25m69J46P7k18Q2j02L91k25k47J00M1k75K60j90l38M94l35K77K64k6m0
2396A29j84K0L18k24J36J0k33M2M41m41k42L03j02PJk13J15L98k73k06K02M8R3
$$ plain form
2239 246 121 -145 685 372 -301 29 426 -203 -272 347 331 -48 -63 -60 -69 -450 -372 62 -166 -66 169 103 163
2262 163 -7 233 334 -104 134 39 -175 127 388 -54 -152 -136 -139 -170 -130 -315 -36 -148 -58 140 -277 -62 178
2285 178 -132 -76 122 332 103 76 -88 312 -36 -281 563 -218 -242 134 -40 -59 -400 -285 297 -35 -350
2306 -350 141 62 -216 373 136 334 320 -174 103 197 -42 -311 -221 28 -18 -335 -373 138 -168 64 -233 -60
2328 -60 -52 -115 -161 348 113 96 413 249 -235 519 94 -44 -42 -274 41 -29 -287 -35 35 -166 -146 102 -43 -1
2352 -1 62 227 542 100 -220 155 156 119 -69 141 358 -260 -433 118 -329 -81 285 -53 -148 86 -112 37
2374 37 462 -7 139 216 -2 80 -22 369 144 -103 -3 38 -237 23 -167 -505 -11 -346 -69 195 169 129
2396 129 -55 -35 283 59 195 205 -28 14 455 14 -228 75 -27 -20 -19 -232 -117 281 8 -198 4 52 145
2419A45k12J9L29j18j19N7J81n0j10k90R1j8K79k56k56M2R6m9K61p3Q5P5r2J4
2443C1O3l08L66J90m20j23M76l45L82m13j35j59J33K50m94L97L24j57j86K06P2
2464A50l6l26J71N73m35k66N27l03k04KL37m21J29o3J17J33l89M15o4l45M01M9
2486A52o91N33J77K07l32k7K51J9q72O79L35o33o1M98j97l73J54L51k15m27M24
2507d8o3r8K21N81o27j57M38Q1n66j12O89l41n44M81N70m81n05Q27k60n80M59
2528c5J37q8p4K60J81m93m05R84p53j30J032j92n27J52R3K79j151N9J045q81j02
2549f09J072k18l47K23j53J09k86J02M81o12J99L58j86k98O03j80q87J40M83R9
2569I3m86p2J000m24n13Q10n8r01J90P74l30k03L86M04p56j21J94j25o38M25M81
$$ plain form
2419 145 -67 -48 281 163 44 101 282 232 122 -168 -77 -95 184 -72 -328 -286 -190 -239 22 -51 34 109 17 31
2443 31 94 -214 152 342 -78 -201 275 -70 312 -101 -236 -395 -262 -12 -506 -109 215 58 -128 78 150
2464 150 114 -212 -41 532 97 -169 358 55 -149 -147 190 -231 -102 -165 -48 85 -304 111 47 -298 103 152
2486 152 -539 -6 171 378 46 19 270 289 -583 96 431 -202 -263 235 38 -335 -181 170 -45 -472 -48
2507 -48 -111 -209 12 593 -34 -191 247 328 -238 -350 339 -2 -546 -65 505 24 -481 346 86 -494 -35
2528 -35 102 14 -60 200 381 -112 -517 467 -286 -416 616 424 -103 49 142 421 -730 -671 374 -507 -609
2549 -609 463 245 -102 121 -32 77 -209 -107 374 -238 -39 319 133 -165 438 258 -629 -489 -6 93
2569 93 -393 -465 535 111 -402 408 350 -551 -361 413 83 -120 266 670 -86 -207 -13 -138 -776 -351 130
2590A30l51q4N05k2j84n48P69j79o72P48J33j72o5L76j20n26K16q0k83n2O72p9
2612A32o97O76K62p99O3M75j14m84P5J204l02p22N73K2p34k47Q20k32j83J00O20
2633E08j80n34M12m4r06N05L64m9m02P83J98m67r1L80m72k17J47M80n16O7L70
2654C36n59K5L8o7j47j33M73N65q47N66M91p05m72N82J52k43o88J046J72q92M53
2675A46Q6l16l23K58K9j0q3L84L57m64j54M58o37LK37P9J13j65J65j08j15p4K00
2698F6m30kL34Lk50L60l18K54j67L13j68l44M45J48r6j70N53j94k40m11M84j61
2720Im91L44M75o26K6M39m63J11K29oL09m28j03N48k58L0K45l19j09k2M1m7L4
2743c2Rk8j49r9N30o17L67K36m65J67L68n1j11n2p9L03l49J21J35k61j88N57M5
$$ plain form
2590 130 -221 -305 200 178 -6 -554 215 36 -636 112 245 73 8 384 264 -262 -46 -126 -409 -461 211 132
2612 132 -565 111 373 -426 -363 112 -2 -486 -411 793 491 -231 342 364 -370 -617 203 -29 -212 -112 508
2633 508 328 -206 206 162 -744 -239 125 76 -326 457 655 188 97 477 5 -212 -65 415 -101 -34 336
2654 336 -223 -198 -160 -227 -374 -507 -34 531 -316 250 741 36 -436 146 298 55 -633 413 585 -307 146
2675 146 232 -84 -407 -149 -120 -130 -213 171 528 64 -90 368 -269 -266 -29 50 163 -2 163 55 -60 -134 66
2698 66 -364 -366 -32 -29 -279 81 -237 17 -150 163 -5 -349 96 244 148 -22 531 337 97 -314 170 9
2720 9 -482 -138 337 -289 -263 176 -287 -176 53 47 356 -72 -175 373 115 145 390 71 -38 -60 -19 -66 -32
2743 -32 -23 -51 -200 -299 231 -386 -19 217 -248 -81 287 236 125 73 -6 297 -52 69 204 -57 -245 312 357
2766C57l84k03J1J52j62r2K96K45m56M41Qk13L91o11M72J00n89Q12p64J06K11
2787A28k5k28K96m61J55K20k07J93k4j52M37k55L94j50k56j09M37k44k22K14l07
2808a66K46j30m33L93J55k58J81j3j25J47k58L45n3k05J81L37n32N80k23k02L35
2829C02m18K48j21j54J77J19l48K79j46k94N50j07k31L26N0k64k34K47J98k02
2849b3L3m6K53l79K46k7j08l0j19L38k32n5J46J28k74K09lJ82k66j51R8J62p1
2872A1K5J96k12r4r3n7L33k97L00J21k95k0J74m2j45O0R1R4N2k55J87o6M8J39
2896B55l61QK43n35M01L3k12J41j23K28j36J46n1J81l47M3K79l6k21K28Q6j65
2918H5j21N4K30j85l08J56M6k7r7k72J66L55j30j80L25K2L28m01kL74n40J31J72
$$ plain form
2766 357 -27 -230 -219 -67 -229 -321 -25 220 -236 205 213 0 391 -220 252 352 -237 575 -189 -83 128
2787 128 103 -125 171 -290 -135 85 -122 71 47 -105 332 77 471 321 65 -44 393 149 -73 141 -166
2808 -166 80 -50 -483 -90 65 -193 -12 -25 -150 -3 -261 84 31 -174 7 344 -188 392 169 -33 302
2829 302 -116 132 11 -143 34 153 -195 84 -62 -356 194 87 -144 182 232 -32 -266 -19 179 -23
2849 -23 10 -36 217 -162 84 57 -51 -81 -200 138 -94 -149 -3 125 -149 60 57 239 -27 -178 -80 82 11
2872 11 36 232 20 -74 -167 -224 109 -188 112 233 -62 -82 92 50 -95 -35 56 150 202 -53 134 68 116 255
2896 255 -106 -98 145 -390 11 44 -168 -27 -150 78 -58 88 37 218 -129 -86 193 157 -64 164 250 85
2918 85 -36 18 248 63 -245 -89 -43 -70 -167 -439 -273 82 -48 -228 97 119 447 46 44 418 -122 9 181
2941A81k70k45K4K90k06o2L00K85o16Q9O00n66L12J08r8k51J42K67j84r9j95L73
2963A79n5J77k51k62K25j15pj97RK29m5j93L51K10l87J94M7L5k26K03K91l76k47
2986b11J67K21j66l92J70r8K02J36j11J95j82q2Q8L8j64K58kJ70J13k13K3l01
3008a41Q0L01k81k68J08J19N7M09k27q2j29N5Nk86L52J11Lp0L54m00j37JQ5K3
3032D2j01J55K11m56k01L07j1j97O4L25m03J87M48o3k34j26N10m35k20M22p2l45
3054a93J25K54m41J87%K14k77k36K90J03j99M30j38k20K53k9r2l31J30L72k14
3075a2q6K69K36q60K10K21l49O3J22K43o2P1K43o5o01M82n0p3k44L32M5j59QL01
3099B85N0o19L47N2p47L71N34k12k6K29J27n01l43L70L4N4J05J01k30l1J95J8
$$ plain form
2941 181 -89 -334 -310 -20 -226 -288 12 297 -319 -230 370 -196 116 224 126 -125 17 284 100 1 -194 179
2963 179 124 301 50 -212 13 -102 -109 -306 -297 -68 -113 -306 45 255 -132 62 109 144 -82 121 412 36 -211
2986 -211 -44 177 11 -381 -211 -309 -107 29 -82 113 -69 -151 -63 -25 -189 69 67 237 350 137 160 -141
3008 -141 -61 240 -41 -309 -201 -82 -25 384 157 75 -54 1 6 -280 72 183 186 116 470 70 -67 -66 19 42
3032 42 -59 96 307 -149 -350 -43 -54 -251 -187 138 -265 -78 370 307 73 -53 457 22 -198 224 152 -193
3054 -193 -68 186 -255 -68 -68 146 -131 -367 -77 26 -173 257 119 -101 152 123 31 -300 -170 202 -12
3075 -12 -98 171 407 -453 -243 -22 -371 -308 -186 57 -5 66 309 244 -357 125 75 2 -242 90 135 -24 -16 285
3099 285 335 -284 63 115 -632 -261 273 61 35 264 391 -110 -453 -83 -49 5 110 211 -19 -50 145 163
3121A63n46J61Q9kl84N40J66n70R3M34L1l67RL16n2j79qO72p71L5M59m95j15K48
3145g3O0k36L78k48J67m02L23K43n15k31O08L05m25K39k54M67l54j15q8K3r2K32
3167A2r6J11K34k21k77J83J46k75L1J43L86l87j95L10OQo1M5j60l5R5L57m92k99
3191d31K61L4j16J66n4k50L47K27J83n72J79L56j60m21K41J10k33j11L98j03j8
3212C3j68L41j71n58L94j2PJ28L06j06l41J20J22p0L0K27k68R5L91l65m9J8k96
3235a92P7k13J36K79j3j81L41k14j5l58M91J24n8k24J65R1m56K54J6k47L26R7
3257B26j56j86J44P1l30N8K78q3j19K82J71l62J48q3j59J85j89K67l04j04O07
3278C62o27o2J66K27j75jk69M13k36K6L83j45l25M79j94O8J41l44L3j89M16l10
$$ plain form
3121 163 -383 -222 -133 -135 -519 21 187 -383 -290 144 175 -192 -183 133 81 -98 -106 566 -205 -170 289 -206 -321 -73
3145 -73 -13 -249 129 -119 48 -354 -31 212 -303 -534 74 379 -46 193 -61 406 52 -63 -151 -128 -220 12
3167 12 -84 27 261 40 -237 -54 92 -183 -152 -9 377 -10 -205 105 111 119 58 103 -57 -92 3 360 -132 -431
3191 -431 -170 -136 -252 -86 -140 -390 -43 184 367 -205 -26 330 170 -251 -10 100 -133 -244 154 51 33
3212 33 -135 206 35 -523 -129 -141 -134 -6 300 194 -147 -27 95 25 55 282 14 109 500 135 86 104 -192
3235 -192 -115 -328 -192 87 74 -107 234 20 5 -353 138 262 204 -20 145 236 -220 34 50 -197 129 226
3257 226 70 -116 28 99 -231 -173 105 22 -97 185 356 -6 142 59 -100 85 -104 163 -141 -245 362
3278 362 -265 -327 -161 66 -109 -110 -379 34 -202 -176 207 62 -263 216 22 90 231 -113 -80 -269 147 -163
3300a63J36l3R3j34K09k47J01J66K8j11J28K91m42k57L50k67J87M3k85L7J5M2
3322a13J76k42J64O5Lm2j18q0O9J36n5j06K09P3J77m15L92j40J76j29l49j8K83
3345A16k23J44m1N4j64J70j60J17J11l70M60m89RL06J00j56l7n1J92j9l37K97
3367B9N3k14j73M25n1j80m5j87L10k5Q8j41r1m5J05L39O0j81p8o6K73l75K47j99
3391a22J57k90M1K78k80L06q2J81k21j7J94k4k07M8J55j86J21q0J48O4k79J55
3413F0J00J93k53m69L18j61P1Q6Q2r6L06j25oj53O4P4n9J05l23Q6R0K54k12J04
3437A36j43l4M3l0l7m4K6O7Q8j72N7K13j28O3j15j71M85k67k93M30k97L30r4j43
3461c0J54j57%R9j11p0N9k22N41l17Q8k2j49l5K80k00O1L52m14J13J0j99o7K07
$$ plain form
3300 -163 -27 -60 33 -101 108 -139 -38 128 156 45 173 464 22 -235 115 -152 35 78 -207 -170 -155 -113
3322 -113 63 -179 -15 50 53 11 -107 -187 -118 18 -37 -143 66 139 316 -99 293 153 329 200 -149 -167 116
3345 116 -107 37 -4 50 -114 56 -104 13 124 -246 214 -275 -266 40 140 -16 -53 -104 88 69 -268 29
3367 29 82 -132 -305 120 69 -111 -156 -343 -33 -58 30 -111 -202 -247 -142 197 257 76 -2 -68 205 -170 77 -122
3391 -122 35 -255 -214 64 -216 90 8 189 -32 -49 145 121 -86 -38 117 -69 52 -28 120 184 -95 60
3413 60 160 353 100 -369 -51 -212 -141 -55 27 -69 237 112 106 -47 17 91 32 137 -186 -100 -10 244 32 136
3437 136 -7 -41 2 -28 -65 -109 -83 -16 72 -100 -43 170 42 105 -10 -181 304 37 -256 174 -123 207 113 -30
3461 -30 124 -33 -33 66 -45 -115 -56 -278 263 -54 34 12 -137 -172 108 -92 -31 321 -93 20 30 -169 -236 -29
3485b9m0J61k63P6J06K85l61J42j99L88k58K7J63k14K20j41j81O3L14k93JJ1j51
3508a73J86k46MJ84j73M24L61q87r9L23L8K16J28j71J33m27j97L91l14J95J91
3529H7j95j17K45j30J16Q3M3j59K21k69K71K32o70O49l27l73J14L57l05Oo2M7
3551a36Q0j22L16Q4o00L85L60l36l33L74m2q6j75P53m26n99L00K75j51Q4O1j64
3573i8M2j32L44j46k84l0J44J71J04j4j27J61j2J48l95M1L28j18k47j0L53m26
3595b03k44M42J12l41K76j31J04j94N17J44m87k12K42k03J84j5P0Q9k39L46l39
3616h2q2j71M15j02k13K18L43j46p6l44L32j21k16J91j47R8K92Nn08M26j5j23
3638b6k75K04J34O8j94M32l32k6J36l82L38q6o5L64j50L3j8l40j03N64l77k51
$$ plain form
3485 -29 -69 92 -171 -95 11 296 -65 77 -122 266 8 35 198 -16 204 63 -118 -55 259 -34 -33 -22 -173
3508 -173 13 -233 -229 -45 -218 206 567 -320 -419 -96 -58 158 286 115 248 -179 -376 15 -299 -104 87
3529 87 -108 -225 20 -110 6 89 132 -27 194 -75 196 428 -242 407 80 -293 -179 178 -127 -121 -183 -136
3551 -136 -56 -178 138 222 -378 7 367 31 -302 72 30 -56 -231 522 96 -503 -203 72 -79 5 66 -98
3573 -98 -56 -188 156 10 -274 -304 -160 11 115 101 -26 135 123 271 -124 -83 245 127 -120 -130 223 -203
3595 -203 -447 -5 107 -234 42 -89 15 -179 338 482 -5 -217 25 -178 6 -9 61 150 -89 257 -82
3616 -82 -164 -335 80 -22 -235 -17 326 180 104 -240 92 -29 -245 -54 -201 -103 189 194 -314 112 97 -26
3638 -26 -301 -97 37 105 -89 343 11 -15 121 -261 77 -9 -74 290 140 173 155 -185 -288 276 -101 -352
3660c52L98L0j50K47l33K80k79K8L30K8k65M1J26Q4j30m8K04k30j40L25j51k44
3682b01M57k59J24l86R8j19J48m8L8J16k05J81J53N2pJ07k40P8j62M9J94n2M6
3705A62n0j64k12L16j35M3j02Q7K18j29L35k99j28R7r3K48m67K61J14r7OO0r3
3728b2l00M37j18j22Q5M5J92j20l51K48Mn8j36O9J41J75m7k28J89J32j94o6M2
3751co7K5P7j02k98J63J42K03j80L4j9J57o34M31PL95m18K09j22K9J03j70Jk01
3775b38K67j43K90l55Q3M96n73J99J53J25o4j91j8n7L6N3K3o5P7j85J08j74K61
3798A08l3n1j52n4L99m90M03j12J71j46pKR1j48R7j64J0j27K01j09J18L45l58
3821fq5L09l12J66n1n1K29k81l4J81k47L32P0j89Q3o5q7r1J96k22J59Qj99O5J1
$$ plain form
3660 -352 46 76 -74 173 -160 120 -159 -131 199 227 -38 3 129 213 83 35 239 9 -131 194 43 -201
3682 -201 256 -3 121 -265 -167 -286 -138 -186 -148 -32 -237 -56 97 149 142 249 9 87 -75 -26 168 116 162
3705 162 112 -52 -264 52 -83 -40 -142 -55 163 34 369 70 -58 39 -54 194 -273 -12 102 5 11 71 -22
3728 -22 -322 115 -3 -125 -40 5 197 77 -274 -26 -22 -80 -216 -147 -6 169 122 -106 83 215 21 -45 -3
3751 -3 -70 -45 32 -70 -368 -205 -63 140 -40 -6 -25 132 -502 -71 -64 331 -87 122 0 29 132 -38 -37 -238
3775 -238 29 -114 176 -179 -96 400 -173 26 179 304 240 49 31 -26 10 63 86 21 98 -87 21 -153 108
3798 108 75 24 -128 -182 217 -273 130 18 189 43 36 38 129 -19 78 -86 -76 -203 -2 -111 7 352 -6
3821 -6 -91 218 -94 72 21 -30 199 -82 -116 65 -182 150 220 31 114 49 -38 -129 67 -155 4 12 -187 -122 -111
3846a11Q4L15m89N01k59N8j07K2K18k17J1m5J79k03o9P7j29J80j04n3O1l0o3K26
3870E3J28k88K28k26L00l81J57K09M8k00j25J06k59K03p1mK96j10P7k57j15O20
3892C89j05m16J75J89p1p1n4k46J37J72j66J69n6l23K99l62L62N7k15L21o05K46
3914a74K91p8k7J5L3k6K45k78j1K14j14m0k52K79q3k16K59j58np0J82R8P9r1J20
3939A92k29p3J03k03O9K60Q7j65k9R3j67Q0o1L14l83N6O1O8J61j94k1J36m29N16
3963B42l15J33P4Q0n6m75M16k02N7j03J50o0r3J59J26l45L24m75L59l27N74j27
3985A16j37j63J99K64k79l06O08l18j29L59m9j0n4k14J19j78j5JK79j96M3P2K
4008A4K8J93n0m66J38O8K90k73p4J99p6j82M38j77j22J81j31j23K31j06Oj63J95
$$ plain form
3846 -111 -27 288 -201 300 41 99 -8 14 232 15 26 -19 160 -43 -112 -35 -164 16 -88 -141 -80 -110 -173 53
3870 53 181 -107 121 -105 195 -186 -29 180 228 28 -97 9 -250 -47 -118 -122 174 64 141 -116 -231 389
3892 389 284 -132 43 232 161 90 36 -210 -73 99 -67 102 46 -277 22 -340 22 79 -136 185 -420 -174
3914 -174 117 39 12 27 60 34 279 1 -10 204 90 50 -202 77 -6 -222 37 -121 -126 -196 -14 84 163 72 192
3939 192 -37 -110 -7 -210 -141 119 206 41 12 105 -62 18 -43 271 -112 -56 5 73 234 40 19 155 -274 242
3963 242 -73 60 134 214 158 -317 99 -103 -46 -149 1 -59 -152 7 133 -212 112 -363 -4 -331 243 116
3985 116 -21 -184 15 279 0 -306 302 -16 -145 214 165 155 101 -113 6 -172 -187 -186 93 -103 -60 12 14
4008 14 42 235 185 -281 -143 -75 215 -58 -132 67 -9 -191 247 70 -52 129 -2 -125 106 0 6 -157 38
4031C8j2k28K03M3M9j15lr2J06Lk71K35j36L54l8j33R9J8k31K3oN97n94R9j40
4056a32L87o67M82J61l50r0o2J59K67j71k31M12l86M47j21k9p5L05l19J56q7L62
4078D18k36k29J27q8j42p9N06k00k4K10q8l71j37L57k33K03K8J90l5p1j09K09
4100B06j10o9J39j35j64J07K33l33J28j08q1j6p5N50m05P5R6J32k04Q1M3p7k43
4123b30K36K2j30J27J23k62n5M76l36j68q4N69k44kJ1K29m33MK49j85j69o3L02
4146a3N2k32N5K23k26N0J45m8P5k49M58l23j45L35m26m6L4K93J66J9K60k73J26
4169C10m38K66Qk55J89M9m31J61P4K04k66P2K20j03n27N70%k16K28M6Pk81L24
4192B11j45l54R1L01P6k71r1L14l3n6n0j32R9J38k10L49l51L05n1k70J24R3J7
$$ plain form
4031 38 26 -202 1 44 93 -22 -25 -117 -11 -8 -279 -44 -180 174 136 3 102 120 -111 -88 -94 503 -91 8 -132
4056 -132 255 -412 70 231 -119 -209 -271 -112 155 -16 -247 165 -221 226 105 76 1 306 -13 143 56 418
4078 418 182 -47 80 -8 -150 -229 277 77 53 263 175 -196 -333 24 -209 -6 22 212 177 106 -3 206
4100 206 96 27 166 31 -133 -26 207 -126 2 -106 -187 -203 -278 272 -133 -58 38 170 -34 47 90 13 -230
4123 -230 6 28 -102 25 148 -114 -169 307 -29 -197 -281 288 44 42 53 282 -151 -147 102 -83 -252 -315 -13
4146 -13 39 -193 -138 85 -141 -91 54 6 81 -168 290 -33 -178 157 -269 -315 -281 12 178 197 457 184 310
4169 310 -128 138 146 -109 80 129 -302 -141 -67 137 -129 -57 163 60 -467 103 103 -113 115 161 168 -113 211
4192 211 66 -288 -197 104 180 -91 -182 132 99 43 -7 -139 -40 98 -112 237 -114 191 140 -130 -6 87 104
4215A04l93L43l8q8l0J32n1q2J47k42R8j67L97J46k91k0R0N0l57L02K68j37k49
4238f8J41q7k38K12R3j61o0O2J55J1k87L52J38m03J27L4q9K11l02J03r8J99j47
4261a02O4j7j06k4j99L58J80k35k47M27k44p1J23M83o36K66J06J2P0l19M15m24
4283a20J8j2L16p56M41%k2J27j62J09K12r2j61J50j94K73l92J57N00k24j19K73
4305C22k38M4M8j39j52J1m5J68J87m40J54k5N1M8rJj46J05J64j12K4J57j54m0
4329a6K35k65L52k37q5j54K26j79K87l30K59J6J30j0k50Q5j74J40J58j17J93j65
4351I9J1r4k17L85j33m0j13l3j97L78k37m7J73K27N6P9l92L61k26m16O31l32j47
4374b24J46M12n59L2J83R0j27j44J92J40l3k7P3m84M88j68P9J3q4k5q2J60j98
$$ plain form
4215 104 -289 54 16 -72 -102 30 -21 -103 44 -198 -100 -267 130 276 -15 -35 55 105 -252 50 318 181 -68
4238 -68 73 -14 -252 -40 53 -108 -168 -106 49 60 -227 125 263 -140 -13 21 -68 143 -159 -56 -154 45 -102
4261 -102 -38 -55 -161 -185 -384 -26 154 -81 -328 99 -145 -216 -93 390 -246 20 126 138 208 -111 304 -120
4283 -120 -102 -114 202 -554 -113 -113 -135 -8 -170 -61 151 59 -102 48 -146 127 -265 -108 392 168 49 322
4305 322 84 128 176 37 -115 -104 -149 19 206 -234 -80 -105 -54 -6 -15 -14 -160 -55 109 -3 21 178 24 -16
4329 -16 219 -46 306 69 -16 -170 56 -123 164 -166 93 109 239 229 -21 64 -110 30 188 71 264 99
4351 99 110 16 -201 184 51 11 -102 -135 -332 46 -191 -238 -65 162 218 297 -95 266 40 -376 255 -77 -224
4374 -224 -78 334 -225 -193 -10 80 -47 -191 1 141 108 81 154 -330 158 -10 69 82 -2 -27 -109 51 -147
4397a47K37J18p1l11J61l6K5Q8J43k22j52L57j52N0K48k31J08l32K94M7k85J01
4419C8K6jk34L37j34J21j8j96j05j7J86qo8L6K24l97J37m3J84p7p1J58N8l1k22
4444a17J96q5j17L2K50l66L30m03L01J46K1j85j00K65k81J65n5m9l6J15q6p9r1
4467b29Q2k05K31j27M39k11P6j77J63KJ01j84L45j96p0J17K53p40Q3J06J71k36
4489b06k3r9L26L6p7L62o66L30J27p0O2j26M6l4J99j32j91j6M1O8J58j24j20l4
4513a63N6n1J81j75P1J07k72K84p8K19k50K2k38M80l55K13k62L51k02K92J78n13
4535a05j50J95j3p4J79J70j84l7L3N3l5p7K5P3j46K86j32k90K38J51j12k29P9
4558a02K01j80k61J80O6J53k36N25l27j69Q5J64m0K32j53q8k74L04k43K99j73
$$ plain form
4397 -147 90 208 137 -174 -13 -49 -24 64 207 -15 -167 190 38 88 336 105 213 -119 175 222 -63 38
4419 38 64 63 -171 166 32 153 135 -61 -166 -183 3 -5 -73 -37 187 -210 -73 -116 68 -9 -80 78 136 105 -117
4444 -117 79 -6 -123 -91 159 -207 123 -280 21 167 188 3 -97 168 -113 52 -3 -52 -88 27 -59 -138 -229
4467 -229 -147 -352 -121 -248 191 -20 56 -121 42 44 145 -39 306 110 40 157 410 -330 -247 -141 30 -206
4489 -206 -229 -328 -2 34 -43 319 -347 -17 110 40 102 -24 22 -12 187 55 -136 -152 -111 -43 115 -9 -129 -163
4513 -163 -107 -158 23 -152 -81 26 -246 38 -40 179 -71 -49 -287 193 -162 51 -211 140 -62 230 408 -105
4535 -105 -255 -60 -73 -147 32 202 18 -19 14 67 32 -45 -20 53 -93 193 61 -229 9 160 48 -181 -102
4558 -102 99 -81 -342 -162 -96 57 -179 346 19 -150 -65 99 59 291 138 50 -224 80 -163 136 -37
4579c7k9m0J31P6l37K31j08K13l5j61L40j94L8n7p7J67j67RJ21k9j77K6K61m57
4603b92J07J26k17j5J08L1qJ91Q8j91j29L87k1k14k28K15P9N7j91L73j75j51p7
4626a47K34k56O7J16O9k22J54J85j39m5m0oj23j10L18L4j71r3K26O6j33P5J22
4649A81l30j6M31l51J3M27q8j22k34r4K93j18K35j4l96J08J69k10K04k70J82j19
4671a19N3L13k19R1l25L32k2k91J10J80l01k9J85K04O2q4j51K9k35K75l48J00
4693a90M06k88J12o7r8L07j21n1j77K51K5j68r5l9J85k06K80k6j19N4k73K48K4
4716b6l17K79rM8M4n9K1Q8n9J04l22L0Q1k4J32P3m3l9K2n9r0K53j07j14N9J74
4742A40j26qQ2J14m72L47k2k81M20k66O1J40j04J10n9j02O9J12k20L0R8q6O7l2
$$ plain form
4579 -37 -66 -106 25 101 -236 -5 -113 100 65 -96 244 50 88 31 -46 121 -46 -37 84 55 -122 -96 165 -292
4603 -292 -185 -59 -276 -291 -183 -152 -160 31 119 -72 -201 186 165 -49 -277 -62 17 74 -117 256 81 -70 -147
4626 -147 87 -169 -102 14 83 -139 15 200 61 16 -24 -30 -153 -263 55 89 -82 -175 51 117 -16 59 181
4649 181 -149 -165 266 -85 -72 355 267 145 -89 -183 110 -8 227 213 -183 -75 94 -116 88 -182 0 -119
4671 -119 -66 247 28 119 -206 126 104 -187 -77 103 -198 -227 -42 162 224 140 -11 18 -217 58 -290 -190
4693 -190 216 -72 40 -27 -125 182 61 10 -167 84 109 -59 -154 -193 -8 -214 66 40 -79 -25 -298 -50 -26
4716 -26 -343 -64 -73 -25 19 -40 -19 69 10 114 -208 -178 -97 -121 11 84 41 2 24 -35 -125 128 21 -93 -34 140
4742 140 14 6 88 202 -270 77 55 -226 194 -72 -11 129 25 135 76 -26 43 155 -65 -35 63 -23 44 12
4766A2j77N3j7J47j18J13p4K25k43J27J86n88L5K95j75N6O9l9J26m3jQj30J9j1
4791a45O0K95J29k64j00k2k23L05O4j23J09j15J98j18m2J72m61K46M25k83j15
4812hJ81L0r7j6l34K27K20j53J68n9n5k38K43k93K06J05k53K06j27J75p7Q3K0
4835A54k26J93J12J10k67L06k65k27l1nJ60j20J13m5L8o8qk74L66k09J95l1l2
4858f1n0n7l0J40O5j9J49J1k11Q3j66J79k4o6nK22j57l17L30J21m05K91J15k76
4882a38M85k87j69j38L99l35J84N6k27K61k82L45m09K18N8j99M8L84j83J6K2j05
4904Dl30J79M1P6n1l2K65l55P8Q7l61K80K39p1j33J50Q1k16P8j42R6K12j87O0
4928D8k04K85k31J18l6j77rJ35J26j17J44j71J09R5j87J36R3k04K60n01K33O2
$$ plain form
4766 12 -165 -112 -129 18 -100 13 -61 164 -79 48 234 -354 -319 -24 -199 -143 -74 -113 13 -30 -31 -23 -153 -134 -145
4791 -145 -85 210 339 75 -25 -47 -270 35 99 -24 85 -30 168 50 8 180 -281 -35 390 107 -8
4812 -8 173 203 106 90 -244 -17 203 50 218 159 104 -134 109 -184 22 127 -126 80 -47 128 51 134 154
4835 154 -72 121 233 343 76 382 117 -110 -141 -146 14 -106 7 -38 0 -68 -76 -350 16 -193 2 -29 -61
4858 -61 -111 -168 -198 -58 7 -12 137 148 -63 20 -146 33 9 -57 -62 160 3 -314 16 137 -268 23 138 -138
4882 -138 347 60 -109 -247 152 -183 1 57 -170 91 -191 154 -255 -37 21 -178 -130 254 71 87 109 4
4904 4 -326 -147 -106 -30 -81 -113 152 -203 -125 -38 -399 -119 120 49 -84 66 147 -69 9 -133 -37 175 -12 48
4928 48 -156 129 -102 16 -20 -197 -206 -71 55 -62 82 -89 20 115 -72 64 157 -47 213 -288 -55 7
4950GJ20k02p0J71O1r0mL0j84L19k14p6J02j10K58k81k7J80j58O0n9K82k16JN09
4975D09m41j14P4Q5k83M20q5j34J05k26K22j98K32j13O4R6j48J10l52L40k24K42
4997H1j59J78O0l60L34l01K99k55M23l28M20k18j39J61j60J58J0l34P0M2N1p4
5019d1P0J56j86oN6J08k57n9K20j15k80L01P5l28M94j12k11J39j49K15J94n1k45
5042a2j59J8Q8K53k30K3J50k19n2j3L88l89J04m8K4Q5%K1J06k05K4J69k74Q0K44
5067A76j37k63K93J23l03J16j32l4L93k45J40k37jk0K20J37j31l09L58k1j01M4
5089F6J36j58p6m0m4J66j39J21j22K25j30M8k61K72r3k44J72L9o2Jj05L25m9J63
5113B11l70K75m38J57K78k17J05J02q5J25p3k98P3p5K68p8J0j0m8M6RJ3m18M49
$$ plain form
4950 7 127 -75 -145 26 87 -3 -7 23 -161 158 -56 -132 -30 -140 118 -163 -190 -10 -168 -108 -167 115 -101 -100 409
4975 409 -32 -146 -72 13 -270 150 65 -69 36 -190 32 -166 66 -47 17 113 -35 75 -277 63 -161 81
4997 81 -78 100 160 -200 134 -167 132 -123 300 -28 392 174 35 196 36 194 204 -130 -60 -18 33 -41
5019 -41 29 185 -1 -7 49 157 -100 -159 61 -54 -334 -33 42 -286 208 96 -115 24 -125 90 284 233 -12
5042 -12 -171 -153 -65 188 -42 -19 131 -88 -140 -153 235 -154 -50 -98 -74 11 11 32 138 -67 -43 126 -148 -68 176
5067 176 39 -224 69 192 -111 5 -127 -161 232 -13 127 -110 -111 -131 89 226 95 -214 144 123 22 66
5089 66 202 44 -32 -72 -116 50 -89 32 -90 135 5 53 -208 64 -29 -273 -101 -62 -124 -123 -228 97 48 211
5113 211 -159 116 -322 -165 113 -104 1 103 18 143 70 -228 -155 -230 38 -40 -30 -40 -88 -42 -33 -20 -438 11
5137A1j15j19L20j19r8J0L40q1k70j58L55j21P4K53l86R1r4O8J50j53j23K5m9
5160a89l1J12n7J71q8N9N2j8oL40l06k40Q1J80j23p1K32o8j36r5l0k1L18p1l10
5185c15J30nr6L25N5L2k84K36k87K57J32j11J63k27k32L61j03j0J74j20j72J71
5207G4P6j78l2J60N6l00M1M4j92K5L57j44K10o15L19r4L41j07j7J30j73J07j6
5230G2k16j58M19K22n40J79J26j77L9p7L32M9k99k0r2k2N1O9M3K71l54K05J46
5253B68n96L90M2j85J85p4J54k49M2j17N01m60L28j16K2q3k34K86K3m3r2J80j20
5276E2j17j18J84j95L71j83k40J42K70k51R2%o8K44l12K50k87K48j01j65K99J66
5298B81k01r3k16N64m66J00J05j82q8J04L46l83J03K29j82N7O6k40K87j12j01
$$ plain form
5137 11 -104 -223 97 -22 -120 -110 230 149 -121 -279 76 -45 29 282 -104 -13 -107 -39 111 -42 -165 -140 -189
5160 -189 -220 -108 -165 6 -82 -23 29 11 5 345 39 -201 -120 60 -63 -134 98 30 -106 -201 -231 -252 66 -5 -315
5185 -315 -185 -190 -286 39 94 126 -158 78 -209 48 180 69 232 5 -227 134 31 21 195 75 -97 74
5207 74 150 -28 -60 100 156 -144 -103 -59 -251 -226 131 -13 197 -418 -99 -193 148 41 24 154 -19 88 72
5230 72 -144 -302 117 339 -201 -22 104 -73 -34 -111 221 270 -29 -49 -141 -163 -112 -43 0 271 -83 122 268
5253 268 -328 62 104 -81 104 30 184 -65 -23 -140 361 -99 229 113 135 52 -182 104 127 84 -8 172 52
5276 52 -65 -183 1 -194 177 -6 -246 -104 166 -85 7 7 -61 183 -129 121 -166 82 -19 -184 115 281
5298 281 80 -13 -229 335 -131 -31 74 -108 -196 -92 254 -129 -26 203 21 78 144 -96 191 79 -22
5319b2j60Q2K36j83k14L56j2r6J0j79O2M1K22l10O8J60q4j51J73K8q1L5LO0M8
5344I2m36M07J4k73L27k66K18k57J4O4K49j39o9j83M06J73k59L0p4k4R3L2j67
5367b8K42k30j00J63M1j58m8K50n9k22P2O7R3l7m0K31j74j13K89l93j26N12j41
5390I1j10l0L44m12K58l41R4n0J37M1j80J35P4j80L44l11J98q5m0l5K35m7j32
5413bJ88j77J46j06K06rk35k74K76K01J13p6k79K23j62O7j68K9j06Q2j34R7M02
5436C02k69m4M1j53MM6K9K28l58K75l17K58k40Q5J69k91L18j38J61j22K45j98
5458C1m6n1m2Q8J1N6j71J94J2L00l82J10j24k63R8K06RJ2j56n6N7K32j89Q0q7
5483g1J46M9j00p9J75K7k62J22K18l35J19O0R6k32J30O1k34l5Kk1J19O0p1Q3P7
$$ plain form
5319 -22 -182 -100 136 -47 -261 95 83 -13 -3 -182 -120 -79 143 -167 -99 61 -23 -174 -1 27 -54 -19 -16 44 92
5344 92 -344 63 77 -196 131 -135 83 -174 -160 -96 153 14 -55 -238 168 341 82 112 38 14 107 139 -28
5367 -28 214 -16 -116 47 88 -70 -118 132 73 -149 -77 -10 83 46 6 237 63 -50 239 -154 -280 232 91
5390 91 -19 -49 295 -117 141 -200 -106 -156 -19 22 -158 -23 51 -129 215 -96 102 17 -23 -58 177 130 -2
5413 -2 186 9 155 49 255 246 11 -263 13 214 327 251 -28 195 33 100 -68 -39 -145 -63 -197 -100 302
5436 302 33 -11 30 -123 -119 -73 -44 184 -174 101 -216 42 -198 -113 56 -235 83 -55 106 -16 229 31
5458 31 -15 -66 -108 -20 -9 47 -124 70 82 382 0 110 -14 -277 -179 27 36 48 -108 -164 -107 125 -64 16 -71
5483 -71 75 124 24 -55 120 147 -115 7 225 -110 9 69 165 -67 63 124 -110 -145 -143 -164 -45 15 -56 27 104
5508A04k30j44K35N4k65J31J20O2o2K0j16J93L0l39K96k00Pn5L76k97k57M60J07
5531B30k84o3L23J46l92R4j68K26k21K41q1Rq0r4nJ99J55o8k7r3J31l8j19K2k04
5556a61J67Q7K9l3j25j49J5J57o5L53k62M5j39K23nl94L18l76M12k32K2K37o3
5579F1j16N9j15n8R6J07j60M5p8K69m4r3j21O9R5M3k21J65J8J08o1j63j51K5M20
5604A99k23J62l39L4O3K10j20J27K8m90J54K15q1L44l29M5j14J31J3l63L80K4
5626G0Q8l3l02K04j32J31J48p7j50j66o0J26J0J27p2L4j54K23j30Q1O2O7j75R9
5650A9O6l7k05M86o73N08j27q7K9k17Q7K41l30k8J36J78j99N8p3K74o3P5k00J5
5674f7j61M01j89j22L10k41J27j24J11l4J01o7N5j4M0R7j43j29L8M5J53r0r1j20
$$ plain form
5508 104 -126 -270 -35 19 -246 -115 5 67 5 25 -91 102 132 -207 89 -111 -104 -159 217 -80 -337 123 230
5531 230 -54 -117 206 352 -40 54 -114 112 -109 132 51 60 -20 -114 -119 80 235 167 140 47 178 140 21 43 -161
5556 -161 6 93 122 89 -36 -185 -170 -13 -78 275 13 58 -81 142 137 -257 61 -315 97 -135 -113 124 61
5579 61 -55 4 -111 -169 -73 34 -126 -81 -159 110 66 -27 -148 -79 16 59 -162 3 21 129 68 -95 -246 -221 199
5604 199 -24 138 -201 -167 -104 106 -14 113 141 -349 -195 20 -61 283 -46 -1 -115 16 29 -334 46 70
5626 70 158 125 -177 27 -105 26 174 97 -53 -219 -279 -153 -143 -16 -88 -54 -208 15 -115 -34 28 95 -80 19
5650 19 85 48 -157 329 -344 164 37 -50 -21 -238 -151 90 -240 -268 -132 46 -153 -95 -168 106 43 118 -82 -67
5674 -67 -228 173 -16 -138 172 -69 58 -66 45 11 112 45 100 86 126 223 80 -49 -11 34 187 97 6 -114
5698a14J43j11kJ56j77J47K4%NJ42m00J07R5L3Q5k67K60p5J66k26R4k92K19l23
5722c11M63l29k2J02J41P6L0j81k55K89J3R3J4r2j61KJ31l0m2J38l3j64K50k13
5746i1Q3M3j3j62K52O8J04k36k9l0k33K39K00l18K92k21p2J65k4J25%J7k43m5
5770a29K08j63L7K03J29l32Q4l51J69M9N4J41o4J39l24R2L7mJ8J12q7o6N26p04
5794b26L4J54Q8J81m21K18J23k55M22k06J03k74J45l2K43m47J07O6J1j49J35K65
5816B85k62O3l3n1j6N4J53p7m51L23K84j88J92j70l13K16l65L79J1mk91L08l5
5839A2K3m7P8k29L39l5m08M81O0p3j77J23J9o6l14L41k21j64l8M52n96M12K24
5862A96k44R5j00L20j72j45K30m33K57N9j06K6j58L08r1k05J20j35L04J3l17J60
$$ plain form
5698 -114 29 -82 -84 72 -105 42 66 66 71 213 -187 -80 15 48 133 -134 126 51 217 -9 85 -207 12 -311
5722 -311 152 -177 -199 -97 44 120 150 -31 -286 3 16 109 123 31 -130 -128 3 -27 -69 69 36 -128 122 -91
5746 -91 -8 35 22 -140 112 180 284 48 19 -11 -244 -5 195 -123 169 -52 -124 41 17 142 142 159 -84 -129
5770 -129 79 -84 -47 156 285 -47 37 -314 -145 -96 -42 99 35 174 -150 -58 -21 -25 -7 105 18 -48 478 -226
5794 -226 -192 -38 50 231 -190 28 151 -104 318 112 215 -59 86 54 297 -150 -43 23 34 -115 20 285
5816 285 23 86 53 2 -14 40 193 116 -335 -12 272 84 276 106 -207 9 -356 23 34 30 -261 47 12
5839 12 35 -12 66 -163 176 141 -267 214 274 201 24 147 166 100 -214 127 -94 -258 -296 156 -440 -28 196
5862 196 -48 47 -53 267 95 -50 180 -253 4 63 -43 -17 -175 133 42 -163 -43 -178 126 139 -178 -18
5884a8k44M96j22j65N5Q9j23J49l76M14l22K13o2J90o4j40lN7Q7j73Q0k55R1R2
5908e4k01K79n5j47J2l8K78p8O6k86J73Q4J67J20n15L24k12j3J69K8j37J9j4P4
5932D3k03K6L08l33J08L83m23j83M84k37L36l94k35K65L7PM9J66l3k05j41K99
5954A24k05M39m04M9J99l37N3j7Q6qk52L00R5j8r7l33M90P1k94M9j32J09l98L51
5978h0N4j04J07O0j69J39K24k38n6J98m97K95J11L0K5km1q5J37j01mK0K61l87
6002a03k2K04j66N23m75j2l5Q6J33q2L10m61kK84n00M4L43k52j79M10p4J84k56
6025i8O4m29M74j67J82Rj21R6k22J0J02J88Qk40J08J74j14J60Q4j88Lk57KJ3J18
6050d1j04K68%k00k36Q4J53p9L78L9k78N7o3Q6o4L8j5l7K93n2n7J5l24K01O3k57
$$ plain form
5884 -18 -262 234 112 -53 2 91 -32 117 -259 155 -167 46 -16 174 110 -30 -33 24 111 -62 18 -237 -146 -54
5908 -54 -255 24 -31 -178 -166 -204 74 -4 62 -224 -51 33 200 320 -195 129 -83 -96 73 101 -36 -17 -31 43
5932 43 -160 -134 174 -159 -51 332 -91 -274 210 -27 309 -85 -320 -55 -18 -11 38 204 171 -34 -175 124
5954 124 -81 358 -46 3 202 -135 -82 -99 -13 -21 -273 27 122 104 7 -326 164 235 -59 -10 -142 -33 -431 -80
5978 -80 -26 -130 -23 37 -132 7 231 -7 -63 135 -362 -67 44 74 99 97 56 -29 108 7 3 23 284 -103
6002 -103 -125 79 -87 436 -39 -51 -86 0 133 51 361 -100 -102 182 -318 -274 69 -183 -362 48 -26 158 -98
6025 -98 -34 -463 11 -156 26 35 -86 10 -212 -202 -100 88 96 -144 -36 138 24 184 268 80 83 -174 -172 -159 -41
6050 -41 -145 123 123 -77 -313 -229 -76 -155 223 262 -16 41 -22 64 0 38 23 -14 279 227 170 185 -139 62 125 -132
6076a32J20M7j2M7j54J04K56k90M9K68j72k08l4J00J45k23K09j97L18k06J60m62
6098b67K45J84j16l03K09qJ5k6L7J9J13K9n64L50J79N3j98o2M59l68m8J30j03
6121d1J88k13P5J26k48j72M00J09k95l1K31k90L12k1L6k70K24k06J4j06J7K67
6143A06k24M04l52k06J95K95j36j77PR6p2j13K01j04J62N7j84k35L41k92L10p9
6165@P2R6m26L50n0j33o6K83m78M46l17K03n3J16l16J86k3K46j88J08PK92l68
6188a3J28j97kQJ39l47K95M1Jk53L54j49j22J00j46K03K2j28NK52l37N34l98J74
6212A64j33j93K43j18j86K20J09k50J82J01q7j87MJ35J29O0j82j23K37o5j47J67
6234H0JJ91k90jrp9j60L15O7k55J00R0n3N0j73L12m23q4N52j95j09R0K28k84M4
$$ plain form
6076 -132 -12 35 23 70 -84 20 276 -14 35 303 131 -77 -111 -11 134 -89 120 -77 241 35 195 -267
6098 -267 -22 162 46 -257 -48 -56 -41 -67 -30 -11 102 131 -433 -83 96 149 -49 -111 348 -20 -68 62 -41
6121 -41 147 -66 9 135 -113 -285 115 224 -71 -102 129 -161 151 130 166 -104 120 -86 -72 -178 -161 106
6143 106 -118 286 -66 -272 -77 218 82 -95 -88 8 -64 -177 24 -80 82 139 -45 -280 61 -231 79 0
6165 0 72 168 -258 92 42 -91 -157 126 -352 94 -223 -20 -73 43 -273 -87 -110 136 -52 56 63 355 -13
6188 -13 115 -82 -84 -76 63 -284 11 52 53 -200 154 5 -117 -17 -163 40 62 -66 -61 191 -146 388 -10 164
6212 164 31 -162 81 -37 -223 -3 106 -144 38 139 52 -135 -131 4 133 193 11 -112 125 60 -87 80
6234 80 81 272 -18 -19 -28 -107 -267 48 115 -140 -40 50 -3 47 -126 186 -237 -321 231 36 -73 17 245 -39 5
6259Eo4k05K85r1K1L40k18k36J96J72kJk3j05j10J78lj27l5K2O7m4j00J86Q9q9
6285A10k73L59j37j97K51k01J23j54J60J87l60J32N3j15q5J07J83n9r8o8l9Qk3
6308a36K94k16l73M32j72j02K95J60k0n27M32q5j15N20n01K28r5L01k72O5k60
6329a47J52q8J44k95J23J15o3j71L67j00k82L10L75n78p9L48l07L68l57K68j52
6350d9J09k73J34k72K90L8K66l71L07k05K2J2J14kj53J36j30j58r8L25o2n3j75
6373b48L75j52K04k58P8K6J83j43j6K2j70L29q2l59K29j00r1L38j76r4K69l5O2
6396A91j38m61L83o3k7L0N6L8j96p3M47j73J08j0j69q3p4L05ok12Q9j3J70j03
6420A6o9q2L88j59J01n38L57Kj55M89j83o3j92k45J43J75L6m9j62J54K43j35J8
$$ plain form
6259 5 -59 -264 21 -70 -49 291 73 -163 33 205 203 204 181 76 -34 144 141 14 -21 1 68 24 -76 110 199 110
6285 110 -163 196 59 -138 113 -88 35 -119 41 228 -132 0 53 -62 -147 -40 143 84 -14 -82 -121 -113 -136
6308 -136 158 -58 -431 1 -171 -273 22 182 162 -365 67 -18 -133 387 -114 114 19 320 48 113 -147
6329 -147 5 -83 61 -234 -111 4 -59 -230 137 37 -245 65 440 -138 -217 131 -176 192 -165 103 -49
6350 -49 60 -213 -79 -351 -61 -23 243 -128 179 -26 -4 8 122 120 -33 103 -27 -185 -283 42 -20 -73 -248
6373 -248 127 -25 179 -79 -1 25 208 65 49 71 -99 230 148 -211 18 -82 -173 165 -11 -105 164 129 191
6396 191 53 -408 -25 -88 -115 -85 -29 9 -187 -260 187 14 122 112 -57 -140 -214 91 85 -127 -38 -51 119 16
6420 16 -53 -135 253 94 195 -343 14 16 -139 350 167 104 -88 -333 -190 -15 21 -28 -190 -36 207 72 90
6443I0K38n90K92j54J31J38q3k16K89l2k37L10j04j38P3O1l7j9L6k39J08J0K7
6466d6p1J68M0o8k1N0N6l04J92K4J43l66K28q7p2k69M02K84k29o7J73l23J42j31
6490a52L23k69j79L39j41K94p2l10J44J78k88Q8J31r7M6L7ln0L73m15n3K66k82
6513i2J00k7K9J46r4N1j27r9O7J37qk21K82J07m07L16J28m53j36K82J65l65J08
6536a11M25m47K5J72j05N8J43j74N8p8l4J84p7l2m8N0k5K54k76j03l0m5L60p3
6560G1k75J21j7L19l13K51N2P9l33J90j74J69m6l37K42n8N0J7m2QJ07k27M80n33
6584a99Q6J95J68k78J6j5j56L92j41j16K3j15K54J18l70K50j22k68K74mj92M31
6606B31k23J9N4j52p3N8J30K38k50Q1k0k20K2p2J20K42j08J52k78K29l21L42j12
$$ plain form
6443 90 328 -262 30 -124 7 145 62 -154 135 103 -134 176 72 -66 7 68 31 12 48 -191 -83 -73 -46
6466 -46 -117 51 91 23 2 52 108 -196 -4 20 163 -203 25 -62 -134 -403 -1 283 54 -13 160 -163 -21 -152
6490 -152 171 -98 -277 62 -79 215 143 -167 -23 155 -133 -45 86 -11 35 72 69 19 392 -23 -76 190 -92
6513 -92 8 -19 10 156 62 113 -14 -113 -46 91 83 -138 144 251 -156 160 288 -165 -301 -19 146 -219 -111
6536 -111 314 -133 -108 64 -41 17 160 -14 44 -34 -68 116 39 7 -41 9 -16 238 -38 -141 -171 -216 144 71
6560 71 -204 -83 -100 219 -94 157 209 288 -45 145 -29 140 94 -243 -1 -59 -9 8 -34 -26 81 -146 334 -199
6584 -199 -113 82 250 -28 -12 -27 -183 209 68 -48 -25 -140 114 232 -138 112 -10 -278 -4 -8 -200 231
6606 231 8 27 81 -71 -144 -86 44 282 32 113 93 -127 -105 -177 -57 185 77 229 -49 180 -141 201 89
6629H9j58J10n2J65j01o0J35k45NJ34K31q8K8k23j06J16j70L22qK6j40K75l81
6652i6PR1j49J71N9J57l77J33N4j74K14m5k6n9J10k14j8P7J15N3k00K47k7o1p3
6677c1K08k27J36K31m31J56k6k11L3M39l14J90L7k65r7Nm9J97j21L67j90k8J40
6700A49j00k3o3k64L20J68p4m4k14K12l69M35p1j78K73l65J94k98L31k25L37q1
6722E0N6l58J42J47n6J59l71L13N2m8k26M91m42J25o5l2J38K32l66l5J86j17q
6745c3j45K24J9m1n9P9o8o4J01Q3j45K45p8o9L14k56l01L20k86K74k32p1M48n30
6769b71q5M85J02q3k18J84j9n3j3P3N6k20Q4j70K48j2l06L20l01o7L69J78l75
6792i4K34O5k93J00j30J80M1j48J21O9k20J07J5j86%R5J55j1%q4o0J67k99K59
$$ plain form
6629 89 -69 41 -11 154 53 -7 128 -117 -112 22 253 165 193 -30 -136 -20 -190 132 124 150 10 285 -96
6652 -96 -89 2 -147 24 83 240 -137 -4 50 -124 90 45 19 -40 70 -144 -162 -85 30 83 -117 130 103 42 -31
6677 -31 177 -50 86 317 -114 42 16 -195 -162 277 -37 153 190 -75 -172 -167 -216 -19 -140 227 37 9 149
6700 149 49 26 -37 -301 19 187 113 69 -145 67 -302 133 62 -116 157 -208 -14 -312 19 -206 131 50
6722 50 106 -252 -110 37 -19 140 -231 82 134 86 -140 351 -91 34 -31 -63 75 307 -59 -94 92 -25 -33
6745 -33 -178 46 65 24 -35 44 -24 -88 13 96 -49 196 118 49 363 107 -194 126 -160 114 -118 -189 259 -271
6769 -271 -356 129 231 148 -70 114 95 42 29 102 158 -62 22 -148 100 88 -218 102 -199 -266 103 281 -94
6792 -94 140 205 -88 12 -118 62 103 -45 76 145 -75 32 47 -139 -139 -44 111 100 100 16 -44 123 -176 83
6816H3j33NL9L77l81p4k86K02K62k68J14L21l38k9j9n0K95n4j64q3K78N4j11M1
6840H1k48N24M8n43l1J7J56L5K67j66l85M58o0j42J89j14Q9nj02M0k44L31k58
6863f3p8n5J90j82J56kJ18l37PM02m31K15J5M6j08J43M32o43L9J87K7J26l80O0
6887a16K17k97K66J43k17m0O9o3q9J9K69k6k00R8j85L84m36K68n4l4N0M2m5j02
6911g9l2O6R1K46m87J02K6K8m8R9nJ0j8J89n82M37J44j99K2J40j20j18J08k7j78
6936a85M33p0m4k01q9Q3J77k21M65k71O6j93NJ45k65J98Q4l2m1P6p9J31j37J45
6960A80q5j74j33L89k53o3J32k10n0M58K5m1k39l8K9N0J52l12R3J95l20N08n03
6983b10K4KJ80J6j37Q6j00K17j40J14j89K93k56J25m9J16j82L27k30J53j96N0
$$ plain form
6816 83 -50 -45 -6 371 -10 -84 -370 -168 94 -174 -60 261 -77 -106 -125 -175 120 66 -98 -181 97 151 40 81
6840 81 -167 357 405 -138 -169 -152 4 39 306 140 -245 213 153 11 200 86 175 170 68 108 -136 195 -63
6863 -63 -141 -196 -6 -188 -32 -34 84 -253 -246 156 -275 -60 -45 1 -107 36 468 -175 -136 51 78 204 -176 -116
6887 -116 101 -196 70 213 -4 -44 25 -38 -127 -108 161 135 -65 33 -152 232 -204 64 10 -24 26 68 23 -79
6911 -79 -111 -45 46 292 -195 -93 -67 -39 -87 12 7 17 -1 188 -394 43 187 -12 10 150 30 -88 20 -7 -185
6936 -185 248 178 134 -67 -156 -73 104 -117 348 77 143 -50 -45 100 -165 33 117 85 44 120 41 172 35 180
6960 180 95 -79 -212 177 -76 -139 -7 -217 -267 191 216 175 -64 -102 -73 -23 129 -183 -90 105 -215 293 -210
6983 -210 -186 -184 -4 12 -125 -39 -139 78 -62 52 -137 156 -100 25 -24 92 -90 237 7 160 -36 14
7005A4o7J9k22J02L23l63J90J88l28J05l6j9k9P6P4r3o4N6J90N6k56L29o9l87
7029b11J06K89k32K04j53m9J00P4l22K96p9k94K49j7j42J95l8J61J65l38L5r4
7051i5l3R5K46k61M9P5k1j24L25l09j3K00q0p0O5O1o2J22j05O1k39J59j35M7J7
7076b5J36k2k67j7N8M30j88k43L16k88L59j68j70j67J41K17j61j22J92j33lN9
7098f6R4q8J53j20J11k27J23R0J35j64j14Q4j43K68l49L28Nj85k58K09K14J04
7120B04j25P6j75q0J17j20J57k78M0N1M0rk8K93k3l87K25j49O1Q7O4k8j59%M18
7145B72m40K29j36O2k31J60J73J2K06k81k83K18P4k11kK94k29J1K50Km09Q8J26
7168d5m3N5J64j77n4J52n9K70m95O2K93j78j81K23M7k58M23k21J6k12J4P5k30
$$ plain form
7005 14 -53 -34 -256 -154 169 -194 -4 184 -144 -39 -75 -94 -123 -47 27 -66 -130 -74 116 172 -84 245 176 -211
7029 -211 -105 184 -48 156 3 -46 54 128 -194 102 23 -271 -22 -39 -181 14 -24 137 302 -36 -1 -95
7051 -95 -128 -33 213 -48 1 76 55 -69 256 -53 -66 134 54 -16 49 110 48 170 65 126 -113 46 -89 -42 -25
7076 -25 111 89 -178 -195 -137 293 105 -138 178 -110 249 81 -89 -256 -115 102 -59 -181 11 -122 -125 -66
7098 -66 28 -60 93 -27 84 -143 -20 70 205 41 -73 11 -132 136 -213 115 120 -65 -323 -114 100 204
7120 204 79 155 -20 -100 17 -103 54 -224 -184 -133 -93 -102 -130 163 140 -247 -22 -171 -110 -23 41 13 -146 -146 272
7145 272 -168 61 -75 -13 -244 -84 89 101 307 26 -257 -39 35 -176 -178 116 -113 -102 148 150 -259 -171 -45
7168 -45 -88 -33 131 -46 -100 52 -7 263 -232 -170 123 -55 -236 -13 34 -224 199 -22 -6 -218 -204 -129 -359
7191c59M83j56j74J1n2K72m5Q7R5l44j22L16R5Q5k79L32j78r3J98q3lp5O7J06
7215A84j80K10L8l46J57j55M15o6k28p2J91l8M0o6q2L6j3j68n2K94l08o4K90l8
7239b1J74l64P8N5J54j33j58J71J40l5j55j37J44m9J42P5M7k84o5K48j10O7J90
7262A74p9J03p4q1O9r0J2k07K36R2mj25J57k7j18O9j23Q3k6K01j40J00k16j24
7286a38K47j73J17n5m8K60k14J30k21k04J98n4Q0K33l3nk09J52K84m82J72K1j24
7309f6K71l50J86m06K34L06k25L57j65J6l98l5K49J42lR9O7j76N4nk53j11K42
7332C0j87O7L04j91J32q5j93N0K36k97J0K45j25Q4J92k22MJ21m15L02j52J89j42
7355d3k5n5J43j42M01o33J37K70N2k72Q1J09K2M1l7%P1m4J84j76l82K24M3j03
$$ plain form
7191 -359 124 -32 -206 -195 -247 25 -20 67 162 -182 -304 12 107 192 -87 245 67 -26 172 89 86 11 78 184
7215 184 4 214 252 -94 63 -92 323 257 29 -43 148 110 150 84 2 38 25 -143 -195 99 -209 -273 17 -21
7239 -21 153 -211 -133 -78 76 -57 -215 -44 96 61 -94 -231 -87 -136 6 81 128 -156 -221 27 -83 -16 174
7262 174 95 198 124 43 112 22 34 -173 63 155 151 26 183 156 38 107 -16 67 41 242 102 202 -14 -138
7286 -138 109 -64 53 -2 -50 210 -4 126 -95 -299 -101 -155 -75 158 125 120 -89 63 347 -135 37 58 -66
7309 -66 205 -145 41 -365 -131 175 -50 307 142 158 -240 -275 -26 116 113 212 279 103 157 152 -101 -212 30
7332 30 -157 -90 214 23 155 70 -123 -73 163 -134 -124 121 -4 80 272 50 54 175 -240 62 -90 99 -43
7355 -43 -68 -123 20 -122 279 -354 -217 53 105 -167 -86 23 45 86 49 49 120 76 260 84 -298 -74 -31 -134
7379a34J62j09J27pj32o5M3j0N7J75k10J23K15j48n4N0nk6j15m2j85J43j7L76
7403B12j99k37M9L79j65j36K91q9k46J91N1j43j3K01N3k17K49n1l27p6L38l9k04
7426a28J34R0Oj44n5k5O6J34p9n2q5J40J46k80N22j73n36M61k95K72Q9J11j53
7449A66j99j3lJ94j70l8J36J28l97K37q3O8r9O1K32k24J14N1J53l19J57k45P4
7472a9l9K2j6n3K51k24j03J21R2K0K2j44m0j40K18J44k16o6NK03J8j76L02j37
7496D5O5r4j90K79j68J93l37K0L81P7m43L59j00l54K66l9K47n81M88k57J00j00
7518a43L24k49K79j22j92L55l14R1l3P6k86M88l4j28j02k5K0n4l4l5NL38j87k31
7542a93K16Qj71N7N3K23k38j08K81j40l7r2L46k43oO5l8J02M0J00k86j00NJ02
$$ plain form
7379 -134 28 -81 46 39 -93 -158 -115 -125 -68 107 -103 20 235 87 33 83 78 52 -63 -105 -290 -147 -164 212
7403 212 13 -224 -175 204 39 -97 194 105 -141 50 101 -42 -55 146 199 -18 231 180 -147 -223 115 76 -128
7426 -128 6 96 102 -42 -97 -122 -56 78 -1 -53 -138 2 148 -132 390 217 -319 142 -153 119 208 319 166
7449 166 -33 -46 -49 145 -25 -63 73 201 -196 41 -42 26 -73 -12 220 -4 110 161 314 -5 152 -93 -19
7472 -19 -58 -36 -52 -105 146 -78 -181 -60 32 52 74 -70 -110 -250 -32 112 -104 -170 -165 38 56 -120 182 45
7496 45 110 16 -174 105 -63 130 -207 -187 194 271 -172 187 87 -267 -1 -40 207 -374 114 -143 -43 -143
7518 -143 181 -68 211 89 -103 252 -62 29 -4 72 -214 274 240 112 10 -15 5 -49 -83 -118 -113 225 38 -193
7542 -193 23 31 -140 -83 -30 193 -45 -153 128 -12 -49 -141 205 -38 -44 21 -17 85 125 225 -61 -161 -156 -54
7566e4j3Q0l2L3j6m46L79l7M6O5Q0j47O5J15j68k18K63O0k46L81p5j90k10rM07
7591A13l55L34jj44j21J14l0r0L19j25J82j88j13nK6K41j40k36P2J00K92k52O
7614aJ94j79k99L35M3k74N7K76k49J23j58J58j60J59n4O4k09L53k04j03J14k28
7636b42K14j21M11m53kQ9J9J32j37N9L80j25k51l7K87l72J63P6j17m02L53lJ0
7659f9N9j04n5K27k4lk37K19J24J3m62K55L0l5k6J05K37j15k80J50J42j40L2j79
7683a36L86j32J17r3l26l7J79J43j81J29l24M09k61j34M13j52n2J59j7k1q7J50
7705A32p5j61J04R5n9J89K4j85j43MK1K51l88L33k01K18k77J33J67j03J71o3l36
7728a49j81K58M3M4j45J89m8j62j01L13j24J71j3k65K89k89j57L38j99K56m34
$$ plain form
7566 -54 -67 13 -19 14 -2 -448 -69 -106 -60 5 85 -62 3 118 -50 -268 -5 55 -191 190 115 -75 -285 -294 113
7591 113 -242 92 91 -53 -174 -60 -90 -180 139 14 196 8 -105 -110 -84 157 17 -219 -147 -47 245 -7 -1
7614 -1 193 14 -285 50 93 -181 -124 152 -97 26 -132 26 -134 25 -29 35 -174 179 -25 -128 -14 -242
7636 -242 -28 -149 262 -191 -193 -104 -85 47 -90 -31 349 224 -27 -64 223 -149 14 90 -27 -429 -76 -79 -69
7659 -69 -10 -114 -169 58 34 31 -206 13 137 150 -312 -57 -27 -62 -88 17 254 139 -141 9 151 11 43 -136
7683 -136 250 118 235 142 -184 -221 -42 101 -80 49 -275 134 -127 -261 152 0 -52 107 90 69 -18 132
7705 132 57 -104 0 95 36 225 249 64 -79 -75 -54 197 -191 142 -59 159 -118 15 182 79 250 187 -149
7728 -149 -330 -72 -29 15 -130 59 11 -151 -252 61 -63 108 95 -170 119 -170 -327 11 -188 68 -366
7749c66N42p6j60o7j70O3L42j42k05M70n20L30n8K5Lj20J60O1j62L6J1K59o6j59
7773C1l1j80L22j59j77P9L04k25r9M2N1L1j4q7J88j73J62j87Q5J23J66k89K46
7796B09J9k66Q4j13K7J12K7q6j5j12J14J8r5J52l7q7l09L92j11N6j12j24J37j28
7820b48M4L44k57k7l3m3L49l03K51j04j05K69O2l85K63M0l07r0K27l82N37j42
7842d0J16J07k93J87J29n04J93j62L14J86l36Q4p1L05k31l8N3j29L23j21k11L44
7864B05j56j77Q0j0k46K85r5K26k62J51J80k5j26j7J5J7M4j04n0J48j08M3J04
7887A22k46j40J32J87l01K37l8j3L7l3J78j60j5p1L37l14J94j72J9J19J08k00
7909c3q8K20k13j23rL82j82m0K24n23P42n35J57j30L05k84J68j11j80N12l16P5
$$ plain form
7749 -366 176 100 -60 -127 -297 -234 108 -34 -239 231 -289 41 -17 8 11 -109 51 112 -50 -14 -3 256 190 31
7773 31 0 -180 142 -17 -194 -115 189 -36 -135 -93 -42 -11 -25 -112 76 -97 65 -122 -37 86 252 -37 209
7796 209 228 -38 46 -67 -40 72 99 13 -2 -114 0 18 -77 75 38 -49 -358 34 -77 -21 -133 -257 -120 -248
7820 -248 -204 140 -117 -144 -177 -220 129 -174 77 -27 -132 137 199 -186 77 117 -190 -280 -53 -435 102 -40
7842 -40 76 183 -110 77 206 -298 -105 -267 47 233 -103 -19 -90 215 -16 -54 -1 -130 193 72 -139 205
7864 205 49 -128 -48 -58 -304 -19 -114 112 -150 1 181 156 30 13 28 45 89 -15 -65 83 -25 18 122
7887 122 -124 -264 -132 55 -246 -9 -47 -60 -23 -56 122 -38 -53 -124 213 -101 93 -79 -60 59 167 -33
7909 -33 -121 99 -114 -237 -246 136 -46 -86 138 -385 357 -178 -21 -151 154 -130 38 -73 -253 259 -57 18
7931A8l23R4K78N9j55K02k72K01K2k34K85q7j83K47k98J09K5p7k7L04o4r9J68
7954A93l16r0K04N0N0j74m7L99k37j40J42L2lJ41j04j4k52J53J24j44J96k95K6
7977a06O2M7r1J82k54J63l3J99k37k10r1L35o3q8K28P9n0K9J45j99o2Q0O7n9j88
8002a15M22l50M7r9o0M5j6p6l2M10m4k24j90M8K37RJ69k01Q2j62K27q3j91J8j33
8027b62K82P0oj33j04j40N08J29k14k72r2J73k7P4j4K64O7m32J5J98M7k04J78
8050A05J1K42k45j34o8J88m2j60J11R2J47k90K16j90J89k78Q5j00J35j19j93N51
8072B53r6j25j17J48j69J60J8R2k18K43j42O3m04L12P5j95k46J68lL64O6l11j35
8095a99J36J95k96M33j57j05k36L53j84L16l24P4J34k29K84j63q1J44k26K42k97
$$ plain form
7931 18 -305 -211 67 126 -29 173 -99 102 124 -110 175 88 -95 152 -146 -37 -12 -89 -116 188 124 25 193
7954 193 -123 -213 -9 41 91 -83 -130 269 32 -108 34 66 63 204 100 86 -166 -13 111 -33 163 -132 -106
7977 -106 -44 3 -88 94 -160 3 -30 169 -68 -278 -369 -34 -97 -185 43 122 72 101 246 47 -15 65 132 73 -115
8002 -115 307 -43 4 -95 -155 -110 -126 -202 -234 176 132 -92 -282 -234 3 12 181 -20 62 -100 127 44 -147 -129 -262
8027 -262 20 90 84 -49 -153 -293 215 344 130 -142 -234 -61 -88 -14 -28 236 303 -129 -114 84 131 -73 105
8050 105 116 358 113 -21 -89 99 57 -103 8 100 247 -43 173 -17 172 -106 -21 -121 14 -105 -298 253
8072 253 157 32 -85 63 -106 54 72 164 -54 189 47 110 -294 18 93 -102 -348 -180 -183 181 247 -64 -199
8095 -199 -63 132 -164 269 112 7 -229 124 -60 256 -68 6 140 -89 195 32 -49 95 -131 111 -186
8116a86k7L6J4L18k19L18m36l4L56m5j28j52J81l10J37N19l07L29l65l7J40m65
8138c63L09r9j0M0J39P4j26J25p5J43j16j14k23L76l03L66m17J14J82M8R4m32
8160b68M33n3k40L4Q6R2j55j00L22J60l99r5L91q3L6l0O4k43K24j42J54j70Q9
8183A07Q7r0j77J06j33J60K66m50
$$ plain form
8116 -186 -213 -177 -163 155 -64 254 -182 -216 140 95 -33 -185 -4 -314 -177 342 35 364 -1 -38 102 -363
8138 -363 -54 -153 -163 -123 16 90 -36 89 14 157 41 -73 -296 80 -223 143 -274 -160 22 70 164 -268
8160 -268 165 112 -128 -94 -8 84 -71 -171 151 311 -88 -183 208 125 161 131 195 -48 176 34 188 18 107
8183 107 194 104 -73 33 -100 60 326 -124
8191a24
$$ Imaginary data points
##PAGE= N=2
##DATA TABLE= (X++(I..I)), XYDATA
0@%%%%%%%%%%%qJ6j6J6j6K4l2M0m8N6p0P9r0J09j32J53j77K05k35K69l04L46l94
34b09M47n04N67o36P11p93Q82r83J092j210J340j483J638j807J992k193K416k662
52a395K933l236L571l948M379m867N430o091O877p827R009j0522J2538j5379J9710
67A1182k7187M3649j48003J11853K52893k23774j50881Q2544J30287m5373m3568
78f378j0950l0225j4541J10826M8446r0979q5670N7015J00723o549j30381m8291
90a06954R1798Q6627k6721p1323j3227M7904J4681m372p877n3323k5040Q5214
102A7387O0377o2167o3697M7845N5068m9819m5261M4041J26m9314L9869P1073
114F5528m0375q0973K6037Q4260k6090r2887K2545P9138j7977m4348L8319M0655
$$ plain form
0 0 0 0 0 0 0 0 0 0 0 0 0 -8 8 -8 8 -8 16 -16 24 -24 32 -38 41 -49 60 -72 81 -96 109 -126 143 -161 185 -209
34 -209 238 -266 301 -335 376 -417 465 -518 574 -636 704 -779 859 -948 1044 -1149 1267 -1395
52 -1395 1538 -1698 1873 -2075 2304 -2563 2867 -3224 3653 -4174 4835 -5687 6851 -8528 11182
67 11182 -16005 27644 -120359 -8506 244387 20613 -130268 -47724 82563 37190 -6378
78 -6378 -17328 -47553 -62094 48732 97178 6199 -79471 -22456 78267 71718 -58663 -106954
90 -106954 -15156 71471 44750 -26573 -39800 8104 22785 18413 10536 -42787 -67827 17387
102 17387 77764 15597 -48100 -255 54813 4994 -40267 3774 3900 -45414 -5545 65528
114 65528 25153 -55820 -29783 54477 28387 -64500 -41955 37183 19206 -25142 13177 53832
126E3832n6801n7470O5783O4991p8773p5593O9926Q8155l3242q3407L346O4345
138B5092O81m7178l776K0226J849M643K0557L596l7383j9645M4853K4881n1126
151a2730l2867M4526M0754k6125l3029K1969J2402l1732J604L0887k1411k9988
163c5740L6992L9682l4261l8640L4642L0081m0833k4292L9402J7826k9849j0030
175a5020K7959J0761k7170j5628J7305N875j4227M37J6796R97k0047L031L2824
188B3893m831m8904k761N5481J6522n2626k3097M9281K7321l7633k4455J5463
200f346P610m803Q383K878k1759n937L4221J5739l8478k5495K7313L0841j1564
213A2603k8147M928K3487Or572k72p594r049J1866J8618q866k8966M896L5803
$$ plain form
126 53832 -2969 -60439 5344 70335 -8438 -84031 -14105 74050 40808 -42599 -39253 25092
138 25092 25773 -21405 -25181 -4955 -3106 1537 22094 25690 -11693 -31338 13515 38396 -12730
151 -12730 -45597 -1071 39683 13558 -19471 2498 14900 -16832 -15228 15659 -5752 -35740
163 -35740 1252 40934 6673 -31967 2675 32756 -8077 -32369 7033 24859 -4990 -15020
175 -15020 12939 23700 -3470 -19098 -1793 4082 -10145 -9708 7088 8085 -11962 -8931 23893
188 23893 19062 -29842 -32603 22878 39400 -13226 -36323 12958 40279 2646 -21809 -6346
200 -6346 1264 -3539 4844 7722 -14037 -19974 14247 29986 -8492 -33987 -6674 24167 12603
213 12603 -15544 -10616 12871 12877 3305 3033 -4561 -13610 -1744 16874 8008 -20958 -16062 19741
227A9741m36l3824p940K2353J2896j1745j0533R877N824m378M371Q00j1663m251
241h908J0303J1408r699j8168J1785J9661j3302j8106Q537J3390o619j3605J1832
254a491J5125j5429p882J8000J560j5058r16J0088K553r440J77J1430o218r763
268g264P139L709o663m633J261J0719J163j2412K072J1744k490p463j588Q358
282C652K912j0741L840J1629j0989p367J1184J663r991n436Q458Q846j0507n653
296h500J1699k6n789J696NM24J163j090N763j083p632N214M880n634n621j773
312f304Q926M131j3494L45J1819m027n967K429J840l59k167M121N352q265j273
327b893J0522l303o736P70J440L277k264n537M910K374m089j12r23J280O74l845
$$ plain form
227 19741 19305 -14519 -22459 -106 12790 1045 -9488 389 6213 1835 6206 7006 -4657 -8908
241 -8908 1395 12803 3104 -15064 -3279 16382 3080 -15026 -6489 6901 282 -13323 -1491
254 -1491 13634 -1795 -9677 8323 9883 -5175 -6091 3997 6550 -2890 -2713 8717 2499 -7264
268 -7264 -125 3584 -3079 -7712 -6451 4268 5431 -6981 -4909 6835 4345 -3118 -4706 3652
282 3652 6564 -4177 -337 11292 303 -7064 4120 5783 -4208 -9644 -1186 7660 -2847 -8500
296 -8500 3199 3173 -2616 -920 -915 -491 672 -418 5345 4262 -3370 1844 6724 1090 -4531 -6304
312 -6304 2622 6753 -6741 -6396 5423 1396 -4571 -2142 -302 -661 -2828 1293 6645 -1620 -2893
327 -2893 7629 4326 -2410 -1640 -200 3077 813 -4724 186 2560 -1529 -1641 -2564 -1284 -610 -4455
343d455M469M247o868J839O931l849l560M97L520O21o038J211N509m505j277L542
359A834m479r12L156q17N59j387m52N258P8k538j199j004M887J777o739J275M803
376D100l304j30J182k865k902M08N265O59q122J518P080j267j607l19k381J696
392i89L162J459j856m034K215M800j913k870k198k810M347M508l733m443l05N015
408C55M089l404n251n28L107P085L44p971j222N779L365j148o197l893K630M416
424A556L312l119p819p66R035N225o607j1985K921J4233L010q688n335L513O313
439D799K298m138o860l396P054Q371l604q424j376L562N352J380q589q595N799
454f367J5128Q45j4243k830J1283K840m652k050l577p68O440N657l424q631M59
$$ plain form
343 -4455 14 4261 -2607 -768 6163 2314 -1246 -749 2771 3392 -2646 -1435 4074 -431 -1708 1834
359 1834 -2645 -3557 -401 -1218 -659 -2046 -2498 2760 2838 300 -899 -1903 2984 4761 -1978 -703 4100
376 4100 796 666 1848 -1017 -3919 -3511 1754 2413 -5709 -4191 2889 1622 15 -304 -2685 -989
392 -989 2173 3632 1776 -2258 -43 4757 2844 -26 -2224 -5034 -687 3821 88 -4355 -4660 355
408 355 4444 1040 -4211 -4739 -1632 5453 5797 -2174 -3396 2383 5748 4600 -1597 -5490 -2860 1556
424 1556 4868 1749 -6070 -6836 2199 7424 817 -11168 -8247 5986 8996 308 -5027 -1514 4799
439 4799 7097 2959 -3901 -7297 -243 8128 4524 -3900 -5276 -1714 3638 5018 -3571 -12166 -6367
454 -6367 8761 9606 -4637 -7467 3816 6656 2004 -46 -3623 -4391 2049 7706 4282 -4349 -3890
469c890N538m47k96k856q753L735J5864N95j4572l976J2831M951j0725k376N492
484A115l238O69J0446o34j1512m842P843P407n424r661k075O751J2929R60j8046
499g312m974J6188O198j0329p504L905N975J286L990Q74j3571m119J4112M709
513I428j2143r704M293J4342M411q812q905k280J0925R391j2273j1747R975J1058
527G959q02m941j387p23l955L257Q530q420j2858R418J4334j995j1955o212P864
542a886O940m262n094k239M562R440j165o241K025j250n055M004N473m717j0074
557i539M217J8152k357j9627k75J1252Q09m194k832N11L260N085L921o253q764
572f634M960N759l368M4j602m520O232R077l525j3323m782J4260N857j2954n628
$$ plain form
469 -3890 1648 1201 905 -1951 -10704 -6969 8895 9490 -5082 -9058 3773 8724 -2001 -4377 1115
484 1115 -2123 -1454 8992 8358 -3154 -7996 -153 7254 1830 -7831 -9906 -3155 9774 10734 -7312
499 -7312 -12286 3902 10100 -229 -7733 -3828 2147 3433 7423 8297 -5274 -9393 4719 9428
513 9428 -2715 -12419 -8126 6216 10627 1815 -7090 -9370 1555 10946 -1327 -13074 -3099 7959
527 7959 7157 2216 829 106 -3849 -592 7938 -482 -13340 -3922 10412 8417 -3538 -9750 -1886
542 -1886 5054 792 -4302 -6541 -1979 7461 6296 55 2080 830 -4225 -221 5252 535 -9539
557 -9539 -5322 12830 10473 -9154 -9429 1823 2632 -1562 -4394 -3883 -623 4462 8383 2130 -6634
572 -6634 -1674 4085 717 761 -841 -5361 871 9948 6423 -6900 -11682 2578 8435 -4519 -10147
587a0147P835O167K857l345o838k87M480L407k498o434J850O189J311J801m674
602A674r967L304J0268j815j0790k298J2080P269r644m706M736N52j197J493o44
617C15j343k42M370L597n520l821K205r71N69J467l590j038M898L318k548m704
633c038Q25L701k832r73M912j551k410L727K662k324m425p54K679p70M62J015
649I06m195P05P130j105p689k69M835Q98k643J360J791k726J352O525m543p526
665e194K867N616j015m909Q23K852n19K49O40m417j430N007J179l691O03K832
681A493N5q16J530l40m482Q36N204j956l877K283K018j728q75P46j346k261K207
698a309K906k379j170L420K93j578J27K94n87r22J986J698k526r24J919o65j199
$$ plain form
587 -10147 -2312 3855 6712 3367 -3471 -3758 722 4129 1631 -4803 -2953 3236 4547 6348 1674
602 1674 -8293 -4989 5279 3464 -7326 -9624 2456 9725 81 -4625 111 663 -534 959 315
617 315 -1028 -1270 3100 6697 1177 -2644 -439 -1410 -841 626 -2964 -4002 896 4214 1666 -3038
633 -3038 -2213 1488 -1344 -2317 2595 1044 -1366 2361 5023 2699 -1726 -2480 199 -571 -109 906
649 906 -3289 -2584 4546 3441 -4248 -4517 318 1216 -1427 -67 1724 -1002 350 6875 2332 -5194
665 -5194 -2327 3289 2274 -2635 -1812 1040 521 770 1410 -3007 -4437 570 1749 -1942 -1339 1493
681 1493 1548 732 2262 1922 -2560 -1724 3480 1524 -2353 -70 1948 220 -655 91 -1255 -3516 -1309
698 -1309 1597 -782 -1952 1468 1761 183 310 604 17 -905 1081 2779 253 -671 1248 583 -616
715f16J79n46p35N11J191J139k499l06K976l72r70m34J89J175J150r10m19p40
733c7K33J719j830j950R99L74j61L73q55P43j01N5J527j810j054K812N40j463
751A14Q59j08L43K41j396K55q92n02K101j052k416K034N42o64K35r56R58N01k28
770c1R87n30j237K807k6k628J173Q7m11N72j479m2R32j090J204q68j739K233M91
789D05j609J329j40l10J540o93k12O23r29J455k28k039J617n41j138J490j453
806h33n17J411p97J33M85j103J489M30j316J396m98m79K410j585j141J863p91
823E57j60J34j764J171K36j538J402r69p74J909m08m50J282j157M67J650j316
840B72K29l0l64J443r38j099J547j529n10J722j201j220R46J95J042p46j312J730
$$ plain form
715 -616 -437 -983 -1718 -1207 -16 1123 -1376 -1682 1294 922 -48 -482 -293 882 2032 1122 703 -37
733 -37 196 1915 85 -1865 -866 -492 -653 -280 -1135 -392 -493 -438 1089 -721 -1775 1037 1577 114
751 114 973 865 1208 1449 53 308 -584 -1086 1015 -37 -2453 -419 123 -541 -306 -1262 -304 197 -31
770 -31 956 426 -811 1996 1970 -658 515 602 191 763 -716 -758 174 -916 288 -580 -2319 -86 405
789 405 -1204 125 -15 -325 1215 522 310 933 4 1459 1231 -808 809 268 -870 620 -833
806 -833 -1350 61 -736 -603 -118 -1221 268 698 -618 778 280 -199 2211 626 -515 1348 557
823 557 397 531 -1233 -62 174 -1364 38 -931 -1705 204 -204 -654 628 -529 -62 1588 272
840 272 501 471 107 1550 612 -487 1060 -469 -979 743 -458 -1678 -732 -537 505 -241 -1553 177
858A77M9j55J445j392m17J925q28m70L78j517Q49R91r22n17j088M78J680j465
876g99q89J420p76P91K042j311j096L88J401R05k106q58K345m75r81R53j045j161
894a252Q23J81N19j361j266K280J128j035o57p13J707J675j812o77J031L16K02
911A089k79j98l01j677M73K388j717k506J180K239J84j900p49J729N46o00P55
928F56m99m25J232J110n12j691r40J531j43o72r7n62m63J961J085j858k276R12
946a651L325m31k546K01J956R04lj190j097N61K14J01m0j054r1n84K564J429m524
965a956k617M618K644l164l033L274L562k265j569K243n66l032J891K061j553
980E38k317R25K892q88k085m63m26O95K450j868j882K184K073l42j381k61P98
$$ plain form
858 177 226 71 1516 124 -293 1632 804 334 712 -805 44 1035 113 -404 -1492 -1014 666 -799
876 -799 -1688 -268 -1044 -253 1789 478 -618 -230 1171 2076 -30 -888 1457 982 1 954 -91 -1252
894 -1252 -429 -248 271 -1090 -2356 -76 1052 17 -640 -1353 354 2029 217 -460 571 887 1089
911 1089 810 612 311 -1366 -893 1495 -222 -2728 -1548 691 875 -1025 -1774 -45 501 -99 656
928 656 157 -268 964 2074 1562 -129 -1069 462 319 -353 -450 -1012 -1475 486 1571 -287 -2563 -1651
946 -1651 1674 1243 -1303 -1102 854 1758 1755 565 -532 29 243 344 304 -750 -841 -1425 1139 2568 -1956
965 -1956 -4573 45 2689 -475 -3508 -234 3328 1063 -506 1737 1171 -1861 30 2091 538
980 538 -1779 -854 2038 1150 -935 -1398 -1824 -1129 1321 -547 -2429 -245 1828 1486 105 -156 642
997F42q13n56K381j125j805K020P35m43r26k009j28J344J231o6l149R33N174r38
1015B502m987J390K645j185j887J474K911k689k308N087J151o365k033M278J771
1030A755k381k746K371L160j458l66l99j717J908N96j207J053L35o33R78Q07o57
1047A399k788k774M656J694m801N05L571q31q16L51l12j589o87L772M47m048K612
1064C61L980l361j626K326j311l635J335M584o52n551K442N520l887l675K188
1079i62L81p41M04J806P58j603L81K047j769j284L3k121K801K986l198j859K766
1096H26J598k293l586J827K703l389O87M892k191l146L008K008k567l457J971
1111a109L392k732o40L503j582k267K062K41k770r30J589K450j417p21K496j36
$$ plain form
997 642 -171 -727 1654 529 -1276 744 1479 1036 110 -1899 -2027 -683 548 482 -2667 -1734 3440 2502
1015 2502 -2485 -1095 1550 365 -1522 -48 2863 174 -2134 2953 4104 -2261 -4294 -16 1755
1030 1755 -626 -3372 -1001 2159 701 335 -64 -1781 127 723 -484 569 904 271 1249 2056 1399
1047 1399 -1389 -4163 493 2187 -2614 -2109 1462 631 -185 166 -146 -1735 -2422 1350 1797 -2251 361
1064 361 4341 980 -646 1680 369 -3266 -1931 2653 2001 -3550 -1108 4412 525 -3150 -962
1079 -962 -581 -1322 -918 888 1646 43 424 2471 702 -582 -549 -2670 131 3117 -81 -1940 826
1096 826 2424 131 -3455 -1628 1075 -2314 -1627 3265 1074 -2072 936 2944 377 -3080 -1109
1111 -1109 2283 -449 -1089 2414 832 -1435 627 868 -1902 -2832 -1243 1207 -210 -931 1565 1429
1127A429k010J170q87m97N73O44O16K77l59k69n37k38L15k328k91L148k57k071
1145a572J695J327j000k218J464J820k633j514M569Q52l047j76K228l61k754k24
1161a544K181p83k111K333J645j947o52J063J55q06p99J102Q45l11P67j51o00
1178C87M40p65q39R83k82r14N81J197k15j602NJ883j482j519J859J513j452j97
1196d19J782L28j973l11J987q91k229J630J599j758q16J156P02j555j020J820
1212C2K23j216K61J118L90n01o06R46J68j073l2Q21O9N2q48J1J098j312j057J086
1232c70L62j018m5P34J370j220p67J966j10j652O34J232m38q51j35J547p11j733
1250a205J373P49j929k18J184J27m79o98J410N58j595N53J142q20k12M40J88M83
$$ plain form
1127 1429 -581 589 -298 -795 -222 422 1038 1315 956 687 150 -88 227 -2101 -2392 756 499 -1572
1145 -1572 123 1450 450 -1768 -304 1516 -1117 -2631 1938 2790 -257 -433 1795 1434 -1320 -1544
1161 -1544 637 -146 -2257 76 1721 -226 -878 185 340 -466 -1265 -163 682 371 1138 987 387
1178 387 827 62 -777 206 -76 -990 -409 788 573 -1029 -1024 859 -623 -2142 -283 1230 -222 -419
1196 -419 1363 1691 -282 -593 1394 503 -1726 -96 1503 -255 -1071 85 787 -768 -1788 32
1212 32 255 -961 -700 418 808 307 -299 647 815 -258 -290 531 600 652 -196 -185 913 -399 -1456 -370
1232 -370 -8 -1026 -1071 -337 1033 -187 -954 1012 902 -750 -116 1116 678 -173 -308 1239 528 -1205
1250 -1205 168 917 -1012 -1230 -46 81 -398 -1096 314 872 -723 -170 972 152 -60 380 568 1051
1268A051o24n24Q77q53m42O09p58Q32n20q20J299J19j280O98R14m73j64j35P80
1287E86L38j295P70Q77j466l4P76l39q48k30L69J035j618l5J726o65l01N49j55
1306D0N42m93l31J234j22j072M30J03J14J27j250P49L68j752J048K38q74P94l29
1325d36L32K73o59M85P67q87L40Q77j350N75J20n37O40j108J27J115q66n98N48
1344b42m4L23j66o89R30K83r93R47L51n80K75O1R2L72j403K11R64q43m0j62l00
1365f53M09r6m41Q36l38j26N87l87K10J60j02N92jp06N84k08m61P64n23l53J59
1386i4j33K25k81r21Q52O99p11N87l32P3L09J41K09m4o79N27L89p32J81l45m66
1407e46M85j8m09m17K34P37l7p30O36K29k65P85l38j72R4j41J77K22l64j59q2
$$ plain form
1268 1051 427 -97 780 -73 -515 94 -664 168 -352 -1172 127 246 -1034 -336 578 105 -59 -194 586
1287 586 924 -371 399 1276 -190 -224 552 213 -635 -865 -496 539 -1079 -1114 612 -53 -354 195 40
1306 40 582 89 -242 992 870 -202 228 331 445 572 -678 71 439 -1313 -265 -27 -901 -107 -436
1325 -436 -104 169 -490 -5 762 -125 215 1092 -258 317 437 -100 540 -568 -441 674 -192 -790 -242
1344 -242 -286 37 -129 -818 112 395 -598 349 700 120 395 456 548 920 -483 -272 692 -151 -191 -353 -653
1365 -653 -244 -340 -781 55 -283 -409 178 -209 1 161 59 651 650 -56 528 320 -141 623 100 -253 -94
1386 -94 -227 -2 -283 -1204 -352 347 -364 223 -109 -36 273 414 623 579 -100 427 816 84 265 -80 -546
1407 -546 -61 -79 -488 -905 -671 66 29 -701 -65 164 -101 684 346 174 268 127 304 526 162 3 -79
1428g9j2M59k70j198L85Q47l88m87J46R92q5o07N33J34p06N71M76p8k55k07k4
1449A47J56k49j52o73k57J388J98j436P8J094J87j274R3J150R3j256J269Q32j152
1468B36j14L89L75q98p36N74Q3N1L02q03l31J468K90k126J77J075N08j146L02
1487c24J861k15k426J476J079k133l50J365M82p87k36P35m20q09P97l63j506J551
1505b23J582j261n90J220N16j329m01J483k23k542J671J976j630o81M76J85k36
1522gq75R2j40J35J042R88j709J020R88j943l87J385j64j157j19K484J92l228
1540a403N81K269j488j743J068L77j39K24R41L55j654L25Q28j151k97J182k54
1557B1O3J069l18q95n39N23K58j532J89J686l69p35J361O3j200l43M14J55l94
$$ plain form
1428 -79 -91 368 98 -1100 -715 132 -256 -743 -597 395 310 -297 236 370 -336 235 711 633 378 171 147
1449 147 303 54 -98 -771 -1028 360 558 -878 -800 294 481 -793 -700 450 543 -713 556 1388 236
1468 236 122 511 886 -12 -748 -174 -91 -40 262 -541 -872 596 886 -1240 -1063 12 520 -626 -324
1487 -324 1537 1322 -1104 372 1451 -682 -1032 333 815 28 -208 527 107 -702 95 -268 -1774 -223
1505 -223 1359 98 -492 728 1244 -85 -486 997 774 -1768 -97 1879 249 -432 44 229 -7
1522 -7 -882 -790 -930 -795 247 1235 -474 546 1534 -409 -796 589 425 -732 -851 1633 1825 -1403
1540 -1403 -822 1447 -41 -1784 -716 -339 -478 -254 687 1042 -612 -287 541 -610 -907 275 21
1557 21 84 1153 835 -60 -599 -76 182 -1350 -1161 525 156 -579 782 845 -355 -698 -284 -129 -523
1576e23L08J574q58j68J187j082j528O94O75j240j29J020J204j189q99K023o67
1593D02k423J363J156p28m3O98R37o01o28O39o82j052J027l53m76J109M55o77
1611A23l60K23K6j037m13J760n6q55J649K35j236j25P65k64j214N8J240k09p92
1630d82J166J71j855LJ003m65n28L59J280m36m51R20M45j705M76O16r08N1M37
1649I7N41l07j66L29k19j247N37L91q89P17O08m28n3M33J28q97j85J270k86j198
1669h24R26J367r64p80Q21l0j261m02J171L12j431P46J263q89p68Q55K86r21o9
1688e92J106K13o95M30M59n73n09L01n43l9J12M22l19j80P99k83q12O71O3p92
1708g61M44Q06p7p58R07N15r02q88J158L15j550N68P67k96q49M72L10m91o59R44
$$ plain form
1576 -523 -215 1359 501 333 1520 438 -1090 -396 279 -961 -1090 -70 1134 -55 -954 1069 402
1593 402 -2021 -658 498 -230 -273 425 1362 761 133 772 90 -962 65 -288 -764 345 800 123
1611 123 -237 -14 12 -1025 -1438 322 266 -589 1060 1295 59 -66 699 435 -779 -721 519 310 -482
1630 -482 684 855 -1000 -997 6 -459 -987 -628 652 216 -235 685 1130 -575 -99 517 -391 -340 97
1649 97 638 331 165 494 275 -972 -435 -44 -933 -216 392 -36 -89 344 472 -425 -610 660 374 -824
1669 -824 102 1469 505 -275 546 516 -745 -1147 24 336 -1095 -349 914 25 -743 112 398 -523 -592
1688 -592 514 727 32 462 921 348 -161 140 -403 -442 -330 92 -227 -407 392 109 -703 -32 31 -761
1708 -761 -317 489 412 -346 561 1076 174 -714 444 759 -791 -223 544 248 -601 -129 181 -310 -969 -25
1728b5L27o93L9Q68k27m53M90j6p2m44J52N34n96L59j7n30J48N6n12K28M24m47
1750d07L68j40K32K50m63M22M43r83K11L08O5o5j25Q8L81j140K62N53j055M82
1770c13K57j3K44n37M74L43m33k79Q63l25m08N23k63K59q6l57l7K24p14K98M9
1791b31k83L29j28K60L70n81L01L72n36K12N27l36M85j000K82M62k74p00L24K2
1811a23K11k13m52Q63k84n80O53R5o47N57k15L33K09l66M90l33k02M46l24j84
1831f6o7J3j47L91m97j05J050q13k31L88p4L32l52J36Q90p82m53R96j46o42J96
1852A7j45N38m38n98O48J21r48O36m1Q1K86p58N82L04o80L86O36m10rj37l2L24
1874C63m37n6M40o23L3J84k30O6K82j01Q7j15j49N12K21k75p6K80p7j20l98P58
$$ plain form
1728 -25 302 -391 -352 516 289 -164 326 310 238 -206 -54 480 -116 243 226 -304 -156 -100 -612 -384 40 -407
1750 -407 -39 -179 53 303 -160 262 705 -278 -67 241 306 241 116 204 585 -555 -293 260 -795 -313
1770 -313 -56 -69 175 -362 112 455 22 -257 606 281 -127 396 133 392 306 -51 -88 136 -578 -280 -231
1791 -231 -514 -185 -313 -53 317 -264 37 409 -127 85 612 276 761 -239 43 505 231 -469 -145 -123
1811 -123 88 -125 -577 286 2 -578 75 170 -477 80 -135 198 407 41 531 198 -4 442 118 -66
1831 -66 -133 -120 -267 124 -373 -478 572 -241 -472 -84 -158 174 -178 -42 848 66 -387 609 463 -179 17
1852 17 -128 410 -28 -626 22 143 -805 -169 -210 -129 157 -601 -19 285 -395 -9 627 217 208 71 39 363
1874 363 -74 -130 310 -313 -280 -96 -326 -260 22 -79 8 -107 -256 256 477 202 126 406 329 209 -189 569
1896E69j30o66qL11N8k60m64O16K74o57o1P95m01j87M15J16q1l91L77K24m78J56
1918A27Q8o22M83R9p85J98L84o2m81m7Q53k00k47J07N19l2m54N91m63k5K02l92
1940a59J85L7K35l97p32O18K31n47j54N85K65j95j69N72j43o55L31O31l53j62
1960B4L30Q2k91j41n6J7j34Q4n4l12O44K72n09l61M52lo4m51O66L96j085N21O21
1983F48l64n42J22J67j49%l10L34j28K17K32m83O2M42m04l50N71N45m48m33R65
2004F94J82j204mO10l24m42M49J42j29J29j95J59o59L49O34p96J20Q98k06k31
2024A76N8L66l77j037O34P90r63j20Q33j28o76N39k61l23k49J78O80l51MQ21m76
2045A18k38J033q75n67O95J05j86j9K96P88j591n72J349m77q56M80O76k68Q3K56
$$ plain form
1896 569 439 -227 -235 76 134 -126 -590 26 300 -357 -418 377 -24 -211 204 320 239 -152 225 449 -29 127
1918 127 215 -407 76 175 -610 -412 -28 -90 -571 -618 235 35 -212 -105 414 382 -72 519 56 31 233 -159
1940 -159 26 63 298 -99 -831 -213 18 -529 -683 -98 167 -28 -197 375 232 -423 -92 539 186 24
1960 24 354 436 145 4 -52 -35 -169 -85 -139 -451 193 465 -44 -405 47 44 -20 -471 195 591 -494 27 648
1983 648 284 -258 -136 31 -118 -118 -428 -94 -222 -5 227 -256 -194 248 -156 -506 65 610 162 -271 694
2004 694 876 -328 -332 278 -46 -488 -39 103 -26 103 -92 67 -592 -243 391 -405 -285 613 407 176
2024 176 234 600 223 -814 -180 610 -353 -473 360 232 -444 95 -166 -489 -738 -560 120 -231 -227 594 118
2045 118 -120 913 38 -529 166 271 85 66 362 1150 -441 -1013 336 -141 -997 -517 159 -109 -26 230
2065B30M78r22l95R19j82p49J158L5n34J43O14n45r95Q6Q17k03j067J377o1o87
2085d83N51L97l58m92L07K60k22j10J004j87n82P79m07j072K70N99n99l01O27
2104a9P50k95r73J035K45j790M52J097n27j64Q08K28j40j019M74J5j114P59N00
2123C22n24O0M04J53n58j07M82n00m08P54L67p66Q06M30m67l66J79j77o49k27
2143g92J216j52n83M02M79r09l23J015k77q76L99Q49j29p30P55P42j148m34O50
2162A54o7l73L30M48n6o66K80j70n93K13N78m58J75P21l60k26J98R8k22m22O16
2183A98L38q26L48N90k17p20K39J90m11n23P56P6m14J20P60n63l82M34K43l96
2203a60k05N60L66p73K8O75j61p55M50n6p6k03J57R7J9j44N14n11r2K88k38M6
$$ plain form
2065 230 708 -214 -609 310 128 -621 537 572 38 181 795 250 -745 -659 158 -45 -1112 265 204 -483
2085 -483 68 465 107 -385 -78 182 -40 -150 854 667 85 864 457 -615 -345 254 -345 -646 -19
2104 -19 731 436 -537 498 743 -1047 -595 502 -25 -189 619 847 707 -312 162 177 -937 -178 322
2123 322 -202 -142 262 415 -143 -250 232 -268 -676 78 445 -321 485 915 448 82 261 84 -565 -792
2143 -792 424 272 -311 91 570 -339 -662 353 76 -800 -401 448 319 -411 344 1086 -62 -496 154
2162 154 87 -286 44 492 436 -230 50 -120 -713 -500 78 -380 -205 516 156 -70 128 226 4 -418 198
2183 198 536 -290 58 648 431 -289 -50 140 -271 -794 -38 38 -376 -256 504 -59 -441 -7 236 -160
2203 -160 -365 195 561 -212 -184 491 330 -425 25 -31 -107 -310 -153 -56 -37 -181 333 -178 -270 18 -220 -174
2225a74O02J23k43l70O47j80r05N41K97p76MO06o7k31j33L61J02q19K31Q73n40
2246e1k30Q46j1n64J11JJ29l52N7J62j84j43L81k42l1J31l33K32K0Q8ML37l25
2269C3L83k63j75M84n81J57L61n01K78j0l39J79j28k33K68j76j37K79K86m24L01
2290D2j38O35n88q4N53j11l31O0K21K0Q5m77J9K70p90O19J98q50O47j79n2K94
2312F3l2l7N02m88j3J28J01j59J25l22L58j69m70L72j40m0J16n2o0K6j14L29M4
2335F8k88M99ro2J37j12l51N5l0r9L72o89J81K20k00N94l90j72M37m05P4L55m6
2358A39l10M54k16M92k49m72L39K49m76J29j06J57j2k19J97n1l31K06N22o36J63
2379c1Oo8N44n10K08o4j39J10qj34J00j6j69L05n84Q4M38l9o6j05j05K02J16K67
$$ plain form
2225 -174 428 551 308 -62 585 405 -500 41 338 -438 -434 172 105 -126 -259 102 204 -615 -384 489 -51
2246 -51 -281 565 554 -10 101 102 231 -121 -64 98 -86 -229 152 -90 -121 10 -323 -91 -71 17 21 358 33
2269 33 416 153 -22 462 -119 38 399 -102 176 166 -173 6 -122 -355 -87 -263 -400 -121 165 -259 42
2290 42 -96 539 -49 -133 420 309 -22 38 259 279 364 -113 -94 176 -614 5 203 -647 0 -179 -231 63
2312 63 31 -6 496 8 -5 123 224 65 190 -132 226 57 -413 -41 -181 -221 -105 -157 -217 -191 -305 24 68
2335 68 -220 279 270 208 345 233 -118 -63 -93 -192 180 -509 -328 -108 -308 286 -104 -276 161 -244 -170 185 139
2358 139 -171 283 67 559 310 -162 177 426 -50 79 -27 130 118 -101 96 45 -286 -80 442 -194 -31
2379 -31 -25 -93 451 -59 149 85 -54 56 48 -86 14 -2 -171 134 -450 -366 72 33 -33 -138 -243 -41 75 342
2403C42j89j6PK00r0M5j04l65L47K38m91r7p3R7M7j60j22K97k96K54K28m9N6r5
2427A1L64j52j37j4j40R2N7J14j94l72K64N7n43L70M4k7j32L96L14m52J41K92
2449C53j40j66J09l13L11P2j32j09k17J97J96o13K64J76m0l35L79K65l80k05N77
2470B49K14m48r8M45l88k09L08J19j46l8oj2l92J75N35o65J08M90P5n30O8J77
2492C1j23n1L49M97n59l75P40m63k5Oj97K38l22K15J14o00M20P61q22m71O61K11
2514B35n38J89O25j40l66J79N14p15k67M92k15m33L61M30m57R8k06M97n49k15
2534d81O78m80k08J075j91l73Q1O02l42o61j1R27o67l06R44M7q15K11j61rl35
2555d75Q9Q02l34o7N37k21p45O96J46r79L22M16M9j42q7L69l93l97M54j9m93J81
$$ plain form
2403 342 153 137 144 344 254 299 195 -170 177 415 -76 -173 -246 -149 -102 -262 -384 -87 -383 -129 99 50 106 11
2427 11 375 223 86 72 -68 24 81 195 1 -371 -107 -50 -593 -223 -179 -206 -338 58 372 -80 61 353
2449 353 213 47 156 -157 154 226 94 -15 -232 -35 161 -452 -188 -12 -52 -387 -8 257 -123 -328 249
2470 249 463 15 -83 362 -26 -235 73 192 46 8 2 -10 -402 -227 308 -357 -249 241 316 -214 -146 31
2492 31 -92 -143 206 703 144 -231 509 46 21 27 -170 68 -254 -39 75 -525 -105 656 -166 -637 24 235
2514 235 -303 -114 511 371 5 184 698 -17 -284 208 -7 -440 -79 351 -106 -8 -214 283 -266 -481
2534 -481 197 -283 -491 584 393 20 101 703 361 -300 -311 616 -51 -357 587 634 -181 30 -131 -140 -475
2555 -475 -386 416 82 15 552 331 -414 282 428 -551 -229 187 236 94 7 376 -17 -414 40 21 -472 -291
2577b91P45m05P2K53Q5j28n87M87n2o76O51O79q29O0J24k76j43m51O86j22l87
2598e05N25K82l16P1q0k12j10J40J03J35j20M03K37o79L09K05p73n7N92K33q07
2619d24J43Q31k35q42M96L04q68J68P63r3m68M07R9k62m21M61J13o66L24M93n03
2640a80j99O32K2m16l49K39L68m52L10N83l85r8M53l68l57K92J01l12j29L06J91
2661B52p12L46M06k99m94P23K29n10o1O94j40o10K6N28j14n29L33K30l27j37N46
2682C80k76m17k00N32k35k66M55J81j58J22J61j65j72r5M28n95K96K66j70k21
2702a49K94m6l49j38M33J64p38L77L90l67k30P86k61k64n8O44k98m18L12O51r14
2723a79J29N54n75l24K80O5M0l00J34N43n90j20J34K87k87L25j6l6R6nl64M15
$$ plain form
2577 -291 454 49 121 374 459 331 -256 231 179 -497 154 833 4 64 188 -88 -231 -682 4 -118 -505
2598 -505 20 302 -14 57 -23 -235 -345 -205 -102 33 -87 316 553 -126 183 388 -385 -442 150 383 -424
2619 -424 -281 550 315 -527 -31 273 -595 -427 336 243 -225 182 281 19 -402 59 172 -494 -170 323 -180
2640 -180 -379 253 275 -141 -490 -251 117 -335 -25 558 173 75 528 160 -197 95 196 -116 -245 61 252
2661 252 -460 -114 292 -7 -501 222 451 -59 -120 574 434 -176 -150 378 264 -265 68 298 -29 -166 380
2682 380 104 -313 -513 19 -216 -482 -27 154 -4 118 279 114 -58 -153 275 -320 -24 242 72 -149
2702 -149 145 99 -250 -388 45 209 -529 -152 238 -129 -359 427 166 -98 -156 488 190 -228 84 735 -179
2723 -179 -50 504 -71 -395 -115 -50 -10 -310 -176 367 -223 -343 -209 78 -209 116 100 64 160 155 -209 206
2745B06m16L11l10L72K2k69m28M84M7j22p9N5o7J75o5M80l86l71O42m7n34K67
2767c3J14P1j44j63K47pk47J4K55m09L25j0j01K14k99L89j81j01K61q4k52M47
2789C06l66P7K31l24kj37J91j72k3j74K72P9k02L53l36J13n4L06J02k65l51N21
2811A45J62m99L09j37k61J64N4J14l20n4L57k92J65J07n5p3L61j81J3K42l80K1
2833c8N24o55L25k4l56J87J59m22M19m3j65L25l06Q6mj83N61m4n11K75J45K7q7
2856A95K3k40p3m5k8K85k23j42K05j76R3L0o8K65k0j17M2K32j79K59k05K79m27
2879c5j56L1j40J6J12o6J01L01o9r5j12m1j11M56j96J2Q4kJ64m24J29M76l66l80
2903c11L39J47j02j93m4K31nm49L67j2J13l3j96J43K5K00k11K67k78L65o31L09
$$ plain form
2745 206 -210 101 -209 163 185 -84 -512 -28 19 -103 -182 -127 -194 -19 -84 396 10 -361 281 234 -300 -33
2767 -33 81 152 8 -155 92 85 -162 -148 107 -302 23 13 -88 126 -173 216 35 -66 195 111 -141 306
2789 306 -60 17 248 -76 -78 -215 -24 -196 -219 -393 -121 -42 -244 109 -227 -114 -168 138 240 -25 -376 145
2811 145 307 -192 117 -20 -281 -117 -63 51 -269 -323 34 -258 -93 14 -41 -114 247 66 79 321 -59 -38
2833 -38 486 -169 156 132 -224 -37 122 -300 119 76 -89 236 -70 16 12 -171 390 346 -165 110 255 282 195
2856 195 218 -22 -95 -140 -168 117 -106 -248 -43 -219 -126 -96 -164 101 81 -36 6 238 59 318 113 392 -35
2879 -35 -191 -160 -300 -284 -172 -238 -137 164 95 0 -112 -153 -264 192 -4 8 92 90 254 -170 -41 435 69 -311
2903 -311 28 175 73 -120 -164 67 62 -387 -20 -32 81 48 -148 -5 20 220 9 276 -2 363 -268 41
2925D1j4l15N5J03M27n80J85J64j49K19o0K58l31M0L31k40k87N56k00k23p5J45
2947E0J47l51J63k87K44q2q6P2P2l13M03o7L2j97J40L26k87K12k25n5J35J4k65
2970b05L55M6k32J52j72K40j57l26N29r7k18K24m5K1J86n16J92K7l21M30K8j76
2992c5M68m88m48K81L05J0l88j5L19k18K48j79K60N0l83K65m3j00J40K06j76P7
3014A56j61p3k01L68k86J20k20R9K78p8m70O17j28l27J09K73N4j24J49l7J92m63
3036a53L22p0n42Q8M33m27J23L70j51J60m31L17l8p0K28J35m12K79jnJ5k50K6
3059e4j42k09N49P8n02M29l24J49k05K62m87L77j10O96M0p02L61q4l56J98J06
3080G0j89k2N35m84K14N5l30Q7l31K23L7k18M35K63j9l14p1J81p1l94M14L66p21
$$ plain form
2925 41 27 -288 -233 -130 297 -283 -98 66 -83 136 76 334 3 43 374 134 -153 403 203 -20 -95 50
2947 50 197 -154 9 -278 -34 -116 -202 -130 -58 -371 32 -35 -3 -200 -60 266 -21 191 -34 -89 46 60 -205
2970 -205 150 196 -36 116 -56 184 27 -299 230 133 -85 139 94 115 301 -215 -23 4 -317 113 141 -35
2992 -35 433 -55 -503 -222 83 93 -295 -310 9 -209 39 -140 120 170 -213 52 9 -91 49 255 79 156
3014 156 -5 -78 -279 89 -197 -77 -297 -198 80 2 -468 149 21 -306 -197 76 130 6 155 118 310 -153
3036 -153 169 99 -443 -355 78 -349 -226 144 -7 153 -278 39 1 -69 159 294 -118 161 160 155 170 -80 -54
3059 -54 -196 -405 144 222 -280 149 -175 -26 -231 31 -456 -79 -189 507 547 -155 206 122 -234 -36 70
3080 70 -119 -141 394 -90 124 179 -151 -64 -395 -172 -135 -353 82 345 326 12 -59 122 51 -343 71 437 -284
3103b84M10M48m32J21k38j3k0m56P2N95k94o4L99q8k06K34k37k5K38j61J84k32
3125d9J14J10l15j72O8M4j58L96N7j81J05J67K35m97q1K80j8l05N08J04l79p0
3147c7L14k5l55l4J66m04J92M59J29o03n0N61k25k84L8K13k89K19L99k42N2J15
3169C09ln68J50K2k7J34q3J49l34J68l0K98n05K58J93o0Q2j96N27m85j17K41j4
3192A09k74J63R0k3l78J99M36n27M3J10j15k57K85K08r6l7J77J45M4l04J02j70
3214g0j17K58k71R4J5N52p76O1J81J81m47L39M31k69j71J53k7N9k8O0K08k78K6
3237A64r3Pq1o3j29j08J0N8K63jn1P9K2k88K14R0k38L26k00K58nl06M08j55j32
3262D9N4j98l41M87k36j2L31l19M8K40l28L25M1n22O32k64j17J12K99l04j03n7
$$ plain form
3103 -284 126 574 142 263 25 12 -8 -464 -392 203 -91 -155 244 156 -50 184 -53 -78 160 -1 183 -49
3125 -49 65 175 -140 -312 -244 -200 -358 38 95 -86 19 186 421 -76 -157 123 105 -200 308 412 33 -37
3147 -37 277 252 -103 -137 29 -375 -183 276 405 -198 -248 313 88 -196 -158 55 -234 -15 384 142 194 309
3169 309 306 -262 -112 -90 -117 17 -66 83 -251 -83 -113 185 -320 -62 131 71 153 -43 484 -1 -118 123 109
3192 109 -165 -2 88 65 -313 -114 322 -205 -162 -52 -167 -424 -139 69 -27 -64 113 258 302 -2 100 -70
3214 -70 -187 71 -200 -106 -91 461 -315 -254 -73 108 -339 0 431 162 -9 144 117 176 148 208 416 138 164
3237 164 71 78 -3 -66 -195 -303 -293 -235 28 27 -24 55 77 -211 3 93 -145 181 -19 239 234 -72 336 181 49
3262 49 103 -95 -436 51 -185 -197 134 -185 -137 103 -225 100 141 -381 251 -13 -130 -18 281 -23 -126 -183
3284a83K04j81j48N6L37j88J02J20l77M22l17K0J38q6J72J20j21j76K98k22J14
3305A04J62m77K67j54q4K09m6k19K36LJ55q1j75L02j89Q8R8k59L55k85j5K24r9
3328A20j40j6J01j8n1n7K3k08J47r3L12l31J66L46o9k42m2K25O7k1l94K05m9J34
3352A15k29K27j07J68l55jL30l03K05j15o8J51m4J5n2J61K7k7j15j2K07j15j08
3375d5n5J22K87n53J06R4k21J99N4Q5k41K28j07J12j62J81jj0k25K91j97N1rR7
$$ plain form
3284 -183 21 -160 -308 -252 85 -103 -1 119 -258 164 -153 -133 5 -81 91 211 90 -86 212 -10 104
3305 104 266 -211 56 -98 -182 27 -19 -238 -2 1 156 75 -100 202 13 101 199 -60 295 10 -5 219 120
3328 120 -20 -36 65 47 -4 -61 -38 -246 -99 -192 120 -211 -45 301 232 -10 -52 173 240 219 -175 30 -19 115
3352 115 -114 113 6 174 -181 -182 148 -155 50 -65 -133 18 -26 -11 -63 98 125 98 -17 -29 178 63 -45
3375 -45 -100 22 309 -244 -138 -44 -265 -66 -12 73 -168 60 -47 65 -97 84 83 73 -152 139 -58 -7 -16 81
$$ [...]
8191f5
##END NTUPLES=NMR FID
##END=
