##TITLE=1H_Pr D
 CDCl3
 8 sc, 
 18.08.2022
##JCAMPDX= 6.0         $$ Bruker NMR JCAMP-DX V2.0
##DATA TYPE= NMR FID
##DATA CLASS= NTUPLES
##ORIGIN= UXNMR, Bruker Analytische Messtechnik GmbH
##OWNER= root
$$ XWIN-NMR		Version 3.5
$$ Thu Aug 18 10:29:01 2022 Russian Standard Time (UT+4h)  she@DPX200
##.OBSERVE FREQUENCY= 200.1313499994
##.OBSERVE NUCLEUS= ^1H
##.DELAY= (6, 6)
##.ACQUISITION MODE= SIMULTANEOUS
##.ACQUISITION SCHEME= undefined
##.AVERAGES= 8
##.DIGITISER RES= 18
##SPECTROMETER/DATA SYSTEM= spect
##.PULSE SEQUENCE= zg30
##.SOLVENT NAME= CDCl3
##.SHIFT REFERENCE= (INTERNAL, CDCl3, 0, 15.7039)
##AUDIT TRAIL= $$ (NUMBER, WHEN, WHO, WHERE, WHAT)
$$ ##TITLE= Audit trail, XWIN-NMR		Version 3.5
$$ ##JCAMPDX= 5.01
$$ ##ORIGIN= Bruker BioSpin GmbH
$$ ##OWNER= she
$$ F:/spectra/data/she/nmr/H-F/1/audita.txt
$$ ##AUDIT TRAIL=  $$ (NUMBER, WHEN, WHO, WHERE, WHAT)
(   1,<2022-08-18 10:28:02.15 +0400>,<she>,<DPX200>,
      <created by zg, POWCHK disabled, PULCHK disabled
       configuration hash MD5:
       00 E9 B6 7A A2 85 ED C7 34 08 36 98 17 FE 4E 26
       data hash MD5: 16K
       34 F2 B0 21 0B 27 BA A7 3D 71 51 B0 AF 31 27 A5>)
$$ ##END=
$$ 
$$ hash MD5
$$ 2B 32 63 82 9B E3 87 CE E5 31 49 86 58 32 9C D3
##$RELAX= 
##$RELAX= 
##$RELAX= 
##$RELAX= 
##$RELAX= 
##$RELAX= 
$$ Bruker specific parameters
$$ --------------------------
##$DU= <F:/spectra>
##$EXPNO= 1
##$NAME= <H-F>
##$PROCNO= 1
##$TYPE= <nmr>
##$USER= <she>
##$AMP= (0..31)
100 100 100 100 100 100 100 100 100 100 100 100 100 100 100 100 100 100 
100 100 100 100 100 100 100 100 100 100 100 100 100 100 
##$AQSEQ= 0
##$AQ_mod= 1
##$AUNM= <au_zg>
##$AUTOPOS= <>
##$BF1= 200.13
##$BF2= 200.13
##$BF3= 200.13
##$BF4= 200.13
##$BF5= 200.13
##$BF6= 200.13
##$BF7= 200.13
##$BF8= 200.13
##$BYTORDA= 1
##$CFDGTYP= 0
##$CFRGTYP= 5
##$CHEMSTR= <none>
##$CNST= (0..31)
1 1 145 1 1 1 1 1 1 1 1 1 1 1 1 1 1 1 1 1 1 1 1 1 1 1 1 1 1 1 1 1 
##$CPDPRG= <>
##$CPDPRG1= <>
##$CPDPRG2= <>
##$CPDPRG3= <>
##$CPDPRG4= <mlev>
##$CPDPRG5= <mlev>
##$CPDPRG6= <mlev>
##$CPDPRG7= <mlev>
##$CPDPRG8= <mlev>
##$CPDPRGB= <>
##$CPDPRGT= <>
##$D= (0..31)
0 1.2 0 0 0 0 0 0 0 0.06 0 0.03 0 0 0 0 0.0002 0 0 0 0 0 0 0 0 0 0 0 0 
0 0 0 
##$DATE= 1660804081
##$DBL= (0..7)
120 120 120 120 120 120 120 120 
##$DBP= (0..7)
150 150 150 150 150 150 150 150 
##$DBP07= 0
##$DBPNAM0= <>
##$DBPNAM1= <>
##$DBPNAM2= <>
##$DBPNAM3= <>
##$DBPNAM4= <>
##$DBPNAM5= <>
##$DBPNAM6= <>
##$DBPNAM7= <>
##$DBPOAL= (0..7)
0.5 0.5 0.5 0.5 0.5 0.5 0.5 0.5 
##$DBPOFFS= (0..7)
0 0 0 0 0 0 0 0 
##$DE= 6
##$DECBNUC= <off>
##$DECIM= 32
##$DECNUC= <off>
##$DECSTAT= 4
##$DIGMOD= 1
##$DIGTYP= 9
##$DL= (0..7)
0 120 120 120 120 120 120 120 
##$DP= (0..7)
150 150 150 150 150 150 150 150 
##$DP07= 0
##$DPNAME0= <>
##$DPNAME1= <>
##$DPNAME2= <>
##$DPNAME3= <>
##$DPNAME4= <>
##$DPNAME5= <>
##$DPNAME6= <>
##$DPNAME7= <>
##$DPOAL= (0..7)
0.5 0.5 0.5 0.5 0.5 0.5 0.5 0.5 
##$DPOFFS= (0..7)
0 0 0 0 0 0 0 0 
##$DQDMODE= 0
##$DR= 18
##$DS= 0
##$DSLIST= <SSSSSSSSSSSSSSS>
$$ [...]
##$SUBNAM2= <"">
##$SUBNAM3= <"">
##$SUBNAM4= <"">
##$SUBNAM5= <"">
##$SUBNAM6= <"">
##$SUBNAM7= <"">
##$SUBNAM8= <"">
##$SUBNAM9= <"">
##$SW= 18.0517283424941
##$SWIBOX= (0..15)
0 0 2 0 0 0 0 0 0 0 0 0 0 0 0 0 
##$SW_h= 3612.71676300578
##$TD= 16384
##$TD0= 1
##$TE= 0
##$TE2= 300
##$TE3= 300
##$TEG= 300
##$TL= (0..7)
0 120 120 120 120 120 120 120 
##$TP= (0..7)
150 150 150 150 150 150 150 150 
##$TP07= 0
##$TPNAME0= <>
##$TPNAME1= <>
##$TPNAME2= <>
##$TPNAME3= <>
##$TPNAME4= <>
##$TPNAME5= <>
##$TPNAME6= <>
##$TPNAME7= <>
##$TPOAL= (0..7)
0.5 0.5 0.5 0.5 0.5 0.5 0.5 0.5 
##$TPOFFS= (0..7)
0 0 0 0 0 0 0 0 
##$TUNHIN= 0
##$TUNHOUT= 0
##$TUNXOUT= 0
##$USERA1= <user>
##$USERA2= <user>
##$USERA3= <user>
##$USERA4= <user>
##$USERA5= <user>
##$V9= 5
##$VALIST= <valist>
##$VCLIST= <CCCCCCCCCCCCCCC>
##$VD= 0
##$VDLIST= <DDDDDDDDDDDDDDD>
##$VPLIST= <PPPPPPPPPPPPPPP>
##$VTLIST= <TTTTTTTTTTTTTTT>
##$WBST= 1024
##$WBSW= 4
##$XGAIN= (0..3)
0 0 0 0 
##$XL= 0
##$YL= 0
##$YMAX_a= 284072
##$YMIN_a= -351048
##$ZGOPTNS= <>
##$ZL1= 120
##$ZL2= 120
##$ZL3= 120
##$ZL4= 120
##$ABSF1= 10
##$ABSF2= 0
##$ABSG= 5
##$ABSL= 3
##$ALPHA= 0
##$AQORDER= 0
##$ASSFAC= 0
##$ASSFACI= 0
##$ASSFACX= 0
##$ASSWID= 0
##$AUNMP= <proc_1d>
##$AZFE= 0.1
##$AZFW= 0.1
##$BCFW= 1
##$BC_mod= 2
##$BYTORDP= 1
##$COROFFS= 0
##$CY= 11.3945322036743
##$DATMOD= 1
##$DC= 2
##$DFILT= <>
##$DTYPP= 0
##$F1P= 2.36226072786647
##$F2P= -0.459571619588291
##$FCOR= 0.5
##$FTSIZE= 0
##$FT_mod= 4
##$GAMMA= 1
##$GB= 0.15
##$INTBC= 1
##$INTSCL= 1
##$ISEN= 128
##$LB= 0.24
##$LEV0= 0
##$LPBIN= 0
##$MAXI= 10000
##$MC2= 0
##$MEAN= 0
##$ME_mod= 0
##$MI= 1.114404
##$NCOEF= 0
##$NC_proc= 0
##$NLEV= 6
##$NOISF1= 3.799351
##$NOISF2= 2.8
##$NSP= 1
##$NTH_PI= 0
##$NZP= 0
##$OFFSET= 15.70392
##$PC= 1
##$PHC0= -18047.11
##$PHC1= 22.80068
##$PH_mod= 1
##$PKNL= yes
##$PPARMOD= 0
##$PSCAL= 0
##$PSIGN= 0
##$REVERSE= no
##$SF= 200.130013532006
##$SI= 16384
##$SIGF1= 3
##$SIGF2= 2
##$SINO= 400
##$SIOLD= 16384
##$SREGLST= <1H.CDCl3>
##$SSB= 0
##$STSI= 0
##$STSR= 0
##$SW_p= 3612.71676300578
##$SYMM= 0
##$S_DEV= 0
##$TDeff= 0
##$TDoff= 0
##$TI= <>
##$TILT= no
##$TM1= 0
##$TM2= 0
##$TOPLEV= 0
##$USERP1= <user>
##$USERP2= <user>
##$USERP3= <user>
##$USERP4= <user>
##$USERP5= <user>
##$WDW= 1
##$XDIM= 8192
##$YMAX_p= 0
##$YMIN_p= 0
$$ End of Bruker specific parameters
$$ ---------------------------------
##NTUPLES= NMR FID
##VAR_NAME=  TIME,          FID/REAL,        FID/IMAG
##SYMBOL=    X,             R,               I
##VAR_TYPE=  INDEPENDENT,   DEPENDENT,       DEPENDENT
##VAR_FORM=  AFFN,          ASDF,            ASDF
##VAR_DIM=   8192,          8192,            8192
##UNITS=     SECONDS,       ARBITRARY UNITS, ARBITRARY UNITS
##FACTOR=    0.0002768,     1,               1
##FIRST=     0,             0,               0
##LAST=      2.2672688,     0,               0
##MIN=       0,             -351048,         0
##MAX=       2.2672688,     284072,          0
$$ Real data points
##PAGE= N=1
##DATA TABLE= (X++(R..R)), XYDATA
0@%%%%%%%%%%%Qj6J6j6K4l2L7m5N6o5P4q9J05j29J53j77K08k40K73l13L59m08
33b17M63n25N91o63P45q35R34j041J158j286J425j578J745j927K126k345K584
50A354k846L136l455L808m204M651n153N725o388P161q080R191j0568J2327j4663
65h004J7939k2889L1333m9491J58658k02203k65473L94574J84541k36130j69965
76a67110J99402Q2756j29008p3421P3723K5146L4518L2125r7047j40816J10228
87d9504J97892n9625j99134L0469J40315k9782r2545N5018O2930m6921l3023K4259
99C49l0640r487J06119M0159j49040q2632J34294R7733r2782o7424O2055K2319
111C1023n5678R00L8830q223L222K5470n9893o9022R0579J11625q8164j20039
$$ y = [0, 0, 0, 0, 0, 0, 0, 0, 0, 0, 0, 0, 8, -8, 8, -8, 16, -16, 21, -24, 32, -33, 41, -48, 57, -72, 81, -96, 112, -128, 145, -168, 191, -217, 246, -279, 312, -351, 394, -441, 493, -548, 610, -676, 749, -829, 916, -1011, 1115, -1230, 1354, -1492, 1644, -1811, 1997, -2207, 2444, -2709, 3016, -3372, 3789, -4291, 4900, -5668, 6659, -8004, 9935, -12954, 18379, -31112, 127546, -74657, -340130, 54444, 238985, 2855, -167110, 32292, 115048, -13960, -87381, -13658, 11488, 46006, 78131, -18916, -159732, -49504, 148388, 88763, -110371, -79902, 60413, 30631, -61914, -6896, 56034, 9113, -23910, 349, -30291, -39778, 66341, 106500, -42540, -125172, 9122, 106855, 14073, -53351, 8704, 31023, -24655, -23755, 15075, 6852, 10074, 35544, -24349, -93371, -2792, 108833, 20669, -99370]
123i9370Q0553R0528r6185n2967J35184L7055j61894l3084J64054J8500j49902
134f7528J7191J49479m8873j61097N2775J60189l3828j27522J7907P1354k6271
145C776k4816M1989k430m5884K0651K9314n1038j5831Q8446J9147j09022l2441
157g8139J02463L2884p7174r995O1683j7405n7704L2294N3990l0229l2284L0320
169A0704J736m2656J8710N7082k1139n7044J5814L5950k2388j3343L6241J157
181B0824m6058J088L5810j0833j5386L3812J452n9560J823P4427l022p4861J6500
194b3984P6844l4092q5504M4210R7554l6286r5374K1040P6187j2025n0498J1431
206a0497K9137j0632j4809p05n529J3213L2337j8793n9600J0118P1855K08o7771
$$ y = [-99370, -18817, 71711, -24474, -77441, 57743, 94798, -67096, -100180, 63874, 82374, -67528, -50337, 99142, 50269, -110828, -58053, 102136, 68308, -59214, -41307, 30047, 3776, -21040, 20949, 18519, -27365, -6714, 22600, -28438, -44269, 44177, 63324, -45698, -78139, 24324, 57208, -19966, -29961, 31722, 14317, -43387, -11093, 42897, 12668, -19616, 10704, 12440, -30216, -11506, 45576, 24437, -32607, -16793, 19157, -3231, -16574, 19667, 20824, -25234, -24146, 11664, 831, -14555, 19257, 20709, -38851, -37028, 37399, 34377, -40484, -23984, 52860, 18768, -66736, -22526, 75028, 38742, -56632, -35592, 40595, 28570, -21928, -10497, 18640, 8008, -6801, -7506, -13035, 178, 32515, 13722, -45878, -35760, 36095, 36303, -31468]
219c1468j528N7811n705n0407J3663M5657j2694l2598J2354J3074j8180O665L2896
232B9540j4285m3523J1008M2560o936l2114P479K0262j2021j3551R207M574k140
245F0R985m584l1367K243M6213O396n0203j1469M7310Q967m3111k530M2952J565
259B2427l8639k536K8071L327j2376M408Q11j4282L228J8642m397j6104P773R483
273I836j5161q647J9545P588j8968m495J3647m665j2936J5824J5724k1083j9095
286b2886K1209J8535j9233j1694K1078Q159k2021p125K0033Q206j1587m712K855
299H17l133K532R836m673j2432N306J0581j0485j2009J5393J3830j6939j6179
312a7555J3004J2642q717n887Q161k40r559M026R716m339n517P887J834j1594
$$ y = [-31468, -32996, 24815, 19110, -31297, -17634, 28023, 15329, -17269, -4915, 8159, -10021, -3356, 29540, 15255, -28268, -17260, 25300, 18364, -13750, -6271, 13991, 1970, -11581, -2374, 2200, 60, 10045, 5461, -25906, -23663, 22550, 28946, -21257, -32726, 14584, 23551, -19560, -22090, 20862, 22427, -16212, -18748, 9323, 12650, 274, 4682, 5493, -8789, -5561, 13081, 8684, -7420, 353, 9836, -5325, -13972, 5573, 13161, -5807, -10302, 3345, -1320, -14256, 1568, 17292, -3791, -22886, -1677, 16858, -2375, -14069, 7009, 15168, -6853, -13978, 6055, 14261, 2674, -2038, 817, -2316, 216, 10052, 5379, -7053, -1747, 8834, -1651, -13660, 1733, 15563, -1376, -17555, -4551, 8091, -626, -6513, 1648, 1408, -8151, -4125, 5591, 1252, -4265, 3622, 5456, -6138]
326f138l42J5682K574j4447l149R788M20o346L665M781n980n206M269J553m009
341b885L044M226p247p311P634P854o466n155O754J776p996K82J0194J363q694
356b627o91O111o43l225M721K399n426l111M006K074l049K78K251k599m236J977
372a790L056p73o76k90l607k054N567M855o182n702O435O172o591o062P662Q900
388H920n101j0153R85R969N084o255q444J776R212K185r873n885R886Q642r920
403A028j2628N631J4633j140j4224l797R532N883m580n438Q91L889K460k017m140
418d017J99P134L743o409p424M343J0161M57r523l413O177M970l493m700O24K868
434A697K39j955k355r24K500L636j169p157k406P586O859n498r664K767R997M81
$$ y = [-6138, -6480, 9202, 11776, -2671, -5820, 3968, 4388, -1958, 1707, 6488, 508, -4698, -429, 1124, -2885, 159, 4385, -2862, -10173, -2539, 5315, -1151, -6306, 448, 2224, -5772, -5490, 4704, 6067, -2627, -3318, 2793, 2150, -1075, 3646, 6045, 619, -2492, 1514, 3588, 539, 817, 3068, 469, -3767, -1790, 1266, 493, -183, -473, -4080, -6134, -567, 4288, -1894, -7596, -1161, 5011, -1580, -7642, 20, 8920, 3819, -6334, -5349, 4620, 9704, 3449, -4995, -3219, 5993, 8178, -1695, -7580, 2306, 10948, 1028, -11600, -5969, 8664, 7524, -6700, -10497, -965, 4918, 338, -5100, -4209, -320, 2140, 123, -4017, -3818, 3316, 7059, 650, -6774, -2431, 7730, 8187, -1336, -4749, 1428, 6398, 2905, -1795, -1171, 1697, 1936, -19, -2374, -3298, -798, 2838, 1669, -5488, -7894, -308, 6551, 1053, -8611, -5844, 4153, 4634]
450D634p257k022N777L169j391k676k178N3O795N449q949j2947P173J9877k709
465A2798k5195m385K5644J0708k4757j7075K0087K0863j3468k2922M463K1241
477H002M403j4637j0592N399J3236N294j0118j3961N578K1251J509k4069r663
490a8368K4899J7951k1450k4154J4243K6895o595k6004j124K0799N130j5131p206
503a0115P739O465k339l916k506q35M750P009m502j1652K381J5508J000j5495
517f508k674J5660L650j4059l116J4328J314j4212J223J5094m203j8114N889K1525
531A5797p057k6062M664K8414j841k8673k594K5687N571k0865p142J4176O883
544F958n959l558r64j516O982R999r066j7886Q692K4999m024k8895j524K8794
$$ y = [4634, -2623, -4645, 1132, 4301, 2910, 234, -1944, -1891, 4904, 10353, 1404, -11543, -4370, 15507, 12798, -12397, -16782, 8862, 19570, -5187, -22262, -2175, 18688, 5220, -17702, -13239, 8002, 12405, -2232, -12824, -7425, 5811, 11105, 987, -12974, -7396, 13855, 15364, -8705, -18368, 6531, 24482, 3032, -21122, -6879, 20016, 13421, -12583, -13707, 7092, 12222, -2909, -10115, -2376, 4089, 1750, -2166, -4672, -5507, -757, 6252, 1750, -9902, -7521, 7987, 8987, -6508, -9182, 6478, 10128, -3931, -7047, 7281, 8595, -5617, -4394, 10700, 6497, -11617, -5728, 15797, 8740, -17322, -12658, 15756, 13915, -14758, -17352, 8335, 13906, -6959, -14101, 75, 6958, 999, -2559, -3523, -5039, 1943, 11942, 2876, -15010, -6318, 18681, 14657, -14238, -15762, 13032]
558A3032Q219k6911j4041K1297J6801j3852j8446M846J5623K137j0603o537K454
571e981Q048M556o134j0310J741J5006M450j6401j0340J5919J6960j2420k0884
584a5790Q551K3054m175k2499J913K0380p74j8614J034J6124k918j4544M251J2648
598H641o840j2655P727J2301q356j1828P162J0343m941p380L706L045k145K272
612A052K811o694l167J1127O053j3786q962J4532J2709j3087j5045Q512J6103
625A2158m066j4823j673J1000N045o421q121L84Q111M711o377q766K599J0973
639D734K391j0247p110P709J1366k416j2933k817J4029Q370j1757j3178R586J5707
653A3434n506j6557J260J5249J265j2610l222Q230K705m505k359O51O6J890J662
$$ y = [13032, 21251, -5660, -19701, 1596, 18397, 4545, -13901, -9055, 6568, 8705, -1898, -8435, -5981, 2067, 6623, 489, -9821, -8080, 6926, 11376, -5025, -15365, 554, 17514, 5094, -15790, -7239, 15815, 11640, -10859, -8946, 11434, 10660, -7954, -6920, 9204, 6286, -8258, -4007, 8641, 1801, -10854, -3127, 9174, 818, -11010, -3848, 6495, 1554, -5826, -2120, 925, -1220, 1052, 3863, -2831, -5998, 5129, 11182, -2604, -11566, 2966, 15675, 2588, -12457, -3945, 12158, 8092, -6731, -8404, 2596, 7641, 1220, -6901, -6517, 1594, 6305, -72, -8838, -6239, 4734, 7125, -3122, -10232, -2523, 8843, 6427, -6506, -9323, 4706, 13076, 1319, -11859, -2273, 13434, 7928, -8629, -7369, 7880, 9145, -3465, -6687, 1543, 4248, -257, -2616, -1965, -1899, -9, 1653]
668A653l790l721M264N617l511n824L089N835j815m259K157K243j337j30J506
683A977j114k041L147K511m026l179L609L415m146l258K742K511k748j892J805
698f87M70j247K0O63n37m07J352Q4n97L72O10j81L38J347p10j400J635K262k390
717I97k289K630K700l150l372L161L340l649l846K661K964k478k910J273K502
732E34p23k045P0J110J256J8j831o02L083J843k951j956L361K615k715k808K472
749G31L213k468k527J719J497j439j143Q10K33j425j19R14o95r07K52P73n57m82
767a620O9P55N93L96q57p89J222K069j068j984J064L008p92k325jK365M6j890
785B61l80J047m2k58l57r08m71Q93R04k043j333J794J250j379j360Q91J702l71
$$ y = [1653, -2137, -5858, -1594, 4023, 512, -5312, -2223, 3612, 1797, -2462, -305, 1938, 601, 471, 1977, 863, -1178, 1969, 4480, 454, -2725, 884, 4299, 153, -3105, -363, 2148, -600, -2492, -687, -217, -1464, -1444, -781, -1318, -1725, -373, -289, -886, -514, 96, -85, 253, 1600, 890, -510, 1125, 3387, 997, -1292, 1338, 4038, 888, -2484, 677, 4017, 368, -3478, -817, 2147, -331, -3241, -1968, 534, -189, -2234, -2164, -1054, 202, 220, -1611, -2213, 870, 2713, -238, -2194, 1167, 3782, 1067, -1741, 731, 3944, 1476, -1051, 668, 2165, 726, -417, 393, 626, -799, -918, -4, -699, -1606, -1354, -581, -1138, -1620, -1551, -796, -203, 193, -664, -1453, -231, 1838, 770, -1214, -150, 2858, 2066, -259, -260, 2105, 2151, 261, -119, 928, 886, 628, 271, -637, -1108, -215, 689, -1354, -2687, -893, 357, -1022, -2382, -1491, 211, -160]
803a60m45M4L81N10R97o42j338J112K206j179k112L79L082j50l600j75K530N74
821B014k756j052J510J025j142j386Q8N93J385m90k419L71L008N85k966p32L379
838A015J488k738j193K474J236j458o38N65K73pO70j177j263O17J862q81k795
855a950N82K539n14k772L3J912l25o64l6Rp8J416Q00j984n35K105J502k310r03
874a173K188J198j668J29P27p20m21J382K54l012m75L609J6l787j292L635J210
891A800l373j059J746R42q29J63o34r16J794K701k405l196K882M376j784m873
907b665J813M058n24k972l59J675M15J18j104j924R06K693p46m087k2M269m24
924A120l571L32K831j592j419K477R69l647J91N130l80n948J090O554r12n822
$$ y = [-160, -605, -561, -180, 330, 1327, 685, -653, 459, 2665, 1486, -626, -247, 2835, 2685, -915, -1090, 1440, 2014, -742, -1794, -284, 741, -401, -1787, -1699, -1106, 279, -211, -2630, -2259, 749, 1334, -1632, -2364, 1015, 2503, -235, -1428, 1046, 2282, 824, 186, 751, 1024, 1017, 1687, 510, -753, -136, 1726, 845, -1950, -1368, 1171, 657, -2115, -2082, -170, -495, -1159, -1195, -1186, -1264, 152, 952, -1032, -1567, 538, 2040, -270, -1173, 1015, 2213, 545, 674, 1401, 681, 260, 1642, 1896, -1116, -1591, 2018, 2034, -1753, -3045, 590, 1800, -1573, -2632, -886, 56, -773, -610, -1244, -2160, -366, 2335, -70, -3266, -384, 3992, 2208, -2665, -852, 3206, 2682, -290, -649, 1026, 1441, 1559, 455, -1469, -563, 2130, 1384, -2703, -2725, 1544, 1120, -2451, -2119, 712, -880, -2299, 178, 1147, -2500, -2309, 2821, 2441, -3507, -2417, 4137, 3225, -2597]
940b597J177N051j767l155K617J257l725l5M834j367o880J704P975k338q664J298
956d615Q654n98p580l51N518J002k716j244K55Q63K482Q28m086j436M715K923
972D614l572m306K807M310l65l928k349K322M331m62o890j247P593L030q578m328
988g018P721M628p025m037O171K539n482J78M933k667m271N412M806p526m626
1003f264R060N226r837m652J0297L382r797k011R024k20q547K334P424m401p712
1018f694N785P123p056o775P139N891o245n167N179M056l390j908K198J44r50
1033f70K379M19l390m35M381J061m040k080K928K514p63l119k092K937M589l019
1049A600p300K034Q971j655r942L22J0267l33r304J042P604j581n380L588L304
$$ y = [-2597, -1420, 3631, 1864, -1291, 1326, 2583, -1142, -1177, 3657, 2290, -4590, -2886, 5089, 2751, -5913, -4615, 4039, 3441, -4139, -4490, 1028, 2030, -686, -1930, -1675, -812, 1670, 2498, -1588, -3024, 1691, 4614, 1042, -3264, -457, 3853, 3488, -440, -2789, -467, 3864, 3402, -3488, -4735, 2858, 5888, -2690, -7018, 703, 5331, -1694, -5731, 440, 2979, -2503, -2325, 2608, -59, -4330, 1082, 5888, -1638, -6264, 2796, 8022, -1815, -6467, 3830, 7212, -2585, -4596, 4428, 4208, -4339, -2005, 5419, 1018, -6694, -909, 6214, -842, -7617, -478, 5413, -832, -5999, -820, 3236, -154, -2062, 136, 280, -670, 1709, 2128, -1262, -1697, 2684, 3745, -295, -2375, 553, 3067, 2304, -815, -2907, 30, 4619, 1600, -5700, -3666, 5305, 3650, -6292, -5970, 4297, 3964, -5340, -4298, 3306, 1725, -3655, -67, 3237]
1064C237n251n17P309j129r056K607J0737l612j1554M545J1198n126j0253N299
1078a566Q337o376o162O334L742p063j849P155r6p507J921O949l120n752L792
1093a261N047m316l122M730K119m561kM049q32l409K128K296k103j546K131j62
1109A186k086J569Q50k925q98M090k95n142N99O278j678o366K380O032l090n141
1125d637M198L595m171j510N133l29n248K319N621l699n558N427M903o447m414
1140d817O937K977p250j645O623l46o012J174N473l364m278M437L130n543j887
1155d391O342P51o323P59O478j823n446L396M413l691l271M378J906m246l36M033
1171B929j211l812K562K624m015j986M503J002n226n65N608q84n574J972M415
$$ y = [3237, -2014, -2531, 4778, 3649, -5407, -2800, 7937, 4325, -7229, -2684, 8514, 3388, -6865, -1566, 6771, 395, -5767, 567, 4309, -2754, -4603, 2552, 2456, -5051, -3130, 3819, 699, -5053, -1261, 3786, -530, -3652, 1078, 3197, -1364, -1366, 2683, 1851, -1558, 570, 2866, 763, -783, 1348, 1186, -900, 669, 1519, -1406, -2304, 1786, 1491, -3651, -3052, 3226, 1548, -4818, -2438, 3594, 504, -4637, -439, 3156, -1015, -2525, 2608, 2279, -2969, -650, 4971, 1272, -4286, 1141, 6044, -403, -4817, 2120, 5097, -2153, -3798, 2825, 2479, -3533, -2359, 3114, -250, -4528, -91, 3039, -2504, -4391, 1951, 2702, -3621, -2862, 3616, 1793, -3653, -257, 4156, 465, -2806, 1572, 3478, -768, -1104, 2929, 1718, -2094, 468, 3092, -923, -2909, 1594, 2596, -2630, -3195, 2413, 1529, -4045, -2073, 2342]
1186B342k358l673L493K408l631r45M449o17l610J631M085k761l073L583K268
1201C591m317j197M363m0m413J083L927k377m135L510K991m591k450N068J375
1216B388n324k12M833o51m350K212L670l102k187L761J568l920m13M513m23m308
1232a945J577M022k517l324K868K438l724j589L714K63m243P97L764j722l911
1247c532L059K570l076k201L545J327l737K06L332p20k960K161K626k693j866
1262a959L614Q69l280l33L527p58l273J242L013k474k335K992J095l714o77L895
1278A444l29l543R05L228j742k899K448K146k467j236K847L61k660R32K903j561
1294G77k439K539J750k625j488K997Q64l193k79K661m00k886J317K085k039k056
$$ y = [2342, -16, -3689, -196, 2212, -1419, -2364, 2085, 1468, -2142, -511, 3574, 813, -2260, 1323, 3591, -726, -1923, 2440, 2400, -2013, -930, 2997, 620, -3515, -5, 2986, -1605, -4055, 1013, 2388, -2936, -3148, 1685, 1034, -3316, -1104, 2566, -536, -2723, 1038, 2606, -1314, -1727, 2786, 2363, -1945, -368, 3654, 1137, -2187, 681, 3119, -605, -2194, 1520, 1783, -2460, -1663, 2101, 379, -3532, -473, 2097, -979, -3180, 365, 1692, -2045, -1839, 1493, 773, -2187, -26, 2600, -93, -1959, 1655, 2524, -756, -1089, 2438, 1680, -1593, -351, 2662, 188, -2147, 845, 1940, -1774, -2451, 1444, 1115, -2428, -1523, 1705, -37, -2936, -488, 1658, -809, -2045, 802, 1163, -1497, -565, 2338, 777, -1662, 877, 2627, 2, -1486, 1511, 2375, -818, -1097, 1564, 1164, -1722, -405, 1680, -359, -2415]
1310b415K499J091k965o86L389K81l540P92L171j135k294J610K347k144j300K382
1326A083O65k166k3K219o00j899J085J563k041j082K103J86k162r0K059n95j964
1343a659P23J368j023j301J676M15j147j7J798m81j475J316J144j400j015K371
1359A293Q38k253n58K715m68k379O47J991j116k336J425J885j944j516J618J215
1375A057k090o90J584L71j505M00J105o02m82J027J000j513m94J362N93j278Q2
1392g3J154N6r80J08P13p00n9O53n38p79N17L42q44n93R29K10r59k99R97K6r28
1413a047M28J249j351k16J252M92j221n69J778O24j539n33J870K92j548p8Q91
1430G74L51j417K09O42l92j252Q58N82p70q46N19J250r68r85N24J140l35m48k62
$$ y = [-2415, 84, 1175, -1790, -2476, 913, 1194, -2346, -1554, 1617, 482, -1812, -202, 2145, 1, -1299, 1083, 1748, -418, -441, 1778, 1178, -721, 364, 1927, -114, -1196, 907, 1093, -1069, -1159, 900, 305, -1659, -936, 432, -591, -1892, -216, 199, -948, -965, 833, 352, -1123, 193, 1337, -63, -1078, 1293, 2131, -122, -680, 2035, 1567, -812, -165, 1826, 710, -1626, -201, 1684, -260, -1776, -158, 1057, -1033, -1723, -139, 232, -1273, -873, 232, -370, -852, 175, 1175, -338, -832, 530, 1123, -155, -73, 1081, 1137, 157, 265, 978, 278, 219, 872, 334, -445, 72, 414, -430, -1023, -94, 116, -843, -1142, -145, -119, -1047, -619, 630, -721, -937, 315, 807, -414, -983, 795, 1419, -120, -653, 1217, 1509, -39, -117, 774, 1125, -292, -83, 559, 167, -1085, -227, 355, -415, -1261, -742, 508, -460, -1445, -921, 219, -116, -564, -826]
1449h26J081J88q00J77R11j33j73L7N06o40j65P42M19j295m17P51P79j256j152
1468a266J064J094j251j299J083J050o47j686J298Q69n38r54Q77R17q14n53J441
1485F85L87j277k14J656J19j534n12K178P4k059m4J803J56k283M8J699l36k084
1503a538L38K119p87j899J003J652r52j942J442J776j056j687J478J440j060j142
1519h15J199J180j295p40J291N96j616j07J285J84j762n9J530J2k022q5J556L30
1537F62j815j74J222M37j082j98J279j20r32P8J376r5j085L65J105j62j287P37
1555C11J100n35j211L48J657r42j551M98J645r60j477L25J337q41j029Q96Q29
1572D00j242m96J333M84j074m84J502K62j300K45J029J47j206L37J395k53j081
$$ y = [-826, 255, 443, -357, -180, 731, 598, 425, 462, 968, 328, 163, 905, 1324, 29, -388, 363, 1142, -114, -1266, -202, 892, -359, -1658, -575, 475, -172, -1858, -560, 309, -229, -1183, -306, 611, -203, -756, 685, 1072, -205, -419, 1237, 1356, -178, -690, 1488, 1562, -497, -541, 1262, 1418, -865, -817, 882, 546, -1538, -1200, 919, 132, -1767, -764, 888, -64, -2006, -564, 1212, 156, -1531, -53, 1387, 327, -815, 384, 1564, 269, -471, 820, 1416, -200, -307, 978, 1162, -600, -659, 871, 883, -1139, -1224, 332, 662, -1153, -1327, -105, 332, -750, -948, 331, 211, -721, -643, 733, 638, -447, -82, 1023, 861, -426, 311, 1411, 876, -335, 13, 1670, 728, -823, -325, 1320, 360, -1117, -792, 545, -296, -1325, -429, 400, -842, -1338, -5, 479, -595, -1079, 423, 685, -615, -370, 659, 806, -400, -63, 1332, 1079, -2]
1589bK57Q38l75j416P44Q58p62j147Q08K11m46m52R3N37j65m13K88M68l58k0L25
1610a29L48J10m57KQ82m64k24O45J70o20m3L48M93p19m27K31N55q77n08O45Q3
1631D4o78l05J021J04r54j30R31kq38J01Q92J78o53J97P97l34o56N91M34k64q24
1652c48Q71N55r27j51K41K95k64n52L95N3o11j83M87K7m66J20Q9k94m4N71j10
1673b46J46j99K86L9M1M6L51k44K42K2j38j84N91%p88J25N41l68n14J79L01j59
1695G0o40M90M10p08n26N31L03o07j92R17J83j007L98R08j80q48N70R16l72p66
1715a50M21M57r8o31K63K29l97J23n0M4l28m70N78K5n24k94M58L8k71K3J03L32
1737a19n5j05k8K13M03j16l85O53J90m84LM46j1l16m1K37J3p42L42J34k94m78
$$ y = [-2, 255, 1093, 718, -698, 46, 904, 142, -1005, -197, 14, -432, -884, -791, -254, -419, -832, -544, -76, -434, -454, -129, 219, 329, -128, -126, 756, 292, 68, 713, 883, 263, 220, 568, 1061, 342, -85, 146, 701, -176, -684, -39, 44, -634, -939, 82, 186, -768, -898, 33, 31, -807, -706, 186, 364, -289, -92, 705, 371, -285, 306, 740, 476, -348, 523, 1078, 151, 0, 241, 536, 272, -280, 115, 168, -443, -626, -139, -112, -578, -458, -369, -663, -707, -136, -246, -100, -299, -13, 26, 67, 113, 464, 220, 462, 484, 346, 162, 753, 753, -35, 90, 631, 263, -251, -72, 229, 70, -570, -80, 330, -378, -904, -373, -70, -677, -869, 48, 231, -776, -378, 530, 350, -498, 72, 988, 616, -150, 271, 728, 630, -1, 262, 491, 94, 217, 167, 211, -117, -587, -9, 16, -508, -802, -344, -306, -577, -554, -451, -119, -174, -279, -307, -94, 309, 193, -192, 461, 651, 167, 170, 616, 605, 289, 248, 485, 498, -244, 98, 232, -62, -540]
1759e40J77M98n40k88N26O0l18l22N07L53m05NN73j20m36L77L05J3n93L88O18
1780H38m4m00j83J92R2l45J29J30n40p5N1P3j60l9J40r5kj26Ko1N56n44k40N68
1804h3q6J37k54O53r9j42k9J25L23j46j41J14L14o56k46M43J49o30J82L3K30q28
1826f37j93N17L7n03J0P92j99l45K39N81j78m79K17O40k60n22O24N76m58n01L97
1847C55J87l94m07P68k81K68q71L94n0k95j28K79N9l57j26L01J53k45l4L1M54
1868F1ql75K36N09p7m11M21L58l44m25M17L46l02m98N68J35p32l10O53N0q30l45
1890i03Q08L06j032j77R38Oo17r9J170j30j029O39O39o1p15M20M93j14m51K65
1910C56K84j40p70O32L17p73o9J85K27k30m09Q0K98k91j36lJ65l8k39L68K47j35
$$ y = [-540, -363, 135, -405, -693, -167, -107, -425, -747, -240, 113, -292, -287, 286, 166, -270, 107, 412, 425, -168, 220, 838, 794, 394, 211, 403, 495, 150, 279, 409, -131, -206, -155, -82, -242, -281, -141, -236, -238, -364, -362, -423, 133, -411, -651, -83, -169, -32, -286, 367, 268, 126, 97, 222, 545, 399, 258, 372, 686, 30, -216, 227, 376, -254, -72, -39, 191, -637, -830, -313, -276, -779, -769, 23, -176, -521, -282, 299, 121, -358, -141, 499, 239, -283, 341, 917, 459, -42, 355, 542, 148, -259, 509, 228, 496, -375, 19, -31, -326, -454, -175, -116, -473, -599, -298, -145, -390, -424, -393, 61, 53, -322, -86, 423, 346, -65, 356, 714, 370, -55, 362, 708, 406, -92, 476, 611, -121, -431, 222, 272, -558, -903, -95, 211, -821, -998, -60, -54, -671, -770, 400, 270, -759, -120, 519, 458, -257, 163, 656, 542, 91, 356, 640, 500, -270, 362, 679, -94, -163, 22, 249, 19, -390, -310, -12, -303, -439, -442, -277, -315, -554, -186, 61, -74]
1932g4l03J31J037p27j95M33L36j1o17K48L02p8n39L80N65q72m67Q14J12n86n31
1953f42P43M16j262O7P40R7q42J21P40mq92L54N83mo98N90O40n29m25L42N16l50
1975C01k74K74M54n95k42M80j77j99m19L35K19m13l19J13J99j55q0J34M16k76
1995b24m61N1Q61K94j104O34O65m57m42M42N66n88k58M20O19p56m86M28P09j304
2015c91k62R11J96r43k04P58j35r64L90O19J28q44M03O71m04l86M01P18m57l89
2035a84M63N25n38j73K49R8k21QJ89J73m44m17M28j12k91O0q8L7k1o4J80k33K26
2058a50o1r3J93K20j62r6P3L73m15K52L74k05l18K84N02k63q29N49N73p29m98
2079d26R10q3q69k87J002k18q38M05Q36p25n18M86N60k46n28N41N30r21J13O06
$$ y = [-74, -377, -246, 791, 64, -131, 302, 638, 627, 10, 258, 560, 482, -57, 323, 888, 16, -451, 363, 475, -111, -642, 101, 517, -745, -678, 62, 159, -683, -562, 178, 174, -718, -364, 219, 215, -483, 107, 747, 218, -207, 135, 651, 301, 27, 301, 755, 160, -82, 398, 221, 22, -397, -62, 157, -256, -575, -462, -263, -418, -498, -364, 52, -224, -685, -634, 227, 521, -583, 51, 716, 259, -183, 259, 825, 237, -21, 399, 1018, 262, -224, 204, 913, -391, -653, 258, 454, -489, -693, 65, -70, -1034, -644, -25, 103, -741, -338, 333, -71, -457, -56, 662, 205, -184, 279, 804, 266, 93, 342, 440, 219, 227, 416, 589, 145, -272, 156, 44, -247, -187, -275, -238, -259, -323, -143, -376, -150, -211, -304, -111, 109, -53, -149, -76, 297, -118, 134, 508, 303, -15, 269, 771, 508, -321, 228, 801, 72, -426, 484, 401, -468, -755, 247, 29, -809, -404, 432, -293, -811, -325, 235, -11, -539, 2, 532, -389, -276, 330]
2099C30J69m74j58P09k87l75N54L6n72Q5K73k42l22L15J94l96l07O41l82m70L17
2120c62L65k15n72M68M04m84k8O12K03m84k50J039j15j024O32N04m77o23O46N76
2140H15p67l98Q26o9j065R1J180l97j223O65J052j132k81M79L10m88k01P05L79
2159D81q86J74O87j27o47N49M71o73rL98Q5m97J23L02q2o14N04k28k94P3K35k98
2181b73o68N46O26q26M2O10L04p45o4Q39o7r27K64J148m85q21Q14O67p64q29J146
2202E37L57j113j95J072k13q93K90N60l33q02P81J35n89m22O76J90o55k45J106
2221B44k3r13N26M35l29r0L55L12m07o0L84j45l99L25L32n51l99M98O25j036j11
2242d27Q31o21n30M29M49o84k01O97K45q57J67P02m7r52Q01P08n27o94R35L58
$$ y = [330, 499, 25, -133, 576, 289, -86, 468, 504, -68, 17, 290, 48, -274, 41, 235, -161, -468, 173, -209, -679, -362, 3, -212, -784, -316, 88, -396, -424, 188, 391, -93, -343, 696, 581, -443, 189, 693, 216, -407, 239, 815, 48, -350, 476, 407, -658, -567, 613, 216, -1007, -342, 710, -422, -703, -224, 86, -402, -603, 102, 481, -405, -231, 456, 329, -318, 231, 702, 29, 20, 418, 503, 6, 129, 431, 349, -265, 239, 11, -283, -210, 25, -273, -941, -395, 231, -595, -553, 57, 361, -384, -448, 391, 324, -603, -339, 809, 324, -497, 317, 984, 220, -609, 537, 894, -219, -414, 658, 445, -448, -158, 402, 69, -733, 48, 183, -406, -828, -152, 38, -617, -862, 244, 221, -692, -166, 269, -60, -150, 205, 517, 110, 50, 434, 289, -110, 215, 547, -4, -403, 95, 720, -316, -427, 404, -217, -747, -318, 131, -553, -754, -57, 188, -669, -502, 200, 153, -799, 2, 710, 183, -511, 424, 782]
2262G82r84r3R88j7r50L0Q30j91p12M44K52l43o50P17J17q14q2Q69k66o14M41
2283b46M18m28j43M55K25m13l21Q11J4n87N71P8m47k11N90L13o46q7P62l79q70
2304e41N35M50n00m61N33J80p00p2O07K45q59L7Q91m34m80K22P42n19O1O06J35
2325F78r21K05N49P8n80O4N05m31l03M04J73o12j15M73l7m56j55M53k40K7J25
2346a16J30n92K37M02R9m99Q2N69m61j89Q54J05n43j04N63K58j028L99N46l19
2366C93p67M30M75p83m35P03N08j295K64O49k18o03J51Q83n49m10N54J99k1n54
2386d26P26J26k49j01N15l06k72L18J30q6m17L27J15m10L50j65L9l94o3J42k13
2407c14N7K78l75l42O98J67o15K96N09l67l09J39N94k62l79L70O70o49n14N35
$$ y = [782, -202, -295, 693, 676, -274, -244, 586, 395, -317, 127, 379, 36, -614, 103, 220, -594, -676, 193, -73, -687, -246, 172, -256, -399, 56, 281, -132, -453, 358, 372, -215, 356, 434, -13, -224, 366, 679, 33, -54, 708, 329, -541, -6, 444, -56, -517, 16, 196, -504, -576, 31, 276, -583, -546, 345, -89, -569, -347, 395, -124, -63, 543, 678, -243, -38, 511, 589, 9, 73, 578, 147, -156, 248, 421, -191, -306, 167, 130, -326, -481, -28, -268, -241, -116, 14, -578, -341, 61, 160, -339, -257, 312, -149, -338, 516, 621, 78, -26, 537, 795, -233, 166, 712, 393, -374, 56, 531, -252, -687, 16, 524, -771, -507, 142, -76, -679, -528, 355, -194, -604, -50, 149, 128, -426, 300, 426, 177, 76, 591, 285, 13, 331, 461, 375, -42, 285, 400, -10, 340, 175, 214, -180, -243, -101, -314, -257, 21, -354, -696, 2, 169, -446, -150, 359, -8, -317, -178, 416, 154, -225, 145, 815, 166, -348, 187]
2427A87M72n61m24P89O6p81M6N31j76p18L69K88k42o49M30L86j30m69M21L58m78
2448b85P8L58J86l82O5J51J03j83LJ60O7k36Q2K37k70j51L35l68j28j1Nk4j61
2471c69r1K08K93R5l88l31K97L10k62J53N1L05k12l79M61L77p17L18J50J14m65
2492h2j97O64l6n16K9L99l05l39L16M15n63k37K37J35k46J73p7J27l47K43M88
2513B81m73J94j29M67k20J48j52R1P6m1j36P0K5K9j9m33K75q8j16o5R0j71Q3J47
2537f7P2k14j5o7k4j30M11j83J5R0J31J51J24k88O3L09k01j94L96k69N0k42K01
2560A19J98l09o2K04k31K6n0N7k28k02L03J8N0j38J76N1J2j89M31j83N6k88M09
2583B30p0q9K32j87K77o2j92R4j43J2k7m0k30R2K35k1l19J2J74k02q9Q3L04k86
$$ y = [187, 659, 98, -326, 463, 529, -252, -206, 325, 149, -569, -200, 88, -154, -803, -373, 13, -117, -586, -165, 193, -285, -207, 151, 337, -45, 20, 171, 274, 91, 94, 254, 321, 85, 167, 404, 134, -17, 318, -50, -178, -189, -184, -208, -369, -460, -252, 41, 136, -252, -583, -286, 24, -238, -85, -34, 271, 59, -320, 141, 518, -199, 119, 269, 383, -82, -279, 385, 349, -167, -138, 261, -44, -383, -67, 348, -215, -452, -215, -80, -326, -153, -230, -103, -450, -207, 281, -192, 2, -127, 340, 120, 268, 116, 207, 283, 242, 106, 176, 201, 230, 211, -222, 53, -35, -151, -216, -126, -297, -214, -67, 5, -209, -224, -291, -315, -445, -34, -217, -202, -112, 19, 170, 294, 6, 69, 378, 177, -17, 379, 110, 160, -82, 119, 317, 8, -54, 150, -81, -55, -105, -48, -276, -478, -175, -157, -107, -245, -69, -18, -6, -195, 236, 53, 109, -179, 230, 160, 71, 303, 116, 393, 331, 139, 233, 90, 102, 75, 35, -195, -103, 132, 111, -208, -196, -22, -224, -313, -230, 74, -212]
2607b12r3L80m1Q2J1k63L60r1j83J82L31j41j98K60j78j34l59L54K23k14l50M10
2629A36K3m28n0L75k26m15J75J08J77j93K6L11k10Kk0N10k02O5O6l02K61j28L3
2652I4R2N4L39l98k45L61l90K44k4l05Jr4L17k73j19Q1J01J4k41k3O46l80Q8n
2676f5J57O5l12L85N1k40J31K03K02m63j02L18k9m11N1K88L0l54j28L64k42l88
2698d89K65L14m32L9K95Nl27K28j21J41N7%l2M44j64k51K17j48L32j98K26k75
2720A26n5n0Jl0K6k59M9K48j37j67r9L26k54j49L13J41k57mK03M42m86k08J74
2743a06N57n46o3M62K25m87K5M2M7j65QL03r2l83N6K59q7n75K68L60q2n78K53
2766b99K70M1m32M03J56j77M2J61m37L82j37J73N4k21Q5L20k53J33J2l28J2J25
$$ y = [-212, -305, 75, 34, 116, 127, -136, 224, 133, -50, 132, 463, 322, 124, 384, 206, 72, -287, 67, 290, 76, -274, 136, 159, -269, -319, 56, -170, -585, -410, -302, -125, -318, -292, 19, -191, -189, -209, 301, 99, 164, 230, -72, 189, 61, 94, 186, 240, 579, 181, -64, 297, -93, 151, 127, -178, -177, -271, 46, -227, -346, -265, -164, -150, -391, -414, 232, -148, -60, -65, 92, 157, -155, 230, 281, 41, 172, 375, 577, 114, 12, 330, 301, -110, -59, 229, 259, -95, -223, 141, -101, -489, -224, 90, -342, -303, -8, -3, -330, -102, -223, -82, -25, -25, -57, 387, 223, -28, 189, 41, 373, 175, 401, 126, 71, 21, 22, -8, 18, -241, -192, 56, -81, -248, -347, -21, -275, -424, -111, 30, -227, -231, -28, 414, -72, -280, -106, 451, -95, -158, 304, 529, 42, 67, 109, 156, -9, -1, 302, 210, -173, -117, 142, 55, -520, -252, 108, 26, -552, -299, -29, 12, -420, -17, 139, -38, 4, 165, -272, 110, -27, 146, 200, -21, 64, 384, 131, 264, 276, -52, -40, 85]
2788H5j77K10K03m26m64M63O4k41k76P37k61j58r0K92K43l05j1O6K80j23n3J12
2810A70K26m99J48K70K0k64K2K60k95j81J38Q2r1k97K79O5l46J0J52J98j06k30
2832b69K79L2j25K12J34l37n4J58r3L92k36J31N9oj92M27k65k80O7j27J3Q1pk63
2856b69m4K67l80K58l9J60j86j52M68l8k04Q0K12K79m47o9M47j39j10l13M95j91
2878H5k07K68L33k95j66J49j64P2l18K50J21l56j53L98L9l04k02M20Q1j65r3L23
2900A16J10j73q3L46k61l23N48O7k14J33n7o7j92J9K6J05n6Nj8j2J10k87k17M03
2924B8m5n9k95L84j09j43Q1K92j00m9QL77j99l13M38J47k17k81K81K26n25k8K06
2947A05K20m32n6L70k66k58J42L84j83m30J89M83l42j19l4J3K68j46J83K06k83
$$ y = [85, -92, 118, 321, -105, -569, -106, -42, -283, -559, 178, -83, -241, -331, -39, 204, -101, -112, -46, 234, 111, 58, 170, 396, -103, 45, 315, 335, 71, 93, 353, 58, -123, 15, 97, 6, -291, -12, 53, -293, -283, -131, 67, -39, -269, 10, 42, -83, 129, 263, -74, -128, 30, -63, 329, 93, 224, 283, 277, 85, 512, 247, -33, 34, -93, -80, 1, -6, -269, -313, -46, -426, -168, -207, -47, -233, -385, 83, 45, -159, -79, 133, 412, -35, -104, 343, 204, 94, -219, 276, 85, -122, 146, 479, 184, 18, 167, 3, 75, -243, 7, 128, -228, -381, 17, 56, -248, -450, -30, 51, -114, -207, 116, 226, 53, -30, 316, 55, -268, 280, 347, 133, 266, 209, 142, -50, -31, -5, 100, 44, 49, 31, 19, 129, -158, -375, 28, -17, -76, -371, 13, -96, -239, -158, 134, 34, -15, -7, 370, 171, -142, 296, 443, 226, -55, 226, 452, -73, -101, 105, 325, -107, -163, 207, -59, -317, -175, 209, 26, -404, -215, 268, -74, -193, -227, -214, 54, -92, 91, 297, 14]
2968A4k56L87j23L2J30P5k6J80k49J58k30q6n8K23k01j9j62P6R7j25L1J47k98
2991b83L36k46J7L74l99m3M76j93n9K52j87K81l88o7K57J70l70K83j37J45m12
3012a93K81o7n0j31k29M42r6m27N14l34K9q3J71N7L23o6m0J52m14K29p7K64l05
3035e0Q8K20k71j20K41J48j15l15K97K25l12J33m29L11J8j79k09L47l70N2J57
3056a33%J72j28J22j82K17j11K9J88j99J12M9q4j42L88Rk28lq4J27j85J26J1k69
3080a98Q6np9J26l03J63j49M31q1n0k83M49m1k54Q6m5K51Q5k21q2j89L70p8mJ06
3105I1m0j02J04k75Q2L04pj06j03J16o0k30k2M9mk05J89L71k37lJ9K18j37j95
3129a83L91p3k52J33P0P3l31J57J50l7j14K41k35k38Q3K45N4k51j32J93m41M39
$$ y = [14, -242, 145, 22, 54, 184, 259, 233, 413, 164, 322, 92, 6, -52, 171, -30, -49, -211, -135, -38, -163, -132, 15, -283, 53, -193, -176, 198, -201, -244, 232, 39, -20, 232, 45, 326, -62, -129, 128, 298, -72, 211, 74, 219, -193, 88, 21, -29, -160, -389, 53, -43, -470, 44, -290, -261, -344, -173, -116, 207, 141, 101, 253, -161, 68, -9, 255, -50, 38, 258, -13, -133, 108, 256, 141, -174, 123, 348, 36, 169, -260, 51, 69, -110, -319, 28, -342, -290, -133, -133, 39, -89, 33, -149, 68, -43, -14, 174, -25, 87, 136, 52, -90, 298, 307, 79, 76, -8, 119, -66, 60, 71, -198, -112, -117, -196, -70, -373, -210, -359, 72, -9, -59, -342, 107, 66, -188, -102, -147, 104, 189, -32, -114, -303, 67, -11, -15, 91, 51, -51, 53, -222, -140, 164, 157, 51, -52, 64, 4, -226, -248, -199, -203, -408, -219, 152, -85, -88, -69, 149, 12, -183, 208, 135, -117, 16, 86, 159, -172, -15, 135, 98, -16, 225, -10, -248, -165, 80, 134, -117, -249, -56, -497, -58]
3151e8j94L42j86N4J22k90l8J5M53L0m1R8O1k03m8j17J72K02j99P6m75K69K30
3174B75j20k00j35K28j41o6j08L48k17k26M40O8m97L49q8J95m39K88M03m69q2
3195a94K46K71J32k64j40M30l77j11J15K19m93J90R6p0J26j29J74k74j11M2R1
3216c1j84J09J65r4o7l3K20r9k07L45o2k37L94Q1P6n92L56K08m02J3O8o3J7q9
3240a08J42J26l13K80j68Q6n7J07j23j56o3N43k78q3O4j17K1j60J14K38M2K8J06
3263B71J18l93K3n1R6j24J91k5j4p5O5l33J17Q7r1J34k22J26J00j25pK03n5r0
3287g4q9J27K48j50j40K03m46O02k05Qkj82J42K84l14Q3Q3j54k75K88J10m13J53
3310a13j19J23j92K17J84j73k42K72L04k48j92M79k25l2J59k3J87k79L4p9K37
$$ y = [-58, -252, 90, -96, -42, 80, -210, -248, -233, 220, 250, 209, 307, 368, 165, 117, 0, 172, 374, 175, 251, -224, 45, 275, 155, -45, -180, 48, -93, -159, -267, 81, -136, -362, 78, 146, -351, -2, -90, 105, -334, -46, 357, -112, -194, 52, 323, 455, 191, 51, 481, 104, -7, 108, 327, -166, 24, 120, 50, 176, 47, 221, -53, -164, -122, -31, -215, -106, 59, -35, -102, -135, 85, -14, -221, 124, 62, -175, 219, 300, 376, -216, 140, 348, -54, -41, 27, -36, -19, -108, 34, 160, -153, 127, -41, 45, -12, 95, -28, -184, -247, 296, 18, -65, -1, -118, -97, -257, -143, 95, 137, 165, 271, 389, -4, 19, -32, 64, -60, 131, 106, 92, 17, 82, -251, -134, -47, -138, -4, -226, -100, 0, -125, -132, 71, 16, -74, -163, -36, 212, 62, -78, 125, -321, 281, 76, 84, 82, -100, 42, 326, 12, 95, 178, 24, -251, 37, 147, -266, -113, -232, -109, -301, -84, 100, -73, -315, -43, 261, 13, -179, 300, 75, 43, 202, 179, 366, 87, 121, 42, 279]
3331B79p6j21N0j0k9Rj14j04j44N19k16j02j96n8M51n97K97J3l2o5K57R2j59J2
3355d4J30k66Q4K76K8q1m2j04J24oj41J84p7l84K07K57l63O8J27j23k02M0N40
3378B32n35O7J92Q7k07J09OM94m01j68K29J66k31M2O7K4r1r1J80l19J56L29k67
3401G0j21J99j30L18l70J21p8Q2k74K3J38Q4l9K5n8K84m56K04l4J54Q5k21O9K47
3425C22K2k82m0J80N9l00J73Q3k07j39jM15l06l64L73J31l65L4L11r8j11J22K01
3448B13p5k65j35N63P8m61M8K99k09j49K09L03k13k05L41N9o62L9K37J9m36J67
3470b35J17O0k27R7n7K05N0J66k58K21m0k96J9K60m0J29O9P9k32r6K36j50J81
3493B58l75K95l35jPJ97J64m92L28m14K47J0P5Q5J82m74P5J75O5l86K66m8J52
$$ y = [279, 203, 82, 132, 122, 93, 102, -12, -116, -260, 259, 43, -59, -255, -313, 138, -459, -162, -149, -181, -246, 11, 103, -56, -44, 86, -180, -96, 180, 208, 127, 85, -19, 105, 99, -42, 142, 65, -319, -112, 145, -218, -150, -23, -146, -348, -308, 232, -303, -236, -44, 43, -164, -55, -49, 445, 44, -124, 105, 271, 40, 82, 149, 173, 82, -9, 171, -148, 8, 337, 70, -51, 148, 18, 336, -34, 87, 9, 91, -183, -160, -22, 62, 23, 48, -10, 274, -182, 22, -12, 142, 227, 6, 75, 322, 344, 62, 22, 202, 261, -39, 134, 217, 10, -129, -130, 285, -21, -385, -12, 119, -246, -212, 99, 1, -110, 12, 213, 138, -127, -262, 301, 379, -82, -34, 265, 56, -93, 116, 419, 206, 1, 342, 401, -261, -222, 15, 34, -402, -235, -118, -58, -285, -188, -245, -40, 10, 176, -82, 139, 99, -197, -178, 82, 42, 171, 240, 319, 87, -9, 227, 77, 258, -117, 178, -157, -158, -151, 46, 210, -282, 46, -368, -121, -111, -36, 49, 231, -243, -168, 7, 72, -314, -48, -96, 56]
3516E6m52N02P1N7l07Q2m1j30K22J74l7n2m0J09k65J6k39J59J01k69J29O3O8j2
3540c5K7J1J75l45J88j96K30j01k2K79k3J8l19J59M7J27k34J90n3j97K1K15j72
3563a0q8q8K49j74r5j26qJ56J20l6N1M4l6K06j02L3K85m39J8J60r6K62k63o3J03
3588F3L0J04Ok46k7p2J83j1n7K13k40K14j67k68L47p6LK25o13K50Q0O1j99K04
3612GJ27o0r3Qj3K26K7j05q4j91J73j34M1Po7J61J41l31J5p7J81M1J14k35j01
3637b22L29r6J08l11K1oL82j71M5j67K83j85K04j97L07n7j66O9kl35m1O4J15L9
3661A0K8j44K63j32j22L11k92J38l36L40nj92QK02k15O6P7J93q1j91J30K98l5
3684C19n73M25J35k33j09K21k73J72n4o1K6k9j07m9P6j11J93O6Nk79L72j01K8
$$ y = [56, -396, 106, 177, 234, -73, 9, -32, -162, 60, 234, 197, 145, 105, 214, -51, -35, -274, -115, -14, -283, -154, -91, -23, -35, -8, 3, 178, -167, 21, -175, 55, -46, -68, 211, 188, 206, -113, 46, 93, 220, -14, 176, 123, -74, -53, 162, -10, -98, -186, 63, -111, -206, -332, -340, -184, -64, -100, -49, -5, -41, 165, 63, 96, 381, -58, -40, 120, 24, 286, 23, -40, 63, 93, 197, 203, -43, -70, -142, 41, 30, -27, 186, -54, 160, -7, -275, 72, -4, -1, 224, -389, -139, -59, 2, -197, 7, 134, 74, -19, -11, -24, 202, 229, 124, 40, -151, 22, -112, -71, -64, -131, 30, 171, -160, -145, -222, -41, 0, 114, -121, -222, 107, 11, 119, -192, -171, -177, 205, 34, 79, -88, 195, 10, 214, 17, 324, 267, 101, 170, 168, -167, -208, -144, -29, 10, 38, -106, 157, 25, -97, 214, -78, 60, -276, 64, 59, -133, -125, 77, -138, -72, 5, 198, 117, -74, 56, 354, 319, -254, 171, 306, 73, -36, 185, -88, 84, 30, -31, -5, -34, -141, -190, -114, -225, -32, 34, 39, -240, 132, 31, 59]
3707E9j07L1j1l8r6R6qK37l28K90ol2j4o3R9j65J44p4K24k02r7m7J24L1m3m8K78
3734B34k72k63L82j02r7k78L95j3K7J50j23J06j39K35k09J69l33O3L5J67n2j36
3756e4J95l55M4L45L3l47j76J02L10q5j2K56l18k4L44Pl14k12q9K58K97L9l5k00
3780Ij81J67K2l4M7L8M7P7j49O8j26m8q6N3Q1k00j30N34l10P0j91K30L6k10M80
3805B94l52QK12j36J02J5QJ62l8k10J21k95l0K84J5p9k25r2J84J11l98L42n1J12
3829F4j3J03k04O7l0l52K93J63O0j98n3K39o8k17J86K77j57q2P8j03J47k7l13
3852a40L36j97J1j69L34k66o9K75l8m73J20L73r6j06J4k12L78R5j46O0k01K76
3874A59l4j2j98J58K91l09j13j24K59k45L81j53J80k35q3J55l22J40J39n2J3J1
$$ y = [59, -48, -17, -28, -66, -162, -66, -74, 163, -165, 125, 119, 87, 73, 10, 109, -56, 88, 14, 238, 36, -61, -108, 16, 47, 4, -44, 234, -38, -301, 81, -21, -118, -396, -1, -14, 13, 163, 40, 146, 7, 242, 33, 202, -131, -68, -33, 134, 82, -54, 141, -214, -170, 175, 208, -139, -315, -213, 97, 12, 0, 256, -62, -86, 258, 265, -49, -261, -350, -92, 205, 244, 209, 9, -172, -5, 17, -17, 30, 68, 115, 192, 43, 111, -15, -63, -149, -96, -15, -215, -345, 189, -121, -51, -242, -12, 24, -186, 294, -58, -50, 162, 26, 128, 143, 151, 313, 275, 65, 186, -109, -139, 145, 160, 81, -144, -236, -52, 59, -339, 3, -48, 64, 51, 154, -50, 17, -13, -365, -72, 91, 151, -47, -100, 139, 71, -146, 40, 317, 160, 78, 156, 53, 200, 173, -140, 196, -1, 10, -159, 175, -91, -160, 115, 77, -396, -276, 97, 1, -105, -91, -303, 75, 170, 24, 84, -117, 159, 125, 113, -85, 73, 364, 55, -58, -182, 77, -168, 213, 60, 240, 5, -78, 77, -245, -105, 34, -18, -5, 6]
3896Fj02J53l2n2j21J48J81j13k07J11MJ64j65K60l33J72k69l4M99j26k55J59
3918D8J63q6l31K14j54K41q9j82J48m51M45O1k3QM7J86k26j18q1K68J7N7k9L04
3942D37k90k30K29K65m46l3M37j34l41j50J71PJ4K05n7k63J4m6N01k84j8j5P4
3965D7r0J78p5O4j32O9m3l6K22l07J70m3N2mP9O3O8l51j89K34k44K92l44L03N2
3990C5j90l7K77J12j52p2R6l19J98K42O0j30k49K18J34k79K81J5k31N5l55L84
4012I3m0l4o5J93j01j80J35N1o3p0K5k7j16K84m13M75j90LJ90j61l3K88q5R8j19
4037A38j8n7J69k60q0M1P3O5m5J0j41L09k15j01J29j32N9l3K70k99j11L89p4Q
4061I4j16J59M3j53K20J48l28m7j4J08R2j54r9N13m17J68j7o6j49k73K88M7k73
$$ y = [6, -96, 57, 25, -27, -148, 0, 181, 68, -139, -28, -24, 140, -25, 235, -98, 74, -195, -229, 270, 144, -111, 48, 211, 125, -206, 8, -146, 95, 6, -176, -28, -479, -34, 27, 4, 12, 59, 245, 19, -99, -180, 88, 105, 162, 133, 437, 147, -83, 146, 411, -35, -68, 369, 235, -106, -256, -85, -78, -64, 141, 84, -179, -165, -211, 290, 6, -12, -27, 47, -43, 135, 60, 124, -8, 61, 18, -18, 204, -103, 67, 24, 76, 72, 151, 214, 282, -69, -258, -24, -268, 24, -320, -17, 35, -155, -192, 85, 197, 45, -27, 69, -250, -52, 190, 250, 120, -129, 89, 223, -56, 225, 240, 9, 64, -291, 93, 53, 19, -46, 147, 46, -134, 1, 52, -11, -81, -56, -83, -199, 85, -328, 147, -43, -40, 150, -11, -44, 244, 159, 257, 138, 120, 63, 232, -28, -108, -67, 6, 71, 26, 36, -105, 204, -11, -112, 17, -115, -56, -89, 181, -118, -229, 160, 86, 94, -22, 137, 180, 27, 247, 395, 67, 20, 6, 114, 206, 52, -47, 466, 49, 217, 200, 134, -15, -288, 0, 47, -226]
4084b26R5J95j90R4j93M05j48j45r4l1K83j65J41M0j42J31M0K27k50J67l21Q5
4106bK21m72L59m8O4j08k39L61l89K88l7m6J49p2p7m6k9j38P4J69J65j80J69j26
4130A0j76m3L08r6o1J11K43o7j99K6j13K0K50k79K79l89K09k69J29j7l5L60k32
4153c1J15j08K83j77K4m6P0P2l85K95J47p6k39J15P9k22Q7oO6j16J01m6J00k54
4177a52M75m05jk19K36j5n8l2K06Q8j97k6K11j34K41l35J20J39o9j20R6M1k1m3
4201B6k07N55m49k27L91n9j70J22j00p8K30k09J76L0J63j08J71j31o4j64o7K18
4223D9k05N1L37q2k95K40J63k34J74k88q5J31R8J55j04J5l49K36J67j20k46R7
4245i5k0L3j44NJ51j71L17j26p2K40k59K11K9R9j18QR5q3p1L02j68L1j06J55k23
$$ y = [-226, -131, 64, -126, -32, -225, 180, 32, -113, -207, -238, 45, -120, 21, 61, -81, 50, 90, 317, 67, 234, -87, -2, 219, -253, 106, 58, 122, 14, -225, 136, -253, 35, -2, -48, 101, 29, -48, -94, -123, -261, -187, -18, 147, -33, 136, 10, -166, -209, 99, 3, -58, 53, 296, 229, 30, 56, -57, -37, 213, -66, 213, -176, 33, -236, -107, -124, -159, 201, -31, 84, -24, 259, 82, 106, 60, 130, 202, -183, 112, 259, 183, -56, 59, 138, -84, 3, -3, 63, -53, 48, 2, 102, -152, 323, -82, -83, -302, -66, -81, -139, -171, 35, 123, -74, -100, 111, -23, 218, -117, 3, 142, 73, -47, 49, 90, 69, 26, -181, 374, -75, -302, 89, 30, -140, -18, -118, -196, 34, -175, 1, 31, 194, 86, 257, 126, 62, -102, -169, 49, -156, -105, 232, 150, -145, 95, 258, 24, 198, -90, -175, -44, 54, 209, 105, 120, -229, 7, 174, 54, -192, -95, -115, -82, -226, -221, -70, -241, 76, -50, -122, 118, -141, 70, 99, 198, 80, 88, 183, 100, 29, 331, 163, 194, 88, 243, 20]
4270B0k6J52J29j83j62L4K96k05j27j7J33l27J95Oo3J75K6N6k75K82l41K82k02
4293a42L51q0P8k94l7K84o3R1k03n9K62k39j9J57j59P0J52k93J24M3J04j89Q2
4316B1Q0j08O8k22N2L6K81j7J70k33M7k43No4L32l9k00J10K9Q5l15K56j82P1Q8
4341A08j71j32J03J79j82l3j65J94P7j27p1J15J70j5qj02J85k27K95J08k13j37
4363d9O2o1M4J51j90n0nJ69l6J75j25j82L9J74r6j48K56k46j47L06p7J15J62k84
4387d3J22k6J24K2j04R8J71q4j10j28o3jL23m52K07L7qJ51n01J85q7P0J1k2P3
4412c5K55k30M3j10L1J38j7j8J30j63N8lm1J16j66OL9k26L35k87K33Qo8J12k20
4437h0K31j32M3j84K24j10P6k83K88k95J27J35LJ22j55J15j80m5J87O3n77O92
$$ y = [20, -6, 146, 275, 92, -70, -36, 260, 55, -72, -89, 44, -283, -88, -82, -145, 30, 56, 112, -163, 119, -222, 60, -142, 209, 129, 207, -87, -124, 160, 97, 188, -15, -74, 188, -51, -70, 87, -72, -2, 150, -143, -19, 24, 128, -61, 21, 101, -7, 61, -161, -109, -73, 208, 191, 361, 128, 175, -68, -63, -127, 205, 166, -34, 76, 105, 190, -125, 131, -51, 20, 108, -63, -195, -92, 87, -95, -128, -293, -99, -22, -149, -220, -105, 65, 50, 42, -60, 125, -102, 193, 301, 88, -49, 13, -48, -4, 147, -43, -93, -98, 71, 35, 210, 85, -97, -58, 116, 20, -128, 128, -118, -265, 41, -36, 79, 241, -43, 79, 53, 177, 199, 95, 193, 364, 280, 170, 42, -21, -22, 301, -151, 56, 93, 85, 236, -265, -80, -167, -97, -86, -108, -35, 220, -10, 33, -77, -46, 92, 75, 57, 187, 24, 82, 79, 38, 154, -12, -6, 33, -193, 142, -145, 88, 96, 28, 140, -80, 151, 19, 62, -122, 102, -8, 68, -215, 73, -222, -95, 40, 43, 165, 10, 125, -55, -100, 87, 150, -427, 265]
4459B65j40j5l04K56j5k15p5P7JNL99k98J75k95R2J12p5l0Nn9J36q3J21%j39L0
4485f9K57r0r2K27k53k8R9l00K31k73J87J7J65l2m16K83j80L36J08k64m6J5q2
4508b00K54Q4j30j46J35r6P4j87L21j37L29k86j5J9J96K1k40K91j25j56J46O5
4530B17k23K22j02q5j0j31P8J3k0J5r0K8J9M8N1k18L62j81J8K46k93O4K52j99
4554H1K8j35J54j51J11J51j97j02J05l3K57k28j58K67j03j57J63o2j10j58L45
4575F8j00K0j08N3K2K77k5l01M43m30O5J78r0k33M32k77j3P0k07K10k12K88m14
4598b84J55J61j9L7k01Q9rJ8K50j53j77J87j81L34k16P7p4M1j17K42j92J20k3
4621F5J71j24k89J45L3r3j10J82O4l37Q0Q3J35%k25K24O6r1m2R7mpM0k48J19J64
$$ y = [265, 125, 110, -194, 62, 47, -168, -243, -166, -165, -160, 239, -59, 116, -179, -87, 25, -50, -80, -75, -134, 2, -81, 40, 40, -99, -69, 188, 98, 6, 233, -20, -48, 51, -249, -18, -291, -104, -87, 78, 46, -370, -87, -267, 69, 177, -87, -133, -118, -200, 54, 138, 8, -138, -3, -99, -25, -212, 109, -28, 301, 15, 0, 19, 215, 236, -4, 287, 162, 6, 152, 217, -6, 216, 114, 29, 19, -112, -34, -21, -41, -26, -116, -88, -69, -21, 30, -188, 174, -7, 11, 257, -36, 28, 280, 81, 109, -26, 128, -23, 88, 239, 42, -60, 45, 12, 269, 41, -117, 150, 47, -110, 53, -9, -119, -277, 68, -32, -12, -120, -67, -45, 232, 207, -94, 349, -81, -16, 162, 72, -161, 271, -6, -19, 51, -156, 54, -158, 130, -284, -129, 32, 13, 50, -151, -62, -71, -53, 197, 44, -133, 54, -127, 207, -9, 68, -6, 35, -82, 160, -32, 88, 65, 236, 112, -177, -32, 1, -92, -202, -20, 44, -293, -213, -130, 5, 5, -220, 4, 70, -21, -63, 34, 30, 23, 63, -185, -66, 98]
4647I8q9Mj05K37l2K3j82j1j60J64L27j46j50k19M11O8m76J81j08Q2L3J5l3K39
4671A71l6j02%q9Q3L07k91Nr6l4K55j98o1J47n2J95n7k4k92K2L43j30j49P6K9
4696B2N8k52q5K39K66k00k79N87m10K27l64N1K82k9k20P8O5J24l13K0K33R8k66
4719f8J51J79j30m22J92R6lk5j82L54k40qK06j90M3J52k78k8qK57L5J03j23k35
4743a72M00nj27k67K84k39K31j78nK65k25nk1K6L9r1J22O5Q0l44L6J87j58p8K08
4768B8K0n7O4k61J60J25J06k4j8J43q4J08l02k42J33K44k31o8K44P3j89K12j81
4791Co0J99k06J29j37R9oP1k24J32k7Q5j85L46j58p8j98n3J71J99J29l82l0M23
4815B42l73O6J02j18O8J48p8M8n1j09J6J20J36O3j75k03J11k9k56J02L35l54L21
$$ y = [98, 9, 13, -92, 145, 113, 136, -46, -57, -217, -53, 274, 128, -22, -241, 170, 238, -238, -57, -165, -83, -50, -35, -68, 171, 135, 33, 33, -56, 27, 334, 43, 48, -48, -82, 173, -25, -86, 61, 9, 204, 147, 123, -169, -147, 196, 66, -83, -7, 22, 80, -172, -257, -18, 248, 48, -231, 356, -54, 173, -191, -140, 142, 113, -107, -29, 36, 160, -153, -133, 100, 198, -68, 83, 262, 132, -290, -98, -2, -5, -30, -212, 142, -98, -106, 100, -90, -47, 105, -173, -201, -209, 48, 83, 186, 63, -172, 228, 223, 96, -171, 113, -126, 105, -73, -78, 187, -38, -43, -64, -38, 1, -90, 32, 97, 177, -167, -131, 56, -102, -180, 28, 48, -9, 55, -206, -46, 79, 185, 161, 143, 286, 202, 310, 8, -234, -101, 143, -88, -156, 88, 161, -28, 184, 3, -57, 142, -64, 65, -72, 27, 21, 92, -132, 0, -27, 58, -127, 219, 61, -17, -215, -268, -97, 102, 231, -151, -181, 242, -131, -65, 37, -81, -13, 135, 57, 105, 54, -55, -39, 81, 217, 280, 105, -98, 13, -16, -272, -170, 165, -189, 132]
4838A32j60J07j43J95l0m9K30l20J04L6j27k39K97q5N3J18j23j4j65J80P0l02
4860b35M94j78r6j88R3j0J43Q1N5j44j67N2J62k5J48L2l84J77J41m00L98P4j26
4883I7Q1j33k75J03K92j71k00O8J32k76J7M26N2k98l4J43K5Qj33J06K8J57l15
4906a00O9M6J26j88k29L58k34L53m6L1k47p2k7j3j1N1M8k9J61j52K69m73N06n12
4930c15L08q5K12p7pJ16k86L40k90K00j5j87J86L7r4J78l51Q3J3J07K6P6j96Q6
4954F5N0k98k8K43P9j43K57j14m9P2k22j8j36M30j22r8O2k6P5o7J53j0k77J14
4978hP8j12p0N0o8M8l3L9p4J78j35K9J97rk72K81k40j07L65l25K09J57j90N7n7
5003a2J01j66M2j4J33jJ44J70m10k09K50o2R8J10l18k69N28m02rL66q0j48j13
$$ y = [132, -28, 79, -64, 131, 101, 52, 282, -38, 66, 102, -25, -264, 33, -52, 1, 119, -4, -18, -183, -3, 67, -235, 259, 81, -15, -203, -110, -120, 23, 104, 159, 15, -152, -100, 62, 37, 185, 217, -167, 10, 151, -249, 149, 223, 97, 178, 45, -230, -127, 165, -6, -206, -138, -6, -282, -265, 161, 213, -85, -119, 24, 49, 57, -76, 30, 58, 215, -100, -31, 15, 141, -47, -276, 82, -152, 201, 155, 186, -61, -133, -160, -173, -184, -133, -85, -114, 47, -105, 164, -309, 197, -315, -7, -92, 120, 43, 36, 152, -134, 206, -84, 116, 101, -86, 100, 137, 43, 221, -130, -47, -34, 73, 99, 175, -21, 65, 115, -183, -211, 32, 111, -32, 225, 111, 62, 134, -88, -106, -242, 188, 66, -32, 30, 4, 79, 12, 165, 155, -122, -8, 70, -42, -112, -62, -130, -82, -115, -76, -150, 28, -107, -78, 119, 110, -162, 119, -121, -228, 137, -188, 21, 178, -12, 45, -12, 89, -77, -35, -49, 84, 83, 227, 397, -13, -222, 28, -34, 64, 174, -144, -413, 115, -287, -296, 70, -10, -158, -271]
5026b71L75M6k85J45N8j00j21L97l10J41k10K66r9Q8k85K6J36J43j90j53L86k17
5048c4J00j90J81rj4P9k60L55k70K5L9J49k67J13L3k9oN9j95K80l97K9J64N1q
5073b2r0L17l07K96j99j06L73o0k59J21j3l0p3J25l62K28J58m31M03j81J03j11
5095a20K25l14Q3m0K8J69m0J06j27j20J69j24K79j82l4j8K06k20l0j9O2J91j00
5118C0q7P6o9k59J47K45o9J4j20J72j31K53j33l7N9M9k14j4L29j42j8j27K9l0
5142d7p7J38j34kJ08L6P0p5j62N1k7J84k3j74j44J61K2P9p1Q4K33l14l2J03R0
5167G7j0l98P67k30K8k10Q4k35q2J48J07n6j91K13L80l80P3qO3l51K49P6k51K18
5191H1k52L54qr3k82K95r3j45L1M29J39n72J02k3k7K2N6r1J02p5j11M16o44L90
$$ y = [-271, 104, 150, -135, 10, 68, -32, -153, 244, -66, 75, -135, 131, 32, 120, -165, -139, -3, 140, -50, -203, 183, -34, 66, -124, 57, 48, 34, 113, -147, 208, -62, -37, 2, 151, -116, -3, 30, 1, -5, 54, -141, 139, -258, -229, -65, -14, -22, -112, 205, -102, 194, -5, -111, 262, 202, -57, 64, 51, 21, -52, 73, -289, -61, 97, -334, 69, -112, -9, -120, 105, -209, -126, -166, -138, 31, -9, 97, -30, -150, 19, -105, 174, -8, -42, -60, 146, -74, -104, -123, -61, 130, 30, -57, 19, -50, -309, -162, 83, 14, 28, -92, 80, -51, 202, 69, 32, 91, 140, -74, -88, 241, 99, 81, -46, -17, -47, -124, 14, -120, -122, -14, 22, 92, 17, -145, -94, -121, 63, 40, -134, -278, -117, -95, -16, -87, -3, 230, -84, -116, -13, 77, 67, -331, 436, 206, 234, 24, 108, -127, -209, -61, 46, -10, -201, 12, 392, 12, 85, 77, 140, -211, 38, 114, -137, 81, -171, 183, 175, 82, -200, 95, 2, -143, -112, 317, 456, -116, -14, -37, -64, -42, 14, -77, 25, -50, -161, 255, -389, 1]
5215AP5J3J21k33J89k27J8LK38l11P8k08R0K04j02J39j25J11n6J36r7J33l46K64
5239A08KP3j13rN7j55p0K8m5R7o0q1J68J79k89j38J88N4M8l8n2q1r1J92J2l6L26
5266B74O4m72J61k16q1J32L8op3K00l7J92l65K55L8j88j5K00k67N9n2K54j93J85
5290H7O9k53J02R5k62J02J10q3Q4O6j04o1j05j17L42J34r8M0q1J1K23l68n2K8
5314i1K89l13L4K9J17r2j90J41Q0j39J24r8M8Q0J45j02J50k23JM4M0K17j40j63
5338a2m31N43j76J82l6j56N4J41k42j04J20LJ26p6M3Q5Mj72J3k5K11q4L8L4J0
5363I3p1J91n20L26K27k05OJ27j93j4K13o3j85J18j35M5l08N41l36O2K66k60Q1
5386Fj0K95j18m7k08Q5N3kK06j80J7j13j53J85K79l60J8j4j02L3L75j28m2l39
$$ y = [1, 76, 89, 210, -23, 166, -61, -43, -40, 198, -113, -35, -243, -153, 51, -51, 88, -37, 74, 18, 154, 57, 190, -156, 108, 110, 183, 70, 61, 118, -37, -107, -79, -124, -27, -87, -168, 0, 179, -110, -248, -60, -6, 42, 4, -48, -129, -220, -28, -16, -52, 274, 338, -134, 27, -189, -270, -138, -100, -106, -179, 21, -16, 176, -189, 66, 104, -84, -99, 101, -166, -107, -159, 95, -98, 87, 156, -97, 5, 100, -162, -60, 50, -33, 51, 117, 13, -48, -153, -270, 72, 206, 108, 148, 67, 78, 301, -67, -119, -91, 198, -115, -81, -52, 65, -27, -217, -76, 4, -135, -11, -109, -61, 19, 164, 62, 212, -11, -10, 34, 74, 291, 151, -12, -443, 100, -76, 106, 70, -86, -32, 109, -133, -237, -117, -114, 12, -64, -21, 64, 68, -104, -91, -116, 95, 11, 49, 83, 93, 22, 213, -307, 19, 246, 41, 47, 174, -19, -33, 180, 117, -68, 50, -85, -40, -348, 193, -143, -81, 185, -75, 6, -4, 291, 173, 126, -82, 3, 56, 54, 260, 80, 97, -16, -169, 16, 295, -65, -47, -61, -163, -130, 245, 117, 75, -264]
5410b64P5Q9L6KK2J61j54J62J01l36k63J73K83j88L28k01j60Q3M9K8K23r8J42
5433B93n40n4mL57L74n16L00k25PQ9M2k44p0J26j65K06J55j54j01J36p4p8M38
5456B98k16K3L1J1j19j98J13J12j99N6j55L47l1L7K1j71k99K50K8Rj21J82J9K29
5480B57j66k68L70r4J00n0j4j81J94j19o8J33K3p3O5l14J52k9k1M63o43M39l29
5503a73Q0J41k47K63j25k52M17l8l9j91J02K99k49Q8j73P3k08M94k57n7J38p0
5525A6j56J99j05M5M8j95J62k05L03j78J0R3l10O9kQ8J40K0k37p8K64j74J52L2
5549Ak4M1p0j00J32qP4J45j47J72j38P7J53k21k62K39Omj28%J03j31J3L33k88
5574c2N0m7j35K15l18L22l4k0K5r5J34q4J62j86M6M3P7J42j69r8k67L97j34l09
$$ y = [-264, -189, -100, -64, -62, -40, 121, -33, 129, 230, -106, -369, -196, 87, -101, 227, 26, -134, -51, -2, 26, 249, 151, 293, -247, -301, -305, 52, 426, -90, 210, -15, -8, 81, 123, -121, -191, -65, -230, -24, 131, -23, -124, 12, -62, -140, 298, 82, 105, 136, 147, 28, -170, -57, 55, -144, -88, -243, 104, 73, 110, 131, -40, -339, -89, -61, -52, -173, 9, 28, 257, 91, -177, 193, 99, 199, 149, 135, -46, 148, 29, -39, 94, 117, 44, 109, -205, -53, -82, -103, 360, -283, 156, -173, -93, 48, -199, 64, -61, -313, 104, 66, 27, -164, -62, 237, -12, 76, -97, -24, -232, 262, 5, -52, 86, 16, -140, 59, -46, -1, 47, -148, 14, -191, 112, -66, -56, 37, -273, -204, -206, -118, 22, 42, -195, -273, -9, -183, -31, 1, -23, 18, -52, -152, -20, -28, 46, 191, 44, 216, 78, 155, 308, 87, -175, 64, 70, 66, -62, -62, 41, -90, -77, 256, -32, 18, -29, -164, 51, -267, 55, 21, 1, 26, -69, 65, -19, 143, -43, 3, 46, 123, 265, 96, -2, -269, 128, -6, -315]
5598c15N56k64K30k90J20J35j13j13K5lJ09j06R9n2m4om3R6M3p7K36j14k86M52
5622B75l07k31K61k87K01j14J54j18K32o7j64L23l08J89j08J36l1Jj08O6J2l6
5644b9P6r5Q3O8j01j3K0j17K22P5k83R5J06k35K30k27J12N1J14j15k06J85k53
5667b37K30m7J23j46j8K80J54m36r6K58Lk15K65j28j69M35m45K82J40l13mM8k7
5690f3K09j60Q2n9n0K08l23N33l12j70J5p7J11K7Q2J90j14j82N2M9k46M6K15q0
5714a7L0k35L29L5j42J06m7N6j42J51k6j78Nj5K11j05K23l14O2l2n4N9J71j01
5738C0q4l9K21j70R5J5j35n3J46o5N2q2N6Q4j08n7K12k29L2R5k98L39k22L48k13
5763c0j63J76J86o14L70j5k74L52Q3N1J10j13Qk2L4j89L9K3L0K07k06O5j59m8
$$ y = [-315, 241, -23, 207, -83, 37, 172, 59, -54, -29, -32, 77, -29, 70, 18, -26, -32, -75, 21, 64, -13, 223, 109, -177, 275, -32, -263, -2, -289, -88, -202, -48, -166, 66, -1, -165, 158, -150, 39, -69, 67, 36, 37, -71, -5, 7, -29, 47, -48, 35, 103, 2, -11, 9, -108, 114, 189, -94, 1, 107, -128, 102, -125, -13, 38, 152, 37, -169, 16, -237, -7, -54, 69, -77, -95, 185, 339, -97, -193, 65, 68, -147, 118, -10, -179, 256, -189, 93, 233, -80, -84, -36, -63, 146, -14, 68, 9, -41, 167, -156, 377, 65, -105, -90, -167, -56, -29, 53, 243, 129, -53, -1, 48, -198, -152, 63, -17, 13, -222, 107, 142, 0, 106, 59, 115, -27, 124, 98, -80, -75, -90, 121, 16, 239, -75, -13, -45, -99, -40, 131, 30, -54, -93, 128, -42, 53, 68, -67, -120, 26, -39, 13, -69, -13, 71, -37, -94, 118, -111, -79, 16, -282, 57, -165, 183, -30, -193, -17, 169, -445, -75, -90, -364, -12, 71, 122, 232, 119, 127, 105, 139, -50, -11, 12, 42, 249, 43, 108, -51, -99]
5787i9M2J1J94q3n3Kl1J93k8j37n3o0J72R5k48J08k22J71J04P9j36N7k04O7j0
5812f9P4P5k26L00k9j27Oj60O7j50L79q2k95J28j9p1J86L0J03k69J02q7J46J71
5836A83k69Q0q2om5J1L30k45M6K1n2K96k57o6K21k21q9J13j28J71K18m21M2R0
5860e9l4k2K06j42j47L12j98P2o7k11M16q5k5j82L3K96k68L22l32N8Q4M3R6n4
5884A12k6kj94j15L31j07j03J43K4M1k48J47k0R2q8q0m9K05j11j04J98P8J39q9
5908A74j61k6o6Q8q5lR7Lr8M9J98m7j56k09k5J66K26k21K20q4m3j08K35j29qN3
5934D0j53O2P5P0K0k18M7Q5j75k65M42K60k65Q4M5j56j87N6K20j01oR9r6j10L7
5959i0JL11n2J05j83J32m13N5J90o2J54N5j2k36J07j72J65k0J42k98K32k30J29
$$ y = [-99, -57, -46, 148, 65, 12, 14, -17, 176, 148, 11, -42, -102, 70, 165, -83, 25, -197, -26, 78, 157, 21, 78, -126, -59, -69, 5, 80, -146, 154, 125, -2, 4, -156, -89, -239, 140, 58, -237, -109, -128, -199, -13, 17, 120, -149, -47, -134, 12, 183, -86, -6, -88, -94, -139, -128, 202, -43, 3, 24, -28, 268, 11, -55, 166, -55, -144, -31, -159, 12, 230, -191, -149, -59, -93, -115, 91, -51, -198, 114, -84, -12, -79, -290, 126, 41, 16, -166, -133, 163, -105, 217, -115, -57, 27, 70, 166, 112, 86, 84, -110, -225, 106, -1, -104, 39, 63, 104, -144, 3, -17, 75, -13, -93, -142, 63, -48, -152, 46, 124, 263, 174, 13, -13, -79, 9, -76, -79, 18, 21, -77, -28, 170, 123, -33, -242, -267, -101, 125, -96, 124, 40, -3, -111, 124, -5, -13, 40, -113, -51, 24, 94, 114, -104, -57, 28, -147, -412, 30, 290, 25, 109, 154, -2, -189, -133, 87, -14, -20, 79, -17, -127, -90, -89, 222, 170, 275, 92, 224, -189, -134, 56, -6, 148, 203, 191, -45, 62, -110, 55, 35, 177, -121, 111, -119, 10]
5982A0l6k71K51J33l54L31Jj23j03K42j61O4M8k60J08K55j76l9J33l2j20j3L89
6005B77l47J0O7r9J19K54j91M7j82J68P8k97r3J36K10j89j7j18K25O9p2L8j78
6028h5j90L18K77j66k27p0J53j38M64L4l48q0j89J91l5L5Q7r9K18k69K05k75n4
6051b43K00o8j42ML97r8j05q6r2J06m7K7K74j81J57j71K71n7k01R5k73M21l7j35
6075A6M3j55J53k85K16J2k56mL37k48J83O4o1l5K32k29J90l03J28L2k31J79J85
6098A63j02nk88K96p6j9o6J89l22J53M99m92L03l36P5K91n49K68J63N7k09r9R7
6121in4J64K2j12O8j4j29L0l8N4q5MK8K11k07J94j52r1J02r5K31j89R8J36j81
6146a4O9j47J12K9j65R3k7R8o0j11K2Q9R8j75K24k43L3J19k3k23J49J22O4j51
$$ y = [10, -26, -297, -46, 87, -267, 64, 65, -58, -161, 81, -80, -16, 32, -228, -120, 135, -41, -80, 53, 21, -99, -112, 277, -70, -60, 7, -92, 27, 281, 90, 137, -45, 123, 201, -96, -189, -53, 157, -32, -49, -167, 58, 127, 55, 93, -85, -275, 43, 320, 154, -73, -143, 10, -128, 336, 370, 22, -58, -247, -56, -91, -56, 31, -68, 150, -119, 86, -189, -243, -43, -111, -253, -249, 148, 50, -55, -141, -233, -127, -174, -147, 127, -54, 103, -68, 203, 146, -55, 40, -233, 188, 151, 16, 59, -96, 57, -228, -12, 0, -256, -260, 77, -171, 12, 76, 15, -20, 212, -17, 173, -130, -2, 30, -201, -22, 163, 61, 56, -232, 64, -12, -31, -97, 92, -230, -77, 422, -70, 233, -103, -28, 263, -286, -18, 145, 202, -7, -106, -9, -63, 101, 123, 11, 79, 65, -64, -34, -72, -18, -103, -99, -71, 140, -67, 127, -25, -116, -14, -109, 122, -67, 31, 167, -14, 55, -92, 20, 49, -116, -23, -50, 48, -12, -123, -101, -12, 86, -89, 135, -108, -75, 44, 21, -202, -53, 69, 133, -18]
6170a8n7j53J15L65j97p0r6Or7K40j9O7j52j08R1PN0K84k29k78J65j7J37J8k17
6195a63J44j10N6J39j73K93j84k09K87j77J38K02k66N5j5k46K13L8M2j12j79J31
6217i6P6J60k20l0J96j27j31KJ86L2j6j28J69j43K29j24K13J90l40k16L0K45m7
6240A10j6k66L43l0L6p6j12r2k6K12j93M26k15j75j24J34K5P7j38Q5k20K81N5
6263A01l02K41K15p4j62L6k06J97k39l5L82k50L6j91J99m6L01k19mJ95j14Kp7
6286a4Q4L1j21j0K1L6N9j99J47J65p6l07K89J91j18k49L14l01o7J87K33k42J4
6309F7j4J3P2k10O6K25k33L1r7J4K44k74K03q7r5M12j71p1RO1l02M7J70J0j30
6334d0j03J29J3j8N4o9J36j68j24M4L9R5k32L41K6j39J55p8j72O7j14K83k48P8
$$ y = [-18, -75, -228, -113, 252, 55, -15, -111, -105, -202, 38, 19, 86, -66, -174, -83, -76, -26, 258, 29, -249, -84, -101, 36, 54, -163, -19, -129, -73, 66, -107, 186, 2, -207, 80, -97, 41, 243, -23, 32, 17, -229, -16, 22, 64, -48, -227, -96, -20, 140, -80, -110, 86, -41, -172, -170, 16, 48, 32, -96, 73, -70, 159, 35, 248, 438, 98, -118, -88, 157, 110, 94, -172, 171, 141, 177, 101, -11, -103, -129, 83, -110, 316, 101, -74, -198, -64, -39, 38, -100, -15, -235, 46, 101, -201, 40, 255, 181, 19, 55, -151, 46, -193, -228, 154, -96, -60, -251, -52, -98, 203, -16, -20, 175, 61, 63, -14, 70, 101, -20, -30, -9, 27, 86, -113, 34, 199, 123, -184, 105, 296, 178, -71, 243, -58, -125, 62, 295, 53, 67, 53, 66, 138, -72, -6, 219, -14, 17, -80, -66, 178, -96, 107, 20, -75, 337, 166, 95, 104, 165, -137, -90, 80, 90, -40, -143, -14, -1, -19, 35, -34, 102, -66, -190, -146, -107, -12, -244, 97, 123, -16, 139, 61, -111, -44, -158, 125, -123, -45]
6358d5j34K23l32N72k38k22M30k12n3K44p2m25K55j16j32K92j58J41K85m33K64
6379A34k86K20K29j18M4r8k21K2R6J32j44k6J7J49j69J24k97K74j09j17L4M9l9
6402a00nL44l14L7OJ30k46J81%J57m69K44J46k47J19Q0l2J04j89q4L14k88J3J40
6426D1j78P2k5K11m8Q8j05r6M0j10JL8J77j85J91k08K63N9j93j33k9N1O5l1J70
6451A26n5j02M8M0j17O5Q6o6N9j12J64l33J51K7R6j15o8j78M07j49j33K4L7K05
6475A07k21J82p3q8k31K03J47j47K38j61J83n3Q8J5k33J44Mm89M00j19j57kK48
6498a5j3j10M01k12J82k43O7O5L8p9K39k80j46J53k24R4J84K3l27K09J2j4K22
6521B26m79M21k57j75o8L54J15j70J50J25l46K71L9j74K1pm7R7k72J84l9j08K27
$$ y = [-45, -179, 44, -288, 284, 46, -176, 254, 42, -11, 233, 161, -264, -9, -125, -257, 35, -123, 18, 303, -130, 134, -152, 68, 297, 179, 223, 125, -96, -74, 22, 154, 10, -16, 1, 150, -19, 105, -192, 82, -27, -144, -110, -61, -100, -105, 239, -75, -38, -32, 98, -148, 33, 33, 190, -279, -35, 111, -136, -17, 63, 31, 135, -54, -138, 176, -112, -99, 41, -137, -65, -90, 121, 73, 161, 56, -40, 0, -110, -109, -71, 106, -79, 112, -96, 167, 226, 33, -100, -129, -78, -13, -44, 126, 71, -31, 17, 57, -60, 5, 91, 25, 84, -28, 136, -197, -46, -19, 77, -38, -106, -284, 123, -26, -159, -135, -98, 107, -114, 68, -5, -93, -324, -121, 26, -121, 117, -44, 139, 86, 174, 189, -44, 100, 104, -385, 15, -104, -261, -263, -15, -28, -138, 263, 51, 233, -10, 57, 122, 160, 81, 320, 40, -106, 47, -177, -83, 101, 124, -203, 6, 18, 4, 226, -253, 168, -89, -264, -332, 22, 137, -33, 117, 242, -104, 167, 206, 32, 53, 46, -1, 96, -176, 8, -31, -139, 88]
6544H8K2k43M8L90o64L84j1R1k16J2k08K09K20J22k94K23l6l13j7N27l38q3J03
6567A6M3k56M14k97J28j31K74o0l24L37m61J88J10O9QJ06n0j78O7R8k36J41j39
6590a33K59j5l4j6n4M7j30J26O4J47j33k81L27k57N7P7p2J27k26j7L16j16k52
6613a89K86q4j67K48j01N1l8K09n5o3r5M8j2j31l4J19l6M8J20k18j64R1J12K68
6637B13l34M06m16j09K34p3k8koK04j07n6J96M3m9R0j68l9K11j79o7J07p7lJ87
6662A78k30J02L9j59J49O0n3L3k98K15k55o8L40k13K11J1k1j33J07j37J01j3M7
6685A3L6l66L15J18j31r4o1J78K4K18l03j01K69J51k28j7Rk0M4p6N2j27j47K75
6709C1j75K76j6p0j13R3k1n4J23J05k01K91l29J22j90l3R6J16O3O7l34R9L61l35
$$ y = [88, 110, -133, -85, 305, -359, 25, 14, 105, -111, -99, -307, -98, 122, 244, -50, 173, 137, -176, -193, 334, -4, -87, 16, 59, -197, 217, -80, 48, -83, 191, 131, -193, 144, -317, -129, -19, 50, 58, 164, 114, -64, 3, 101, -135, 6, -133, 126, 111, 77, 61, 7, 54, -76, 50, 114, 261, 128, -153, 174, -83, -26, 51, -21, 106, -120, -137, 179, 63, -189, 97, 13, -154, 94, -7, 44, 6, 215, 160, 97, 2, 50, 38, -93, -127, -8, -44, 4, 124, -94, -258, -167, -55, 213, -121, 285, -131, -240, -6, -79, -107, -109, -115, 89, -18, -74, 122, 165, 116, 206, 38, -1, 210, 31, -36, 71, -6, -9, 178, -52, 50, 89, -70, 79, 139, 86, 119, -179, 36, -219, -287, 53, -160, 51, 62, 41, -92, 15, -122, -21, -34, 13, 49, -317, -2, 116, -15, -109, -170, 8, 32, 250, -53, -154, 115, 266, 38, 21, 30, 10, 54, -22, 30, -97, -244, 31, -144, 132, 116, 46, -67, 26, 5, -49, 74, 179, -22, 269, -60, 62, -128, -161, -65, 51, 114, 181, -153, -54, 307, -28]
6733b8J05k38J54k7j05K68j80j0R3l2k40J71J83l34L96j68J3o0K89m4j00j24j01
6756a19L01k18L6J58p2j91J26l22L05j31Pj43L41j63O7J22k41m3P7j4l5LJ68J26
6780A45o8j75K28j21K00k43Q0k0K6m5k8P6P0j02P7K6n0n7k15J36K54k22j39J93
6804B6om3J59o0j99J07P4l93M19Q8o2q5M4j8J42k20j47m5K29r5N1j29p4J08J42
6829A3R5k81K03p2o6j9RJ68k31n2L3M8P1mj70M67l03r9K35j61K1Q2j92J69j21
6854a57m2J81J35p1j15J30j74j79L72l1L5QR6P4k82K56k27m1p9J82K5r1J4m1j87
6879b09N26k37N5p9p2l7l9L56l61j02K12j63J18J00KJ05j81j69K40J09k65J4j22
6902a99K05j06p5J92k84K22K58l8k37J5R9J00m7j73J09JQ2Oj98On7j22Q2J02M8
$$ y = [-28, 77, -161, -7, -34, -139, 129, -51, -61, 32, 0, -240, -69, 114, -220, 176, 8, 21, -39, 250, 206, 106, -18, -119, 182, -36, 0, 158, 86, -105, 21, -301, 4, -127, -120, -263, 78, -85, -18, 104, -137, -180, -103, -117, -152, -149, 19, 145, 77, -98, 130, 9, 209, -34, 46, 26, 52, 7, -21, 55, 125, 23, 100, 126, 76, 19, -196, -60, 194, -28, -167, 26, 20, -23, 136, 76, -123, -16, 58, -335, 84, 172, 110, 25, 69, 51, 193, -27, -174, -219, 10, -85, -34, -163, -237, -129, 13, 108, -173, 30, -42, -108, -127, -118, 50, -181, -233, -200, -152, -81, -85, -255, 212, -91, -190, 45, -116, -95, -13, -205, -36, -157, -199, -18, 117, 46, -69, 61, -113, -292, 80, 49, 84, 92, 188, 262, -20, 236, 9, -32, -111, 71, 96, 5, 19, -22, -209, 317, 80, 135, 56, -16, -53, -92, 264, -97, -199, 13, -150, -32, 68, 70, 175, -6, -175, 65, 174, -91, -77, -199, 6, -100, -175, 17, -267, -45, 213, 175, -62, -47, 52, 152, 105, -68, 41, 42, 124, 130, -68, -62, -119, -241, -159, -57, -9]
6927ij23K05j51K83k20K2O2J1k07L00n7N4n8j3n5k0n1L09j2l65K51l72K50K88
6951C22m78N08j62k43K87j94j00R7P3L3k44p9K05j23J71j97q4J66J75j44J2m4
6973d3J31M1j77n4J12J4j60N2L29k98M2P9J42j55J32p4j23J4j14J52r7K1j4J55
6997A07J4Q9j71J13p2J38l81Q6r7K92k12K25k33l9k7M60j47q9n1o1K9J0o8j4J79
7022H0j83q6K27q9N5Q1j12k03K62jn2n4O3j23R8J36J11l11L77p7l67K12N8J41
7046B43l99K70j98M5K29o2K1m8K19m47K36q6j83J54j72K07j35J12J72j85P6L0
7068I9j09j91M69j71J40k38j31K61j88K95k15n3L7p5M8j50O2J01J9J0k52L8L11
7091A17m01L42k22J08K23k37J01j79J87M47m97l7J64m5j53J8J37J96m84K76o0
$$ y = [-9, -132, 73, -78, 205, -15, 7, 69, 80, -127, 173, 116, 170, 112, 99, 44, 24, -27, 282, 270, -95, 156, -216, 34, 322, -156, 352, 190, -53, 234, 40, -60, 37, 110, 143, -101, -180, 25, -98, 73, -124, -208, -42, 133, -11, 1, -43, 88, 129, -48, -102, 10, 24, -136, -84, 245, -53, -11, 68, 210, 55, 187, 113, -10, 4, -110, 42, -55, -34, -48, 107, 121, 210, 39, 152, 80, 218, -163, -77, -174, 118, -94, 131, -102, -141, -168, 292, 145, 56, 5, -56, -27, -17, -85, -99, 80, -103, -189, 38, -51, 4, 85, -27, -230, 32, 31, -21, -75, -12, -135, -37, 99, 210, -101, 276, 199, -168, 44, 102, 243, -156, 114, -84, -39, 190, 128, 149, 101, 320, -127, 109, 23, -160, -6, -178, 29, -106, 6, 178, -7, 69, 99, -10, -201, 268, 97, 237, -1, -132, 129, -59, 236, 21, -32, 5, -70, -22, -172, -110, -9, 10, 20, -232, -194, 117, -284, 58, -164, -56, 167, -70, 31, -148, 39, 486, -11, -48, 116, 71, -82, -64, 73, 269, -215, 61, 1]
7112Aj90n4R8L40j94J61j03j55J1K60l43L41k87O9J71j1j38m6O4m1J46n4J2Q9
7136A47J84l17j54J37J78n9kk41L20Mk48k7r3J73N4m7k1j06N3r8k3K30j43L07
7160B08j56N3j59J05J00k0k1j45J29N8k30j24J47J47p8J85j36J55k06J48j4P3
7182B19j64j82K17j37J66j24k7q6Q3p6J81k19K27l30L52m2k12L33k33J80K5k86
7204a35N0N3r5J24k3L08j08K05l82R3j10j85L63r2M5q4K98l05k2j87n9M55k23
7227a6J16k27J75j52K0J14J2j09M6j02O9J76j93o0M4J95p6J21n0l77J44J40J05
7250A15m1q9j15J13j41K01K61m88M0P8m8J92K6j83J53j9K5k1k33L52k8j34k47
7273b31J92O7J14k53j06J84J12j55k2j9J57R2pj02K9j91j9J21M4K00k70K20j03
$$ y = [1, -189, -243, -145, 195, 1, 162, 59, -96, -85, 175, -168, 173, -114, -45, 126, 115, -23, -69, -5, -46, 100, 46, 58, 147, 331, 14, -140, -3, 175, 116, 114, -127, 193, 197, -51, -78, -171, 2, 56, 9, -12, -118, -65, -163, -186, 44, -99, 208, 52, 105, -54, 51, 151, 131, 110, -35, 94, 152, -78, -202, -55, 92, 14, 199, 63, 218, 12, 160, 146, 219, 55, -127, 90, -47, 119, -5, -32, -118, -35, -111, 70, -149, 78, -252, 100, 58, -154, 179, -54, 126, 151, -135, -85, -32, -127, -3, -26, 282, 174, 379, -3, 90, -20, -205, 158, 66, 111, 27, 325, 20, -2, -189, -248, 207, -16, 100, -127, 48, -104, -84, 30, 42, -67, -21, -123, -54, 122, -71, -131, -87, 108, 32, 153, 103, -274, -130, 10, 115, 74, -15, -130, -17, -158, 43, 304, -184, -144, -66, -114, 78, 104, -79, 74, 55, 80, 59, -174, 178, 150, 16, -231, -39, 28, 142, -111, -217, -33, 79, -76, -98, -117, 40, 132, 125, 23, 52, -139, -158, -37, 7, 207, -63, 157, 54]
7296E4J43k96J23O6k66L9LL04j51J41k17j18L28J1j23N5N7k1k08p0O7k0K84k73
7320h8l1J73Jj01l01L30J19K52m38K06o9O0n7l58L71k46KP1J52q8K22k58R7l7
7344a6J61j36n5O9j51p5K68k03j64K66R2j41K01K3l60J75j55K42p0j08K86k39
7366i0L31m77K54l9K99Oj2m05K4k66L75k99J57Q4J72j58j38R4J86k50L59q5k03
7389h1J75j63n9l5K84K1l68J77o3K63Q9m42p0J04J15O5R0j08%p6k8J61Pk47L06
7414A17k93J06L3K9P9Q0m01J05L64j38P6k14J08l8J2K03j85m3O7P6j54j0K3j82
7438a80K89j17J01q8J60j55k03L15l80J90J73K36k63j2j32J94Q9j86N8k23L50
7459B16p8K2k4k45J92j19nj04J34R4l49M78k71J66k8j57J7k9K00k42K03P5j73
$$ y = [54, 197, -99, 24, 90, -176, -137, -134, 170, 19, 160, -57, -175, 153, 164, 41, 96, 153, 132, -76, -146, -79, -99, 185, -88, -119, 54, 55, -46, -347, -17, 102, 354, -84, 122, 53, 113, 56, -302, 69, -177, -175, -104, 48, -40, 182, -76, 21, -16, 145, 9, -46, 23, -128, -203, 65, -138, -302, -36, 56, -85, 116, 139, -221, -46, -201, 41, -29, -137, 149, -90, 241, -236, 18, -21, 278, 284, 272, -133, -109, -375, 0, -299, -142, -58, 114, -44, -182, -88, 98, -152, 207, 122, -81, 94, -69, -128, -163, 121, 142, -226, -49, -112, 151, 240, -202, -272, -168, -53, 12, 102, -6, -6, -82, -110, 51, 58, -189, 117, -176, -70, -37, -8, 71, 151, -250, -145, 219, 81, 157, -57, 51, 13, 25, 228, 43, 0, 67, 143, -11, -21, 2, -180, 109, -8, 93, 5, 165, 10, -193, 122, -258, -68, 105, 341, 78, 66, -66, 128, 217, 31, 89, -134, 216, 138, 160, 136, -109, 83, -36, -41, -145, -11, 83, -266, 212, -59, 107, 79, -78, -61, -90, 110, -132, 71, 146, -27]
7482b7M5J02%j39K15k24L3K15j11k56Q4K38k26K67l41L32k37Q9P3j37N4M8p9Q9
7506A07Mj61L12j54l4k46K08K0j53J06R3j84P3j40L25k65J57J04j95j7N6j4j28
7529a26M10r2l41K82l31L08j42j43L92l72K65k14J13l63M06J92m32J32k10R3N7
7550a16K16q9jj53J29R2j78J89J33j97J20j40J34k11J29q8R9K0j55N0k99O28l20
7573hn6L2p8m3l0M4R1J84q1l48L58l4k04K11J04j34m9J54j73M05m47J91J94m03
7597a20k7J13O7j9J3j7k48K72n0p2J40J24k75K00j28J00j57m3L06l55J05J66k95
7620b00K29j39J7O2M6L8k07J62P3j70J91j29k19J35K02j35P3m1J4r2Q5M8r6j32
7644a85P8k6N00m10M3J43j29O6K5j9m3k5R3j41O4J68n4j73n1o9p0K43%j14Q7J19
$$ y = [-27, 18, 120, 120, -19, 196, -28, 5, 220, 109, -147, -63, 175, -51, 216, -125, 207, -30, 59, 132, -5, 49, 97, 18, 107, 111, -50, 262, 108, 74, -172, 36, 56, -97, 9, 102, -82, -9, -149, 176, -89, 68, 172, -23, -40, 16, 2, -126, 284, 192, -149, 133, -198, 110, -32, -175, 217, -155, 110, -104, 9, -354, 52, 244, -188, -56, -266, -173, -116, 100, 11, 10, -143, -14, 78, -100, 89, 222, 25, 145, 5, 139, -72, 57, -31, 68, 88, -67, -17, -316, 312, -8, -64, -32, -110, -153, -183, -139, -48, 136, 55, -293, 65, 31, -173, 38, 142, 8, -41, 113, -60, 345, -102, 89, 283, -120, -147, -34, 33, 14, 27, 10, -238, 34, -16, -88, 52, 176, -99, 101, -27, 73, -84, -127, 179, -176, -71, 95, -200, 29, -110, -93, -31, 15, 53, -154, 8, 81, -89, 102, -27, -246, -111, 91, -44, 29, -12, 2, -90, -5, 43, -53, -185, -107, -133, 367, -43, 0, 143, 14, 80, 105, 86, 43, 18, 111, -30, 34, 202, 148, -25, -76, -145, -215, 28, 28, -86, 1, 120]
7670A20j80O2O2j59J30j1j77J50K5k35N04m06M44m16L82l73LJ06j04L47l66L48
7692B56j56k1j95P3K15q0Q3k31R6j61lQ3q7K50j60OL9l7M5o1P3l1K5J7Rj22RJ51
7720H5n7j72J65r4R3j9K10j59O3l27J79M3j89K50J21J1l85l0L33m2k01K98j07
7743F9P5k77M71k38j59N7j19R4J15p8j14J42K41q9l37N04l44j2P3M6j53J55k84
7766a62J99l1j36Q4o2J35j3r5l2K08j42K68l10J32j78J33R5k36K05j18J9J21l0
7789E4J05l06J40J24n2L0m45L41n2O2M1r6L79m1m89O5L8J69l09L18J09k76L73
7812B82j20j35k38K76n5K75j28j25P9n1q1K0K00m3m0j82J56J71k47k59L60j97
7834h2K31j44lj51K7j9K25p6j77J77pP3K4J3j98P9L55l17jo6P0J47j11M8k68J42
$$ y = [120, -60, 2, 64, -95, 35, 24, -153, -3, 22, -213, 291, -115, 329, -87, 295, -78, -75, 31, -73, 274, -92, 256, 100, 79, -116, -43, 172, 92, 175, -56, 40, -121, -124, -41, -128, 122, -38, -32, 7, -30, 15, -46, 27, -4, 21, 38, 47, -75, -66, 85, 28, -144, 21, -73, 20, 1, 211, 52, 115, -212, -33, 10, -179, 71, 192, 203, -182, -212, 121, 79, -122, 176, 69, 144, -133, 338, 100, -59, -2, -121, -27, 88, 10, -104, 38, 279, 190, -147, 357, 13, 1, 74, 120, -33, 122, -162, 37, 6, -130, -46, -108, 27, 14, -81, -113, 95, -47, 221, -89, 43, -135, -2, 93, -143, 62, -56, -37, 84, 54, 159, -147, -7, 117, 65, 95, -350, -9, -61, 1, 42, -54, 325, 284, -205, -140, -102, 67, -242, 76, 185, -91, 282, 162, 27, -211, 65, 10, 285, 157, 32, 111, 60, -21, -1, 199, 156, 116, -66, 90, 261, 14, -245, 115, -82, 149, 5, 2, -149, -122, -141, 84, 8, -169, 8, 1, 74, 98, 111, -87, -8, 347, 30, 29, -37, 33, 180, 69, 117, -151, -9]
7860ik83K59Q2k10kK52m9j2j95J84K05l42M2J82k00J53n7k9r4J7J74J6o2Jo0o3
7886a00K42l2j65J14k37K11O8l8P1j5l15P6J71j83J78k8j90L41k05J33k56J66
7908Gj73Q2K01k55K28k45O5K50k59J27j85R0K42j63J61J5j52j54k0L8J65lN5l30
7932b13M21o39K31J56J89l7Q4p7l41K05K28J4l16j66J51J43k33L12q4j07P7k36
7954b38L51j90J14k13K47q5p6J3J38n4j73J09j7J55j58q5J11J43J75l55K31j73
7976c0j36J14m9K38j26j00l2J06J38m9j53P4P0k08K83l69J13P3j25J35J25q8k3
7999a9K32k11J01j52n2j0j6R5J79p7%j54L0J44j54J33l5P9j52J68q1r5r6L1k2
8024a34L38Km30K82l37J80K09r1p2P6J26O8k63K1J36r9qo2LJ78j52L4N9P3j23
$$ y = [-9, -292, -33, 49, -161, -163, 89, 40, 28, -167, 17, 222, -120, -78, 104, -96, 57, 0, -29, -123, -106, 68, 84, 22, 23, -37, -100, 142, 110, -55, 59, -178, 33, 101, 63, 134, 119, -196, -120, 51, -132, 46, 18, -172, 169, -36, 97, -159, 7, -166, -84, 117, -138, 90, -155, -90, 160, -99, 28, -157, -67, 175, 12, 173, 188, 36, -118, -138, -100, 65, 62, 117, -213, 208, -431, -200, -44, 145, 108, 192, 115, -226, -21, 207, 221, -95, -261, -110, 33, -200, 112, 28, -79, -2, -238, 113, -77, 37, -176, 71, -14, -90, -77, 61, 7, -166, -57, -74, 81, -77, -162, -51, 92, 267, -88, 143, -30, -166, -52, -101, 137, 11, -89, -121, -15, 123, 74, -79, -5, 65, -143, 140, -229, -116, -43, -168, -33, 92, 4, -19, 213, 2, 103, -49, -101, -111, -127, -32, 147, 70, 70, -84, -54, 90, -64, 69, 34, 113, -39, 129, 48, -47, -143, -112, -134, 204, 206, -224, 58, -279, -99, 110, 19, -53, 23, 149, 217, -46, -25, 111, 12, 4, -58, -55, 123, -29, 5, 64, 137, 14]
8049A4K04k03n5J91J6k31n2K70j89m9J01J56k10J2r5J1K95k06j97N43k70k49%
8072a93j5K7O3L71m07K66j39N3K42n59M18j73J01L8n9p1j2P8l93O0J12NN9K73
8096A45j40k00P4K13j07P2l8K28k90J19J45J0k38j2R4j97k31O26m17J11J8K37
8118B22k05K3K47l46j0O7K7j0L26m93K29j73j1K10r9J70k81J20L8N8k4j39q9J26
8142a7o6R5j25M7l8K94J11k07J04j95N4k32L62p6r4J71j98j71K66j50N6M8q1J10
8166F8l24M15m4j85K3J41K38k98j63J98j78k1L9J0J6N9J56k58J54j70J94j13J71
8189A28j84O5
$$ y = [14, 218, 15, -40, 151, 167, -64, -116, 154, -35, -84, 17, 173, -37, -25, -120, -109, 186, -20, -217, 326, 56, -193, -193, -208, -181, -118, 253, -154, 112, -27, 26, 268, -291, 127, -46, 55, 93, 34, -37, -49, 29, -364, -304, -192, -187, -128, 145, 5, -195, -121, 92, -15, 57, 19, 247, -43, 76, 221, 231, -7, -19, 75, -122, -353, 273, -144, -33, -15, 222, 17, 40, 287, -59, -69, -2, 25, 15, 341, -152, 77, -96, -107, 103, 4, 174, -107, 13, 51, 109, 85, -54, -143, -17, -83, 12, -113, -66, -104, 190, 301, 94, 198, 3, 57, -175, 187, 111, 17, 188, -10, -181, 85, -65, -9, 39, -42, 68, -256, 159, 115, -70, -47, 94, 332, 34, -129, 69, -109, -130, -91, -81, -65, -6, 150, -108, 46, -124, 70, -43, 128, -56, 9]
8191I
$$ Imaginary data points
##PAGE= N=2
##DATA TABLE= (X++(I..I)), XYDATA
0@%%%%%%%%%%%%%qJ6j6J6k4L2l2M0m8N6o6P4q8J04j20J37j59J83k08K36k66L00
35A59l37L79m26M74n28N87o53P26q03Q86r78J079j190J311j444J593j753J931
53A013k131K357k612K902l234L620m082M635n313O175p308Q863j1144J4812k1654
68a3101L8564j54467k22044M29491K05629k93589j93235K23802J15457j57132
78b0625q0577J11062M8235j6654o458o9775q9270J13900J73897q6141k10403M1200
90i1609J70147k4982j15204M3703P4558n4670n1801L7351M963j1732O9725K1799
102G2248j34270o1243J48433R7199j13469q6167P4754M4109n6694p012N0042m868
114B3062k1792J3347l2991m5205P8597R2175r3033j22052Q2048J07777q5666p0617
$$ y = [0, 0, 0, 0, 0, 0, 0, 0, 0, 0, 0, 0, 0, 0, -8, 8, -8, 8, -16, 16, -16, 24, -24, 32, -34, 40, -48, 56, -64, 73, -86, 97, -111, 125, -141, 159, -178, 201, -225, 249, -279, 308, -345, 381, -422, 464, -514, 565, -625, 686, -758, 835, -918, 1013, -1118, 1239, -1373, 1529, -1705, 1915, -2167, 2468, -2845, 3330, -3978, 4885, -6259, 8553, -13101, 25463, -129004, -351048, 78443, 284072, -9517, -202752, 21050, 136507, -20625, -101202, 9860, 58095, 41441, 34983, -34792, -124062, -10162, 163735, 77594, -132809, -91609, 78538, 53556, -61648, -17945, 56613, 1943, -49858, -12507, -7544, -19276, 50449, 72248, -62022, -123265, 25168, 122367, 8898, -77269, -2515, 41594, -15100, -22112, 27930, 23062, 1270, 14617, -18374, -63579, 15018, 107193, 14160, -107892, -25844, 81933, -3733, -74350]
126g4350J14744M1529j51715l5125J66392K8900j55905j857J47889l4680j53684
137a07862N5349J64314m3624j47516K3886J00650j8822m5364L3998Q746m6942
148b3187J0443L8429l4420k1642O9589J4599j03134k6534J08682L4963r0224k4019
160d6455O7309m620n8298K7751N7706l2128m4661K9511J7805l4491J1506N1415
172D2350k1527n9115J8236M8526j7465k4049K9033N156m3482j45M2598m631k6511
185a1026K0029O564m7873L15O9071j755p6341Q135P5193k5261q0007M1455R2990
198G1489m1978r8262K9525Q8130j4659o2847J1332L9407j1425k1551O048N460
210F69P666J7737j8090m7146J5040O7695n320p1941k824O2343j843n4041R953
$$ y = [-74350, 40394, 81923, -69792, -104917, 61475, 90375, -65530, -67387, 80502, 45822, -107862, -52513, 111801, 68177, -79339, -55453, 45197, 26375, -18989, 15009, 23755, -23187, -12744, 25685, -8735, -30377, 39212, 53811, -49323, -75857, 32825, 67788, -22436, -46455, 20854, 16234, -42064, -14313, 43393, 11265, -33396, -3885, 13920, -20571, -9065, 42350, 20823, -38292, -20056, 28470, 11005, -13044, 15989, 21145, -22337, -22482, 20116, 15485, -11026, 9003, 15567, -32306, -31991, 37080, 35325, -41016, -32881, 42312, 17051, -62956, -21501, 71489, 29511, -68751, -39226, 48904, 34245, -28602, -17270, 22137, 10712, -10839, -4791, 669, 8335, 26072, 7982, -39164, -24124, 43571, 38251, -33690, -36514, 25829, 23986, -30055, -20102]
223b0102M8086j4101m0433J2652K3594j3900k101K5802j1764l8998J4034M5288
235B8057p850l7743O968K6345r704j6473J1548R318n661J179k442k0853L549L9437
249B5675J641n0274j0027M8523J0622m4712n962M2520J469m1638j891L4750M446
262A5142k0426N03O209q911K031J7815l072j7395N340J3164j0960q523J7797P957
276A6671k0047p426J6189q9j2959R897J3722j9683j8263K1136J8948k0660j4991
289a7555J9853R200k1516o579K1910Q095j6329o420P653J405P61P532l370j1466
303f826M997J2130p941j1103J3702J2018j7008j5601J4775J4421j0608j0355P681
316B82K074r088K263R538m194p960N874L253r311m33J4283J798j5356k803J2712
$$ y = [-20102, 27984, 13883, -26550, -13898, 9696, -4204, -6305, 19497, 7733, -31265, -17231, 28057, 20207, -17536, -10568, 15777, 6073, -10400, 1148, 10466, 4805, 5984, 3542, -17311, -13762, 25675, 27316, -22958, -32985, 15538, 26160, -18552, -24514, 18006, 19475, -22163, -24054, 10696, 15142, -5284, -4781, 1428, -7483, -5452, 12363, 9291, -8104, -2764, 10400, -560, -9083, 8714, 16671, -3376, -10802, 5387, 5298, -7661, 2236, 15958, -3725, -21988, -852, 18096, -2564, -17555, 2298, 11498, -10018, -16597, 5313, 13408, -2921, -9341, -1688, -283, 478, 8010, 4640, -6826, -1829, 10301, 2360, -8743, 4959, 16977, -31, -15632, -857, 13564, 2956, -7399, 282, 2356, -6732, -4469, 5069, 875, -7085, -1211, 2042, -7269, -7702, 6581, 8379, -6977, -9780, 2932]
331B932K775p240J741N671m798n104O125L171l994Q32L191n624o294P296P712
346H392p408p168N650L199p534j058R479K33r686j263P582N47m091L215K916m709
362a704k827N427L222l050o75K856j682l292K624M137j609k492k9k002o56M272
378B520K531o041n685N741N315o279o017O845P238o493r903L695J0983K111p853
393a292o475M204R461J005r460l693J0012P384j0105j0510Q020J3850l641j5269
407f509j689J1581M877p184o284J990M228Q39l427l638J439N657J608o912n550
422h974O124R168j865r448j891Q710M592m512m572K237L964j23k548j245P18K175
438B510K284k542n886j030P374M801p613q627L738R788q98r174j624O688L046
$$ y = [2932, 5707, -1533, 208, 5879, 1081, -4023, 2102, 5273, 1279, 2111, 5302, -322, -6616, 680, 8392, 984, -6184, -534, 2665, -4869, -5927, 3552, 3785, -5901, -7164, 418, 965, -3126, 89, 3005, -1704, -4531, 896, 4118, 1068, 393, 3249, 1567, -1725, 899, 5036, 3427, 935, 906, -1096, -1752, 2520, 5051, -990, -6675, -934, 4381, -1898, -7915, -1070, 6168, -325, -10228, -6533, 4450, 6561, -1292, -7767, -3563, 5898, 6903, -2557, -6250, 3762, 11146, 1041, -9469, -1449, 12401, 8760, -6509, -8198, 3383, 8260, 1076, -5208, -3218, 1010, 1849, -1578, -5216, -3777, 1880, 3488, -3424, -8974, -2850, 6318, 4453, -4995, -6886, 1824, 6416, 1904, -2668, -431, 3533, 3410, 862, -383, 335, 2510, 4794, 2252, -3634, -4664, 2710, 7511, -102, -8729, -4991, 4797, 3899, -5275, -6899, -211, 2835]
453B835l720k802K8J848N014K687p791q884R067J7081n609k2503m26K5917P442
468B0184k5416j3960K2211J9150j7399k3207R045K2520l44j8717q248J0063J1865
481G747O9j2280j0007Q269J8090j559k3225m940K5128J4320k3479k0840J8348
494d359K6475r978k7031K594K3608L534j7675o625J1055O731n220n710m13J250
508a764L537L778n362r970L558J3745p37j5979k010J5617L876j4276l585J4377
522D805K746j4064J64J5249k357j6514N444K0165o828k4093O126K7453l433k8965
536a4102p48K7038L982k3579o834J6826P252j0280n803J977J426M339N406q252
550a352j3854R471K1908o427k6932J528K9991N051k8291j0626K4312J5880j7521
$$ y = [2835, -885, -3687, -3659, -1811, 3203, 5890, -1901, -10785, -1718, 15363, 9754, -12749, -13175, 12742, 20184, -5232, -19192, 3019, 22169, 4770, -18437, -9392, 13128, 12784, -5933, -14181, -4118, 7747, 7816, -4464, -14471, -6202, 11888, 10329, -12896, -17836, 7292, 21612, -1867, -22707, -4359, 22116, 12138, -14893, -12299, 11309, 14843, -2832, -9457, 1598, 8329, 3109, -2601, -3014, -1764, 1773, 5551, 189, -9781, -6223, 7522, 6785, -9194, -11204, 4413, 8289, -5987, -9572, 4805, 7551, -6513, -6349, 8900, 6543, -9971, -4527, 15638, 8810, -15283, -9157, 18296, 14863, -14102, -14850, 12188, 16170, -7409, -14243, 2583, 9835, -445, -6248, -4271, -2845, 1494, 6900, -1352, -15206, -5735, 16173, 9746, -17186, -15658, 14333, 19384, -8907, -19533, 4779, 20659, 3138]
563C138j7836R187J7121j075j3308n293O404P514R20p840p808L845J2100J380
577H449j5756p625J6304J3729j4392j9025J0464K2887o126k2883L254K1808o17
590A0471j9309Q60J7569j566j5178L462J3630n672j2544P367J2018q446j2393
603i731P323J1212o553r281M273M867k918q16K722m626k863Q935M753j2018p836
618a2557J4943J1195j3753j3633J1180J5931o163j5233J418J2916L442q792p013
631f119L180Q436K042q036p291M537R849m23j1262m843Q996R065n178j2290l7
646i374J3660N657j2713j0486J0856J5001p068j6467L393J6937J18j3825k144
659f455J0204L415o396l075K618J118M71M96l400l040M061M576m592o115L415
$$ y = [3138, -14698, -5511, 11610, 10535, -2773, -8066, -1662, 5852, 6772, -1068, -8876, -5031, 7069, 8449, -7307, -14932, 1372, 15101, 709, -18316, -7852, 15035, 8909, -13974, -10720, 11088, 10471, -8838, -7978, 9591, 8025, -7153, -3691, 9939, 4267, -8277, -910, 11108, 2662, -9731, -2408, 8804, 2251, -7030, -2757, 2110, -808, -1624, 1098, -3528, -6391, 2544, 7297, -4721, -12557, 2386, 13581, -172, -13805, -2625, 13306, 7143, -8090, -6672, 6244, 9686, 894, -6119, -2939, 5497, 7539, -497, -7788, -3251, 6598, 6175, -5087, -9930, -934, 8131, 2953, -9337, -9374, 4286, 9943, -2770, -13256, -2400, 12601, 5533, -10934, -7541, 9396, 9514, -4311, -6455, 3749, 7164, 768, -2307, 311, 1429, 1900, 2396, -1004, -4044, 17, 4593, 1, -6114, -2699]
674b699N777k544m998K023K954j103j130J875n92j624K514K414k896k911M119
689A179L671l749l523L752K738k906k102J893Q31j558m00N99o34m33O10k08j211
706a451j39P35k34m41Q51l85p82J293J827j612j986K452L065k758l212L987L318
723D528l314l546L089L604k878l313J684K702j252k671r8J514Q07j110j869o21
739b744K673Q92k686k021L230K703l080k545L194L159k393k612K438K521j458
754A271j367J080P88p62l99J010n20j109L52P05p68j153M44kL1p1r92n63R58J158
774I1o17k400J203K838n93k590N35L093J59k212J32J488O7j78kr4k57J061N36
793B260j920j282J493J071j358j809O89J475o38j603l7N22N15J52q13j025J333
$$ y = [-2699, 3078, 534, -4464, -2441, 513, -590, -1720, 155, -437, -2061, 453, 2867, -29, -2940, 1179, 4850, 1101, -2422, 1330, 4068, 1162, -940, 953, 1784, 226, -174, 425, -209, -642, -32, -240, -1451, -1590, -855, -1089, -1530, -679, -1064, -1846, -553, 1274, -338, -2324, 128, 3193, 435, -2777, 1210, 4528, 1214, -2332, 757, 4361, 1483, -1830, -146, 2556, 1304, -1367, -1465, 49, 856, -254, -2123, -2744, -71, 821, -1865, -3886, -656, 2047, -1033, -3578, -384, 2775, 382, -2230, 208, 2729, 1271, -96, 984, 1772, 1010, 611, 1621, 1101, -8, 344, 1049, 281, -872, -428, -430, -399, -470, -1462, -2025, -1067, 91, -526, -2926, -1723, 1115, 522, -2068, -1533, 1560, 1719, -493, -361, 1127, 1194, 1016, 1014, 920, 663, 1724, 2260, 340, -942, 551, 1622, 264, -1545, -856, 619, -19, -1622, -1659, -1137, -622, -470, -1283, -2308, -975]
810i75J995r15j933P64L189j88l142K61L228L58k657r57K505O25j240j016J86
827H8R14K97j103j678N9K586m09k952p89L477N39l136j138K816J323j459j167
844a732J506N28j20L94j96o70P92K034j054k288R49K630j002k647M59J944m01
861A126j504k77K9K56J52J59j652n82K136R03k382j070K365J260j668l75J160
878C6L0m68J436N84k238l62L484L97l409j058L984R32l866j187K207J067j547
895B2m44k72r60J321J666k178l032K260M225k500m331J918M627q38l278r3K866
912I79O34o72o46j113J469K578j037l418K00L924j63m247L75K982j268k340J652
929a11J175l497k41M323k24n585N53O341o79o296J317N775j461l769K150K785
$$ y = [-975, 1020, 105, -1828, -1064, 2125, 1937, -1205, -944, 2284, 2642, -15, -972, 1533, 2158, 918, -98, 88, 1002, 1299, 196, -1482, -1423, 1163, 754, -2198, -2987, 490, 1029, -2107, -3245, -429, 894, -565, -1732, -226, 302, 182, 576, 380, -290, 502, 2536, 1482, -806, 143, 2773, 1771, -876, -417, 1527, 1126, -378, -655, -626, -370, -218, -59, -1711, -2293, -157, 746, -1636, -2706, -341, 919, -749, -1124, 36, 66, -402, 1034, 1618, -620, -982, 2502, 2899, -510, -1568, 2416, 3348, -518, -1705, 502, 1569, 22, -422, -694, -1654, -333, 1333, -845, -3877, -1617, 2608, 108, -4223, -2305, 2322, 1484, -1794, -1887, 979, 1613, 941, 295, -818, 651, 3229, 2192, -1226, -1026, 2898, 2735, -1512, -1137, 1845, 577, -1763, -111, 1064, -2433, -2674, 1649, 1425, -4160, -3607, 2734, 2055, -4241, -2924, 2851, 1390, -2379, -229, 2556]
945B556l062o08M552r10n560J700P495k025q840J595Q957j622q100q7O452N28
961C021m332j252J108J374O12j3l217j087M533K435m214l726L869M403j514l659
977a659j287L716L558j536n490n92P213K327p888m144P874M611p701m461O438
992I79L199o001j341M942j605m625M092M565o285n009Q310N458r562m434J0008
1007B691M352r809k902R869J058q408J004Q016l487p544N314P180o709o893O902
1022F34O257o983o054N823M260m280l196L019O52j525J213O48k766l58M379O61
1038B384m263r50L464K474k057k190o30L300K926k679n893K257P977j726r488
1053e094L21J0252l64r941J85Q394j160o744K175M229m285j558N922J54q155K072
$$ y = [2556, -506, -1114, 3438, 2528, -3032, -1332, 6163, 4138, -4702, -3107, 5850, 4228, -3872, -3959, 2493, 3021, -1311, -2563, -1455, -81, 531, 518, -2699, -3786, 747, 3182, -1032, -4758, -889, 3514, 2000, -1659, -2946, 770, 4328, 2792, -2698, -3290, 3923, 6250, -1638, -5782, 2092, 6703, -998, -5459, 979, 4178, -1823, -3164, 1778, 173, -4452, -360, 4205, -2080, -7089, 1221, 6679, -2883, -7317, 2691, 7043, -2766, -5668, 4201, 5259, -3149, -2145, 5871, 2384, -5160, 154, 7334, 625, -6268, 634, 6891, -92, -6146, -323, 3937, -343, -3539, -520, 132, -1393, -180, 468, -2298, -2656, 1723, 2384, -1879, -2829, 635, 3109, 1052, -1138, -1768, 1532, 4458, 1779, -4114, -1857, 6120, 4394, -5094, -4773, 5479, 5115, -4826, -4641, 3753, 2593, -4151, -1976, 2253, -2032, -3590, 2332, 2486, -5669, -3597]
1069c597R966k889j1268M516J1301m761j0209N322R413n912p245O205N100o629
1083f87k994P046K70o975P63O631k735o063L655N048m839l767M558K418m555r28
1099c154M522k32l982J984L362k456j911K585J300k416O45J908j899j588L836
1114B504L28n198L58N814j556o228J930O176l110n773L649M163m271k726M787
1129H47P04n180J727N278l098n374N114N160n576m603O839L937p235j950O723
1144C313Q28o297M75N495k064n237L826L673n166k716N594J250o478K90N956j557
1160A185n765K829N058l792l462M115K659m200j006M481j46m176K112L704l257
1175C39k816M584J698n299n22N221m63n539J262M738k336m303L020L170m162j761
$$ y = [-3597, 6369, 3480, -7788, -3272, 8029, 3268, -6941, -1619, 7794, 1882, -5363, 842, 5942, -687, -3681, 3365, 3635, -3340, -2577, 4054, 1319, -4744, -1089, 3959, -880, -4647, -89, 2329, -2226, -3154, 1368, 1136, -2846, -862, 2500, 44, -1867, 718, 2018, -398, 247, 2155, 256, -1332, 2504, 2832, -2366, -2008, 3806, 2250, -3978, -2048, 4128, 1018, -4755, -1106, 3057, -1214, -3940, 847, 1551, -3629, -1902, 3376, 278, -5096, 18, 5178, -398, -5001, 1838, 5775, -1460, -3410, 3313, 4141, -2156, -1681, 3814, 1750, -3487, 339, 4012, -1154, -3870, 1724, 2974, -3504, -3214, 2742, 1185, -4580, -1751, 3307, -485, -3947, 168, 2827, -1373, -2379, 2102, 1956, -2220, -108, 3596, 339, -2477, 2107, 3805, -1494, -2016, 3205, 2742, -2797, -1535, 3203, 867, -3436, -416, 2754, -1408, -3169]
1191c169M230L00m156J095L800k308l037L286K764l809j827M728P30m412N31M506
1207C252j672m201L166L184l448l172M529K014n491q94N192n33m745J008M119
1222B308k210l445L064K247l906j082M658j42m500J573M159k005l362K795L301
1237C453l569j879L865J037m113K75L794j302l897K166K979l050k535L319J412
1252A955l630m80L248n52l156J561K594k182k234L240J552l316p53L735L9l212
1268a591R76L131j677k370K657J760l245j249L585K79m049Q01L437j665l230J942
1284e08K158k189k187K733R51l016L60L006j425k135J894K180k007k140L173J397
1300B245k938p01L306j42k752O04L084k053k129K372J350k690j234L024K7l302
$$ y = [-3169, 1061, 1361, -2795, -1700, 2100, -208, -3245, 41, 2805, -1004, -2831, 1897, 2627, -1785, -1254, 3252, 1580, -2621, 545, 3729, 281, -2891, 1638, 3652, -1839, -2733, 2459, 1926, -2819, -1811, 2308, 98, -3347, -283, 1964, -1942, -3024, 1634, 1492, -3008, -1435, 2724, 719, -2643, 152, 3453, -116, -1995, 1870, 2907, -1206, -931, 2863, 1561, -2336, -170, 2809, -241, -2776, 543, 1955, -1675, -2155, 1093, 541, -2615, -1054, 1540, -642, -2876, 364, 1916, -1400, -2153, 1582, 1621, -1591, -615, 2516, 839, -1531, 1126, 2886, -359, -1608, 1977, 2256, -1793, -992, 2445, 780, -2450, -508, 1650, -539, -2726, 7, 958, -2058, -1698, 1308, -117, -2252, -358, 1822, -185, -2325, 848, 2245, -693, -1394, 1912, 1770, -982, -378, 2706, 653, -1476, 896, 2246, -444, -1678, 1346, 1373, -1929]
1316a929K39K896r30k579J243K176j749j720K345R13k068l00K373k38j880J446
1332B38J685j568j209J977R20k255n33K439k26k122P15J549j211j462J021R94
1348I52j889k74J761l93j813R09J528j439j052J707P46j663m09K057M44k231M91
1365e68K508r83k148J420J998j531j946K212J121k219r61J823K61j658p4J203
1381D58o32j214J073O70j269o68J482N97j518J02J186K30r18K58N15J8l38N34
1399E66k01j89M59N18p16p03J027K97j110k25P83j65q70L90L01p50o96Q36R25
1418D77j699n79J731O39j472l40J452P68j498n5J392L8j011j10J405j66j046M43
1436C69Q67q14r10O52Q30p80j402Q61J054n17j119N5Q72J08r98p2P12k2n32L42
$$ y = [-1929, -1690, 1206, 276, -2303, -1060, 1116, -633, -2353, -8, 905, -1163, -1463, 910, 672, -1208, 238, 1923, 355, -854, 1123, 2043, -212, -745, 1694, 1468, -654, 61, 1610, 399, -1063, -42, 952, -937, -1211, 550, 157, -1656, -747, 781, -658, -1710, -3, 743, -920, -1329, 728, 1172, -1059, -568, 1940, 957, -1191, 229, 2227, 696, -1250, 962, 2083, -136, -1097, 726, 987, -671, -745, 458, -174, -1388, -315, 355, -914, -1582, -100, 497, -1021, -919, 267, 497, -421, -163, 352, 370, 32, 566, 365, 176, 635, 1153, 437, -266, 761, 1058, -52, -277, 506, 341, -529, -139, 162, -588, -1284, -448, 477, -1222, -1801, -70, 569, -903, -1243, 209, 977, -521, -576, 816, 854, -157, -267, 1138, 972, -74, 369, 1236, 422, -488, 164, 994, 214, -1188, -327, 727, 210, -909, -854, 18, 126, -872, -944, -232, -254, -786, -444]
1456d44L36j21j78P44M47q95k5Q29O65j149r08J352J285j289j425R68J259r33
1474E18j680R50J123j006j144Q69L69o76o50J141M49j283p4J475J11j560J08K035
1492A075R6j506k31J896J95j973N7J725j23j922M78J904p36k153J039J593j122
1509B92k225J403J599j283j595R23J653r16j363R94J227r11r46J161O87j005k99
1526f04J548O5j313j04J646N9j630j04J589%j533n01J436K70j328o94J556J03
1544D61j316q6R28J04j144J86J069j70j090M81J426m02j487J110R36k48j429P42
1562G1J517o78j372O28J148p60j262R03J053j408r45J449L67j459n19J247L10
1579B90j267MJ197j04j243L15J319l26r84P56Q68k94r66N65R41l33j022O06O71
$$ y = [-444, -108, -229, -407, 337, 784, -111, -136, 693, 1358, 209, -699, 653, 1938, 649, -776, 192, 1451, 518, -1162, -212, 911, -95, -1239, -370, -1, -677, -1327, -186, 263, -1020, -1094, 381, 492, -1068, -960, 1075, 1171, -335, -566, 1330, 1525, -448, -391, 1334, 1211, -711, -233, 1671, 935, -1218, -179, 1414, 292, -1933, -530, 1069, -214, -1809, -886, 767, -149, -1512, -518, 709, -202, -1148, 13, 700, -305, -604, 944, 1009, -304, -408, 1238, 1297, -333, -437, 1152, 1152, -381, -882, 554, 824, -504, -1198, 358, 461, -855, -941, -13, 91, -1053, -867, 202, 32, -1058, -577, 849, 447, -1040, 70, 1006, 758, -671, 71, 1588, 910, -462, 166, 1314, 554, -708, 195, 1248, -160, -1105, 344, 711, -748, -1267, -20, 290, -977, -973, 224, 120, -1123, -808, 511, 185, -799, -43, 825, 531, -435, 130, 1071, 738, -284, 322, 993]
1598I93l70r28N46N49n91m72J80M69q04m6j05K31J7l81J08M23j21j46J85L22l96
1619c37l34O20N42k61k04M83L94l82m61N85K74p79l07Q58k69o15l03O27P4r25
1639g20j31Q16J17j129K44Q14l97p45M27Q34j69n31M57O10m45n35P80L27m99j13
1659A2M80K34n29k23O78k05l36j27J46l19j22J50Q7m39m4J31j48J17R4J45l73
1680e91N05j21j01L8N91r3k08J02N44k03m93M61M42m04n89L99L39m07l89L41K96
1701D59j141KP50L5r17KQ83j95r56N55P34l06n87N07N11l31k64N93M18o82j33
1722f3P78k39l33J00K90j53j37j33K33k37l09J29p7K87m78m5j42J37J56j94j24
1743e54L98J06l99L9M07J52j82J16L75j8m19K11N86k08o40O08K18l47m51K19L96
$$ y = [993, 623, -305, 241, 790, 199, -273, -93, 376, -428, -474, -579, -348, -331, -712, -604, -181, -302, -448, -263, 59, -337, -671, -51, 491, 230, 26, 509, 903, 521, 60, 645, 919, 140, -167, 691, 422, -193, -496, 131, 205, -720, -851, -35, 82, -1047, -803, 11, -386, -1131, -704, 130, -39, -570, -113, 497, 52, -483, 297, 624, 125, 12, 492, 726, 197, -26, 652, 447, 111, -16, 130, -189, -311, -161, -74, -513, -557, -426, -574, -457, -363, -218, -591, -86, -207, -308, -270, 321, 228, 20, 122, 666, 463, -30, 431, 873, 469, -120, 279, 618, 211, -178, 163, 459, -682, -680, 70, 105, -812, -810, 73, -122, -1078, -523, 211, -95, -682, -175, 336, 5, -259, 334, 752, 70, -63, 715, 476, 143, 243, 533, 380, 243, 110, 343, 106, -203, -74, -151, 136, -342, -387, -529, -392, -236, -430, -554, -156, -50, -449, -410, -3, 149, -33, 83, 458, 440, 21, 232, 818, 610, -30, 578, 796, 449, -2, 217, 613]
1764F13m42o94P15j12o69M3M49n6m66j76P73q0o25L42L42o3k23K7O38j22j82N02
1786E34k01l3K0Q7J21l6j61j19J37k01j14J27k79O4n15R6R0J83l5m23K16K30n7
1809b69k50P3L14O5k51N69p4N4j68M60Q5n64j8M51K43n40K1K75j44o71L71L32
1831C64k20q15J52N12k90p96N93N25m61j52J93N85o21p2L79N03j30n51N81M75
1851G54m09l16N50N0R9p72M88j39j42j26o8M42o61J96k66j97J83l37K76L08l68
1872d55k49L95J85O9n49P78K63l03l55O32L74r20Q5L31O97j067j81Q14K50r18
1892a24l23N76L62j037K8P78j41r95L15Q37l41n79J42P79m62n75O46N39l80l8
1912GK25L08j31m27J48P24p12q5M05J52j31n36O5K97k72j86j3K53k94m37J34M03
$$ y = [613, 171, -523, 192, 80, -589, -546, -97, -153, -619, -795, -22, -102, -727, -385, -43, -106, -329, -302, 336, 214, 32, 534, 333, 300, 320, 407, 528, 492, 331, 212, 349, 148, 34, 161, -118, -54, -569, -473, -383, -200, -235, -658, -442, -212, -269, -519, -446, -132, -67, -318, 251, 177, 231, 63, 523, 608, 44, 26, 477, 720, 180, 201, 476, 332, -339, 32, 364, 144, -671, -519, -7, -297, -1093, -500, 25, -436, -588, -395, 190, -431, -503, -124, 379, 249, -302, 279, 754, 345, 29, 579, 629, 728, -44, 444, 305, 163, 37, -31, 411, -250, -54, -320, -517, -334, -671, -395, -87, -455, -704, -309, -124, -55, -604, 174, 437, 134, -221, 411, 785, -135, -50, 281, 978, -89, -270, 544, 794, -124, -447, 129, 491, -546, -518, 260, 119, -876, -561, 276, -65, -644, -502, 277, -185, -760, -114, 425, 45, 7, 232, 540, 409, -18, 130, 854, 142, 57, 462, 614, 483, -53, 12, 309, 37, -149, -162, 91, -203, -640, -506, -103]
1934a03n7o21K88O34k32o64P82O18m58p65M70R18p04j97L83N70o73l67O30N01
1954I53j119l81J083k0q95j24Q40n2q64k87Q20J42q63K88Q24o84j77L72M82j43
1974A95m78M2R04n67j22M29K50j77n10K51N24l86l43m0M10j79p54M82L12k14n91
1995e62k52P54o4m39K35O00k42q13N07P93l17q35P08O11l91l27N46L53p74j95
2015a04N48N57r71k44P02M79j253k84R60l48n89m0P81k57p09L17N08l48m64N39
2035b20L8qk82L84L98l69n2O59k26j72K5N71k78j75j70J42J41k76j36R2q0j5k86
2058b95j15K16J29k61m21M18J05m28J81N87l00m61N36M96j20o63N83P36o08q02
2078d87R31K55q86J59O76J55j150J37Q27o64n06L90N35n26n53L82M32o07j90P89
$$ y = [-103, -160, -781, -493, 141, -91, -755, 27, 645, 187, -578, -108, 810, 106, -91, 292, 862, 189, -178, 452, 953, -166, -547, 536, 516, -379, -503, 337, 285, -579, -866, -46, 96, -767, -479, 345, -339, -516, -144, 338, 195, -283, -241, 663, 96, -26, 403, 653, 476, -34, 217, 741, 355, 12, -28, 382, 203, -551, -69, 243, 29, -562, -814, -60, -124, -563, -328, 272, 30, -783, -276, 517, 200, -635, 73, 684, 293, -34, 512, 865, 91, -104, 444, 1001, 30, -214, 488, 967, -286, -570, 390, 42, -547, -587, 194, -63, -772, -455, 53, -295, -759, -220, -182, -190, -472, -88, 310, -59, -111, 548, 322, 150, 175, 746, 468, 293, 123, 265, 406, 130, -6, 86, 6, -9, -295, -410, -194, -65, -326, -747, -329, -224, -652, -471, 116, -184, -645, -109, 387, 267, -396, 187, 923, 315, -487, 444, 699, -187, -28, 648, 803, -347, -210, 617, -47, -553, -163, 372, -154, -707, -325, 107, -500, -690, 99]
2098I9k52l68K51L67k44k59M40M03n34j4M53Qj00r0N90k49n92K81L97n55k03M60
2120B89l06m23K82L47j065K24O83N9r01K01Q47j95r19N57J071n32p43M96Q79q75
2140b4m08R72M15j063j66J231m89j002L90P91o85o20Q27J30p61k69N32M99r89
2159f89P8O88l66l44L06O14m95l68Q81m6o50M36N75j78n70L55M72o72O9P21l05
2180E12o05R9N26q04k22N28J97n81o43Q90M60j248K20J023l10r86Q30O37p73m00
2200f50J074L15q36l23J158j08j030M61N14n4j019Q22K26n97m61Q92O5p84j95
2219e30O00J86q42J10Q37o15n37O39M72p94k71R25j22o38O38O09n82l07Q83J4
2239F75p34p9O24k02m95L57N12n88o33Q69J16q90j45P79k56n77L7J024n84p24
$$ y = [99, -153, -521, -270, 97, -147, -406, 34, 437, -97, -111, 342, 350, 250, 160, 750, 501, -91, 190, 587, 32, -171, 289, -17, -440, -158, 189, -876, -652, 31, 90, -811, -610, 237, 42, -877, -320, 751, 219, -524, -28, 851, -24, -432, 540, 955, -108, -274, 957, 468, -534, -144, 647, -38, -658, 169, 299, -462, -731, -199, 300, -689, -611, 77, -289, -633, -327, 287, -208, -576, 305, 259, -391, 45, 620, 442, -128, 227, 699, 27, 96, 817, 512, -93, 6, 532, -272, -494, 34, 231, -350, -993, -103, 357, -891, -671, 352, 42, -944, -114, 523, -250, -650, 424, 739, -97, -420, 738, 630, -400, 61, 575, 521, -498, 324, 550, -47, -508, 384, 449, -335, -530, 70, 256, -586, -476, 361, -254, -791, -152, 320, -474, -745, 180, 58, -580, 58, 667, 85, -222, 661, 675, -59, -138, 486, 284, -211, 146, 658, 70, -563, 306, 422, -468, -613, 166, -90, -667, -630, 394, -190, -914]
2259i14P99O01j043j7R93J86r00j34J198m80o36N92O46n92n20O08J83n26k33P45
2279E56q3r58L13N45l88n50M06L52o59mN40j8p03J55P05l92j69M32L58q31q8J236
2301G55k79r30O07M32m25n97Q56L82p66l67Q21k75n08N0N29j32j230P03O69q16
2321e21k39O18L59n41k97O57J52o63J69O65j63l54N28J06l54p7M71O2m31pL74
2342E14l82l73M35P6m42k11O15k33n49L66L98n45m55M50K37m07n8P23J77r52O65
2363D9N15j33q02Q70K82o37m02P35L40r75l7Q99j73j068K45O66l27m52J32O71
2383C98m99n16O99j50l98j43P74L9o58L10M34j19l59L14J74j78L2j27L7K4J84
2404B72k4k93J78O6k87j4J36l4pk43K78N9n94L9N76j99n95L81N70k24k95J96M01
$$ y = [-914, -115, 486, -557, -574, 419, 605, -295, -429, 769, 289, -347, 245, 891, 299, -221, 387, 570, 44, -189, 556, 473, -485, -172, 373, -15, -565, -159, 193, -466, -470, 70, 52, -651, -496, 209, -183, -352, 80, 438, -393, -481, 755, 476, -454, 153, 585, 160, -437, 419, 801, 35, -332, 489, 214, -294, -244, 285, 153, -1077, -374, 295, -521, -760, -142, 217, -324, -621, 36, 188, -475, -306, 359, 196, -158, 370, 476, 122, 45, 516, 578, 147, 140, 514, 132, -241, 194, 270, -172, -383, 232, -1, -550, -184, 214, -331, -786, -336, -99, -506, -564, 159, 336, -616, 49, 564, 431, -371, 499, 781, 144, -258, 477, 817, -158, -195, 704, 531, -537, -292, 374, 47, -405, -273, 398, -101, -617, 82, -68, -466, -609, 165, 204, -454, -144, 290, 171, -188, 126, 300, 122, 154, 27, 64, 88, 272, 248, -45, 133, 199, -88, -102, 34, 0, -7, -250, 28, 87, -507, -468, 108, -91, -686, -305, 265, 41, -254, -58, 343]
2427C43m1m22N49J63n25p2N54k72n60Q7N73m5n51L71M72n28o06L01K44l10l9L29
2449A5j0k82l7L07J4j65J02o9P3P2%J40j26O3J62M9j64j12K80j66J21l40J7J9
2473c7l4K46n73J45N14o07j17L62J67n41O0L23J43m20L6M57K3l16p8O14j26m37
2495a96N1O21l05R5j00L06l35j55J01K94l29j68q9P3k55J77K15k63j56L94j21
2516a45j59P3J81j69M68j41j45J39j05J96M8l3k0K04k01j00Q8K61m22R5K37m07
2538e7O0J35L9j46k10j12J16j29M0n7J6J64r1J65Kj09K13M5j27k9L72L3l65K47
2562B15j32J18lnm1j86J26k48L0m5R1j08J2j07L06k66j11K65j69L74l07on3N5
2586a95R4K45j28j03J90J93J8k4j53K27n6j03J78k02K0j38j67r7p1K05P0P9m04
$$ y = [343, 302, -120, 429, 592, 67, -5, 549, 277, -283, -196, 377, 332, -219, 152, 624, 96, -510, -209, 35, -275, -314, 15, 5, -277, -314, -7, 7, -158, -56, -125, -52, 20, 20, 160, 34, 97, 259, 308, 144, 32, 312, 146, 267, -73, -56, -37, -71, 175, -398, -253, 261, -346, -463, -101, 66, -475, -415, -92, 51, -369, -333, 124, 147, -169, -247, 367, 241, -196, -145, 476, 171, 266, 166, 472, 137, -18, 83, 377, 48, -120, -209, -136, -391, -214, 1, -262, -418, -24, -145, -304, -231, -50, -219, 249, 108, -37, 102, -3, 193, 241, 208, 188, 392, 191, 91, 179, 440, 18, 113, 350, -57, 3, 138, 177, 31, -179, -291, -175, -304, -264, -321, -305, -141, -232, -67, -65, -174, 39, 84, -43, -72, 300, 333, -32, 215, 83, 201, 198, 193, 152, -34, 92, -156, -126, -171, -80, -188, -176, -283, 23, -243, -354, -89, -258, 116, -191, -197, -250, -195, -101, 144, 16, -87, 103, 296, 314, 290, 137, 364, 308, 205, 383, 181, 201, 63, -104, -201, -272, -67, 3, 82, -322]
2609c22J97k29K02q3J13k22L3M29j22q4J14rJ86m56M10L8M0k63j9O10l97l3K27
2632C60j22k01l5%j20j15Q1J28j30l31J84J39N6m29K31J92P6m3Q2j22R9J10M3
2655A33l0K20k62k0K19k09k3J06L1Nj28l8L15m13l67K23K87j3k77N6J27l4k85
2678c77K19L44k36l62N62N2k91o1L83n9j32LJ22J95k74Q2K3l0K2n6n1k7l52M66
2702A65p9k73j44N9L05k98rM56q4l97J58JK10J0J16k18K16k5L6j60M2J40k97J11
2726D1J35k6j71j5K19j94l32K53M83j99m98J20J85p1k35K12J91l95k18M49K28
2747A62m18N8L99l45J36J18J05K05l96K6M07l03j63L38j57M2m42J91J78l86J18
2768a27r0L99o92L17O3J85m98L45M7p5O5j77L13K9k58J85J17o9J27P1m4K20j55
$$ y = [-322, -125, -354, -152, -235, -122, -344, -311, 118, -4, -88, 26, 17, 203, -253, 157, 195, 235, -28, -47, 563, 166, 133, 360, 238, 37, 2, 2, -118, -233, -152, -24, -154, -485, -301, -162, -106, -535, -304, -112, -36, -79, 3, -119, -20, 90, 133, 103, 323, 61, 41, 260, 51, 28, 134, 165, 170, 42, 4, 319, -94, -461, -238, 49, 36, -241, -185, -58, -92, -377, -158, 186, -50, -412, 150, 202, -89, -150, 233, 174, 42, 45, 167, 362, 88, 170, 193, 163, 185, 129, 78, 51, -301, 165, 86, -187, -331, -272, 33, -265, -274, 182, 98, -299, -141, -140, 70, 80, 196, -22, 194, 169, 205, 45, 87, 227, -70, 41, 176, 150, -21, -36, 183, -11, -343, -90, 393, 194, -304, -184, 1, -70, -305, -93, 98, -297, -515, -66, 162, -256, -198, 201, -144, -8, 110, 215, 420, 24, 50, 457, 154, -9, 329, 172, 214, -228, -37, 141, -245, -127, -217, 182, -510, -193, -130, 55, -443, -98, -51, -126, -61, -238, 75, 104, -154, 31, 148, 79, 206, 277, 233, 453, 298]
2791B98k96OK58j84r1J07J8j57o0q9L73k88m27J02L70j81p9N49j13l53J99L04
2813B66k06r2M61n0k03R8O3L78n14k41L06P0m69k0K18K38m81kK37K8j63J7J71
2836A10k17k32J20M08L7n23M5L35K9k8L00j07o9k05J80j1l3j07J85n2K39k44j09
2859E1p2J5Q6k09J16N9l81J54J06Q7l27J2L81r6j27K43p6J61n93N11J36k43M5
2882C9k03O52m53j09L77j86j79j02L33K70n09L70l54Q2l72M17j11O9o48L89Q7
2903a41K6J7r7M19l52L9M9L52l69P3K57N1l8k38j71M38j08l07J22K20j20k70o
2926a54L03L9l59p6J97K0l93R9P2m1K34m5J42k62j90M54L72m36k79N82R2k60j67
2949e6K62J61k54j37O71o46j79l3L85j76j86N1k3k30J02P8K8O0j10o4J92J6k02
$$ y = [298, 2, 8, 266, 82, -9, 98, 116, -41, -101, -190, 183, -105, -532, -430, -60, -241, -320, 229, 116, -237, -38, 266, 60, -32, 429, 379, 176, 274, 337, 715, 201, -40, 266, 336, -133, -153, 65, 303, -178, -180, 57, 85, -78, -61, 110, -107, -339, -219, 189, 226, -297, -252, 83, 112, 84, 384, 277, 208, 3, 183, 172, 139, 32, 217, 165, 404, 160, 51, -21, -6, 80, -129, -13, 46, -335, -181, -75, 12, -315, -303, 78, -18, -145, 98, 22, 183, -410, 101, 237, -6, 39, -164, 488, 35, -74, 303, 117, -62, -164, 169, 439, -70, 300, -54, 28, -344, 73, -38, 31, -617, -228, -141, -115, -98, -195, 224, -128, -89, -40, 312, -57, 16, 273, 324, 286, 48, -123, 315, 207, -100, 22, 242, 122, -148, -154, 149, 188, -171, -247, -50, -30, -423, -324, -252, -293, -59, -104, 38, -224, -414, 40, 412, -24, -303, 279, 371, 111, -56, 206, 367, 113, -24, 647, 1, -178, -211, 174, -2, -188, -137, -160, -390, -288, -210, -182, -122, -232, -296, -104, -88, -290]
2972b90L47o0j71p5J06M21k87K67K01j30j72m23L28L08m62j07K45K56j04m41R5
2993a48L2J27j72m1J76l71K09L48k15k30J08M38j23l53J34M88l62j51J31M13k74
3014A64o2j75K48k08Q6j43L73m25J49j92K67Ok14J61o0j40L7K02j9j26N8k48K80
3037A9J16k34K89j33k54K89J74j13l8j09J10J1j32P4K30l00Q4m88J76K90k53O0
3059a32R8n7p7j3N4q9Q0O9m6k38K56J3J7K09q3r3J58J16j44j27J8q4M27j23k09
3084@K02j25k20j5L51l07K13J55n11j11J34L39k04j16Q9p2J91j44Q6O1j52M58
3106C02l29R3j91L17q6N7l04M38o1k02J26mRk14j74K89m0l94L61K81m72k37O11
3129A76k55J87k54L19m6k61PM53j97l2O2k08K3L86k95l9N0J8J92j89P8k43R7n3
$$ y = [-290, 57, -3, -174, -249, -143, 278, -9, 258, 459, 329, 157, -266, 62, 370, -92, -199, 46, 302, 198, -243, -148, -116, 11, -161, -202, -26, -397, -188, 160, -55, -285, -177, 261, 138, -215, -81, 407, 45, -106, 25, 438, 164, 102, -73, 175, -33, 53, -90, 283, -142, 7, -185, 82, 88, -126, 35, -25, -165, -128, 74, 55, -71, -13, -261, 19, 135, -99, 190, 57, -197, 92, 266, 153, 115, 6, 116, 127, -5, 69, 299, -1, 83, -405, -229, 61, -192, -132, -34, -91, -168, -181, -127, -216, -136, -67, -113, -351, -95, -82, -65, 144, 61, -32, 126, 242, 98, -29, -11, -95, 332, 209, 0, 202, 77, -143, -158, 193, -114, 99, 254, -257, -368, -234, 105, -99, -215, -126, -198, -7, -151, -65, -4, -156, 302, -27, 66, -125, 192, 106, 163, -141, 297, 236, 34, 160, 156, 165, -49, -223, 66, 26, -368, -7, 274, -198, -435, 176, -79, 108, -146, 173, 127, -134, -127, 326, 129, 97, 159, -49, -26, 360, 65, 26, 76, 94, 286, 97, 175, -68, 29, -24]
3153b4k51J10P7j43L4q5K98k4j66L43j54r8K76k54j01J43L8K6K66k08j07j36K21
3176H1R5J39rj11L8j37l23L21Q5k21k14J79M85o62O3J88q3p7p5K85j87l4qN74
3200C92k32k37K77J67j38k95K86p9q1q5q5lQ6K01K7k30m4l8L07n24J98j59K15
$$ y = [-24, -275, -165, -88, -231, -197, -282, 16, -8, -174, 169, 15, -83, 193, -61, -162, -19, 19, 45, 311, 103, -4, -140, 81, 176, 315, 306, 195, 233, 96, -227, 94, 179, -42, -256, -77, 408, -254, -191, -3, -86, -163, -238, 47, -140, -174, -182, 392, 160, -77, 200, 367, 229, -66, 220, 141, 60, -25, -110, -113, -27, 174, 201, -29, -73, -111, 196, -328, -130, -289, -74]
$$ [...]
8191e2
##END NTUPLES=NMR FID
##END=
