##TITLE=1H_Pr D-E
 CDCl3
 8 sc, 
 29.10.2024
##JCAMPDX= 6.0         $$ Bruker NMR JCAMP-DX V2.0
##DATA TYPE= NMR FID
##DATA CLASS= NTUPLES
##ORIGIN= UXNMR, Bruker Analytische Messtechnik GmbH
##OWNER= root
$$ XWIN-NMR		Version 3.5
$$ Tue Oct 29 14:57:56 2024 Russian Standard Time (UT+4h)  she@DPX200
##.OBSERVE FREQUENCY= 200.1318
##.OBSERVE NUCLEUS= ^1H
##.DELAY= (6, 6)
##.ACQUISITION MODE= SIMULTANEOUS
##.ACQUISITION SCHEME= undefined
##.AVERAGES= 8
##.DIGITISER RES= 18
##SPECTROMETER/DATA SYSTEM= spect
##.PULSE SEQUENCE= zg30
##.SOLVENT NAME= CDCl3
##.SHIFT REFERENCE= (INTERNAL, CDCl3, 0, 15.7039)
##AUDIT TRAIL= $$ (NUMBER, WHEN, WHO, WHERE, WHAT)
$$ ##TITLE= Audit trail, XWIN-NMR		Version 3.5
$$ ##JCAMPDX= 5.01
$$ ##ORIGIN= Bruker BioSpin GmbH
$$ ##OWNER= she
$$ F:/spectra/data/she/nmr/H-F/1/audita.txt
$$ ##AUDIT TRAIL=  $$ (NUMBER, WHEN, WHO, WHERE, WHAT)
(   1,<2024-10-29 14:56:48.03 +0400>,<she>,<DPX200>,
      <created by zg, POWCHK disabled, PULCHK disabled
       configuration hash MD5:
       00 E9 B6 7A A2 85 ED C7 34 08 36 98 17 FE 4E 26
       data hash MD5: 16K
       DC 79 F6 81 E2 E6 E0 43 B2 8F 5E C6 2A 4A 22 38>)
$$ ##END=
$$ 
$$ hash MD5
$$ F0 C4 3B 88 3A F6 65 DF 44 DC A7 92 F5 A7 DC 07
##$RELAX= 
##$RELAX= 
##$RELAX= 
##$RELAX= 
##$RELAX= 
##$RELAX= 
$$ Bruker specific parameters
$$ --------------------------
##$DU= <F:/spectra>
##$EXPNO= 1
##$NAME= <H-F>
##$PROCNO= 1
##$TYPE= <nmr>
##$USER= <she>
##$AMP= (0..31)
100 100 100 100 100 100 100 100 100 100 100 100 100 100 100 100 100 100 
100 100 100 100 100 100 100 100 100 100 100 100 100 100 
##$AQSEQ= 0
##$AQ_mod= 1
##$AUNM= <au_zg>
##$AUTOPOS= <>
##$BF1= 200.13
##$BF2= 200.13
##$BF3= 200.13
##$BF4= 200.13
##$BF5= 200.13
##$BF6= 200.13
##$BF7= 200.13
##$BF8= 200.13
##$BYTORDA= 1
##$CFDGTYP= 0
##$CFRGTYP= 5
##$CHEMSTR= <none>
##$CNST= (0..31)
1 1 145 1 1 1 1 1 1 1 1 1 1 1 1 1 1 1 1 1 1 1 1 1 1 1 1 1 1 1 1 1 
##$CPDPRG= <>
##$CPDPRG1= <>
##$CPDPRG2= <>
##$CPDPRG3= <>
##$CPDPRG4= <mlev>
##$CPDPRG5= <mlev>
##$CPDPRG6= <mlev>
##$CPDPRG7= <mlev>
##$CPDPRG8= <mlev>
##$CPDPRGB= <>
##$CPDPRGT= <>
##$D= (0..31)
0 1.2 0 0 0 0 0 0 0 0.06 0 0.03 0 0 0 0 0.0002 0 0 0 0 0 0 0 0 0 0 0 0 
0 0 0 
##$DATE= 1730199407
##$DBL= (0..7)
120 120 120 120 120 120 120 120 
##$DBP= (0..7)
150 150 150 150 150 150 150 150 
##$DBP07= 0
##$DBPNAM0= <>
##$DBPNAM1= <>
##$DBPNAM2= <>
##$DBPNAM3= <>
##$DBPNAM4= <>
##$DBPNAM5= <>
##$DBPNAM6= <>
##$DBPNAM7= <>
##$DBPOAL= (0..7)
0.5 0.5 0.5 0.5 0.5 0.5 0.5 0.5 
##$DBPOFFS= (0..7)
0 0 0 0 0 0 0 0 
##$DE= 6
##$DECBNUC= <off>
##$DECIM= 24
##$DECNUC= <off>
##$DECSTAT= 4
##$DIGMOD= 1
##$DIGTYP= 9
##$DL= (0..7)
0 120 120 120 120 120 120 120 
##$DP= (0..7)
150 150 150 150 150 150 150 150 
##$DP07= 0
##$DPNAME0= <>
##$DPNAME1= <>
##$DPNAME2= <>
##$DPNAME3= <>
##$DPNAME4= <>
##$DPNAME5= <>
##$DPNAME6= <>
##$DPNAME7= <>
##$DPOAL= (0..7)
0.5 0.5 0.5 0.5 0.5 0.5 0.5 0.5 
##$DPOFFS= (0..7)
0 0 0 0 0 0 0 0 
##$DQDMODE= 0
##$DR= 18
##$DS= 0
##$DSLIST= <SSSSSSSSSSSSSSS>
$$ [...]
##$SUBNAM2= <"">
##$SUBNAM3= <"">
##$SUBNAM4= <"">
##$SUBNAM5= <"">
##$SUBNAM6= <"">
##$SUBNAM7= <"">
##$SUBNAM8= <"">
##$SUBNAM9= <"">
##$SW= 24.0689170037331
##$SWIBOX= (0..15)
0 0 2 0 0 0 0 0 0 0 0 0 0 0 0 0 
##$SW_h= 4816.95568400771
##$TD= 16384
##$TD0= 1
##$TE= 0
##$TE2= 300
##$TE3= 300
##$TEG= 300
##$TL= (0..7)
0 120 120 120 120 120 120 120 
##$TP= (0..7)
150 150 150 150 150 150 150 150 
##$TP07= 0
##$TPNAME0= <>
##$TPNAME1= <>
##$TPNAME2= <>
##$TPNAME3= <>
##$TPNAME4= <>
##$TPNAME5= <>
##$TPNAME6= <>
##$TPNAME7= <>
##$TPOAL= (0..7)
0.5 0.5 0.5 0.5 0.5 0.5 0.5 0.5 
##$TPOFFS= (0..7)
0 0 0 0 0 0 0 0 
##$TUNHIN= 0
##$TUNHOUT= 0
##$TUNXOUT= 0
##$USERA1= <user>
##$USERA2= <user>
##$USERA3= <user>
##$USERA4= <user>
##$USERA5= <user>
##$V9= 5
##$VALIST= <valist>
##$VCLIST= <CCCCCCCCCCCCCCC>
##$VD= 0
##$VDLIST= <DDDDDDDDDDDDDDD>
##$VPLIST= <PPPPPPPPPPPPPPP>
##$VTLIST= <TTTTTTTTTTTTTTT>
##$WBST= 1024
##$WBSW= 4
##$XGAIN= (0..3)
0 0 0 0 
##$XL= 0
##$YL= 0
##$YMAX_a= 231510
##$YMIN_a= -258253
##$ZGOPTNS= <>
##$ZL1= 120
##$ZL2= 120
##$ZL3= 120
##$ZL4= 120
##$ABSF1= 10
##$ABSF2= 0
##$ABSG= 5
##$ABSL= 3
##$ALPHA= 0
##$AQORDER= 0
##$ASSFAC= 0
##$ASSFACI= 0
##$ASSFACX= 0
##$ASSWID= 0
##$AUNMP= <proc_1d>
##$AZFE= 0.1
##$AZFW= 0.1
##$BCFW= 1
##$BC_mod= 2
##$BYTORDP= 1
##$COROFFS= 0
##$CY= 11.3945322036743
##$DATMOD= 1
##$DC= 2
##$DFILT= <>
##$DTYPP= 0
##$F1P= 15.6554695791079
##$F2P= 12.8336369535428
##$FCOR= 0.5
##$FTSIZE= 0
##$FT_mod= 4
##$GAMMA= 1
##$GB= 0.15
##$INTBC= 1
##$INTSCL= 1
##$ISEN= 128
##$LB= 0.24
##$LEV0= 0
##$LPBIN= 0
##$MAXI= 10000
##$MC2= 0
##$MEAN= 0
##$ME_mod= 0
##$MI= 1.114404
##$NCOEF= 0
##$NC_proc= 0
##$NLEV= 6
##$NOISF1= 3.799351
##$NOISF2= 2.8
##$NSP= 1
##$NTH_PI= 0
##$NZP= 0
##$OFFSET= 15.70392
##$PC= 1
##$PHC0= -26344.46
##$PHC1= 8.78743
##$PH_mod= 1
##$PKNL= yes
##$PPARMOD= 0
##$PSCAL= 0
##$PSIGN= 0
##$REVERSE= no
##$SF= 200.130013532006
##$SI= 16384
##$SIGF1= 3
##$SIGF2= 2
##$SINO= 400
##$SIOLD= 16384
##$SREGLST= <1H.CDCl3>
##$SSB= 0
##$STSI= 0
##$STSR= 0
##$SW_p= 3612.71676300578
##$SYMM= 0
##$S_DEV= 0
##$TDeff= 0
##$TDoff= 0
##$TI= <>
##$TILT= no
##$TM1= 0
##$TM2= 0
##$TOPLEV= 0
##$USERP1= <user>
##$USERP2= <user>
##$USERP3= <user>
##$USERP4= <user>
##$USERP5= <user>
##$WDW= 1
##$XDIM= 8192
##$YMAX_p= 0
##$YMIN_p= 0
$$ End of Bruker specific parameters
$$ ---------------------------------
##NTUPLES= NMR FID
##VAR_NAME=  TIME,          FID/REAL,        FID/IMAG
##SYMBOL=    X,             R,               I
##VAR_TYPE=  INDEPENDENT,   DEPENDENT,       DEPENDENT
##VAR_FORM=  AFFN,          ASDF,            ASDF
##VAR_DIM=   8192,          8192,            8192
##UNITS=     SECONDS,       ARBITRARY UNITS, ARBITRARY UNITS
##FACTOR=    0.0002076,     1,               1
##FIRST=     0,             0,               0
##LAST=      1.7004516,     0,               0
##MIN=       0,             -258253,         0
##MAX=       1.7004516,     231510,          0
$$ Real data points
##PAGE= N=1
##DATA TABLE= (X++(R..R)), XYDATA
0@%%%%%%%%qJ6j6J9k7L3m1N3o1P2q8J04j25J49j73K00k31K66l05L49l96M49n10
31b71N75o44P23q10R04j006J119j245J380j529J695j876K077k301K549k826L137
48A651l492L900m372M925n584O390p398Q698j0452J2958j6861K3956n8052K75243
62B31510r0730l76035K15138J89204j94072r3319J71347J5920q9138k5307K4131
73b1351L9914L3555p6943l4865R3447K5057j06543M212J13904k4959j32805N3980
85c3397J28920q9147j05958J17862N9029j16791j1721R4315j4313m7451R216J043
97h393K4641K0673q0208p202J20215l7946j21080Q4053Q5103r8948l1327Q4361
109C3942r856m6852K2438L442j1874K7291j7061l8565M3266K9311n1700r180N0047
$$ y = [0, 0, 0, 0, 0, 0, 0, 0, 0, -8, 8, -8, 11, -16, 17, -24, 29, -32, 40, -48, 56, -69, 80, -93, 107, -124, 142, -163, 186, -210, 239, -271, 304, -340, 383, -427, 477, -529, 590, -655, 725, -804, 891, -985, 1092, -1209, 1340, -1486, 1651, -1841, 2059, -2313, 2612, -2972, 3418, -3980, 4718, -5734, 7224, -9637, 14319, -43733, 231510, 140780, -235255, -20117, 169087, -24985, -118304, 53043, 68963, -20175, -45482, -21351, 18563, 52118, -24825, -59690, 33757, 58814, -47729, -43517, 70387, 45428, -87377, -33397, 95523, 6376, -99582, 18280, 77309, -39482, -51203, 43112, 28799, -18652, -9436, -8393, 16248, 36921, -43287, -50489, 69726, 31780, -89300, -5247, 79856, -19092, -50419, 33942, 24086, -22766, -328, 3114, -8760, 18531, 1470, -37095, 6171, 35482, -16218, -25398, 24649]
122B4649o402m4927K0659M0619l9172l0439N3730K355n7781L3547M2475o1101
134b1788p141P1707l6971m9690P6010R0r1941N6554P0330r8536k6789J07123j7549
147C1409q6463M6249N7191n0542k8911L9516J0128k0751n139Q12M368J0524o466
160A925j4802P767K0543r948k3159K1615J9624l3908p265L4179j1741k3080K4940
173F690R03k7538K2681J7087l2760N346K7523k5839o732L2720j9221k3753L2824
186I931K147l2138J7199K1068k5232n945K3750l214j2850O866O99p187M713N998
200E805q954p331J2124Q706j6043l542K0625m553j7616J2204O922j2737N446R32
214A988j6494J8097J5833l6116k726M6027j5542m1010L3184K6506m0576r928L5271
$$ y = [24649, 18247, -26680, -6021, 34598, -4574, -35013, 18717, 21072, -36709, -3162, 39313, -21788, -28929, 42778, 5807, -43883, 32127, 32217, -59724, -3170, 67160, -31376, -58165, 48958, 31409, -55054, -8805, 48386, -2156, -31067, 8449, 18577, -2174, -7313, -6501, -2133, 8391, 1925, -12877, -5110, 15433, 5485, -17674, 3941, 23565, -10343, -17608, 16571, 4830, -18250, 6690, 7593, -19945, 2736, 19823, -12937, -7591, 19932, -5907, -12639, 20081, 860, -22893, 9931, 12078, -20060, -2861, 18207, -7025, -12970, 10780, 7566, -5284, 1582, 2281, -4906, -193, 5805, -3149, -10480, 1644, 10350, -5693, -9235, 11390, 6837, -10779, 1425, 8347, -4390, 1056, 1988, -14506, 3591, 19424, -16692, -19418, 26609, 11067, -29943, 3241, 29747, -10829, -20757, 14514]
227A4514l157k5882O496J6156n159q987K772R230R3j0066k81J0540m92j1211k598
242h032J1233N597j5690n519K1368L195k4522M615K4613j1906j8882J4379Q292
255H741j1279r46O96j93R500m535j3418J4138J2138k0613n701K3598k700k2389
269a2963P977J5739j1305r227J0070O416q087m450Q787M171q621k121N919J85
283B490l582k372J487M244j313o670M142R408o989q603J1746M792j3998J597R681
298F060p989l705P965j947m403N332R59n132L610N120o810k809P238j546o035
313d092K983L166l627j661L993K096m097R01L577k673q70J799j982q68J373j415
329a397o85K428P03l350K006N273n145j984N888k223n149M018J400m664j02M253
$$ y = [14514, 11357, -14525, -8029, 8127, 2968, -6019, -3247, 5983, 6076, -3990, -4271, 6269, 5777, -5434, -8032, 3201, 8798, -6892, -12411, 8957, 12152, -12370, -7755, 16858, 4952, -13930, 449, 8741, -2538, -3484, -2788, -2981, 6519, 1984, -11434, 2704, 14842, -5771, -11472, 12126, 9426, -12963, -4986, 10753, -552, -9779, 291, 6707, -1380, -5830, 2957, 7128, -1493, -3614, 2305, 2490, -1092, -3464, -1977, 2267, 954, -5716, -1574, 7834, 845, -7758, 3988, 8780, -5218, -3621, 6060, -1929, -5634, 2331, 384, -4019, 1313, 2272, -2860, 750, 5870, -940, -3749, 3489, 1943, -4092, -1109, 2057, -1570, -3231, 762, 2858, -1239, -338, 3239, 566, -304, 1495, -487, -1355, 18, -1397, -2082, 346, 1049, -2301, -295, 4978, -167, -2151, 3737, 1514, -3635, 383, 1783, -2881, -2983, 1270]
345A270q19l124L812J802m439K140K978m362j035K819r49k372J645J662k373m24
361a769L874r01j946K736r25j727J156K13j375m78L87n56L39K257m48k583L377
378A631J296l904J175J843k028k391J997J853k991j209M088q65j819L547m45k319
394e41P78Q61j430m81P16j137q26J962Q37k277K083J136j865R14P81j029p04k66
412d88J48j149K70J330p82J11K096j404k26J588o86q07J75N52j183j713J953O36
430D21k351J601K145j875j57J557R7j408q22J617p42j823J676n73j14J067p63
447d47J013Q62j277k36J142J05j747q62J824n60k207K655P46j586L01O58R57n37
465H04p22j7L55j122M1l59P12k33p3N13N19M51K11j402J202N22k102J71O97j132
$$ y = [1270, 451, -2673, 1139, 2941, -1498, 642, 3620, -742, -1777, 1042, 93, -2279, -634, 1028, -1345, -1769, 2105, 1204, -742, 1994, 1069, -658, 498, 711, -664, -1142, -755, -1311, -972, 1285, 837, -1746, 1631, 2927, -977, 198, 2041, 13, -2378, -381, 1472, -1519, -2728, 1360, 495, -1324, 2223, 1778, -541, 237, 1098, -332, -813, -97, -1234, -2060, -98, 739, -1538, 545, 1681, -184, 730, 1511, 482, -222, -488, -340, -1489, -1219, 111, -671, -560, 1536, 132, -94, 1494, 808, 1, 176, 728, -455, -2168, -215, 421, -1930, -329, 1816, -59, -216, 1341, 1438, 30, -792, 825, 83, -1740, -64, -637, -751, 316, -447, 566, 1428, 151, -85, 1057, 1162, -585, -1447, 377, -183, -2390, 265, 1011, -575, -274, 384, 1341, 804, 82, 65, 420, -702, -661, -1020, -308, -541, -614, -101, 418, 869, 1080, -322, 880, 1402, -700, -529, 168, -964]
485i64k70J065o50J053R77j153j08J876m85k345J561J21k093O14R58j246P85L02
503br20K231j3j919J041J597k649r97J987N6j764k90J041K056p74k650K077L671
521C779l345k670L581J50k763Q7N12O66N31j773l60L992k82m472K723K962m089
538g71j160L378j276k058J443L01L06n19j002K842J181m161O40M100l024l532
554c312L948N28l089J595r1o78K986m86l696L264K489m426k82K419j151j080J54
571i08j111K389J799m690J505M707l312j504L257k162j360L686l312k351N095
586A728l50m800L423K602l484R73J462k165J144P7j898J529m58k665M362O87o413
603d246L932N902o334l135P355p22m852J735m98k43L464l935l077P982L68p645
$$ y = [-964, -1234, -169, -819, 234, 1211, 58, -50, 1826, 1341, -1004, 557, 678, -1415, -801, 157, -1089, -304, -2, -922, 1309, 1296, -623, 418, 2015, -634, -1631, 356, 412, -1352, -1642, -601, 1455, 681, -1969, 108, 3779, 434, -2236, 1345, 1495, -1268, -1181, -669, -3, 528, -1245, -1605, 2387, 2105, -2367, 356, 3318, -771, -1931, 1447, 171, -1887, -444, -143, 163, -356, -1358, 1484, 2665, -1496, -856, 3244, 220, -3312, 636, 1164, -1925, -330, -421, -1099, 1887, 1401, -2295, 969, 3458, -968, -1250, 1169, 18, -1062, -908, -2019, 370, 2169, -2521, -1016, 3691, 379, -1125, 2132, -30, -1390, 2296, -1016, -3367, 1728, 1378, -3422, 1, 2603, -881, 92, 1554, -611, 533, 610, -1288, 241, -217, -2882, 1480, 2167, -4246, -314, 5588, -746, -3881, 3474, 2752, -2100, -365, -863, -1106, 2358, -1577, -4654, 3328, 3696, -3949]
619c949K571N317k808k405k91J622K582l292l420N108K012o581K494N050n739
634a729Q2O261n410k548O317k047m291L187M50j251K118j668j919N260k17m519
650a924K184J775k594J238j289l102O456k74q365M848O754o348k593N963j754
665I75j598K277l001j781N865j955m754M026J838j703P63k397R78N617o074m178
681e102P993J89p582L246L817m544R90M072n115K00N884l300k692L545j976q0
697d55K154m100L1N670k682l826M132J053j197l61k330J523N236n258o728R309
713B171L075r933J292P263l481j087K024k310J886J768m704M37L552k407q57J783
729D72j980P07M220l540k587N504p36m623M100j580k726N521j922o096N522M291
$$ y = [-3949, -1378, 3939, 1131, -1274, -1565, 57, 2639, -653, -4073, 1035, 3047, -3534, -1040, 4010, -1729, -1647, 4614, -796, -3344, 2973, 926, -3365, -178, 272, -979, 1139, -529, -2448, 2812, 2595, -1924, 260, 2035, -559, 679, -610, -3712, 2744, 2470, -5895, -1047, 5707, -641, -3234, 2729, 975, -623, 1654, -1347, -3128, 2737, 782, -3972, 54, 1892, 189, 952, -1445, -467, 5150, -924, -5102, 2891, 3080, -4502, -1256, 2561, -1983, -993, 3079, -2036, -1836, 4048, 748, -1944, 1601, -375, -455, 1699, -2401, -2370, 3300, 618, -3208, 924, 1977, 780, 419, -1911, -388, 4848, -410, -7138, 2171, 5246, -4687, -3395, 3868, 387, -700, 1324, -986, 900, 2668, -2036, -1599, 1953, -454, -1311, 472, -1508, -801, 3419, -121, -2708, 2796, 2060, -2563, 1537, -43, -2769, 2752, 830, -5266, 256, 4547]
745D547o348p13M744l24j714p51j374L655J273o736J128N673l797j174L628l169
761a452N64N376n203l441P547n25o496K305L073k458O28J93k034M092M12n102
777b521K188L403l639J89J118l303K747J938m612M13M894k526k074L609j688p98
793f62L659l373l465O213n4o091K563L158k014N58n40j041L608n17m902K278L268
810B646l699p56K511j622L87K634m093P58N499l833k874M026l16k442K009j428
826e93j679L460m93l123K344J949k272N74O42j860K568K19n035K634L342m005
842a328r44L605j381k90J744j926n16L399j763k366K177L20j420O82o10o25L290
859B048j181l262L392J171k943L68R43j150J068Lk626J791K177k797j51K734j289
$$ y = [4547, -1801, -2514, 2230, 1906, 192, -559, -1933, 1722, 2995, -3741, -2613, 3060, -737, -1911, 1717, -1452, -888, 4488, -715, -4156, 3391, 2866, -3630, -1325, 1748, -710, -82, 111, -1923, 2169, 2581, -2521, -333, 3070, -569, -380, 738, -2565, 182, 2120, -2492, -2079, 2815, 289, -1785, 1824, 136, -662, 2997, -376, -3841, 2372, 2318, -3773, -1210, 1948, -66, 492, -48, -1089, 2519, 2002, -2900, -622, 2646, -1053, -1809, 702, -920, -533, 2101, -1992, -1234, 4265, 432, -2442, 1584, 1268, -1174, 835, -593, -2272, 1188, 695, -2428, -84, 1865, -407, 167, 809, -1051, 1517, 1736, -3299, -665, 2677, -1328, -2272, 1333, -48, -338, 1406, -520, -1036, 2363, 600, -1766, 411, 731, -689, -7, -617, -1242, 2048, 867, -2395, 997, 2168, -775, -407, 536, -614, 454, 457, -2169, -378, 1799, -998, -1149, 1585, 296]
876B96m21J384j414k95J844j806j540K166K37j442J105j56j94J664n31k363K448
893I82M82k571J13J222r73M90N35j781J694J646k353l76K003k34j494N87p0m67
911e65J058j588l66K077m05r34J580m90o53J059l9j501N83R49j782M22Q98q95
929e92K82P66q60L73J119j298K8J137j094m30O75m85q8N85l53l00J605o28n53
948a11N47J16q66N4j13l65P30P2j291J401Q6n47J84R07l66m93M73n87m95O70m87
969d81j70P00m18M17N41l14l55J149o43p30K14M41m82o6p8j56L70K53m65M38M08
990E73n70J04O00n08k97J80m12J72j18j80K00P83m01K04k29M38m74oK33p19j34
1011e61K88k46L58j64j53Q30K76o09M40J23o79J33k27J49l93m1J77Q2K76K01j33
$$ y = [296, -125, 1259, -155, -450, 1394, -412, -1952, 214, 451, -991, 114, -42, -236, 1428, 897, -1466, 982, 1464, -1107, -994, 228, -745, -255, 280, -1501, 193, 1839, -514, -890, 1113, 879, -615, -28, -98, -565, 493, -1095, -1461, 616, 211, -723, 857, 367, -286, 773, 734, -767, -184, 765, -1017, -595, 303, -592, -310, 456, -404, -31, 1088, -210, -182, 955, -139, -569, 106, -379, -467, 118, -235, -535, 1070, 442, -111, 436, 552, -314, -260, -373, -738, -8, 64, -1227, 174, 260, -287, -103, 804, 438, -55, 418, -169, -664, 6, -481, -651, 49, -369, 48, 589, 275, -80, 1069, 426, -304, -90, 351, -131, -197, -275, -431, -61, 192, -273, 165, 573, 3, 107, 707, 199, -98, 82, -330, -158, -276, -456, -256, 527, 126, 330, 101, 539, 65, 59, 292, -427, -561, -273, -519, -161, -325, -478, 352, 628, 19, 459, 582, -97, 36, -191, -42, -435, -476, -299, -217, 59, 260, 127]
1032A27N96n64P4K41n79n8L63o32M40k06o2jj38M73J73M5j32P0k52M00m01k94
1054c17K91k96R0K71J03k2J99j35Mk18j5k55j62M01l3k02J36O1k32O07m87N42
1076C31l04j28L43n24M10l37k42K60J04k12K49j20P39l64p9J16J3m14J87k5m47
1097d44K48j12J27L24n20O42J12m95N66k58j82l34J81J07j20k16J11J93J86KJ40
1118B58K50m34j1j58K01j39m56J45P4L0l22L35L52o3K11r3n0R6l20m4K8l20O1
1141c69j03K98K90j81J48K06l40K89N0j03m04r7M3L20l55L17n7J49L11j63m61
1162b12O11m48o2m26M00K23n59J98j1K79O7j25K06L71o26O77j95n68k72L77k00
1183b95j36J79J39l03P85p0l24M87j30m35q7O76r99J3J17L72K6R7q8M08N5m30
$$ y = [127, 723, 159, 233, 474, -105, -163, 200, -432, 8, -198, -260, -261, -399, 74, 247, 292, 160, 230, -22, 378, -23, -317, -26, -322, -232, 39, 142, 120, 319, 184, 188, -30, -45, -300, -462, -61, -94, -296, -160, -99, -331, 276, -211, 331, 27, -101, 242, -282, 128, -209, -451, -191, -87, -299, -50, -170, 569, 205, 126, 242, 255, -159, 28, 3, -444, -196, -308, -181, 143, -377, 265, 377, -118, 448, 190, 8, -326, -145, -38, -158, -374, -263, -70, 116, 118, 258, 508, 74, 63, -95, 106, -33, -489, -344, -270, -240, -562, -227, 125, 62, 273, 180, 130, 226, -94, -138, -110, -430, -369, -472, -174, 116, -65, 83, 289, -51, 238, 288, 185, -219, -316, -273, 47, -308, 9, -48, 101, 412, 249, -212, 399, -49, -111, -537, -137, 86, -473, -275, -286, -7, 60, -65, 141, 512, -114, 563, 368, -200, -472, -95, -295, -431, -252, -113, -416, 369, 299, -25, 462, 332, -103, -190, 486, -513, -500, -383, -11, 15, 112, 24, 432, 487, 57]
1205E7j6N31l84m29J47o4o7L43j3k07N50J09n82J07K75m95L50k91k14M39J2p89
1227f31L19N28m76L67L37m89J20L94m23l68N54k97l26J87k8k58O59l79q4J162
1247H68m16n71Q2L33o40J39j49k78Q26K06q40L22J021q00l79O77m05j75K51n80
1267e08m7R25m69p40J070o7j87P27n41j97M24k64o16M70j9n00L59K66o93P84L32
1288E09q56j7J302r11p9j45j69O82l82m84K77R91j060l95J565l36p68O61j17q08
1308e40P28k57j384J096J256j497j43J660m60k83N19r54Q06j11o27p15R20j36
1326a22M9L97j146R04R88j261m80J601r19o48O71o5n88R72l22q97P20R76q96k88
1346c54J297n10m07L05p88M09P21j104k01R53J25m73M29m84J31P51j032n59J428
$$ y = [57, 41, 572, 188, -241, -94, -158, -225, 118, 105, -102, 448, 557, -25, 82, 357, -138, 212, -79, -293, 146, 158, -631, -312, 216, -260, 107, 444, -45, 75, 469, 46, -322, 232, -65, -391, -204, -232, -490, 169, -210, -294, 868, 452, -119, -37, 296, -344, -205, -354, -632, 194, 400, -440, -118, 903, 103, -276, 401, -4, -179, 72, -508, -555, 370, -99, -839, 231, 164, -23, 704, 163, -34, 390, 126, -490, -20, -39, -539, -180, 86, -607, 177, 509, -347, -364, 938, 27, -52, -197, -366, 316, -66, -550, -273, 718, -342, -737, 828, 492, -276, 385, 268, -540, 188, -69, -1453, -357, 899, -598, -741, 919, 459, 176, 695, -259, 547, 436, -191, -906, 14, -122, -73, 324, -822, 82, 1070, -191, -671, 930, 11, -637, 34, -31, -619, 353, 31, -866, -146, 830, -66, -354, 943, 433, 26, 331, -457, -48, 673, -431, -632, 321, 446, -27, 402, -82, 49, 800, -232, -791, 637]
1365F37l04r97N33O88j085Q73J47j027J014m5j006M57N67q21N36k57r92R52J143
1384A013j480j39J627k23j449Q45J48n18N05m87p39J161j08j280R01P72k75j82
1402I2l85j7R34l7j316N17O74o22j73O52n83M40M75j025j54J462q64q39R51L02
1422D84p43J56o43R0J068K08j357N33J192r92k20K74o63R14J57j406N45J100j038
1441c41k01O12J69j10K08o54J43J287r25p80Q24k98m37O23n50r4J278m02j000
1460f48P96P50j259k17O11n36K14O59j163M96Q68n36p22J026j0k44K26m14l86
1479d89R43n19n12N10K33m78P73m63r1N94k48j130R50O20j416M11M36n44L65M09
1499C54j340P80J051p64j84P00o1q76L96j64n4M97l39p84J349j38m27l04O02j42
$$ y = [637, 333, -664, -131, 557, -528, 345, 492, -535, 479, 434, -572, -115, 452, -369, 167, -90, -1082, -130, 1013, -467, -606, 1021, 798, -651, 194, 342, -176, 329, -158, -897, 264, 156, -1124, -223, 549, 274, 92, -293, -310, 624, 587, -729, -212, 462, -160, -333, 319, -264, 176, 651, -374, -528, 934, 70, -769, 182, 484, -259, -103, -746, -656, 412, 620, -737, -204, 988, -4, -224, 50, -613, 301, 458, -948, -403, 697, -341, -542, 70, 239, 129, 337, -317, -174, 1113, 188, -592, 232, -66, -503, 120, -430, -524, 754, 352, -648, 148, 898, -361, -578, 33, -503, -289, 370, -793, -297, 571, 35, -687, 339, 329, 85, 311, -103, -489, 454, -65, -577, -67, 166, -312, 461, -2, -93, 501, 253, -877, 73, 693, -723, -312, 124, -420, -55, 354, -986, -206, 845, 81, -103, 597, 536, -340, 56, -108, -162, 335, -4, -788, 561, 423, -4, -308, 294, 152]
1519A52K74k43q61N73N72p50l48J243o58K17K83o29Q1N84q27J11O05l28m94K35
1539b08L28j78J81J00p01J056M3r20L15M34l69J36j19o06O70Q2q38J35O33Pl57
1560a76N61l34J65J00o84K6O41m86j41M32J7j35O66n42j21M22J04n51l49M92l71
1581b64p0L31q6J61O34p89k2L96l09j27K28l44J02K87l03o1M07j33k23M53K0j64
1603A24K10k80r4K70l36j80j16P42n08L27K05n74M53L42p47J54O25p87m83L36
1623c17J50k66O44j82j02O63n12O0j77j43J39j0J20j57k09J69k62K18L05l30J76
1644b3L58m93J94J67l30n8K16l47R2J60k13J10M14Q4l38nK48m07k92L28l92N71
1666D4j89R4q7J07J17J89j47q9k6r0R8l41J99Q6l69P6M4m3K98rQ1J46J22l75j46
$$ y = [152, 426, 183, -678, -105, 467, -283, -631, 612, -46, 171, 454, -175, -94, 490, -337, -226, 379, 51, -443, -208, 120, -58, 123, 223, -478, 578, 621, -299, 16, 450, 81, 217, 98, -508, 162, 244, -594, -459, 174, 181, -176, 385, 51, 216, 316, -368, -342, 299, -187, -328, 104, 121, -14, 652, 110, -11, 411, 515, -36, -385, 107, -264, -334, -3, -89, 72, 706, -83, -105, 291, -18, -145, 83, -261, -159, 128, -175, -236, 171, 38, -185, 268, 288, 124, 334, 54, -40, 230, -106, -286, -402, 340, -168, 159, 364, -210, 243, 585, -162, -8, 617, -170, -653, -317, -167, -433, 211, 29, -73, 590, 78, 138, -39, -182, -43, -53, 67, -90, -299, -130, -392, -174, 131, -199, -23, 335, -158, 36, 203, -127, -185, 31, -316, -224, -64, -277, -167, 247, 331, -7, -12, 236, -171, -463, -135, -527, 44, -145, -51, -138, -31, 86, 275, 128, 39, 13, -77, 21, -320, -121, -35, -404, -328, -284, -327, -29, -38, 43, 189, 311, -64, -210]
1691b10L00m95M31j9j47K07j45k9J81K20l9m1k2q9r7L8j73q3l8K6L41J7j00Mp
1716C1L12l49k66K21J89j72j43n3J17K43M8J24J13l73l8R2k4k27J38q9n1J47j15
1739a25k24J81L87k50N91l40o7k49K06k72J17lm48M49j37J75J51j20j74L39j83
1760DK74m52K03j03j10R2j91M14No3P4M0j07j19K42p4j78Q6l25L09m00L22mK63
1784B02j1j39K64j13R7l68P7j77J20k19K1K21K02k08j32J72K56mk23J77j10p3
1806C2o6L4R3k43j73L51l7q4J68J48j43q9Jr3K6r6J74j73N7K91l68M82j72L51
1830D71k09l7n35L17k71N8RK72n27K10M00j37K8K55k4j18j65k36j41K40l00L16
1852a24J35k14K69J93k51n6J10R8K08m94J34j77QK19l4p2o5K10M2J06k10J4j43
$$ y = [-210, 90, -405, 26, 7, -140, 67, -78, -107, 74, 294, 255, 214, 192, 103, 6, 44, -129, -212, -250, -224, 117, 134, 34, 38, 31, 343, -6, -272, -51, 138, -34, -177, -230, -113, 130, 178, 302, 415, 42, 4, 96, 72, -155, -17, -106, -157, -10, -125, -349, -168, 219, -31, 560, 220, 153, -96, 110, -162, -45, -48, -496, -47, -184, -9, 142, 22, -152, 187, 4, 278, -174, 29, -74, -184, -92, -283, 131, 136, 73, 147, 187, 80, -39, 203, 129, -49, 37, -288, 21, -379, -57, -61, 202, 191, 52, 316, 203, 300, -68, 9, -168, -48, -267, -246, -25, 177, -31, -163, 9, 265, 261, 38, 215, 105, 32, -34, 0, 93, -150, -323, 28, -9, -93, 75, 223, 80, -9, -8, -101, -75, -171, 3, -170, -113, 178, -190, 292, 120, 471, 262, 225, -310, 7, -264, -206, -197, 75, -452, -242, 158, 21, 49, 304, 280, 162, -3, -239, -380, -140, -440, -124, 11, -203, 66, 259, 8, -48, 62, 160, 368, -126, 8, -169, -161, 58, 24, -48, -113, 97, 139, 245, 35, 49, -94]
1875i4m6L37k28j17O1j3K65j82K26j44K6K41j70r9J47j88n54P49l70j03M9J64
1897d3J8K61K29k33J30j3m27J10j26oj20J39j87K24K26j46K1L97m14J6J16k18
1919d6m18L68o8r1L62K0q9K48j29j18K27p5l09J94K29r16L74L88l61K5N71n49
1941a63N5J67k12K8L33j73j57J34j81j79K83J04j13L6M26l17J07J61n4j29Q6n48
1963c06L53P9p05J99M11J04J29M3n53K16K56k98k95M70N1o16P38p49J27P64n45
1984a27k11N59P9k35J58j73m31M63r0l50M08L32m80j20L67kj24J05l23K18L36
2005C59l04o17P08l4k98qk9J2Q85q15j68M10K01n20K38L32n83Q1n0q5K44L45n55
2028b51l7N50m28K13j6k09M22J97p47o1P30j87j08K92m20r0Q29m78l73K64J88
$$ y = [-94, -140, 197, -31, -148, -87, -100, 165, -17, 209, 65, 91, 332, 162, 63, 210, 22, -532, 217, -153, -256, -207, -43, -25, 236, 465, 232, 362, 349, -78, 32, -94, -100, -220, -81, -268, -44, 182, 36, 57, 454, 40, 56, 172, -46, -464, -96, -164, -255, 107, 127, 38, 286, 157, 39, 266, 191, -118, 76, 305, -611, -237, 151, -210, -185, 386, -163, -108, 59, -153, -125, 208, 35, -122, 12, -169, -348, -65, 39, -74, -38, 388, 71, 178, 339, 285, 156, 242, -306, 47, 126, -579, -380, 31, 135, 264, 307, -246, -30, 226, -72, -367, 103, 154, -462, 276, -473, -346, 418, -127, -338, 221, 300, 65, 223, 50, -381, 82, -8, -358, 50, 382, -98, -218, 149, 147, 23, 128, -195, 23, 359, 55, -562, 146, 112, -186, -194, -223, -211, 674, -141, -309, 101, 302, -218, 20, 352, -231, -150, -200, -285, -41, 304, -251, -288, 262, -166, 47, 31, -178, 244, 441, -306, -367, 363, 176, 68, 360, -60, -150, 679, 201, -172, 92, 280]
2049B80n39L8M86m27J72k24j64Q46J55p82oQ13q62K2K63k73jM32k72p30R21M30
2071E78q42N29j21l93L78l91m14Q64k10l75N02K25r6q3M28j032P62K48j152L09
2091b86N04j47n07P83k92m46J005m27j46M16o6o19M37J63m44J06l65j36P34J93
2111D60q48M84L93o47J70N96n39J14j21o76K54P92n30o84R84L4j61L93l39o81
2131e52P89k31p04N75N28o94J64M0l9L56R6o72M63K60o12N5N50m31k12L66l77
2152b82J77N48p72j70Q75nn51L04Mn33O43l05l62N42P9m84K50K77k74L04r8l29
2174a62M3N63p29j81Q46q05M22Q7l39KN98o58N5N73j7l38K01j79r8j01Q7k93N06
2197H3K54o71J78N18o27O18k53o14K18M83n85j13Q21k50kM00j61l40M28m03k18
$$ y = [280, -259, -221, 265, -162, 10, -214, -378, 468, 623, -159, -165, 648, -214, -192, 71, -202, -203, 229, -43, -773, 148, 578, -264, 265, 144, -249, 129, -262, -676, 188, -22, -397, 105, 330, 234, 151, 579, -453, 309, 557, -595, -286, 218, 71, -436, 347, 55, -391, 614, 187, 41, 457, 391, -228, 209, 372, -72, 34, -331, -467, 267, 460, -388, 96, 489, -158, 12, 608, 69, 183, 62, -614, -360, 432, -98, -782, 202, 236, 75, 468, 129, -552, 237, 6, -698, -123, 405, -289, -125, -85, -124, 232, 328, -344, 119, 379, -233, -178, 372, -59, -271, 95, -282, -105, 443, -329, -499, 376, 371, -180, 124, 128, -405, 238, -67, -429, 113, 192, -292, -42, 235, -39, 265, 167, -162, -119, 444, -285, -466, 380, -425, -3, 84, -255, -253, 345, -313, -258, 315, 298, -40, 161, -18, -116, -217, -130, -423, 83, 337, -334, -156, 362, -265, 353, 100, -514, -296, 187, -398, -511, 310, 60, 58, 458, 297, -43, 385, -18, -236]
2218b36P24l49k29K18k25k09N98J82r17Q99j03m74k7L88j81kj37k09k1P53o21
2239a78J61R07j080PK72j46L6K97m73j1K22J16o33P32r0m59M63K6l63J90L71q62
2261d95K5N73n15L28K45j54L9M55n58L29L3r3j55j49L48k64R8k32K14J87k76j03
2283a20r5M86p9R2mn62N05M5m47jM48n25K87M2k82L06n1m21K99K01j6k32Q4n7
2307i7K50J56n99N7K60J42m97L34M30q54K26k2RK01J72k71M1P5k48M04nj24M0
2330H0J71m40K32L89m59j46J58J75k02k44J43M36k47k64J18K99L6m04J22l03J31
2351b19N9L92k15N92k52j89o8J04l01J68k2N2j3K27l38O2q6L95n47M61n8k35O9
2374C8J19o3l70L18l25K4N79k07j4j90p9J69K33j10k87L98l99q8K94j86J14K63
$$ y = [-236, 488, 139, -90, 128, -97, -306, 292, 474, -443, 456, 353, -121, -148, 240, 59, 57, -80, -289, -310, 443, -178, -17, 890, -190, -183, 89, -57, -21, 276, -197, -208, 14, 130, -503, 229, 139, -320, 143, 169, -194, -4, 367, -495, -470, 103, -412, -84, 161, 7, 46, 501, -57, 272, 305, 212, 57, -92, 256, -8, 90, -142, 72, 259, -17, -120, -215, 271, 192, 284, 280, -282, 223, 268, -179, -180, 268, -257, 30, 72, -210, 96, 45, -376, -77, 124, 108, -124, -40, -97, 153, 309, -290, -233, 27, 169, -328, 6, 436, -418, -192, -214, -205, -4, 168, -103, -62, 13, -235, 169, 164, 40, 80, 251, -189, 43, 432, -27, -173, -15, 160, -42, -286, -143, 293, 46, -218, -100, 199, 235, -169, -47, -350, -219, -160, 232, 17, 609, 357, 168, 100, 204, -97, 71, 49, 101, 88, 315, -23, 39, -47, 348, -199, 262, 204, -31, 38, 157, 94, -276, 42, -283, -259, 320, 113, 99, -91, -170, -1, 232, 122, -165, 233, -166, -254, 40, -146, -32, 231]
2396B31k95K66j94N2m22K35L91k11jk38R6k42K80P1L2r9o3j02K49q8J65J02k69
2419e4J22MR9j99k43J06K91m46K34R3n4O0O1k8m69P25m54m8M98l01J51k06l3K90
2443A99j14j51J20M4k74M42l10j91K42P2J05j58K06n29L75K08k00k19L22p1m11
2464b93N77m57K55k61M94j50n2j9j12j72K08K5K0k01J7L20L5l82M02o4L50l32
2486B08k20J31q0Q4j90rL03N5m37K09Q4q1J01n5J45k48k60K03j07J83m9o8J21
2509B3MQ0J9L35m89k52K30L85l33o5j4R2R8k37j26l0N78k18j12j15j15K32J57
2532A27k11k28M58q8q1n3j19mK73J54j34R8k15L3M7K7k84K19j04K88n98M38K05
2555B48j56j7m4q2j6Q2qL3M7l09L34K15k55M5J5K56k33j21JO5j37l25J16L38r2
$$ y = [231, -64, 202, 8, 60, -362, -127, 264, 53, 52, -186, -90, -332, -52, 19, 51, -48, -111, -213, 36, -52, 113, 215, -54, 68, 72, 171, -28, -271, -165, 126, -320, -86, 7, -47, 13, 74, 46, -423, 302, -152, -200, 298, -3, 148, -58, -91, 199, 85, -66, 54, 98, -176, 266, -44, -235, 7, 79, 184, 26, 232, -297, 78, 286, 86, -133, 189, 118, -293, 284, -173, 82, -179, 315, 165, 113, 94, -18, -190, 18, 43, 63, -138, -121, 199, 234, -148, 254, 190, 540, 208, -12, 119, 39, 123, -67, -76, 227, 282, -155, 54, 138, 57, 158, 103, 248, 0, -260, -57, -164, 19, -30, -98, 23, 27, 107, 126, 461, -28, -280, -50, 335, 2, -63, -77, 15, 113, -124, -250, -280, 298, 80, -32, -147, -262, -30, 127, -84, -312, 146, 58, -23, -76, -195, -199, 74, 228, 94, 192, -23, 10, 57, 84, -200, 19, -85, 203, -395, 43, 248, 92, 75, 31, -51, -67, 15, 7, 40, 87, -222, 112, 327, 72, 117, 132, 388, 155, 34, 35, 100, -37, -362, -246, 92, 0]
2580@l03L93J15j68j2K09k87J92l40j24K20L31m23N2M3P2%K2N8p0j8k99J64K89
2604A16k36J35K35l96k4K97j19j24L64l24Q9J99nk77k63L64NK9J52p4r4q2O0Q1
2628A08O2O6k50P7j21L4J74n75R4O6M27m48L26J58l56M09q7n63O45l13j50J15
2650a02Q6q3K74Rj40K0M87o90l1K19l67K25J82l23J74K60l34M6L73j8m68L99n30
2673c32J93L71k15l49M83M9k68J14J40j42J13k39j58O60j92n01j66O24n2k70J98
2694F1J2j06K53l14k54O37j67n89L38J73M2Lk3m7K87k36j67J55M05o61J52Q2m94
2717d58M78j10m31L70O84q35q8M98K56n20O95p78k06Q42n02k11J00L94l22K6K08
2738I0n52N86J28o96M99K58l02k75J62j71K66m8o1k40Q03l24m87Q99l87j95N44
$$ y = [0, -303, 90, 205, 37, 25, 234, -53, 139, -201, -325, -105, 226, -197, -145, -102, -30, -30, -8, 50, -20, -38, -337, -173, 116, -120, 15, 250, -146, -170, 127, 8, -116, 248, -76, 13, 212, 207, -70, -333, 31, 36, 65, 217, 143, 49, -33, 27, 108, 170, 236, -14, 63, -58, -24, 150, -425, -331, -265, 162, -286, 40, 198, -158, 251, 164, -399, 246, -67, -217, -102, -16, -99, 175, 184, 44, 64, 551, -139, -170, 49, -318, -93, 89, -234, -60, 200, -134, -88, 285, 267, -201, 198, -332, -139, 232, 17, -332, 151, 200, -68, 46, 186, 44, 157, -82, -240, 420, 228, -273, -439, 185, 133, -137, 61, 73, -33, 220, -94, -348, 289, 122, -467, -129, 44, 86, 89, 66, 19, 306, 70, -97, 58, 463, -198, -46, 36, -458, 20, -90, -521, -151, 533, -302, -390, 108, 364, -156, 539, -239, -445, 397, -105, -316, -216, 178, -144, -118, 90, -462, 124, 252, -444, 55, 313, 11, -264, -102, -273, -7, -55, -116, -356, 447, 123, -364, 535, 148, -47, 497]
2759D97j078J78M81J14n25M32J91l28J79j93j79N33l15m65L82O05p43n7K34j21
2779a78L05K37l88LN32m96m73M56P9m92N56n82oN20k59j51P13k84l33M51j84R3
2801A19k7l97k7Q16j75k82j06K94n4k78L59n40L41M34o90M5L06m6l74K89j36n1
2823a80L76j91k58L10M22p37m4L00l25N80o0n23J27L52n58K95L99k07k3J82l39
2844a02M66j53l74L7l4J19r7K59L2r8L16n46qM42O1o58K73K42m92L56n1O8L31
2867C89n5l82K19r6j18J9L50n63N20J9n66J37L97j78l11L16q4l38K23j33n2O36
2889C49j31q03J31O12m03J65K28k40K46J6o17K13M70l42j28L08l9q1P2J24Q5j86
2911D9J17k32J91k52K8J35M7p3R6J6n09N84M4l10k40L90Rk01J05j35R3Ml0j20
$$ y = [497, -581, -403, 78, 192, -333, 99, 290, -38, 141, -52, -231, 302, -13, -478, -96, 509, -234, -291, -57, -178, 127, 364, -24, -21, 511, 15, -458, -2, 77, -415, 141, -441, -447, 73, -186, -337, 376, 92, -241, 210, 26, 119, 92, -305, -332, 484, 309, 27, -79, 215, 161, -117, 242, -298, 43, 477, -213, -168, 138, 92, -282, 7, -129, -180, 196, 5, -253, 57, 479, -258, -302, -2, -327, 253, 193, -330, -203, 149, -409, -114, 285, 78, 55, 237, -102, 364, 211, -163, -126, -160, -41, -138, 121, 153, 55, 371, -175, -183, 259, 320, -338, -65, 177, -315, 41, -10, 58, 389, 334, -48, 171, 75, -43, -24, 326, -237, 283, 302, -264, -127, 270, 92, -219, 97, 13, -325, -102, -235, -287, 349, 218, -585, -454, 158, -245, -80, 148, -92, 154, 170, -447, -234, 236, -106, -234, 74, 35, -46, 26, 150, 235, 49, 166, -66, 125, -127, -99, 36, 83, 10, 106, 122, -387, 197, 241, -69, -309, 81, 90, -111, -6, -141, -48, -44, -74, -194]
2935a94N65l09j15j3j44J34J81L15n84J43L34k22l40L75k73K30O1l0O8N08q11
2956a21M05j34K9k17L3k09K03M08n04j80J00K71m02P89n11m6K75m61K21J93j71
2977b9k83K33K11j28K24k85L0J82n7n05N61m3k40K35J28l51K58r8O7l23K78K21
2999B86j17O0n27L75o7L7k16R7J43j81K41J24o9j76m2K63o15M84k27q3K24k26
3021b12M46l00P7p8L00J10n22L36m74L22Q5l05J26J85j27J15J3j12J48J62m44
3042a49J03mK1L45j61k53R2L7j37J71P8R2K58j88j18l70N6J79n8k17L91k61J10
3065A7J71m09K06N8j6M0r8j30K72m00K20J09j63m5K8K62j12O6J85j21q0j93N0
3088h3n9K64r1n7rK92m0j04R8J02l58L09l81K00j82j14K20J05Q4j43J27j70J15
$$ y = [-194, 371, 62, -53, -66, -210, -76, 105, 420, -164, -21, 313, 91, -249, 126, -147, 83, 144, 114, 182, 690, -121, 284, 150, 179, -38, -5, -214, -11, 397, -107, -287, -187, 84, -318, 471, -40, -86, 189, -272, -51, 142, -29, -312, -79, 132, 4, 228, -57, -27, 155, 98, -407, 154, 111, -129, 106, 234, -117, 141, 43, 110, -213, 65, 286, 169, 229, -298, 77, 10, 47, -169, -72, 71, -110, 131, 255, 186, 10, -32, 231, -384, 100, -127, -210, 14, -212, 234, -66, 11, -67, 233, 343, -179, 157, -317, 5, 90, -215, -89, 96, -31, 84, 97, -15, 133, 295, -149, -46, -50, -29, 316, 155, -98, -6, 31, -106, 65, 143, 235, 493, 305, 187, -183, -127, 52, -6, -223, 168, -93, 17, 188, -221, -15, 43, 27, 67, -31, -161, 111, -289, -69, 40, -123, -168, -140, 122, 10, 76, 261, 140, 60, -133, -83, -142, 122, 31, -26, -35, 257, 217, 113, 211, 313, -45, 264, -117, 83, -99, -213, 7, 112, 196, 53, 180, 10, 125]
3111A25k06M24j8j40n6k10j89K24J72j34J51j01N8Q5k05K96q1n03K07L00n37K90
3133d8o8J18K01J51l19k1K1M1L09n94O8l9J23j98J99j7j69J91J45j02J54j75L6
3156Gp5J61m7L1k14J2L24m06L07k95l4O2K07n9J53j41q3N9M7j32k79L88j08L20
3180B05o5j37J66k1o0j93j14L42k94L54l06O6J01k35N7K10r4P9J72j82k59l5J06
3203a37k46M39N4k91K85j07J27r2O2l22j38M57K08l87L50n7l27M6K25m2m37L95
3225F5k12m2M32m69Q6J37l47L99j72J21J3j70L53l31N66q6l10N9l15J35K82l91
3247a97J62r4M15n10K71j9QK32n90L71k18K52k05j65k0J95J17k28q2L32j2j77
3269a62L23k58P1L61m41K28l63M26k73L02n9k37K20n2J44j99O4J1j81k73K35O6
$$ y = [125, -81, 343, 325, 185, 129, -81, -270, -46, 126, -8, 143, 42, 100, 185, -20, 276, 195, -308, -101, 199, -338, -48, -116, 2, 203, 354, 35, 14, 35, 76, 385, -209, -141, -180, -57, -255, -56, -73, -242, -51, 94, -8, 146, -29, 7, -68, 93, 46, 77, -137, -125, 199, -207, 100, -195, -229, -167, 40, -19, 134, -7, -90, -31, 16, -116, -395, -7, -115, 205, 140, 3, 169, 148, 88, -105, -219, 123, -171, 183, -123, -57, 44, -191, -134, 76, -18, 61, 233, 51, -208, -243, -137, -383, 56, 110, -181, 104, -3, 124, 32, 94, -228, -366, 91, 299, -88, 262, 205, -122, -76, 149, 107, -330, 65, -147, -189, 243, -226, -140, -3, -350, 49, -123, -2, 11, -159, 194, -137, 429, 343, 33, 92, -223, -88, 194, -197, -35, -129, 286, -224, 47, 28, 36, 268, -322, 49, -169, 83, -122, -287, -307, -112, 5, -223, -305, 27, 15, -162, 161, -97, -26, 335, -106, 122, -241, 185, -88, 214, 155, -82, 138, 86, 230, 31, 95, 106, -75, -348, -113, -47]
3291d7r7n9K01k34K63k38R7J67o9J33R1k47j5K94l64J81m3J22j47R1k50R1K5j00
3315a54J18p7K65j19n14O30n65M53K30P1n06J29r0l6L31k11P2J70l03K31O2j83
3337Dn9J55j75k0PJ92J4Q4m16Q8M31l37L6k60J75J04J00O0p7k42R9J86l24J71
3361dj3j50K3j28J49J94J65l21j5J38k67k26L81j5L19O3k28O6J9j11m4l5J55K4
3385A39l21N84l63n4KL29l11p1K25O2l15PK76L9n74J44K25l04L55k05j36K58J16
3408A07r6q6J90J90j43k75J27K72k69j98K74r7l48N71m76L84K2L4P4K9j45j57
3430a6P8J02j84L2O3j15j99K22O7q0k6j61R5n3J7K03K7k88J25p3J26m7L58k05
3454F8J30M2k57n1K26k9m01K07j38L61m44J71J9j20n2J12J36jj09J96p3M9o9L54
$$ y = [-47, -144, -203, -2, -236, 27, -211, -114, 53, -16, 117, 208, -39, -54, 240, -124, 57, 14, 136, -11, 80, -170, -79, -54, -154, -36, -113, 152, 33, -481, 149, -416, 37, 267, 338, -168, -39, -129, -165, 166, -45, 27, 197, -106, 125, 187, 4, -55, 100, -75, -95, -88, 104, 118, 202, -214, -126, 305, -32, 4, -256, -81, 23, 123, 183, 106, -136, -37, 149, -175, -4, -17, -167, -144, -272, -123, 71, 236, -85, -100, 38, -229, -455, -74, -89, 230, 293, 65, 131, 150, 39, -5, -40, 115, 139, -182, 402, 39, -15, -13, 316, 5, -66, 159, 221, -94, -87, 189, 228, -346, -202, 23, -281, 74, -131, -267, -9, 107, 11, -75, 115, 305, 162, -113, 14, 286, 17, -181, 93, -4, -352, 219, -257, 127, 149, 183, 257, 286, 141, -16, 62, 164, -20, 12, 75, -40, -239, -17, 50, -30, -56, -217, -122, -175, -158, 45, 72, -216, -91, -164, -38, -85, 273, 68, 198, 240, -17, -68, 158, 129, -272, -65, -203, 158, -286, -115, -96, -216, -268, -156, -20, -21, -130, 66, -7, 42, -27, 327]
3478C27j54k32P5K51j74k79K4J14P2k81q1L65k74J41j43N39j66n8J01m93J63K17
3500E4l69L18J69M4K8m97J06L27n16J59J24m7K58K19k80j83J43R4l9j59K3K7m0
3523c7j18P3k86K15R5j55K24O6j90p0L82m28L77O6l67L47k53M61m95R9l83L98
3545B1l30N75j85J97n29j28Q51m91k24L56k23J39M39n79Q3J1K60o99M01j9O2J6
3567DN8j9j38Q5o2q4L4j0O2j12K95o6j68P4J81K25l84J10k68K38j60j76N48n18
3591b51M12n6j58K58l17j19L09L43k37k4r6l43K74K8Q9p8p8M73%l81n9j66R0N9
3615b8R8J0nk0M0k57K08r9j49L0M33k40j41j20K59l68L81l4j83K65j62q8o6L97
3639A61l59K11k30K99n2P2o5Q8J8N2n18L48J01j92J56j39R1L5j49J81J7k48J41
$$ y = [327, 173, -59, 16, 267, 93, -186, -162, -48, 24, -257, -338, 27, -247, -106, -249, 290, 124, 66, 167, -326, -163, 54, -315, 3, 172, 216, 244, -253, -147, 180, -336, -177, -53, -100, 158, 377, 97, -86, 57, 151, 112, -47, -24, 3, -37, -155, -82, -368, -153, -58, -213, 11, 77, -113, -183, 199, -229, 148, 214, -153, 194, -59, 402, -93, 6, -377, 21, -309, 266, 81, 278, -251, -379, 472, -19, -243, 113, -110, 29, 468, -111, -28, -17, 243, -456, -55, -74, -12, 4, 62, 43, -95, -10, -72, -156, -122, -132, -70, -182, 113, 47, -121, -47, 134, 359, -25, 85, -183, 55, -105, -281, 267, -251, 161, 105, -53, 205, -112, -231, 78, 421, 184, 160, 64, -279, -5, 23, 112, 34, -44, 429, 429, 48, -11, -177, -87, -28, 70, 80, 75, 55, 95, -162, 46, -53, -202, -172, 261, 21, -120, -240, 19, -349, 32, -2, -185, 80, -82, -170, -236, 161, -198, 13, -217, 82, 30, 102, 37, 125, 143, 195, -323, 25, 126, -66, 90, -49, 42, 77, -72, 109, 126, -122, 19]
3662A9K12k12m6k2j29j65J35J66j72J41J86m5l66M31k22l3J64J97N5L8l33j9k05
3685b25K69J87j13m44L67o6J69r6lK65l38J97k66L60l33m4j98K58J14j83J15J02
3707I4P3r1J2j90k15L71J3R1q2j47K29l64O2J76mP0k55K89j13j3k68J86JP7j16
3732a14K51j09J5j69n4J7J22O6K5K4j30j87L21J5Q8k03J7L09j87N2k21L04m50
3755a98L25r5j69m5K69n02M63M1j71K57p5j97l6j1M41k61l5ML5j11j32K61n2j09
3779a03J11P0j38O1m5q1N45l22k3L5k58K68j94L07n64L86l9r9Q0O7l8k52K86j15
3803e5Q3k15L11j00K7k13O8O1Ok39M39p9k65J86j1o2J09l7p1J48j56j58K28m5
3827d0m7J47j18n9j07M37m51K14J27j4j67j29L66j53m1q6L25l77K15l15K71l50
$$ y = [19, 231, 19, -27, -49, -178, -343, -208, -42, -214, -73, 113, 68, -298, 133, -89, -122, 42, 239, 294, 332, -1, -20, -225, 44, 231, 118, -326, 41, -25, 144, 48, 45, 310, -28, 169, -97, 263, -70, -114, -312, -54, 60, -123, -8, 94, 167, 76, 88, -102, -317, 54, 67, 158, 76, -71, 158, -206, -144, 32, 28, 98, -157, 132, 19, 6, -262, -76, -75, 2, -114, 137, 28, 43, -126, -180, -163, -41, 25, 50, 74, -56, -243, 78, 93, 181, -22, -5, 304, 117, 169, -52, 252, -198, 127, 32, -137, -182, 87, -415, 48, 89, -82, 175, 100, -97, -133, -144, 297, 36, 1, 5, 40, -71, -203, 58, 6, -103, 8, 78, -60, 1, -44, -125, 420, 98, 75, 110, -148, 120, -74, 233, -331, 55, 16, -83, -3, 64, 26, -226, 60, -55, 28, -187, 124, 24, 51, -162, -94, -33, -27, -266, 173, 94, -171, 15, 4, -58, 51, 14, -57, 91, -65, -223, 5, -40, -87, 60, -58, -117, -224, 213, -238, -24, 103, 89, -78, -207, 159, 6, -35, -121, 204, -173, 42, -273, -2, -352]
3849c52l6M56k76L97j10j3k42N04k46n4J51n84N56k12J20N9j34K44k37j27Q1K12
3871A57n39J68J79j04K27Pk46M85J63n47L3R7k95K51L0m9k12RL32j04L65l40k39
3894a72L38m7k76o9K34L9K91l04n2lM13m65J31K77l70o8rj0M26l27j6J73k15l77
3918d58N24r3k43L68l40J40M39l83K31o1k99J14P1n1j44L53k34K44k56m8L72K1
3940B67k62j52L17l90L79j87K78k82j8QJ73k16L11m25N12l56L14q8j99j58K42
3961F8R0k65L11n03M43q5j47Q6J17l76M8r9M59j73m3N9m32L76L65j51j89L96m17
3984f2q8J72J41k38k19K09K1K38Pl54J63N3k53K60k49J28K0j08N30k99r6N2j72
4007a44J80l75K31L11n16J43M53l45j52L79l40J29L22k76J01J3l19K31J5q0R7
$$ y = [-352, -388, 68, -208, 189, 79, 66, -176, 328, 82, 28, 179, -405, 151, -61, 59, 118, -16, 228, -9, -136, -55, 157, -382, -214, -35, -139, 88, 95, -151, 334, 497, -50, -17, 80, -215, 36, 66, 17, -195, -186, 146, 42, 407, 67, -172, 166, 119, -157, -226, 8, 47, 338, 34, -18, -21, 392, -73, 58, 335, -35, -103, -112, -122, 304, -23, -39, 134, -81, -458, 66, -27, -270, 98, -242, -102, 337, -46, 185, 124, -175, -61, 10, -41, -185, 168, -66, 178, -78, -126, 246, 267, 5, -147, 170, -220, 159, -28, 250, -32, -50, -42, 131, -85, 226, -199, 313, -43, 271, 183, -16, -174, 68, 158, -107, 204, -299, 144, 59, -88, -2, 115, -261, -213, -312, 147, -26, -69, -10, -442, -66, 299, 148, -41, 355, -62, -150, 22, 163, -75, -294, -85, -64, 174, 181, -173, -10, 43, -210, 50, -199, -71, -51, -159, 371, 72, -24, 28, -144, 36, -339, -108, 203, -313, -170, 283, -62, -214, 165, -175, -46, 276, 0, 101, 114, -205, 26, 41, -39, 58]
4028E8j14J2K82k68j40j35M24P3k79r4J98K42m24J37j62k12R78o77j72O00Q9n18
4050a02k42N86m13J14J8q9K99k34k40L69k02k62L50J16l49N28P2m59n1K72m16
4071c35Q5L26k56J10M13j79l58L55m1j50Q3J43l23K63k65qp1J93m47J19M38r8
4093cj46J19K48k84N75o33L8mK2j65K78n4L1J57l60k11N21Q2l20M12m04j24R7
4116a28J35O7J40J56n10m17M13M5J51o8j54P3N14o15J96R6k67k11M90p6j39M73
4138C64m66j32M45k65j91M40j70j73P2k11k3L53L26p34K38K63p9l17J31P3O9j72
4160a59K2j00N07j42l81J22M61j61K58k74K1p8L48o52N41j05n09L74L2r6K40o2
4182B07o57L22Q5J17j10L64n87L85K51n16J58M37n34k73L93J73k61J30k95j06
$$ y = [58, -56, -44, 238, -30, -170, -305, 119, 192, -87, -181, 17, 259, -165, -28, -190, -402, 576, -101, -273, 327, 416, -102, -344, 242, -171, -57, -39, -128, 171, -63, -303, 66, -136, -398, -48, 68, -281, 247, 319, -140, -191, 81, -335, -250, 76, -180, -70, 343, 164, -194, 161, 120, -30, 53, 196, -127, 136, -129, -137, -208, -15, -462, -343, 95, -3, -149, -30, 218, -66, 509, -124, -86, -90, -68, -233, 45, -9, 22, 179, -181, -392, 129, 211, -109, 303, -101, -225, -128, 7, 74, 214, 370, -140, -557, -144, -99, 52, -16, -170, -97, 417, -198, -2, 94, -173, -384, 106, 30, -109, 364, -102, -234, 211, -54, -245, 195, 25, -148, -76, -287, -310, 43, 369, -365, -127, 136, 57, -260, -129, -56, 13, -159, -137, -237, 270, 128, -253, -131, 330, 169, 427, 153, 174, 96, 444, -208, 333, 228, -281, 93, 125, 29, 269, 207, -450, -128, -43, 74, -36, 328, -259, 126, 377, -139, 19, 456, -78, -351, 42, 215, -46, 84, -211, -317]
4202c17O10J26m61j14L97j63j91K52m43L39K69o79J92K43j37P8J85qk02K64n66
4223c26M68l20j33j5P19n13L1K33q0n9r0M23m14J97J31m52K7M58l64k5K00k06
4245a10R1R9l65L46L18k17j78J66k01J65J97k74j51K32K2r0J56M5l33J97no28
4267e18L57L12l41J28P6k95M64j95j04L47k3n16J46J36O0k29K20j34k78L63j73
4288a97p8N34K5m11k14L41l27M14l19M13R4l28j10M39j43m44M25J77o05O92o67
4309b89R8Q6Q1k25nM92l37L05k08M7l82O43k04l82K05J97p4L87l74l28K85K52
4331B70l68J94l5k94J00K91l49P5L09n8j08K55j48l48M34l85K2K30k95M39n8j57
4353A6O3K49j4m67j6j92L27K23k02j80J66J21l00J91J00l8K9J3j78J51L02m83
$$ y = [-317, 293, 419, -42, -156, 241, 78, -113, 139, -304, 35, 304, -375, -183, 60, -77, 1, 186, 178, -24, 240, -326, 142, -178, -311, -326, 393, -120, -89, 144, 64, 5, -85, 338, -76, 121, 252, -200, -173, 285, -79, -104, 96, -110, -19, 80, -285, 61, 379, 162, -16, 150, -51, 114, 311, 37, -114, 118, 140, 50, 206, 251, -82, 115, 110, -518, -161, 151, -190, -62, 14, -281, 183, -12, -116, 231, 208, -308, -162, -26, 34, -195, 25, -109, -387, -24, -197, -275, 259, 284, -127, -341, 0, -327, 87, -232, 181, 275, -53, -163, 276, 133, -311, 114, 291, -314, 378, -289, -191, -105, -24, -249, -254, 238, -99, 206, -2, 45, -337, 306, 102, -280, -75, 122, 48, 435, 61, -267, 18, 270, -98, 96, 61, -233, -133, 158, -191, -116, 193, 135, 27, 282, 134, -214, 220, -165, -143, 87, -208, 231, 173, 16, 79, 328, 314, -153, -169, -361, -34, 189, -13, -193, -27, 94, -206, -15, 85, 47, 76, 89, -89, 62, 364, -119]
4375a19K3R5J42m7j82L5l84M43Po4K00k27o9J93j98J41K66k21k70K32Q9j55k75
4398c45J98j48N55l48n2K28L67p86N08j05O1J30j00l07P6J85l83J04lK73r7M1
4420E2J54j75r1K79n66N22p5l36J53K62j23J41k34j3q1K11k18M00m42j45J86o5
4442b04K10k08J18m2J23j89Q51o23k50N17k40j27K29k41O8m08K90m1K89n7N4o
4464A13j55n2K34L4n56N90R9j29n0k74j36L29l09N8M26N3k52j90J44J98l65J7
4486a73J60k1m9K68j8j29Q6l2k23m6M82l01j00j1j76L6J28K22k8K88l90o6J39
4509D6j36O2K93l35j76K91J30k28j23K49J42l36J44j22M6J76j20Q4q0q1J57j81
4531i8j02k2M15j08n1L5k13J15l6m1j64J33n6J22j08L22k10J73J22J17k90K34
$$ y = [-119, -96, -1, 141, 94, -88, -53, -437, 6, 13, -51, 149, -78, -147, 46, -152, -11, 255, 34, -236, -4, 85, -70, -345, -147, -295, 260, -88, -140, 88, 455, -331, 177, 72, 133, 263, 163, -144, -68, 117, -266, -162, -165, 108, 11, 52, 206, 31, -60, 219, -347, 175, 100, -236, -83, 179, 56, 197, -37, -50, -131, 80, -138, 262, -180, -325, -139, -204, 6, -202, -84, -126, -3, -192, 659, 36, -214, 303, 63, -64, 165, -76, -8, -416, -126, -167, 122, 65, 119, 113, -42, -94, 140, 174, -382, 208, 307, 178, 128, -146, -282, 47, -262, -204, 222, 275, 23, -167, -23, 175, -190, -173, -13, -34, -83, 185, 167, 38, 124, 92, -131, -177, 305, 4, -96, -107, -283, -247, -119, 103, 75, 363, -27, -93, 46, -90, -28, 265, -70, -246, 45, 175, -53, -176, 73, 215, -121, 23, -99, -53, 123, 3, 87, 7, -74, 83, -98, -200, -222, 193, 85, 34, 69, -144, -29, -65, -106, -270, -137, -193, -71, -179, 143, -67, 106, 228, 345, 55, 289]
4553B89l48p1L1K72k3k30J24j19j78L03m23K63N45l47m4M4k93K95L19m40K47j53
4575F3J75j22q8j10ML18n66K23O6J40l17M50k94O3K08l5j95R5L3n7j25q5J73m33
4599d16J68P5L69l32K89j79J89O8j75j99j5K79q4l72K52J42J70m65K67L75m18
4620a2K58q4j58M69m08k91j67M26j87J38J16J72n65J08K75k33l7L75N1k21J73
4641A98j82R4j78L40m51L45m36n5N89l22j96M13l61K06L9%o2L83n2n09M31K2j29
4664A27k34L99m90K81m1k84k0J98K6l8L86k61k16K72o1l46J78%J0M5qJ27m10L39
4688b1J64o0K66o23N97k37r7J06mj16j72M11k7m05K55k77L80j10j66O9L60k89
4710DO7R3j39k70L89j52J89k0O9l19O1K62k90j68M33l31J95j97M21j21K47l11
$$ y = [289, -59, -130, -99, 173, 150, -80, 44, -75, -253, 50, -373, -110, 435, 88, 44, 88, -205, 90, 409, -31, 216, 63, 238, 116, 28, -82, -78, 240, -326, -103, -37, 103, -214, 236, -58, 5, 213, 178, -17, 78, 111, 54, -71, -156, 17, -416, -248, -173, 196, -136, 153, -26, 163, 231, 56, -143, -158, 121, 37, -335, -83, 59, 229, -236, 31, 406, -12, 246, 162, 4, 473, 65, -226, -393, 33, -154, -16, 100, 272, -293, -185, 90, -143, -180, 195, 246, 25, 198, 16, 110, -68, 272, -179, 166, -270, -325, 264, -58, -254, 159, -202, 4, 43, 43, -19, 364, 312, -197, 234, 256, 127, -107, 292, -198, 83, 42, -242, -262, -64, -38, -76, 310, 49, -167, 105, 44, -302, -124, -124, -114, -69, -77, 50, -360, -21, 143, 83, 349, -274, 323, 86, -11, 95, 91, -25, -197, 214, 187, -218, 37, -240, 140, 30, -136, -67, 293, 4, 71, 164, 25, -245, 144, -8, 181, 161, 230, -89, -28, 234, -56, -224, 209, -122, 73, -124, 297, 176, 423, 112]
4732A12O6Kj94p8J89j82J32M00l68m13O17n22N8L77k10r9L71p05M95J17l47J53
4754b9k29L16j38L3M72l31K33l65j06K13K51k42k48J30qm7L07k75l71M14J04l76
4776b92M37l18mK02L1n17O04j81q6J47K05k30n0J40k51J41J86k06m3J43N9nm03
4799b91k13K3M74q4L4J12j03M8Q3k08o4L32o4j41N5K92k63j44L97k15j1J77k29
4822cJ04P7J24l95N19n38j41K98j99r5M99l83j90M73K9l60j35K68k73K37nj89
4844b78N42Q4n01K67J82l51L07l37j86L23J87j98k1N1rJ1N1p5m46L96l44K88L2
4867b5L16l26N1J02k27M35l39p6M41m63p8K0P59m92k26K83l06J46K46r6m44N20
4889B21J07o88L52j7J3K81k98n33P65j13j71K67l8l03l2M49l49R2L4k60K74M1
$$ y = [112, 178, 180, -14, -92, 97, -85, 47, 447, 79, -334, 283, -239, -181, 196, -14, -113, 258, -447, 48, 165, -182, -29, -258, 58, -80, -47, 425, 94, 327, -38, -144, 69, 320, 78, -170, -40, -48, -95, 212, -63, -434, -20, 84, -292, 145, -173, -177, 25, 56, -461, 143, -38, -124, 23, 228, -2, -52, 88, -163, -22, 164, -42, -85, 58, 117, 112, -291, -504, -481, -7, -91, -57, 55, -48, 0, 83, -125, -189, 143, 79, -62, -7, 285, 22, -122, 275, 60, 49, 226, -3, 101, 178, 302, -93, 426, -112, -253, 45, -154, -249, 250, -133, -323, 150, 179, -181, -316, -48, -321, -84, -89, -278, 264, 348, -153, 114, 296, -55, 252, -85, -271, 52, 239, 41, 20, 71, 62, 73, 124, 49, -397, -1, -345, -57, -25, 291, -35, 16, 118, -109, 326, -13, -89, 352, -111, -189, -169, 590, 98, -128, 155, -151, -5, 241, 145, -299, 221, 328, -360, -8, -25, -12, 269, -29, -562, 203, 90, -81, 186, 148, -155, -187, 262, -87, 5, 39, -221, 53, 94]
4911I4R5r0r9Q3j70J87k73K82J74m88K0N42m25O6N05l31l97M75l98j80K06L66
4933B44o14L23j62r7L86m2m23M05K62j61l03J48N2q1R2l9p2L67m53j24L87j7l27
4956b49N12J22p69N63l3j58p7L14k05rj44J90K0m1j79J12K41m54R2J04J60O4l58
4979a82K32l03J83q0L1J70l17N35l40M76l39M0l17M6J92j50K62j65M30k14k8j89
5001b7K21O7k27l56N21nk25J44K73k78k02K44J8k73k2L96l24J14q4q9J81L7k54
5024a50K05P2k9j14L05m58K1K25l8Q6mk46j57K54Q9j48J1K95k09M21l66k78M21
5047B08l32j12L53l66K67j64m1R9L67n03K44k54J5o7K68J84n02N94q3k42J69k52
5069a50nk7N36m93k5Q8K35j60n6J16r0J37j14r1k54K06O1J50j1J2r2K45m9l16
$$ y = [94, 189, 99, 0, 83, -87, 100, -173, 109, 283, -205, -185, 357, -68, -2, 503, 172, -225, 250, -148, -328, -122, 244, -370, -47, -209, -306, 80, 38, -385, 20, 282, 121, -182, -34, 18, -63, 29, -10, -82, 285, -168, -292, 95, 78, -249, 263, 385, -384, 179, 146, -12, -89, 225, 20, 11, -133, 57, 77, 36, -143, -31, 210, -244, -152, -48, 112, 176, -182, 50, -253, -70, -150, -119, 51, -266, 269, -71, 405, 66, 106, -211, -165, 27, -123, 139, -26, 404, 190, 162, -27, 194, 261, 34, -322, 199, 194, -31, 113, 386, 108, -94, 150, 168, -105, -127, 269, -55, 59, -25, -114, 67, 104, -150, 55, 127, 98, -16, 289, -169, -148, 77, 39, 125, 121, -125, -282, -28, 61, -87, -76, 219, 10, 431, 65, -213, 208, -124, -236, 117, -249, 18, -146, -187, -88, 279, -224, 20, -234, -219, -286, -18, 166, -336, 258, 175, -67, 102, -150, -155, -182, 354, -139, -164, -76, 159, -1, -57, 59, -31, 106, -8, -99, -353, -147, -86, 64, 53, 65, -27, 218, 169, -147]
5093a47J68J45k73J74L25o44K08J88Mj70L32l90o8j25J10O9j1L3J70O8l46J09
5115g1M3pn5J44l12L17K51n18J7L73l30L6K50r8K09k47j72l52P74k8k91K01l09
5138a75P5J01j44O1R3P0j3L4k8q3KK69k81J8L42m72Q2p1J34M0j14Q3N4l4j02K2
5164c7r4K29l1L2l4J14J39m67J05J01j80Q2j7K12q4J2n0k23L13j27j04L8J15K20
5188B64m47L38j96p7L55l02j44K65k34L91Q9k10N1L5k08M4J19j22k2k14J53K44
5210A72q9R8o9j94J19P9j28j12M47n02L54l18K78M9l85j78P56l63k7J2l9m5N9
5233b6k02M85l69O7M3m2l23K06k0K11m6j24o4K65m1M5J22l55K86k80K46m15j66
5256d97L07L82m09J88K59Jk67o5J26j04O8j07j2J74r0N8M7j92J69j54J53k01K32
$$ y = [-147, 21, 166, -107, 67, 392, -252, -44, 144, 148, -22, 310, -80, -148, -273, -163, -94, -105, -72, 98, 166, -180, -71, -28, -35, -90, 54, -258, 59, 310, -208, -191, 182, -148, -112, 138, 40, 249, 2, -170, -522, 252, 224, -67, 134, -175, -100, 1, -143, -82, 11, 81, 68, 102, 74, -9, -7, 262, -19, -1, 341, -131, -49, -120, 14, 54, -60, 23, 77, 43, -59, -37, -131, 98, 67, 99, 65, 179, 318, -149, -44, 57, -123, -41, -58, 154, 70, 82, 32, -191, 122, -5, -109, -71, 44, 264, -183, 155, -41, -118, 237, -65, -209, 56, -178, 213, 302, 92, 143, 178, -30, 14, 133, 11, -11, -225, -72, 172, 83, 181, 112, -82, 37, 116, -12, -124, 323, -179, 175, -143, 135, 184, -201, -379, 377, 14, -13, -1, -40, -85, -26, -228, 257, -112, -45, -2, -44, -367, -161, -181, 30, -16, -140, -204, 61, 20, 65, 187, -168, 118, -162, 84, -331, -497, -190, 192, -217, -29, 230, 231, -36, -101, 25, -79, -11, -118, -130, 44, -46, 12, 59, -133, 36, -118, 35, -166, 66]
5279F6m4J87J19k22n9j65K37j98K56m15J41J9P9r5L09M2O1k93l23K02j45M05J2
5302A76j61J72l42K68k2K2k12J33j57R7Q9L11k09k14n3j0K04k10M8M1o6k3L17
5325A99k24J44k20K23j58J29Q2k83m6P9K36k09j13K88j75J98j45j34J57J83k58
5346d7j00N72m81l02M15J29o33O86j89k42P4K98l78L38m05K49L24n10j14M89j52
5367B1j85J58K98l45j8J35l74j8K31J44j41j2J19j35O6J82j88J6j9j90M80O1m83
5390a97J81j33J15j91N16k64j96J8K11j95J22K23j77J04l29M48r1j93o3K1mJ05
5412C1L1k44j77O92k8n26P95p01l1L30r1j06J10N3m35M48l19k7l9L48j3k5J6K0
5436A12m36N2K20k73N03j67k55N06j03k26K76J90l83l62L27k29L23J96o56L57
$$ y = [66, 22, 209, 328, 106, 47, -118, 119, -79, 177, -238, -97, -78, 1, -94, 215, 257, 318, 25, -298, -96, -241, 164, 176, 15, 187, -155, 113, 91, 113, -99, 34, -123, -26, 63, 374, 165, -49, -102, -112, 92, -118, -70, -29, -95, -118, 199, -25, 119, -101, 122, -36, 93, 175, -108, -154, -75, 161, -48, -161, 127, -48, 150, 5, -129, 28, 211, -47, -147, 425, -56, -358, 57, 186, -447, 239, 50, -192, -118, 180, -198, 140, -265, -16, 308, -202, -316, 173, 21, -164, -6, 292, -53, -71, 64, -310, -328, -97, 47, -94, -106, 13, -122, -56, 126, -62, -46, -65, -255, 225, 286, -197, -16, -149, -34, -225, 291, 27, -169, -151, 60, -135, -13, 210, 33, 137, -192, 256, 165, -28, -91, -70, -74, 31, 62, -182, -359, 333, 305, -221, 574, -127, -158, 172, 81, -25, 85, 138, -297, 151, -168, -195, -234, 114, 101, 76, 92, 112, -324, -272, -52, -325, 178, 11, -244, 262, 159, -67, 209, 399, 16, -346, -19, -248, 75, 271, -385, -28]
5456b8J97N6l50l2pJ62L5l3p7J71K8m27L42J94n5j13j65l15N24Q0l71M78Lk08
5480H9k1j83o9L03j12k3l2J25l73J65M16n6j93M04p10N03K67o25j92L07J44j10
5502B4j06L14j77K29l12q7L42q4l96K08O6J03j66M8k45L13M16k12k64P4k33q1
5524b26k90M46K0J62n1l24K59J03j11J8K19l46N33n80j97L00Q9o4j07M5k6J54
5546B6K12o40M45J7L9l13M57m20J69K53l59R5K76k58m18O53J0l77L89l48N4J04
5568F6k4l0L3J36m96L69M37n52J06q4p2L56J49p07J89L06j03l18K22J61J17J6
5590B77l15k58N30j58j49L6J45K7l13j9N1K47r5m4k8k5j95K47k71L86j32K52j63
5613C3j26K10J69l58N5K17K9n43K80k07L24pj28O1K58k14P8K8r7J5Q3l70K67j67
$$ y = [-28, 169, 225, -125, -157, -164, -2, 33, 0, -77, 94, 122, -305, 37, 231, 176, 63, -102, -417, 107, 187, -184, 294, 297, 89, 68, -115, -184, 119, 7, -16, -48, 77, -296, -131, 285, 229, 36, 440, -270, 233, 500, -125, -317, -10, 134, 24, -82, 232, 55, 284, -28, -115, 227, 143, -253, -45, 21, 124, -42, 6, -239, 74, 490, 278, 14, 88, -145, -226, -516, -70, -50, 112, 61, -263, -4, 99, -12, 6, 225, -121, 412, -168, -365, -65, 24, -40, -147, -102, -128, 26, 238, -402, 43, 60, 99, -214, 243, -177, -8, 245, -114, -19, 257, -1, -419, 234, 244, -133, 256, -92, -38, 66, 42, 12, 45, 181, -315, 54, 491, -61, 45, -39, -111, 245, 394, -313, -124, 182, 79, -239, -17, 144, 261, 277, -38, -296, 234, 76, -73, -37, 108, 135, -178, -197, -146, 101, 6, -38, -66, -91, -286, -39, -310, 76, -56, 196, 33, -93, 117, 286, -72, -17, 200, 229, -314, -34, -241, 83, 76, -52, 9, 267, 53, 131, 159, 62, 77, 160, -210, 57, -110]
5637a10K47p7J32k93j32M31l4o26M25Q1k28L23j89J88M2J9k0k5Lj93J19p4p9j91
5661b61L30Q1j21k6n8J58R7m28p2N14n71J52K80k24J9J51n3l5J19N9k71L14o8
5684H6l76J89qR4j5P8P6n4J63k95k00P2J67O7P1q3k5J35L84n61j50K23p3m9L2
5709e2M6K14j16j47j8K59l19m0Oq9L86j57J27j58K2K29j07Mk16J08o9o%J32j25
5734h6R2J91m32K07K94l43N3J19K6j45Q1j22K9J06k11k24K71K76j34k26K35k56
5756a99K87k06K24O3j10m9l1K60p7m43N38m72J82M6j79K20M2K11m36J44l0K71
5778B56m1o53L89j5lR4m0j01K73O0n18M66k75j77Q3K73o4L25l82P0j30M7O0J69
5802A66m80K47k9K10m07J56P7j05N6M1j6K38k08j7K08j62j87K65r4q8K07O1l53
$$ y = [-110, 137, 60, 192, -101, -233, 198, 164, -462, -37, 44, -184, 139, -50, 138, 180, 199, 179, 154, 157, -36, 83, 9, -70, -261, 69, 150, 29, 3, -55, 103, 200, -228, -300, 214, -357, -205, 75, -149, -130, 21, -32, -67, 52, 111, -160, 154, 86, -290, -101, -109, -15, -30, 48, 124, 70, 233, -62, -262, -190, -23, 44, 115, 32, 7, 142, 526, -35, -185, 38, -35, -84, -52, -6, 208, 92, -55, -73, 186, -133, -173, -167, -256, 130, -27, 100, -58, -36, 193, 86, 90, -126, -18, -87, -93, -93, 39, -86, 6, 197, -235, -28, 266, -77, -24, 95, 121, -24, 57, -65, -36, 70, -141, -365, -94, 182, 48, -178, 57, -199, 88, -118, 106, 169, 59, 10, -21, 239, 162, -281, 257, -215, -33, 13, -166, 54, 96, 307, -129, 15, -15, 256, 215, -438, -49, -64, -67, 27, -13, -114, 159, 219, -299, 167, -108, -285, -202, 71, 7, 332, -50, 20, -110, -63, -3, 166, -314, -67, -96, 114, -293, -137, -60, -165, -109, -68, -84, 154, -54, -71, 137, -25, -212, 53, -41, -129, 78, 139, -214]
5825b14M72N1o15O46l65j62J80J26j93N3l0K18l16L29l68K69J00k24J67k99N0
5846a25M78l62j62K05k47q4O85l51l73K73P8K81m83M26j40k33J88J93j54k2J01
5867A72o4k37j65N36m96K18n2K25j34N3k85K72k64k26L67j53K88k46L41j40Q3
5888I3l09M71k62K62J15l99k12K05o6no0L70o6m45N48j78m03L06QK79n60K4M80
5911A96o52M88j9N7j72l73L90J91K36j30j81N3Q1n4K38j50j58j41QM30m46k2k2
5934a52K23n6j00j06k65O03j75J15k14J15M0L2K2o3N2P8l58P9J49R2r9k36N0j61
5958c35J77K46k52K82j33J3L9m43N90n9j62L68k85J3n20L94k10J80K3o4J02m12
5980d48j4M50N7j70j21L25k33K18Q7l35K15j02M00n32q1M67Rj12N2j49p9K04J96
$$ y = [-214, 258, 309, -306, 340, -25, -187, -7, 119, -74, -21, -51, 167, -149, 180, -188, 81, 181, -43, 124, -175, -125, 353, -9, -171, 34, -213, -297, 388, 37, -336, -63, 15, 296, -187, 239, 99, -134, 54, 247, 93, 71, 172, 108, -129, -294, 242, -254, -36, -88, 137, 3, 56, -229, 43, -221, -447, -80, -233, 55, -191, 150, 10, 93, -216, 255, -7, 255, 370, -29, -241, -36, -102, -107, -167, 203, 137, -308, 240, 62, -341, -35, -27, 252, -308, -284, 196, -456, 32, 13, 70, -102, -475, -85, 106, 342, 212, 31, 84, 165, 111, 349, 199, 41, -100, -92, 338, -108, -130, -152, 71, 15, -85, -191, -456, 147, -28, 87, -127, -12, 28, 60, 82, 19, 71, 149, -209, -130, 19, 111, 12, -224, -174, -335, -158, 88, -164, 118, -15, -2, 37, -406, 184, 125, -37, 331, 46, 59, -461, -67, -277, -97, -74, -138, -36, -448, -462, -12, 45, -125, -246, 79, -154, 64, 151, -184, 31, -71, 329, -203, -284, 183, 192, 80, 132, -17, -96, 108, 304]
6003C04k69O6n7j04L1j1K73k64J54O1j06l20K50J28j46K37l38K28M7n36L27m4
6025h9j11L74m9r2p8L71l43k23K27L31j98j35J90l41J87J65j28l06J08L6N1K14
6047A61l55J82j1J30J26k01k26K46P4k56k15N23q5k58L87k66J32k54J67k94L13
6068B0k19L68k37o3r1J88J04j07K77l22k16M53K01l97N56l98m60R9J02L97l52
6089i7M99l53Q7k34N15r6l44j60j86M09r1j2K11j15l27J36L05l37K82r6J26R2
6111B14j5k16p3K18j72j09K09P2k22J3J53Jj44m3j04K92r6j43N40m37j18m6K43
6134A7M4J88m85k62N81K6K2k19M08l57l8k2m23J35M15nk37L59l00NL29k86k10
6157c15N52k35K31m5j91q2K48k90q7K83O5k60M01k53k56K76K64m96R3L04l78J66
$$ y = [304, 35, 101, 44, -60, -29, -40, 233, -31, 123, 184, 78, -242, 8, 136, -10, 227, -111, 117, 164, -372, -45, -89, -200, 174, 125, 33, -45, 326, -17, -240, -13, 318, 120, -15, 175, -166, 21, 186, 58, -248, -140, -104, -53, 161, -194, -12, -23, 107, 233, 32, -194, 52, 126, -130, -345, 178, 93, -165, 222, -44, 88, -166, 1, -293, 20, -199, 169, -68, -131, -222, -34, 70, -37, 240, -82, -298, 155, 356, -41, 515, 117, -343, -244, -142, 255, -97, 402, 49, 136, -98, 417, 321, -23, -183, -369, 40, -51, -63, 148, 33, -294, -158, 147, -190, 92, -4, 122, 214, 199, -17, -90, 128, -44, -153, 56, 128, -94, -81, 72, 73, -71, -114, -218, 74, -22, -165, 375, -62, -180, -226, 17, 61, 249, -236, -498, 83, 109, 131, -88, 320, -37, -75, -97, -520, -385, 30, 25, -212, 147, -153, -148, 181, -105, -315, 237, 2, 233, 188, -3, -85, 163, -127, -214, 69, 134, -126, 275, 22, -234, 42, 306, -190, -97, 207, -171, -5]
6179eK15m8l78K96j43J45m7k6k23K60P7m34L32k97M9L60p1k51l71Q03k6k99m9
6202a31n7N3K75j21K6M3l52K84K81l02k32M50m40j04L86p1K5J67J43k12J27L8
6224B76l15K75J83n15J05n6K44l38L03j55m49L22J90l74M95R7k34L74n10o2J88
6245D4Nl13M51n5k13J20K6m5K45p4j52J60n1j74j05K61kpok20j80L57k45N6J2
6270a05j18M47j32k12J61k2R6k41J58q0q2J01J4r1j5Q4k32L08J91n09J95L28k73
6293b9J44j86o9J78M15k51m53J93J54j20J51m4K10j19j58k16M60j73k4o8j68p5
6315b48L9L43k25J73j31K46k32J18j91K11k20o8L19O9k17k26K59l39K68q6Mo0
6337a94M04j05m00K38J75l94L17J16k83p3J42k7J76k82j18K83o4K11j15j01J66
$$ y = [-5, 210, 162, -216, 80, -63, 82, 35, 9, -214, 46, 123, -311, 21, -276, -227, 133, 62, -189, -560, 243, 217, -82, -131, -188, -135, 140, 19, 45, 88, -264, 20, 301, -1, -233, 217, -223, -327, 59, -12, 13, 180, 323, 111, 238, 276, -39, 236, 419, -96, 9, -47, 197, -141, 162, 7, -442, -120, 70, -304, 191, 288, 54, 428, -82, -144, 44, 49, -264, 187, 132, -81, 39, 65, 20, 265, 191, 39, 199, 148, -26, -131, 130, 128, 121, 115, -105, -285, 72, -173, -117, -105, -223, 224, 92, -120, 41, 19, 115, -126, 32, -48, -130, -29, -15, -106, -121, -37, -269, 39, 230, -279, -84, 244, -29, 115, -71, -140, 38, 453, 202, -251, -58, 96, -24, 127, 83, 293, 174, 16, -200, 260, 87, 63, -5, -173, -248, -209, 134, -91, 82, -49, 197, -35, 83, -108, 103, -117, -185, 134, 203, -14, -240, 19, -320, -52, -138, -134, -194, 210, 105, -295, -57, 118, -276, 41, 157, -126, -199, -57, -84, 92, -190, -308, -25, -89, 122, 7, -94, 72]
6358G2P1n4k19J84L65j2m82J09r7K17l53K46l06L63K12l57M9N5J16j10p3J59l85
6381b30K94j56N52k14l93L43k68k98L56k31L19r5KJ32k82M58k07m3J82q9K10q4
6403B58j85j73l8L58l68j62K53M0K57j26j52J34J98k65J71P6l03L26n16L97o5
6424A15J08o5j57J09K02l61J87N2k30J5j20M0K9L06m78L4K77R5k3J1j09N4R0m47
6448b66J14M60j89l31K61J85l91K09Q7p3J07k28q9Q9J34m3j6J2l33M53L21n67
6470i4L42j58l94L09j27K15m68L14M6j04Q3rK88l10K78q6j68J97n4K53n66L29
6492A16k3m94K66j5M65j63n32K96Q3Q0r1j43K76k52j61J92K78k80J05J82j62J41
6514A64j80P1J00l11QL39j95L63m97J54j34L1K90o1j14P7K51n67K14l1JK3J03
$$ y = [72, 143, 89, -130, 54, 419, 407, -75, 34, -63, 154, -199, 47, -259, 104, 316, -41, 8, 63, 179, 69, -4, 155, -230, 64, -92, 460, 246, -147, 196, -72, -370, -14, -245, 74, -21, -19, 113, -169, 289, 82, 39, 221, 132, 342, 258, 73, -100, -138, 220, -148, -310, -57, -17, 240, 114, -38, 96, 294, 29, 200, 276, -27, 299, -217, 180, 115, 223, 158, 1, 110, 312, -49, 138, 190, -40, -25, -145, -105, -76, 230, -248, -214, 63, 158, 135, 146, 37, 91, 181, -266, -152, 308, 119, -212, 49, 234, -157, 52, 139, 66, 173, -55, -144, -55, 79, 36, 20, 32, -301, 152, 473, -94, 248, 90, -304, 5, -122, 93, -375, -61, -15, -119, -36, -45, 243, -67, 211, 125, -43, 154, 100, 353, -213, 116, 93, -401, -135, -150, 315, 152, -380, -84, -1, 79, -12, -155, 121, -131, -292, -100, 178, -102, 3, 185, 23, 164, -16, 55, 155, -156, -148, 191, -4, 359, -138, 16, -118, -87, 203, 142, 28, 105, 356, -211, 3, -28, -27, -4, 99]
6537I9j70J39m36L41L7o5J06j93K91k51R2k37L61k60J11L40m33o2K06Jj42J65
6559D0j73L8K42l9j19Mr7J0M67n98K37j24L26j34k42M21l96j38L13m12L89J05
6581A20J19l87j24M13k00J66J23j44m2n4M8r5N2j63n0j37J92Q8L30k69J14K8k73
6604a45J55j07M1M2J04j02j93K07J47K33m72K67k46J79O9j93q4L97k50J63k70
6625e8M7L15j11qj20K52m74K15J88l09J79j98J21k96L21K40k59Oj63j65J78K00
6647A01l07L59n17K75K41k00m6j4J7j98N20k91o9J57j59o0K27l55M09m9l67P2
6669b54K58j27j9j6J83o2m8J05k85J33K8L3K17Jk55N10o15J52NK81l44Rn5P8k07
6694b94J08j40K17J49P3j6k63K88j37K8J93m48O7L21J96k84l52K4K99K9j61K73
$$ y = [99, -71, 68, -368, -27, 10, -55, 51, -142, 149, -102, -10, -247, 114, -146, -35, 305, -128, -190, 16, 17, -125, 40, -133, -95, 147, 108, -11, -7, -104, -94, 373, -225, 12, -112, 214, 80, -162, 259, -137, -275, 38, -374, 15, 120, 239, -148, -272, 141, -59, 107, 230, 86, 44, -10, 38, -57, -5, -168, -218, -355, -163, -75, 255, -14, 100, 128, -145, 10, -97, -56, -14, 90, -12, -205, 2, 149, 382, -90, 177, -69, 110, 179, -14, -98, 299, 49, 212, -58, -11, 304, 193, 185, 65, 317, -157, 58, 246, -63, 116, -82, 39, -257, 64, 304, 45, 51, -112, -277, -99, 101, -206, 153, -364, -89, 152, -48, -94, -108, -91, -289, 231, -60, -129, 28, -131, -191, 36, -319, 90, 41, -326, -254, 4, -123, -142, -158, 25, -37, -85, 20, -265, -132, -104, -71, 146, 147, -108, 402, -213, -61, -56, 225, -119, -110, -165, -87, -294, -186, -326, -109, 40, 113, 97, -166, 122, -15, 13, 206, -242, -175, 146, 342, 58, -294, -270, 29, 58, -103, 170]
6716A70J60k94k90L54q5o1P5QJ23n9k91L11k84J41K7l5J77j11m9n3j57K34l4J95
6740A72k00J14r3M53k51k82K52l03K7n2K39j57P6J0J29j26K40k56k6J26j77k18
6762c03J76J84l89M31j03l5K77l45j20K69r3k10L23j8k65K38L37o15J73J42N2
6783A06p3j12J70K62j61l53K08j28j23n9M05j56K1k6jQ2R1K48k04j03K8N7l04
6806a25Q8j63M09O4j62j88O7L60l89J23j36J25J14j81j05K27K45p02J17L75m14
6827b51N45k86J02j85R8j10K0j00j36J53J69J60l69M1Q9R8r5N0q7j15M13k39J8
6850a7K35k41J37j67J30l8J30n19K94j1l05JK17j9K0N29l39Qm5j38J58l57M0J55
6874a42L73p80N43J85k67K60j00K7J90j29j88l17K90K35l82K92j15J5P9J48k85
$$ y = [170, 330, 36, -254, 100, 15, -46, 29, 37, 160, 101, -190, 121, -163, -22, 5, -30, 147, 36, -13, -66, -223, 11, -23, 172, -28, 86, -7, 446, 195, -87, 165, -138, -111, -163, 76, -81, -5, 5, 134, 8, 248, -8, -34, 92, -85, -303, -127, 57, -332, 99, -4, -39, 238, -107, -227, 42, -51, -261, 62, 44, -221, 17, 354, -261, -88, 54, 106, 33, -79, 91, 353, 192, -161, 47, -81, -204, -263, 142, -14, 7, -19, -20, 62, 153, 401, 197, 94, 122, 179, -125, -37, -200, 209, 273, 111, -77, -10, 350, -39, 84, -52, 73, 187, 6, -99, 128, 373, -329, -212, 163, -251, 294, 8, 110, -75, 23, -87, -67, -167, -303, -150, 19, 179, -190, -149, -60, 38, -57, -7, -94, -209, 204, -35, -17, 218, -23, 114, -53, 77, 39, 169, -350, -56, -67, -372, -371, -154, -173, -153, 376, 37, 45, 0, -138, 20, -337, -297, -142, 231, -549, -6, 179, -88, 172, 72, 99, 289, 160, -28, -345, -55, 180, -202, 90, -25, -10, 69, 217, -68]
6895f8L09k88j5k57K88k68N48j05j09L02K7o10L29l00K18J12k14J37j5jj55J72
6917C7K62l0m02N7j33L58j48J39l57J96J45Lk50K02J70l00K78n27M8K48L5l08
6939b77R0K85j64l18M34j13K33k33L0k7K84m22J14pO4K84N1j96j10k78J37J42
6961CJ34n6m59N80k73O4n9o8rJ57O3k38L68j60j88J76k51J97J5j35J63r3O11o38
6985i6kK94n04M82j54l39L01P2l69K5K19L0N1O7P1j98L11J31o73M37j9l27MK20
7009C4j44j28M58j55j37J07j83K29k8n8j03K47m13L10K3k86m4M90l3k02j13j37
7031b66J42J69m60L79l4L83n01K45R7m97L11J96k60M2K16k76k81N12k32Q9M08
7052C82l96j02J76K04o33L35K8p9k24M15l50L33r1N4j3O4R2k45j12p3K42m4J37
$$ y = [-68, 241, -47, -62, -319, -31, -299, 249, 144, 35, 337, 364, -246, 83, -217, 1, 113, -101, 36, 21, 20, -135, 37, 299, 269, -133, -76, -209, 149, 1, 140, -217, -21, 124, 127, -123, 79, 249, -51, 227, -300, -252, -4, 31, -277, -187, 98, -66, -384, 50, -63, 170, -63, -33, -60, 224, -198, -84, -91, -27, 257, 308, 112, 2, -276, -139, 3, 137, 81, -378, 202, -71, -7, -66, -134, -143, 14, 77, -161, 207, 47, -141, 35, -216, -19, -4, -139, 24, -69, 542, -96, -98, 196, -308, 174, 20, -319, -18, 54, -315, -290, -71, -41, 10, 77, 148, -50, 261, 392, -281, 156, 137, -190, -186, 34, -110, -238, 220, 65, -72, 35, -148, 81, 53, -5, -108, 139, -274, 36, 59, -227, -271, 219, 186, -16, -129, -266, -124, 45, -415, -36, -70, 313, -188, 57, 154, -343, -32, 164, -96, -54, 162, -114, -395, 117, -115, -26, 382, -14, -116, 60, 264, -369, -34, -6, -85, -309, 106, -244, 89, -2, 52, 39, 103, 195, -50, -162, -235, 7, -37, 100]
7075A00j74J49k71o7J77J44k1l2Jj93L00Q4l40J42J39j45J05P3p2j53N9P2k82
7098b05L87p1oJ13l66Q5P7j32L59l51R8m30N44Kk74L7k3K25K92m24K24k78J75
7121E8J47l72R0M3K15k62NJ05J37k48L25p7l27m7m9M0J99P8j92K36k34P0L92O4
7145C96j66m66O02k25k40J89l02J94O5L18m55N0J25r2J17Rj15j84L00j29p2K28
7167A47m23L49L44n91K78l6j64k25J83J98o8j90K01QK3m4r0oJ79j57J8L13k00
7190D7q2N29o04N4p0K6J02P2j89M8j18P6j21j53K84k01M48m42N80k36j39r9K29
7213D1L29m64L0J5J34j46q5k41N09l36K64j12p9P3oJ67L9j75l15M96k68J15J38
7236A23q3J47J33l98N0N5k48K76M3l75M42k34J31j83J39l32L65j97r7L02k3L36
$$ y = [100, -74, 75, -196, -263, -86, 58, 37, 5, 6, -187, 113, 197, -143, -1, 138, -7, 98, 171, 99, -54, 5, 77, -205, 182, 111, 105, 218, -148, -63, 14, -118, 241, -110, -12, -442, 102, 104, -170, -133, -156, 69, 361, -63, 161, -117, 58, 205, -167, -77, -34, 181, -81, -76, 29, 166, -82, 243, 166, -161, -208, -257, -217, -18, 60, -132, 104, -130, -60, 332, 396, 230, -236, 366, 141, -99, 90, -212, -18, 47, 365, -90, -40, 85, -7, 110, 119, 4, -180, 120, -9, -81, 147, -276, 73, 417, -174, 104, 68, -96, -321, -138, 60, -8, -198, 3, 11, 34, -10, -100, -106, 73, -84, -66, 247, 47, -35, 494, -110, -56, -126, -100, 2, 74, -115, -67, -185, -109, -230, -383, -99, -300, 148, -294, 286, 50, -89, -188, 41, 370, -94, -64, -49, 85, -61, -146, -387, 122, -214, 50, -62, -141, -68, -74, 93, 132, -43, -358, 138, -130, -15, 123, 40, 187, 320, -78, -28, 27, -221, 55, 98, -277, 165, -69, 62, -121, 18, -314, 51, -146, -243, 59, 36, 372]
7258C72n87J22N21m38j18N01j89l07L19m0p1k16K84POM7j36p8J03N3j40K86o23
7281c22L75j56P7L2j23K56m97M23l38K65m4J01J69j66J0j03L10k00j5k12K22o9
7303eK01J62k31k75J23j03J22J40k13j4L14j90l85N19k50O3o4K20l94R7J76k6
7325a3j19QJ3J22O4p4j17K85q7P9j16k69J22o5J09L72k90q8N5J08o6j54K93k42
7349g0K50l04K8K96k98M18r8m31j02K65J17j46q8M01l9M4l75L36q8J93q4j69J1
7372F7p4k5N0K47l10n5M7J0k35K70L1l75M64j91l8J05L38k66k13N0J80lk70M25
7396B29k28J88m43J52J17O8k56j49L96j52l8K01R2l00j58M51k43O3P8j03K34n
7418A94R7m44J15J86n62L23k24K08p6L63k59j15K24k05j4R7J90k84K03j1K95k55
$$ y = [372, -215, -93, 428, -10, -128, 373, 184, -123, 196, 156, 85, -131, 153, 160, 166, 213, 77, -1, 102, 155, 15, 301, -322, 53, -103, -26, 6, -117, 139, -358, 65, -273, -8, -52, 49, 218, 52, 62, -41, 269, 69, 54, -158, 64, -5, 196, 358, 127, -148, -25, -128, -6, 134, -79, -93, 221, 31, -354, 165, -85, -22, -86, 134, -260, -163, 13, -13, -132, -124, -111, 11, 75, 1, -116, 169, 82, 161, 45, -224, -102, -167, -58, 314, 24, -64, -9, 99, 33, -121, 172, -70, 180, -124, -96, 200, -98, 320, 222, -209, -311, -46, 71, -75, -163, 238, 199, 243, -132, 204, 116, 309, 225, 56, 67, -7, -32, 18, 265, -45, -100, -53, -43, -278, -8, 23, -352, 112, -79, -117, -12, 326, 60, -153, -103, 77, 74, -196, 229, 1, 189, -254, -102, 15, 83, -173, -322, 74, -78, -116, 85, 177, -123, -281, 170, -73, -10, 68, -35, 199, 194, 291, -153, -38, 148, -414, -91, -315, -107, -183, 180, -79, -194, 30, -175, -189, -92, 98, -186, 17, 6, 301, 46]
7440D6j22J36m2K01M3j29k55K46k31P1OL42J64q31M91j52j09J03mk65K59J79K0
7463A67j62Kk54L36j75r7R4j93K46J41k05J39k28J42q4Nn8K65p3k29L02q7j14
7486a20K75k39M4J10n5K13j26j80J37k7l8j22K21k36Q1l4K54l14J96K8j11J28
7508H5qj3j13q7O3J77l38K64L1K47m86k3P7J86k0o4n5R7j59J89l39M60l13L15
7532A73j32j68R3J7j53J40J2n9R3J91j09J88k37j54l45K71M02l91K70j80M61n63
7554a80J12J24J3n99P44k77j15L36j64j93J49M01j57L2m65M90K6j92k53J77L22
7575C31J0k66j14j29L14j36k51N42l07L8k33L11l6m44M80j29R8j18J51N1l47L52
7597A68J65l6k75p8p9K88j19J67n52L37j52K16J81r3l31K44k3j06J56J06j85n6
$$ y = [46, -76, 60, 18, 219, 262, 133, -122, 124, -107, -36, -30, 312, 476, -355, 136, -16, -125, -22, -26, -291, -32, 147, 167, 5, 7, -247, 89, -86, -183, -89, -282, -36, 105, -100, 39, -189, -47, -131, -126, -184, 81, 8, -221, 81, -6, -120, 155, -84, -40, 70, 15, 228, 102, -78, 59, 32, -6, -128, 93, -143, -62, -96, 158, -156, 40, 68, -43, 85, 77, 64, -49, -136, -73, 104, -234, 30, 61, 308, -178, -201, -124, 62, 42, -22, -77, 20, -139, 50, -289, 171, -142, 173, 41, -127, -34, -17, -170, -30, -18, -77, 16, 207, 98, 286, 49, -105, -450, -179, 223, -168, 102, -78, 383, -180, -68, 56, 69, -530, 214, -63, -178, 158, -6, -199, -50, 351, 194, 226, -239, 251, 277, 85, -168, 9, 331, 341, 75, -39, -168, 146, 10, -241, 301, -6, 32, -201, 110, 74, -370, 110, -19, 79, -39, 112, 163, -184, 168, 333, 297, 22, -56, -135, 153, 34, 201, -351, -14, -166, 50, 231, 138, -193, 51, 28, -78, 78, 184, -1, -57]
7619e7J56r0j62J61j94k2N18n39L9K35n31K31J16J24N4k41N35k64N1O4m00o4L73
7642I3K32r6n32K69J3k42J94l26M98l85M08J0j93K21N2j45j34nr0K92o6k20PK94
7666A49M6l50K36n3K26k87J42Q3j59K26o96L19M5M7m4j92L03j68L3R3k22K16K10
7689B03l84K10j93L76j53k19l5J61P8l90M71R5j89J99k39J22l8pm6K33n08J53
7711a00J02J26J15m59N68r7j28N9k84K82j26J79k85n4o6j45L81j94J11k30N05
7732B60k41k41J04J79j9J60k79m4L50j39m37K61P9m7P3r6L26k16K54k28M6m29
7754c24O56l96J7J84M4m44M34k85J42j88M4J28o0J2J87k36k10N2K89q5M05k05
7776A61j7k68j85J98L45l61L3K81j84l51M03j42M4J55k62K1K4l7K78k42M72m60
$$ y = [-57, 99, 9, -153, 8, -186, -208, 310, -229, -190, 45, -486, -255, -139, -15, 39, -202, 333, 69, 120, 184, -216, -280, 93, 325, 229, -303, -34, -21, -263, -69, -395, 103, -282, 126, 136, -57, 164, 216, 71, -63, -68, -158, 134, 68, -152, -145, 149, 195, -155, 81, 28, 254, -33, 109, 192, 33, 259, -437, -118, -73, -26, -70, -262, 41, -127, -94, -1, -223, -7, 203, -181, 29, -164, 212, 59, -160, -195, -34, 44, -346, 125, 220, 31, 230, -9, 113, 75, 68, 22, 255, -253, -100, 2, 128, 243, -216, 352, 255, 127, 186, -98, 184, 58, 237, -48, -102, -168, -313, 68, -126, -15, -245, 260, 19, -222, -118, 61, 42, 202, -77, -121, 229, 90, -347, -86, -7, -54, 19, -77, 249, 33, 287, 59, 105, -324, 332, -64, -47, 137, 181, -263, 171, -114, 28, -160, -116, 12, -48, -36, 151, -85, -295, -243, 46, -39, 366, 161, 144, -124, -309, -111, 234, -127, -94, 187, 3, -348, 55, -87, -43, 112, -150, -129, -105, -142, 136, -106, 366, -94]
7798i4L10m69L14K86k75j80J37p9j31J01L14k68K53n56L30J5L45l74P3j83L6q8
7820a83K56K03l67qo2L31l42L15k28J18p4qN9J51j67o2J16J89j45j51k23K41k62
7843c03K84k63K55N6K8k68L17j96N4J86m68J88P5r6K91j13k90J51k32O92k80J85
7865B53m13J80l7M1j15K97j50j96R9q9Q0K01j80M09j78p9j54r0L14p3J11j08k49
7888a26K02k63J24J81k28N1K21j35P8m23P4O3K67n4K17k26m7L80p26M49j40K2
7910c9K84j68m39M92pk6j08J86l0l33J85J30k63J48K9j36L19J11l10r7j12J99
7932A5j37K80j39K83j74m38oM29k27PO1K25j57J74j12j37Q0J44j86l25M70k55
7954a25K73k41k4J13J07J05j80K07j40j68J95r3K1p9k3L39o19L10k9l8k65L02
$$ y = [-94, 216, -253, 61, 347, 72, -108, 29, -50, -181, -80, 234, -34, 219, -337, -7, 8, 353, -21, 52, -131, -95, -183, 73, 276, -91, -99, -161, 170, -172, 143, -85, 33, -41, -49, 10, 161, -6, -68, 48, 237, 92, -59, -282, -41, -303, -19, -282, -27, 29, 57, -211, 106, -90, -36, 150, -318, -130, -55, -151, 140, 27, -263, -112, -344, 348, 68, 253, -160, 20, -17, 24, -91, 206, 56, -140, -41, -130, -50, 151, -29, 380, 202, 123, -31, -121, 193, 120, 231, 123, -126, 76, -187, -63, 118, -110, -59, 162, 27, 105, -318, -244, -181, 86, 32, 249, 23, -24, 356, -370, 79, -61, -39, 245, 77, -362, 130, 123, 97, -11, 175, 145, -188, -3, 127, -136, 12, 41, -95, 224, 335, 25, -72, -184, 15, -122, 158, 19, 302, 128, -310, -316, 113, -114, -107, -46, 179, 22, 196, 84, -53, 27, 171, -15, -340, 130, -125, 148, -93, -117, -4, 103, 208, 28, 235, 95, -73, 122, 29, 50, -29, -52, 287, -332, -22, -51, -89, -354, -52]
7976e2o7J70l12N2N9M4N8K54J65r8m01K17j62J80J62k64j59P8N0k5j25J05j77
7999b48j17L42p9l4K57Q3l22K61q4j14R1J41k72J92J03q8K9l02o7J30j82R2J43
8022d5OJ28o5j90J72q1N7L5K47j3l13k28L05ro9K81k76R1j0o9L83m31j58J37O7
8047d8k8j6K29j18J04k20k2L3J20m9J36K7l50Q9L82l66J60j27J3K63p59M78J40
8070G1o7j56M1Q1j0m7K03k0j84r8K94K7M4k13n8o2J54j85k6P8k16K20m90P85l4
8095A32Jm0j14j89L22n1q1k14J76J11P2J50m21j91L64j5M7jk30L63mk18O6K2K0
8120G7k12L51m42M03L21m97Rj08j82J31Q0O49m93q0QO01m20l7k59j30J31J4J31
8143D6n1l21L92K61k92p1q3K24k19j24M39K48m46M5K11r5j74mj49M53k18oR4k59
$$ y = [-52, -119, 51, -261, -209, -150, -106, -48, 206, 371, 273, -128, 89, -73, 107, 269, 5, -154, -76, -26, -51, -176, -71, -248, -365, -23, -102, -136, 121, 204, -118, 143, 59, -55, 36, 177, -95, 97, 200, 112, 141, -161, -228, -98, -280, -188, -45, -39, 89, 24, -166, 6, -75, -18, 17, 264, 251, -62, -290, 15, 6, -63, 218, -58, 33, 23, -46, 337, -94, -252, -115, -48, -76, -92, 137, 19, 123, -97, -119, -86, 34, -15, 121, 148, -202, -113, 269, -97, 63, -64, -51, 212, -547, -69, 71, 4, -152, -111, -30, -40, -87, 116, 96, -88, -186, 108, 135, 179, -34, -92, -154, 0, -185, -211, -133, -349, -129, -619, 166, 132, 133, 93, -21, -210, 112, 61, -20, -234, -58, 53, 125, 275, -146, -337, 27, 12, 59, 58, -172, 191, 187, -31, 35, 57, 77, -135, 216, -226, 177, 498, 1, 10, -98, -280, -149, -69, 580, 87, 7, 15, 616, 196, 159, -100, -230, -99, -85, 46, -5, -326, 66, 327, 35, -36, -119, 105, -114, -238, 201, 449, 3, 48, 259, 164, -10, -14, -163, 290, 72, 66, 160, -99]
8167i9k40L75n0J54l55J36L5l07M12k88M18k74j01K06J45j94j54J61K74p0l21
8188a37Q9K60k59
$$ y = [-99, -339, 36, -14, 140, -215, -79, -44, -351, 61, -227, 191, -83, -184, 22, 167, -27, -181, -20, 254, 184, -137, -48, 212, -47]
8191d7
$$ Imaginary data points
##PAGE= N=2
##DATA TABLE= (X++(I..I)), XYDATA
0@%%%%Qj0J0j6J6k4L2m0M9n7P2q8J05j28J52j78K10k43K83l29L78m31M90n59O36
29C38p18Q07r07J020j143J274j420J582j757J950k160K392k649K932l248L600
45A893l990M428m930N507o175O955p888R029j0459J2308j4802J8376k3947L3873
59B0178n6735J94900M6407m63003J98451K54250j92926j51006J99729L5757j23057
70c7055k2907O2768K4935J5282o3675l4238Q2870L4639j03856p680J06008j1875
82D5216j26601M0191J32108o9478j21778J07206Q3591j19669l4730J09379n711
93C9724p1524J4735K2683L159J4495n2383j8836J03978j2051j26067O3473J07355
105H8741r5613n8550R5009P341o7849J8760K5004k0485J4475j201l5303L2679
$$ y = [0, 0, 0, 0, 0, 8, -2, 8, -8, 8, -16, 16, -24, 25, -32, 40, -48, 57, -71, 81, -97, 113, -130, 153, -176, 202, -229, 261, -298, 338, -380, 427, -480, 540, -603, 671, -749, 833, -924, 1026, -1134, 1258, -1391, 1541, -1707, 1893, -2097, 2331, -2599, 2908, -3267, 3688, -4200, 4829, -5630, 6678, -8124, 10252, -13695, 20178, -36557, 158343, 204750, -258253, -59802, 194448, 1522, -149484, 50245, 86002, -37055, -59962, 2806, 27741, 43023, -20652, -54890, 27980, 62619, -41237, -48917, 57091, 45216, -81385, -41194, 90914, 21436, -100342, 6864, 90455, -29214, -63944, 45435, 39724, -31800, -17065, 5618, 8777, 23272, -29111, -47947, 56031, 43980, -82087, -18614, 88741, -6872, -65422, 29587, 36928, -30921, -12161, 12843, -7642, 6833, 5632, -29671, 3008]
117C008L5744m9015j9648N1929J54m7255J2196M2619k9728l6785M7359J8787n7933
130b8568J5686N3797m9421k6757O9615j4808o4970N7670K7322q8140K8437Q5757
142F5620q0892m9530J07599L630r9349L4750P2224n1365m2703M6141J7731l0765
154f909o482J0132M990N900n469j2212O912J7714p963k2262J4451K2330k8413
167g281j4953L5599k410l0074J9441J3220k7675J2221K4128k9631o881L2575j7013
180A266j9294L1388o479l0953K7817J4131l4021R015K8059k2987j3085K5657p4
193A0440j8701N136O335p403K586O034o717n656J0396Q530j3543o776J8569k93
207H937k0440Q076J3317j3730j125Q190j1347Q133J8096k7378j0204M2429o179
$$ y = [3008, 38752, -10263, -29911, 22018, 22172, -25083, -12887, 29732, 4, -36781, 10578, 29365, -28568, -12882, 40915, -8506, -35263, 34352, 19544, -45426, 12244, 39566, -48574, -20137, 65620, -15272, -64802, 42797, 46427, -52922, -18172, 54052, 2687, -40016, 6125, 23856, -6909, -13391, -3259, 1731, 7631, 2162, -10050, -3138, 14576, 6613, -15649, -1198, 21132, -7281, -22234, 13365, 10955, -19119, 322, 13542, -14133, -1912, 22216, -7415, -14296, 18279, 1266, -18028, 13360, 6881, -24072, 3745, 17876, -16145, -7130, 20929, -2058, -15143, 10514, 10440, -8261, -3125, 3210, -4193, -1607, 4427, -2290, -7946, 2450, 10980, -2563, -9339, 9230, 8937, -11503, -3427, 9890, -3840, -4965, 3225, -8122, 11, 18107, -9271, -19475, 22954, 16775]
220A6775m5263K4657L4034l8521j8035L9270K301l0683O290K0937o343j1507L529
233b559R151j376j0230j41J0064l83j1468n82J1306M474j2891n895J8390N520
247A3380k3318L83K4853q699k2601J3402J3841j3906m395P227m94M719o43j1900
261h151Q908J3371j7939r744K2657J038k4012N971J9625r923j2460J1325Q057
274H723q885n087P855M912r810l555P624P34n196q45K504L609p29n312K815Q348
290G705n582j0264R728O835j3689j837J2248n127o237Q326J248o627M812K621
304D160n790P59N249n216m474O934Q29p106K700M786k953k089M206J674l928o52
320i11L866k178k768K182q86j391J952J4r67K310N89k863R78M313m235m107O038
$$ y = [16775, -28488, -3831, 30203, -8318, -26353, 12917, 15218, -15465, -9175, 11762, 5419, -6088, -2559, 6592, 5216, -5014, -5155, 4909, 4526, -6942, -7524, 3782, 8256, -4635, -10530, 7860, 13380, -9938, -9555, 15298, 6599, -16002, -2600, 11241, -2665, -7060, 167, -327, 4392, 3749, -8151, 757, 14128, -3811, -13555, 9102, 10140, -13872, -7901, 11724, 1801, -10659, 666, 8723, -162, -5249, 2606, 7518, -2292, -5847, 1777, 2511, -2685, -3530, -1026, 2583, 1854, -3458, -643, 7705, 2123, -8141, 1587, 8422, -5267, -7104, 5144, 17, -6220, 2106, 3354, -3273, 1539, 4160, -1630, -871, 4378, -838, -5312, 1622, 2451, -4655, -1955, 2831, -122, -2211, 1995, 3669, -259, -911, 2955, 777, -1991, 191, -695, -2086, -134, -120, -1087, 1223, 1812, -1051, -73, 4240, 5, -4102, 1936]
337A936l15o303L705L529m679k72M660p1l646K190K602m353j49L518l476k036
353c160L462l31j996J433K179j430j239L293k07l338K008K32k521Q05Q02j174
369a182r1J282K62m17J695K37k860J797J855l867k58K916k354k022K375K255j999
386c76j553M054j6l375K495J009l608P48R17j292nO95j90n24J438J658k354O36
404C57J568k233J30Q00j340m93J92M79J45n34J539j33o80J967r19r15J112j042
422@r74N65j85J7j015J489J853k497O38K263j540j114J580l79j392p93J223O5
440a96j650J822P26j047R53L61l47M51r69p98O32L85j694m38J919J06j927J946
458B35J950k286N66J99q4k64j217J34L16o83l6Q48J11N73j87J9P92J73m66j704
$$ y = [1936, 1621, -4682, -977, 2552, -2127, -2399, 2261, 2190, -1456, 734, 3336, -1017, -1166, 2352, -1124, -3160, 302, -29, -2025, -592, 1587, 157, -1082, 2211, 2004, -1334, 674, 906, -1615, -810, -8, -1182, -1273, 9, 271, -146, 1549, 1786, -1074, 723, 2578, -1289, -1547, 1369, -985, -3007, -632, 1623, -376, -1929, 2125, 2109, -1266, 1229, 2238, -1370, -622, 295, -997, -1002, -307, -497, -1021, 417, 2075, -279, 357, 1925, -308, -178, 622, -718, -1211, -1019, -540, -395, -929, 610, 477, -203, 1764, 845, -70, 1042, 0, -974, -409, -594, -577, -1592, -103, 1750, -747, -109, 2154, 614, -500, 1080, 701, -691, -1484, -261, -196, -1846, -24, 702, -345, 608, 969, 622, 1073, 104, -694, -62, 323, -1371, -1809, 110, 216, -1711, 235, 2185, -101, 465, 664, 580, 316, -901, -767, -451, -1134, -1170, -322, -211, 362, 175, 194, 986, 1159, 693, -1011]
478a011O41J213j782o95J955q67l17J298n54P73P70j161l14Q26P5k314M33J529
496D98k345O05K249p87J37J34n22J544k78k221L60K171k458r88K076K08j513j36
514a266J447J697m55k658Q69L284k721l675L923J227l856N86J685L90K22r90o50
531i41L224lm209J011L705l678k276L989k91k551J409J845n23k7j043J027J506
548B174l719k28M372k250m253L831K671m210P21K006q96J031N43l802J870K984
564B845m485j305L953o82j810J066m33J831J642l654k20M688k528l429L305m27
580C57k661L208r57l200M531J277n256K523L798l747j382L003j986l91J163j681
596a401N94J325k440L046J714n280J751O029n336m462O685L21o038J692K459j416
$$ y = [-1011, -370, 843, -939, -1634, 321, -546, -863, 435, -119, 654, 1424, 263, -51, 775, 850, -1464, -1031, 498, -1847, -1242, 1007, 220, 357, 491, -31, 1513, 1235, -986, -626, 1545, -913, -1901, 175, 383, -1130, -1266, 181, 1878, 1423, -1235, -366, 2918, 197, -3478, 445, 1672, -2184, -1598, 87, 477, 699, -291, -941, 2283, 2280, -1929, -918, 2787, -891, -3167, 822, 531, -2020, -611, 1234, 711, 684, -359, 668, 2174, -1545, -1773, 2599, 349, -3904, -73, 2598, -1612, -891, 1115, 219, 1250, 1793, -2009, -139, 2845, -1640, -2945, 1008, 326, -1484, -418, -851, 980, 2622, -1032, -1252, 3436, 908, -2521, 784, 357, -2304, 904, -53, -3253, 1278, 2555, -2701, -178, 3620, -127, -1509, 1494, -492, -883, 280, -1401, -807, 518, -1922, 1124, 2838, -2442, -691, 5338, 2, -4460, 2225, 2546, -3492, -1800, 659, -757]
612g57K346j885l359O764J490q484J468O918l491l929J334J659J100j328l476
627c630M025L666o345O96O153m788l012O567k788n334O338O72o221L289K471k292
643e33J377m36k080L425J227n572Q50M024l157o4Q52k645M225K045p696K569P863
660F274o052m917O727j9m047K354r21j982M532K46o003L632L481l120n54p5k14
677f58L788l328n375P445J825p951J825O546m487j222M855l894j573N676k374
692A098m689L829K78k064K555k255j152N623j523m865L655K544k874p79j008O31
708i96M356l596o399P591N642j0097j181R551k925l929K862r26l33K157l600q48
724b671M599j408k493K444j74j129L755k393m025N310Q93n874K913J310l415L540
$$ y = [-757, 1589, -296, -3655, 3109, 4599, -3885, -2417, 4501, 1010, -2919, -1585, 74, 1174, -154, -3630, 395, 4061, -2284, -1588, 4565, -223, -3235, 3332, 544, -4790, 1548, 2220, -4001, -712, 1759, -533, 844, 408, -1672, 1753, 2980, -2592, -1742, 2282, -875, -939, -87, -2732, 1493, 3538, -4158, -1589, 6274, 222, -4695, 2032, 2013, -2034, 320, -601, -2583, 1949, 2195, -3808, -176, 3305, 185, -369, -444, -658, 3130, -198, -5573, 1872, 3697, -4254, -2429, 4117, -370, -1592, 3263, -631, -2204, 3472, 1098, -3591, 238, 516, -1548, 1007, -1248, -2400, 3223, 1700, -3165, 490, 3034, 160, -619, -1627, -996, 3360, -236, -6635, 956, 6598, -3499, -4680, 4871, 1946, -1983, 879, -47, -380, 1777, -1823, -2671, 1928, 520, -1973, 471, 297, -832, 2923, 530, -3495, 1815, 2708, -3166, -253, 1057, -2358, 1182]
740A182O18o172M252N365o453k022N618m04l238L70l06J634J932m955n20O877
756C778k760l619M310j175k093M653k891m775O451J312o884J682M503k674q78
771a060J737j659K150J626n064N64M834l558j689K581j830P96L020m004q05N502
787C141j671l899L498j25k615K958j105m391M970K515o686J739M876k727j156
802f78R93r55J929M92m595J109M476l257k196L734m13j235K300k042j374M949
818C237j939m826M296J326l945J735j57j556K951N87l446J391K607k477j97J124
834G11j796J286J051m143J419N225m193k288M281K61k411J461q73q75K299p75
850F40l061J953J456j854P26L70j245K392o3l182J882K258l058p20K616j208n28
$$ y = [1182, 1800, -4372, -120, 5245, -1208, -3230, 2388, 1984, -1254, -884, -1190, 444, 2376, -2579, -3099, 3778, 1018, -2601, 1709, 534, -1559, 3094, 203, -4572, 1879, 3191, -3693, -2011, 2492, -182, -1060, 677, -982, 1168, 2794, -2270, -1706, 3128, -430, -2119, 462, -1368, -572, 2448, -1556, -2361, 3141, 1470, -2429, 1069, 944, -1671, 1287, 182, -4209, 761, 3276, -3410, -1671, 3205, 478, -678, 315, -640, 1289, 1781, -2814, -1705, 2771, -486, -2682, 1052, 639, -596, 1704, -338, -1712, 3237, 1298, -3528, 768, 2094, -1851, -116, -273, -1829, 1122, 1709, -1737, -346, 2261, -216, -413, 711, -1085, 201, 1252, -2891, -1472, 3753, -440, -2728, 1553, 1814, -597, 864, -9, -884, 1415, 640, -2421, -468, 988, -866, -140, 230, -1015, 1377, 1314, -1868, 14, 2272, -786, -1506, 1110, -98, -626]
867f26Q59j559J479K011k215j304L005m76k462J543l01r78J624n67k020K216P57
884I86j514N81P66r22P70K38k262J288J738k576m72J973n58l59Q07j279N50K098
902A853j946j195K440p41j788J234J05o62R63o34l80J995J10j895M78J124j289
919b28N06kj458P04R96j523J28J648n45m59P47o51j06J009r66o26J205m20j310
938a351J496j92l06J126l71q69J304J93k101Q48R55j105j11L27m67Q54K56j174
956f88Q73P68q09k16J074j124k36N67m70j72K55k9l60O16K89n91J196m62p95J006
976F92k6j587K82R53o31O6p1J37O36j05k21J37O45p57l96K86J10r68P80l34j47
997e19R28m44L4L65N7j16L18n62m76J90J97l93j08O42n14L08J65o3J78L29o78
$$ y = [-626, 233, -1326, 153, 2164, -51, -1355, 1650, 1174, -1288, 255, -46, -1024, 600, 33, -1987, 229, 986, -528, 53, 819, -103, 667, 905, -1357, -69, 1669, -907, -1379, 594, 36, -323, 484, -795, -245, 1853, -93, -1288, 1152, 411, -1377, -143, -38, -700, 263, -371, -751, 1244, 1354, -541, -63, 1061, -228, 278, 276, -1182, -478, 518, -1005, -877, 771, 226, -233, 514, -137, -243, 766, -200, -826, 379, -41, -1351, 145, -47, -353, 773, 402, -467, 837, 1030, -1071, -223, 732, -373, -484, -157, -624, 230, 486, -688, 185, 953, 144, -72, 1002, -122, -358, 209, -261, -433, -178, -207, -567, 49, 338, -253, 943, 481, -314, 692, 666, -921, -639, 314, -317, -251, -322, -185, 451, 346, 125, 262, 907, 150, -246, 40, 150, -818, -38, -372, -519, 409, -35, -1, 364, 421, 305, 623, 61, -415, -225, -28, -421, -529, 113, -401, -93, 72, 9, 187, 516, -162]
1018a62L03K48o83k91L15K07l99K39L96Q4K68j19q7Q8m31l82O05l41l47N30j74
1039a33K43k83L53P3L5q3K3l0n54N26o25K27Rj82M10j79L68L00j49k03P9j88J9
1062E6m21L34j32j36OL4J30L8L02RL55l76k23K21m72L34k70K8K66l29N9K70K03
1085B86k0jJ19j31K4l52L60n22L66l17l80P91k0k81O27p03L45L77m44J45k69l52
1107c52J77k5O7MM8K79J39k89J59K9j25j72n29J78J68j75N15j61j6L02o0J29P8
1130C68m42J65k4q2l48m6L36k77J43J99Q9L44j90l5m2M84o58K09n19K98k38n34
1152h00Q48J47q7J03L12k32J05q8k42j26J45n95J77K01k2J04J12L12j26j96o7
1173a5lK97l21m19P76n08m68N72M9j28L46j9j28L70j55m14L80l21o04K00L88q4
$$ y = [-162, 141, 389, -294, -585, -270, -63, -462, -223, 173, 257, 525, 406, 319, 407, -24, -406, 199, -142, -489, 41, -133, 110, -173, 180, 253, 288, 205, 228, 198, -356, 170, -455, -228, -219, -401, 9, -170, 198, 498, 349, 146, 225, 37, 56, -365, -31, -163, -299, -293, -259, -129, -91, 211, 220, 575, 199, -24, 197, -275, 59, -211, -183, 83, -246, -187, 83, 286, 266, 265, 384, 253, 277, -75, 285, -237, 129, -188, -568, 223, 203, -78, 549, -154, 191, 568, 124, 269, 0, -352, -175, -200, -133, -129, -81, 198, 337, 48, 207, 236, 111, -61, -590, -412, -244, -419, 96, -65, -81, 221, 161, 290, 368, -74, 91, 67, -15, -363, -409, -73, -350, -207, -8, 81, 425, 235, 200, 158, 642, -16, 193, -326, -28, -266, -800, 48, 195, 108, 211, 523, 291, 396, 308, 66, -60, 85, -510, -333, -132, -154, -50, 62, 374, 248, 52, -15, -18, 279, -42, -461, 315, -193, -661, -89, -40, -168, 178, 159, 31, 401, 246, -168, 212, -109, -713, -513, -125, -209]
1195b09m55Q09J5l69M61m09L92L93p24l91M66J78p01K99L16q6R0l70J57P36k90
1216C08n13O09j22o39O1L04j30K12R8n76L38O17n96J56P1K41o35K78l19o78J129
1237B14J5o37J90M44N9J76n10j13M78k63k23r2Q7KJ1J56l34P19L43j147N69R22
1259A066j040n30P48k04m26M05l17pO71R3n20Q52m75n38K94K1k30K51j44n16K27
1280c19Q28q37K59L90k46K92M17j115Q0R16p74o83N13M15k65kk79K96J004o82
1300B08l46N66J0r84L74L53q36M92N05j416J483N40j111j69J332p04k30L99m66
1319@p05N39k64l70J241l48l25P18m43J62P16r28q45J528j89j274P40J46m25O22
1339B96O7r95Q34J134j423m56J317j35j204N10p03M84R50r55l67R63L70j136O43
$$ y = [-209, -664, 145, 160, -209, 252, -157, 235, 628, -96, -487, -21, 157, -544, -245, 71, -15, 75, -295, -138, 598, 308, -205, 404, 282, -357, -296, 8, -122, 90, 188, -388, -50, 567, -29, 127, 198, 439, -196, 82, -237, -915, 214, 229, -408, -218, 226, 285, 461, -49, -162, 316, 53, -170, -262, -175, -173, -162, -6, -340, 379, 722, -425, 144, 1066, 26, -504, 244, 40, -386, 19, -298, -305, 366, 459, -61, 791, 316, -222, 72, 93, -137, 114, -30, -546, -319, 509, -328, -69, 321, 75, 367, 784, -331, -251, 665, -109, -792, -279, 136, -129, -131, -410, -114, 890, 208, -138, 428, 438, -546, -172, 181, -655, -163, 342, -1074, 409, 949, -162, -331, 1001, 297, 67, 466, 0, -705, -166, -430, -800, 441, 93, -232, 486, 43, 205, 921, -7, -852, 676, 487, -787, -47, 99, -326, 296, 363, -632, 202, 1336, -87, -543, 774, 639, -565, -55, -758, -274, 676, -279, -646, 317, 687, -449, 194]
1358A94J4k17R7l86o24J262K63j799R42Q50n41J46O3l46M41L07j049K5Q26q57
1378c89r1O36r27O56P79q23n29J520p4j714O61O17p21P1M22p76J032M28j758R06
1398g4P45m75k67P4j85M99l27p24qJ339p98l31R04m49o5J163j210k65J432p50
1418B28r21N32N95q58K04L41l60P33J49j130M04R40j037j58M00l31j41P24p14
1437d00K13Q74m11o73Q92j11j58J52p41j89J022l29j125J123N87r16K02k9j32
1456a49R36j41j810R73P85r06k80P96n52K37L15l00k16J136o28r42J050k33l43
1475b72rq7l14J083n66n98Q33L55o44K49J20j47J13K62j185O88P04j036P9R31
1495E59n99j54M07r2j49O59n93p10R35J27n33N9Ok15P10k91m28M69Q58j146r3
$$ y = [194, 208, -9, 88, -298, -922, 340, 603, -1196, -254, 596, 55, 201, 264, -82, 359, 666, -383, -358, 468, -389, -480, 156, -771, -115, 664, -159, -688, 832, 758, -956, -295, 322, -399, -328, 94, -682, 350, 778, -980, -74, 671, 196, -71, 3, -182, 317, -10, -734, -742, 597, -201, -532, 372, -77, -142, 1021, -189, -454, 978, 228, -693, -161, 434, -424, -220, 121, -239, 494, 643, -487, -83, 857, -180, -338, 62, -269, -410, 314, -400, -187, 687, 276, -397, 495, 384, 226, 378, -363, -552, 470, 141, -984, 139, 726, -190, 12, -17, -149, 787, 646, -1164, -191, 594, -312, -592, 204, -348, -111, 204, -96, -312, 824, 196, -746, 304, 71, -272, -281, -368, -682, 401, -165, -763, 70, 425, -219, 30, 150, 3, 116, 378, -807, -119, 585, -451, -372, 559, -40, -194, 213, 121, -28, 631, 38, -672, 263, 390, -143, -84, -78, -293, 417, 126, -302, 167, 1025, -121, -214]
1516b14K63j86M1j20l04M70L61r35N08Q23l67l90M36l46J7K84n07o07J106n42
1536b09n38R35P4l94Q66n35n99O88J69m95l41O33l73L4J17l4j5P91q21K0P11m49
1558B35m39J21J21j78N47o02j74N79l34j4J76K83l95M26j85o89P48J93p23O1N39
1579B96n64j42R34m06j97O01n89J22K98m93l08P71m63j78P17m63j94O41l1n78
1599b26M71p2L2l91L60l82J86J35l12j00M99kj00j70O0k66M68j57o22N81m48M66
1621A0n41M96j51M61k08k89N37Q9o64K30L18m50k36M28Q5J7k55j34L00O28n40
1642A31j43K15l64j91L17N2j38J13j73m4N95j54r1N69n12j81K87m74l46P24q7
1663A05k47k07M11J82l0o4L71l38M5k80P6j98o5J91M3m5L22l14L2j14L12J90m05
$$ y = [-214, 49, -137, -96, -216, -520, -50, 311, -624, -116, 707, 340, -50, 386, 40, 57, 341, -166, -773, 333, -209, -747, 188, 262, -132, 734, 199, -400, 288, 457, -38, -379, 254, -119, -85, 32, -2, -17, 774, -47, -27, 684, 235, -204, -83, 38, -140, 407, -195, -369, 210, -124, -138, 38, 321, -74, 352, 167, -522, 226, 419, -304, -243, 296, -268, -410, 524, 118, -79, 522, -67, 55, 353, -140, -448, 323, -140, -318, 399, -64, -258, 383, 352, -226, 245, 173, 205, -186, 174, -208, -22, 113, -199, -299, 200, 198, 98, -72, -12, -278, 190, 33, -589, -8, -456, 10, -531, -35, -186, 275, 67, -222, 315, 404, -260, -30, 288, -162, -398, 30, 115, 132, -123, -257, 43, 671, 131, -12, 203, -161, -352, -35, 17, -121, -8, -181, -225, 370, 216, 125, 694, 182, 1, 288, -186, -532, 192, 105, -142, -349, 62, 244, 214, 150, 521, 183, 228, -52, 24, -174, -239, -48, -5, -50, 272, -42, -10, -124, 188, 378, -27]
1686b7l33m0K70r1L68m09J39J45Q0N1M2k9j26J50j29r4%P5k18j67N07k96J09k4
1710d7L30J19j95j99K04l6j75k59j62L24k81K34p6R4M23k02K33k4m48L44l97J95
1732aN2o2mk35M22n96J61K27J21P1l54L00l50j5OK2k6L71l74J73L39l86M08k7
1756B43n2J77n42L8q6K63j69l1lJ71n7M00k39R1K38n44M6M8j28K2K91j46m64L39
1780i4N0K29k17l7J89j91J0r4K6Q8J27k52L69m01L32q0J66j33l0l18N09n7l78
1803a87J46J93j92k16L67q7j9j02L3L01k39J94j40j13j53N1R2j55O30o90N73l08
1825b1L29j54K13n26J89r4k0r3J68K3q1J69j42oL60k11m3L42p6l15K0j52o9j80
1849c70K36o7Q2J02K71j72J04k76O01l08n48j2M05n71M15L51n05J67N55m94J88
$$ y = [-27, -360, -400, -130, -221, 147, -262, -123, 22, 102, 153, 195, 166, 40, 190, 61, -33, -33, 42, -176, -343, 164, -132, -23, -47, 283, 402, 207, 8, 212, 176, 1, -258, -420, -96, -377, -143, -219, -125, 298, 96, 329, 305, -143, 201, -196, -1, 51, -11, -15, -250, 172, -424, -263, -36, 85, 156, -198, 102, -248, -263, -257, -235, -261, 110, -264, -91, 248, -138, 270, 243, 191, 368, -174, -136, -222, 41, -128, -159, -162, 9, -48, 352, 113, 204, 442, -102, -56, -8, -136, -114, 177, 31, -433, -94, -44, 185, -32, -69, 120, -71, -61, -155, -129, -41, 86, -166, 203, -198, 134, 54, 220, 87, 57, -261, 248, 191, -187, -41, 152, -40, -256, 111, 24, 5, -97, -64, 237, -2, 192, 52, -61, -214, -163, -71, -226, 404, -286, 287, -21, 308, 154, 367, -159, 30, -64, -84, -177, -9, 14, -67, 102, -40, -46, 314, 103, 60, 402, 326, 11, 31, -121, -190, -370, -134, -201, -119, -17, 254, 82, 186, -90, 511, 203, -345, -357, 48, -523, -108, 243, -262, -95, 460, -34, 154]
1870A54K24m00J18Kk89Q6J21k17K63J9r7L5O1j56P4r5K56k96K34k70J78j99O7
1893a27L05p7pk19L45J47n70j2J98j83K7L71n46J57L41l53J44L88k15n6K14m97
1915b25k1R9K34l15Q8J30k27M84l3k69K89j94J82J68k05n58K70J24m26Q5K26K54
1937A60r3L36k20k59M50m6n61J22K65p23N27J61k41L54k05O5r2L33j59R1o4j85
1959A6J27p2j77n29R86l17k28L58P2p5K34n35q3O29n95j28M21j42p3J93j9J04
1981A67M7J6o63O56Q3m46j87K82j09j5K90l77MM77l56j0M75j80l33K56k92J83
2003c2M93q67q7M43O4J03O9k2K7p9k42k95L05J73m11J99L56l85N0K47k28K63M93
2026F37p58j78L79J39p71N86j16n6N63m59l02Q76k36l42j75N81n66L42op98O97
$$ y = [154, 378, -22, 96, 98, -191, -105, 16, -201, 62, 81, -16, 19, 80, -76, -2, -97, 159, -137, 97, -173, 5, -194, -127, 178, 101, 94, -125, 220, 367, -203, -215, -17, -200, -173, 198, -348, -191, 150, -203, -59, 329, 114, 58, 272, -225, -246, -147, 87, -228, -140, -10, -237, 247, 214, -55, 234, 40, 222, 390, 185, -373, -103, 21, -405, -320, -94, 160, 67, 403, 183, -76, 374, 328, -233, -111, 154, -569, -42, 119, -122, 232, 27, 92, 0, 333, 174, 265, 201, 16, 143, 71, -106, -635, 351, 34, -194, 164, 236, 161, 395, -140, -223, 406, -189, -317, 104, -38, -111, 82, 63, 167, 214, 230, -433, 223, 306, -140, -327, -45, -154, -169, 121, -256, -252, 225, -131, -141, 334, 154, -179, 77, -215, -32, 461, -406, -493, -50, 14, 117, 186, 164, 191, 112, -130, -425, -120, 53, -358, -159, 197, -188, -138, 109, -119, 144, 637, -121, -299, 80, 219, -552, 34, -82, -138, 425, -34, -336, 540, 304, -38, -213, 368, -198, 144, 138, -660, 37]
2047C7L49r56L15P80m81k43L01J76j80Q1m10k11O50l98q8J93j45N5N04l25o37
2068f33J220j65q86M54L53k53k89J4m46Q30j43k57j31R76n41M6L24r10K33L05
2088A01n41k97J233n85m09O92K0p8M95j99o67O10l13p64Q77K16n78J38K67o19
2108d01M96L92p06O5Q50q05k09M45m57L63L10n56l88J421q09o36P40O71r06L99
2128B79k54m18O34k69n11M16L88l81J26J85l63O42l9r86M00Q27p31j57O22m61
2148e1k34O00m66l9P53n05q1Q2n3j21J85k86j12L63L47j104Q30K44n66L02J29
2169B17j62o0K89q72J87P19k64m58L80J70k10M38k97l00N58l48l82L24N15q66
2189d22M88r1j40M31q1l99L83L20o77J14J55mk4J58o26L78N48p64q3Q19j79k42
$$ y = [37, 386, -570, -255, 525, 44, -199, 102, 278, 98, 179, -231, -442, 208, -190, -278, -85, -230, -175, 329, 4, -633, 587, 422, -464, -10, 343, 90, -199, -185, -631, 199, 56, -201, -332, 644, 103, 149, 473, -437, -204, 101, -440, -737, 496, -89, -498, 194, 214, 136, 631, 432, -235, 375, 62, -702, 175, 391, -187, -49, 218, -401, 95, 487, -219, -154, 696, -109, -318, 127, -330, 33, 343, -213, -601, 820, 11, -625, 115, 786, -120, 279, 25, -393, 241, -28, -539, -123, 265, -116, 10, 195, -168, 474, 435, -551, -151, 676, -55, -212, 410, -51, -285, 315, -151, -190, 563, 58, -23, 59, 6, -115, 70, -216, -328, 35, 382, -722, 108, 352, -214, 88, 217, 55, -5, 284, -588, -401, 318, 54, -404, -24, 146, -64, 374, 77, -223, 335, -13, -395, -71, 444, -422, 66, -25, -165, 266, 185, -214, 169, 489, -188, -74, 81, 77, 53, 211, -415, -37, 511, -253, -336, 483, 304, 62]
2211F2J43l12R3K44m96l08O70L35o40L22P7l04L85j99j5M3j5m45K78L42m72rR7
2234a24J5n9K37o3mJ41k5n61N17j47k6K45l84j48M38N10o85M3L84j78k68J91j03
2257e4k5O09j093N2Q08l63m1j23K2M31p1l58%M70j80o49M96J61j29J11k88K20
2279FM42k83m53O29J23o55K67k82kK58K02n92K32J68%k14N99m34k15J94k03N9
2301a54P80p16n34R48q9n10M85j36Q4J90k71k73K84L9k53PN9j78J26K64k62P8
2323c2K93j11m39J39J46j42R6j75J63R8j68R3J26K53m15P7J36k52K46j65k76L46
2345C7n4Q6J13j01k02K99k5r3J04l36K10n3j20J7l10L69j27M60J03n20L12J29
2367B98j68p0K57l07j88J2NK24k36J05J22l6K28j25j19l7l7j17M00j92k53L72
$$ y = [62, 205, -107, -14, 230, -266, -574, 96, 431, -209, 113, 190, -114, 271, 72, 57, 100, 85, -360, -82, 260, -212, -221, -124, -109, -168, 69, 6, 2, 143, 118, -443, 74, -73, -99, 146, -238, -386, 52, 562, -123, -80, 304, 126, -142, 49, -54, -79, 530, -563, -511, 297, -66, -107, -230, -208, 223, 152, -206, -206, 264, 84, -565, -69, 92, -37, 74, -214, 6, 448, 165, -288, 341, 464, -191, 76, -206, -208, 50, 252, -340, -108, 60, 60, -154, 445, 11, -204, -10, -213, -154, 626, -90, -624, 324, 235, -275, 210, 74, 158, 348, 77, -196, 88, 127, -126, -119, -60, -238, -112, 152, -110, -32, 261, 150, -289, -150, -4, -146, -50, -225, -62, 36, -132, -39, 87, 340, -75, 2, 138, -114, 132, -33, -309, 37, -17, 69, 182, 81, -121, 178, 153, 60, 164, -172, 38, -15, -135, -118, -428, -59, -186, 274, 377, -143, 169, 298, 130, 60, 317, 10, -178, -166, -161, 63, -173, -68, 54, 18, 246, 121, 2, -35, -72, -189, 211, 19, -234, 138]
2389A38k85J12L69l04K05l3k10J89l2p9j97o1r2K26j9J01j45K54k85M1L35J34
2411C62l77k72N44m15L58j8n96M68k8P1l35M41J91j90R0j78Qk10k20R9J51K05
2433A49k04L08l79J41Q2j99K83j26N8k09K60l28L46j64j27J08k14L99r6j23J8
2454a7P7Q9j56J24n17J59L71j24K10k6M8j71k21M6K78L4k48L4j48qL32j72k32
2477b38J74O2Lk00j2K88J44k01k93K22j26L96l95J90j75J91J08n9N2j03n4p2O1
2500c7J82j79k32L69k04j4Q9J89J70o8j00J41n72N76l61J19k06l39O96k62J8l9
2522f4J15j19J31r4j87L67o8j39R3k5l43J26J02J46j11Q2r5j2M0J70j22L85n50
2545a72N9K07J05n34K25L82k73K67r9j98j45K68j10P5l31K88k09J44k58K49j9
$$ y = [138, -147, -35, 334, 30, 235, 202, -8, 181, 149, 70, -127, -188, -280, -54, -73, 28, -117, 137, -148, -107, 228, 362, -15, -287, 257, -158, 200, 182, -414, 54, 26, 97, -238, 203, 394, 204, 294, 116, 124, -86, -306, -207, -56, 149, -55, 253, -126, 15, 97, -102, 181, 55, 113, -96, 164, -164, 182, 18, -109, -1, -215, 184, 88, -35, -17, 60, 149, -7, 117, -400, -241, 130, 6, 216, 190, 238, 67, -154, -108, 170, 204, -44, -10, -158, -166, 166, -6, -238, -64, -2, 1, -199, -211, 77, 221, 20, -273, -51, -177, 219, -176, 14, -161, 30, 138, 79, 131, 28, -26, -98, -37, 145, -34, -266, 103, -101, -115, -26, 163, 333, 265, 165, 306, -266, 310, -51, 68, -138, -477, 219, -43, -25, -64, 51, -68, 63, -31, -218, 149, 81, -58, 35, 10, -333, -207, -105, 41, -70, 12, -83, -95, -55, 115, -7, 378, -172, -113, 94, 199, -335, -110, 272, -1, 266, 167, -31, -176, 92, -18, 57, -274, 14, -195, -51, -309, -60, -79]
2566g9O1k4K7l02J05J81j18j38L28j7l20M12k37J98j7J27l09QO0K12k64k41N32
2589A85j77o5j01J12L34k27j67R4J06k41L88m47k96N73l1l66L44K00l15J58j5
2610D6L66j66n9l68M05K14m78o4J02k08L98p6j80l2M27m13l3P6k25M2N23k99O6
2633F4K46k98k88N08q5k13K39j15k85L89j42m72L53L2j23M2K82Kj62L34l17L24
2655C15q0p40L30L73k52r2O4n6J81Q3J94o00M93j24l30L03Jk48J50k53J05J51
2677c2L38l21m7K83k16j80L18l81K63K40n95J79M28j76p04K95L44j42N2L28p26
2698d52O56K7p33M81j25k20J79K47j42J58Q5l73L9M49l11k05K98Jm79N33j69k02
2720b58O08l32j85J54J41l02K50j60l52J98N0l28M99J17j24l2L30k72JM62q53
$$ y = [-79, -18, -42, -15, -317, -212, -31, -149, -287, 41, 24, -296, 116, -121, 77, 60, 187, -122, -114, -54, 158, -106, -347, 185, 8, -57, -158, -46, 288, 61, -106, -12, 94, -147, 241, -206, -502, 71, 40, -326, 18, 218, -97, 61, 46, 412, 246, 187, -181, 224, 438, -40, -104, -2, -210, 188, 112, -68, -100, 327, -86, -119, -43, -268, -226, 297, -2, 64, 310, 12, -276, 232, 147, -66, 173, 58, -227, 162, 20, -452, -99, -67, -190, -148, 134, 136, -26, 308, -9, 315, 235, -505, -175, 198, -54, -146, -82, -138, 43, 126, 320, -280, 213, 89, -241, 62, 63, -185, -35, -288, -183, -32, 306, -15, -62, 221, 5, -175, 143, -238, 25, 265, -330, -151, 277, 101, -603, -308, 36, -106, -54, 274, -452, 204, 231, -502, -21, -146, -366, -187, 60, -82, 76, 161, -212, -173, 276, -35, -240, 58, 59, -420, 113, -56, -258, 350, 18, -167, -13, 128, -174, 76, -84, -436, -238, -188, -516, -17, 100, -24, -56, 274, 2, 3, 465, -388]
2741c88J09N76n14o4O30m04Q9o3N9O4L63n29n28P45K18p45K22j91L40M37n30m18
2763e22M87K54m15L36J8k75K54N9m55J08M91m38m62P33J2k36J44k93K36M86l74
2784A48n66M65L10o91O0rJ95J81Q6o49N09Q1m89L22K52k58K66o7q9J51L59p08
2806a41j02M85l46L87J9p0m06K98m63K23O38l69l64j18L81j18Q7j11o9N18j69
2827A90k49j42N78o70J56L29l44L90L49o76o2L70j69n3J74m77J36N02j82l37L52
2848A65M18o67K43k1j80P0j78k4N59o3l67k19O35m61j82K17%L00J73o02J02M76
2870C94n52j29P40l78j6j77R4k9L57j13m83N46P4n50K30j5J28nj70m21N39L79
2892D43q55J97M86l36K11r9m28K95M29k87k93N76j74P5p1l28K09N4k65k69M10
$$ y = [-388, -279, 297, -217, -281, 349, -55, 34, -29, 30, 94, 457, -72, -600, 145, 363, -382, -160, -351, -11, 426, -104, -522, -35, 219, -196, 140, 158, -117, 137, 196, -259, -151, 340, -98, -560, 173, 185, -51, 93, -200, 36, 522, 148, -418, 47, 357, -334, -274, -283, -88, 93, 179, -470, 39, 120, -369, -47, 205, -53, 213, 146, 57, 208, 567, -141, -243, 242, -104, 283, 302, 232, -174, 124, -339, -116, 522, 153, -211, -329, 52, -66, 21, -90, -159, 359, 190, -59, -201, 377, -293, -137, 192, -152, 238, 587, -89, -151, 219, 50, -3, 171, -306, -170, 332, 150, -187, 165, 583, -84, 159, 138, -42, 28, -150, -174, 385, 322, -45, -264, 371, -90, -272, -55, -55, 245, 418, -184, -82, 394, -158, -287, 453, 75, 59, -118, -24, -53, 304, 191, -292, 254, 328, -222, 8, -7, 121, 116, -54, -475, 64, 443, -412, -215, 271, -65, 146, 47, -381, -86, 343, 56, -237, 339, 165, 240, 169, -159, 50, 104, -161, -430, -20]
2913b0O2n44O99p6l90L69J94n48N71K12p82q3P3L38L4q3n7n7N97k56m43J74J4
2936bJ23K8j48j16L57l33m31N26K2Kj26K6J95k00K92m09O8N82n70l9J73l46M00
2959G4j01k12L43K49k93j44L09J32n26J32R3j14L47j40q9k08k4k92M80K05j60
2980F1K19j93k39O4J48k99J53j1K77l20K48k64L16J11Mk23j79M31k83n64M13j89
3002c19O40o28K12m0J70j2J77k06K5m5k97M00jj28N9r6L92l83K11k28j50K42M15
3025D10l43Pj14k1L03j75j87J91M9R3k79J22K34m26P5n3Q6Q8m2n8R1j8O8m7K87
3050C41j21o9J3k13q8j91M81k34R7k46J02M97m75J53J97k52ll46K74r5P1L85m24
3073a46L76n22m5K54O2K01Kl32K89k12K6N7j31l8M20k41j36k1K50l4n7j29J5N28
$$ y = [-20, 42, -502, 197, 121, -269, 100, 294, -254, 317, 529, -253, -336, -263, 75, 109, 26, -31, -88, 509, 253, -190, -16, -2, 121, 149, 1, -115, 242, -91, -522, 4, 26, 28, -98, -72, 123, -77, 215, -194, -126, 456, -114, -153, 20, -326, 74, -27, -239, 104, 353, 60, -84, 225, 357, -169, -37, 56, -58, 289, 149, 60, -148, -172, -464, 16, 221, 61, 280, 87, -152, -88, 60, -239, -86, -97, 180, -140, 108, -156, 160, 271, 275, 52, -127, 304, 21, -543, -130, -319, 321, -307, -95, -135, 35, 23, 200, -6, 19, -26, -323, 77, 76, -52, 7, -89, 303, -80, 131, -97, -247, -5, 410, 67, 74, -40, -61, 242, 67, -120, 71, 120, 213, -66, 56, 290, -136, -61, -114, -28, 60, 18, -40, 51, 33, 101, 54, 341, 220, 151, 164, -49, -137, -328, 153, -81, 16, -230, -128, 369, -106, 47, 244, -8, -11, -357, -83, -178, -107, 278, -146, 230, -292, -337, -83, -21, 180, 182, -150, 139, -73, -47, 10, -121, -159, 261, 20, -116, -137, 113, 79, 22, -107, -92, 436]
3097D36o79K68j99O9j2Q4o4r2L10k37Q1R4j05M26l95J48m17M02n2J46l21J83k4
3120E0p5o6k45K17J3J05r2j55M49J06l16L54o05M63l9J22k09N6K10r3j65j85l1
3143a31qj73M00R1qO9k21Np3K2J39k32j87j67M21k26K06J08J83o7m89L61K2k86
3167b41N15l56J23k87J12LJ63O1j56K20J09k68J03l6j36k2J01q3J16j39M5J86
3189A33m28M61l11J16K86j85j89j25J06j19k7L61K3l24L24j46n5JK71j95k5J21
3211G4J19j71O0R1l19M32j17j41k54J52L55j60j32J03k00J77k71r7P00r8m63M87
3233C27k68j61K39Ql38M21l70l6k10O23p06K89N53l73K66j03K11j02l18o3J40
3254B9j4k6k86N56q3l19K6K85l22K71l41J25p2J13J74k57J48k48j8J94K36qo8
$$ y = [436, -243, 25, -174, -105, -117, -33, -97, -189, 121, -116, -35, 59, -46, 380, -15, 133, -284, 118, 66, 212, -109, 74, 50, -25, -91, -336, -119, -106, -1, -93, -248, 201, 307, -9, 345, -260, 203, 164, 286, 77, 133, 343, 250, 85, -100, -131, -139, -312, 88, 179, 171, 240, 19, 24, -49, -27, 112, -120, -307, -474, -53, -279, -73, 35, 218, 151, -338, 23, 45, -241, 274, -82, 41, -246, -134, -131, 32, 93, -63, 157, 266, -2, 101, 65, -71, -93, 8, -75, 41, -98, -53, 133, -295, 166, -145, -29, 257, 72, -117, -242, -136, -255, -282, 79, 102, -222, 102, -44, -99, -98, 173, -22, -47, 74, 193, 22, 82, 173, -146, 286, 169, 28, -226, -74, 281, 121, -11, 92, -108, 69, -202, -299, 401, 303, -160, 327, 59, -102, 137, 145, -193, 228, -142, -178, -388, 235, -471, -182, 371, -2, 264, 161, 372, 270, -48, -111, 29, 15, -11, -297, 259, 176, -143, -117, 168, -154, 117, -224, -99, -171, -58, 116, -141, 7, -241, -259, -65, 171, 163, 95]
3277I5Pk46K8K74k31M4k31M00n02L38k70Q8K76j12j2K49k43r6L34l0k4l87N1M1
3301a59K77k31LR2O1O2l45J36M4K51k13j81K50P5j16K89l97J48J57k52L97j01
3323B47k52o1J04J89k80P9K05k28oJ89l26Q6K36l6q6Qk41J76l5k58K04M6P4K56
3347B90k91K49j05K8J5j28P7l12J89m54P10k77L48k48k47K85l25P2l65O62k69
3368i6k39J24J18PJ26Pj50J33l32L75M9R6L5q2m29K37J53l44K06q0k34M67N3k30
3392c0J95o9l95M97J08l93J8L12l53m9o6J67J5k36K41M0J01n84N10o4J2J22j18
3415a9J42j30o7J81j7k4pj26KJ06k52L39lK35l09k14K07Q3j39k27K11QOk14J43
3440h5q2L56m3j6l97K65L6L3k16r2L66L21m22k93M86j74p9J19M93q22K33K47m05
$$ y = [95, 102, -144, -116, 158, -73, -29, -260, 140, -362, -24, -294, -206, 70, -42, -54, 195, -48, -144, 190, 160, 136, -251, -200, -159, 118, -113, -110, -18, 43, 105, -240, -104, -60, 191, -22, -203, 47, 122, 6, 295, -102, 46, 203, -49, 348, 247, -5, -66, 38, 227, -53, 26, 231, 3, -3, 186, -140, -54, 182, 146, 60, 68, -173, 3, -32, -290, -86, -40, 34, 290, -1, 248, 143, 171, 186, 58, 135, -177, 12, -442, 268, -9, 339, 91, -156, 129, -196, -124, -489, 173, -96, -335, -211, -93, -86, 40, 47, -103, 30, -302, 73, 122, 218, 253, 171, -258, -21, 132, -212, -6, -86, -320, 147, 200, -30, 165, 96, -299, 198, 306, -87, -69, 243, -110, -159, -225, -58, -43, -279, -38, 2, 103, -481, 29, -35, -23, 99, -19, 123, -7, -74, 107, 90, 66, 59, -67, -65, 41, -211, 128, 125, 360, 51, -163, 44, 127, -12, -239, -28, -20, -14, -228, -85, -167, 189, 146, 130, -267, -2, 34, 67, -149, -241, 125, 446, 24, -269, 217, 43, -36, 83, 576, -246, -13, 234, -171]
3463a71K35O1j22N6J5j68r8K17R0k19J04K57N1l32O3K89l95P9j14L52n47J16K50
3486F9j36L07k30mJ26P5k66k7K31l26j30K39j46L24j1j17j1P8j77K24j92L05P
3509B12l23M8L61l75P0m85K61L74q4K24p5j01N1j21j43j33J98m22K27M75j49m
3531H6J22J10j5k98j32n0o4K33L32l37J26k68P0M2K62l58L46n2j41L1k22r6L82
3554A09j06j52j10J96k8pJ87L07k64l6j71K58Q7l04R9k2l37K04P9k02M17j83k
$$ y = [-171, 64, 125, 3, 59, 74, -94, -192, 25, 115, -104, 0, 257, 308, -24, 39, 328, -67, 12, -102, 250, -297, -181, 69, -67, 240, 10, 6, 132, 207, -59, -86, 145, -181, -311, -72, -218, 106, 95, -22, -33, 45, -132, 92, -100, 205, 212, -111, -63, 298, -77, -7, -492, -231, 143, 59, 283, 208, 107, 158, 37, -106, -239, -41, -463, -236, 239, 90, 86, 208, 318, 303, 5, -127, -177, -241, -8, 324, -13, 113, -155, -85, -43, 219, -139, 207, 155, 14, 45, -177, -273, 109, 3, -149, -259, -63, -91, -98, 89, 396, 132, 96, -75, 183, 270, -34, 65, 43, -294, -90, -11, -213, 204, 21, 19]
$$ [...]
8191c11
##END NTUPLES=NMR FID
##END=
