##TITLE=1H_Pr D-D
 200.13Hz, CDCl3.
 8 sc
 
16.3.2026
##JCAMPDX= 6.0         $$ Bruker NMR JCAMP-DX V2.0
##DATA TYPE= NMR FID
##DATA CLASS= NTUPLES
##ORIGIN= UXNMR, Bruker Analytische Messtechnik GmbH
##OWNER= pz
$$ XWIN-NMR		Version 3.5
$$ Mon Mar 16 15:30:29 2026 Russian Standard Time (UT+4h)  she@DPX200
##.OBSERVE FREQUENCY= 200.1313
##.OBSERVE NUCLEUS= ^1H
##.DELAY= (6, 6)
##.ACQUISITION MODE= SIMULTANEOUS
##.ACQUISITION SCHEME= undefined
##.AVERAGES= 8
##.DIGITISER RES= 18
##SPECTROMETER/DATA SYSTEM= spect
##.PULSE SEQUENCE= zg30
##.SOLVENT NAME= CDCl3
##.SHIFT REFERENCE= (INTERNAL, CDCl3, 0, 14.3821)
##AUDIT TRAIL= $$ (NUMBER, WHEN, WHO, WHERE, WHAT)
$$ ##TITLE= Audit trail, XWIN-NMR		Version 3.5
$$ ##JCAMPDX= 5.01
$$ ##ORIGIN= Bruker BioSpin GmbH
$$ ##OWNER= she
$$ F:/spectra/data/she/nmr/H-C/1/audita.txt
$$ ##AUDIT TRAIL=  $$ (NUMBER, WHEN, WHO, WHERE, WHAT)
(   1,<2026-03-16 15:29:04.51 +0400>,<she>,<DPX200>,
      <created by zg, POWCHK disabled, PULCHK disabled
       configuration hash MD5:
       00 E9 B6 7A A2 85 ED C7 34 08 36 98 17 FE 4E 26
       data hash MD5: 16K
       87 BF 23 FC 91 36 52 1B 29 33 25 60 F5 2C 82 CB>)
$$ ##END=
$$ 
$$ hash MD5
$$ 65 50 C1 C8 E2 DC 75 AB A7 FA 74 18 E8 63 82 BC
##$RELAX= 
##$RELAX= 
##$RELAX= 
##$RELAX= 
##$RELAX= 
##$RELAX= 
$$ Bruker specific parameters
$$ --------------------------
##$DU= <F:/spectra>
##$EXPNO= 1
##$NAME= <H-C>
##$PROCNO= 1
##$TYPE= <nmr>
##$USER= <she>
##$AMP= (0..31)
100 100 100 100 100 100 100 100 100 100 100 100 100 100 100 100 100 100 
100 100 100 100 100 100 100 100 100 100 100 100 100 100 
##$AQSEQ= 0
##$AQ_mod= 1
##$AUNM= <au_zg>
##$AUTOPOS= <>
##$BF1= 200.13
##$BF2= 200.13
##$BF3= 200.13
##$BF4= 200.13
##$BF5= 200.13
##$BF6= 200.13
##$BF7= 200.13
##$BF8= 200.13
##$BYTORDA= 1
##$CFDGTYP= 0
##$CFRGTYP= 5
##$CHEMSTR= <none>
##$CNST= (0..31)
1 1 145 1 1 1 1 1 1 1 1 1 1 1 1 1 1 1 1 1 1 1 1 1 1 1 1 1 1 1 1 1 
##$CPDPRG= <>
##$CPDPRG1= <>
##$CPDPRG2= <>
##$CPDPRG3= <>
##$CPDPRG4= <mlev>
##$CPDPRG5= <mlev>
##$CPDPRG6= <mlev>
##$CPDPRG7= <mlev>
##$CPDPRG8= <mlev>
##$CPDPRGB= <>
##$CPDPRGT= <>
##$D= (0..31)
0 0.7 0 0 0 0 0 0 0 0 0 0.03 0 0 0 0 0 0 0 0 0 0 0 0 0 0 0 0 0 0 0 0 
##$DATE= 1773660543
##$DBL= (0..7)
120 120 120 120 120 120 120 120 
##$DBP= (0..7)
150 150 150 150 150 150 150 150 
##$DBP07= 0
##$DBPNAM0= <>
##$DBPNAM1= <>
##$DBPNAM2= <>
##$DBPNAM3= <>
##$DBPNAM4= <>
##$DBPNAM5= <>
##$DBPNAM6= <>
##$DBPNAM7= <>
##$DBPOAL= (0..7)
0.5 0.5 0.5 0.5 0.5 0.5 0.5 0.5 
##$DBPOFFS= (0..7)
0 0 0 0 0 0 0 0 
##$DE= 6
##$DECBNUC= <off>
##$DECIM= 32
##$DECNUC= <off>
##$DECSTAT= 4
##$DIGMOD= 1
##$DIGTYP= 9
##$DL= (0..7)
0 120 120 120 120 120 120 120 
##$DP= (0..7)
150 150 150 150 150 150 150 150 
##$DP07= 0
##$DPNAME0= <>
##$DPNAME1= <>
##$DPNAME2= <>
##$DPNAME3= <>
##$DPNAME4= <>
##$DPNAME5= <>
##$DPNAME6= <>
##$DPNAME7= <>
##$DPOAL= (0..7)
0.5 0.5 0.5 0.5 0.5 0.5 0.5 0.5 
##$DPOFFS= (0..7)
0 0 0 0 0 0 0 0 
##$DQDMODE= 0
##$DR= 18
##$DS= 0
##$DSLIST= <SSSSSSSSSSSSSSS>
$$ [...]
##$SUBNAM0= <"">
##$SUBNAM1= <"">
##$SUBNAM2= <"">
##$SUBNAM3= <"">
##$SUBNAM4= <"">
##$SUBNAM5= <"">
##$SUBNAM6= <"">
##$SUBNAM7= <"">
##$SUBNAM8= <"">
##$SUBNAM9= <"">
##$SW= 18.0517328524113
##$SWIBOX= (0..15)
0 0 2 0 0 0 0 0 0 0 0 0 0 0 0 0 
##$SW_h= 3612.71676300578
##$TD= 16384
##$TD0= 1
##$TE= 0
##$TE2= 300
##$TE3= 300
##$TEG= 300
##$TL= (0..7)
0 120 120 120 120 120 120 120 
##$TP= (0..7)
150 150 150 150 150 150 150 150 
##$TP07= 0
##$TPNAME0= <>
##$TPNAME1= <>
##$TPNAME2= <>
##$TPNAME3= <>
##$TPNAME4= <>
##$TPNAME5= <>
##$TPNAME6= <>
##$TPNAME7= <>
##$TPOAL= (0..7)
0.5 0.5 0.5 0.5 0.5 0.5 0.5 0.5 
##$TPOFFS= (0..7)
0 0 0 0 0 0 0 0 
##$TUNHIN= 0
##$TUNHOUT= 0
##$TUNXOUT= 0
##$USERA1= <user>
##$USERA2= <user>
##$USERA3= <user>
##$USERA4= <user>
##$USERA5= <user>
##$V9= 5
##$VALIST= <valist>
##$VCLIST= <CCCCCCCCCCCCCCC>
##$VD= 0
##$VDLIST= <DDDDDDDDDDDDDDD>
##$VPLIST= <PPPPPPPPPPPPPPP>
##$VTLIST= <TTTTTTTTTTTTTTT>
##$WBST= 1024
##$WBSW= 4
##$XGAIN= (0..3)
0 0 0 0 
##$XL= 0
##$YL= 0
##$YMAX_a= 14304
##$YMIN_a= -10278
##$ZGOPTNS= <>
##$ZL1= 120
##$ZL2= 120
##$ZL3= 120
##$ZL4= 120
##$ABSF1= 10
##$ABSF2= 0
##$ABSG= 5
##$ABSL= 3
##$ALPHA= 0
##$AQORDER= 0
##$ASSFAC= 0
##$ASSFACI= 0
##$ASSFACX= 0
##$ASSWID= 0
##$AUNMP= <proc_1d>
##$AZFE= 0.1
##$AZFW= 0.1
##$BCFW= 1
##$BC_mod= 2
##$BYTORDP= 1
##$COROFFS= 0
##$CY= -3
##$DATMOD= 1
##$DC= 2
##$DFILT= <>
##$DTYPP= 0
##$F1P= 0
##$F2P= 0
##$FCOR= 0.5
##$FTSIZE= 0
##$FT_mod= 4
##$GAMMA= 1
##$GB= 0.15
##$INTBC= 1
##$INTSCL= 1
##$ISEN= 128
##$LB= 0.25
##$LEV0= 0
##$LPBIN= 0
##$MAXI= 10000
##$MC2= 0
##$MEAN= 0
##$ME_mod= 0
##$MI= 1.114404
##$NCOEF= 0
##$NC_proc= 0
##$NLEV= 6
##$NOISF1= 3.799351
##$NOISF2= 2.8
##$NSP= 1
##$NTH_PI= 0
##$NZP= 0
##$OFFSET= 14.38212
##$PC= 1
##$PHC0= -3865.274
##$PHC1= 10.5923
##$PH_mod= 1
##$PKNL= yes
##$PPARMOD= 0
##$PSCAL= 0
##$PSIGN= 0
##$REVERSE= no
##$SF= 200.129724274929
##$SI= 16384
##$SIGF1= 3
##$SIGF2= 2
##$SINO= 400
##$SIOLD= 16384
##$SREGLST= <1H.CDCl3>
##$SSB= 0
##$STSI= 0
##$STSR= 0
##$SW_p= 3205.1282051282
##$SYMM= 0
##$S_DEV= 0
##$TDeff= 0
##$TDoff= 0
##$TI= <>
##$TILT= no
##$TM1= 0
##$TM2= 0
##$TOPLEV= 0
##$USERP1= <user>
##$USERP2= <user>
##$USERP3= <user>
##$USERP4= <user>
##$USERP5= <user>
##$WDW= 1
##$XDIM= 8192
##$YMAX_p= 0
##$YMIN_p= 0
$$ End of Bruker specific parameters
$$ ---------------------------------
##NTUPLES= NMR FID
##VAR_NAME=  TIME,          FID/REAL,        FID/IMAG
##SYMBOL=    X,             R,               I
##VAR_TYPE=  INDEPENDENT,   DEPENDENT,       DEPENDENT
##VAR_FORM=  AFFN,          ASDF,            ASDF
##VAR_DIM=   8192,          8192,            8192
##UNITS=     SECONDS,       ARBITRARY UNITS, ARBITRARY UNITS
##FACTOR=    0.0002768,     1,               1
##FIRST=     0,             0,               0
##LAST=      2.2672688,     0,               0
##MIN=       0,             -10278,          0
##MAX=       2.2672688,     14304,           0
$$ Real data points
##PAGE= N=1
##DATA TABLE= (X++(R..R)), XYDATA
0@%%%%%%%%%%%%%%%%%%%%%%%%%%%%%%%%Mj1J5j6J6j6J6j6J6j6K2l0L2l2L3l9M6
49B4m8N2n9O3o9P7q5R5j04J15j30J46j65J87k14K49k95L59m49N74j408J5257l003
72A1169j8673k22J2103M651q625m289L231j01o98M887l20o416k553N717N367m353
88H75o173L628M315j463o29J015j223j863J394M162k220o568J902N887j801m590
104c352Q24L802m85l284K143L566k954j998L528J314k921j489K908J141n158j422
120c837N989O81o797j790O461L877o052m345O556M686m798l204L680L094k590
135A611l390K160K131k769j400R17n19l58P85M28j046j295K460K926k177j950
151a486K364J765p76j521P80J070k891j329L629L96m650k046L557L534k573l898
$$ y = [0, 0, 0, 0, 0, 0, 0, 0, 0, 0, 0, 0, 0, 0, 0, 0, 0, 0, 0, 0, 0, 0, 0, 0, 0, 0, 0, 0, 0, 0, 0, 0, 0, 4, -7, 8, -8, 8, -8, 8, -8, 8, -8, 14, -16, 16, -16, 17, -22, 24, -24, 28, -31, 32, -37, 40, -45, 50, -54, 61, -69, 77, -88, 99, -115, 134, -161, 198, -251, 323, -1085, 14172, 11169, -7504, -7726, 4377, 9028, 403, -3886, -655, -756, -1454, 3433, 3113, -3303, -5856, -139, 5228, 875, -5298, -1670, 2645, 1182, 553, 1568, 345, -1518, -124, 4038, 1818, -4750, -2848, 3039, 1238, -3352, -2528, 1274, 789, -2495, -352, 3214, 260, -1738, 1790, 3104, 183, -1306, 1602, 2743, -2415, -3837, 2152, 2833, -3964, -5754, 707, 4584, -1468, -5813, 743, 5429, 631, -2573, 1107, 4201, 1611, -1779, 381, 2512, -257, -1657, -740, -1259, -1617, -832, -404, -1450, -2745, -285, 2641, 464, -1486, 878, 2643, 1867, 346, 1126, 2196, -695, -2024, 1605, 2001, -2649, -4695, -1138, 2396, -177, -4075]
167d075K037L180J31P3n05j266M07K212J907k573m728J861M621j276m441j304
183c739K928K122k512j096K204j94q65J656J348m97j865J75K783l02k343K88j35
200d4m41P64j73r72j077j1K579K36k785N18K159M24p08r03J221R99k111O3K082
219A820j018j836L5J238Q21j943j043J864K86n92M95m32k74R14N53J03j378p65
237a152K277O11k244p41J095J222o03j841Q12J475r15m03M29k1Q5k18L43L96j247
256f40l7J230m69o83M50N0J52l00J71J015q88o94J256M56p27p53J8J208j56j670
276a011K86O63l72o3l8J96K27n17P80P18r82K66P96k38j29k92N9K20r31n0Q05
297C93r51o30M18L09L66o73l77J471K59n86L36L32K66N6n83L52p4r83N64j3j096
$$ y = [-4075, -2038, 1142, 1273, 1346, 841, -425, -18, 2194, 4101, 1528, -3200, -1339, 3282, 2006, -2435, -3739, -811, 1311, -1201, -2297, -93, -287, -1152, 504, 1852, 1355, -510, -335, 2448, 2146, -197, 91, -44, -485, 279, 106, -866, -1943, -1954, 625, 861, -1924, -1406, 753, 1177, 469, -434, 787, 1786, -325, -262, 1820, 802, -1034, -999, 239, 1060, -883, -1926, -62, 224, -368, 127, -305, -579, 335, 888, 991, -387, -1152, 1125, 1736, -508, -1249, -154, 1068, 465, -1376, -564, 911, -4, -407, 22, 1, 86, -132, 211, 607, -640, -677, 553, 84, -599, -149, -99, 53, -247, -76, 939, 51, -643, 613, 1069, 342, -411, -393, 815, 659, -1011, -725, -62, -434, -497, -535, -339, -112, -629, 151, 869, -113, 153, 949, 711, 582, 290, 349, 569, -362, -412, 393, -558, -1188, -770, -461, -95, -768, -1145, 326, 585, -1, 335, 667, 933, 989, 406, 758, 684, -299, 265, 252, -844]
318h44J08J40n1O0n95N55Q40p00L70Q14k55K17L6p2O69p71n95O95n01m49l8m61
340h28K93n2n45P10k2m53R70K36k51M35j09N57N4q88M53L47q99K1r9m08K69m22
362f31k14N63m68O0P32l44L98O0j79Q10j12n16M94k38k83N30n09l44r4k98P45
383A62j93j006M02M51Q4K81n55o6Q21l6J19m2o20M11L49l29J15m60k75P24k80
404E7k68J78m24J90L34l29L55k17l13N69o0j78M64m20j31M82p2K34k31o56N25
425H9M44l49po44JO17j19n0j90o73M98Q63k05l57p20M76J459l97q53M6K65N89
447G83k1j033J35K17k72J13k41j05J81n65J65Q81l93o5R4m9P63J10m68L31k47
468C14j97N37j38j52n22r58P39R74q42q13l00Q65J389p70j001M96N54P78J81r78
$$ y = [-844, -736, -596, -647, -587, -1182, -627, 213, -487, -117, 697, 442, 659, 695, 623, 1292, 521, -74, 621, 120, -329, -367, -828, -535, -587, -1132, -422, -444, -897, 73, 309, 58, 493, 384, 941, 995, 107, 560, 907, 8, 29, -70, -478, -209, -631, -845, -282, -750, -690, 42, -302, 96, 156, -23, 787, 675, 159, 653, 415, 132, 662, 153, -191, -285, -583, 162, -31, -1037, -635, -184, -100, 181, -374, -440, 381, 345, 464, 422, -198, 213, 562, 233, 348, -112, -387, 337, 57, -211, -33, -457, -267, 67, -262, 93, -124, -437, 132, 72, -106, 358, -62, -193, 289, 217, 451, 220, -436, 89, 533, 184, 177, -467, -466, 151, 32, -18, -208, -881, -383, 480, 275, -82, -802, -326, 1133, 736, -117, -71, 194, 783, 762, -271, -136, 81, -191, -78, -319, -424, -243, -808, -643, 238, -155, -220, -126, -175, 588, 698, 230, 561, 314, 117, 654, 516, 364, -158, -1116, -377, 597, -245, -1058, -1358, -493, 896, 126, -875, -379, 175, 953, 1134, 156]
488A56j06K65O3P97n83j453Q0O07N98l25j614K07J464n0l13j94PR55j07m73R19
509I00%p06j34K6P91r3j555o1P85l0%o54k75P48o2J41P09n47m55M85P08R08j048
532E81j549Q03J367j51j079j304O35J436l82r50l71J2J052L25o86N8k42L01R54
551H10m6o48k20kQ43K6j044L5K61p7J7m09R4N54o90l27P56M10q3o36k97J195K13
574G35n63j48j29K10M73k33q1l09o47P31N67m46p16n63O76J389o46j167J8P58
594i1J037l40j271L34Q78K39j40r33J01P84m66k82K98m12o6J3j03M70l00m05O27
615b8l3j63M47j38K07Q1n97P09L98p41j71JK7N28p33m26L31k82L23M15o86j33
637f64M06L02N97m92o28P68L67N3k0r06O6P74l22l14m13k74P15p8o92L79R1rK32
$$ y = [156, 50, 315, 378, 1175, 592, -861, -781, -174, 424, 99, -1515, -1308, 156, 106, -207, -401, -394, 561, 454, -19, 900, 900, 194, 60, 86, 877, 784, -771, -832, -47, -77, -77, -731, -1006, -258, -320, -179, 530, -17, -472, 13, 721, 1629, 581, -968, -165, 1202, 1051, -28, -1332, -697, 739, 357, -593, -964, -952, 100, 425, -261, -203, -445, -144, 810, 764, 116, -104, -106, 737, 763, -281, -246, 15, -62, -45, -454, -360, 194, -496, -823, -67, 343, 260, -376, -673, 522, 735, 172, 24, -105, 105, 578, 345, 264, -45, -692, 39, 606, 160, -556, -1119, -443, 946, 300, -867, -849, -91, 946, 606, -665, -331, 547, 786, 646, -287, -186, 598, 132, -150, 148, -264, -330, -317, -420, 50, -250, -655, -28, -61, -224, 223, 85, 292, 373, -224, 485, 883, 142, -29, -28, -1, 527, -206, -632, -301, -583, -260, 155, -531, -664, -258, 44, 641, 149, -479, 289, 656, 709, 689, -217, -151, 623, 301, -13, -426, -700, 15, -63, -755, -376, -285, -294, -62]
660f2l18O34M14q69J74P45j12j58m64m9O74m48m20J90m07N2K92l13Q1o0p5P07
682B08r7k19K93j3O8L85k37M7k46l68N27J63p92j74J33K08J36o31k4N29r3J84
704a3Qk76L85K65l4P8m08K01M73n33k72J25o5J37l06k96M03p3l80M78Nj17O9j8
728a64M72J06m72K67K02k30K80k69k84L09k98Q1L1o33K35M16l60M3j33P7N13k97
750a08j22N54k29j2K31j30J94j14l64M06n1n46K97j67j95L96m28j1K22k67M90
771D6J28n76M42K75j37J88l54R7N84m91k39K70k38O7j36l19K92j77k26M42k00
792b62j53M81j52N5L07k75L45K7l55M39o2l24J94k76o2K09n06J15J66l09Q6J01
814b11j05L03r0j8M74k26k9L11j78J18R5m27J33J3k72J93k92k72M03k55q7K37
$$ y = [-62, -380, 254, 668, -201, -27, 718, 606, 448, -16, -65, 609, 161, -259, -69, -476, -424, -132, -445, -364, -424, -499, 208, 111, -108, 185, 172, 240, 625, 388, 435, 189, -179, 348, 511, -281, -455, -322, -114, 22, -609, -633, -104, -197, -13, -5, -281, 104, 369, 335, 413, 5, 206, 679, 146, -126, -1, -66, 71, -235, -531, -128, -201, -581, -103, -98, -215, -146, -164, 308, 414, -58, 209, 411, 181, 461, 192, -92, 217, -81, 0, 31, -602, -367, 49, -311, -268, -401, -324, 189, -108, -230, 324, 95, 83, 314, 184, 378, 264, -100, 306, 255, -291, 6, -161, -356, 40, -388, -399, -177, -444, 46, 174, -402, 40, 315, 178, 366, 12, 109, 693, 202, -37, 233, -5, 62, -74, -393, -101, -278, -504, -62, -262, -415, 66, -86, -31, 276, 1, 346, 373, 18, 457, 395, 71, 265, -11, -73, 136, -370, -255, -89, -398, -312, -211, -316, -13, -103, -121, 353, 127, 98, 409, 231, 349, 444, 17, 150, 163, -109, 84, -208, -480, -77, -332, -419, -182]
836a82k31L12K46l51K67J97j37L74k89p1L42l39pP1l74N8O3l42J45j38o0L73j82
859b55r2L23r7K94J48k30K04R5k88L45j56k96K00k84MJ24m83J38J31k25K17jj94
882c78L56OO6L27l72J07L45l08J61O4m86J64L3j88K50l67l13L76j12J36Q6m36
904d83L22L40k50K70j27j65N15q9j69J67l79J69K28m64M3p4l22L85L6l92K93j59
926c05O3M48l02K9K78k73L20J67l22K52j79k53L17o6k78O9l61R0L46l98N1k8m6
949c81M99m7k33K29j3O4L57k51n0M1k06L96l6o44O0J25k0J11m27m9M28k09J31
972a25J42j65K94j8j19M13n8l09J81j61J49R4m59k7J19l13L23j58k36K53j45K10
994a15L05k08j73K26J38M16j87n52K30L25r5j11m45P7L00k86j22J35k92J99J36
$$ y = [-182, -413, -101, 145, -206, 61, 258, 121, 495, 206, 135, 477, 138, 131, 202, -172, -114, -51, -393, -248, -386, -446, -73, -255, -347, -24, -121, 173, 321, 91, 295, 390, 102, 447, 291, -5, 195, -89, -85, 39, -444, -306, -175, -400, -183, -184, -378, -22, -16, 50, 377, 5, 112, 457, 149, 310, 374, -112, 52, 85, -103, 147, -220, -533, -157, -269, -133, -47, -483, -161, 179, -71, 199, 72, -93, 422, 333, 164, 331, -48, 121, 349, -115, -72, -146, -468, -83, -47, -439, -146, -305, -242, 206, -96, -67, 211, -62, 258, 425, 103, 355, 176, -77, 240, 174, -104, -35, -396, -306, 40, -358, -307, -335, -381, 118, 71, -162, 67, 54, 118, 475, 224, 174, 215, 9, 405, 369, -275, -215, -90, -110, 1, -426, -475, -47, -256, -125, 17, -148, 146, 128, 9, 422, 364, 55, 236, 75, 224, 318, -141, -168, -49, -362, -39, -197, -433, -180, -325, -115, 190, -18, -191, 35, 173, 589, 402, -150, 80, 405, 310, 199, -246, -169, 131, -155, -277, -142, -434, -235, -99]
1015i9k2J78k83j15O71N0k36qr0L42M9m78J08L7j84M8k72O1K68m14p9L98j10K08
1039B8m2l30N00K09k83K32k19K8K94l17O2J39n92N6L67j45j46l70J07O81k86m65
1061d92L35J58J91P7l70L71J26l95K89N1l26N8q3l3K70n66m3L44k77J27q5M1L16
1084H4j19j48L92k9j5J89k96J29K67l94m9Nj34K36k53k30K93j26q1K03j49J57
1106f8Lj72M39O3l56K47J25O7j7l38N6K81l13j66J35k60J53n3j66K76j33j10L62
1129E5p7N2P6o8K67J4k48K66o2k71J88j48r4O5k68j2J85k05O9Q8j78K71L6q1K73
1154A93q8RK13k28J06O0j75Q3r2k45K72k98j12K78k16o6J73l1J49K5k23M34l5
1177A86j75L11j02p0K13k55k9J25l99J41J44l89J38M3j88L09k26p9M16k25L2L49
$$ y = [-99, -121, 57, -226, -341, 330, 380, 144, 136, 46, 388, 437, -41, 67, 104, -80, -32, -304, -243, 25, -389, -468, -70, -180, 28, -14, -344, 156, 365, 82, 314, 95, 123, 417, 100, 162, 301, -291, -235, 132, -13, -159, -529, -422, 259, -27, -492, -157, 1, 192, 269, -101, 270, 396, 1, 290, 341, 15, 73, -10, -43, 227, -339, -382, -38, -315, -188, -273, -232, 84, -35, -183, 209, 180, 165, 354, 58, 187, 454, 60, 11, 16, -118, 118, -135, -365, -72, -198, -279, -76, -225, -68, -65, -237, 202, 265, -91, 156, 281, 348, 331, -7, 49, 330, 17, -149, -14, -274, -121, -174, -340, -64, -197, -307, 55, -22, 30, 106, 38, 305, 319, 71, 337, 275, 4, 192, 44, -50, 15, -253, -265, -80, -285, -216, -128, -306, -35, 1, -80, 193, 105, 114, 327, 99, 205, 265, 90, 173, 81, -164, 108, -190, -302, -24, -240, -306, -133, -164, -15, 10, -213, 221, 186, 11, 322, 220, 150, 363, 108, 79, 204, -195, -54, 90, -299, -161, -118, -306, 3, -223, -302, 114, -111, -79, 270]
1199B70j83R4P7j97K55j18k21K39j96j21J77k72J9J07k15J61J41l25K41J26j66
1220a07L11j60O6K31k38J6K07l13K5Q7k57K10k95p5L19l01p0L11j66j4K26j06
1242i3K30j1j36L21l3j25J24j12j16Q0j82J0O5k85J16K6j63J66o6l2K71j16N0
1265a1K20j67R2J32j48R8r0L1J03k48j67J47j24o2Q6j55J54K0j62K32J2j34K98
1288A57p9N4O5j34J55O5l27J07M0j78J17j41j06J44k40J03J44j58R2J70p4J17
1310I3L1r5L16j91j00K55k10qJ11l28J38k2l17K57o6k37K91Kp9J94j61Q6K55k54
1334c9J84K12k94J52j8j66J48k65o6K29k14j33K04k09J23P0k30L27L0j39K52J6
1356A74j48K82k65J43L3k27R8Qk08J13n0k40J72n8m1K77k72N2K23j23J14J26j63
$$ y = [270, 87, 181, 258, 61, 316, 198, -23, 216, 20, -101, 76, -196, -177, -70, -285, -124, 17, -308, -67, 59, -107, 204, 44, 110, 341, 103, 119, 326, 13, 38, 125, -132, 78, -217, -292, 27, -274, -344, -33, -199, -213, 13, -93, 137, 126, -10, 311, 278, 153, 277, 165, 49, 129, -53, -43, 22, -263, -147, -121, -284, -118, -184, -216, 55, -61, -11, 209, 42, 134, 266, 118, 216, 126, 157, 260, 12, -155, -8, -132, -194, -108, -263, -109, -89, -251, -19, -7, -141, 157, 78, 132, 197, 63, 218, 283, -44, 63, 103, -75, 42, -99, -205, -61, -301, -198, -54, -212, -120, 50, -24, 93, 124, 29, 345, 154, 54, 309, 99, 91, 202, -126, 12, -10, -327, -70, -136, -373, -82, -80, -159, 35, -126, -40, 215, -39, 145, 357, 63, 215, 197, 31, 179, -86, -152, 77, -137, -270, -66, -275, -152, -82, -312, 15, 45, -94, 158, 174, 26, 308, 43, 186, 219, -8, 90, 98, -110, 3, -47, -287, -115, -173, -214, 63, -209, -157, 66, -57, 57, 183, 20]
1379B0K00p2j07K51k11j08K07j34j42lj47R7P7j61R8L3m7J70l4N8Q5j04J34Q5
1403B45k14K16r8j95J49j06q7J25j82n1K05k15M6J10j10J61J1k9K44j68j6J97
1425B38m8p5L4j50J56n8k07J58q2j47J29j39rJ28j43J81J63j96J29J6j0J98j09
1448A57j03J73m3j08P5k99J27N2l25J70l1q5R1m2K3L12k13M8K05j29J32M6k10
1471B3K05l5k32K28j70j36J55j99J5J34l07J64P9r3J53m0n2L14p3p0J16r3P6L8
1495B00k32J48N6l09O3J0j05P1j15j4K01n8j33K63n8R6J8m3K17k4k44J42l9k1
1519I0Jj73pJ08k21Q7M7j23J21%r7K26o5k1J44o6Q7L1j15J69l5k07J09j43m6J53
1545E4j96o8K15k06Q4nm1J79J8j13K79m0r0R4l3L3Jj65J04Rk02k1j1j6lk7j4J42
$$ y = [20, 220, 148, 41, 292, 81, -27, 180, 46, -96, -99, -246, -149, -72, -233, -135, -102, -149, 21, -13, 45, 130, 26, 160, 245, 31, 247, 149, -46, 103, -3, -90, 35, -147, -198, 7, -208, -162, -52, -162, -1, 10, -19, 225, 57, 41, 238, 190, 115, 149, -1, 155, 97, -110, 48, -34, -181, -52, -191, -200, -72, -215, -34, 129, -67, 62, 78, 68, 266, 157, 54, 227, 184, 76, 151, -148, -21, 31, -294, -124, -155, -240, -149, -191, -168, 144, -69, -21, 184, 55, 187, 233, 23, 228, 193, -39, 189, 19, -117, 38, -161, -146, -12, -319, -155, -76, -169, -16, -56, -108, 206, 133, 63, 179, 86, 162, 200, -32, 116, 172, -137, -74, -64, -169, -98, -213, -227, -26, -84, -217, 46, -12, 84, 102, 59, 276, 252, 8, 150, 111, 90, 91, -82, -89, 19, -202, -115, -68, -191, -70, -70, -167, 59, -6, -27, 117, 51, 138, 169, 54, 223, 188, -19, 90, -53, -99, 54, -142, -210, 5, -201, -117, -122, -163, 16, 34, -79, 200, 160, 70, 164, 131, 164, 165, 0, 104, 113, -89, -110, -121, -137, -140, -167, -181, -39]
1573c9j53J41J12l7L4Q3j02J85j26m6J70j34l5K6j31M9n4j09P5K4j76K01l4J2
1597f4J08m5m7J82m9J8J14k16J07L6j24N7r7m1J49k42k6J88j60MP1j22K38q9o8
1622a18K50k5n9J40n6n0M5j03J6L0j84R2J6k18J44j1j29J87j04P8N9k6J12J37
1646B23j72Q7Kj04J91k12l4J46k26o6J81j41kJ8q8J03P7j32K02k4n8J70r5Q3R3
1671B22j70R1K0k11Q5lj27Q1j00j5P4j28K8J45j10Q0P3m1J49j03NJ49j16rJ05
1696A74j38K9l0j22J25q2j89J28K6j00Q4j8J5J31p5N1J07p7N2J06j34J36r8p4
1720B7K6j19m6J14j54K2M6o2R3K5r5J61Rl9J10j1J0np8J26l1j88J72q2q7J2o5
1747a09K5J08j83K3J01j19J11N2n9J46l1NJ36j42K0O0n0o3J1j82J08nj64J72n9
$$ y = [-39, -192, -51, 61, 24, 58, 141, 39, 224, 98, 52, 222, 88, 53, 79, -52, -3, -57, -166, -91, -67, -243, -42, -76, -64, 44, -1, -48, 134, 85, 103, 217, 1, 108, 144, 20, 77, -20, -61, 88, -154, -180, 8, -152, -148, -77, -199, 39, -50, -118, 132, 107, 48, 188, 132, 82, 127, 24, 40, 70, -114, -22, -6, -224, -80, -91, -220, -33, -137, -59, 0, -26, 86, 223, 51, 138, 140, 36, 227, 15, -19, 127, -99, -165, 16, -125, -127, -109, -197, -94, -17, -149, 53, 29, -29, 141, 46, 129, 222, 52, 143, 163, -48, 37, 34, -93, -12, -112, -127, -53, -181, -153, -8, -118, -38, 35, -6, 143, 40, 45, 194, 78, 69, 174, 36, 65, 35, -87, 38, -44, -233, -105, -79, -179, -95, -113, -98, 33, -42, 9, 116, 39, 91, 197, 63, 199, 101, 27, 53, -66, -112, 2, -152, -130, -84, -146, -53, -28, -123, 38, 47, 8, 118, 107, 117, 112, 34, 160, 129, -59, 113, 31, -56, -44, -109, -84, 24, -159, -136, -35, -154, -43, 9, -50, 96, 65, 70, 206, 64, 84, 144, 94, 31, 42, -140, -32, -37, -201, -29, -88]
1772h8p8J75n5o6J53p1O1O0r0J13M5j27M5J3j42P4o0o3J06j62M1J39k03J25j4
1797f9j8J53l2j06K44j21P6J7n1PJ3j21M1l8j05R7l4l3O9r0kN6r4J43J04q4P0
1824I2j0o8J35j06nN3n4k9J9r2Q5p6r8R5J2p3Q5m7jJ25r3J30O1o6j0N3n9N2J3
1853A23j38M7q5k0N0j38Q4K1r2P7M9q0J34j0MR9p7J2OJ3M0pj49J17q4o5Q8n0p9
1882a10P0q7J4P6j19J31J27j49J27j2m3J78j53j9J50j86%O0j16K2q1jR4o5p1J61
1908bp9j0J00k9lJ35r5J58l6j45J44r3j29J66j15n7Q5j51O4R1j49J21J8o4J11
1933C6o8L5J05k6JJ13j48J0N9j22K9Jj13Q5q1p2Q4o8N1J42r8j8J15o3N5R5r4J19
1961A64l8j38J06j20K1Ll9l1Q1j52J02r1nJ28n6j8K24o2m5O2R%%n2J15j07j14
$$ y = [-88, -166, 9, -46, -112, 41, -30, 31, 91, 1, 114, 159, 32, 77, 90, -52, 22, -38, -101, 5, -157, -116, 23, -180, -55, -69, -87, 66, 34, -72, 172, 51, 127, 144, 93, 100, 113, -8, 33, -5, -110, -13, -47, -80, -11, -101, -103, -47, -141, 2, 106, 22, 92, 82, 14, 149, 43, 38, 91, 37, 8, 27, -65, 20, -56, -154, -59, -47, -120, -35, -82, -83, 42, -51, 79, 140, 74, 64, 117, 58, 110, 123, -15, 32, -53, -73, -23, -161, -77, -56, -148, -71, -22, -102, 32, 22, 26, 125, 48, 60, 66, 79, 119, 112, -37, 80, -4, -69, 19, -31, -110, -40, -127, -113, -37, -156, -25, 102, -47, 80, 68, 25, 203, 50, 31, 181, -5, -5, 55, -61, -39, -120, -121, -27, -92, -163, -2, -81, -91, 9, -20, -23, 112, 17, 175, 139, -6, 138, 45, -84, 82, -33, -90, -5, -156, -92, -1, -150, -29, -11, -75, 36, -32, 3, 108, 82, 83, 196, 48, 58, 117, -5, 24, 25, -88, -3, -84, -156, -72, -140, -89, 53, -45, -63, 52, -11, 44, 139, 45, 164, 126, -12, 94, -26, -5, -2, -41, -72, 9, -143, -41, -132, -137, -9, -65, -83, 141, 79, 34, 96, 105, 105, 105, 53, 168, 61, -53]
1988e3J16q6J3jj02J5Rj9J20j01L4J20m9kJ25r5M6J4o1J9L5j14R5j61O7N9j35
2015i2k0J09m7l5P1j8L3M8q2J48l3o4J33o9m1L3j07J9Lp0N5k9j1l9O1l2J15r3
2043e4m3J63l1J4Ljj6R9q7K8p4m5J24j47rJ01j48N7M6n4PK8J0QnL7J00M2r8LJ0
2074F8l6P7j33j6P1j22J08o0o7P3o8N8M4p9J20K4q3O5L8l2jRj8Q8j23m8J19j27
2102e1OL0q8M3kMJO8j4O7m8L2P3m6K2N5j01l2J7p4P6l6j01N8k2k8O3n3K8N9q8
2133h2J13n7K0Q5l8J9O7j07M0Rp9K7jj07P2Mr8Q1J4NL2q6J16m5j8N9K2nK4M6j16
2164A6N8l1j01O9p5J5L0l8K9l5l0J02rj04J86q5N9J05j79J01P8j69Q9n5k5N2p9
2191b6l4P1p9rj3K4RQ2j05N1R5K6j9Nm8R6q5nK0q3L7pj00L1J7j34J47j3q7J99
$$ y = [-53, 63, -23, -10, -11, -113, -98, -89, -108, 12, -89, -55, 65, 16, 14, 139, 44, 90, 104, 43, 62, 97, -17, 78, -83, -16, 43, -92, -112, -3, -50, -85, -14, -32, 1, 49, -33, 115, 82, 18, 151, 82, 41, 74, -33, -14, -11, -81, -26, -55, -66, -105, -44, -76, 39, -54, -97, 66, 35, 49, 52, 51, 35, 134, 47, 75, 1, -44, 80, -67, -76, 25, -123, -66, -20, -74, -67, -39, -29, -21, -26, 11, 111, 153, 55, 58, 68, 32, 109, -24, -40, 31, -91, 17, -43, -110, -37, -105, -47, -3, -82, 38, 62, -21, 44, 82, 50, 49, 58, 40, 128, 5, -43, 76, -51, -45, -15, -103, -60, -62, -58, -57, 11, -3, 64, 16, 48, 121, 75, 97, 152, 51, 19, 36, -38, 38, 2, -99, -41, -63, -91, -28, -81, -53, 6, -82, 31, -26, -6, 79, 41, 60, 127, 20, 60, 69, -10, 17, 16, -91, -19, -15, -113, -32, -18, -13, 19, -67, 49, 4, -14, 45, 67, 62, 86, 132, 16, 74, 43, -58, 11, -64, -49, -19, -57, -28, -63, -93, 9, 0, -104, 82, -3, 56, 161, -18, 83, 161, -8, 81, 26, 1, 53, -26, -60, 11, -68, -77, -90, -66, -57, 25, -80, -29, 66, 92, 73, 78, 30, 126, 41, 36, 56, -27, 10, 3, -97, -66, -49, -183, -36, -49, -136, 63]
2221F3j36R3N7r9J44J2j58J13k7l4R5j09K6Op1o9P9m0J4l4oO7K2k2O8n3K3N5m0
2250C9JM4n0O3m0p6J2Ll2P3q7l6N8q8O2R2j18J24oj7O5n7J9M6q6L9lp6O8l0o7
2281f1O8L8j44P7j6PP2r0M3N9n7J16nj00R5k0r7J51r3j9l3k3qK1r7J19p3j1J00
2310A9n4J6Q8p4O9J6m4P9K7j08Nln5R1j16n1J28o4l5O9q3N1J02j09P3M6j24J23
2338H2Jm9kk5oJ0q9O4J0o5J16p9mL0o3RJ08j25N5J06j58J73Jm3L7m2n4P8o6l5
2368b5M3j03J5M6k6MO4p8P1pp5J28l2mO3j04O7M8p2QJ2r8O7m2j4K2k7rK1n1N7
2399c1qL9N4J7q7R4l1p3J76j23pJ6k8j1M1q8K5Rk8N8l7%Pl9M4L7p0R6J4r7O9J8
2431E6r1J20j08l4N2p6N5k9kK6K0k9J5J3j01J53k5nJ11j05N2j9j06R5k2p9N3l4
$$ y = [63, -73, 20, 77, -22, 122, 134, -24, 89, 62, 28, 123, 14, 40, 46, -25, -94, -15, -55, -41, -75, -81, -14, 8, -14, 54, 1, 24, 79, 39, 40, 84, 34, 97, 57, -19, -7, -4, -36, 37, -50, -86, -28, -116, -54, 38, -80, 44, 38, 21, 86, 29, 48, 94, 8, 47, 44, -32, 36, 6, -61, 7, 45, -99, -22, -38, -31, 41, -49, -6, 53, -4, 112, 107, 7, 102, 82, -15, 136, 43, 24, -9, -32, -40, -19, -116, 3, -70, -81, 19, -35, -19, 69, -5, 64, 80, 36, 115, 142, 34, 39, 36, -19, 72, -44, -95, 33, -31, -66, 3, -80, -29, 73, -36, 37, 83, -41, 82, 83, 34, 32, 7, 1, 11, -78, -14, -4, -69, 47, -32, -36, -6, -69, -60, 48, -77, -22, 84, -74, 99, 100, 57, 94, 52, -2, 76, 10, -25, 18, -85, -70, -24, -50, -46, 18, -60, 11, 4, -71, 57, 25, 21, 84, -20, 47, 95, 23, 31, 43, -55, 12, -30, -44, -22, -49, -58, -37, -88, -31, -39, 0, 54, 71, -16, 78, 47, -26, 150, 27, 20, 36, 8, -3, 38, -50, -25, -16, -44, 14, -23, -23, -16, -55, -11, 26, -44, 52, 66, -31, 38, 56, -35, 85, -23, -57, -5, -81, -26, -55, -57, -31, -11, -40, -25, -12, -113, 40, 15, 10, 121, 16, 68, 49, -57, 38, 16, -63, -10, -44]
2459d4k2P1m1q5P4M8Ln5L8mK1L5JJ4l1jj0j7J03j10l0Q9j20L6j5j9J11p3m2O4
2489a1k3OP3%m1L6k3K3Pn7O4k1q3J9pj4M5o6J6M6nJJ3l3J07j04O8O5o9M0j5j9
2521C8j8L6m2lm4JON0p6L7pk8L3J8O8k8k4L8oj0Jl1qM9n2l6L8l5NOjK9m4kN5m6
2557c3K1R1o6%j1m9R5l2n8P8j9n2j8QK7k1l8J08n4J1J2L6Nk9l0O0K5m5MK6o3K0
2589Ij8qN5p5ml7M4QN8r7RR2k4qO9n1l7P5Nj6jj7P2j35K5oq5P7j3LJ8l4K7N4k5
2624IpL6m5N2J8k4O4o8n9P6m2n0L7rn4M5j1K4K1n8N8m4O4Rj9MJ7j2JOq2N4j4k1
2658b4%L0p9N4n4k1K9K9qN0L4l2j3K9%K9j0o5N6n0M2j3k0J4n5m5L3L8J4L0n2J18
2690H8o4J2k8M1%n7M0oL1k8j8J4l8K3l8K0K2l1m2O5l2N7n4l8P9OnPm8M5J0n7L2
$$ y = [-44, -66, 5, -36, -121, -47, 1, 4, -51, -13, -17, 4, 39, 40, 54, 23, 22, 12, -5, 98, -12, -42, 47, -73, -37, -52, -71, 40, -33, -75, -11, -34, -28, 45, 45, 4, 40, 17, 40, 47, -10, 54, 33, -50, -31, -38, -52, -7, -73, -57, -11, -16, -15, -2, -35, 72, -32, 36, 101, 32, 72, 57, 38, 20, 56, 14, 11, -33, -32, -26, 24, -52, -15, -22, -50, -17, 1, 69, 41, 17, 55, 49, 39, 40, 9, 1, 50, -2, -38, 0, -35, -30, -24, -25, 4, -40, -42, 13, -33, -12, 79, 13, 13, 2, -47, 48, 16, -42, 36, 17, -35, -53, -45, -18, -39, -77, 31, -23, -12, 0, 36, 41, 12, -18, 42, 67, 22, 26, 52, -11, 9, -9, -17, 38, -37, -41, -78, -34, -26, 32, -65, -56, 36, 12, 4, 73, 22, -15, 60, 65, 49, 48, 31, 103, -32, -7, -13, -98, -21, -34, -31, -13, -47, -20, 34, 9, 2, 38, -7, 45, 63, 39, 103, 35, -24, 52, 10, -40, -3, -12, -66, -21, -32, -8, 13, -45, 13, -31, 33, 42, 23, 27, 44, 32, 33, 39, -43, 11, -3, -24, -24, 6, -73, -19, -73, -94, -65, -36, -44, 6, 40, 8, -5, 24, 24, 53, 43, -22, 34, -16, 26, 13, -7, 7, -48, -93, -60, -22, -8, 22, -30, 88, 24, 36, 8, 49, 49, -8, 32, 26, 57, 29, 11, 25, -13, 10, -28, -8, 14, -17, -59, 6, -26, 31, -23, -61, 18, 24, 19, 26, -22, 23, 33, -24, 8]
2723HN8q3M1J4r9P4j8m4j0M7j1L4l4O0Mm0PMnQ6r2Ojk9j8N5o2KR6r5k6J12r7N8
2757Bk3O3l8j6L9m3N6%L9o4M7p5j2N5p1K3J9kJm3j3P3nl2qJ04j10J41p4J3Oq7
2789c5M0k0M4n7M8l5N8r5kj9Q0l1J7L0Nml5K7K1J5k9j5L0k6p2N0n1L7N3Rn0rk8
2822d9M7M0p0%R7o3K3N8l6J4l4n5J2K1k9k5K3n0O0j0L4l1J1k7L6n6L6M1m1R4m9
2853B2o4N1o6J5kj1Q4k7k8N2p6K1n6Q0j1J5NK0j9J2L9n9P0M9p1k8j7n3L5l1J0
2884c9M5n9j5N1k8M4O0n2j3K9M3p2Q7r0KJ9k3j5J04p3j6k3j8L3%M1p0P6m7l7O8
2915A2L7Mn0N2n4OJ6Oo1L6pk0O0p4P2k7r0J13o0nQ5p1j9R2o8M8J6o1L4ok2j2m1
2948e9K0J4k0l6N1K1J9m4J8N8r0PM3P1o8N2l6pJj5L1q7M9j9M5pk2L0n7L3j3k2
$$ y = [8, 66, -17, 24, 38, -61, 13, -5, -49, -59, -12, -23, 11, -23, 37, 41, 1, 8, 12, 7, 93, 1, 7, 6, -23, -41, 14, -48, -46, 50, -45, -71, 41, -56, 2, -21, 42, 4, -12, 27, -16, 40, 40, 79, 15, 62, -13, -25, 30, -41, -18, 1, -1, 0, -43, -56, 17, 12, -20, -28, 76, -34, 107, 33, 46, 52, -35, 5, -15, 29, -28, 20, -15, 43, -52, -54, -73, 7, -24, -7, 23, 28, 24, -11, 16, 37, 52, 23, 8, 38, 12, -60, -10, -61, -24, 29, 38, -12, -21, -49, -2, 38, -32, -32, 65, 2, 25, 83, 47, 61, 27, -28, -16, 5, -24, -49, -26, -76, -16, -26, 8, -23, -12, -39, -3, -59, -23, 18, -23, 71, 22, -42, 9, -57, -42, -44, -55, 29, 2, -26, 26, -50, -29, -85, -5, -16, -1, 4, 24, 5, 17, 56, -3, 67, 116, 45, 17, 0, -53, -18, -49, -39, 6, -53, -68, -17, -45, -1, 59, 7, -6, 23, 66, -6, 81, -9, -7, 12, -11, -26, 78, 5, -11, -34, -52, -19, -19, 22, -48, 28, -19, -56, 12, 49, 53, 3, 55, 1, 7, 23, 29, -32, 4, -3, -23, 37, -37, 35, 8, -82, 31, -29, -34, 51, -20, -39, 53, -15, 33, 49, -12, 22, 16, -6, -18, -59, -39, -25, -45, -81, -30, -9, 10, -34, -16, 42, -48, -41, 2, 73, 5, 57, 21, 14, 15, 0, 31, -56, -7, -26, 19, 12, -10, 20, -37, -4, -17, -39]
2980c9K3L5kl1J3onnK7k6J7Jp6Q8o5k2R1j6J7J1l6k3L5N9j00L2m1L3N0j4P1j26
3012c0j6N7j4o8P8o6K6Q1p1J06m4m3K7MJ0J0m6oK2k9j1K9j9M1n8P0n4oo4N3k4
3043e5Q5j6j9j7oP1k9K9q0Q8k0o9R3j1p5M5l0J9j4J4l9K0MmN4Kl7PL8l7K4j1l8
3076a4l3Q5j6J2Jl1n1M4l2OK5j1mM8rLj7K3N2r2j5Q7p7j6Q5n5NK5q8j5P8l1M6
3109A8l4K9J6k9k7M1K0k5o7K1L8K1m6jM7m4j3Jm1L6k2M7L8l4M6o2nO5L9k2J5n3
3141A3j0O2p9N0o7rN8j3l9O0o3ML2n3K5O7o9P4k0ml0jO6o4j3oO7l0J2k5k5L7K5
3174C2r6J06Ko0kN5l4K9n6M2K5r8P9QPl6QRK7n8k6N6j0rm3L9J3j2jM8M3k3k2l4
3208Hl5P9m2L3rp9N7o0L1R0p7j4QOmqj8P4n8NN0L5q8P0k7m7M1n7K2j3K9J1K6r3
$$ y = [-39, -16, 19, 17, -14, -1, -7, -12, -17, 10, -16, 1, 2, -74, 14, -51, -73, 18, 2, 19, 30, -6, -29, 6, 65, -35, -3, -44, -11, 39, 25, 96, -30, -46, 11, -3, -71, 7, -59, -33, 48, -23, 83, 39, -4, 23, 27, 37, 47, 1, -5, 17, -12, -23, 6, -13, 28, -30, 40, -14, -20, -84, -31, -55, 30, 14, -5, -22, -28, 43, 14, 43, -37, 51, 31, -38, 55, 44, -31, 14, -16, 3, -11, 3, -36, -16, -12, -16, 38, 40, 3, 10, 48, 11, 35, 24, -14, -47, 38, 22, 34, 35, 4, -47, -3, -35, -29, -4, -15, -19, 29, 20, 23, 6, 29, 81, -11, -26, 61, -16, -32, 53, -2, 3, 28, -60, -75, 3, -28, 18, -16, 13, 29, 0, -27, 14, 34, 9, -58, -37, 1, 22, -24, -25, 22, -22, -35, -34, -75, -39, -61, -14, 24, -10, 36, -26, -31, 34, 73, 51, 66, 13, 3, 65, -14, 36, -31, -40, 18, 5, -34, 26, -37, -33, -1, -54, -29, 38, -31, 43, 23, 19, -11, -12, 54, -10, -23, -29, 38, 8, 20, -5, -30, 7, 32, -64, 42, 44, -16, -18, 37, 3, 32, -24, 18, 43, -55, 24, 32, 39, 3, 11, 20, 47, -11, -37, 19, 9, 0, -43, -4, 9, -3, -4, 44, 87, 64, 42, 8, -27, 52, 10, 43, 34, -45, 12, -48, -17, 73, -4, -18, -10, -4, -8, -16, -34, 40, -18, -13, 37, 72, -16, 54, 27, -20, 21, -36, -14, -27, 2, 13, 39, -54]
3242e4pK8j0O9jj7j8%L3M3q7M9J3m4l3N4o2J3M4Nj1m9P1Kn2P2pj9J3m0nMj5J4
3276dL6p8L7J1k1k1N1p4L8Q1j28J2nR0jKJ3m7K0l3Pj7J6K9l3N4r3L9KO1j28J26
3308D2Lp5P3q1K8M6pO5q1qN0j03M0L7o9j1L4M0J7l7j3j3jl5M6j1oj6P8K0n4K0
3340A8L7k7n6L2j3M7L5j25M1kj9K3JL9j5O6j14Q8On2K8k1LM6n1j0K0l1k7JnK1
3372a6j1l4P4o1KK1K9Rl0QK3lj0m0J17l2rn6J8k4J5l8K6qpJ0N5k8qM2K5o1l6J
3406c7K2K0N7j09O0K0o1K4p2J12q3OPPm0M1N2l9N5q8N1J6o0N8k0j7K2o6K6oJ8
3437b4M%m4J6N5M2pj8m6P0j1k0Rk4m0P1n9K4J5j04Q5mj0K0J3l1K8m5P0k7ol5Q2
3470D9p0K4N0j08J08l6k3J4M0p7M7k5k3j4JN5K0r4R5j4n1L3qnJ6k5K7O2j2n7k9
$$ y = [-54, -61, -33, -43, 26, 25, 8, -10, -10, 23, 66, -21, 28, 41, -3, -36, 18, -44, -31, 13, 18, 7, -42, 29, 31, -21, 51, 44, 25, 38, -2, -7, -3, -18, -4, 32, -46, -9, 2, -19, -40, 11, -63, -25, 56, -72, -60, -65, 25, 24, 26, 39, -8, 12, -21, -14, -31, -15, 14, -19, 35, -58, -19, -17, 44, -84, 42, 45, -30, 43, -38, -10, 36, 29, 94, 13, 5, 55, -48, -8, 29, -40, -51, -17, 23, 40, 3, -10, -23, -24, -59, -13, -24, -30, -46, 32, 52, -2, 18, 55, 28, -28, 4, -9, 38, 73, -52, -11, -13, -32, -9, -8, 31, 16, 82, -32, 56, 62, 10, 38, 17, 20, 66, 15, 5, 25, -6, -33, -32, -37, -16, -27, -61, 13, -48, -46, -25, 4, 13, -17, -9, 14, 11, 1, -39, 78, 46, 37, -19, -1, -25, -10, -48, -22, -30, -37, -27, 28, 0, -8, 34, 59, -2, -38, -37, -15, 5, 62, -47, 13, 33, -28, -4, -76, 36, -47, -41, -34, -27, -67, -26, 26, -13, 42, -46, 5, 21, -39, 19, -1, -18, 4, -62, -36, -42, -24, -20, -20, -64, -48, 7, 49, 42, 24, -22, 48, 37, 17, 26, 2, -38, 33, -26, -2, 13, -91, -6, -10, -20, 0, 13, -18, 10, -35, 35, 8, 2, -33, 49, -21, 3, 53, -55, 53, 17, -6, 8, 48, -29, 18, -7, -30, -44, -43, 12, 32, -62, 33, 19, -32, 1, -7, -12, 4, -21, 6, 68, 56, -1, -30]
3501c0j0NmL9j2m4J0Q0m9J6Ql8Q3j6ll1K7j9poj0J6l8M7L0q2J2j9L7O7j05pP4
3534B1ll3K5L8mq3J5M0l6o3J05j8lMn2J2m1L6qL9k0L3L4J6m4o1N0L2o4K3Q3m8
3566B5n4LJ6L1k9k4M2k2k7L5l9M3Nk8M1J2l6N4j3m9lLL2Pl7J7N7j57N2M4qj2K0
3599AJ0N2l5p3N8oJ7K0n4M3L5j32K3Q3o9MJ3%Om2O4j8%pK8p1R8l9j9K6m9M3k1
3632a1l7J04q0QJ6o9L5M0M2n5K6Nm6N4m3LN4o7L8j5M8l6Qk7mJ0L7n0L2p2k5Q0
3664Cj4j5K6l6Q2m9m3O5L7l6l1K2l3K9J2p4M8J5l5%J6Oj9K0JKOL7m6j9l3J14l5
3697B3j0J1Mo1M7j7%l3LMj9M0N1k1p2N6j1Q1n1j1j8K7nj4M2k9m8MJ5K8Ko7N0o5
3731f4L1L1k0M2Lmm0K7PQJ4om7l4Q1J4o9M3Rj3j2k6L0k5j2N7l2l2Q4m6l5R1Rj20
$$ y = [-30, -40, -35, -39, 0, -12, -56, -46, 34, -15, 1, 9, -29, 54, 38, 35, 4, 31, 12, 5, -1, -11, 5, -33, 14, 44, -38, -26, -45, -8, 59, -46, -53, 21, 18, -15, 10, 48, 44, -39, -24, 16, -20, -83, 22, 4, 1, 5, -47, -35, -76, -40, -48, -9, -29, 4, 38, 54, 10, -51, -1, 31, -33, -10, 73, 25, -29, -26, -10, 21, -8, -32, 10, -12, -39, -4, -43, 0, 5, -23, 18, 30, -6, 48, 35, -14, -17, -14, 18, 25, -12, 5, 62, -95, -43, 1, -7, -19, 1, 11, 63, 28, -45, 13, 7, 24, 44, -10, 33, 68, -64, -41, 42, -27, -23, -10, -10, -4, -46, 18, 0, 0, -7, 21, -50, 48, 9, -10, 16, -33, 10, -11, -48, 56, -24, -16, 0, -69, -34, 6, 48, -7, 19, 24, -22, 32, -11, -8, 46, -21, 17, 2, 50, 14, 22, -5, -9, 1, 38, -12, 20, -52, -77, 3, -11, -26, 0, -36, 46, -3, -46, 19, 56, 20, -11, 11, -22, 7, 19, -55, -7, 8, -27, -27, -11, -5, -24, -4, -3, -1, 5, 42, -4, -23, -56, 58, 23, 13, 24, 28, -33, 14, -3, -3, -36, -33, -29, -48, -8, 43, 22, -50, 6, -5, 76, 25, 14, -4, 23, 18, 4, 46, 17, -31, -27, -12, 16, 18, -49, 1, -64, -33, -2, -22, 20, 23, 19, -21, 6, 13, 21, 35, 29, -18, -52, 29, 43, -26, 17, 26, 13, 1, -25, 5, -20, -32, 25, -7, -39, 45, -1, -36, 55, 64, -56]
3765e6R7n4j9N7q1J3QjJ5K9nl3QJ1J6k3p6J38m4P6j9q1O7l8pLqm2P9k9k9n3P4
3798gl7L6Oj8N4m5%QK7j2L2k9k6K4l1L3Mm8J2o1M6K4k5M7l1L4j2K9o9j0L2P3j5
3831D5p5K3M5j9Pl6j2L3m1l3J4pj8N7Kj0L8l1L4L0l4RL6l3m8J7K4m1%K0j2M7n4
3864b3K7j0JK3l5NN0l4J9m%l8JJ4m8L6L8o0O9j1n5l9N8m9K3N1n5L5K7N1k1n4N7
3897D9J5n9J0%m0J4K1pk8J6Pk1j1K8L6l3J6j6L4k4J7Pk0l0K6j8l7K8J0k5K3k0
3929c2pM8n6j3Q2J1Kk5j1J4pL2J0m3k3K0k9o8R9n5L3J8km7M8OqN1r9Q3q3O6oK3
3963C2L9l3p2N4L8q0L5J2q2N9j8l0O9l4J6k8O1L9q4j5N5qJQm2j2M2Lrl5NJ9l0
3996b5J0Ol9M0K4p1M6L6m7P4n2J2KL6j2Nm5m2J3pJ4J4l3Rk6R7j6l8L0jm1O6Kr3
$$ y = [-56, 41, -13, -32, 25, -56, -43, -35, -36, -21, 8, 3, -30, -22, -11, 5, -18, -94, 44, 0, 76, 57, -24, 43, 5, -2, 1, -7, -49, 30, 1, -28, -81, -7, -44, -8, -2, -20, 34, -11, -11, -3, 24, 12, 44, 15, -11, 13, -18, 15, 19, -29, -17, -78, -32, -8, -33, 14, -17, 17, 5, 34, -35, -45, -13, 60, 45, -30, -7, 38, 19, 26, -10, -22, 11, -30, -63, -49, -56, -74, -17, -15, -25, 13, -18, 16, 46, 12, 21, 57, 24, -24, -7, 17, -24, -24, -4, -16, 31, -23, 4, -6, -5, 18, -17, -12, 38, 4, 23, 19, 19, -19, -18, -4, -52, -16, 22, -38, 31, 20, -35, -74, -16, -65, -42, 9, -46, -11, 16, 67, 46, -8, 49, 64, 5, 15, 15, -25, -11, 10, 3, -25, -9, -2, -23, -34, -6, 30, -3, 13, -3, 31, 7, 24, 31, 11, -19, 7, -11, -48, -20, -10, -35, -12, -32, -39, 9, -47, -60, 22, 33, 35, 10, -1, 13, 6, 38, 48, 5, -18, 2, -27, -95, 4, -51, -18, 0, -2, -49, -1, 5, -3, 48, -51, 32, -51, 15, 9, 32, 71, 38, -34, 20, 58, -22, 13, 25, -57, 2, -16, -46, 23, -11, 5, -23, 38, 77, -7, -22, 33, 25, 26, 34, -8, -20, 22, 25, 16, -19, -14, 5, -25, -15, -9, -48, -8, 16, -55, -9, 27, -20, 54, 2, 14, 16, 52, 40, 45, 0, -42, -29, -36, -22, -8, -41, -32, -58, 39, 23, -15, 15, 14, -27, 39, 41, -52]
4030e2N5O5o2nNJ0k1m5N2K7o6K5k5JJ7jN4m5lJ02l9j13J21J4q0J0nKJ7q6O4L8
4062C1l4qKk8LN3k9L8O9l3mm8l0K6K4J0k0LMl2l4J0M6k8L6m6l8J6L3K4j1j0jL2
4096B6k0L2J6j3ol9l5M1o1N8Jkk4j2P3p8R1j38P3n3O7J6K0Qm2QO7l8n6LOj3M8
4129B4n8M6L7q2O3q2N5J2j5L3j3k1M0m9L4j8K9j5k7j6L4l1j4L2M8m0o0O8k4J3
4159CRoNQPk2J1k9L3K8l8l9N9l0J6j8L8k9k9M6k8K6l0kMQ8o7K5j2k6k9m7j3R2
4193Dk0o2M3NPmL3n2K7rK1L4j9N9p2K4K4j9k0j7K8j3RMj1m7J3j7L8l7J7L2J3k9
4227a3j3M0j7k6O6Pr7M3L6n0ok1%L2Qn0M5K5J4K4n6M7Ln5L0J8n8N7k7J4k8N4k1
4260B5M2j35R0k3q0P8KqL5r8N7M1p2K5l3P2J7m4Mj3JrJ9j3N9o2JRJ2KK9l8j3O7
$$ y = [-52, 3, 68, 6, 1, 6, 16, -5, -50, 2, 29, -37, -12, -37, -36, -19, -20, 34, -11, -14, 88, 49, -64, 57, 71, -9, 1, -4, -2, 15, -71, -7, 31, -3, -11, -9, -37, -34, 19, -10, 28, 97, 64, 60, 12, -18, 8, 32, 42, 22, 25, 29, -3, -37, -27, 19, -9, 27, -19, -57, -41, -8, 16, 5, -5, -6, 26, 6, 38, 54, 41, 35, -4, -39, 2, -59, -1, 0, -2, -26, -38, 35, -43, 48, -90, -17, -70, -3, 13, 33, 41, -1, 7, 74, 36, -20, -17, -11, -24, 24, -34, 12, 49, -33, 30, -52, 3, 15, 0, 33, 20, -1, 39, -10, 24, 6, 35, 20, -7, -23, 11, -20, -34, -2, 46, 6, -54, 14, -10, 3, 12, 6, 11, 19, 26, 4, 15, -14, 19, 47, 9, -30, 29, -1, 15, -3, 35, 6, -23, 23, -5, 21, -9, -11, -7, 81, 14, 39, 27, 1, -28, -75, -88, 4, -16, -78, -35, -30, -23, -27, 6, -46, -19, -28, -7, 27, 8, 67, -5, 19, 43, 24, 4, -13, 15, 2, 11, 15, 4, -43, -30, -47, -9, -46, -29, 3, 16, -13, -26, 14, -3, -29, 37, 44, -53, -10, 26, -24, -30, -51, -51, -19, -11, -61, -16, 9, 23, 47, -9, 38, 41, -14, 16, 34, -24, 33, 6, 20, -8, 46, 25, 67, -68, 22, -1, -81, -3, -1, -9, 26, -72, -15, 26, -46, -21, -54, 18, 35, -9, -5, -18, -17, -26, -7, -20, 39, -23, -22, -13, -1, 1, 30, -8, -21, 46]
4294D6r8J14p8j4N1J3l0%j0k1J4%j6K7plNj6L6l9OpM4K4j5k5L1k5K4l0l8J0%k4
4328e1N6M9j08mP6l9J1PJMl4P6Nl3m1Q9o7RjMnj2J6l9K5J6k2K8o2M6L9j1k5mj
4363bL9j1j4L8o4M3p5K1J7m5k6J3L7N8M3j22M6q8J23l6O2m1J2K8k0J6o2pJ8K1
4393B2K0l2k3j6J2Rn0J5J00k8q2Q1k0j4O4j8m1K1l2%P7j08J5M7lj2l5L1K2o1O1
4424B2n2O2l0K0n8J03j5n1O4o6kPrj8J3m6oM9jj7P7r4K9P3p9N1j4K1jj5J5Kp3
4457c9N7k0n1J3O0k1qK0Rk7MQ0o8k1P6n6l2l4P9n6L3mj4M0r2R1k2m1L0J2p7P0
4489inLL5Nl9M1K7k3o5K7O7k2l1L0Jlk4kk0K3o5%K9J8k0L8J7k0M7n3M2l9n5P9
4523C4m5k5QL2k8L5m7J6jMMK7J2J3K2o0j3K7J3PJ2k3l9O8m1n2J9k4J9L2n0K3O4
$$ y = [46, -52, 62, -16, -30, 21, 34, 4, 4, -6, -27, -13, -13, -29, -2, -9, -12, -7, -23, 13, -26, -20, -27, 17, 41, 26, 1, 32, 7, 31, 1, -37, -27, -27, -51, 5, 54, -54, -58, 18, -21, -10, -3, -2, 2, -32, 44, 49, 16, -25, 64, -3, 6, 5, 9, 4, -8, 8, -31, -6, 10, -12, 16, -46, 0, 39, 28, 3, -1, -2, 37, 26, 12, 50, -14, 29, -46, -25, -8, -53, -79, -66, -29, 29, 72, -50, -4, -92, 31, -5, 57, 16, 28, 56, 36, 52, -10, -17, 1, 22, 42, 10, -13, -29, -17, -8, -58, -43, 57, 29, -53, 28, 8, -6, 58, 40, -1, 20, -12, -12, 65, -43, -28, 19, 16, 4, -31, 0, 22, -39, 22, -30, 32, 2, 22, -36, 67, 52, 1, 65, -1, -3, 4, -5, -23, -10, -56, -62, -13, -14, -31, 46, -48, -19, 54, -25, 26, 12, 33, 32, 17, 32, 34, -39, 18, -2, -53, -40, 20, -1, -9, 11, 20, -7, -3, 77, 9, -12, 64, 8, -24, -58, 21, -35, -2, -6, -20, 20, -72, 19, -3, -44, -14, -2, -79, -9, -14, -11, 24, 29, -10, 31, 58, 35, -30, -3, 64, 42, 11, 41, 42, 39, 15, 13, -7, 16, -49, -49, -20, -2, -22, 16, 33, 13, 60, 7, 49, 10, -45, 34, -11, -36, -28, 4, -24, 11, -36, -20, -21, -17, -13, 14, 26, 39, 61, 1, -12, 15, 28, 35, 47, 24, -15, 53, 12, -40, -21, -45, -26, 6, -44, -21, 43]
4556D3j3n3M3j0J1RL1l9j7L1L3q1J3j1OOJ7o1l6P9k2N5q2QM5m9M3pj7N8J5o9M8
4589B7K0p1j2R6o5J3l1j5j6J3M8p7Q7n1N2m0N7m4JL4k7l6N6m6J4J0J5J7l7Kn8
4620f4J12k6K5k8Ro7ML9rlM0Kj1L4m3J8k6k2J8j8J9k1K6Kn7j0M0J0k7L4M8j1n2
4653a5L6K5p8J6J0K0K1o5K4m1O0l1J3j9J6J2k5O8n8KK9j8M7j0m8M1j2j1lK3k8
4684AJn2M7o5R1m1P1k0k2Mp2L0L9k2L2kNK1q4JL6J6M7o1jO0j34Q8m5PL0NmMJK3
4720C5k6J9k4%k1O4p7Ql1L0oN1r1j2M2mO7k4Q4n1m0ll4rj1Q3j7l2O0o5J2K0kJ2
4754GLm2QqN8K3j9j9N1o3K8K0l7K7Om3N7j8m1k6QQK1k3k7N2m3N2j2J8L3k0r2K0
4788c3O1l6J9j0qK8Lm2l2%J0K9J3lj6O9p3LJ26n2j6J8l5k6rP8m3Jpm6M0m4j1M8
$$ y = [43, 30, -23, 20, 10, 21, 30, 61, 22, 5, 36, 69, -12, 1, -10, -4, 2, 19, -42, -78, 1, -21, 34, -48, -40, 5, -44, -1, -8, -25, 33, 48, -21, 27, 47, -24, -36, 60, -5, 8, -23, -38, -54, -41, 7, -70, 17, -34, 18, -22, 35, -9, -8, 26, -1, -37, 19, -27, -13, -3, 12, 29, -8, -6, -64, 48, 22, 47, 19, 28, -39, -35, 4, -5, -8, 32, 34, 23, 57, 14, 32, 6, -16, 2, -16, 3, -18, 8, 10, -47, -57, -17, -7, -34, 0, 48, 37, -15, 21, 46, -32, -16, -6, 14, 35, -30, -6, -47, 13, -18, -5, -24, -8, 4, -21, 47, -11, -9, 20, 2, 49, 39, -9, 32, 20, 9, 6, 29, 1, 2, -50, -3, -68, 23, -18, 53, 33, 11, 15, -57, -27, 12, -10, 22, 20, 25, 46, -38, -37, -1, 15, 62, 1, 0, 60, -74, 14, -31, -24, 6, 11, 7, 11, 12, 35, 9, 28, 4, 4, -17, 47, -30, -22, -53, -23, -29, 22, -69, -81, -39, -43, 24, 0, 84, 33, -7, -10, -44, -53, -64, 19, 2, -30, 30, -35, -23, -3, -5, 7, 10, -32, -24, -32, 26, 49, 30, 11, 62, -1, 27, 47, 10, 37, 43, 0, 57, 39, -2, -28, -20, -12, 9, -14, -41, 11, -32, 20, 8, 26, 59, 39, -53, -33, 28, -8, 11, 1, -7, 21, 24, -18, -50, -50, -40, -11, 2, -1, -17, 52, -21, -18, 108, 56, 40, 58, 23, -3, -12, 66, 23, 24, 17, -29, 11, -33, -44, 4]
4822Dk1L0m4mk0L1j2L5j5KK5qk2Qj5N0J9o7K8o0J3K6J2moOL7l4J3M5o0J7J2K8
4856D9nLl5Rj1p0Q3l6k7K7mk3J8j1NO9l3J6Lk4O9m2m8K8L1m7K7j3M8j6o3L4j1
4889@l1nN1j1k2q%N8m1L5n8M0J2m7J0n0Q9o6M9n2P0Jm5OK0j8N3p3O6k0pL1l3J8
4923B2pJ6p9%O5mM3m5l7N2qj9Ql2J8M4n5l8R3m5O3op7L5j1j6N0j8n3P7p3K4j6
4956b9K3j0jk8P1n0K8lj4N8K8o4PM5o7J2j9%J4mrk0m3K9O0m2L7M0j20P2N8on9
4989fK8jj6n5J08q0L5l3O2q6J0K6j0oM8k8L3j6mj7KJ7N9pj6J5o3l2O0Nk0J9m2
5022a1j2N4n6m1R3k1kM6m8J6Pj3l8L5lm2J6P3q0N5m9J7MmL4j7p0N6K1k1J8L1q4
5055c6J7l8P3K0j6mp1P9l4L9o4N5m3O3n6oM8j8K9n1O7l1j5M9m6j5j9K7N4l6n5
$$ y = [4, -17, 13, -31, -35, -55, -24, -36, -1, -16, -14, 11, 3, -19, -11, -26, 24, 43, -24, 4, -56, -43, -17, -5, -9, -15, -9, 28, -6, 7, 52, -8, 9, 21, 49, 44, 47, 12, 21, 10, -60, 23, -13, -40, -13, -17, -40, -22, -33, -28, 41, 8, 24, 27, 3, 72, 30, -18, 10, 41, -6, 21, 8, 56, 40, -23, 11, 0, -31, -36, 15, 4, -18, -26, -26, 32, -9, 26, -32, 8, 20, -27, -17, -67, 22, -44, 5, -47, 23, 24, -21, -15, 5, -13, 40, -33, 33, 13, 6, 37, 4, 22, 15, 31, -48, -48, 17, 13, 56, 11, -26, 26, 18, -1, 7, -25, -7, 37, -18, -56, 37, -8, 55, 49, -28, 7, -4, -20, 30, 12, -41, 36, -37, -13, -29, -6, -16, -17, -45, 26, -24, 4, 1, -13, 45, 73, 9, 16, 61, -6, 6, -13, -13, 1, -3, -12, -32, -75, -46, 14, -28, 9, 49, -71, 1, 59, 53, -6, 22, 21, 5, -50, 58, -22, 13, -20, 42, -44, -34, -8, -18, -24, 24, -4, 29, 13, 9, -8, -6, 11, 70, 63, 47, 62, -1, -33, 27, 32, 12, 31, -11, -23, 31, -25, -66, 27, 6, 4, 50, 2, 18, 25, 12, -26, 9, 6, -36, -20, 53, -27, 28, -21, -4, 0, -4, 30, 13, -57, -1, 20, -1, 17, 48, -36, -19, -57, 16, 36, 20, 16, -55, 24, -10, 29, -35, 20, -23, 40, -16, -22, 26, 8, 37, -14, 53, 22, 7, 56, 10, -5, -24, 3, 57, 21, -34]
5086c4O2n6l9P1l9K3rqO1%rk0k7K2K0j6J3jj1n4K0RQn%L3l4M5m0k4L6JK4K8np8
5122c3N1j7k6J2LL8J9l1k0N4k2Rl5o2J1JM2K4pk6pK4k8K8%OJ5k3K6Om2kp0O3M3
5157B4j4k0k6K3K4m2PK4L2l0K7p9R1l8m9N8j0k0J4nm7PJK0J5K3j5NL6m5K9n9J1
5190b8J34j04oL4k5oj7O0q3L6K4J2pj8o5K4K7k7QR7n9jL0k0J1rJ5o1k4M4K3k6
5222gK3Ml5M2m8QJ4j5N3k7K4m4Jl1N5p2R0k5j1pM%qK6r9J00oK4Mjn1lL4L1j1p1
5258c5K1L2k0K0nl9K1J0Nm8O4l6rj1Jk0M5j6K4J1K0%jk4Qq0R4n6J4PlMj0L0m5
5293b7L1KL2op1L8rNK9M3k4o7PJ9j5J0k8K6k3l8Q4m6L8nK1k1qj1M5K3J5l2J7q5
5327c1RQ0l2l2m7K8rQ6n2l4N8p0O5k0J2nl4M6j4jLO5q3J2M2o0RJ5l8Q4j27M2N3
$$ y = [-34, 28, -28, -67, 4, -35, -12, -21, -29, 32, 32, 23, 3, -24, -2, 18, 2, 15, 14, 3, -51, -31, -22, -14, -19, -19, 14, -20, 25, -15, -39, -3, -2, 22, 50, 45, -33, 18, 1, -25, -13, -10, 28, 47, 16, -4, 50, 28, 37, 2, -60, -49, -48, -6, 18, 11, -15, -22, 2, -26, 2, 2, 8, 23, 0, 26, 32, -10, -12, -82, -19, 24, 10, -10, -36, -13, 11, -31, -24, 0, 32, 2, 29, -50, 41, 3, -46, 12, 2, -18, -4, -9, -56, -49, -48, -28, -13, 10, -5, 0, 36, -9, 20, -39, -28, 106, 2, -4, 30, 5, -1, -18, 42, -41, -5, 19, 31, 24, 6, -59, -35, -8, -35, -27, 70, 11, 10, 40, 20, 31, 22, 37, -24, -48, -4, 19, -7, 16, 20, -15, 27, -21, -13, 1, -14, 39, 12, 36, -8, -7, -38, 17, -55, 35, 10, -1, -8, -4, -4, -12, 14, -85, 15, 9, 33, 37, 36, -15, -18, 16, 47, 36, -35, -14, 18, -2, 18, 13, -26, -5, 5, 10, -38, 26, -10, -19, -30, -29, -49, -4, -20, 4, 15, 35, 35, 34, 10, 18, -62, 32, -24, -10, -3, -6, -2, -12, 18, -27, 4, 6, 38, 32, -39, -1, -10, -5, 24, 67, 43, -24, -17, 2, -13, -3, -31, -5, -28, -66, 18, -28, 10, 5, 26, 5, -3, -14, 31, 54, 69, 37, 54, -31, -22, 58, 26, -6, -53, -25, -34, 52, 0, -34, 24, -46, 19, -1, 11, 6, -28, 18, 4, 3, 6, 71, -12, 0, 42, -18, -9, 6, -32, 52, -75, -33, 20]
5360B0o5L6j%k3J1M3J4l6L4k8k1l5O0J6j17P4%Pj2K7N5nk5l6KK1pl9JR2l2n6J6
5394iK0M4o0L1j8j6j2L8m7P4m2J2o1J00m8J7l7K5l9O9j1K2o5J4Mk8L0l4jK1m7
5425e4K9M5q0J09k7K7o2N6m9nj0O7n1j0l2O6k3OM1r5M3k7l7R2J6l5j0M4o1M5J1
5456B9m5j0l5J03m0p6P2ok4J9J3L7n4j4n2R7m9J5L5rmj6NJ7kJ0k0m2K1M5K6p8
5488c2JM8n2NK5L5kj9l8J13r2L7l1O5n9ML2j4l1Lk7OL6m1M5k2q7J07l0K3l6l1
5520e9O6Kk9KM2O3q9P3n3%nj8L6l3M8k0n6l0J06l2K5p4N6l8J32j07n8M2N7n2L1
5551B8k9l6L1j4Mk9K5K1k2J3k7pP9Pp0O3n4M3q0Q4J7k8N4mk1m4l6J8K3K7j7lJ8
5584C4o6L9k0O8l1j5KL4o7RO1n1K5rn6M5J2o2M3K8k2J%k5j8L0k8Q0j8j7J6j2L0
$$ y = [20, -45, -9, -10, -10, -33, -22, 21, 35, -1, 33, 5, -16, -51, 9, 25, -92, -18, -18, -11, -23, 4, 59, 54, 29, -7, -5, 16, 9, -30, -29, 63, 31, -25, -9, 11, 55, -5, 26, 8, -8, -20, 18, -29, 45, 3, 15, -46, 54, 6, 23, -14, 11, -28, 41, 30, 52, -13, 1, 5, -23, 7, -27, -28, -7, -54, -25, 20, -60, 49, 22, 49, -13, 43, -6, -11, -21, 46, -5, -15, -47, 19, -4, 2, 43, -52, -9, -36, -73, 19, 35, 0, -10, 34, -27, 18, 29, -16, -26, -61, 42, 2, -74, -2, -8, -32, -13, 0, 37, -17, -31, -83, 14, -35, -20, 15, 6, 2, -14, -9, 8, 6, 16, -4, -46, -25, 20, 46, -32, -31, 17, -35, -30, -5, 30, 28, 9, -29, 84, -8, 29, -2, 63, 4, 8, 40, 26, -5, -2, -29, -23, 13, -28, 17, -5, -92, 15, -15, 8, -28, -59, 7, 9, -20, -18, 24, 87, -2, 71, 18, 18, 13, -5, 31, -2, 46, 26, -30, -60, 46, 14, 39, -35, 21, -17, 115, 8, -50, -8, 49, -3, 28, -1, -37, -6, -20, -16, -45, -20, 1, -21, -8, -35, -42, 37, 44, -26, 37, -17, 26, -54, 30, 47, 19, 73, 69, 48, 4, -32, -14, 9, 36, 19, 16, 34, -32, 7, -13, 55, 24, 9, 11, 45, -22, -13, 48, -3, 22, 13, -43, 2, 14, -48, -5, 23, 1, 2, 2, -23, -41, -11, -39, 41, 23, 6, 22, 10, 40]
5617D0j02Q1l9j5N2j0j1L2J5j1Nq1K6o7R5Jn8J2L4M1n2oJ5oM6j3m6J7mK0K8q0
5649d1M7m7M0K9j7m2k1J16n4pJk1Q7m6n8L1O3o9J8l9L5j9L7J2m5N2Kml6Ln9M7
5681ekk3J1mJ1K4K9j05L0N0j3rq4M0N5k3K0L8k3K7m7jPL6m6L0o5N8KJ5j2om3M9
5715B1m0N3k4o4J17p1N3m8L0n1M6j0k8O6p6k0K8j6N6NJ4o0Mj5P4r0Q1m4k6mK3
5746a6J8l3K2l4O2Lk2J3k6N8l6o2NJ01p2L4k4ML9k2J8p2P8L6o4N4Ok4J3n7M0j17
5778g7P1j3J3k0K9j9j0jP4j2l7Km2J13n7M6m9Rp2O3M4n3PJ5p0N5O7q6j7L5l7O8
5810C9q5O4%p5P1J7l9lk6l7M3L3k6M6j5j9j1k3N5O2o9K7p8K4MO9on1J1J1J3pK0
5843C9J4l6k7jML2n9j0O3m4PN3k1j2jj3K4m3NJ13m6r9P2j9j4N0l8Ko2R2J0j08
$$ y = [40, -62, 19, -20, -35, 17, 7, -4, 28, 43, 32, 37, -44, -18, -85, 10, 11, -47, -35, -1, 40, -12, -18, -3, -9, 37, 24, -22, -5, -9, 11, 39, -41, 6, -41, -1, 28, 11, -31, -52, 64, 10, 3, 4, -17, 70, 24, -34, -3, 60, -9, 9, -30, 5, -14, 23, 35, -10, 42, 44, 40, 4, 7, -52, -5, -7, -30, -19, -23, -12, 12, 41, -64, -34, 16, 3, -6, -90, -50, 5, -18, 2, 40, 17, 44, -3, -4, 3, 39, -7, 23, -42, 16, 18, 33, 21, 15, -28, 21, -19, 34, 10, -54, 63, -8, 45, -3, 27, -24, 22, 12, -16, 50, -26, -46, -18, -34, 22, 27, 41, -19, -15, -30, 44, -46, 35, -9, -35, -39, -16, 2, -31, -9, -43, 19, 22, 0, 13, -13, 45, 9, -53, -48, 53, -19, 15, -9, -5, 34, 12, 30, -42, 36, 72, 8, 62, 68, 44, 57, 0, 40, -77, -6, -19, -6, -26, 3, -16, -26, -27, 47, 35, -2, 0, -42, 71, 14, 60, 11, 20, -52, 11, 55, 2, 9, 24, -46, 9, 76, -10, -27, 8, -29, 39, -46, 18, 18, -57, 14, 31, -8, -11, -37, -74, -31, 2, -24, 22, 7, -12, -23, -46, 9, 71, 2, 29, -49, -25, -21, 48, 42, -9, 2, 13, 26, 19, 39, 53, 17, -10, -11, -7, 25, -34, -44, 19, -25, -18, 35, 14, 2, 1, -12, 12, -31, -26, 87, 41, -58, 14, -5, -19, 31, -7, -5, -67, 25, 35, -73]
5875g3P2j9l2M2k9j3N5%K9l0j9L0K2j8J3j3lJ9j4k6N4J6p7J4l0L9J6o1J4Nl6M9
5907dj3ON4q0J1O0n4m4Q0M5l0m9O3k6mOl0l5J25o4nPm1J1PM2m6j0k0R0o1n5L2
5940c2J5R0j25Q6n0lM1j5k0Pk0M8J2n5j2K1mL5l3L7K5o5R5p7KOl7L1j5j0J41j30
5972a1N0j7pk0jm8J9kJ3K2j7j6M9m4k8P4N6q8K4n0L4Kl4P0j5j5m0L7K1pj7Mj1
6005a3L1J7m3RK1ql3J0%l0M0O4l1r6R2j3K0m1L7k8O8q7Oo1O7J7j9Kpk8J1O5rN8
6039H8j3r6j5N1n1N6ll0j3J2M5K3n1K2k4l4J7N8o7N7j0j3rL8mm0M2k4j1J0j8m9
6071e6M2l2K3l7P8k1K2nm1Q9j09P6L5j1o8L1K9J3q1ONj3Mk6O9r5P9J8n3J0N4m3
6103hJj7K3OJ0k3L6m5k3Q9p0L1m8L5K1j7n8L3M5%L2k8j02R6M8p7J6j5qM5j6J4
$$ y = [-73, -1, -20, -52, -10, -39, -52, 3, 3, 32, 2, -17, 13, 35, 17, 30, 17, 14, 33, 19, -7, 47, 63, -14, 0, -30, 9, 25, -36, -22, -17, -53, -4, -17, -11, 43, -37, -26, 34, -20, -64, 16, 61, 31, -18, 45, 19, 15, 21, -9, -44, 81, 17, 12, 19, -22, -11, -4, 38, -8, -18, -38, 52, -9, -64, -32, -17, 73, -52, 34, -16, -19, 22, 7, -13, -6, -26, 22, 34, -21, -33, -12, -16, 19, -14, 23, 48, -17, 78, 1, 3, 9, -28, 3, -12, -22, 119, -11, 39, 22, 15, -5, -6, -54, -35, -37, -24, -2, -19, -35, 14, -30, -58, 16, 72, -16, 8, -42, -8, -6, -40, 30, 15, 0, -40, -3, 18, 11, -6, -2, -13, 18, 35, -8, 1, 22, 14, -19, -9, -9, -39, 1, 65, 34, -62, 30, 17, 37, -4, 33, 5, 73, -14, -8, -69, -2, 15, -4, -2, -9, -37, -26, 39, 30, 88, 75, -21, -36, 15, -36, 20, 17, -13, -26, -14, 31, 54, 3, 25, 1, -33, -16, 42, -25, 32, 22, 9, 0, 38, 34, -6, 36, 12, 1, 11, -7, -56, -14, -46, -23, -60, 18, -3, 19, 14, -27, 62, -47, 29, 64, 53, -15, 16, 45, 58, -23, -17, -12, -25, -21, -47, 22, -73, 6, 24, -29, -19, 35, -8, -7, -24, -1, 5, 15, -8, 28, -17, -40, 49, -21, 10, -38, -3, 18, 1, -57, -24, 21, 21, 53, 25, -77, 19, 67, -10, 6, -9, -17, 28, 12, 26]
6135B6K2m3K1l5l6P6K6o9n9M0L2oJ7K5k8k5K5P3j37N7J8jo6R3p2KO3q3P3k4k7
6166b2nO1j1PJ6p3L2k1J05n9m9N5n2M8n5M3Mj4n5O6%k5K6Nl2l0O9p0PL4L1l6L1
6199C1k5Qq9J03n2n2L2N1l5M5RMn4J5K6J5o7L7L1o3O9%k1orqrlL6l6k2N1pk9L6
6234A2L0K2p6l7M9R0m1l3m1PM6k9Kl4J00l4j0Lj0j8JK3JNJ3m4K3J5j6j7j5L6l5
6267a2K6nJ2K4n1K1nrrJ4o5j3R0n9N6k4K0rk3L0ojnj3K4M5j30N1L5n6NM1M1m9
6301ij7N0N8l6q2J21j10O4qp2L6m4L6J4L1k5oj1j3j2NL2k2K6J8m0N5n5K4rm7K5
6333b3j0P4j18N7LL6jq5%L7QL5P2o0l8J5J4L7j46J49n0k0kK9N7p3j0j7Q4r0J1
6364b5K9j3%pkM2k7%j3N2o7L4K4jk2K4l3O6l6m6L4k2K%mN4l9kk3O0k1l6L4k9P6
$$ y = [26, 48, 5, 26, -9, -45, 31, 57, -12, -71, -31, 1, -5, 12, 37, 9, -16, 9, 82, -55, 2, 20, 19, -47, 46, -26, -24, 39, -44, 29, 5, -22, -27, 34, 23, 30, 46, -27, 5, -16, 89, 30, -19, 36, -16, 32, -23, 20, 24, 10, -45, 21, 21, -4, 22, 27, -5, -35, 34, -36, -29, 5, 36, 0, 31, 6, 14, -75, 28, -24, -76, -44, 7, -28, 17, 26, 30, -24, -9, 17, 32, -35, 2, 33, -30, 39, 39, 18, 12, 3, -5, -14, -17, 19, -17, -39, 12, 5, -24, 12, 42, 64, -12, -49, 0, 90, 49, 16, -25, -18, 28, -1, 1, -33, 67, 33, 23, 26, 16, -2, -1, 22, 23, 28, 41, -3, 20, 35, 19, 2, -13, 23, -12, 14, 9, 21, 45, -6, 15, 10, 1, -8, 6, -59, -72, 18, -41, 15, -9, 11, 2, -21, 9, 3, 2, -3, -16, 8, 53, -77, -26, 9, -47, -42, -1, 40, -9, -26, 24, 82, 46, -36, 85, -25, 39, 31, -41, -5, -49, -13, 1, 32, 7, 1, -10, -23, -35, -30, 2, -20, 6, 24, -16, 39, -16, 8, -1, -48, -23, -33, 41, -77, -20, -17, 19, 18, -67, -67, -30, -22, 13, 85, 25, -13, 2, 16, 53, -93, 56, 6, -14, -16, 13, 70, -3, -13, -30, 54, -36, -25, 4, -9, -9, -16, -18, 24, -3, -3, -16, 36, -31, 3, 27, 26, 4, 28, -5, 61, 25, -21, 13, -9, -7, -7, -11, 43, 4, 2, -21, 39, 18, -18, 16, -13, 63]
6399F3l9k3kJ0m7O1Mo6J9L2j2L4k7Kkl0M3j8K3j04N8RN1n2jpJ8K3ol4n8K9N7K2
6433C0K8j12L8k3RM4K3Ko7K8j7O3m4qN5m6m4L9m9O7Kl6MJJk6K7o5N8ORM8o3M0
6467B2l5Mk5rM9n7N1m4M0J1k6QJ9j2j5L8k1Jj7ON3l0L3j1l2Ql4j9J0J34p6j8m3
6500c7L1j6K0%Nj4m2M1KK6j1lrK1nJ6n0O3l1Rkj7L8m2J7L1k1k3K7L5m9j7Rn0O0
6535A2m4J4JL8m0J0k8nmM4l5L0j9J11q6m5O5m5k6N4NJk4N3o8J1Q8n7J0o5NNJ8
6568a6J5jp1M8N3o7M3k1j3K9rM0k7Kj4l6R3j5m5j1j2K7L8n8l4M6j5L8N9o6L2k2
6600A0M6q3M0K0K2l4ql9N9j8l9P1l7K7m4K3J0NJ2q8J08Kn6kM4q9L7p3P9l4M4m0
6632b5Nk1N0L0p4PoR2l4K3l8krJ0k5N5j0l7jQj9L1k5K6Qkl4QJ3J1K4l3l8J4J8
$$ y = [63, 24, 1, -1, 9, -38, 23, 27, -39, -20, 12, 0, 34, 7, 9, 7, -23, 20, 2, 25, -79, -21, -12, 39, -13, -14, -21, -3, 20, 14, -20, -78, -49, 8, 30, 58, -54, -16, -39, -30, 14, 37, 39, -28, 0, -17, 46, 2, -6, 49, 3, -41, -2, -51, 16, 18, -18, -14, -13, -12, -38, -11, -76, -18, -12, -3, 45, -18, 22, -13, -9, -34, -43, 6, -51, 0, -44, -4, 7, -19, -11, 8, -4, -19, 19, -2, -1, -18, -12, 41, 11, 44, 33, 1, 9, -25, -44, -34, 100, 24, 6, -37, -6, -22, -2, -2, 3, -11, -53, -12, -10, 16, 5, 2, -7, 14, 9, 25, -25, 38, 7, 16, 14, -3, 35, -7, 10, 41, 20, -3, 24, 59, 10, -7, 2, -48, 12, -32, -18, -17, 21, -19, -9, -37, -42, -46, -2, -37, -7, -26, 85, -1, -46, 19, -26, -52, 2, 7, 8, -16, 37, -31, -20, 68, 11, 21, -44, -39, -34, -16, -1, -2, -73, -25, 28, -39, 4, -17, -30, -1, -10, 30, 3, 5, -9, -45, 48, 33, -12, -23, -35, -8, 30, -28, -62, -16, -31, 7, 66, 0, 32, 10, 56, -27, 13, 33, 55, 21, 13, -26, 33, 15, -24, 47, 10, 37, -7, 16, 26, 31, 43, -45, 63, 65, 9, 7, 51, -38, -1, -74, 5, -29, 15, -25, -20, -41, 9, 39, -35, -28, -34, 58, 24, 47, 9, 7, -2, 8, -17, 38, 28, -9, -10, -2, -21, 10, -15, 11, 19, 17, -17, -9, 4, 15, 39, 6, -32, -18, 0]
6667@j0J4k2lN7j05J13r1L6LN4Mn8J2KJ9Qrm0K5%J6m2M9o5O1l8k6K7lJOj6J6M9
6702D4l4k1L6J8j01L3K5k1N5j6J4n5N6n2j9J6nL4J9J1j8o5PL5Oj9J0j8M1M4k4
6733C6o2mL5O9o0j4J4K5n9K6N3j01lM6k7j3j6P6k9K6K6n8K0n6P5q5Q9l0j6Mk8
6764d1PpJ8M5o1O9J3o2J7L9j6NJ2o0K2L8j0j8p1L9O0m0O0j10Q1J6j04oN5lk4N9
6796B2J1J9r7K0OM4qJ6o2L8j9j0K3J8m0l0RO6Lk7J3k1P7n7m0%M9k1lLk6K8j0m
6830a0L4m0j7j2P0n1L1mK2n9J46p2l7J5l2O7j03N2N2n3m3L1M4qk0l3L7K2p2M2
6860aL1j3j6P5o5L7k2o7N2p0P3L2o5j6Q3r1NjO7K0o1JM7qo8M9K1l6MnNk7N9m3
6894a4M5j1r0O7k1qL5l1L6l5J4J04j05L3QOrm6kL0M5r5j2L5j4J2J6n8N3K5n3M6
$$ y = [0, -10, 4, -18, -21, 36, -69, 44, -47, -11, -8, 46, 50, -8, 4, 6, 25, 33, 24, -16, 9, 9, 25, -17, 32, -33, 28, -10, -36, -9, -12, -11, -5, -21, -5, 44, 10, -11, 25, 43, -58, -25, 0, -21, 34, 18, 32, -23, 33, -19, -38, -22, -27, 7, 26, 37, 19, -46, -39, -4, 2, -17, -7, -25, 16, 60, 36, -26, -30, 5, 74, 14, 0, 14, 39, -20, 6, 59, -42, -45, 1, -26, -39, -55, 21, -8, 18, 44, -14, 6, -50, 25, -60, 29, -1, -17, -13, -41, -34, -41, -23, 22, -39, 30, 43, -19, -2, 37, 21, 26, 38, -22, 0, 38, 28, 10, -61, -22, 38, -2, 58, -52, 29, 45, -59, -65, -10, -13, -37, 22, 33, 52, -45, -25, -19, 25, 17, 33, -29, 9, -10, -20, 3, 21, -19, -49, -40, 26, 29, 2, 15, -6, 71, 14, -26, -26, 23, 2, -1, 2, -24, 4, -6, -10, 24, -16, -33, -45, 25, -26, 5, 1, 23, -36, 110, 38, 1, 16, -16, 51, -52, 0, 52, -1, -44, -13, 31, 23, 3, -30, 7, 29, -43, -1, 30, 17, 1, 76, 11, 48, 26, -41, 11, -59, 14, 46, -19, -35, 48, -43, -38, -39, 28, 48, -13, -12, 35, 27, -41, 8, 29, -7, -3, -8, -3, -30, 29, -14, 31, 20, -70, -3, -24, -32, 3, -28, 8, -27, -13, 91, -14, 19, 27, 33, 24, -22, -24, 6, 51, -44, -56, -21, -35, -23, -7, -65, -12, 13, -40, 6]
6926Fk2J9j6j8K0n3P4j9J5K0m0L6m7L7oNPj7J9j8n0O8k6kQ4j61Q6k1k0P0M5j16
6958d1J7L8l1%%K1l3M5m0j4M2l6J6N3o0K6m0J0OkLL6J3Rq4R1Qq1P9l3Lk2K2k4
6992cK4K8j11M2L1k0nM3n2P1n0L1j6j6j5j7O1Om2l1oK2K9k4K4M3j09J00Ql4l5
7023b3L5m0K4N1j03P5M1q9Q2kq3R2m2l8M1l9K4K5j9Ro6L3RLK5k7j1k1N6nl5KP9
7056F3q7L8o6R2j7M8n1K5k4j6k7l0K9N7k9j9jRj0k6P2o2M2RPj8L9p1P8j3p5O5
7088C1m4j6M7n1P1j1o7K7j4L0j6J8mj9J4k7Nj5M3J2K7j1p3L3l6N7m1J6M5m0K8
7119A9n9J6K8jJ0jl2K5Pjk8N8rRk8K7q0N1m5L9o7O9n0K3M9m1K3k9N6m7K3j7OK0
7153B3Lj3N1n7j6L6l7kMpL8J9m2KJK5K2m0M6n3n2L1J1RKN0l4k4k5M0on7N8K3M
$$ y = [6, -16, 3, -13, -31, -11, -64, 10, -9, 6, 26, -14, 22, -25, 12, 6, 11, 18, 1, 20, 2, -48, 20, -6, -8, 76, -85, 1, -20, -40, 30, 75, -41, -24, 14, -17, -17, -17, 4, -29, 16, -24, -38, 4, -32, -16, 37, -23, 3, -37, -27, -21, -23, -20, 16, 29, 38, -46, 45, 53, -28, 51, 18, 21, -1, 21, -3, 21, 49, -62, -20, 11, -9, -14, 29, -23, 48, -2, 29, 13, -3, -18, -35, 26, 32, -10, -41, -47, -25, 4, -20, 4, 47, -62, 38, 46, 12, -23, 12, -28, -4, 47, -56, 19, 60, -29, 53, 51, -32, 60, 18, -20, 21, -18, 6, 31, 12, 21, -45, -12, -3, 0, 25, -2, -13, -34, 22, 17, -18, -16, 63, -24, 14, -52, 40, 23, 71, 20, 45, 21, 5, -22, -52, -23, 34, 5, -14, -15, -6, -16, -42, 30, -32, 10, 19, 26, 8, 47, -24, 54, 41, -34, 31, -13, -29, 18, -33, 38, 27, -40, -13, -27, 3, -13, 5, 1, -18, -4, -31, -26, -41, 2, 14, 41, 30, -43, -10, -46, 11, -30, -14, 31, -9, 19, -40, -24, 4, 3, 13, 12, -20, 5, 12, 11, -17, 41, 32, 41, 13, 40, -40, 11, -34, 5, -62, 7, -43, -20, 29, -12, 11, -18, 38, -9, 14, -3, 3, 23, 26, 13, 64, 7, -9, 27, -10, -12, -8, -15, 23, 42, 0, 2, 3, 28, 50, 10, 56, 3, -49, -18, -7, 2, 4, 54, 20, -4, -29, 11, 5, -52, 6, 29, 33]
7188C3q0LL4P5o1LN8r6K1o3O7j7M8K7p8oN9m3J7j0K6Mn3R2l3n0J2k7k2M4kmN6
7221C4n8P8r7Q2p4kP1l7mk8l3P9j8kJmLM9k9n2P6J3o4L2K6o9L8k6M1L2k9Mm9j0
7255b6J1j3R4l4m1k3kjPO5Kj16J20l2J8j8l4J4O0r4K2k9M0j6J1l9N2%OO7p3N1
7287D9q6J9N2j3m0kR8o2%j1PN5r4L6o3O2k3N4n5J7J0%m4M1mK4j3m6N4l6k8K3m
7320b3M6j1Qj9J0JLj1J0L3k2n0M4ML1o3M4m7O4n0lml1O1j4l1j1rOJ3j9j9nN1J1
7355bnlM1n8L5mm6O4k7n1N7k2MJ2K7l5OJ4nJ6lj3Nj6k3j9L1NmM4k0L9k7m6O%K3
7392@J0qJ2j1lJ6l7QJ5J7%j1j4K8j3M3Pn0L6n5M2n4L5L9p6N1l6J7M1n6L6l5qM3
7426B9N7o3j7k3j5J2N9p8K2K%O1q8O5l8J2Q3j04J9K2o9P5j4o7R9m4MK7k6M7k5
$$ y = [33, -47, -44, -10, 65, 4, 7, 65, -31, -10, -73, -6, -23, 25, 52, -26, -32, 27, -16, 1, -9, 17, 21, -32, 60, 27, -23, -11, -38, -60, -16, -18, -22, 34, -24, 54, -43, 39, -35, -37, 34, -3, -7, -35, -68, 11, -7, -9, -8, -12, -9, 40, 11, -41, 35, 48, -16, 16, 42, -27, 11, -15, 26, 58, 29, 33, -16, -26, -15, -28, 66, 32, -9, -32, -34, -35, -28, 37, 39, -77, 43, 11, 29, 11, -23, -9, 51, -43, -21, -50, -10, -26, -15, -54, -2, -2, 4, 71, -2, 49, -37, -18, 34, 21, -19, -21, 77, 15, 15, 4, 11, 66, -28, 8, -55, 7, -16, 38, -17, 0, 10, 10, -34, 7, 3, 27, 14, -32, 22, -14, -42, -19, -23, 23, 12, 20, 1, 11, 12, 15, 4, 14, 47, 25, -25, 19, 23, 54, -9, 35, -12, 52, 2, -1, -5, -36, 25, 11, -20, -31, -40, -34, -21, -40, -59, -64, -13, -2, -7, -10, 31, -27, 8, 4, -42, 22, -5, -56, 1, -21, -17, -5, 22, -13, -7, 7, 2, 18, 15, 2, 7, -9, -32, -51, -20, -15, -19, 25, 5, 44, 17, -29, -23, -23, 0, 10, 2, 14, 3, 0, 16, -21, -13, 2, 19, 19, 8, -6, 22, 9, 52, 59, 9, 45, -10, 32, -22, 13, 52, -24, 27, -9, 8, 49, -7, 29, -6, -14, 29, 86, 23, 6, -17, -32, -20, 39, -39, -17, -15, -15, 46, -42, 23, -15, -3, 80, -24, -5, 17, -52, 23, 9, -58, 41, -3, 1, 28, 2, 49, 24]
7457B4j7l0L8K8p8P2pn0J0l0K0k1L3nK9m8L9K3l7m4O2K3j5l6l7K2O0l5j4K6J3
7488A8r0N4Ol3R4q4L5oL8l0j8L5K5l3j2m2L5pj4O1l1Pj0n1K7L0N0k5L5m2j6L6
7520D2m2j6K0j6NK7qj5n7P5o7K1l1R7r0L9OrP2p8O9q6N4K7J9m4n4mQ1m8J6j3L0
7553B2j1k0kN8j7o7O9Pko8k3Q5m8L1p4L7J8rj5J5M3m3N1jjl8K0k0J5J9pkk1l5
7587c4N3n8J02q4k6M8J7o7M7%l2L1O5n1OLJ2j4n7rL2L6m5l3R1k8m4Jk9P3oKNk2
7621a5J2LK9o3LN4n7O4l9OJ8j4k3O8o7qk3R1rn2kL0K0p7N7jm5K3m5J09o5lk0K9
7655a2J7m2JJ3M9rj9k8O2k2NRo9O8Kj6Nj3Nn0O3Nk2p6J19m1nnL9o7O5l8Pm8JL5
7691a2K5l0J1l6J12r6Mj4R2n8K4k4k4J9l9M7K5Qn1kM4J0oJ8q3J00q6P7l1j3J3
$$ y = [24, 7, -23, 15, 43, -35, 37, 30, -20, -10, -40, -20, -41, -8, -13, 16, -32, 7, 30, -7, -51, 11, 34, 19, -17, -54, -32, 28, -7, -21, 5, 18, -72, -18, -12, -45, 49, -35, 0, -6, 32, 2, -16, 19, 44, 11, -1, -43, -8, -15, -29, 32, 1, 8, -2, -53, -26, 4, 54, 29, 64, 22, 6, 42, 0, -16, 4, -12, -7, 20, 12, -3, -60, 15, -52, -31, -62, 35, -55, -16, -10, -19, 53, -25, 44, -42, 12, 39, 58, 14, -40, -44, 37, -11, 5, -8, 22, 11, -9, -11, 47, 30, -37, 32, 39, 37, -31, -54, 31, -17, 14, -60, -23, -5, -14, -29, -14, 29, -14, 37, 36, 35, -3, 17, -3, 12, 31, 24, 22, 1, -34, 19, -39, 63, -21, -47, 1, 18, -49, -2, -2, -34, -3, 62, 11, 17, 20, 32, 18, -39, -48, -16, 20, -25, -58, 33, 5, -39, -38, -67, 6, 0, 2, 7, -15, -3, 0, 29, -34, -31, 23, -34, 30, -9, -3, 15, 1, -22, 46, -21, -29, -52, 39, 30, -22, -24, 6, 26, -51, 6, 5, -40, -17, -62, 47, -18, -21, -41, -12, 5, -37, -36, -23, 26, 17, -2, -30, 32, 10, 15, 24, -45, 23, 25, 9, 14, 1, 6, -44, 19, 24, 2, -74, 45, 4, -1, -6, 33, -34, 31, -7, 0, -48, -47, -12, 13, -17, -6, -42, 70, -26, -22, -36, 56, -2, 22, -2, -26, -7, -46, 1, 26, 34, -17, -19, 25, 35, 29, 47, -36, 64, -22, 55, 24, 11, 24]
7722B4j8k0K1k8K2J5j4K1l4k0Q2m4kN4j7rm4lnJ1J5j3PL7n4Lj8N9m8K1j8j0K5
7755bl1P9m8qK5l7M0%K6Pn7M5j8J7nm6j6M5Om0K1k7JN5m1J7p0M9n4O5Qk1jK4L1
7790C9j8RJ1j2j6K5k0M6j3J9l6K0m1k6J5l9Q6p8n0Q2K0j4N7q7L7kj2k8L9K6m6
7821gmJ1jn5P8j1j1Rl3O1n6j0KMK7O1o8L7L4r2L7o7M9l3Q2Kp6J6mPPJ0j7O3p9
7856b7K4O2j07R6%l5PL1o1O5m3J4j4jpl0J9j7N2o0lP1p4L6Op2Q1l0M1J8n2J1k4
7889b3j1Rk0L4J4K9l2L7Rp2K2L2l2%m2M9J0p2Q1J8m0k8m0J20p8M9j1K8K7p2Qk7
7921b4J8RL9k9j2mJ0j0M1Nm7l3L4K6q6K7MJ1J7Q3o5l4K5K3k3J0n6j5J4M1l2N1
7953A8l1n6J10j7j4M8qr6L9k0R9q8oKl3R2j0k4M5o0J8J0Oj5j0M5n4j4K7j4oJ11
$$ y = [24, 6, -14, 7, -21, 1, 16, 2, 23, -11, -31, 51, 7, 5, 59, 42, 33, -11, -14, -19, -8, 7, -6, 1, 38, -16, -13, -31, 28, -20, 1, -17, -27, -2, -33, 46, -2, -10, 15, -22, 18, 18, 44, 51, -6, 39, 21, 38, 33, -13, -29, 16, 22, -18, 3, -24, -23, 32, -9, 8, -62, -13, -67, -2, 6, -15, -16, 8, 39, 21, 30, 41, 29, 13, 38, 18, 64, 51, 70, 34, 54, 13, -13, 2, -37, 49, -29, -79, 3, 23, 9, 66, -21, 16, 14, 2, -26, 13, 39, -7, -11, 0, -1, -56, 22, 11, 0, 9, -24, 37, -19, -29, -27, -23, 4, 65, -3, 34, 68, -24, 13, -54, -5, -38, 44, 46, -30, -14, -18, -11, -4, 6, -11, 52, -27, -3, 59, -48, 48, 48, 13, 20, 51, -10, 55, 12, 26, 12, 11, 4, -26, -7, -24, 28, -32, -35, 36, -38, -2, 4, -68, 13, -17, 24, 42, -10, 1, -23, -34, -25, -45, -11, 3, 32, 0, 37, 46, -26, -4, 28, -4, -4, -46, 3, 13, -59, 22, 40, 0, -28, -68, 52, -26, 23, 12, 40, 67, -5, 3, -24, -6, 3, 42, 13, 1, -3, 7, -3, 38, 43, -4, -37, -3, 23, -63, -36, -32, -21, -4, 79, 14, -20, 5, 28, 5, 15, -41, -56, -42, -1, -33, 18, -13, -69, 41, 24, 10, 58, 50, -46, -7, -27, 72, -16, -22, -20, -53, 39, 29, 5, 50, -10, 8, 18, 24, 9, -1, 44, -10, -24, 3, -11, -17, 94]
7985I4j11M1n7M7k6k2O8k9QL0m0L3k4j9K6m6LRN5j2n7J4m5O8O1n8Ro1L5Q8p1l
8017HJ0m6J1MM7o7K7Lk1L3K3Ko0J8l1O0qok0J3O6k5p5K4j5n7R1K3k4K2j07K0R0
8050C3j7l8J5K6oRKL3n3K1M1j04M0nQ1j34Q3l8J6L7n4j4O6k4K1j4k9J1M5q5j0
8081d5M5MK0o1O3pk2K1o9Q4l9kk2l9O5O0n2JL9J1o8k8K8J1k1L4Nk8j6RL3M9m8
8114A5l2jn2J03j0Kk2J8m0qpJ0Q0j43R9J4%J0n6N5jk8p1O0j6j4L7j6K6l8K8Q8
8146I0k3l3j1K0j5km9M4k1n3K3K1j6j9J3K9m0K3Pl0M2j4L2l2K4m2rQ5r6R3Kl1
8178A2O0k6q6nO4J4n1K6N4Rj2p2j5
$$ y = [94, -17, 24, -33, 14, -12, -34, 34, 5, 13, 43, 3, 36, 12, -7, 19, -27, -24, -15, 40, 28, -29, -15, -60, 8, 69, 11, 20, -41, -6, 82, 11, 8, 18, -28, -17, -13, 34, -33, -6, -3, -24, 9, 32, 34, -26, -8, -39, 21, 13, 7, -13, 0, 66, 41, -34, -10, -25, -82, 9, 32, 8, 30, -77, -57, 33, 16, -22, -7, 19, 13, 22, 24, 57, 4, 25, 66, -38, 2, -3, 78, -56, 27, -11, 5, 42, -12, -26, 40, 16, 37, 23, -6, 5, 50, -35, -45, 0, 4, 24, -37, 26, 19, -3, 18, -51, 33, -6, -8, -30, -69, -4, 56, 4, 5, 44, 55, -13, -41, -13, -2, -23, 11, 16, -12, -28, -19, 14, 63, 15, -17, -18, -70, 33, 23, 25, 3, 21, -19, -27, -34, -24, 56, -87, 12, 26, 26, 36, -20, 35, 34, 6, -65, -5, -21, -35, 2, -14, 12, -26, 2, 90, 67, 34, 23, 43, 28, 26, -23, 21, 0, -53, -30, -9, -25, -44, -31, -2, -42, -19, -12, -42, 0, -14, 18, -14, 10, -32, -41, 44, -52, 41, 43, 12, 72, 46, -40, -45, 19, 33, -18, 8, 62, 71, 59, -13, -28]
8191b8
$$ Imaginary data points
##PAGE= N=2
##DATA TABLE= (X++(I..I)), XYDATA
0@%%%%%%%%%%%%%%%%%%%%%%%Oj4J6j6J6j6J6j6K4l2L2l2L9m7M8n5O3p0P8q6R4
44D8j03J17j30J41j53J68j87K08k28K51k79L09l41L80m26M76n37O14p11Q34r98
65e47J235j601K250l757J4583K141k4582L074J2778L580j1942m682M820K750k400
80b300L385m67n340r07O945M281m243n956M730N540k317k709R84j047j459Q85
96EK481k294n927J745O535k012n040J571M409p8l089J585L973k378k716L413J435
113C618l364j627K411R83m266j665N394P69o599r82O716L089n961m045O663M892
129F026n452l791M298L047l029l436K111K738k786j982J725K05o57O95K06p13
145g95p35J843K377k315k461K490J953j495j624N24J349j837j212L364O10m397
$$ y = [0, 0, 0, 0, 0, 0, 0, 0, 0, 0, 0, 0, 0, 0, 0, 0, 0, 0, 0, 0, 0, 0, 0, 0, 6, -8, 8, -8, 8, -8, 8, -8, 16, -16, 16, -16, 23, -24, 24, -31, 32, -38, 40, -46, 48, -55, 62, -68, 73, -80, 88, -99, 109, -119, 132, -147, 162, -179, 201, -225, 251, -286, 328, -383, 451, -547, 688, -913, 1337, -2420, 12163, 14304, -10278, -7204, 5574, 9154, -2788, -7470, -2650, 100, -2300, 1085, 618, -4722, -5629, 1316, 5597, 1354, -4602, 128, 5668, 3351, 642, 1626, 579, -880, 5, 2486, 192, -5735, -3990, 2545, 533, -4507, -2936, 1473, 1395, -1694, -109, 3864, 1486, -1230, 2183, 3618, 254, -1373, 1038, 2021, -2245, -3910, 1484, 2253, -4346, -5328, 1388, 4477, -1484, -5529, 1134, 6026, 574, -3217, 1081, 4128, 1099, -2337, -226, 2512, -274, -2256, -531, -326, -983, -288, -82, -795, -1530, 313, 2690, 375, -2086, 404, 2357, 862, -762, -238, 1111, -726, -1938, 1426, 2036, -2361]
161b361j067M173K904l133m032K339L820r86j680m69p17P41J816N47k419l410
177c934K394M998j579m529n4L677K078k686j884K385K96j626J004P54j255j568
193a529J06K379j45k730M04J278j30P79K30p62k63N08J908K18l005m0K392l48
211A250j622q60O72Q94j686n11K210m21j794R37J718O64j402r14K141Q17j343
228G50Mk12o23N13ln85j223o26J834P14k408k97J950J135m07j437Q71K069q10
247A209q35O60j4l86l27k53J69j041n51J164l97r70O43L93J49O3K38R66l21p54
267a95J386O49j146o36R5R11k40j871J01R74n99l90R2R7L55k16M45Q38p73KJ147
288A026j76m00J1p1L06o39m08Q73o83r20O99K25p7m26m40J231M20r79K73N06L8
$$ y = [-2361, -3428, 745, 3649, 516, -3516, -1177, 2643, 1657, -23, -492, -1209, -468, 1348, 1895, -524, -3934, -1540, 3458, 1879, -2650, -2704, 973, 3051, 365, -1519, 866, 1162, -464, 540, 1294, 39, -1529, -1423, 956, 811, -1919, -1515, -237, -367, 412, 642, -120, -383, 125, 2033, 2251, -754, -794, 1598, 1250, -372, -1232, -560, 334, -1352, -1863, 347, -74, -1868, -931, 787, 1451, 49, -865, 1276, 2093, 750, 754, 542, -81, 432, 429, -156, -1379, -2005, -171, 543, -1865, -2162, -212, 923, 516, -921, -50, 2019, 1209, 374, 1034, 1020, 634, 307, 54, 223, -818, -1369, -205, -602, -1572, -929, -536, -387, -324, -86, 880, 559, -195, 1191, 1840, 694, 58, 153, 1064, 824, -1047, -946, 28, -571, -961, -869, -772, -417, -633, -188, 650, -123, -121, 1026, 850, 450, 461, 390, 696, 57, -351, 522, -161, -1081, -382, -157, -234, -660, -1100, 131, 551, -428, -155, 351, 389]
309C89J44l18N3L48p73L20M62j009l3N51j40o3m76K06P44p49j99Q67l44j51K88
330A17j97N25m05n66R01M9o41M16k11J00L47o71L53K40p71M50K73p64J90J00M0
351a25J43p35L32Q27p45M2N71k36M12o7l57N97k53m48O27m77l44J76m89L79k0
372a90p67M71K43m27P42Nk98M62P9M91J36j006K79O31l58k04n24m76P45j62m98
393f26L9m80L77P28k72M0J28n2Q59J05m75K83j29j37L52n63k62j5n57K87O4n11
415h17L47j73k29P25K19l9J50l30O36P05n36j53k15k05N87k72n89j78m94K18Q80
436B37n60n72k02N00J286j99j120M03O91M35M1r05J00N60l87n6p2n06J55l75p8
457f24P21m18m43M13l8M94K67n79K72K62k36O04p3l78j22n65O46Q96j078j032
$$ y = [389, 533, 215, 268, 616, -157, 163, 625, -384, -417, 134, -6, -69, -545, -339, 405, -344, -543, 324, -20, -171, 117, -80, 445, 40, -526, 375, 424, -217, 199, -12, 88, 435, -236, 117, 357, -414, 36, 309, -455, -265, -165, -125, 18, -717, -385, 442, -303, -261, 310, 74, 486, 419, 62, 659, 406, -42, 585, 108, -236, -60, -549, -170, -190, -957, -486, -243, -670, 72, 77, -221, 241, 320, 811, 947, -59, 220, 851, 493, 289, -235, -711, 34, -128, -626, -587, -1067, -690, 38, -234, -194, -66, -118, 741, 846, 371, 654, 525, 388, 740, 177, -85, -100, -657, -370, -306, -817, -470, -643, -872, -147, 72, 33, 183, -147, 489, 1194, 658, 505, 290, 85, 672, 400, -189, -367, -861, -643, 237, -323, -895, -1097, -597, 689, 490, -630, -227, 464, 899, 940, 35, 135, 695, 308, 252, 180, -326, -171, -546, -624, 97, -321, -764, -351, -389, 105, 372, -207, 65, 327, 91, 695, 622, 244, 122, -443, 203, 1099, 21, -1011]
477a011L07O72Q21q66j355Q36Q49J33J6r45j6Q41J53L67k66j210L93R85J69m69
497D04j328J72J513k56r66o1m5O65P4q02O46K17p12J56L99N08J89j271K3J314
517H39k9m08m61l41O42J05n07L48n63o47O59N81K32p95j228J149J738m84j177
536c47n44R03J594n97j338jL42O59N8j110k65R5J43O30k39r08R6M57P33K23r43
557c59J46Q65n9o7j71p6M04n36o43Q04Q3o67n50k01R98K93q72j16L26K44N79q2
579C43k11N0k10O10P08p44p98j81N72Q48q50j439L13R48M55m96j244M82J268P0
599D94l55m82J41J091k22o12M75j86k47J49k67J78k20o55M63J12n17L95L0o8K55
620d8k88M17P35p41j84M58R9L44n01o19M63O1k84L89p79l26O39Q6J59l66o83Q14
$$ y = [-1011, -704, -32, 789, -77, -1432, -596, 253, 386, 402, -543, -559, 282, 435, 802, 536, -674, -281, 704, 873, 404, -924, -752, 761, 505, -461, -522, -567, 98, 172, -630, 16, 233, -479, -323, 76, 584, 773, -498, -475, 839, 810, 402, -59, -400, 242, 347, -160, 188, -375, -1022, -363, 218, 450, -345, -1573, -424, 1314, 830, -347, -891, 12, 1606, 1009, -329, -330, 12, 671, 729, -381, -646, -551, -408, 222, -17, -925, -829, -372, 361, 584, -359, -213, 652, 593, 526, 355, 279, 683, 147, -496, 308, 391, -276, -826, -1027, -29, 264, -608, -724, -398, -154, 425, 343, 132, 182, -28, 582, 1290, 546, -252, -433, 139, 987, 137, -1302, -989, -41, 414, -82, -1326, -844, 424, 494, 139, -343, -202, 889, 667, 55, 530, 344, 97, 246, -21, 157, -63, -718, -255, -143, -660, -265, -235, -303, -48, -336, 81, 816, 75, -109, 349, 448, 792, 291, -328, 135, 196, -88, 301, -478, -804, -165, -79, 80, -286, -969, -155]
642a55O52l17q5l79O9J045j97n52m8r6N69K9q94J49K24k23P8k58P3M73p06l7Q73
665B87j03k74q5O9O96j01o06L62n6o5L50l46l29P2k22L70j8m97R9J99r5L44j61
688a10o5K12j26M48L16o53r7M45J29k3n62j83N54j57k88j8m02J91L51k03m0q6
710c67J38O41k77l88N60J73n9j1m00L20M2n27K19J2m25J11j57J54J72n43R6N59
732D3j49J68Q9k20M69K1j03K25n15R8M77m54k48k3j64K91k61m08M29Pk17L92r7
755a50P1K45k70N17K01n49K66Q0k41J94k32l28K26k98M7J87o45J79N15k69P7l
777a80o4P06k39l52N59o0j27J69l51J40R9n04K53j19m36L53j11k19L25j14L6L13
799G7l07L01K84k77J48J03j36K38k59j91L56k98j62J34k26L4k9k58L72r4k74M07
$$ y = [-155, 497, 180, 95, -284, -215, 830, 633, 81, 33, -63, 506, 535, -359, -210, 14, -209, -131, -389, -316, 157, -549, -586, 287, 184, -90, -175, -106, 590, 489, -117, 245, 189, 124, 474, 128, -201, -129, -351, 19, 1, -496, -397, -198, -293, 51, -110, -175, 37, -89, 359, 675, 22, -75, 370, 499, 476, -86, -269, 285, 128, -160, -178, -580, -389, -38, -241, -281, -367, -229, 412, 135, -253, 307, 480, 421, 410, 10, 330, 372, -155, 64, 76, -349, -238, -395, -241, -69, -612, -516, 43, -106, 62, 151, -69, 400, 421, 318, 543, 28, 126, 603, 149, -99, -122, -286, 5, -256, -664, -235, -228, -445, -53, -150, -79, 166, -104, 413, 614, 65, 331, 411, 170, 364, 132, -196, 30, -268, -221, -34, -679, -500, 15, -254, -177, -180, -244, 462, 223, -129, 430, 370, 243, 412, 61, 201, 300, -204, 49, -70, -506, -153, -264, -483, -158, -272, -236, 77, -230, 71, 355, 78, 226, 329, 193, 431, 172, -19, 337, 39, -123, 11, -215, -181, -210, -468, -96, -190, -464, -57]
821e7L2k1K99j72K8L27l09J84k4l23L09n8k65M2j77J2J98m91L2L33j85J78K1j60
845b47M77j31j15L73j39l5L34m11L6P4k51K05j66m06K77j04o8J79l09J06L23k07
867b05K31J89k72L14L4j6J63l09r7K65l13P2N6m09O9J62l41K15j07j56M82j03
889g6n3L38k55J24L78k71K36j56l20L48k7k70R0m50K1M65m55n5J21j89M30Q7k98
912b37K45K2ON24l19r6K41l40K45J17m93K1j3k51K97j85l29L80k18J18L94l57
934b28J93K49k10K55K27l33J76j67m3K95l43k94J26j28J68L8m85J64K06j09L49
955A06j93o9K32NK78J41n16J09K97j28k0k72j88L52j52k34J26k07P8Q6k14L36
977d7J44l33K53J02M4K65l36r1L84k08rK9l78J58k4j70K59k60l72L64J31J37l7
$$ y = [-57, -25, -46, 253, 81, 109, 436, 127, 311, 287, -36, 273, 215, -50, -8, -185, -173, 25, -466, -434, -101, -286, -108, -87, -247, 230, 99, -16, 357, 218, 183, 517, 106, 142, 216, -35, 170, 4, -402, -125, -229, -297, -118, -427, -321, 2, -205, 26, 215, -57, 257, 291, 275, 438, 129, 32, 297, -16, 56, 112, -297, -228, -66, -407, -192, -299, -455, 27, -76, -129, 209, -46, 78, 456, 185, 421, 265, -55, 293, 266, -4, 86, -364, -343, 122, -333, -388, -267, -456, -26, 61, -237, 8, 30, 36, 560, 241, 145, 386, 46, 291, 408, -85, -64, -77, -328, -31, -216, -545, -165, -383, -265, 129, -228, -35, 214, 4, 259, 486, 153, 329, 162, 119, 414, 71, -223, -97, -225, -57, -19, -504, -340, -134, -243, 106, -87, -156, 76, 81, 359, 500, -16, 93, 390, 262, 242, -30, -218, 134, -18, -252, -126, -333, -255, -169, -383, -47, 97, -236, 17, 119, 163, 428, 92, 1, 385, 177, 168, 197, -181, -23, -47, -217, 42, -218, -590, -226, -95, 42, 5]
1000En50L90O08k31n6j43M3M27k21k34J89k66L6R7k27K5j68k60M94Q1m12J48R1
1023a34J91J88l73J98L32k31J01p1j63L21k53l60M06k25q1L0l62K89L41n14J17
1044b53J49r6L70l8m8K81l18l1N66l17k61j19p8N90k71o98K97K63j50K8l69K12
1066b91M08l74K42K92l10J55Q2PK75l84k20N01k77k15J45k17Q3l4l35K73J44k08
1088b58K00j29J01M45k73r8K73j34K01K3l85K71o1k90J80j50j44N6j72K01J41
1109bn10K49L87q0R6j53J1M65k70j74K98j78j0O7k50O6k9l80L31p8k28K07m5J2
1133a98J70j61J86K64k91K31Q8j37J49j21j23J86k41r4J78l46R4J04k79J53k9
1154b17j5K53j15PK48q5Q6J19k11K10p3j49J87j33k65K14j62m2N7k63J87J36l01
$$ y = [5, -545, -155, 453, 222, 166, 23, 66, 493, 272, 38, 227, -39, -3, 94, -133, -108, -276, -536, -42, 39, -373, -225, -134, 57, 245, -128, 70, 402, 171, 272, 201, 38, 359, 106, -254, 152, -73, -154, -124, -486, -197, 144, -370, -253, -104, -200, 170, 132, 84, 365, 47, 16, 582, 265, 4, -115, -193, 397, 126, -572, -275, -12, -162, -134, -503, -291, 117, -257, -15, 277, -33, 122, 204, 211, 486, 102, -118, 383, 106, -109, 36, -181, -98, -132, -467, -194, -50, -258, -58, -187, -86, 359, 86, -12, 261, 127, 328, 351, -34, 237, 176, -114, 66, -84, -228, -172, -344, -143, -2, -512, -263, 124, 44, 140, -13, -2, 463, 193, 19, 317, 139, 129, 196, -54, 12, -17, -397, -66, -144, -372, -165, -210, -198, -28, -189, -3, 261, -30, 201, 289, 152, 301, 180, 57, 243, 2, -92, 86, -260, -166, -62, -341, -188, -217, -232, 21, -94, -87, 161, 76, 162, 281, 70, 280, 207, 58, 245, 112, -153, 61, -101, -143, -86, -349, -162, -26, -327]
1177c27J86J42j07K77j05l8L24k15j7K74l06k5J07k10J29j43k52L27j49k35K24
1198a39j04K2K69k42L00J03k95K92Q7k48K69j50j12J44k07qJ19m26J19J88l41
1219c60J86L6j30L22r3j10M03k38k6L79j78N7K3k31J59r6k97K59p8k21J33j72
1241b73P2J30k62K04K25k26K08Q1j11K12r7j1J35k06j8K06l26K2M0k59K03p8j91
1264c20L03j89pK41q3PJ60o4J71M3k04K10n8j75J27k03LO2j96O3N5k68J14Q4j15
1289b39K30r2J02K45k79J07K12j43N0j2j35J75j95j44K43k10j51J89k02O5K3j02
1311b63J73J07k16K49R8j35K51j16j3J71k46N7J34l72Q7N0k90J24j1q8K28k36
1333b57%L59k50J07J96p9Q2m3j10L19p9l28L00j52j58J29k41Q0Q0k60J27J43k14
$$ y = [-327, -141, 1, -106, 171, 66, 28, 352, 137, 120, 394, 88, 63, 170, -40, 89, -54, -306, 21, -128, -363, -139, -243, -221, 48, -194, 106, 209, -86, 206, 293, 45, 314, 164, 52, 196, -11, -19, 100, -326, -207, -19, -360, -174, -138, -268, 54, -39, -149, 254, 16, -10, 369, 191, 248, 271, 40, 199, 103, -194, 65, -13, -234, -101, -273, -201, -71, -333, -129, 96, -130, 78, 159, 48, 260, 163, 152, 287, 81, 63, 269, -57, -35, 5, -254, -51, -129, -320, -17, -206, -213, 28, -55, -48, 112, 48, 219, 262, 58, 268, 210, 35, 162, -41, -38, 24, -172, -109, -54, -322, -208, -124, -239, -9, -101, 1, 246, -33, 74, 286, 143, 193, 181, 46, 221, 26, -118, 125, -85, -236, -47, -249, -184, -161, -263, -90, 17, -199, 50, 148, 13, 264, 148, 135, 306, 60, 117, 251, -121, -34, 16, -274, -150, -161, -249, -21, -257, -257, 102, -148, -41, 155, 76, 158, 115, 5, 324, 245, -83, 217, 65, -93, 36, -205, -125, -45, -305, -178, -35, -249]
1356b49K12J3%J70j06L1K23j89K8J85l00J36q0j33Q4j42j14K10j49m8J54j66J37
1379i3P1j45K67O8k03K58m6r5J59r9p0J19l25J02O2k23R4J9j57J28m8m9K59j06
1403e3P6J14j50J90N1p8N7r2j20J82r7j40Q7j52k3M6j45J19jj64K90k9p4J80m4
1428C0P7J26k05J30P5j28Rj2k25J36j51k5J36j69K2K8o0K05P9k08K35K4j14K18
1452B33j11J7J37k72K4J72k62Pjj39K16j76j92L58j28jJ91k15Q9J94j74J61J60
1475B88k68J80l3j07R4j66j11J83k53N3M8j99K50M2k13J83mRJ84j35Q9J62j94
1498H2nJ02j32M7p8j56J91j03j76K00p3q9P2j01J94M7j61J53J44q3J11j25J3K09
1522B83k17p4J43j98J8J3j16P6Jj61J16MMJ54j41Q5J50j12P2J45j24J10o5j73
$$ y = [-249, -37, -24, -24, 146, 40, 71, 294, 105, 133, 318, 18, 154, 74, -59, 25, -117, -231, -21, -170, -218, -64, -230, -93, -22, -167, 100, 168, -35, 223, 177, 82, 241, 142, 72, 191, -134, -32, 30, -193, -99, -80, -237, -109, -157, -206, 53, -53, 23, 137, -13, 177, 228, 150, 207, 115, -5, 177, 80, -60, 27, -125, -148, -102, -247, -128, -129, -293, -3, -32, -106, 74, 30, 107, 233, 28, 158, 233, 105, 114, 102, -123, 13, -138, -163, -27, -196, -174, -146, -206, -1, 78, -130, 105, 129, 15, 233, 122, 139, 276, 4, 28, 200, -62, -55, -56, -195, 21, -155, -347, 11, -117, -118, 73, -142, -53, 141, -33, 128, 288, 20, 200, 167, 60, 154, -12, -123, 60, -193, -140, -92, -291, -41, 1, -212, -29, -33, -24, 160, 25, 114, 276, 82, 77, 179, 47, 94, 16, -140, 51, -52, -228, -28, -101, -190, -118, -219, -25, 22, -139, 14, 158, 75, 186, 61, 74, 283, 66, -8, 135, -63, -45, -32, -148, -72, -71, -232, -116, -112, -108, 46, -95, -10, 140, 28, 100, 245, 121, 231, 166, -7]
1546gJ95j16j99J65j36k9P4j80R5R4j86J89K0P5J4r1J09J40j88L6J42j09k3m4
1570D0r8J54j95n9O1n5K7N7j31J55O5r8J80K1j01J52o1p2J15j28N5O2k81J03J0
1595b2j50O9ro8J54p2j7J51j27J88N4j32J21Lo1J56j00j42K20j77j61J03j00q2
1619b01J43k02J59P8k42K57N3j12J77m0p6J97j18P5Q2j73m2M9j43O4m2o8J31j65
1643a59k6J74j18j4J54o6J50P0j91K07p2n3J04j07m6N6r7k6O6j69N4M1o5J3Ql0
1669a42J28l3L0K02j89Q6Q2p4L6n3p4J41o6r2K2j19LO8p5L6Jm4J04M7j26K03O6
1696A68j00Q6o8N1Jj14P7Lj64kPl4O7j24K3Q9j45J36P1m0R0Mo9J63m6p6J05j33
1724B6rO7j56P0qj43J38o6j08J48o1KJ33m3%J21j01J27j1p0P0n6p2J28j38n4P0
$$ y = [-7, 188, 72, -127, 38, -98, -127, -53, -233, -138, -44, -230, -41, -21, 54, 68, -23, 86, 226, 38, 74, 216, 107, 84, 40, -58, 96, -99, -158, -97, -152, -125, -68, -199, -44, 21, -77, 103, 124, 23, 175, 114, 42, 157, 29, 84, 146, -135, -32, -22, -172, -103, -112, -180, -26, -98, -115, 36, -91, 97, 151, 19, 140, 143, 82, 238, 138, -4, 216, 39, -122, -19, -119, -201, -58, -260, -101, -23, -265, -8, 45, -67, 110, 70, -6, 191, 73, 148, 230, 57, 15, 64, -79, -15, -57, -125, 6, -159, -185, -11, -129, -143, 11, -55, 95, 165, -26, 181, 109, 56, 160, 53, 7, 63, -34, -60, 6, -163, -109, -68, -133, -120, -112, -142, -14, -47, -17, 185, -4, 82, 164, 90, 126, 73, -1, 140, 74, -18, 4, -115, -112, -44, -119, -83, -82, -126, -22, 25, -101, 102, 168, 68, 154, 86, 137, 138, 24, 101, 104, -60, -62, -55, -89, -22, -146, -123, -34, -179, -43, 28, -12, 78, 82, 13, 176, 130, 54, 159, 26, 17, 84, -72, -2, -10, -153, -15, -81, -189, -41, -102, -100, 33, -10, -10, 111, 10, 137, 126, 56, 126, 70, -2, 126, -12, -66, 4]
1751Dj98Q0J25j18J6Kl9J26ok0J63m9m4J09n9L1Mo5j9L4j75J27o4j32J54j57K
1778a68J08p7R9Q3n8P6l4n7J83n6j3R8o9j15R7j23L2j5j82J27N0k16J50K4m9P5
1804c0j9P1L2k0N2L2j05J28n4m3L7l7j31O6p6j0R1j66M7J50j13Q1J2j5J24Kp4
1831C2P6j6k5P1j21N0q5kK1M4j73R6j07L2O2l5L2J06m9P0j5o0J10j9n7P6m7n7
1859A0J13j27p6N4n9O5m9p5J18o7M1J03q5N4R0q4Q8K0j16J18m5j13QJ0p1R9j62
1886a38K0J08j73Q5P8j14J33m6kJ21l0NP6p8J0jj14J49k6j77J10n8j00J46m6p0
1912a32J08j04M8J19p1N0Q9j24J13j4J0Ko3NQ9k13J0P7r0o2J30j03Q8n8o2K04
1938D6n1pR3J0n7J23j23L4M9j17R2j48J1L4n6r4Q6OK4L2m5j0J29j6P6k9K2Rm9
$$ y = [4, -194, -114, 11, -107, -91, -89, -128, -2, -8, -28, 135, 86, 42, 151, 92, 123, 127, 62, 43, 77, -98, 29, -35, -167, -13, -170, -168, -60, -137, -38, 45, -13, 63, 29, -28, 155, 99, 86, 184, 115, 0, 97, -26, 6, -9, -191, -64, -14, -230, -80, -56, -105, -30, -49, 22, 54, 34, 86, 118, 13, 141, 87, 44, 81, 44, -87, -21, -97, -107, -16, -182, -135, 15, -98, -17, -5, -20, 104, 106, 32, 108, 92, 67, 138, 17, 67, -18, -20, 1, 45, -128, -32, -139, -107, -45, -80, -48, 58, 9, 79, 64, 4, 114, 95, 38, 114, 67, 10, 123, -4, -80, -26, -85, -20, -69, -144, -26, -93, -52, 51, -34, 20, 110, 26, 114, 134, 18, 136, 91, -22, -14, -4, -75, 24, -138, -118, -10, -183, -98, -20, -134, -1, -47, -49, 72, 42, 47, 123, 45, 55, 54, -60, 89, 63, -114, -4, -62, -162, -16, -62, -132, -24, -128, -80, 39, -32, 18, 107, -17, 96, 82, 92, 94, 31, 36, 125, -88, -78, -1, -91, -153, -23, -126, -38, -96, -158, 46, -5, -12, 81, 91, 34, 157, 34, 68, 117, 0, 92, -56, -45, -11, -67, -161, -75, -69, -45, -13, -58, -68, 61, 45, 121, 92, 114, 123, 74]
1967G4n2M4k4k5J6j29R0k8n6M1p3j8P3j0K1J02j11J22N1q6R2K6q4N1k2j00O5n3
1995cK3Np9j8P2j38J10j8j5Q0n4M1Q7r2M3R3j21Q2j6p9O5j29JJ2n8N0Q3q2l9Q4
2025a0j08J06J7k5J16p0k2J43jr7J3j5k1L8o5L7n8j59J64m3p6R6m4O2N9n1O9P7
2053A32o9n1Q3r7J27o3j41J22m7q1J64k14L0NnJ18k0o3J22p5oJ25m1L6J1p6N2
2080G8N9j47L2j5q2J4k2%J07j61N4J06p2J2M6m7J64n2q0J86q2o5J08j12m3J36
2106A22j84J3P8q2K4p6P0K4mOM0l1Q8k7o0Q1J8o0Q4k9n8No6m8P1o5l4K4m2O1P
2137e0l0P4ljJ34r1j0P7p8K1R8p3l8m8l0P8r8j4P5p0k4J21q0R3k4j1J30l3n2J04
2167A47n8q8J22j16M3j8n6Kk8j15J34l0LK4jo0J69j10J33K9n4L8J1j08J31q6r1
$$ y = [74, 22, 66, 42, 17, 33, -96, -6, -34, -90, -49, -122, -140, -67, -77, -56, 46, -65, 57, 108, 22, 114, 140, 56, 107, 85, -15, 50, -3, 20, 25, -54, -72, 0, -138, -28, -46, -61, 19, -35, 6, 93, 1, 44, 137, 16, 98, 82, 3, 68, -61, -60, -48, -106, -56, 27, -55, -94, -10, -118, -12, 5, -20, 96, 26, 4, 147, 146, 49, 62, 47, 26, 64, -1, 36, -22, -181, -17, -60, -136, -40, -84, -22, 37, -14, 55, 132, 63, 12, 95, -2, 125, 62, -79, 43, -4, -85, 79, -135, -105, -100, -105, 13, -7, -70, 52, -23, -29, 96, 55, 91, 102, 26, 78, 137, -10, 22, 7, -75, -61, -83, -83, 24, -137, -83, 23, -49, -37, 9, -38, 126, 74, -6, 180, 98, 33, 141, 29, -14, 122, -62, -49, 29, -53, -29, -105, -35, -11, -15, -9, 31, 0, 88, 61, 1, 82, 100, 40, 124, 95, 37, 42, -24, -72, -1, -66, -100, -76, -118, -57, -50, -80, -6, -9, -10, 124, 33, 23, 100, 22, 43, 141, 68, 30, -18, -48, 30, -68, -82, -7, -77, -101, 20, -60, 33, 9, -2, 128, 95, 43, 147, 89, 1, 123, 7, 50, 32, -24, -22, -50, -165, -31, -61, -58, -34, -35, -95, 74, -36, 97, 126, 72, 110, 121, 13, 144, 58, -33]
2194c3J16j27%M5n7n2R8r6Q5l1jJ05l8j8Q2j1J8M8q5l3N4m8K0m5j04J32j16jO7
2223b6o6J4M6K0l6J18j22J41p0n3J38n4j4K0m0j7Km6O3L7j58Q2Kn3P3r6QJ81j16
2252b2M6N3j22R7P5j25P2lq9L2m5k7J4j9O5r8l3Q9L8p1Q3K4m4K7O5q1Q6l0mLm7
2283Il9J4m5M0o4J0M2m7JN1j5N6K7k7N4knOJOL7r4K1rj21M3L6p0R8l7o6J00q6
2316g5O1R6p0K4M2m6qJ9j1O7r8rL8n1n3J14q4PQj6L8J8o8J33n0m2Q9J6m3K3o2
2347GO6q2nJ2Lk0Qm1o8J53j13M0R3r1J6Q6K5j3j5q2J48l2r7R5j02n7Q2p3rP1n9
2378e4L2J4l5L1K2j1M7n3M0K7l2K0jm5L1Qq3R9n3o6P5j02K1K5m5K4L1j0P0j4k6
2409a3J01n3l5L4n7L9%m3L2j6k9M2n0l4P5Nk3K1j4j7J56j81J43l5OK7k0n2Q3q6
$$ y = [-33, 83, -44, -44, 1, -56, -108, -10, -106, -21, -52, -53, 52, 14, -4, 78, 67, 85, 133, 48, 15, 69, 21, 41, -4, -108, 24, -92, -93, -26, -92, -78, -32, -12, -48, 70, -52, 89, 19, -34, 104, 50, 36, 56, 16, -1, 1, -45, 18, 55, -103, -21, -19, -72, 1, -95, -87, 94, -22, 24, 77, -45, 52, 127, 2, 74, 71, -18, 14, -31, -58, -44, -63, 2, -96, -129, -40, -2, -73, 10, 34, -10, 17, 82, 1, 87, 57, 53, 56, 9, -30, -16, -61, -21, -85, -75, -33, -80, -79, -28, -43, 13, 40, 13, 67, 65, 60, 66, 67, 73, 110, 16, 37, 28, -93, -50, -14, -84, 14, -23, -89, 11, -75, -14, 82, 12, 36, 78, 32, 24, 43, 32, 99, 1, -8, 30, -21, -74, 40, -44, -37, -29, -45, -7, 11, -57, 76, 26, -16, 73, 89, 46, 69, 7, 73, -9, -14, -2, 1, -19, -11, -52, -120, 33, -80, -40, 53, -38, -22, 64, 89, 76, 61, -21, 127, 95, -2, 93, -9, -66, 16, -57, -66, 5, -54, -22, -8, -43, -12, 10, -1, 46, -7, 33, 60, 28, 48, 47, 2, 33, 41, -42, 57, 4, -62, 13, -89, -68, -43, -88, -64, -33, -43, 27, 13, -13, 88, 35, 0, 34, -23, 16, 16, -27, 5, -11, -40, 2, -48, -82, -7, -2, -25, -4, -18, -35, 121, -60, 83, 48, 54, 81, 61, 9, 92, 6]
2439FjJo9N6k1o3N8N0m3M8r1J7Q2k5J4O1n2L4k3m3J6O5m3j0l3lJ0r0j4J19p7M7
2471a7L1l2M3N4q3O8K7pop5M5l5o1N8J6r5N3l5%N1o4J7J5L2j8O0j02J03M0r3P3
2502F3Mn0%k5M3on3M4n2L6j0l8j3O7k4oL4N1o9O4p9J4L4qJ7rm5N0k6n3Rk5mJ9
2536d6M1k9J7pO5J5k8J1k1KK7p3K7M3r0J23p4Qj1l9kK4j9L2M8o8O3k9l9O7Nk3
2568B0N2n9K3on0k8M4J6j05N6Ok3M3K0J5ml7J7K1j1M0j8Ql3nM6j6K6Mj01nK3j
2601b2n8K6K1L5K5p5M0J9o4J01j7Nk5K5p2J03p1n4J22j19K5J7n8O1qM4O1r2L6
2630C1nNl0J00p0L2m7k5M0j9m1j3k1j6J12o2jJ3l5Q7m5oL6j0j5K5pN6j1m3oNl9
2663b5M9o6J1j6M6k5Q8q2QJ6n2N4KOO0l3l1N7l8rL8p4l6O9o4J9k7k3M5NL9J2n1
$$ y = [6, 5, 6, -63, -7, -28, -91, -33, 17, -26, 22, -69, -52, 30, 5, 19, 80, 28, 62, 39, -4, 12, 77, 34, 24, -9, -12, -2, -92, -106, 13, -64, -17, 14, -18, 25, 79, -4, 64, 91, 84, 78, 3, 48, 13, -48, 10, 26, -69, -16, -51, -51, 0, -64, -47, -32, 0, -18, 42, -60, 43, 83, -10, 63, 67, 17, 17, -8, 35, 29, -24, 20, -32, 4, -6, -44, -57, 10, -14, -20, 14, 65, -4, 60, -19, -5, 29, 21, 38, 29, -16, 34, 8, -45, -36, -61, -65, -46, -5, -34, -17, -24, 41, 56, 28, 39, 18, 20, 47, -26, 1, 44, -46, 77, 3, 11, 0, -39, -41, -17, -36, -4, 44, -24, 39, 10, -29, 38, 43, 20, 72, 13, 36, 30, -20, -48, -4, 12, -93, -37, -31, -54, -11, 9, 24, 20, -17, 0, 21, 10, 50, 32, 40, 7, 2, 48, 32, 58, 62, -39, -44, -21, -22, -80, -54, -33, 2, 27, -48, -8, 11, -53, 48, 31, 36, 11, 36, -36, 67, -4, -58, 64, -55, -30, -13, -71, -10, -18, 26, 87, -5, 31, 26, 31, 1, 101, 31, 63, 16, -9, 31, 12, -29, -42, -63, -79, 33, -29, -30, -17, -52, 35, -10, -16, 20, 10, -5, 20, 13, 69, 58, 15, 9, 14, -25, 24, -42, -31, -47, -1, -26, 62, -20, -12, 4, -48, 6, 8, 14, 74, 41, 10, 67, 29, 20, 58, -16, -52, 17, -47, -28, -55, -78, -33, -28, 11, 23, -28]
2696b8JP3l9J5J3q3R1L0j5mk0o1R6j15N4l5k9L9K4ll0P8o0P1j00Q8J8n8lQ9r5
2727BQM6j00J6O9k6o0%k3Q0p8R4kj8K9J4p6Q0m5k6Q6qr7Q9q9L7Op1Q8m6kj7NJ2
2761b3M7J0o3R2m0o0P7Nj9K2p8O0nj9RLm2Ok5l8O1l7L7O0j4o6P7qK4o2k1N5mk0
2795Aj4m0j2N7N0j6l7o2K8J9L0M1m9O9l0rJ9n3PK3J5k2j8l3K3Ll3K6q1J2N1L3
2827bJ3QRm5J5J1M1j8k0l0K6n8M6K3n1lM1J2n7K3k8M5N2k9l2l2P6m5l8P5k1lm
2860@%ORk0K6o8J9L2k6j4L3o9N6L4o3Q3L0k1J4n2L0j9Lm1N3m7mjmJ7j0j8L5K2
2894B5q5J08k9pJ2j2l5P1j7r3Q5L8q2L4m2K9k7J1%j8k4R6p3nL8QL4l0k4M5K5o0
2926dL1p1J6L6o5J2J4NkJ1J0%l1M6j9jJ7R4j44J25l1l4K0l9j2L1j7o5O4n0K0O6
$$ y = [-28, -27, 46, 7, 22, 35, -48, 43, 73, 58, 54, 34, -27, 69, -46, 8, -27, -56, -17, 7, 4, -26, 52, -8, 63, -37, 51, 69, 11, 8, 97, 2, 10, 56, -44, -28, 41, 15, -45, -45, -68, 12, -66, 28, 26, 8, 37, 51, -25, 55, 10, -16, 70, 62, -35, 54, -35, 2, 8, -63, 25, -21, -23, -40, -35, -23, 24, 34, -29, 63, 23, -37, 40, 45, 26, 48, -30, 30, 25, 6, 15, 18, -24, -18, -43, -81, -20, -57, -20, 40, 26, -40, 37, 29, 53, -9, -30, 25, 21, 1, -13, -53, -65, -8, 42, 26, -11, -73, -45, -26, 4, 45, -4, 65, 35, 26, 45, -8, -1, 22, 37, 15, -3, -36, -13, -10, -43, -17, -98, -86, -35, -2, 11, 19, 28, -17, -2, 9, 50, 32, 12, -18, 8, -50, -4, 19, -32, -35, 6, 18, -39, -16, -44, 1, 53, 24, -8, -40, 36, -9, -47, 28, 7, 4, 0, 0, 6, 15, -5, 21, -47, -28, 4, -22, -36, -3, -72, -16, 18, -45, 38, 68, 47, 61, 9, 39, 20, 23, -18, 35, -12, -16, -17, -21, -4, -14, -32, 3, 25, -60, 48, 19, 12, 24, 12, -23, 48, 31, -62, 23, 61, -21, 13, -29, 0, -27, -16, -16, -34, -58, 38, -35, -40, -2, 6, 40, 10, -14, 31, 56, -4, 27, -44, -28, 8, -57, -45, -31, -26, -28, -17, -7, -7, -38, 8, -11, -12, 5, 99, -45, 80, 49, 15, 35, -4, -16, 15, -2, -67, -3, -53, -33, 33]
2958C3l8N2j3k8l8M0rK7Pl9O5oj26O5k2P0q2P5n0Kj7L4%k5J3m2P9k6j2L8n9P6
2990D4J5n8M3k2k1l0J6j0mJ8j2K9Qj3j6kJ3RMk7J8nj9R3p7J6n0M7Nl2N0or9M1
3024c4RK5J2k8j10J13L3j1K1Rn8N8k0m1k2M3rj2j9K6j5qjm2K5P4m3j1K7k4M7J9
3056C3l1N0o8J1kJ3K4k7j7l1M0j0lm1J6rK8K1mokK2PJ7Nl7pJ0JnJ5q2O4l8rP4
3092B2mn7L7JmL6j9K8m6oL6L3rl1n0N6nj7ml8k0N9j8p0L5J7j2N0K2Lpl2M7j8m
3127A1mm4L0M0m9K3K2m9j5M0n7J05p4k0L1m1M7K1k5R3m3pk0Nk7K6o5k5L2K0K5
3158FJ7om3J5O9j6nKk0PJ7l7J9K3l8m0O6n3k3M4k9k1M2M6l5nLN6lr7R2k6K9l8
3192A8Km1J9j9j3M0l2l0JJ6K0m5m7J00K6m0R8J6q0%K4k0k0L9K9m8o6L3n5J6M4
$$ y = [33, -5, 47, 34, 6, -32, 8, -1, 26, 33, -6, 59, 53, -73, -8, -30, 40, -42, 33, -17, -15, -32, 2, 2, -23, -10, -52, 27, 1, -11, 27, -32, 44, 59, 1, 44, 22, 1, -29, -13, -23, -27, -9, -21, 8, 16, 3, -13, -15, -2, 7, 11, -16, 2, -3, -22, 71, -6, 10, -40, 7, 12, -20, 30, 24, -75, -34, -25, 0, 12, -16, -126, -13, 20, 9, 30, 39, -19, 39, 19, -22, -44, -1, -10, -22, -41, -15, -30, -38, -39, -81, -56, 18, -25, -36, -9, -33, 14, 33, 2, 52, -16, -5, -7, 6, 30, 3, -14, -45, -5, -15, -18, -59, -43, -52, -24, -3, -7, -13, -15, 7, 14, 31, 36, -1, -8, 2, 3, -2, 13, -69, -5, -43, -52, 22, 18, -39, -2, -1, -5, 31, 12, 40, -6, -12, 24, 57, 48, 17, -33, 23, 18, 1, -3, -41, -61, -2, -20, -90, -55, -38, -50, 0, 22, 25, 18, -14, 33, 15, 11, 7, -37, -7, 33, -16, 7, 29, -20, -35, 5, -52, 53, -21, -41, -10, -51, -4, 17, -8, 85, 42, 35, 15, 20, -7, 19, -46, -71, -39, -19, 6, 23, 17, -26, -11, 58, 42, 37, 39, 19, 26, 43, 6, 25, 48, 10, -30, 36, -17, -40, 4, -25, -46, -4, 42, 7, 2, 5, 61, 58, -39, 53, 27, 56, 18, 20, -21, -2, -21, -34, 6, -26, -56, -55, -39, -19, -64, -111, -11, 15, -25, 73, 89, 9, 9, 33, 13, -7, 32, 61, 13, -53, -20, -75, -59, -15]
3223a5n0M5J02p6m0P4n4L9j9l0O4J6j5k5j5J4l9J8OK1j5J2kp7J5oN7M3ro8J5L9
3255B5o7P2k1KJjNk0q9J22k9m7N8q0R1nm0N0Km2M5J2n1J05j03J1k9P4Kn4p7N4
3287b4nmjj6L0K2j1nM9n2K5J4%l2M4l1M0Kp5O7m1j2J7L2l4m8j9Q6Qj04N6KK9L1
3321D0qJ7j7l5JO2j01N9qqK1q4NO9l0l2k0L1M1l2oL8K4l1M9l6j8J0j6l8L7k5J8
3354b3RkJ2l0M3k2J5j1M8j8j2J9k1k7P3k0k1J1n1oK6J0nl7K9j7J3J8JLL6k6kk2
3388gN2n2P0l4mm5k9P2k1l1K1j1N3l5J9m0oM8nmj5N2k6j4kK0j8j5j1K1j7n6L9
3421c1N4j8l0k0L5j2K5Ql5j0O1m9K1P1kj27J5N8Jm7Ll4N2K7k8lL2l6K0n6K7L7
3453Ik3J9J6q1Q7k3J6J7k2plp5P8q0MJ03o2pK6l4M2M2m6J5k1K5k6Jk0N9m3K0O
$$ y = [-15, -65, -20, 82, 6, -34, 40, -14, 25, 6, -24, 40, 56, 41, 16, 1, 15, -24, -6, 0, 21, 6, 18, 16, -61, -46, -52, 5, 48, 39, -29, -14, 25, -42, 30, 9, 11, 12, 11, 16, -4, -93, 29, 0, -47, 11, -69, 22, 17, -23, 27, 29, -13, 32, 44, -7, 98, -5, 6, -23, 51, 53, -1, -78, -24, -29, -33, -34, -50, -20, 2, -9, -14, 35, -17, 8, 22, 22, -10, 34, 3, 43, 45, -30, 37, -4, -16, 1, 33, -1, -49, -68, 18, 26, -78, -22, -20, 9, 40, 32, 49, 32, -3, -2, 60, -41, 18, 10, 2, 23, -61, -56, 13, -17, -49, -69, -38, 3, -29, -35, 3, 27, -4, 45, 9, -9, 1, -15, -53, -16, -41, -23, -14, -16, -4, -34, 9, -13, 2, -9, 39, 21, 9, 28, 7, -20, 53, 33, 12, 23, -28, -34, -8, 2, -3, -40, -11, -28, -15, 3, 4, 7, 43, 17, 15, -7, 45, -7, 63, 29, 25, -20, -49, 23, 2, -29, -8, -19, 34, -1, 18, -22, -28, 20, 15, 11, -4, 48, 22, 8, 6, 26, 8, -7, -18, 3, -14, -70, -31, 23, 5, -25, -45, -10, -22, 3, 11, -24, -34, 27, -22, -1, 70, 68, -59, -44, 14, 15, -32, -29, -63, -11, 16, -12, -15, 17, -19, 1, -55, -28, 9, -14, 5, 21, -60, 27, 4, 20, 37, 15, 8, 5, -70, 8, -72, -68, 35, -27, -34, -8, -42, 0, 42, -4, 11, -10, 15, -11, -10, -30, 29, -14, 6, 12]
3486A2m3J1K7l7k6P1l3rO2k4J4p4J28o0L5o8O8m8K8QJ4l2n3j8N2n2M9k5M7l1N3
3517D6l7m9M4Lpj4k3P1k1j1M7j21O9l6L7J6k6k8L9l5M6K6k6kJ6pJ1J7K5k7l5j7
3549iM5j13J3L2OK3j4MJM1p1M3J0J6lj1j7P6n4J7n2k5J09k7q7K1k7R3ql0n6O2
3581HpL0jo7N4M9q6L9J5o1K3M1q6M1J4j1QoJ7j2ojl8N5j3K1j7M4k2%L2q6O0K3
3615E4l3n2N5k7p7LK6K0NKQm2O6l7L2K3k9O3ml2j3L6l4o0L5k4LJ5m3P3l3n3M3
3648c1L9Koj3O5k8mL5m3K0M1o2j0P8r1k1L4m8j7L0OM7m6M4K8m4rP1p7jJ4n6J20
3681F7o1n9L8J6j4K2n4K0J5k7L0L9q5L4l0R4l7oM3n6%l1pj0R5L1j12L1lL5J3m4
3713a3l2Q2q9L9L3pN6n0n5J06m0j7j3K2K6n7kl1j4M9O5r3qJ00r1nQ6p5K0L2j0
$$ y = [12, -31, -20, 7, -30, -56, 15, -18, -27, 35, 11, 25, -49, 79, 19, 54, -14, 54, 6, 34, 42, 56, 24, -29, -47, 5, -47, 2, -23, 24, -7, 46, 9, -40, 4, 7, 0, -14, -37, 34, 13, 2, 49, -72, -3, -39, -2, 14, -12, -40, -1, -36, 10, 36, 10, 8, 24, 17, 28, 45, 70, 43, 8, -9, 36, -77, -64, -32, -26, -3, -17, -13, -12, 29, -42, 1, 11, 27, 24, 13, -4, 72, 18, 35, -17, -42, 67, 40, -47, -26, -53, 40, 32, 2, -54, 8, 1, 31, 30, -37, 17, 66, -20, 19, 34, -27, -4, 37, -49, -8, 6, -5, 3, -3, 14, 2, -4, -5, -43, 12, -1, 20, 3, 47, 25, 25, 57, -29, 31, 54, 21, -31, 24, -3, -80, -77, -51, -31, -26, -24, -16, -58, 8, -29, 3, 26, -3, 60, 56, 24, 11, 47, 13, -47, -12, -36, -33, -18, -61, 12, -21, -74, -31, 8, 10, 4, -9, 56, 28, 24, 59, 16, 36, 77, 15, 5, 83, -8, -29, 5, -43, -60, -30, -24, 23, -23, 21, 49, 5, -4, 67, -10, -11, 3, -53, 67, 6, -53, -15, 1, -13, 9, -45, -25, -10, -37, -7, 32, -53, -19, -49, 45, 8, 2, 45, -11, -11, -42, -49, -59, 36, 67, -45, -14, -17, 18, 31, -13, -45, 37, -52, -13, 20, 13, 69, 19, -36, 70, 30, 13, 0, 22, 48, -9, -11, -42, -56, -7, 58, -35, -43, 57, -34, -39, 47, -28, -8, 24, 14]
3744A4OJ1o6L3N1r1K3N7p8J2k3M8j7O9o4K2j9QM8qNj0oml0k8J14j01P4j16K2Q1
3776C7l6m9N6o1P1l4K0j4nNl2O5k6K5j2K7oOo2J0J7k9m1O2o6N1J9K3o3%J41j4
3808H5p0L8o2K9L8p5Q0l8j8N0r0K5L4m2l8K7L2K1n5l2P7MmQKll3M0j6%k8O5k9
3841B2n4OM1q0N3L0nN7n6n1jLJ3O1l5N8qj1l2L9k7K6m8K1K2m9l5M8mk0JKN2j4
3875B5J6l8M6m9L7m3O7n0n1j5O1J0J9q4n3J02j8MJ8m3J8M8oN2rl0j3j4k9k5M8
3906AL7k5j1m9K5M0l2Nm8J26r3J9J5RRL2m9J6L3k3L1p6K3po7P3J3k7j5l1M2ML
3939Cj1R1p0l1O1o4O7Rj9j7l0j5jM6m8K3No5J05l0QK3m9O2r8K2M9l0j6L4KrM6
3972E3j04K4R4q2k4J8k%J4N2o2M9o1K3m1J02l8N1m8Pl4J1j9L6k0j8j4L4rj6l4
$$ y = [14, 20, 31, -35, -2, 49, -42, -19, 38, -40, -28, -51, -3, -20, 49, -15, 7, -12, -4, 44, 36, 41, 31, 25, 21, -9, -37, 77, -24, 50, -66, -44, 37, 1, -48, 8, -53, 18, -16, 4, -10, -15, -10, -42, 23, -3, 22, 10, 37, 31, 37, -25, -15, 2, -27, -68, -6, -72, -21, -2, 21, -42, -42, 99, 85, 15, 53, -9, 20, 58, -17, 63, 25, 7, 57, -33, -8, 26, -16, -54, -27, 5, 26, -29, -61, 16, 20, 16, 24, 26, 23, -10, 30, 14, 14, -14, 51, 22, -32, -26, 15, -65, -12, 18, 13, 70, 14, -37, -38, -35, -22, 39, 4, 62, 54, 43, 11, 50, 23, 49, 1, 22, 44, -5, -40, 8, 4, -16, -15, -13, 39, 25, 41, 3, 49, 0, 37, -6, 61, 11, -40, -55, 6, 16, 35, -49, -102, 0, -18, -14, 4, -39, -21, 27, 21, 73, 64, 34, 21, 7, -22, -47, 1, 38, 13, 2, -47, -22, 18, -14, -9, -57, 69, -24, -5, 10, 19, 28, 60, 11, 27, 60, 37, 68, -8, 15, 8, -59, 14, 27, 0, -15, -46, -4, 0, 3, -8, 83, 13, -18, 43, -21, 46, 55, 36, 19, -11, -26, -27, 19, -29, -6, -1, -66, 39, 9, 17, 40, -9, 53, -45, -23, 26, -4, -20, 14, 16, 7, 53, -51, -27, 67, -15, -39, -21, -23, -23, -9, 43, -19, 30, -31, -8, -49, 53, 15, 66, 18, 25, -9, 2, -17, 19, -1, -19, -33, 1, -8, -24, -58]
4003e8K0K9J6mnJ9mL2q9Q9k7o0K3L5pj5M5p5K2M7l4M6j20R9LJ5m3PK1M4l5l2M8
4036E2lq3Q4o9K5j4j7L2J6l0O2n1p5Q4n2L4N7o9j7R4k8j2Jm2N9K4q5N4L9q7l7
4067e4mkN8j3N0m2N7k9mo0O8m4M9J8o6M1Kq4M3M7j20J21q6K3M4k2qM8kK2l2L4
4099E3n1PN0j7J6n8N7j09N6L6n7k1J8nj9M1k7L5Qk9k0l1Q4kM5j06O5kk6L6km7
4131b2K8l6L6m8N5lj01O1J9ROOmJ0jkRk6K4j6k1k3%qN3n3P1%j9l8jL9L5j6N4l6
4167D1n9L1l1Q8n9Po3O7j4k2k5k8K4O6m5K2k1k6M6j6N5Nj2N0p6K7k6j1j6oO2k7
4199Ho8NK2kM1p0P6k1l9Q2o2L0k1R0nm5k4k0L5j2K7j2l6nN6n5O3o9mM1l6Q9r6
4232c7N7k9P5o9N7n4NMpm2N0n0L4L6l6j1O1n5M0m7P0k8m1M5J6m2K3K0m0P6m2m6
$$ y = [-58, -38, -9, 7, 3, -2, 17, 13, 45, -44, 45, 18, -42, -19, 16, 9, -6, 39, -36, -14, 33, -1, 45, -75, 24, 27, 42, -1, 6, 27, 71, 36, 4, 52, 49, -34, 50, -19, 6, -8, -25, 7, 23, -7, 55, 4, -71, 13, -39, -5, 52, -17, -34, 60, 32, 20, 21, -21, 38, 62, -23, 31, 70, -17, -54, -58, -60, -2, -15, 35, -7, 50, 21, 17, -43, 25, -19, 30, 48, -18, 23, 25, -59, -16, 31, -89, 32, -54, -31, 13, -9, -17, 31, 29, 51, 19, 53, 2, 9, 59, 42, 58, 0, 57, -52, 4, 40, -17, -38, -20, -25, -44, -3, -30, 5, 13, -16, -36, -67, 17, 15, 60, -46, 19, 17, -9, 27, 25, -22, 6, -30, 6, -42, 13, 10, -91, -30, -11, -2, 4, 10, 6, 16, 15, 13, 22, -4, 20, 4, -17, -40, -40, -48, 5, -48, 23, 23, 4, -34, -35, 4, 39, 23, 77, 41, -18, 13, -18, 70, 11, 18, -45, 22, 8, -14, -39, -67, -43, 23, -22, 0, -21, -47, -1, -17, 38, 43, 31, 81, 5, 32, 6, -5, -21, -27, 35, 8, -60, -55, -33, -35, 6, -64, 12, -9, -48, 34, -28, 2, -19, 71, 66, 21, -3, -23, 12, 0, 27, 15, -21, -26, 30, -25, 38, -31, -35, 6, -30, 59, -37, 20, -9, 66, -3, 54, 0, 5, 9, 2, -40, 10, -40, -6, 30, -6, -17, 44, -11, 29, -18, 52, 24, -17, 28, 44, 2, 25, 45, 5, 81, 39, -7]
4264gJ5kj2K2k0J0Mm7Q4k7P0r7K4J1l7J9O3L2o6l1j7l4Lj0M0j7k3j6P1nrJ4k2
4297a7P5j3m2Q1j02k2N5m2K1M3j6o5N9QL3o4m6R7n7M4n0L5l1L7oj6O4p8M1L0p7
4328b1Q6r4J8K5m2J0n2R2k1mq8J84r8L2m1K2L0o1o3J42Ml5L2Oo5j2k4j0P8o4K7
4359gM2o2Mj1LM0K6j1l8qJOK0K0k9OMK4k1m7J8K6k2k6M1k9O8q1L3K9OK6q6P6l4
4394Gm0N6j8M6n6K9k3k2Qk1Pk2M6%J2M6q2N2l5N8ok3l7j2K5J1j7j4J5J0k1m9Q3
4427A3o1j2P9nl2L4K3j2j6l5O3j1l4j3lM5j6m0K4J3k5k8P4q3J01Mr2P9n4L8l3
4458a5l3N4k7L1nN5l4n2J9n7K3M2r3L4Q1N3j57N2Q7l4N7j7q9jP3o5L2pRk9%J6
4490Ck1j8K9nK4l4M6m2O8j3lk6K7Kj1J7nm4Pk4j7qRL3j8L7m9L6k0k6M2mk9M0j4
$$ y = [-7, 8, 6, -6, 16, -4, 6, 10, -37, 47, 20, 90, -7, 17, 28, -9, 10, 73, 105, 39, 8, -9, -43, -40, -50, -10, -27, -50, -66, 5, 0, -9, 5, -17, 58, 45, 3, 84, -18, -40, 15, -27, -6, 37, 21, -44, 15, 23, 56, -8, -54, 43, -14, 30, -20, 15, -16, 21, 15, -1, 63, -15, 26, 56, -21, 65, -29, -11, 14, -28, -18, -70, 22, 1, -3, -91, 93, -5, 27, -14, 8, 38, -23, -86, 56, 60, 25, 57, 63, -2, -14, -38, -48, 30, -34, -7, 35, -27, -23, -34, -31, 9, 35, 24, -14, -22, -21, -15, 5, 25, -4, 2, 6, 30, 9, -38, -20, 6, -16, -42, -1, -30, 38, -43, -10, 19, 25, 51, -35, 41, 7, -33, 23, 5, 51, -5, 24, 1, -21, -13, -34, -27, -49, -3, -3, 9, 55, -27, 25, -10, 48, 42, 19, -18, -30, -5, 6, -11, -25, -10, 0, -21, -70, 13, -48, -60, 19, 14, -18, 16, 39, 27, 11, -24, 39, 28, -6, -19, -22, 23, 7, -33, -9, 4, -21, -49, 25, -58, 43, 47, -45, 34, -20, 18, -15, -48, 6, -21, 10, 5, 60, 26, -26, -7, -64, -41, 1, -92, -58, 23, 76, -81, -29, 58, 24, 81, 64, -25, -26, 47, -18, 14, 7, 16, -13, -13, 3, -18, -36, -7, -12, 12, -22, 24, -18, 50, 37, 34, 8, 35, 37, 26, 43, 38, -6, 1, -23, -40, -48, -39, -6, -24, 13, -36, 0, -20, -46, -4, -8, -37, 3, -11]
4525a1l0L0M6p9P8Ml5M6p2K5L4j32P3k2N4k0M7l7j3J8K6j4jnNmm0N2o1M7Km1J04
4558G4k6n2M2M3j53J08j1OLn2M4l6o1M6K9jJ1l1LL8m6oN1r6M1L7k7MJ2J9jL4j5
4591C1QK7j4oj03Q4qm7%N6Jj9k8j2K9j1%J0J6rJ8k0N2n5l1Q0k7J0qm6N2n7L2k2
4625a7Jj1O1q0K7lj8M4L8k8kj7K1m8M9l4R3o8m3N8kk6k9N5n9rk0K2K8j8J8K3J9
4658B5K0p2P3Mj00P7k4K2l1J0p0R5k8k0O7o8jP6o3J7j1j4k0J00l6l0nnO3l7k9
4689a5j8j5N5l5Kk1J8KJ7M1j9k2J5L3J4j4K1L5r8K4p2Q7j6o4k6M4j9K3Pn3P7N6
4721F4j35P8J7P3j24N7l0K1mo3J10o9J0pJ0l6j0K1l1O0K0l0j0K8j6m6O6j8M9l5
4751B0j7K1n5M6n0P3q2K7L9j11R7n5O6Ln2K2LL6Km5K6L4n8J1m1NJ5K2l0J2oK4
$$ y = [-11, -41, -11, 35, -44, 34, 38, 3, 49, -23, 2, 36, -96, -23, -45, 9, -11, 36, -1, -14, 4, 30, 16, 15, 10, 15, 11, -29, 23, -38, 9, 11, -30, 74, 48, -4, 38, 81, -72, 36, 25, 31, 34, -18, 26, -10, -71, -25, 4, 3, 14, -17, -14, 24, -22, -28, 23, -73, -32, 5, -22, -18, -6, 13, 12, 46, 31, 39, 66, 52, 46, -57, 27, 19, -28, -28, 28, 29, 10, -18, -30, -1, -12, -12, -2, 14, 5, 23, 3, 55, 0, -31, 49, 22, 32, 24, -22, 30, -27, 5, -17, -16, -27, 34, -46, -19, -22, -40, 4, 42, 14, 12, -5, 16, -32, 17, -17, 76, 8, -35, 23, 21, -5, -34, 21, -38, -47, -67, -45, -17, -35, -17, 6, 25, 45, -27, 46, 50, -50, 27, 3, 25, -6, 4, -66, 29, 1, -19, 48, -20, -21, 55, -8, 9, -2, -16, -36, 64, 28, -2, -7, -12, 51, 14, -15, -33, -48, 7, -28, -26, -47, -29, -27, -10, 31, 12, -10, 5, 38, 52, 38, 59, 94, -4, 20, -52, 35, 19, -45, -71, -27, -46, -23, -16, -69, 8, 64, -71, 7, 24, 97, -27, 30, 0, 21, 17, -46, 64, -5, 5, -2, 8, -28, -38, -17, -48, 12, 32, 2, -8, 20, 4, -42, 24, 6, 55, 20, 3, 24, -31, 15, -35, 38, -44, -17, 22, -89, 8, -47, 19, 22, -30, -8, -5, 31, 33, -12, 14, 48, -10, 1, -40, -35, -20, 2, -28, -16, -22, 2]
4783Bnk4j0pR9j02M1L1k8L9l3J3K0ql0l3M7L2o2o3N7K9N2r8OM1J7nonJ8k4N7k7
4817C1l4PL7m3QJ9Mk2qL1l1k0lL0k6Jl7K6N2l2K7m6M8K7p5Rj6M2Qn0J0M4m8L3
4851CJkL1k4olM3n3RK6M7j18LP3j3OoJ0n6L3k7l2M8j6K3J29j45N5j6K2oo6O0n0
4885a7N1l2K9m4Q3j31K1k3M6Qj0O4j1k4n4O1L8j0k1J3m7L7p5JR4l0j4q1R7l2N5
4916D2l0K1p8N9l2L1k4P9Jn6kK9j5n0qM1j4pJ3k2k2%PL8M0k0J9n7l9M1l6O0M7
4949E6j1r1N7l1ok6M6M0j5j5j2k4MK0J9o7N2J3m1O5l9K2K5pl6O3p6j5O3j8J1l4
4981hm5M9j7J4M6m3j6N5l1N2q2R3m0j4l5M9l2N3l9LJ1k2j7k0k8M5M7p6L1J7J3
5012A3Nj2j1M2q0P3l5j2J3j2L2k1J0l9k6L5j8M5M8k6Qn9J5L1j3N0m9j5L2k6L3
$$ y = [2, -3, -27, -37, -44, 55, -47, -6, 25, -3, 36, 3, 16, 36, 28, -2, -35, 12, 44, -18, -81, -24, 5, 57, -41, -35, 6, 23, 18, 12, 7, 25, 1, 58, 31, -3, 4, 41, -2, 6, 25, 29, 7, -1, 30, -1, -21, -24, 6, -20, -19, -56, -30, 22, -10, 17, -29, 19, 46, -29, -20, -36, 6, 14, -36, -26, 18, -30, 3, 4, 2, 33, 9, 3, 0, 43, -10, -1, 25, 72, -46, -43, 30, 17, 23, 17, 27, -29, 4, -23, -55, -7, -23, 0, 129, -16, 39, 23, 45, 39, -27, 33, -17, 34, 2, 31, -13, 70, -61, -40, -63, -17, -9, -19, 45, 34, 10, -44, 17, 55, 45, 24, 37, -10, 27, -48, -47, 47, 17, 3, -78, 19, -13, 42, 12, 33, -45, 14, -18, 13, -11, 68, 69, 13, 11, 40, 25, -25, -33, 8, -6, -13, 0, -22, -44, -44, -37, 1, 41, 21, 40, -17, -56, -15, -51, 9, 56, 45, -46, 11, -20, -26, -52, -6, 34, 19, 4, -8, -32, -28, -8, 11, -56, -4, 9, -32, 33, -6, 16, 41, 34, -2, 61, -15, -30, 33, 15, 26, -8, -53, -4, -21, -7, 39, -4, -20, 35, 4, 56, -26, 67, 27, 13, -22, 27, -5, 48, 9, 12, 23, 1, -16, -36, -64, -19, 28, -48, -17, 0, 13, 18, 6, -5, 37, -43, 30, -5, -17, -4, -16, 16, -5, 5, -34, -60, -25, -43, 2, 50, 24, 32, -27, -12, 19, 6, 56, 7, -8, 24, -2, 31]
5043C1N0j15J9M2l9J3q8Q7loK4Kl5k2R6n1pL6j9l8N8l0K3l2l4P7l2m1N9kl4ML
5076dn4R4j5M3k3k3J2l3N1k5L7q8M5j4pNm6K0N3j7j9p8N6K7PJ4K0k2KJ6k8M5j6
5109C5j8L4r5JP9l7j6k6P6l4m3L9O8o1n2P9n4M7Ol9rP1l1L4j16J06K4q2J0K7l1
5140hL2k6KQl1j2nN4pL4nj7K6j7j8P4l8m6J1j6J0m3K5j5mL7J8j1ML7m6jNRj4j
5176Ek6j4O8%q9J17p0J8m4M3l0P3o4K8l1M2pl0J7n3R2j07Q4J2o5L9k0K9k5K2n2
5207c8K7K5m8J7On2L9K3M8M1q3orMRJ9nl2J7O4j09Q9l0L0o8N2pm2KJ3J3J7m6N3
5241C3m0N8p9Q2o5OJ2o0N3L4m5J5rlN9r1M8m5M5m9O6M4r4Q0p3N1k5m7N5k4j4j1
5273c3L6k8k2j6O2jj4Q2l1k5J1k7K8k9J3Kl2P3p4M9m2N5n9K7J1K8q3N5m4j8L5
$$ y = [31, 81, -34, -15, 27, -12, 1, -87, 0, -3, -9, 15, 17, -18, -40, 56, 5, -2, 34, 15, -23, 35, 5, 28, -4, -38, 39, 7, -34, 25, 23, -11, -7, -4, -58, 36, 21, 64, 41, 18, 30, -3, 48, 23, 60, -28, 17, 3, -4, 1, -45, -25, 28, 11, -8, -86, -30, -3, 4, 18, 38, 16, 18, 34, 6, 51, 35, 17, 51, -44, -43, 36, -1, -17, -43, 33, -1, -44, -5, 63, 2, -50, 29, -25, 22, 28, -11, -20, 51, 20, 54, -62, 44, 68, -14, -4, 23, -8, 24, -2, 0, 8, -23, -35, -40, 14, 7, 41, 36, 19, 45, 28, 10, 84, 46, 0, 11, -5, 5, -38, -13, -28, -32, 5, 23, 12, 16, 53, 7, 6, 11, 20, 6, 5, -21, -35, 33, 33, -56, 61, -9, 9, -35, 8, -22, 51, -13, 15, -16, 26, 19, -11, 6, -47, 45, -62, 22, 34, -31, 8, -12, 17, -8, 14, -38, -11, 14, -34, -17, -11, -63, -24, -1, 47, 88, 5, -1, -10, -6, 3, 22, 17, -15, 2, 66, -43, 46, 16, 46, -22, 30, 23, -19, -17, -4, 9, 26, -20, 33, -7, 51, -28, 54, -11, -5, 7, -53, 0, 34, -11, 4, -5, -8, 51, -40, 8, -37, 8, -41, 25, 69, -25, 55, -18, 33, 8, -39, 16, -8, -22, -33, 3, -25, -47, -63, -1, -2, -16, 66, 35, 10, 21, -6, 22, -7, 6, 8, -24, 49, -25, 24, -18, 37, -22, 5, 16, 44, -39, 16, -28, -46, -11]
5304a1j2L4OJ7N1j1j45O8O4o2M5p4K1L8n4lK5k2K4j5P7r8NN6j6l9M3K6o5L5n8
5335e0L8J3K1l8N8q0K1j7O8j7QM2n6J1k0k2m6O5KJ5p6L5O1qpLk7K0l5j4M0J4m1
5368a9N6j01L2J6L8Mo7L2pL2l1K0j8JjL1l0J1J0L0l0MnKl4J5L2L7j1ok2Nm4Qj6
5403b6L6j9p4O4kmM4l4n4P7J1pK4j6k8L4n4L6nJ9Nn7O1j2q7O8o1P8P3p8OLk0J4
5437A5k8PJ7J4NjM1r4Q7j8m0%k9L2Qkn5m9P5knM3l9k8N8k8M1jl1Pj8qj5l4Q5N9
5473F9r6M3l9O4m0l0lO4k0L9n0K8k9l8R0l4n7M5N0l1n1k2K7J2nl5M3m9M2l3M5
5504aN3k9or5J14k7J7l5O9j6n7L1l2Onj5j7N3j2o3N5pJ8k5j4R4p6M8m4qL7J4l3
5537hkMPJ2l3PL7l5j3MqN4mP8j08M4L1n9nn2N7l0k0R9k5n2L3jL1n4L4Jj7qJ6o6
$$ y = [-11, -23, 11, 17, 34, 85, 74, -71, -3, 61, -1, 44, -30, -9, 29, -25, -28, -3, -25, -1, -16, 61, -37, -32, 24, 8, -31, 12, 38, -27, 8, -50, -12, 1, 22, -16, 42, -38, -17, -34, 34, 17, 25, 67, 11, 22, 2, -20, -66, -1, 1, 16, -60, -25, 36, 28, 21, 24, -3, 17, -18, -32, 8, 22, -19, 37, -64, -32, -16, 22, 26, -41, -9, -16, 16, -15, 5, -13, -12, -13, 18, -12, -1, 9, 39, 9, 13, 8, 10, -24, -9, 23, 60, 49, 43, 21, 26, -18, -10, -26, 10, -9, -83, -19, -21, -25, 19, -15, -69, 8, 19, 12, 36, 20, -8, 26, -28, 8, 3, 22, 27, -30, 31, 19, -68, 0, -61, 17, 90, 12, 18, 21, 1, 15, -13, -6, 11, 25, 30, 29, 70, -24, 63, 45, 5, 5, -24, 8, 16, 14, -41, -90, -15, -17, -22, 21, -18, -46, 12, -16, 25, 24, -7, 0, -18, -26, -41, -75, 10, 69, -27, 16, -23, 41, 1, -29, -32, 32, 12, 51, 1, 29, 0, -38, 52, 18, -39, 6, 56, 25, -26, -48, -21, -9, -14, -49, -6, -55, -13, -46, -1, 52, 23, 17, -78, 36, 9, 26, -9, 60, 44, -13, 18, -14, -8, -13, -28, -45, 8, -4, -67, -12, -19, -1, -26, -40, 54, -22, 26, -18, -26, 11, 25, -8, -10, -6, 1, 13, -20, -13, 24, -11, -24, -20, -28, 26, 22, 100, -8, 36, 67, 8, 3, -49, 8, -22, -42, 57, 32, -20, 13, 12, 43, -11, 23, 24, 7, -1, 15, -51]
5573e1J00p0M0L1o9M3j1o3N3Qj0K8Rn0J6J9j8j1m7O9L0m2l3L9l6M9K8p0P7q4O2
5604C6k0n5Q2k9J4j1n2K0J2J3Pj1k6J1l8O7l7PO9o4j7j5L1Q8m9j4n4L6Rk7K6k3
5636a4N6m7jO7k4L0q4%Q9o0m0J7J5J9m7K5ml0PN3j7m7J9j2O9p6R1l6j6J9m4KJ7
5669dK7k2n4O0Jj9M2qo7K0L3K9Rk0L6n8Jl3R4k9n7oL7n1O6L7n8m1M2l9M9l6P8
5702E9n1k5K5K7l3K7p1L6j2L6n8k0R1n5J8J3J4k1l3N3nJ1jM5j22P8j0j5LQk6K7
5734A3N1q8P9p8P9k8j8k8j6K7N1j2p8R2l5K1m6K8pk4M1k0j3M3M3k9PK9m1k8j0
5765Ek4oK2J7jl9J4M1jJ1n2m1J05k9ml5K7o1K0K2M6l1j9nk1M8l5L7k1J6K4J7l
5798D4o0Ml4M4M2n8M9j3Lo2N5M7l6J1m5j8K9rm1P6K1n5J7M0q6J18p3J0p7P1k5
$$ y = [-51, 49, -21, 19, 50, -19, 24, 13, -50, 3, 11, 1, 29, 38, -12, 4, 23, 5, -6, -53, 16, 46, 4, -29, 10, -26, 23, 51, -19, 58, -26, 36, 16, -39, 43, 14, 28, 17, -35, -15, -3, 10, 17, 6, -20, -9, -47, 20, -17, -10, 59, -5, -22, -37, -6, 82, 33, 19, -35, 1, 10, -17, 9, -14, 42, -5, -6, 61, 37, 67, -17, -17, 72, 12, -28, -11, 4, 23, -24, 1, -3, -33, -26, 27, 10, -37, -18, -30, 39, -37, 54, 18, 2, 21, -23, -21, -4, 23, 1, -53, 7, 8, -11, 31, 23, -44, -24, 9, 38, 47, 27, 63, 5, 6, -27, 67, 38, -19, -25, 12, -39, 27, 64, 6, -35, 7, -32, 17, -19, 59, 8, -17, 8, 35, 2, 29, -42, -6, -18, 18, -40, -60, 31, -24, -6, 7, 21, 0, -33, 20, 15, 26, 25, 70, -52, 26, 16, 1, 4, 12, -14, 13, 64, -24, 55, -23, 56, 28, 10, -18, -34, -7, 44, 32, -46, 46, 11, 32, -14, 14, 7, -17, 24, 4, -9, 34, 77, 48, 55, 84, 43, 15, 5, -19, -25, -3, 14, 13, -26, -12, 29, 28, 39, -13, -54, 51, 22, 18, -17, 10, -51, -31, -9, 37, 6, -13, -18, -39, 9, -26, 11, -10, 6, 30, 47, 44, -16, -12, -46, -2, 40, -18, 31, 18, 21, -41, 14, 61, 25, 36, -9, -27, 2, -7, -48, 28, 49, -6, 11, 51, -35, 83, 10, 20, -57, 14, -11]
5829a1Ll3M8l3L6M1om2oJ7M4q2J1JK8n3K4P2k3Pp6Q9o5OL8l9K7m3K5L0k4o0N6
5862GkM0j1l9rON2j3Pn7Pm0J32k4p2J8J4j2l9P0l1M4m9j0L1J5jl5j8L5P%j5%p1
5897f3N6j2jK1J2jk0Qj9J25j17jN4l6J7M0j19M4K1K3p6M9MM2Qo5K2Nj8PK9q4N7
5930A2JKk3j9L0j7j4K9m7Q5m2l1R8r7OrK4PK5rL3%J5m9NJ3j6J19j35O5n6m9L6
5963hmL8Qk4k5pK8jl3oL6k4J5OMJ6K0m9k7rQ8o5jK8n2K0j6Q3n4K1PK2m4M4mm9
5999a8O4L0o0jl5l1L0K0j6kO8o8j2K5Nom9M6N2j2r4L9K0L9K2l1j0K2L0j01R4o7
6031gK2k4J0J5Mj1L7%j6J2m0Q5q2PLom4O5k1l3M2rn5K9m9R4lq1P1l4O1k9pqp%
6067ijj2K3Ql6j1P9J4m9l0kl8O6PL0o2l0J18j13N3oj5K2K1k2L3Nj8K7n3J5m0O2
$$ y = [-11, -8, -41, 7, -26, 10, 51, 45, 3, -3, 14, 58, -24, -13, -12, 16, -37, -13, 59, 36, 43, -33, 56, -9, -3, 35, -4, 23, -20, 5, 35, 11, -49, 7, 5, 45, 34, -5, -14, -8, 44, 31, 38, -19, -12, -52, 80, 56, -16, 2, 16, 4, -35, 35, 4, 48, -1, -11, 20, 35, 34, -1, -19, 16, 23, 23, 8, 8, -63, -7, -19, -20, 1, 13, 12, -8, 0, -19, 106, -11, -12, 42, 6, 23, 63, -56, -12, 9, 32, -44, 5, 9, 51, 59, -6, 16, 21, 3, 10, 39, -45, 12, 13, 15, -8, -27, 3, -14, -28, 1, -46, 39, -3, -34, 64, -33, -27, -36, -12, -5, 20, 11, 44, 44, 59, 10, 15, 28, 12, 131, -4, 61, 5, -44, -8, -12, 26, 34, 10, -15, -22, 6, 5, -28, -34, 2, -22, -7, -1, 3, 19, 39, -10, -37, -46, 42, -23, -24, 4, -48, -28, -44, 39, -15, 6, 13, 35, -9, 35, 31, -18, 46, 76, 16, 15, -20, -51, -21, -1, -17, -19, 49, -19, -31, -6, -1, -7, -56, -10, 42, 30, -64, -25, -5, 34, 56, 25, 15, 37, 67, -34, 60, -7, 15, -9, 1, 16, 20, 9, 46, 46, 30, 42, 2, 87, 5, 12, 15, 9, -35, 30, 9, -24, 18, 9, -46, -17, -66, 28, 25, -56, 15, -19, 42, 13, 6, -2, -9, -9, -10, -22, 1, 9, -27, -38, 41, 55, 6, -24, -26, -64, 2, 9, 39, -23, -53, 65, -48, 5, -1, -16, 6, 27, 5, 38, 43, 25, 52, -1, 14, -26, 36]
6100C6j09R5j19R5m8O1J7K0j00J05J4m8L2r7O0M6q4k6PM4L2q3j5K4O5rk6J1K9
6129B9k0m0O0k5oK0l4L9NNQJ6r1N6nnm2l1O9L8l6j9RL9m3N1k5k3N1o9J9l9J0L6
6163GM7l3j6m3M2J5J4J7j14Q6kj1K9Lo6O2o6O1oL4r1L6Mom9L5Jj0L0J6m8nK5J
6197aJ0L1j1m5J9k7J8R3p3j1L7m3Pj4LN3m0qj8ROl7K3OJ6ln5O7L3k7j8n4N7j0
6231gK6Ko2J2L4k4KN9j5j2M3m5l1K4j6J3k8J5M5j2k2l7L0m4M7J4m6J9jM2q3J9
6263c9N2l4O6m6L3l6J5L9l0o5Q7m0j6j4QK2kJ5Lj4%mk5K7o9R4Mo6L0mj3J5J1K1
6297B5k3J7p5K1L3L7j1j0j5pj1KrrN9K8n1M3m0j9L4J5j1k9j6Oj0O6m0k0l1M0P
6330do2R3m0N1r3N8pK1j2l0PL4pM2k6m8L8mj2j8K3l9R1m3J2%MMll1M3r0J6N2P
$$ y = [36, -73, 22, -97, -2, -50, 11, 28, 48, -52, 53, 67, 19, 51, -46, 14, 60, -24, -50, -43, 1, 33, -50, -65, -41, 24, 15, -11, 0, 29, 9, -31, 29, 4, -2, 18, -16, 23, 28, 33, 41, 57, -34, 22, 17, 12, -30, -61, 8, 46, 10, -9, 0, 39, -4, 47, 22, -1, 50, -19, 0, -39, -29, 7, 54, 21, 5, -38, 4, 19, 33, 50, -64, 22, 20, 9, 38, 41, -25, 37, -29, 32, 26, 60, -31, 5, 9, 3, -46, -11, -10, -20, 10, 26, -22, -27, -2, -1, 9, 40, 29, -16, 3, -24, -6, 87, 14, 3, 40, -3, 4, -10, -7, 46, 6, -2, -20, -11, -5, -42, -19, -13, 3, 0, -55, 12, 45, 18, 0, -54, 3, -7, 19, 21, -41, -29, 5, -19, -17, 42, 27, 15, 58, 13, -18, 6, -10, 3, -25, -10, 35, 23, 1, -36, -6, -50, -3, 11, -35, -16, -17, 25, -58, -39, 13, -21, 45, -1, 32, -4, 11, 50, 20, -45, 42, 2, -14, -28, -20, 2, 0, 15, 18, 4, 4, 0, -25, 2, -67, 27, 31, -35, -5, -9, -22, -7, 4, 25, 2, 19, -56, -35, -2, 35, 24, 14, -1, -8, -19, -17, -26, -35, 24, 52, 1, 44, 4, -15, 19, 34, 23, -6, -22, -16, -26, 40, 0, -20, -51, -11, -4, -66, 27, -13, 38, -55, 3, -4, 17, 5, -25, -18, 16, 9, 51, 25, -23, 15, 11, -1, -19, 4, -35, 56, 13, 25, 25, 29, 33, 30, -1, 42, -48, -32, 20, 27]
6365B7o2J4Ln9P5l9N5Jk1ol3N1K6k3kP2r9O5j2m3L2K7o5L9j5j4J5rj6N3PJ2o8
6398a2K3RNm3jK3J2J6k4l3K0Qj8L6Mo9M2j3j3L4L4Lk0Pk4PJ5n4N0J5k8o9O0K6
6432B8l8RL6j7k6l7O6jk0lnO3o6K3K0J1n9O4l0nNl5k6O7l5N7jj5j4RKqk6J0m7
6467d4j2M8M6l5l0k4j2P5k3j8K6M6Oj3j6j9nQ9q5J7l5N7m1Lj0Q8j7l5O0j17lL6
6499CK5l4kkj9K5K1l9J9j3L6kpp0J10q1J3O9m6L8Lk3r8Q1j6L5ml4J4jl2K4L7n1
6533b1j6Q0j6J1j0On7J1nj8M6o5KM2pK0l0L2K1o7M7J3m4J2J5mM6l2j5O6o4K5m7
6566b3JK3L3j4j0ok9N0l3N3j06P5Pm2L4L2l6J7J9k5k0K1o2M5nm5K4M3k2K1j9L0
6598C1lj8J7j8qJ7n2rJ18n3qrjPqJ8n0P7oj8Ln3M9L4l7m5L3j4Nk5N0mk1K8k6R
$$ y = [27, -35, -21, -18, -77, -2, -41, 14, 15, -6, -12, -45, 6, 32, 9, 7, 79, -20, 45, 33, -10, 22, 49, -16, 23, 8, -6, 9, 0, -16, 37, 44, 56, -12, 11, 20, 25, -18, -19, 4, 16, 32, 8, -25, -5, 3, -15, 21, 25, -44, -2, -15, -28, 6, 40, 43, 23, 30, 6, 13, 28, -26, 24, 39, 11, -58, 2, 28, -10, -1, 35, 18, -8, -45, 21, 20, 0, -3, -8, 55, -11, 12, 32, 43, -16, 48, 18, 13, 18, -17, -43, 24, -11, 46, 45, 30, 16, 25, 27, 19, -7, 3, -44, -56, -8, 38, 3, -27, -51, -63, 12, -11, -29, -3, 43, 49, 36, 20, 1, -4, 85, 0, 17, -18, 39, -2, 1, -9, 79, 62, 27, 87, -30, -33, 3, 28, -6, -8, -10, -29, -4, 17, -22, -3, -16, 20, 18, 11, -59, 51, -30, -17, 52, 6, 44, 47, 24, -74, 7, -9, 26, 22, -12, 2, 1, -31, -7, 30, -21, -37, 43, 27, 38, 28, 34, -23, -12, -17, -35, 11, -54, -52, -10, -17, 3, -27, 5, 26, -41, 6, 19, -25, -13, 2, -2, 44, 12, -3, 63, -1, 24, -23, -22, 1, 34, 20, 10, 4, -25, 25, -8, 45, -61, 14, 21, -21, 13, 45, 9, 26, 45, 20, 0, 21, -41, 4, -1, -46, -22, 21, -1, 20, 1, 31, 28, 10, 27, 9, 1, 18, -34, -43, 75, 22, 14, 5, 4, 11, 3, 21, -29, 48, 42, 24, 27, -26, 23, 57, 20, -25, 8, -6, -1, -26, 24, 20, -1, 27, 1, 10]
6634A0n9P3o7J5N6j1%mm8j2P5lN7j9l8l6P3n6Lj8L5J3Pl5pJ3k5M8j15M9N1m4k7
6667d6P9n1j6J8N0m6k3K5MN3n6lK8K3o9M4o8O1O2j27P2n9R8p9L1l7R2o5n8M0N6
6698C3j5qJ2k8J8n4O6l0J2m5J3PQ8q7M4qj1m3J3L1K6p9P0j4K9m0k8k8N9lM3om
6731C3n4On5J11j6p5N1L5p3O7jj9Mj6K7m8J8k0J5M3Rn6J7k2L1j1k6L7MK9o8mK
6764b5L5kj2Qk3l1K7N7l2K6q7R1k7m2L5L2K3o2M4n9j5N2J1j2jl3pNJ8PL3k0J0
6797B4m7j6N5kK2p5M7J3K3kl5%m9oN2k2O1m4NK0n5M8o2J8P4o2L2j5K0L0n4q6J20
6830C2kk4m2O2q4N1j5k3M6K2no4L9JQ4p8l5L0j7K0J1L3k5n9L6j8M5j3L3m9j1L7
6862A8n3M8N1j11K9j4J2L7n8K9l0L4K5J3k8M3n7J5m4J2PJ0lkK3L9m7j0k8RO3o1
$$ y = [10, -49, 24, -43, -28, 28, 17, 17, 13, -35, -47, 28, 25, 82, 63, 25, -11, 62, 6, 9, -9, 26, 39, 46, 11, 4, 17, -8, 40, -75, -26, 25, -19, -46, 33, -18, -34, -16, 34, -12, -35, -10, -6, 47, -9, -12, 16, 39, -30, 14, -54, 7, 69, -58, 14, -45, 53, -26, 5, -32, 60, -5, -63, -23, 33, 18, 10, 22, -6, 12, -42, 24, -6, 6, -39, -26, -19, 69, -18, 26, 18, 7, -36, -23, 8, 34, -45, 25, 11, 40, 0, -28, -56, 3, 0, 43, 37, 33, -21, -15, -70, 41, 25, -50, 1, 36, -37, 30, 29, 10, 14, -2, 25, -23, -5, -25, -10, 33, 42, -14, 3, -19, 12, 1, -25, 12, 16, 45, -23, -27, -25, 10, 8, -4, 4, -19, -50, -23, 34, 2, 28, -59, 32, 5, -37, -2, 30, 53, -9, 35, -24, -39, 13, 24, 12, 11, -22, -29, -24, -6, 1, 34, 14, 24, -23, -39, 16, 14, 36, -39, 8, 21, 44, 42, 7, 7, -42, -48, 4, -18, 43, -1, 4, 24, -31, 17, -45, -27, 47, -15, 17, 2, 22, 52, -2, -88, 32, 30, 6, -36, 26, -58, -7, -22, -45, 1, 23, 18, -46, -7, -6, 78, 0, -35, -5, -22, -2, 9, 42, 17, -42, -6, -24, 21, 8, 41, -8, -19, 18, -35, 13, 64, -47, -18, -32, -20, 17, -41, -12, -42, -8, 17, 30, 2, 45, -12, 3, -41, -29, -22, -12, -15, -17, 6, 45, -2, -12, -40, -31, 32, -29]
6894b9P1o4J5K1L6o5Q%K0K6Pn8J8k9j5JJ2Rk8pN6P1j07PK7Jm3N2m1l4J06k8m6
6927c0M9j5n6Q1j6Rj0j9K4o3N9Qj0Mj6Kn5K9Q2mk8Roj1j0K1k7j0L0j2K5q3N6j4
6961gl3R2j1j3j8J8k9j2j2K7j1nK5rM2j6ok3j2N2j2n3O2m8k7K6qM6n1J1M5K5r0
6994c5L1k3K9mK0n2N8qk5PJN2m2Nn8O0p5R5%m5K8k8J1jK3k3K0k6o2J15p9L0J1
7027A0RN1p2m7N4O4j12P5j8k2Qj8N4kn6K8pk1J7M3LJl5k7J0N4o7rN0qJ9l0QqJ1
7062A0k8jl9O7J9m5L8mm3N0J9K4j23P0n9N6j5m9NK8M5k1Qm6L5K4k7J8J4k5k5J7
7094cL5m0K0Pk4M2o0QN8j1j2n8kO0l5m1N9K1m8%J15j25OM6mN2n5j8J2K2m1j6P5
7127D5n8%K5m0K1L5m6K0%j5M5p2J00l3m7L9j8J0l4L3l4K0M5m5ml4mP0m0LK2K6
$$ y = [-29, 42, -22, -7, 14, 50, -15, -7, -7, 13, 39, 46, -12, 6, -23, -38, -37, -25, -16, -44, -51, 5, 76, -31, -24, 3, 4, -39, 13, -28, -62, 44, 16, -30, 19, 4, -52, 29, 13, 22, 12, -7, 17, -46, 13, 21, 11, 15, -1, 1, -54, -25, 57, 53, 25, 34, 28, 17, 7, 28, 1, -9, 21, 9, 34, -49, 7, -7, -40, 52, 41, 28, 10, 28, -1, -13, -25, 2, -9, -14, 11, 2, 44, 28, 22, -1, -13, 39, 27, -26, 36, -12, -39, -13, -21, 25, -26, -15, 30, 55, -35, -4, -27, 2, -2, 18, -34, 24, 16, -9, -2, -1, 51, 9, 14, -44, 16, -59, 36, 36, -9, 19, -9, 2, 1, 24, 1, 21, -5, -67, 48, -31, -1, 10, 19, 70, -2, -49, 5, 69, -43, 32, 14, -8, 0, -18, 36, 34, -22, 6, -1, -22, -5, 38, 41, 42, 7, -20, -10, 44, -23, -32, 18, 10, 29, -1, 7, -1, 10, -18, -19, -58, 9, 28, -17, 21, 17, -26, 24, 43, 67, -56, 14, -45, 11, -4, -53, -48, -20, 25, 4, 12, -34, 1, 25, -2, 16, 30, 5, -20, -3, 32, -8, 12, 19, -5, 37, -23, -15, 43, 32, 20, -38, -40, 20, -15, -56, 3, 24, -24, -24, 91, -34, -28, 18, 14, 66, 11, -7, 5, 27, -14, -30, 45, -13, -13, 12, -28, -7, 28, -18, 2, 2, -13, 32, -40, 60, 27, -20, 19, 1, 11, -23, 10, -24, -4, 41, -4, -8, -42, -46, 24, -16, -13, 9, 35]
7159C5p1P7j9l4M2m5N1m7kM4j8mK4n3K3Mj8k1%O3Qj1j2mjK8%K9l5oMn4l1M7j9
$$ y = [35, -36, 41, 22, -12, 30, -15, 36, -11, -13, 31, 13, 9, 33, -20, 3, 7, -11, -32, -32, 31, 39, 28, 16, 12, 11, 39, 39, 68, 33, 27, 31, -23, -54, -7, -26]
$$ [...]
8191c
##END NTUPLES=NMR FID
##END=
