##TITLE=1H_Pr D-C6
 200.13MHz, CDCl3,
 8 sc
 
 4.2.2025
##JCAMPDX= 6.0         $$ Bruker NMR JCAMP-DX V2.0
##DATA TYPE= NMR FID
##DATA CLASS= NTUPLES
##ORIGIN= UXNMR, Bruker Analytische Messtechnik GmbH
##OWNER= pz
$$ XWIN-NMR		Version 3.5
$$ Tue Feb  4 14:28:44 2025 Russian Standard Time (UT+4h)  she@DPX200
##.OBSERVE FREQUENCY= 200.1313
##.OBSERVE NUCLEUS= ^1H
##.DELAY= (6, 6)
##.ACQUISITION MODE= SIMULTANEOUS
##.ACQUISITION SCHEME= undefined
##.AVERAGES= 8
##.DIGITISER RES= 18
##SPECTROMETER/DATA SYSTEM= spect
##.PULSE SEQUENCE= zg30
##.SOLVENT NAME= D2O
##.SHIFT REFERENCE= (INTERNAL, D2O, 0, 14.3821)
##AUDIT TRAIL= $$ (NUMBER, WHEN, WHO, WHERE, WHAT)
$$ ##TITLE= Audit trail, XWIN-NMR		Version 3.5
$$ ##JCAMPDX= 5.01
$$ ##ORIGIN= Bruker BioSpin GmbH
$$ ##OWNER= she
$$ F:/spectra/data/she/nmr/H-C/1/audita.txt
$$ ##AUDIT TRAIL=  $$ (NUMBER, WHEN, WHO, WHERE, WHAT)
(   1,<2025-02-04 14:27:34.60 +0400>,<she>,<DPX200>,
      <created by zg, POWCHK disabled, PULCHK disabled
       configuration hash MD5:
       00 E9 B6 7A A2 85 ED C7 34 08 36 98 17 FE 4E 26
       data hash MD5: 16K
       C0 82 A2 A6 09 6A 64 83 AD 14 A0 CC 6F BF D0 FB>)
$$ ##END=
$$ 
$$ hash MD5
$$ BE 56 5F B7 BD F0 49 E5 39 EE 5F B9 0F 42 8D 26
##$RELAX= 
##$RELAX= 
##$RELAX= 
##$RELAX= 
##$RELAX= 
##$RELAX= 
$$ Bruker specific parameters
$$ --------------------------
##$DU= <F:/spectra>
##$EXPNO= 1
##$NAME= <H-C>
##$PROCNO= 1
##$TYPE= <nmr>
##$USER= <she>
##$AMP= (0..31)
100 100 100 100 100 100 100 100 100 100 100 100 100 100 100 100 100 100 
100 100 100 100 100 100 100 100 100 100 100 100 100 100 
##$AQSEQ= 0
##$AQ_mod= 1
##$AUNM= <au_zg>
##$AUTOPOS= <>
##$BF1= 200.13
##$BF2= 200.13
##$BF3= 200.13
##$BF4= 200.13
##$BF5= 200.13
##$BF6= 200.13
##$BF7= 200.13
##$BF8= 200.13
##$BYTORDA= 1
##$CFDGTYP= 0
##$CFRGTYP= 5
##$CHEMSTR= <none>
##$CNST= (0..31)
1 1 145 1 1 1 1 1 1 1 1 1 1 1 1 1 1 1 1 1 1 1 1 1 1 1 1 1 1 1 1 1 
##$CPDPRG= <>
##$CPDPRG1= <>
##$CPDPRG2= <>
##$CPDPRG3= <>
##$CPDPRG4= <mlev>
##$CPDPRG5= <mlev>
##$CPDPRG6= <mlev>
##$CPDPRG7= <mlev>
##$CPDPRG8= <mlev>
##$CPDPRGB= <>
##$CPDPRGT= <>
##$D= (0..31)
0 0.7 0 0 0 0 0 0 0 0 0 0.03 0 0 0 0 0 0 0 0 0 0 0 0 0 0 0 0 0 0 0 0 
##$DATE= 1738664853
##$DBL= (0..7)
120 120 120 120 120 120 120 120 
##$DBP= (0..7)
150 150 150 150 150 150 150 150 
##$DBP07= 0
##$DBPNAM0= <>
##$DBPNAM1= <>
##$DBPNAM2= <>
##$DBPNAM3= <>
##$DBPNAM4= <>
##$DBPNAM5= <>
##$DBPNAM6= <>
##$DBPNAM7= <>
##$DBPOAL= (0..7)
0.5 0.5 0.5 0.5 0.5 0.5 0.5 0.5 
##$DBPOFFS= (0..7)
0 0 0 0 0 0 0 0 
##$DE= 6
##$DECBNUC= <off>
##$DECIM= 32
##$DECNUC= <off>
##$DECSTAT= 4
##$DIGMOD= 1
##$DIGTYP= 9
##$DL= (0..7)
0 120 120 120 120 120 120 120 
##$DP= (0..7)
150 150 150 150 150 150 150 150 
##$DP07= 0
##$DPNAME0= <>
##$DPNAME1= <>
##$DPNAME2= <>
##$DPNAME3= <>
##$DPNAME4= <>
##$DPNAME5= <>
##$DPNAME6= <>
##$DPNAME7= <>
##$DPOAL= (0..7)
0.5 0.5 0.5 0.5 0.5 0.5 0.5 0.5 
##$DPOFFS= (0..7)
0 0 0 0 0 0 0 0 
##$DQDMODE= 0
##$DR= 18
##$DS= 0
##$DSLIST= <SSSSSSSSSSSSSSS>
##$DSPFIRM= 0
$$ [...]
##$SUBNAM0= <"">
##$SUBNAM1= <"">
##$SUBNAM2= <"">
##$SUBNAM3= <"">
##$SUBNAM4= <"">
##$SUBNAM5= <"">
##$SUBNAM6= <"">
##$SUBNAM7= <"">
##$SUBNAM8= <"">
##$SUBNAM9= <"">
##$SW= 18.0517328524113
##$SWIBOX= (0..15)
0 0 2 0 0 0 0 0 0 0 0 0 0 0 0 0 
##$SW_h= 3612.71676300578
##$TD= 16384
##$TD0= 1
##$TE= 0
##$TE2= 300
##$TE3= 300
##$TEG= 300
##$TL= (0..7)
0 120 120 120 120 120 120 120 
##$TP= (0..7)
150 150 150 150 150 150 150 150 
##$TP07= 0
##$TPNAME0= <>
##$TPNAME1= <>
##$TPNAME2= <>
##$TPNAME3= <>
##$TPNAME4= <>
##$TPNAME5= <>
##$TPNAME6= <>
##$TPNAME7= <>
##$TPOAL= (0..7)
0.5 0.5 0.5 0.5 0.5 0.5 0.5 0.5 
##$TPOFFS= (0..7)
0 0 0 0 0 0 0 0 
##$TUNHIN= 0
##$TUNHOUT= 0
##$TUNXOUT= 0
##$USERA1= <user>
##$USERA2= <user>
##$USERA3= <user>
##$USERA4= <user>
##$USERA5= <user>
##$V9= 5
##$VALIST= <valist>
##$VCLIST= <CCCCCCCCCCCCCCC>
##$VD= 0
##$VDLIST= <DDDDDDDDDDDDDDD>
##$VPLIST= <PPPPPPPPPPPPPPP>
##$VTLIST= <TTTTTTTTTTTTTTT>
##$WBST= 1024
##$WBSW= 4
##$XGAIN= (0..3)
0 0 0 0 
##$XL= 0
##$YL= 0
##$YMAX_a= 99552
##$YMIN_a= -142068
##$ZGOPTNS= <>
##$ZL1= 120
##$ZL2= 120
##$ZL3= 120
##$ZL4= 120
##$ABSF1= 10
##$ABSF2= 0
##$ABSG= 5
##$ABSL= 3
##$ALPHA= 0
##$AQORDER= 0
##$ASSFAC= 0
##$ASSFACI= 0
##$ASSFACX= 0
##$ASSWID= 0
##$AUNMP= <proc_1d>
##$AZFE= 0.1
##$AZFW= 0.1
##$BCFW= 1
##$BC_mod= 2
##$BYTORDP= 1
##$COROFFS= 0
##$CY= -3
##$DATMOD= 1
##$DC= 2
##$DFILT= <>
##$DTYPP= 0
##$F1P= 0
##$F2P= 0
##$FCOR= 0.5
##$FTSIZE= 0
##$FT_mod= 4
##$GAMMA= 1
##$GB= 0.15
##$INTBC= 1
##$INTSCL= 1
##$ISEN= 128
##$LB= 0.25
##$LEV0= 0
##$LPBIN= 0
##$MAXI= 10000
##$MC2= 0
##$MEAN= 0
##$ME_mod= 0
##$MI= 1.114404
##$NCOEF= 0
##$NC_proc= 0
##$NLEV= 6
##$NOISF1= 3.799351
##$NOISF2= 2.8
##$NSP= 1
##$NTH_PI= 0
##$NZP= 0
##$OFFSET= 14.38212
##$PC= 1
##$PHC0= -23.56133
##$PHC1= 17.19222
##$PH_mod= 1
##$PKNL= yes
##$PPARMOD= 0
##$PSCAL= 0
##$PSIGN= 0
##$REVERSE= no
##$SF= 200.129724274929
##$SI= 16384
##$SIGF1= 3
##$SIGF2= 2
##$SINO= 400
##$SIOLD= 16384
##$SREGLST= <1H.CDCl3>
##$SSB= 0
##$STSI= 0
##$STSR= 0
##$SW_p= 3205.1282051282
##$SYMM= 0
##$S_DEV= 0
##$TDeff= 0
##$TDoff= 0
##$TI= <>
##$TILT= no
##$TM1= 0
##$TM2= 0
##$TOPLEV= 0
##$USERP1= <user>
##$USERP2= <user>
##$USERP3= <user>
##$USERP4= <user>
##$USERP5= <user>
##$WDW= 1
##$XDIM= 8192
##$YMAX_p= 0
##$YMIN_p= 0
$$ End of Bruker specific parameters
$$ ---------------------------------
##NTUPLES= NMR FID
##VAR_NAME=  TIME,          FID/REAL,        FID/IMAG
##SYMBOL=    X,             R,               I
##VAR_TYPE=  INDEPENDENT,   DEPENDENT,       DEPENDENT
##VAR_FORM=  AFFN,          ASDF,            ASDF
##VAR_DIM=   8192,          8192,            8192
##UNITS=     SECONDS,       ARBITRARY UNITS, ARBITRARY UNITS
##FACTOR=    0.0002768,     1,               1
##FIRST=     0,             0,               0
##LAST=      2.2672688,     0,               0
##MIN=       0,             -142068,         0
##MAX=       2.2672688,     99552,           0
$$ Real data points
##PAGE= N=1
##DATA TABLE= (X++(R..R)), XYDATA
0@%%%%%%%%%%%%%%qJ6j6J6j6K4l2M0m8N6o4P2q8J04j20J36j52J68j92K24k56K88
36A52l20L56l96M40m94N50o08O76p49Q29r16J009j113J228j352J488j640J808
54I48j997K211k451K725l041L409l850M387n053N906p046Q653j1103J5349k4689
69a5642Q1169n5045j43095J48042N3638r3458j0089P5415n7353k7388R3468O798
81E6460j19781J9637J01946l5496p9008N0494L7598m3534Q311M2564n0739l3574
93d5122O8266J5714p7246Q623O9651k6732m8136M7926K1518o0314r85N6322k4142
106E343m2321M5880K6353n6707k102O0841k0486n8847L4637M3323m5845k1382
118c1313N5389J564n5737J8405M9595l7065m2081M5762K7438m8705q197N0747
$$ plain form
0 0 0 0 0 0 0 0 0 0 0 0 0 0 0 0 -8 8 -8 8 -8 16 -16 24 -24 32 -32 40 -48 56 -64 72 -80 88 -104 120 -136 152
36 152 -168 188 -208 232 -262 288 -320 356 -393 436 -480 529 -584 644 -708 780 -860 948
54 948 -1049 1162 -1289 1436 -1605 1804 -2046 2341 -2712 3194 -3852 4801 -6302 9047 -15642
69 -15642 65527 10482 -132613 15429 69067 -24391 -34480 40935 -16418 -43806 49662 56460
81 56460 -63321 -43684 58262 22766 -56242 -5748 31850 -11684 -3373 39191 -11548 -45122
93 -45122 23144 38858 -38388 -29765 39886 13154 -34982 12944 34462 -25852 -26837 29485 5343
106 5343 -36978 8902 35255 -21452 -23554 37287 16801 -42046 -7409 35914 -9931 -31313
118 -31313 24076 25640 -30097 -11692 37903 838 -41243 4519 31957 -16748 -24945 25802
130B5802o306m5819J7832L4900k7503k3377K9287Q632k4628J0046K0724k4364
142d774j5187L2508O066l7809L62L4635n923k2099J4661P753k2240O622K5806
155B0381k0953k7803L0101K5466l1538j3988L1026j258k8403J5507K0761k9623
167a0324j2719L8761M410l9034P266L4198j9724k6085K8319J3438l3407Q60L4649
180B0608j2660k8386K3507J7520l2296n740L4907p356l2191J9247K5181k6175
192c834j2877K8609l037k8185J7470K3146k8851j4206L6548M548l6306O498K9301
205A8824j7980j8675K6298N349l0519Q624L0482k0026k5072K7542J4186l1875
217a2842j484L1268j0720k5467K1507J6832k7633n634K8603p061k5634J8193J8825
$$ plain form
130 25802 19496 -26323 -8491 26409 -1094 -24471 4816 13448 -11180 -1134 19590 -4774
142 -4774 -19961 12547 18613 -19196 -18834 15801 9878 -12221 2440 10193 -12047 -5425 20381
155 20381 -572 -28375 1726 27192 -4346 -18334 12692 11434 -16969 -1462 19299 -10324
167 -10324 -23043 15718 20128 -18906 -11640 22558 2834 -23251 5068 18506 -14901 -14041 20608
180 20608 7948 -20438 3069 20589 -11707 -17447 17460 10104 -22087 -2840 22341 -3834
192 -3834 -16711 11898 8861 -19324 -1854 21292 -7559 -21765 14783 19331 -16975 -10477 18824
205 18824 844 -17831 8467 13816 -16703 -8079 22403 2377 -22695 4847 19033 -12842
217 -12842 -14326 16942 6222 -19245 2262 19094 -8539 -14173 14430 7369 -18265 -72 18753
230A8753k5594q666K8897k216k7352J1916K0394k0468j0922K5794L35k6590J0558
243e161K3728j8912j7246K3545P697k4432L115K2064j2840j6335K0608Q452k5379
256a1096j03K5222q614k1310J5950J4590k0428n791K2196l488k0814J1785J6199
269A4298j8065r114K1647J326k1424O516J7863j3240j2179J7490M310j9164M148
282e588J7802j1550j3574J7000P081j9807K95J9547p409j6067J3855J0636j7913
295e692l548J9009m103j7428J0587J2913j5422o634J7843n05j7570P438J4599
308A1487j3256r537J7034L247j7927L495J6526r286j2718J3613P087j5935p41
321f911J5764n650j3187J0997Q625j4530l169J5609k879j4433Q410J1142j2497
$$ plain form
230 18753 -6841 -15507 13390 11174 -16178 -4262 16132 -4336 -15258 10536 10871 -15719 -5161
243 -5161 18567 -345 -17591 5954 13651 -10781 -7666 14398 1558 -14777 5831 14283 -11096
256 -11096 -11199 14023 5409 -15901 49 14639 -5789 -11580 10616 7128 -13686 -1901 14298
269 14298 -3767 -12881 8766 10092 -11332 -4816 13047 -193 -12372 5118 9428 -9736 -5588
282 -5588 12214 664 -12910 4090 11171 -8636 -8341 11206 3797 -12270 1585 12221 -5692
295 -5692 -9240 9769 5666 -11762 -1175 11738 -3684 -10318 7525 7020 -10550 -3112 11487
308 11487 -1769 -11306 5728 8975 -8952 -5457 11069 1783 -10935 2678 9765 -6170 -6911
321 -6911 8853 3203 -9984 1013 9638 -4892 -8061 7548 4669 -9764 -1354 9788 -2709
334b709n743J4957k78j4995O268J2748j1237q764J4421L422j5500K373J4147p939
348A171j0777J2124N508j4395M21J4556o037j2315J0911Q332j4014k990J4933
361G428k836j3600Q270J0258j2158n508J4185j64j4179N407J1798r940p705J2911
375D167K476j3620L146J2310q053r054J1868M435j3663Q94J3481o023j1330J0149
389A183P273j2813k398J3185k796j1626P547Q346j1000l756J2702j282j2381O126
403a690J0068r709o045J1929J193j2270L676J0749q111p692J1121L498j2509J064
417d728J1858n350r507Q632N804j0509j242J0925l200r544P255O776r990l074
431e894J1290j231j1023N103R047q251n815J0133J595j0631K796R681o784p211
$$ plain form
334 -2709 -8452 6505 6227 -8768 -2500 10248 -989 -9753 4668 8090 -7410 -5037 9110 1171
348 1171 -9606 2518 8026 -6369 -5948 8608 2571 -9744 1167 9499 -4515 -7505 7428
361 7428 4592 -9008 -738 9520 -2638 -8146 6039 5875 -8304 -2897 8901 -1039 -8744 4167
375 4167 6643 -6977 -3831 8479 426 -8628 3240 7675 -5988 -5094 8387 2364 -8966 1183
389 1183 8456 -4357 -6755 6430 3634 -7992 -445 7901 -3099 -6855 5847 4565 -7816 -1690
403 -1690 8378 -1331 -7376 4553 5746 -6524 -2848 7901 -210 -7902 3219 6717 -5792 -4728
417 -4728 7130 1780 -7727 905 6709 -3800 -5042 5883 2683 -6861 394 7170 -2820 -5894
431 -5894 5396 4165 -6858 -1755 7292 -959 -6774 3359 4954 -5677 -2881 6800 16 -7195
445g195R591L939j0737J64J0342m327q404P867N175j0154j093J0787l248r733
459g026P037P005r912l404J1185p51j0628M781Q524q000m841R906N40j0064L873
474a775Q732p641o131J0148K537j0993J210R842m981p034P927L266r760P61J0224
489F332m264q985O895O300q327k495Q692j507p726M873N682p398k775Q665o37
504C325q730L775P460o305n243P877K110q222J449P582m516n910O966L427q369
519c324l19Q620k768p670N190N353o820k168P359j585p015N081N840p597l750
534e573Q791Q97q457K410P057n356m808P518J999q298J108P578m244n718O872
549A776K986q478k16Q583k545p199M803M678o315j238P058k255o662N257N341
$$ plain form
445 -7195 2396 6335 -4402 -4238 6104 1777 -6627 1240 6415 -3739 -4832 5955 2707 -7026
459 -7026 11 7016 -2896 -6300 4885 4134 -6494 -1713 6811 -1189 -6030 3876 4416 -5648 -1775
474 -1775 6957 -684 -6815 3333 5870 -5123 -3913 5929 948 -6086 1841 5107 -4653 -3892 6332
489 6332 2068 -6917 -22 6278 -2049 -4544 4148 2641 -5085 -212 5470 -1928 -4703 3962 3325
504 3325 -5405 -1630 5830 -475 -5718 2159 4269 -3953 -2504 5078 562 -5348 1618 5045 -3324
519 -3324 -3643 4977 2209 -5461 -271 5082 -1738 -3906 3453 1868 -5147 -66 5774 -1823 -5573
534 -5573 3218 4115 -4342 -1932 5125 -231 -5039 2479 4478 -3820 -2712 4866 622 -5096 1776
549 1776 4762 -3716 -3932 4651 2106 -5093 -290 4388 -1927 -3165 3893 1638 -5024 233 5574
564E574p236l240P954O71p345J872N528m520k959O533J39p557K351P427m205n917
580d930N443L379o110k58O272k541n544M685L882o043j509O527j288o301L682
595f54N325n407l601O132J025n974J958N072m468l415O407J451p436O91P316k697
611A725o048M306L606n229n96N375k640m949N222L900o735k069P029k87o114K808
627f96M511n030k213O238j11o329K505N247m555l589N941J447o406P29N620k732
643E77l897M313J628n343Q77N691k985n100M596L774n448j830N508l69m873K500
659c81L496m337j847N453N6n798J638N171k956l609M022J414m558Q88M603k905
675C50l756M397K221n304k27N444j878m925L551L571m531j728M831o60m351K895
$$ plain form
564 5574 -1662 -4902 3052 3723 -3622 -1750 3778 -742 -3701 2832 2971 -4586 -2235 5192 987 -4930
580 -4930 513 3892 -2218 -2476 3796 1255 -4289 396 4278 -1765 -3274 3253 1965 -4336 -654
595 -654 4671 -736 -4337 1795 2820 -3154 -1196 3876 -592 -4007 2400 3851 -3585 -2894 4422 1725
611 1725 -4323 -17 3589 -1640 -2236 3139 499 -4450 772 4672 -2063 -4132 2897 2610 -3504 -696
627 -696 3815 -1215 -3428 2810 2699 -3630 -1125 4122 -433 -4022 1919 3366 -3040 -2311 3309 577
643 577 -3320 993 2621 -2722 -1845 3846 861 -4239 357 4131 -1317 -3147 2361 1992 -2881 -381
659 -381 3115 -1222 -3069 2384 2440 -3358 -1720 3451 495 -3114 908 2322 -2236 -1348 3255 350
675 350 -3406 991 3212 -2092 -2319 3125 1247 -3678 -127 3444 -1087 -2815 2016 1356 -2995 -100
691a00L313m530j705N449o0n362J947M370l475k755M438O57m875J558M468l424
707h6l459M615J922n005j05M615j695l479L190K017m125k62M328j431l728K835
723A47K650l895j239M238k65l973J540L124k721j826L501K98l768J252L474k351
739A86k666L172J416l415J1L282j541k618K755J548l615k94L885j044l573K156
755c55K786k991j585L523J40l448J232K925k372j881L150O35l466P20L189j977
771B25k499K891J335l400M9L297j391k776K562J859l271o45L519o18l161J822
787b02K335k661j161L109k15l121J515K532k552j671L260L84l365Q70L027j992
803I2k189K805J097l164J61L089j412k469K389J504k921l63K953q54k601J899
$$ plain form
691 -100 3213 -1317 -3022 2427 2367 -2995 -1048 3322 -153 -2908 1530 2187 -2688 -1130 3338 -86
707 -86 -3545 1070 2992 -2013 -2118 2497 802 -2677 513 2530 -1595 -1857 2471 1040 -2688 147
723 147 2797 -1098 -2337 1901 1636 -2337 -797 2327 -394 -2220 1281 1579 -2189 -937 2537 186
739 186 -2480 692 2108 -1307 -1296 1986 445 -2173 582 2130 -1485 -1779 2106 1062 -2511 -355
755 -355 2431 -560 -2145 1378 1518 -1930 -698 2227 -145 -2026 1124 1759 -1707 -987 2202 225
771 225 -2274 617 1952 -1448 -1399 1898 507 -2269 293 2152 -1119 -1764 1755 1137 -2024 -202
787 -202 2133 -528 -1689 1420 1205 -1916 -401 2131 -421 -2092 1168 1552 -1813 -943 2084 92
803 92 -2097 708 1805 -1359 -1198 1891 479 -1990 399 1903 -1018 -1381 1572 718 -1883 16
819A6J783k636p82K992l74k863J505K314k328j394K868L37k874P23K522j697j774
836a662K316P84k637L28K425j343j915K111J126k607j07K669q47k392J823J676
852A748k383p83K668k69k499J229J985j987j219K423K31k505P36K152j601j486
868a560K177O08k430M24K350j319j891K068J183k492k46K511p26k143J451J516
884A481k086o36K324l40k180J184J766j927r57K314P2k316Q20K029j582j427K166
901G05N75k349L08K185j168j758J837R69k153j47K135p35j786J513J194k011l52
918a038K259n46k078J344J672j998r42K253Q7k215P09J851j463j211J926L37k093
935a146M61J972j171j440J754P18j984O9J998q87j599J535R96j981k48K078n18
$$ plain form
819 16 1799 -837 -1619 1373 999 -1864 -359 1955 -373 -1767 1101 1438 -1436 -713 1809 112 -1662
836 -1662 654 1438 -1199 -871 1554 211 -1704 407 1533 -1074 -1181 1488 641 -1751 72 1748
852 1748 -635 -1418 1250 981 -1518 -289 1696 -291 -1510 913 1144 -1361 -625 1527 -74 -1560
868 -1560 617 1225 -1205 -781 1569 250 -1641 427 1610 -882 -1128 1383 657 -1486 -35 1481
884 1481 -605 -1241 1083 743 -1437 -253 1513 -414 -1371 943 1015 -1301 -481 1548 -34 -1461 705
901 705 1280 -1069 -761 1424 256 -1502 335 1304 -849 -996 1139 404 -1382 131 1325 -686 -1038
918 -1038 1221 675 -1403 -59 1613 -385 -1327 926 1013 -1202 -493 1358 -105 -1316 610 947 -1146
935 -1146 -685 1287 116 -1324 430 1148 -836 -767 1231 344 -1255 280 1276 -705 -953 1125 607
952F07j913J129J429j573p77J806n7j694Q08J415j380q46J751J62j818N19J633
969A201j128j266J605O22j793O0J692p41j421J245J016j603m07J720k83j541R03
986a19J195j352o27J571K6j557O64J304j289r15J731L09j895K94J742q87j321
1003a126J306Q20j612p6J639n98j351J208Q92j655k80J763l15j631R10J121j407
1020c92m53J638k22j714Q40J503j337r47J617L09j635L15J426q75r42J278L30
1037G39j453L12J431q92j193J227P47j426j50J448m44j294R14R53j217m24J362
1054F40j05j339O89J088j052p81J198L34j229K18J072p73q27J198M05j385O8J412
1072H31n20j270R57R37j193m45J301j71j124O83R01j195m97J454l2j445N11J217
$$ plain form
952 607 -1306 -177 1252 -321 -1098 708 651 -1043 -235 1180 -200 -1046 705 867 -951 -432 1201
969 1201 73 -1193 412 1034 -759 -699 993 252 -1169 76 1092 -511 -918 802 519 -1022 -119
986 -119 1076 -276 -903 668 694 -863 -199 1105 -184 -1099 632 941 -954 -660 1082 195 -1126
1003 -1126 180 1000 -612 -688 951 353 -998 210 1102 -553 -833 930 615 -1016 -106 1015 -392
1020 -392 -845 793 571 -1143 -303 1200 -137 -1084 533 842 -793 -478 948 73 -869 409 739
1037 739 -714 -402 1029 137 -1056 171 918 -508 -658 790 346 -948 -34 919 -298 -722 640
1054 640 535 -804 -115 973 -79 -860 338 672 -557 -339 733 -40 -867 331 736 -649 -581 831
1072 831 311 -959 -2 935 -258 -703 598 427 -697 -14 887 -308 -805 649 617 -828 -317 900
1090I00j022p39J346J88j443M08J282r35q68J342L86j563J36J498n90j169R26
1107H3O04j145KJ205n76j076R49P65j193l16J338j94j182N88R28r00m58J021p
1126D36j081M77R52p48p43R61L12j010J28Q86m87p43Q06M18r24k8R87l57r65P67
1146D4P98r98m88R85J03r31L29O98o64m89R75J35j067K66R71o31p15Q75M36j047
1166d15L5R80m57p74P92N36j063j66J109k24r81N27P14q15l36R41o7q96M54P33
1186F27p99l77J036j9j038K81R70o06o50P92K27q65R8Q74m42p36P12M56q62q1
1206d02Q49k08p36N20N17p22k12Q25j48q12M39P16p06m37P75J85q53J24P64m45
1226C3n27O55K64p69Q0P74l95o36O35M13p73j32P88j96p14M90N36p31k59Q53o8
$$ plain form
1090 900 -122 -861 485 673 -770 -362 920 -15 -883 459 845 -718 -582 916 326 -843 83
1107 83 687 -458 -456 749 173 -903 46 811 -382 -698 640 446 -736 -148 780 -120 -578 443 436
1126 436 -645 -168 784 36 -707 254 566 -444 -316 570 83 -660 146 564 -360 -388 599 242 -723 44
1146 44 842 -156 -644 341 444 -487 -158 540 -124 -613 362 497 -570 -304 667 36 -679 196 632 -415
1166 -415 -380 600 143 -631 161 697 -366 -532 577 353 -628 -101 613 -202 -538 403 336 -560 -106 627
1186 627 -172 -549 487 468 -570 -289 681 75 -575 217 444 -421 -323 551 109 -627 85 541 -321 -402
1206 -402 447 239 -497 23 540 -182 -394 431 283 -529 -90 626 -80 -517 258 443 -410 -286 478 33
1226 33 -494 161 425 -344 -264 510 115 -521 114 527 -246 -378 410 214 -500 -10 526 -205 -464 389 321
1247C21q15L39O74n88m04P40J13p52K12O22m98l99O90J74q16J79P31m20n99N99
1267A03L48p39o0P14k06o10M55M51o44j50O86j23n72K81M96n21k91O36L1o90K46
1288a59N96m61m24O21K08o71N4O51l34n03N20L35o25k8N75j78n31M03L48n52j33
1309b88O35j66n69L13M89m92l44O36P7o27K05N14l71l49N08J69n76O7N16l01m16
1330c70N00J81n50N2N20k70m57M37L20n40j19O07n5n82L08L98m77j52M72nm70
1351b52K02L48l27k74M67Q8n14J18M76l19l45M33K06n15rN24j94m17L33K85m26
1372a12j17M44n8m15K13L33l61j67M36%m48J71L50k76k80M23J30m67O0M43j66
1393A36m44L67K51m63n3M47j54l99K93K84l71j50M65p5m57K54L73l57k24M78K2
$$ plain form
1247 321 -494 -155 519 -69 -473 267 380 -372 -160 462 -36 -435 255 429 -387 -208 523 103 -496 103
1267 103 451 -288 -348 366 160 -450 5 456 -188 -338 348 225 -347 -66 430 -91 -382 254 285 -405 -159
1288 -159 437 -24 -448 173 381 -290 -236 415 81 -422 98 433 -192 -220 355 177 -354 49 397 -155 -288
1309 -288 347 181 -388 -75 414 -78 -422 214 291 -336 -131 383 12 -337 171 340 -236 -169 347 46 -370
1330 -370 130 311 -239 -187 333 63 -394 43 363 -177 -296 311 256 -326 -18 380 -97 -249 223 218 -252
1351 -252 -50 298 -29 -303 164 252 -262 -144 332 13 -332 101 307 -208 -217 307 113 -304 29 314 -112
1372 -112 -229 215 157 -258 -45 288 -73 -240 196 196 -252 -81 269 -7 -287 136 266 -201 -141 302 136
1393 136 -308 59 310 -153 -206 241 87 -312 -19 265 -106 -256 209 134 -323 -69 304 -53 -277 201 223
1414B23n04J80M42l30l23M31J16m57P6L99k15l02L64J70m60L2M28k11l43L36K37
1435B89m22p1M61j41l93K53L21l58j84M27j0m19J84K97k80k06L80M8l97R7L59
1456B35k29k33L23J84m55K3M10j38l56K38K54l55r2L74m2l57J89K66k87j71L97
1477A78%l93J70L10k79k23L75O3l79M8L96k57k73L40J52m00k5M00j32l08K81J95
1499B39l49p0L88j25l63L16K42l55r9L85m9l98J60L56k78k50L50P8l57R7L04k26
1521dk03K99J27l51OL15j20k67K72J33l26n9L63r6l07J83K53l12j47L53K9l02
1543a61Q3K51j94j47L12P2l50O2K98j70k44K68J33l49m2L70r8l09K11K27l36q4
1565a97L71om02J47K81k35j35L47rl81J83K54k78j39L34L2l53Q3L35k26k47K93
$$ plain form
1414 223 -281 -101 341 11 -312 119 235 -222 -146 253 38 -264 100 270 -190 -158 270 59 -284 52 289
1435 289 -133 -204 257 116 -277 -24 297 -61 -245 182 172 -247 -63 234 -46 -252 128 176 -221 -124 235
1456 235 6 -227 96 280 -175 -152 258 120 -236 2 256 -99 -191 183 141 -216 -27 239 -48 -219 178
1477 178 178 -215 -45 265 -14 -237 138 201 -178 -130 266 9 -264 76 228 -172 -197 203 71 -237 44 239
1499 239 -110 -180 208 83 -280 36 278 -77 -176 209 160 -238 -78 278 0 -250 100 178 -179 -82 222 -4
1521 -4 -207 92 219 -132 -126 189 69 -198 74 207 -119 -178 185 89 -218 -35 218 -94 -241 112 141 -161
1543 -161 -78 173 -21 -168 144 216 -134 -72 226 56 -188 80 213 -136 -178 192 94 -215 -4 223 -113 -197
1565 -197 174 168 -234 -87 194 -41 -176 171 162 -219 -36 218 -60 -199 135 167 -186 -103 232 6 -241 52
1587E2J32k97K9L29j52k66K21J57k58j6K10o7k33J65J58k07j09K84k3k69J16K23
1609A79k07j71K70O6k14l7K53j00j86J93J37k64m7K43l4k40J89J48k58q4K91j7
1631A10k83J18K70k29j55L18P0l49QL18j39k13K46J15l39N7K65j48k34K48J06
1652A60l36K8L44j04l04J78K23k82n3K96k7l20J90J81k28j01K61k0k41J08K06
1673A59j83j43K62Ok19R0K06j62j66K01J38k43l6K02n6j68J25J27j99m6J92k7
1695F0j81J06J32j45j03J86Q0k07J8J70j20j57K18J18k29r9K42mk12J16J77k12
1717d6p5K30m4j80J06J93k32q1K76J5k90Q9K37k21j33K82Qk51L1K43j55j76K45
1740G1O1k51M5K18j05j74J69Q6k12J7K12r8j79J64J80k52p6K32k0k36R5J78j56
$$ plain form
1587 52 184 -113 -84 245 93 -173 48 205 -53 -69 141 74 -159 6 164 -43 -152 132 109 -160 -44 179
1609 179 -28 -199 71 137 -77 -114 139 39 -147 46 183 -81 -128 115 81 -159 30 178 -80 -164 127 110
1631 110 -173 -55 215 -14 -169 149 219 -130 -122 196 57 -156 90 205 -134 -77 188 40 -194 54 160
1652 160 -176 -148 196 92 -212 -34 189 -93 -146 150 123 -197 -7 174 -54 -155 106 86 -155 -47 159
1673 159 -24 -167 95 101 -118 -28 178 16 -150 51 189 -54 -90 112 56 -112 13 140 -59 -105 87 60
1695 60 -121 -15 117 -28 -131 55 135 -72 -54 116 -4 -161 57 175 -54 -153 89 85 -127 -11 166 -46
1717 -46 -121 109 65 -115 -9 184 -48 -129 147 162 -128 -39 198 -23 -156 126 134 -117 -86 157 2 -174 71
1740 71 132 -119 -74 144 39 -135 34 120 -92 -75 137 39 -140 24 204 -48 -124 108 88 -148 -53 125 -31
1763c1o4J79oj73N6J87j20j52K04L6k07K5J87r8j51J16J46k16k2K09j8k17J24
1786fJ48j57j02J87lj67O6J46j00j29J78O5j98K9J99j10j57J49Q4j89qJ94o7j69
1810a17J18J34j74m1J59k2j63R7J42j64p7J91j3j89J02J47j36j37K01M8k34O1
1832f7J83j03j22J45R8j78jJ64q0j43J25R7j65l7J86l7j79R1J27j26n2J52L1j88
1856g9L0K00j75q1J29R1j88K1J51j02j05J63J1j01lJ21r4q4J39O9j46m4J76n1
1880D8j43P8J61j20r6J34%j37P0J33j04j25J60L4j39pJ81j25j17J44J02k20L1
1903e7J35j9j36P9J15j72l0J39j9j18N8Q7r4o7J45K0j58L7J48p7j04J23P0j89
1927h4K5J63o5j09Q6R9j45n0J75m4j24P2J17j37o7J61j6j32N4J29j34p2J74J9
$$ plain form
1763 -31 -95 84 78 -95 -39 148 28 -124 80 116 -91 -66 121 23 -128 -12 134 -82 -104 105 87 -130 -6
1786 -6 142 -15 -117 70 67 -100 -34 112 12 -117 61 126 -72 -43 156 46 -111 38 122 -67 -75 119 52 -117
1810 -117 1 135 -39 -80 79 57 -106 -9 133 -31 -108 83 70 -119 -17 130 -6 -143 58 106 -128 -67
1832 -67 116 13 -109 36 134 -44 -45 119 39 -104 21 118 -47 -84 102 65 -114 -23 104 -22 -74 78 109 -79
1856 -79 -49 151 -24 -105 24 115 -73 -52 99 -3 -108 55 66 -35 -38 83 -11 -95 44 113 -33 -77 99 48
1880 48 -95 -17 144 24 -72 62 62 -75 -5 128 24 -101 59 93 -46 -53 128 3 -114 30 132 -88 -57
1903 -57 78 59 -77 2 117 -55 -85 54 35 -83 -25 62 -32 -99 46 66 -92 -55 93 16 -88 35 105 -84
1927 -84 -59 104 39 -70 16 115 -30 -80 95 51 -73 -1 116 -21 -88 73 57 -75 -21 108 -26 -98 76 95
1951I5j85K4J69q1j34J58N0j42j9J23n8j02J20M3j26K6R7k1j18R8R7j50m0J67
1975I1l3j34Q2Q6j11o5J50Qj69M0J35q6p5J10J3j12R7M5p4o6J18L7j22k2J33k8
2001D8j13L5J02j07k6Q7L9j15N3P0o3q0J32Lj18K6R9n8q0R9M2j08l9J53j4j40
2027g3Q2O9j49kJ24Qj13M4P8q3o5J67l6j25O6J37j15j32J85J5j83P9J20j03q1
2052h6J55J3j42L9J25q5r7J24L3j20J4J28q0j07J12O3j33rJ35p1j04R4R4j17l4
2077e6P8kn2L0P9p8n5R4J2r1KJ19p5r9Q9P7j13J8P3l8n3K4J12j14j9R1M1j31J4
2106b3Q9p7o6R9K3p6k3J18o0n5O3O5j23k1J57m4r6M8R4j77J8J40k5j30R5P8j17
2133b6k8J38j9j59R3Q3r7k4J00jj24O0J02q3j10J49K7j30N1N3o7o2O4P6j27L3
$$ plain form
1951 95 -90 -66 103 22 -112 46 96 -46 -65 58 0 -102 18 61 -65 -39 58 37 -81 17 114 -36 -76 91
1975 91 58 -76 6 92 -19 -84 66 74 -95 -55 80 -6 -81 29 42 -70 27 72 -2 -68 50 87 -35 -57 76 48
2001 48 -65 -30 72 -35 -61 26 65 -50 3 73 10 -70 62 65 -53 -27 72 14 -66 33 75 -33 -72 81 67 -73
2027 -73 9 78 -71 -73 51 59 -54 -10 68 -15 -80 87 51 -74 -8 129 14 -118 67 82 -101 -22 98 -5 -86
2052 -86 69 82 -60 -21 104 19 -78 46 79 -41 -27 101 21 -86 26 89 -44 -53 82 11 -93 1 95 -22 -56
2077 -56 22 20 -32 -2 77 -1 -56 38 50 -41 -39 80 5 -94 -5 72 -41 -23 50 12 -41 -17 95 -19 -38 53 94 -37 -23
2106 -23 66 -11 -77 22 45 -31 -54 64 4 -51 12 77 -46 -67 90 46 -50 -2 92 -85 -67 73 48 -82 13 91 -26
2133 -26 -54 84 65 -94 -1 82 -15 -39 61 60 -64 -4 98 15 -95 54 81 -49 2 55 -12 -74 -10 66 -61 -28
2159b8J10p5r3R2O1q4l4R8m4n7M1R0r2m6Q8L2q4J7Q0n2j18J21N5r5QM2j8p4P6
2188A7Q2j27PR5l2q6P6M4p5l8R2K6j37oJ14o5m7J07Pj23K4J22p1p2Q7N8j65N5
2216c1J34q3r8J27L6j17k9J50n4p7O1N0r1j8R5rj01N0P6o5l4P0J7j01J6R3n5o5
2244e3O7L1p0j9R6n8p8R6N4j04KO5K5j35Q3L2m4j9Q4J3j05K9J12j02n3R8nr5M0
2273a3R4o3q7P1N8j22O5M3n8m0R7J9j19J0J31o7n5M9M6j02k4J10nj41P3R4o3n9
2301e8P9L7q3PP8o6l0O8L3j17M9O9o4j6K8M1j06K1R0k8j03P8O1m8n9Q4Mr6N0P1
2331G4p3m4O5K5p8jO0l0m3Q5lp1K2R6m4o6P5K9o7l0Q3k0q1M7N9q6j3J08m1q8N8
2362GQ5j27J0N8l6l4j2J55o5j05Q0O3j07lO8nm1K6K4q3OQ3m1o0N8P9j23oR9Lj25
$$ plain form
2159 -28 82 7 -86 6 67 -17 -51 47 3 -54 -13 77 -15 -61 27 59 -25 -8 72 20 -98 23 78 -17 -9 33 15 -59 17
2188 17 99 -28 -21 74 42 -44 32 76 1 -37 55 81 -56 -62 52 -13 -60 47 54 -69 -45 77 6 -66 21 79 -86 -31
2216 -31 103 20 -78 49 85 -32 -61 89 35 -42 19 69 -22 -40 55 46 -55 -5 71 6 -28 42 59 -42 -26 67 12 -53
2244 -53 14 45 -25 -44 52 -6 -84 12 66 -38 -36 29 54 -81 2 34 -10 -29 55 68 -37 -8 104 2 -51 47 42 -53 -13
2273 -13 81 18 -69 2 60 -62 3 46 -12 -52 45 64 -55 -45 86 19 -36 13 59 -43 -67 43 38 -103 -30 64 1 -58
2301 -58 21 58 -25 -18 60 -6 -36 32 65 -52 -3 66 2 -14 14 55 -51 -30 60 32 -71 7 68 20 -39 45 49 -47 3 74
2331 74 1 -43 22 47 -31 -32 28 -2 -45 40 37 -34 -12 84 40 -26 49 78 11 -19 64 44 -37 10 69 -17 -30 78 37 -51 7
2362 7 92 -35 -25 33 -3 -37 -49 106 41 -64 16 79 -28 -31 37 32 -9 17 41 -42 -36 47 6 -54 4 83 -40 -46 53 56 -69
2393f9Q1N4n7k7O0L5j10L9O9p5j0M2J3p9L0N7n1o7O9L6p5OP6qr1P4K0l9k4PL1
2424A7o2N1M6n8m3O9Qn9M6N2n7m4N0N2j07J6P8l3q4P2M4n6k9R1Oj02J0O2n3n5
2454g2J07l8o8N3R0q1l4R5k0p4N1M4j5q0N5K5n6oP9m4k5RN0m9LM0n8OJ9L0n2j8
2486c4Q0K1j11M0O0n9l7N7J5r0K9N6l3j8M0J5n0j1N5j4o5N3K2k5k1M8k3p0O8M3
2516D1m2j7J7K0l6J4O2m0p0O3J9p7K7P6n0l7P9oj09N2O0k7q9R4K4q2J6N0l6j9
2546b3j3O7k2j5M1m2j4M8Rj3p2Q0J0r7N0P0l3o3M7L8n0k4N9l4m6M2M7o6j6M2P
2577A4o0Q6J8q4k7Q0J3p5K3K7k0l5M9K9q6jJ08m9k3N7Jm9mP7o0n9P5L1p7K1N1
2608E1jq8K8N7n8oN4jq7J3P9o7K5L0j6l0M5Lj8p8R2k8m8N2O2o1k6K2L1Rm8J8L8
$$ plain form
2393 -69 12 66 9 -18 42 77 -33 6 75 0 -10 32 45 -34 -4 53 2 -65 4 40 -35 -29 47 39 -52 22 42 3 -21 -14 17
2424 17 -45 6 52 -6 -49 20 28 -31 15 67 10 -34 16 68 -39 -23 55 22 -62 10 54 -2 -31 60 66 -36 -26 36 -17 -72
2454 -72 35 -3 -71 -18 72 -9 -43 52 32 -42 9 53 38 -42 13 38 -18 -24 55 11 -14 -5 45 -4 -1 39 -19 -13 6 36 -16 -34
2486 -34 46 67 -44 -4 56 -3 -40 17 32 -58 -29 27 -6 -24 16 31 -19 -30 25 11 -54 -1 21 -4 -25 23 0 -70 -2 41
2516 41 -1 -18 -1 19 -17 -3 59 19 -51 12 31 -46 -19 57 7 -30 49 43 -66 -14 46 19 -70 24 48 -34 -18 32 -4 -23
2546 -23 -36 31 9 -6 35 -7 -21 27 36 23 -49 31 41 -56 -6 64 31 -32 15 53 3 -21 38 4 -42 0 47 -19 -35 7 14
2577 14 -46 40 58 -26 -53 27 40 -35 -12 15 -5 -40 9 38 -48 -49 59 10 -13 44 45 -4 -8 69 9 -50 25 56 -21 0 51
2608 51 50 -38 -10 47 -11 -17 37 36 -51 -38 41 -26 -1 29 13 -17 28 31 13 -65 27 -1 -49 3 65 4 -22 0 31 40 -8 10 48
2641D8n9J8L9m2k4M7J7o1K1J2j6KL5Jn6PK0J2n8Q7K2r5OK3J9o9O9L2p6QM4nn9
2674c1N5K5o6j0Q6m5n4L9O4q9QP3Kp5L6K5m0LK3J0o2K4L3l2k5L8K2q6L0N5l6l0
2706c0M8K2n7RN0j1p3N1N8m6k5J1J5k8j1L7k1j1N1k1mk3M5k2k5M0L9n3rK9qk2
2738E%O8p8oJ4M9p5J0L8k9j6L9L0p1nQ1m8m4O9M4q4l0J00n0m1NP2m0l7N6j7l5
2770b6J2M6m5j8P3k1o1O2L5o1qM3k3k6jP0j3m7J0M0n5J0L1k6l6O2j7j2MJ7j2o3
2802e6Q9J3k9m4P3j6n5J1O6p0k5M9K5m8N3j2l3%L5jk3LL1k5n6N5J8k7j8N4k3m2
2834b8L1J1k9mL7j4k4LM1l6J7L9j5j3J3Qn1k9N5j3Mm7R6ro4L7J5k0k2J4J7l0Q
2867bL1n6K9NL1q2O4j0l6JO7k6n5nQ3k6m6L7L1m0j5M4m2K0J2L3p2K0L2l6NJ0K0
$$ plain form
2641 48 -11 7 46 4 -20 27 44 -17 4 16 0 2 37 38 -18 -11 9 21 -37 50 72 -23 -17 6 25 -44 25 57 -19 -11 33 28 -31
2674 -31 24 49 -17 -27 59 14 -40 -1 63 -26 -18 55 57 -18 18 43 3 6 29 39 -23 1 34 2 -23 15 37 -49 -19 36 0 -30
2706 -30 18 40 -17 -8 42 31 -42 9 67 21 -4 7 22 -6 -17 20 -1 -12 39 18 14 -9 36 14 -11 29 68 15 6 35 27 5
2738 5 5 73 -5 -11 3 52 -23 -13 25 -4 -20 19 49 -22 -27 54 6 -38 31 75 -9 -39 61 11 -30 -25 47 7 -30 26 9 -26
2770 -26 -14 32 -13 -31 42 21 -40 22 57 -4 -12 31 8 -18 -19 51 38 -9 1 41 -14 -4 27 1 -35 27 10 -2 2 19 7 -56
2802 -56 33 46 17 -27 46 30 -25 -14 52 -18 -43 6 31 -17 36 24 -9 -9 26 25 2 5 36 11 -45 10 28 1 -17 37 14 -28
2834 -28 3 14 -15 -19 18 4 -20 -17 24 -12 5 44 29 16 29 37 -14 -43 12 -1 3 -44 52 43 -21 16 31 11 -11 3 20 -10 -2
2867 -2 29 -27 2 7 38 -44 20 10 -26 -25 42 16 -39 -44 39 13 -33 4 35 -5 -20 24 -18 2 14 47 -25 -5 27 -9 -4 6 26
2900B6p0K8M3rn6K9N9n0j8O6l0j2MJ4l7LL2m6Kj3N5Mo8N8Ml7j9L9L1l0j2K6j9
2933ckM1l8LoM6l6k2M7L8n5qj4OK2j1Lj3l2N4j0m6L8J9l9jK8J7k5k6K8l0nL7J2
2968A7o0L5J0Mj1L4j7k5K3K0pm4J9P2m9m6K3L5o2M7mj3LL5l2l2L6kl2J4J4pNJ2
3002A5L5p5KL0L2l2rRj5l0N1Rl6rO2n8J8k0N6m6RK5j6%L6k5k9j1L5M1n0nK7Rm1
3037fL2n0K2J0ONLk2K3k7j0J7J0l7L1J6m1j9N5K3k7k8K4k0m2R5j3k2kK8l4pO4
3070E7j3n3kN2m0k5L5J2l7qL7j6j7RN4o4j4O2m1k9M3pl8N0K6n5RL1K1p0j5M1J2
3103Gk6J6J3Nj4K3qj0J7rj5K5MKk9j8L7lm3L2K6k9k4L4jj1OMRo2K1M4n1K6j2R
3139eOK2J2k3j7K2Ko3P1k1l3J5Q7o1l0J7J3k6J3mj9J8JMj0jL2k3l1O9k1l4L8O
$$ plain form
2900 26 -44 -16 27 18 -38 -9 50 0 -18 48 18 6 10 24 -13 -10 22 -24 -22 -35 20 24 -44 14 18 -19 -38 1 32 2 -10 16 -3
2933 -3 -5 36 -2 1 -5 41 5 -17 30 68 13 5 -9 -3 19 8 11 -2 -34 20 10 -36 2 21 -18 -19 9 26 1 -25 3 -27 -32 5 17
2968 17 -43 -8 2 6 -5 29 12 -13 10 30 23 -21 -2 70 21 -25 -2 33 -29 18 14 1 4 39 7 -25 11 9 -23 -9 5 -2 3 15
3002 15 50 -25 -23 7 39 7 -2 7 -8 -38 13 22 -14 -23 39 -19 -1 -21 35 -11 -2 23 7 7 43 18 -11 -22 13 54 4 -1 26 35 -6
3037 -6 26 -24 -2 8 14 19 22 0 23 -4 -14 3 13 -24 7 23 -18 -37 18 41 14 -14 10 -10 -52 43 30 8 6 34 0 -7 57
3070 57 44 -9 -11 41 1 -24 11 23 -14 -22 15 -1 -18 -9 45 -19 -33 29 -12 -41 2 -5 -43 7 33 -22 -13 18 39 -31 -46 -5 7
3103 7 -19 -3 10 15 1 24 16 6 23 14 -1 24 28 30 1 -17 20 17 -26 6 32 3 -21 13 12 1 7 11 20 -42 -21 23 -28 -2 -14 -5
3139 -5 1 23 35 12 -5 17 19 -44 27 6 -27 -12 75 14 -16 1 14 -12 1 -3 -22 -4 -3 1 -9 -10 22 -1 -32 37 16 -18 20 26
3173B6l8oK2Ll9K8lJ1kNL0k4k4M7n0NnM9j8l7QM8l3LJ0rk0J2K8m0KJK0j2J9K1
3209C8o2K4K0j2ll0L0kk4J0L9l5j6L3Qm8J3K8ql7M5O%j0Pj6oK9%l9K1QroJL8l7
3246bmK9n1rM3J5k1rL8qn3L1j6Pj5K5mJK1j9%j6J1N4n1J4krOj7N1l4nqL0l2QK7
3284B6k0PmqJ3qJ4j9KJ3mk1K7J3j8oJ8j5j8RPmk9N0j6n3K5L7Mj1j6K0j0J5J5j5
3320B0l6NN0l8oL8k8j7OJ2j4L1jKl4L6l5oL0j7K0k3NJ4lj7K7k7K7rk6kJ7K2J3
3355C6j5K2k5J7k2J4mPl1J3j0J3Oj9J3j2J6rK2n3M0pk3mL3k7Nkmj9NL3k7j6M9
3390A5j1loLK3l3K7J5l6lN4l3k0N2k2l2K7j4J6k2J9j0j9K2L0m4kK2nm6M8j3k%
3424cl4M5RLk4j5L5mPl4lK1Ok1kO4o6J3KL2k9J4Rlj9%Rk8K7K4k2k2M3m2POk2J4
$$ plain form
3173 26 -12 -18 4 7 -32 -4 -7 4 2 7 37 13 -11 36 -14 -9 -14 35 17 -20 -12 36 3 6 16 7 -13 -1 27 -13 -11 -10 10 -2 17 38
3209 38 -24 0 20 8 5 -25 5 3 -21 -11 28 -7 -23 10 18 -30 -17 11 3 -34 11 17 17 7 14 -2 -8 21 21 -18 3 11 2 -4 -3 35 -2
3246 -2 -6 23 -28 -37 6 21 0 -9 29 21 -32 -1 -17 -10 -25 0 -4 -3 18 -1 -1 -17 -6 48 -3 11 9 0 6 -11 40 6 1 -7 23 -9 -1 26
3284 26 6 13 9 1 14 6 20 1 3 16 12 -9 18 31 13 7 25 10 -8 1 8 4 -25 25 9 -44 -19 18 22 11 -5 15 5 20 35 20
3320 20 -16 -11 39 1 -5 33 5 -12 -6 6 -8 23 22 24 -10 26 -9 -15 15 -2 18 -5 0 14 11 -6 21 -6 21 12 -14 -16 1 23 36
3355 36 21 43 18 35 13 27 23 30 -1 12 2 15 21 2 15 3 19 10 32 -21 19 12 -11 -15 18 -9 -4 -6 -10 -29 -24 9 -18 -34 15
3390 15 4 1 -5 -2 21 -12 15 30 -6 -9 45 12 -8 44 22 -10 17 3 19 -3 16 6 -13 9 39 -5 -7 15 10 -36 12 -1 -3 -3
3424 -3 -37 8 17 20 -4 -19 16 12 19 -15 -18 3 9 -12 -14 50 -16 -3 -1 31 2 16 25 22 3 3 12 -16 11 35 13 -9 34 -8 -1 5 -17 -3
3462ck8L4K8j9k1J1J7j7k5K6J8l5L1%j2l7M6j5j2J5j5j4O3k9K6k3JkLl8M1l2J6
3495aj5L4nj0J3J4Ok4k2kJ7k1Km8O1qj1J8KJ9k8J0NkJ5m1K0NJ1l4J2K8j1j5j1
3530a7PK9J3k3jJJ2J2l1KmkJ4j5k3K3Pj7K4j4J1j3k9J6L2j3j3K5l4QJ0MrJ5Pn
3566IkL2l8LlK2k6J1oJ7k4QLkJ2kLl9L2J2Jl2J6Om5J7j2KK5kL8l5Mk1L6j4Oj1
3604AJ1j3pM3j3jk7J5k3K1J4m7J3K3Pk8M4n1qK0MJ0pJ7j5j8K7j7MqL1On4K5K0
3639A9k4J3mj3oQK0J1m7L1K3m5L9k4j0KK8l5K7Lk4kK3lk5J7J3k4Q%PPk8L1k9K0
3675GLpJ8k7OJ1k5LJ1kJ5j6k5L1PJlkjPk6nNPL7k6QJj6J0k2L9%k2RlrnK6J2j5
3716A7k9Lk6N9k4rNj0MJ5Knn1L2N6l6kJ2K3m8L7j4j3%rK7j8J2J5rk0Pj0RK6l1
$$ plain form
3462 -3 -31 3 31 12 -9 2 19 2 -23 3 21 -14 17 17 5 -32 14 -1 -13 2 -13 -27 36 7 33 10 11 9 12 -26 15 -17 -1
3495 -1 -16 18 13 3 16 30 36 12 -10 -12 5 -16 -14 -62 -1 -9 -20 -2 0 19 -9 1 6 4 19 -22 -2 3 14 -20 -8 20 9 -6 -17
3530 -17 -10 19 32 9 8 9 21 33 2 4 0 -2 12 -3 -26 -3 4 -13 11 -3 8 -5 -34 -18 14 1 -12 13 -21 -13 -3 1 -8 7 14 9
3566 9 7 39 1 4 1 23 -3 8 2 19 -5 3 6 4 16 14 17 -22 10 22 23 -9 7 13 -32 -15 -27 -25 0 -2 36 1 5 -16 20 6 12 1
3604 1 12 -1 -8 35 22 21 -6 9 -14 7 21 -26 -13 10 17 -11 33 -18 -26 -6 -2 8 1 18 3 -15 12 -5 -1 -9 22 28 -26 -1 19
3639 19 -5 8 4 -9 -15 -7 13 24 -23 8 31 -14 25 1 -9 -7 21 -14 13 16 -8 -10 13 10 -15 2 15 -9 -1 -1 6 13 -15 16 -13 7
3675 7 10 3 21 -6 0 11 -14 -11 0 -2 13 -3 -28 3 10 11 8 6 5 12 -14 -19 -14 -7 30 4 12 13 -3 7 -15 24 24 2 11 8 -1 -6 20 32 17
3716 17 -12 -9 -35 24 0 -9 -4 -14 -10 5 7 2 -49 -17 39 3 1 13 36 -12 25 11 -2 -2 -11 16 -2 10 25 16 -4 3 -7 2 28 -3
3752cL0n2QL4k0RkOj1K9k0j9J3Joj1K5jQk1k0N0J0m2K7o2M5Nom%mL9j6k2K7l2
3789hj2L2j3OqJ2PK1npl1L2j8lRj6K5l3PJ2jk4J4llj5K6mpJ2Rj0jK4l0J7m8N9
3827B4pl4L8j7j3j4K1P%j6J3kK0qm0J0Njj4J5lK8K4m7J3j4J8J0k7Nj3K0J7Pk2
3862C%L9jo9K4j6L9L1j9l0lJ2mL2k4J0o3L7pK4k6%J4kKNk7K6m2K3J7k6K3Qk5K6
3898A1k4j4L2Kk7J9K6J4j8njqRkKj6njMPooKJ6k0K8l3RpK1nk0J1k1L9J0k4OJ8
3937B3LrKLoQk2O%Nkk4J2K8k2j4%L0knk5J9K9m0M3k2k8K6l5M0j6jj1J3Ll3j5L5
3975dn%Okk5J5J1K4j1lJ2j5j5J6j3j7J1K7j4K1mRl8OpM8l1kK3k9j5J5M9n1j5J4
4011iOkj0K0l0K2j1J4Rk0J2lM3l3l0K8lk7M6J5o1N4j5l8L4j4K4pjK9l2jjJj7m
$$ plain form
3752 -3 27 -25 -17 17 -3 6 4 10 -1 28 8 -11 2 3 -3 -14 11 10 18 -3 -23 27 37 -5 22 -40 5 10 4 0 0 -4 35 19 -3 24 -8
3789 -8 -20 12 -1 5 -3 9 16 37 32 25 -6 26 8 5 14 -2 23 -10 -3 9 8 -16 -2 -5 -8 -23 3 -1 -8 4 13 3 2 26 -4 13 -35 24
3827 24 17 -17 21 4 -9 -23 -2 5 5 -11 2 0 20 12 -28 -18 -13 -14 -28 -13 -16 12 36 -11 2 -12 6 16 -11 -6 -19 1 18 25 3
3862 3 3 42 41 -28 -4 -20 19 50 31 1 -2 10 6 38 14 24 -39 -2 -9 15 -11 -11 3 1 3 8 -19 7 -35 -12 5 -21 2 10 -15 11
3898 11 -13 -27 5 7 -20 -1 25 39 21 16 15 7 16 14 16 0 -5 -6 -2 5 -1 -7 -5 11 -9 19 -14 -5 -12 9 4 -16 -5 -26 13 23 -1 5 23
3937 23 26 17 19 22 16 24 2 8 8 13 11 -13 -1 27 5 -9 -9 21 19 14 -11 8 37 -3 40 18 -10 16 -19 21 5 4 -7 6 9 -24 -39 -4
3975 -4 -9 -9 -3 -5 -30 -15 -4 20 9 6 18 3 -12 4 -9 -26 -15 12 -2 19 15 24 -14 -8 -15 33 2 0 23 -6 -21 -6 43 -8 -23 -9
4011 -9 -3 -5 -15 5 -25 -3 -14 0 9 -11 1 -2 41 8 -22 6 3 -24 22 37 -24 30 15 -23 11 -3 21 14 13 42 10 9 8 9 -8 -12
4047a2pj5J3K6mk2K7k0J6qJ0Qk2J5l4L1J2j9K2j9J5j8kL1j5j7nJ0J0j9K6k2%k
4081a0J7J1j8J3oj3K5Rj2j7k1J6j3L7n1J0L6j8pkj0K2k3NL6j8Jj0klK4rmK0Pm0
4117a8RJ1L2k1j8lkmJ6k0K6%Kl6K0M2pl1NQrj5KJL2ko9M7J7qlKmoqJ7RLrQJ4j9
4159A1lOj1nj0K3J9k6K7j9OmJ3j4k0L0j4j0L2nk3Lj6J9k1J1NJ0J6j9k7J8j5K0
4193GJ6k3J5J3l3J6pK1k9LrJ5Mjj4j0K6k4L3qmL2m0jj2J1Pkj2K0Nk6J0L1n6L9
4229A3JLml8PM3l6kjJ9%J1ljrL0l4j8M7j1j4NJ1M6m5J0rk8K0JJj5K2k2pJ5l7J8
4267a1JK5nQl1jJ1KM%J9j9j2MJ5k7NL8k3rLJ8Pqk4QJ7J1j7oj0K2rJj1jj2L1Oj5
4307Eqm7M5J8j3j4J9rnpRl3N2K0k0oqj6M9l5L4l5J7pK0jPj7J5m0J2KJ6J0j5rj6
$$ plain form
4047 -12 -19 -34 -21 5 1 -21 6 -14 2 -6 4 12 -10 5 -29 2 14 -5 17 -2 13 -5 -7 24 9 -8 -13 -3 7 -12 14 -8 -8 -10
4081 -10 7 18 0 13 7 -6 19 28 16 -1 -22 -6 -19 18 -33 -23 13 -5 -12 -14 -24 -2 -25 -20 16 -2 -1 -11 -13 -16 8 -1 -5 15 22 -18
4117 -18 -9 2 34 13 -5 -8 -10 -14 2 -18 8 8 10 -26 -6 36 29 -2 3 11 2 -13 -11 -10 22 20 -49 -2 15 7 4 6 2 -4 -12 5 14 17 8 16 30 11
4159 11 8 14 3 -2 -12 11 30 4 31 12 18 14 27 13 -7 23 9 -1 31 26 3 6 -10 9 -12 -1 4 14 30 11 -16 2 -13 7
4193 7 23 0 15 28 -5 11 4 25 -4 -1 -10 5 9 8 -6 -16 10 -14 19 11 7 39 -1 -2 -14 -3 4 2 -10 10 15 -11 -1 30 -26 13
4229 13 14 17 13 -25 -18 25 -11 -13 -14 5 5 16 13 12 3 33 -1 -19 28 17 3 8 19 65 20 30 21 -7 13 14 15 0 22 0 -7 8 -29 -11
4267 -11 -10 15 10 18 -13 -14 -3 -1 3 3 22 3 -9 -5 10 -17 -12 26 3 -6 -3 15 22 14 -10 -2 15 26 9 3 -7 15 6 7 -4 -5 -17 14 20 5
4307 5 -3 -50 -5 13 0 -14 5 -4 -9 -16 -7 -40 12 32 12 6 -2 -18 31 -4 30 -5 12 5 25 24 31 14 29 -11 1 3 19 29 14 5 -11
4344a1L5l0K1l4M3m1J6K0krj5J0l2K2JJ1k8K1M0m6qQlL3k1Rj4J9J7l6K2Rn0N4
4378C1j2k5J3QRj7J3k6PK1m5M6k7J7rj2J5j3JJ4j8J0rL9k3l0J5L3m8K3J1k0K6
4411A8rlK0j9j1M0k2QKOk7L6Rl9Mj7J2j7J3j3K1J9l9J6j5lK2j5mK4k8qK1LOk9
4447a8J1J2Oj4J9l1NK0k2LM7k0Lj2J1j1PJk2K8l1QJ1L6n3L1Nkj9jrjK7m8K0J1
4483HLj7QoNNJ1jj1J3k2PlJ5j2K5J2rj0ok1QK7j3k8J9j9K7j7K0K1o3M0l0J9J3
4519A8k2L4k6lPk3J8J0j8Jj1OQjK0k3K3NRk6J3JjJ3%k5nNJ8j1j0mJKJ6Nm5K3J9
4558B1qJjj9RkJ5k6Pj4L0j1oPj3OK4j7mj1L7Qk6KJ9j5rJ3Pk7rJ5Jj7J7L4j9j9
4596@K2j4k6L4K2n7QRJ2j9J9k4L0ok2j4K2MMmj1J2QJ4k9J5JJ2j6KOoJ4nl9M8o
$$ plain form
4344 -11 24 -6 15 -19 24 -17 -1 19 17 8 -7 3 -29 -7 -6 5 -23 -2 38 -8 -16 -8 -11 22 1 10 -4 15 32 -4 18 27 -23 31
4378 31 19 -6 7 15 24 7 20 -6 1 22 -23 23 -4 13 4 -8 7 -6 -5 9 -9 1 -8 31 8 -22 -7 26 -22 1 12 -8 18
4411 18 9 6 26 7 -4 36 14 22 24 30 3 39 48 9 13 -4 8 -9 4 -9 12 31 -8 8 -7 -10 12 -3 -7 17 -11 -19 2 5 11 -18
4447 -18 -7 5 11 -3 16 -15 -10 10 -12 -9 38 18 21 9 20 9 16 17 -5 23 -8 0 11 47 -6 25 30 28 9 8 -1 -2 25 -23 -3 8
4483 8 11 -6 2 -4 1 6 17 16 5 18 -4 3 0 15 3 28 40 31 21 15 -6 2 29 16 -12 7 -12 15 -2 18 39 -24 16 -14 5 18
4519 18 -4 30 4 1 8 -15 3 13 -5 -4 -15 -9 -1 -2 18 -5 18 23 32 6 19 20 19 32 32 7 2 7 25 14 4 0 1 3 19 24 -21 2 21
4558 21 13 14 13 -6 3 1 16 -10 -3 -17 13 2 -4 3 -10 -4 20 3 -1 -12 25 33 7 9 28 13 4 17 24 -3 -12 3 4 -13 4 38 19 0
4596 0 22 8 -18 16 38 -19 -11 -2 10 -9 10 -14 16 10 -12 -26 -4 0 4 0 -11 1 9 23 -6 9 10 22 6 8 14 8 22 17 -22 26 20
4633B0j9K7j1j5k5K2JjL2l9J1J5Rj9J4l0J3J3l8JL5k3J8m6N4j9J7K3l8kMJ4%l
4667A5k3J8j3K2Jl7N7j6Oj0nqk5K6QJ0lj1kjJmMJ7l8j0L4qL9m3Rk9KM8mqrmqJ8
4707A6k7K3j7K0K0omj4mj9K8j1K9l6J0j1RJ0rk8K6J1j1k1RjJ0nj0J6K9rj3LKk6
4743a1K2mJ0Rj7lQPk0K6pl9J5PQj3nL1l4NJ1%k3L4j3J9l2J6QQl8J6RL%J9k6Nk0
4782iRL3j2kj3prK5l4J2%OK0j6J7J1j4PrJ1j0j9K2m5N5k2l1L9M0n0Qk7Jj8M1j6
4818fLk1K7jl7M4M1p0L4Ql6L2j5%j6L2qlj7RRPNj9RnkjJ2j3NJ3k2L5qj8j2j9J2
4857a2J6kJQP%qoLJ1k1qK3mk3PJ3K3j0l0PJ8lKk8J2PJ1Lmqj0J4J4l7L7k9L0l6
4896a2K1rj4QK1j%kj2QpRm2QK6J6J5n0K7qk4K9J6Rj2jl1L4%j9J5Lk3pJ7J5j7l
$$ plain form
4633 20 1 28 17 2 -23 -1 0 -1 31 -8 3 18 27 8 22 -8 5 18 -20 -19 16 -7 11 -35 19 0 17 40 2 0 4 18 18 15
4667 15 -8 10 -3 19 20 -17 40 24 30 20 15 7 -18 8 16 26 23 12 10 9 10 6 10 27 -11 -21 13 5 44 1 10 -19 -17 31 27 19 10 6 -2 16
4707 16 -11 12 -5 15 35 29 25 11 7 -12 16 5 34 -2 8 -3 6 16 7 -21 5 16 5 -16 -7 -8 2 -3 -13 3 32 23 10 13 15 -11
4743 -11 11 7 17 26 9 6 14 21 1 27 20 -19 -4 3 11 -2 -7 24 -10 -5 6 6 -17 17 4 23 -9 7 15 23 -15 1 10 13 13 32 6 11 -9
4782 -9 0 33 21 19 6 -1 -10 15 -19 -7 -7 -1 19 3 20 31 17 24 15 26 16 -3 19 -26 29 7 -24 15 55 5 13 -14 -13 -31 10 -6
4818 -6 -3 -24 3 2 -35 9 50 -20 14 22 -14 18 3 3 -13 19 11 8 -9 0 9 16 21 2 11 6 4 3 15 2 7 20 -2 33 25 7 -5 -24 -12
4857 -12 4 2 3 11 18 18 10 4 7 18 -3 -11 12 8 -15 -8 5 28 18 -12 -5 13 10 12 -16 -4 3 14 17 13 5 -5 9 23 -14 23 -6 24 -12
4896 -12 9 0 -14 -6 15 14 14 12 0 8 1 10 -32 -24 2 18 33 -17 10 2 -22 7 23 32 20 19 -12 22 22 3 18 21 -2 -9 8 23 6 3
4934CJ6J1k8JJ2j7K5k3O%lK4j3Qm5J5Nj6L7kj3%L4k4L0k8nk4K3qj5J7KL0lkj5
4971A5%j1K6m8L3j6QJ3j5j1mRpL7l3nJ4k2J6J2J3k6K9j8NKl0K6K6k1Rnk3k1P0
5006D7j9k5J1PlqRk6Qoj1M2k6Lnpk6M2m3M9j6Mmk2J8j2Qj7L2J7Jj3Qj6J3Qkk3
5044cOpJ9LJ0j9L2n6J5jl2L4Nj8J2LK5o6K9NJJ0l7J6L6Pj5nJ5k4rKM1k2k7L6m4
5081b3NL9kJ0k7NK4m2L9k3J5j1lj5M0m0K3k9JmM9m2PK8Om9K1mJ2PLl2nJ9qrM2
5118B7rl2L7j3lMj3j1J5k4M7j1Lmj8J7j2%jNj6jL2m1L8k0J1Nljj7jnK0j9K9k6
5155a1K2j8kJ4j6K8rk2j5K8oRK8k4J1j7j6J4Jk%J2J6j8NLMLnJ2j5kRj4jLk7K9
5193A1k5J5jk5M0kqjqLKj5PQQJ9j6k0J2Kk0J8j1jK0l6J8L4qOmjk3Rj7KJ6pJ0P
$$ plain form
4934 3 19 30 2 3 15 -2 23 0 6 6 3 27 14 22 -23 -8 -3 -19 18 16 3 3 37 13 43 15 10 -14 9 1 -14 3 5 35 32 30 15
4971 15 15 4 30 -18 15 -1 7 20 5 -6 -10 -1 -8 29 -4 -9 5 -17 -1 11 24 -2 27 9 14 16 -14 12 38 17 26 21 -2 -23 47
5006 47 28 3 14 21 18 10 19 -7 1 -5 -16 26 0 3 -2 -9 -35 7 -36 13 -3 1 -3 -25 -7 -19 -11 -28 4 21 22 9 17 1 14 22 20 -3
5044 -3 3 -4 15 18 28 9 41 -15 0 -1 -33 1 6 -12 0 3 28 -38 -9 -4 -3 7 -30 -14 22 29 14 9 24 0 -9 -7 34 12 -15 21 -23
5081 -23 -18 21 19 29 2 7 31 -11 28 5 20 9 6 -9 31 -9 14 -15 -14 -18 31 -11 -4 24 30 -19 2 -2 10 17 20 -12 -17 2 -6 -15 27
5118 27 18 -14 23 10 7 11 -2 -13 2 -22 25 14 17 13 -5 12 0 0 -1 4 -12 -13 19 -22 16 -4 7 12 9 8 -9 -10 -15 5 -14 15 -11
5155 -11 11 -7 -9 5 -11 17 8 -14 -29 -1 -7 2 30 6 17 0 -16 -2 -1 -3 -3 9 25 7 12 15 19 22 17 29 14 12 21 7 6 9 -18 11
5193 11 -14 1 0 -25 15 13 5 4 -4 -1 1 -14 -7 1 9 28 12 -8 4 6 -14 4 -7 -8 12 -24 -6 28 20 26 22 21 -2 7 -10 -8 8 1 11 18
5233A8on4N1J2j4jmMjj4J0J0Oj3%j2N4k4j0L1j5k2J7l1J2jJ8m1K6K1k6J6Klj5
5268AOk3N8l0j8L3j7j8K0k7J2nK2l2K5j0j8K2j4L5l7K3On2L6jM0n0ROMJ8OJ3l5
5303Hk8J7j0J4K0kj7k2R6q4PrK8nj7pj4Nj4L1kJkJ0mk7J6Rk0K0RJ0Jk0K6rj8n
5341hj5L5k7J2K8Ml9J4j4L6Kl5j8K3Ol1J0nM3j7j4K4j6MrpJ3k2K9rK5Qj2l5L5
5376A8PKok1L5j5l5K1pJK1MNk7jj0J9KNj8J6l3K5j7OKJ6j1lK6l2qMrK1L6o2L3
5414A0l3L0j9K9Ll6KK7k5J7%QlkRm3K8KPqJ1Oj7j4L6k0kNj5ROnJ7m9L3k3K1Mk0
5453a4L8k2L7m0J0J5n2M7Pk9PkJ0J0MNk1K1j3rj7K3OlOj9J3j7JJ2l1M9l8oprL7
5490IQk7j6L7l0J1J0k6N1l8QQlmlMK3m7N1j6Oj6LJ6J5kk2nj5L4m4J3jJ5j8RPK3
$$ plain form
5233 18 12 -42 9 21 7 6 2 6 5 -9 1 11 17 4 4 -8 46 22 12 43 28 6 23 -8 4 3 21 -20 6 27 1 17 19 16 1
5268 1 7 -16 42 12 -6 27 10 -8 12 -15 -3 -8 14 -18 7 -3 -21 1 -13 22 -15 8 14 -38 -2 -3 37 -13 -4 2 6 24 30 43 8
5303 8 -20 -3 -13 1 21 19 2 -20 76 -8 -1 -10 18 13 -4 -11 -25 -20 -34 -3 -5 -4 -6 4 0 -27 -11 -2 -22 -2 7 17 18 -2 24 15 -3 -8
5341 -8 -23 12 -15 -3 25 29 -10 4 -10 26 28 -7 -25 -2 4 -27 -17 -22 21 4 -10 14 -2 2 -7 -14 -1 -23 6 -3 22 30 18 -17 18
5376 18 25 27 21 0 35 20 -15 6 -1 0 21 25 30 3 2 -8 11 13 18 0 16 -17 8 -9 -3 -1 15 4 1 27 -5 -13 -9 -18 3 39 -23 10
5414 10 -23 7 -12 17 20 -16 -14 13 -12 5 5 13 10 8 17 -26 2 4 11 3 14 20 3 -11 25 5 3 8 -7 2 8 3 20 -29 4 -19 2 6 -14
5453 -14 24 2 39 -1 9 24 -28 19 26 -3 4 2 12 22 26 31 10 31 18 9 -8 15 21 18 24 5 18 1 2 14 -17 32 -6 -12 -19 -28 9
5490 9 17 -10 -26 11 -19 -8 2 -24 27 -11 -3 5 2 -2 -5 -1 22 -25 26 10 16 0 3 19 34 32 10 5 -10 24 -20 -7 -8 7 -11 -2 5 28
5528B8l9N0m2J8mk0N6l4j7k6L4j3JQl0L4oOOk2K6OPk1K7l9J6J3pqj1ojK4j5k0
5564b1RK9j2Qk5j3N4k4J6K2o6K7k9%M0J9m0rPj0J5J8j4K2Rk1Qj1k5RJ5qMpL9k1
5600A4oJ4rj9J2PoKj8K9kj8J4mRJ6o8L6Jj6J3j5K5j7RoJ0k4J6j5K9l3M0k5j4M4
5636B5lj7qK2k5M2j1n5M7Rk2J3nj1k9K5Kj7J2KJ1l1K2nJ2J9k4K8k9k0L0j6j6M8
5670B5l8j7M2k1nL8oj5mQOJ8Jl5L0j7mK0onolklmj4K4JK9n4L2k4qppL1qK6j7j7
5710a6K0k4J4j7J9K2k6K2Mk2J5J4m1L5k0K3k9JK8k8PJ0l0K7%j7K7J0n4M7j9Ok
5743Fj7jL9k1RmmlKMmk5QRK1j9MjKNpJ7qK8%l9K4mj9lj6N5rol9j6K8J6K8l8L%
5785EKj8qJ1j7M7j8k6L6j7pJ6pKj0J2j2J4rk1L1J3qNJ1l4J6L4m9QRk8L0Oj0j1
$$ plain form
5528 28 -11 39 -3 15 11 -9 47 13 -4 -30 4 -9 -8 0 -30 4 -2 4 10 -12 14 20 27 6 33 -6 10 23 16 8 -3 -9 -10 14 -1 -21
5564 -21 -12 17 5 13 -12 -25 29 5 21 43 -23 4 -25 -25 15 34 -6 -15 -8 -18 -3 15 1 23 32 11 19 8 -17 -8 7 -1 3 -4 35 14
5600 14 8 22 13 -6 6 13 7 9 -9 20 18 0 14 10 19 35 -33 3 4 -12 1 -14 11 -6 3 -3 7 -17 -1 -16 13 -20 20 -5 -19 25
5636 25 22 5 -3 19 -6 36 25 -30 17 26 4 17 12 1 -28 -3 -1 -18 -6 -4 7 -24 -2 -7 5 24 0 28 -1 -21 9 -7 -23 25
5670 25 -13 -30 12 -9 -14 24 18 3 -1 7 13 31 32 -3 27 10 6 26 20 15 9 6 4 1 -3 -17 7 8 37 -17 15 -9 -17 -24 -31 0 -8 18 1 -16
5710 -16 4 -20 -6 -23 -4 18 -8 14 18 -4 11 25 -16 19 -1 22 -7 -6 22 -6 1 11 -19 8 8 -9 18 28 -26 21 2 8 6
5743 6 -11 -12 27 6 15 11 7 4 6 10 6 -19 -11 -2 19 0 4 3 5 10 3 20 12 40 40 1 25 21 2 -1 -17 38 29 23 -16 -32 -4 12 40 2 5 5
5785 5 7 -11 -19 -8 -25 22 4 -22 14 -3 -10 6 -1 1 -9 3 -9 5 -4 -25 6 19 11 16 27 -7 9 43 -6 2 11 -17 13 19 9 -2
5821b%%%PNk8RRk4J7K3%jj0NlJ%J0pl3L1j0L0j4j8j1J2j4K7j7L6Ql4jJ7ppj6R
5861aj3L1lJpj9NJ5k1J7m2O1Jk6k8M3k1J1j6mL5mqJmj2J0k6K6K1Rl3J6K0l2Mj2
5898eK6ql6L8LQk4J6k5K0K5m0K2j8k2RJ1j0L1j5j2J6k0J3j3K2rM9n6lJ0lK5j9
5932Fj3M3l2LMj6M3k2k9M1j8Kj2K2j2Qj1Jk0MNk9M2omrj3JK0qJ7Oj6Qo%K8k1M
5971A1J6l9L3pm1L5j7J2mj1kK0rkK7o0N5l1%M4l3k7N8k6l0O8m9oK7llkPKl8K4
6007aJl1N3J9m1rL1k0k9O5m7J0j9L7j4l0L9k1K2nj7rJ9ok0K0Jj0K5j7K3k4j1L5
6041A9Mjn3L3Oj6PpRNK7k1pPJ6k8k5L9nnK6lK3n5MK7k1J0Lm0kJ2J5L0l6j0K1J0
6079A8j8j3%J6Mj1M%PMj6Nl5M3j3J0j0KPjjoQK1k5jJ1K7k1lm2L4QK1Ok4k4K5m6
$$ plain form
5821 -2 -2 -2 -2 5 10 -18 -9 0 -24 -7 16 16 15 5 10 7 8 8 18 11 -22 9 -1 29 15 -3 -14 -2 -16 11 -6 30 38 4 3 20 13 6 -10 -1
5861 -1 -14 17 14 15 8 -11 -6 9 -12 5 -37 24 25 -1 -29 14 -7 4 -12 -16 19 15 7 8 4 -8 2 -24 2 23 32 -1 15 35 3 7 -5
5898 -5 21 13 -23 15 18 26 2 18 -7 13 38 -2 20 2 -20 -11 0 -10 21 6 -6 10 -10 3 -10 12 3 52 -4 -7 3 0 25 6
5932 6 -7 36 4 7 11 -5 38 16 -13 28 10 12 0 22 10 18 7 8 -12 -8 -3 -32 10 4 0 -9 -22 -21 -1 -9 8 14 -2 6 0 0 28 7 11
5971 11 27 -12 21 14 -27 8 -9 3 -1 -12 -14 6 -3 -5 22 -38 17 -14 -14 30 -3 -30 28 2 -28 40 -9 -15 12 9 6 4 11 13 -25 -1
6007 -1 0 -31 22 41 0 -9 22 2 -27 38 -9 1 -18 19 5 -25 14 -7 15 10 -7 -16 3 -3 -23 -3 -2 -12 13 -4 19 -5 -16 19
6041 19 23 22 -31 2 8 -8 -1 -8 1 6 33 12 5 12 28 0 -25 14 9 4 30 27 50 -5 -1 26 5 15 18 -22 -24 -12 3 33 -3 -13 8 18
6079 18 0 -13 -13 3 7 -4 0 0 7 11 -5 0 -35 8 -5 5 -5 -3 4 3 2 -4 4 25 0 -1 10 37 16 13 -29 5 13 34 40 16 -8 17 -29
6118b9L4J0k1Qpj7K1k2K4qJ2k0M0l2RL4n7L1j2Pj2j1K3J7k4OlNlrORQjj2pj3L1
6156A5J4k8k5K0LK7m7K0knjJ0jk3K6%oK4k4kJ1j5K2J8k7jPJ0j5Jj0J5Pj5Jml6
6193c6M2Nk7K9qj9LK5k2J9k5K1J9mkk2Mj5J6j8kK3Jj0rQJ0J9ol1K8j3Lj1Qk8J3
6230a2J9%l1K5Pj4K1J7l8Jj3M5l4L6l3J1mrJ1rL%K3j4Pj7J8l2K9j1K4l1j1QJ7
6265IjKrL4j6j1oJ9k9Lk1L9J3l1jLJ1nk1J2J2j6PK0m3K3J2qLj1K4Ll4J0K6m3N7
6302C6l2NJ1j4k7L8ml9QJ7M2k8j5j1K0%lRj3j5J0L0k0mk6J0J9j5K3%l0J3K4j2
6336GLqJ1l5M2kk4mJJ9kjJ7l8J2J5l0K9Mr%K8l3J8Mj6k8K9L%K3l5j0QJ9j1k5Q
6374a1J3k1L9j5j2lk6N4mj4oKlNJMrlPPrKK9nj0j8kmL1k5%l1K7mK1J5l2j5K8l
$$ plain form
6118 -29 5 15 -6 2 -5 -22 -1 -23 1 -7 5 -15 25 -7 2 36 -21 10 -2 5 -7 -18 5 22 -2 4 1 6 3 -6 0 9 17 16 4 -3 -16 15
6156 15 29 1 -24 -4 -1 26 -21 -1 -3 -8 -9 1 0 -23 3 3 -3 21 -3 -5 6 -9 13 31 4 3 10 20 5 6 -4 11 18 3 4 0 -36
6193 -36 6 11 -16 13 5 -14 -11 14 -8 11 -14 7 26 22 20 -2 2 -13 3 -15 -17 6 7 -3 -12 -4 6 25 19 -12 16 3 6 -5 3 -25 -12
6230 -12 7 7 -24 1 8 -6 15 32 -6 -5 -18 27 -7 29 -4 7 3 -6 5 -4 -1 -1 22 8 15 -2 16 -16 13 2 26 -5 -16 -8 9
6265 9 8 10 1 35 19 8 2 21 -8 -5 -26 13 26 -5 -6 -3 8 3 -18 -6 6 -10 -3 17 -26 -3 9 1 4 -7 17 20 -14 -4 22 -21 36
6302 36 4 9 20 6 -21 17 13 -26 -18 -1 41 13 -2 -13 7 7 4 13 0 -15 -5 25 5 1 -25 -15 4 -11 12 12 -18 -5 19 7
6336 7 10 2 13 -22 20 18 -6 -10 -9 10 8 7 24 -14 -2 13 -17 12 16 7 7 35 2 20 24 8 -20 9 12 12 35 0 -10 -2 17 6 -19 -11
6374 -11 2 -19 20 5 -7 -10 -36 18 14 0 -6 -4 -7 -2 -1 3 -6 -9 -2 5 -4 -2 27 22 12 -6 -8 -12 19 -6 -6 -37 -10 -14 7 22 -10 -25 3 0
6414@J6j8lj0K3J1J0nk6K4qPk3lk4L7jJk4L2k6L3j4k1J8kJ1m2P0n3J1K8j5J6M
6449C4k7k0M3m3J8l6%K6k0K5olk9L6k2K7kk8K3QJk4K0J4Kj4jj9K2k8N1j9Rjmj
6485A2pk0K3JLmK5l4j6K3j9J3J6Pj6J0j2l1QK3j7LJ3pOJj3pnPK6k8J8J8Krk6J
6523a2K3nj6J4NQqj2oMOK4l6k2N7rm2PJ8j4J4j0j4K5j0J6l4JJ3J8j6L0%mj0j7
6559a4J1k8L9J1j9JMk5pJ8OJ2JRk1J6Lm9M2k2J1lJj6K5k5M0l9M1k5j6KOK2Lo2
6595d7M6OlK9m2K6k9J5J1MMk1J3l4M1l5K4kj1J5j1l9M2K2Rm2L6k1k0J9kQj1J9
6629A9j7kj0J3J1k6J2nj2J6J0k2K3m%l2K0K9mm1L4Qj7jQjqj6L2nkjM0o6L2J2k6
6666Aj9M0l2Kk6J2L6k0nnJL3J0m1mk7O3l6k2J1L3k1MMPK6j4Jj9Rj3K2l3jL6qN
$$ plain form
6414 0 16 -2 -5 -15 8 19 29 24 -2 22 14 21 -2 -5 -29 8 7 8 -16 16 -10 23 9 -12 6 4 15 -27 43 -10 1 29 14 30 34
6449 34 7 -13 30 -13 5 -31 -31 -5 -25 0 -6 -9 -38 -2 -24 3 1 -27 -4 4 5 -19 1 15 17 3 2 -17 5 -23 28 9 18 17 13 12
6485 12 5 -15 8 9 12 8 33 -1 -17 6 -13 0 16 23 7 17 5 -26 -18 5 -12 -9 4 -3 3 4 -9 -16 -21 -14 12 -16 2 20 22 13 -13 -12
6523 -12 11 6 -10 4 9 17 9 -3 -9 -5 1 25 -11 -33 24 15 -27 -20 -2 -16 -2 -12 -26 -1 -11 5 -29 -28 -15 3 -13 17 17 13 3 -14
6559 -14 -3 -31 8 19 0 1 5 -20 -27 -9 -3 9 10 19 -2 14 17 -32 10 -12 -1 -4 -3 -19 6 -19 21 -18 23 -2 -18 -16 -10 12 15 -47
6595 -47 -1 5 2 31 -11 15 -14 1 12 16 20 -1 12 -22 19 -16 8 6 -5 10 -1 -40 2 24 33 -9 27 6 -14 5 3 11 0 19
6629 19 2 0 -10 3 14 -12 0 -5 -17 -1 9 -13 10 6 6 -26 -6 23 19 -22 12 20 3 2 10 9 1 -15 17 12 10 9 49 -17 15 27 1
6666 1 -18 22 -10 -8 -34 -22 14 -6 -11 -16 -15 18 28 -13 -17 -44 19 -17 -39 -28 5 -16 -12 -8 -1 25 11 12 -7 2 -11 11 -22 -23 13 5 10
6703A0j6NNRJj0j3j8K5LkJ3l0j1M1l2K5j5OOqpK0%l0M1l6RJ4k6K8pJ3r%rJ2j6
6741iK0j1j3K3n2J0J2k%J0J2j7M5m1k9O8k5j4J1j8j1K8j4M0j3j7K6j4jj5KJ0l1
6774c0K0ORm0K1J4K8m9%L9LJ6j9k8pPQj3pM9l2kJ2k2j6J4K5j2K6k5jmK9l8ML6
6810B1j0Kl0L1j6j1LJ0rj1K8j8Nk0K7j4J1Lrnj6QK1k8J6K6j3k3L1%LqmJ9k4pL0
6847A9k3pjJ5J2j0jJ8k9J3j4qK0J9JPj2m0L3pk6KL3l3kK8%l5K0L7k6Jpj7pL1J1
6884A5k0kM6l5k6L8pl8RK3J5n9L2K8m7K7%qlpM1k7kK3k3k2N4l8pJ3j4J3J9k6J6
6919Aj2Pk0J0K1l2J2Pj5K2j7J1kRlk2QK6J3ol5rK7J0j5J5k0jJ0J0lk4M2j4j3%
6955bqJ9j5j7J5J8jj5j7PMK8lj2rK4Kl7k4M0Mj2L9l5Rj9J0NK7pk1J4L%pj5J5J1
$$ plain form
6703 10 -6 -1 4 13 14 4 -9 -27 -2 1 -1 12 -18 -29 12 -20 5 -10 -4 2 -6 -13 7 7 -23 18 -18 -9 5 -21 7 0 13 4 4 -5 7 -9
6741 -9 11 0 -13 10 -42 -32 -20 -22 -22 -12 0 -17 28 -13 -42 26 1 -13 -2 -20 -31 -3 -17 23 10 -7 19 5 4 -11 -9 1 -30
6774 -30 -10 -4 5 -35 -14 0 28 -21 -21 18 21 37 18 -10 -17 -10 -2 -15 -22 27 -5 -7 5 -17 -33 -19 6 -6 20 -5 -6 -10 19 -19 -15 21
6810 21 11 13 -17 14 -2 -13 -10 0 -9 -20 8 -10 -5 -25 2 -12 -1 2 -7 -12 -28 -20 1 -27 -11 15 2 -21 10 10 13 5 1 20 -4 -11 19
6847 19 -4 -11 -12 3 15 5 4 22 -7 6 -8 -16 4 23 24 31 19 -21 12 5 -21 -19 14 -19 -21 7 7 -28 -8 29 3 4 -3 -20 -27 4 15
6884 15 -5 -7 39 4 -22 16 9 -29 -20 3 18 -41 -9 19 -28 -1 -1 -9 -12 -19 22 -5 -7 16 -7 -29 25 -13 -20 -7 -21 -8 11 -15 1
6919 1 -11 -4 -24 -14 7 -25 -13 -6 -21 1 -16 -5 -7 2 -1 -23 -15 11 24 18 -17 -26 1 11 -4 11 -9 -10 0 10 7 -17 25 11 -2 -2
6955 -2 -10 9 -6 -23 -8 10 9 -6 -23 -16 -12 16 13 1 -8 16 18 -19 -43 -3 1 -11 28 -7 2 -17 -7 -2 25 18 -3 11 14 14 7 -8 7 18
6993A8kkP%l5LL3l0K1qJ7m4J8LKl3O6l8j1oOK0jJ8rj2L4l3j6OPjJ3j6KK9j9J7
7031B4k6L4n2K0%j5M2j2jj4KJ3Jl6Pk2N5l0j0mj4M5K1k6j4K3Mk4j4M7l4LJ8mo
7066AJj1J1KLJ4oknnKNj9L1l8K3j7J6KKpj5Jj7K6%rK9k1%joj6K5J0Jlk8qN4nl9
7108a9L0rL2n4QL5k1J8J3l6K4n%Rj5k4QMMj0j2K3K1l0k%%K1Mj4kmPJ0J6n2poM9
7147A4k8K8oOj4K6k0k3L4j9LPk3L6k1KK3j9j7M6m8M1l1j0J1J8lj1J0l2K6plQL
7182Gk0J7lkj7K3k3J5J5j6J9K5k2J4k0k1L4k7j8K5Pl6N2l8OPJ1pj6J6k5oL1m0
7216c3N1j4K3j2Km8llJ7J8qJ8MqNJOk2rJ0JL1l2ojK3pj8K2J6%j1J%k2OJ7Kk5J0
7256BqoJ3opL1j9K2k0k1%J9K2j6lJ0j6qK1j2%Rj1J0J8Kj3k1K1j7jK3kjok8K1P
$$ plain form
6993 18 16 14 21 21 -14 -11 22 -8 13 5 22 -22 -4 -1 1 -32 34 -4 -15 -21 -15 5 4 22 13 1 35 2 -14 -8 -1 -2 11 -5 -3 26 7 24
7031 24 -2 32 -20 0 0 -15 27 15 14 0 2 15 16 -20 -13 -35 20 -10 -20 -24 -38 7 28 2 -12 11 15 -9 -23 24 -10 -7 11 7 1
7066 1 2 -9 2 4 7 21 15 13 8 3 5 10 -9 22 -16 7 -10 6 8 10 3 -12 -11 -28 -2 -2 -11 18 -3 -3 -4 -10 -26 -1 9 10 7 -21 -29 25 20 -19
7108 -19 11 2 34 -20 -12 23 2 20 33 -3 21 16 16 25 10 -14 -6 -2 2 -8 -20 3 24 -6 -8 -8 -8 13 17 3 1 -3 4 14 30 -22 -29 -35 14
7147 14 -14 14 8 14 0 26 6 -17 17 -2 1 8 -15 21 0 2 25 6 -11 35 -13 28 -3 -13 -2 16 13 2 12 -20 6 -1 -4 4 7
7182 7 -13 4 1 -1 -18 5 -18 -3 12 -4 15 40 18 32 12 -9 25 -2 -20 5 12 -24 28 -10 -4 3 14 7 -9 7 -18 -24 7 -33
7216 -33 18 4 27 15 17 -31 -34 -37 -20 -2 -10 8 12 4 9 10 16 -6 -15 -5 -4 27 -5 -11 -12 11 4 -14 8 24 24 13 14 14 -8 -2 15 17 -8 2
7256 2 -6 -12 1 -5 -12 19 0 22 2 -19 -19 0 22 6 3 13 -3 -11 10 -2 -2 7 -4 6 24 26 13 -8 13 -4 -5 18 16 15 9 -19 2 9
7294IjmJ4k1k8K3OnQkK2pk4j3K8J8l1lRJ8OPmm9K1M2k0Qk4pJ9l4J6K6m3L3oPm2
7333b8O1j4K6m1qL1m2J1J2k8J9J2qJ8nKkkj4NMk4K3mj6PJ7Ronj1j3K6j8j6qM2
7370A2j0ljkJ9j4j5K2OLk2J7Kj5J5k0J8Ol4Ml6M4K5k8koqM6k8K5j1oJ1k2jJ9J0
7407B0j2k8jL6nK3n2J8Kj5Pj3N6ll1K0m7M7rk5j6J8K3k2jjJ5LL0n3J1rL4j9j9
7442a8K7kPj7lL1k1K4l6M0Qm3nJ9oK6m3J6k5L5j2KOKj0lL5j8%l6L9j7Pl8K4kL3
7479B6k4mJ2K2j0k9J0nJ7rJ8nmrj5J1Rj0k2J3OK4J0m2KJ4L2n1J9%m4J3K9kJjp
7516eJJ2rj8J9lk0M0l5J4Rj6nL8l0J8Qj1J6j2j5j5K4OjrJ6nj4jj3J1Pj4J4j4J5
7553CrJ8j6j8M1lm4M5kkJ4m4JL4%JLJj5j3MKQj9j1L8Mm6pJ7J2j0K9Mk0j5K7qK3
$$ plain form
7294 9 8 4 18 -3 -31 -8 -2 -7 1 -1 21 14 -10 -23 5 23 -8 -11 -2 16 22 29 25 -24 -3 39 19 27 3 -4 15 -19 -3 23 -20 13 7 14 -28
7333 -28 33 19 45 4 -4 27 -15 -4 8 -20 -1 11 3 21 16 18 16 14 0 5 9 -15 8 4 -12 -5 12 21 15 10 -1 -14 12 -6 -22 -30 12
7370 12 2 -1 -2 -4 15 1 -14 8 14 17 -5 12 14 -1 14 -6 12 18 -16 -12 -48 -4 21 -7 -9 -15 -23 23 -5 20 9 3 14 -8 -9 10 20
7407 20 8 -20 -21 15 10 33 -19 -1 1 -14 -7 -20 36 33 2 22 -25 22 13 -12 -28 -10 13 -9 -10 -11 4 7 37 -16 -5 -14 20 1 -18
7442 -18 9 7 14 -3 -6 25 4 28 -8 32 40 -3 -8 11 5 31 -12 4 -21 14 2 4 10 12 2 -1 34 16 16 -20 19 2 9 -29 -5 -7 26
7479 26 2 -2 10 32 22 -7 3 -2 15 6 24 19 15 6 -9 2 11 1 -21 -8 -2 22 32 -10 -8 6 38 -13 6 6 -38 -25 4 2 3 2 -5
7516 -5 -4 8 -1 -19 0 -3 -23 17 -18 -4 5 -11 -16 22 -8 10 18 7 23 11 -4 -19 5 11 10 1 17 12 -2 -3 -16 -5 2 -12 2 -12 3
7553 3 -6 12 -4 -22 19 16 -28 17 15 13 27 -17 -16 18 18 19 22 23 8 -5 -1 1 9 -10 -21 17 21 -25 -32 -15 -3 -13 16 20 0 -15 12 4 27
7592B7m1J5lkJ5l3L6n1M7%m7L9J1k8KK8k4K1J2j5mJPjj1JOK0k3pj2QL5m3L1j2
7628EL3k7J1k0J4j9j0M2k2j6l1M4%j4k0L8j1QK3l4k4K8Oj7k8O7l2k1J3J8lj2K1
7661A0J1k1J2rpJ8qK4k2Kj8J9l4J8kj3j3N2l4PK0j9%ONJ8m1lN3l0j4K3j1J7Pm7
7697b4J9RqkJ4j4POqk7M4k2j1L2j3K6k4j9RjOJ1lj9J4qmkjJ4J6n2K2j0L4nqlK5
7736B0rJj0JK1j2l0J3j4L4k2j7L4j5KpLm4O2njOk0J1j8L4lj7jj6K9K0pj8l4J3
7772a6LK0j9kj1M1j4Rjk4J1J7kj5nL1m5K3PJ5k4J5j4L2j5Lj1j5K0k1k0O1l9J0
7806Ej3K4Po0L8K4pk1J9j9JLj0K1j5K3k6K3J6m2J5Lj7k7L8OrOnPj6K4l1RJ0oP
7843EJj0j2NrRMK2j3j9J0k4M5J5l6LQOOl1K3j5K0pJ2ok1L2k0nlK4j0QjlMj7L2
$$ plain form
7592 27 -14 1 -2 -4 11 -22 14 -37 10 10 -37 2 13 -15 -13 15 -9 12 24 9 5 6 13 12 1 2 8 28 5 -2 -14 -6 29 -14 17 5
7628 5 38 11 22 2 16 -3 -13 29 7 -9 -40 4 4 -10 -30 8 -3 5 28 -6 -30 -2 4 -13 -41 26 -6 -27 -14 4 1 -11 10
7661 10 21 0 12 3 -4 14 6 30 8 10 -8 11 -23 -5 -7 -20 -33 19 -15 -8 12 -7 -7 -1 4 22 -19 -22 31 1 -13 10 -1 16 23 -24
7697 -24 -5 4 -4 -6 8 -6 1 7 -1 -28 16 -6 -17 15 2 28 4 -15 -6 -7 -1 10 7 -12 2 -6 -10 -12 -13 1 17 -35 -13 -23 11 6 -2 -5 20
7736 20 11 12 2 3 24 12 -18 -5 -19 15 -7 -24 10 -5 -3 -10 -7 -51 11 6 5 11 -9 2 -16 18 15 -2 -3 -19 10 30 23 5 -29 -16
7772 -16 -13 7 -12 -14 -25 16 2 11 10 -14 -3 14 12 -3 -8 23 -22 1 8 23 -1 14 0 32 17 20 9 -6 14 -7 -27 34 -5 5
7806 5 -8 16 23 -37 1 25 18 -3 16 -3 -2 1 -9 12 -3 20 -6 17 33 -9 6 9 -8 -35 3 9 0 6 1 8 -8 16 -15 -6 4 -2 5
7843 5 6 -4 -16 -11 -20 -11 -7 15 2 -17 -7 -31 14 29 -7 -4 4 10 16 -15 8 -7 13 6 18 12 -9 23 3 -2 -5 19 9 17 16 13 17 0 32
7882C2j3j3j9J9JK1m2j3L9Mj6J5Ql2J7k5M6k7lJ1OoNlj0J8KK8m7j1J6J7j2Kl2
7917a7K1QNmLprPkkPJj0J4k5L6j5jPm0J7%RJ2k1K1l3J6J2j2%kjjPjqlP%J4j0o
7960fJ3j2J4Lk%l0L3J2k7K4j8Mj9pL3j5qk0KP9p2L7l6J9L6l4nj1L9m9L0JKPk8
7996a1Nj1KJ6K3j0k6QJ1mjK3k0MMj4K4J0l4j8J3lj4PJ2nJ7j5pj0N1k7k5M8l3j
8032a1J6MkOj3j5M4j4LJ4nj8j1J2Pj8J6k1J4PJ4j1m3K6J3k3L0l3L9Km6L4k4J8
8066A1jOm%j7J3k2L1J7n7L4kMk4L0j6J0LL6n3J2Ljlj3J0pj0L6k1j3QK1j0%Pl0
8103a2K2Mj9L6l2NrJ1LlJ8k3J3nj9J1K6l4J6mJoPJ4J5l1pk4L6lm4M5Jj7j5M0k6
8140iJ2lJ9j5J0KQl4J7k6RJ4J0jNkQj9KOk7K1j5kL3j9j4J6Pj1J0k1L3j5Rkj7J7
$$ plain form
7882 32 19 6 -13 6 7 28 -14 -27 12 16 0 15 23 -9 8 -17 29 2 -1 10 16 10 15 12 2 20 22 50 3 -8 8 25 13 15 -17
7917 -17 4 12 17 13 16 9 0 7 5 3 10 11 1 15 -10 26 11 10 17 -23 -6 -6 3 15 -6 15 -18 -2 10 -2 -2 -4 -5 -6 1 0 -8 -11 -4 -4 10 0 -6
7960 -6 7 -5 9 12 10 10 -20 13 25 -2 22 4 8 -11 -18 15 0 -8 -28 -26 53 -19 18 -18 1 37 3 -2 -13 26 -23 7 8 10 17 -11
7996 -11 -6 -17 -15 1 24 14 -12 -4 7 3 2 25 5 9 13 -1 23 33 -1 -19 -6 -9 -23 -16 -4 -9 8 -7 -14 -24 27 0 -25 23 -10 -11
8032 -11 5 9 7 13 0 -15 29 15 18 32 27 9 -2 10 17 -1 15 -6 8 15 29 18 -25 1 14 -9 21 -12 27 29 -17 17 -7 11
8066 11 10 16 12 12 -5 8 -14 17 34 -23 11 9 13 -11 19 3 13 16 52 -1 11 14 13 10 -3 7 0 -10 26 5 -8 0 21 11 11 18 -12
8103 -12 10 14 -5 31 -1 4 -5 6 9 6 24 1 14 9 -10 1 27 -7 9 5 6 0 7 21 36 5 -2 -26 10 7 -37 8 9 -8 -23 17 -9
8140 -9 3 0 19 4 14 16 24 -10 7 -19 -10 4 14 13 18 16 24 5 7 13 -14 7 -8 -10 23 4 -10 6 13 2 12 -9 24 9 18 16 -1 16
8178A6Ll2J4Qk3L6n3M9lm0J9Rk
$$ plain form
8178 16 19 -13 1 9 -14 22 -31 18 15 -25 -6 3 1
8191A
$$ Imaginary data points
##PAGE= N=2
##DATA TABLE= (X++(I..I)), XYDATA
0@%%%%%%%%%%%%%%%%%%%%%kJ0j6J6j6J6j6J6k1K9l2L2l6M4m8N2o0O7p5Q3r1J00
43E2j10J20j31J45j60J76j94K16k38K61k90L22l57L98m47N06n75O62p72R13j110
64f13J394j835K592m123Q296l8858j08921J46031R5589j17099l4060Q6652k6103
77H942n0001P6646J6534j11463O947J13064k7952r2348M5253N9703m7272j5012
89a6959M3210l2073l9217O1387K6036p4034k823P5805j7470o0278L7403L3911
101C4898n6218j1577O0142j1266m9656L6218L5143n2627j4949N9082j0197o1270
113d2277K8538N2833l9847l2163N1553J1332n6828Q113N2777k8719m6368M2673
125A617L5796m7362j7773N0037km9556J2010M0632k3172k8968K9798J6933k7062
$$ plain form
0 0 0 0 0 0 0 0 0 0 0 0 0 0 0 0 0 0 0 0 0 0 0 -2 8 -8 8 -8 8 -8 8 -13 16 -16 16 -20 24 -24 28 -32 35 -40 43 -48 52
43 52 -58 62 -69 76 -84 92 -102 114 -124 137 -153 169 -188 210 -237 269 -306 356 -416 497 -613
64 -613 781 -1054 1538 -2585 5711 -33147 -142068 3963 99552 -17547 -51607 35045 8942
77 8942 -41059 35587 52121 -59342 -52395 60669 32717 -59631 -14378 45325 -1947 -16959
89 -16959 26251 -5822 -45039 16348 42384 -31650 -34473 41332 23862 -36416 987 34898
101 34898 -21320 -32897 27245 15979 -33677 2541 37684 -14943 -29892 29190 18993 -42277
113 -42277 -13739 39094 -753 -32916 18637 29969 -26859 -18746 34031 5312 -41056 1617
125 1617 37413 -9949 -27722 22315 22313 -27243 -15233 25399 2227 -26741 3057 19990 -7072
138g072P36K2576j8144j8520K8926J0808l5701k423L7584l021k9313R845J4649
151A0930j9036o74K4342j3967k6951K6642K7710l1378k0582L1446O473l0095Q496
164f644K5034k2761j6626L5196Q773l9992R32L6853j3933l0757K4475K0227l1165
177a0388o034L4795o942l2334J8203K3267k8349j1612L4504n95l4091J3736K9245
190B3405k3557j9791K7717M910k8892J0557K6222k3569j8970L3459R467l7342
202a6384P94L3484j2356k4253K2761J2388k8841J867L1104j4868k8649K4145J9975
215B1167l0257p946L2255m749k8972J6419K1451k5287j1519K8728n63k7457J3153
228c577K2836k2378j4012K7807L169k8851P169K4335j6472j5918K3578N649k6797
$$ plain form
138 -7072 -6336 16240 -1904 -20424 8502 19310 -16391 -18814 18770 15749 -13564 -3719 10930
151 10930 -8106 -8780 15562 1595 -25356 1286 28996 -2382 -22964 8482 14955 -15140 -6644
164 -6644 18390 -4371 -20997 14199 22972 -17020 -16088 20765 6832 -23925 550 20777 -10388
177 -10388 -16422 18373 11431 -20903 -2700 20567 -7782 -19394 15110 14515 -19576 -5840 23405
190 23405 -152 -19943 7774 12684 -16208 -5651 20571 -2998 -21968 11491 20958 -16384
202 -16384 -15590 17894 5538 -18715 4046 16434 -12407 -10540 20564 5696 -22953 1192 21167
215 21167 -9090 -17036 15219 10470 -18502 -2083 19368 -5919 -17438 11290 10727 -16730 -3577
228 -3577 19259 -3119 -17131 10676 13845 -15006 -7837 16498 26 -15892 7686 13335 -13462
241a3462N176K5596j5262k0929K1772J2822k4357k211K3741q025j9486J7078J2520
254A4973k3536m319K5844m322k3677J2514J8207j8642j0507K1622R93k1938P864
267d924J8915j5114j2799K0317N342k1941K668K0046j0010j5293J5760Q389j8729
280g373j34J8837q119j6101J4539J0449j8828l435K0024l865j8082J0885J3622
293A2419j6165p184J8823k83j8482P567J5524j3214r989J6932L034j8167L970
306e215J6332j0579j2316J5443O482j7804J56J7529o547j4799J1732J0135j4946
319d397l931J6199k506j4752Q509J1067j3107o042J5280R5j5340N694J3006j0616
333h41q613J3988K803j5301L390J4155q821j0898J3174O259j5219n83J5090n261
$$ plain form
241 -13462 -8286 17310 2048 -18881 2891 15713 -8644 -10855 12886 4861 -14625 2453 14973
254 14973 -8563 -12882 12962 8640 -15037 -2523 15684 -2958 -13465 8157 9150 -12788 -4924
267 -4924 13991 -1123 -13922 6395 11737 -10204 -7536 12510 2500 -12793 2967 11356 -7373
280 -7373 -7507 11330 3211 -12890 1649 12098 -6730 -10165 9859 5994 -12088 -1203 12419
293 12419 -3746 -10930 7893 7610 -10872 -3305 12219 -995 -10984 5948 8982 -9185 -5215
306 -5215 11117 538 -11778 3665 10147 -7657 -7501 10028 3481 -11318 414 10549 -4397
319 -4397 -8328 7871 5365 -9387 -878 10189 -2918 -8960 6320 6415 -8925 -3231 9775 -841
333 -841 -9454 4534 7337 -7964 -4574 9581 760 -10138 3036 9295 -5924 -6507 8583 3322
347C322j2740J0196Q239j3535k638J4743l393j3736Q598J0525j2666n730J4797
360E982J42j4503N716J2232j0383p992J3430K709j4496K808J3233p899r965J1655
374B669N099j3595L44J3191n717j0872J0141O960j2927j821J3921l507j2662Q266
388e10R521j1675m894J3230k35j2704N255J0098r521o194J2071J220j2856L821
402c373J1448q015q190J1091L764j2275J304J1743o043r374R818N695j2068j240
416e715J2354l352j0894P050P804r779l602J0929r81j0392N314Q384q795m984
430f659J0914R41j1293L250J0239o813p618R321L745j0624O32J0317m963q694
444g305Q370N693j0383j890J0769k271r505O247P003r172l169J0704j083j0445
$$ plain form
347 3322 -9418 778 9017 -4518 -7156 7587 4194 -9542 -944 9581 -3085 -8815 5982
360 5982 6124 -8379 -2663 9569 -814 -8806 4624 7333 -7163 -4355 8878 979 -8986 2669
374 2669 7768 -5827 -5483 7708 1991 -8881 1260 8220 -4707 -6528 7393 3886 -8776 -510
388 -510 9011 -2664 -7558 5672 5437 -7267 -2012 8086 -1435 -7629 4442 5662 -7194 -3373
402 -3373 8075 60 -8130 2961 6725 -5550 -4246 7497 1454 -7920 1898 7593 -4475 -5715
416 -5715 6639 3287 -7607 -557 7247 -2532 -6134 4795 3814 -6578 -1264 7120 -1675 -6659
430 -6659 4255 5196 -6097 -2847 7392 579 -7039 2282 6027 -4597 -3965 6352 1389 -7305
444 -7305 1065 6758 -3625 -5515 5254 2983 -6522 -275 6728 -2444 -5613 5091 4008 -6437
458f437N195Q507q705n314J0719J315j1148K773R787o558o829R149K786j0210
472d970J800R635n899p506R079M418j0793o52J0676l152q623O511N178r068j260
487d626J0109k596r779N719P794p756m466Q678N31q336L338O912o257m281Q137
502C121J071q848K209Q244n169o517P192L710q227l39Q029l037o854N887M760
517E232p773j922Q717j206q325M151O635o115l852P169L03p306L313O559o514
532i34m979Q369K395q848P65P934l915o010O645L437q006m71Q131k686o734N644
548G37M374p871j639Q706j236q074L685O077n635l068O782m93o978L853O162o348
564i66m314P754K013p820O27O565l247m320N645J502p224J143P560l351o833M858
$$ plain form
458 -6437 -1242 7265 -1440 -6754 3965 5280 -5868 -3095 6692 134 -6695 2454 5240 -4970
472 -4970 -3170 6465 566 -6940 2139 6557 -4236 -4888 5788 2636 -5987 524 5702 -3366 -4626
487 -4626 5483 2887 -6892 -1173 6621 -1135 -5601 3077 3608 -4728 -1390 5522 -735 -5016 3121
502 3121 4192 -4656 -2447 5797 628 -5889 1303 5013 -3214 -3553 4476 1439 -5415 472 5232
517 5232 -2541 -4463 4254 3048 -5277 -1126 5509 -606 -4458 2711 3014 -4292 -979 5580 -934
532 -934 -5913 2456 4851 -3997 -3232 4702 787 -5223 1422 4859 -3147 -3618 4513 1827 -4907 737
548 737 5111 -2760 -4399 4307 3071 -5003 -1318 4759 -876 -3944 2838 2345 -4633 -780 5382 -966
564 -966 -5280 2474 4487 -3333 -2706 3859 612 -3708 1937 3439 -3785 -2642 4918 1567 -5266 -408
580d08M765n790j861O299j226n971L766M876n395k775O362J26o533K523N944m710
596hm630N878K336o149M25N629l279m308N584K468p076k99P522j755o718L539
612h41M976m808k181N386j126n233M044M479o173l067O984R14o709J551N405l977
628c76l344N782J068o401J361N926l545m495N317K566o323l67O118j796m897L563
644A57K850m946m18N618j958n506L879M538n053k862N597P82n257J489M224l505
660c71k695N018R30n792P61N627k401m529L586K522m340k57M681j954m175L683
676B94L118m893j300N514q24n294K759M348m176k724M786N19m707J757L924l816
692g15k569N135Q44n499J016M989k729l642M116J706m722M85M732k557m047M068
$$ plain form
580 -408 4357 -1433 -3294 3005 1779 -4192 -426 4450 -945 -3720 2642 2768 -3765 -1242 4702 -8
596 -8 -4638 1240 3576 -2573 -2148 3481 202 -4106 1478 3946 -3130 -3429 4093 2338 -4380 -841
612 -841 4135 -673 -2854 2532 1406 -3827 217 4696 -1477 -4544 2440 3354 -3355 -1804 3601 -376
628 -376 -3720 2062 3130 -3271 -1910 4016 471 -4024 1293 3859 -2464 -2831 3287 1491 -3406 157
644 157 3007 -1939 -2357 3261 1303 -4203 -324 4214 -839 -3701 1896 2678 -2579 -1090 3134 -371
660 -371 -3066 1952 2882 -2910 -2149 3478 1077 -3452 134 2656 -1684 -1941 2740 786 -3389 294
676 294 3412 -1481 -2781 2733 1909 -3385 -626 3722 -454 -3178 1608 2127 -2580 -823 3101 -715
692 -715 -3284 1851 2695 -2804 -1788 3201 472 -3170 946 2652 -2070 -1585 3147 590 -3457 611
708F11K724m918j003M796q30m096K500K803l759j106M293n62m061K191L268l410
724e59j974M160M91m235R52L624k272k497L156J046l713M71L688j832l118K823
740B11K073l330o92L464p92k993K182K120l219r63L798l63l777J581L228k676
756a48k236L301Q54l505N60L252j885k438K883J296l339M2L436j374k914K473
772B58J956l253o37L404p58l147K057K367l042j265L452N1l441J300K821k323
788b00j754L011M97l179Q54K908k065k146K917J034l386K38L255j535k638K429
804B40J693l034m72L186p73k807J909K070k703r13L001k47k863J389K259k367
820d32j293K831K05l010J000K603j970j868K642Q38k871K35K755j234k181K076
$$ plain form
708 611 3335 -1583 -2586 2210 1380 -2716 -216 2587 -1172 -2278 2015 1453 -2608 -417 2851 -559
724 -559 -2533 1627 2118 -2117 -1165 2459 187 -2310 846 1892 -1821 -1350 2338 506 -2612 211
740 211 2284 -1046 -1738 1726 934 -2059 123 2243 -976 -1939 1859 1496 -2281 -700 2528 -148
756 -148 -2384 917 1771 -1734 -1174 2078 193 -2245 638 1934 -1405 -1363 2073 699 -2215 258
772 258 2214 -1039 -1676 1728 970 -2177 -120 2247 -795 -2060 1392 1443 -1998 -698 2123 -200
788 -200 -1954 1057 1554 -1625 -771 2137 72 -2074 843 1877 -1509 -1271 1984 449 -2189 240
804 240 1933 -1101 -1573 1613 840 -1967 -58 2012 -691 -1604 1397 1150 -1713 -324 1935 -432
820 -432 -1725 1106 1311 -1699 -699 1904 -66 -1934 708 1546 -1325 -1090 1665 431 -1750 326
836C26J310k498k43K578q60k254J771J505k405o56K709m29k548J325K110k136
852c95j210K553K54k606Q07K261j587j614K177P48k502K46K352j199j891J967
868C61J013k356r8K451q87k149J720J583k294p30K561k38k365J125J862j808j063
885a312K216J41k292P73J958j559j452K151N80k389L79K240j263j711J924J035
901A419k281j33K323p50k002J479J401k015n85K172k90k086J178J528j829p83
917a254K167l9k251R75J902j690j268K175N10k271L23K096j109j577J690Q22k064
934h63OK061q43j743J498J084j896l14K083n30j805J239J329j788o08K100j72
951H38k040P94J704j348j145J701L54j760M19J570j115j144J602M97j779J86J777
$$ plain form
836 326 1636 -862 -1105 1473 613 -1641 130 1635 -770 -1426 1283 854 -1694 -369 1741 -395
852 -395 -1605 948 1202 -1404 -597 1664 77 -1537 640 1388 -1114 -868 1484 285 -1606 361
868 361 1374 -982 -1080 1371 484 -1665 55 1638 -656 -1386 1175 937 -1428 -303 1559 -249 -1312
885 -1312 904 1045 -1247 -474 1484 -75 -1527 624 1204 -1185 -806 1434 171 -1540 384 1419
901 1419 -862 -995 1328 578 -1424 55 1456 -559 -1144 1028 738 -1348 -170 1358 -471 -1254
917 -1254 913 874 -1377 -402 1500 -190 -1458 717 1227 -1044 -721 1375 266 -1311 379 1201 -863
934 -863 -857 1204 361 -1382 116 1200 -696 -1010 1073 543 -1262 -23 1306 -482 -1090 1010 838
951 838 -1202 -408 1296 -52 -1197 504 858 -902 -483 1087 -28 -1172 430 927 -852 -666 1111
968A111q59j432J387R30j673k92J773l90j631R95J242j465p24J647N5j624N89
985c61J407j193q72J516L07j579L71J457j029j120J545O50j885PJ812n89j578
1002a134J128J045j469m34J610j99j579R15J185j501n78J768kj701O17J375j167
1019a21p99J560J26j759N51J634j108j280J494N96j588jJ571o08j204J085O71
1036H20j372J3J487o10j374J081R65j382m11J455j84j387O94J133j090p27J337
1053D48J47j303L86J195q24r84J196N62j269l8J206n31j001J021O08j325j73J410
1071G31l08j375P79J112j113p22J288K30j254M59J015r81o84J370K26j491K42
1088d76J364p87r73J177M46j426J06J411o52j102J116O46j435j51J556l35j367
$$ plain form
968 1111 252 -1180 207 1137 -536 -828 945 555 -1076 -81 1161 -304 -1028 619 674 -950 -361
985 -361 1046 -147 -1019 497 804 -775 -404 1053 24 -1096 449 1099 -786 -779 1033 444 -1134
1002 -1134 -6 1039 -430 -864 746 547 -1032 -117 1068 -433 -1011 757 755 -946 -329 1046 -121
1019 -121 -920 640 766 -993 -442 1192 84 -1196 298 894 -694 -695 876 268 -936 149 820
1036 820 -552 -539 948 338 -1036 45 1010 -372 -783 672 488 -899 -205 928 -162 -889 448
1053 448 595 -708 -322 873 49 -935 261 823 -446 -484 722 191 -810 211 819 -506 -679 731
1071 731 423 -952 -173 939 -174 -896 392 622 -632 -173 842 -139 -823 547 773 -718 -476
1088 -476 888 101 -872 305 751 -675 -569 842 190 -912 204 850 -585 -736 820 485 -882
1105h82Q06Q54j054k53J180l44j155P80R49j107n60J262L9j277M25J057p26p00
1123g06R79K44j057K74J051o81q65Q96N20r73j30R58l04q40O54O20r17k46J010
1142D87k33r78O40Q62q59o67J007L38r74Q6Q40n54n70Q36L12j048L1J078m72q67
1162g05P56O09j002j98J058k47q78O04O80r39l30J104l5j087L87Q68p08n31Q92
1181B98J19r60L27P90o38n54R26K11j070J79J001m63p96P41M24q41o8Q76k77q10
1201e85N84O00q38k40Q36o6q17M00O52o35l69P94J2q07L24P47n59n85P35L18q43
1222c42J0P84k93o56N60M06p46j04P63k08p02N30N30p26l01Q49j7p98L82O07o16
1243h8m16Q20O8p98J50P63m70n40O47K80p72P6P24m07n28O26L13p40j6P53k29
$$ plain form
1105 -882 -76 778 -276 -529 651 307 -848 -68 881 -226 -786 476 515 -762 -337 720 -6 -706
1123 -706 273 517 -540 -266 785 104 -761 135 655 -318 -448 510 206 -634 20 640 -277 -523 487
1142 487 254 -724 -84 778 -81 -748 259 597 -377 -291 549 -5 -575 261 573 -475 -444 634 162 -705
1162 -705 51 660 -342 -540 518 271 -607 -3 677 -262 -592 512 477 -610 -223 645 -63 -594 298
1181 298 417 -543 -216 574 -64 -618 308 519 -551 -372 629 166 -630 111 535 -306 -374 502 225 -585
1201 -585 -1 599 -239 -479 357 291 -526 -126 526 -109 -478 316 328 -479 -155 592 33 -552 183 501 -342
1222 -342 -332 452 159 -497 63 469 -277 -381 382 174 -528 2 532 -194 -495 354 337 -461 -79 528 -88
1243 -88 -504 316 384 -414 -264 499 29 -511 136 416 -356 -280 444 37 -491 135 448 -292 -308 445 216
1264B16o72M75M84o88k39P52q7o77L16N63n59l22O55N2o26K02N97m45m35O25J52
1285C39o47J05O64l91n20N82K78o72m2O58j76o02L89M17n21k21O31n9n74L18M44
1306D00m97k50O21%o24K38N52m65l45N49J44o38J00N60l07m23M58K61n75J5N61
1327C35j70n19M00L07n22q1N50j23n51L49M09n48j67N74K5n99J95M86l83l17M80
1348A30J22n13J23M48k76l03M06J49n05M7M56k03m21L70K81m66r9M54l1m64K24
1369g1L92l87j89M29P0m72J66L74k96k71M05O5m67P8M76k42l72L68K04m53k5M79
1391B61j15m45K94L12l83j76M56k2m39K26L21l44k40M60L7m44J41L97l42k65M32
1412A22J33n03Q0M75k43l92M02K45m77l9M51j42l86K98K56m18p1M53j71l98L18
$$ plain form
1264 216 -456 19 503 -185 -424 328 241 -436 -120 443 -116 -438 217 269 -357 -155 442 -3 -438 187 339
1285 339 -308 -203 461 70 -450 132 410 -262 -304 354 178 -424 -35 382 -139 -360 271 212 -362 -44 400
1306 400 -97 -347 274 274 -350 -112 440 -25 -370 179 323 -315 -215 345 38 -385 73 334 -241 -226 335
1327 335 165 -354 46 353 -169 -250 300 177 -374 -25 384 -164 -331 243 268 -331 -136 350 -33 -350 130
1348 130 252 -261 -138 310 34 -269 137 286 -219 -172 284 81 -340 30 311 -155 -254 200 169 -295 -71
1369 -71 321 -66 -255 174 244 -228 -62 312 16 -255 150 215 -252 -174 302 60 -312 56 260 -193 -218 261
1391 261 146 -299 -5 307 -76 -252 204 182 -257 -31 290 -54 -294 166 203 -241 -100 297 -45 -310 122
1412 122 255 -248 -168 307 64 -328 74 319 -158 -197 254 112 -274 24 280 -138 -209 244 73 -325 -7
1433gK80m15j12M38%m42J71L71l09k63M26Q6m31J01L76k63k39L11J18l60RL73
1455B19j92k96K92K41l99q3M15p5l54J91L19l46j42L87ll56R1L03k70j99L69M7
1477A59l63Q3L68k39k46L39J23l89j1M51j80l54K79K39l41j08L90q4l81K14K60
1498B09k75j16L35j8l60J86L05l08k29M23P9m30J15L51k39k47K90J60l68PL27
1519A97j73k62K79J48l02l8L02o9k48J75K01k87q4L10ql23J41K50k22j94L01J24
1541B18l54LL07j40k36K64J54l47j2L28r3k67K13J76l02r1L84m1l96K06K75l08
1563e9j83L76L1l55Q0L31k26k21L49J5l17R1K77j59k33K94J27l74K2L49j63k99
1585b47K73J54k83l5K91p4l13K08K28k54j16K96pk75J28J90j70j81K54J03l05
$$ plain form
1433 -7 273 -142 -254 184 184 -258 -87 284 -25 -288 138 224 -207 -106 270 7 -232 79 197 -163 -154 219
1455 219 27 -269 23 264 -135 -218 197 122 -232 -41 278 -68 -210 177 174 -182 -91 212 -58 -257 112 159
1477 159 -204 -121 247 8 -238 101 224 -165 -176 275 95 -259 20 259 -82 -190 200 116 -265 -51 209
1498 209 -66 -182 153 135 -225 -39 266 -42 -271 152 231 -199 -84 267 28 -219 71 231 -137 -130 197
1519 197 24 -238 41 189 -113 -151 151 82 -166 9 210 -77 -161 149 141 -182 -41 209 -13 -207 94 218
1541 218 -136 -133 174 34 -202 62 216 -131 -143 185 92 -175 38 214 -88 -179 205 164 -232 -26 249 -59
1563 -59 -242 134 165 -190 -110 221 -5 -226 123 138 -179 -88 189 30 -203 91 218 -156 -134 215 52 -247
1585 -247 26 180 -103 -138 153 79 -234 -26 202 -52 -168 128 121 -154 -26 164 -6 -187 67 170 -135
1606a35Q8K20j55k48K67J29k38p3K87m5k63J63J58k12j33L05j2k31Q9K33k39j32
1628a77K90M4l05M4K72j76k14K70J67l80OL60j18k54J98J66l00l4L30r0k72J70
1650cJ88k98n2L48o6l37J83K12k30j19K89Kl23J74K10j87j58K58N6k76R4J78j46
1673cj78K20R2k68P2K28j44k05K02J54k51l2K35mk30R1J72j50j25J97K0j83N8
1696c2J35j12j65J90J01k28j7K32l8k20J79J40k14q7K91j7k57R1J83k02j09K26
1718G0K9k28N6K01j45j44K74M9l14O6K34j30j79K39P2k69JK65q4k00J35J59k19
1741f2o1K29p2j73J15J56k15m1K72o5k44J44J74j83j08J97N1k20L2J99r1j65J73
1764D2R0k23L8J46o2j44J79M3j77%J68n3j82J35J09j67m9K12lk04O6J50j13j41
$$ plain form
1606 -135 -47 173 18 -230 37 166 -72 -145 142 97 -166 -3 155 -57 -190 115 103 -128 -39 194 -45 -177
1628 -177 113 157 -148 -104 168 -8 -222 48 215 -165 -159 201 83 -171 27 193 -107 -141 189 99 -173 -3
1650 -3 185 -113 -165 183 117 -220 -37 175 -55 -174 115 117 -206 -32 178 -9 -167 91 147 -129 -35 143 -3
1673 -3 -181 39 131 -137 -65 163 19 -186 16 170 -81 -113 122 118 -112 -21 151 1 -124 73 93 -90 -32
1696 -32 103 -9 -174 16 117 -111 -128 104 66 -154 25 165 -49 -136 155 138 -119 -28 155 -47 -156 70
1718 70 99 -129 -73 128 -17 -161 113 162 -152 -86 148 18 -161 78 150 -119 -118 147 63 -137 -2 157 -62
1741 -62 -123 106 34 -139 -24 132 -83 -124 148 83 -161 -17 157 -26 -134 63 114 -106 -74 125 34 -131 42
1764 42 132 -91 -53 93 31 -113 66 109 -68 -68 100 47 -135 0 109 -58 -107 105 102 -102 -36 114 1 -140
1788a40J44P7j37j3J69j21j08J73Q9k17lK42j19j60J35J40j57j15K10k7k23J43
1810a8J47j37j24K04L9k26N9J68j28r1J45P9k13L9K20j43j25J25R8k10oK03p0
1833C5j78J15J38j79n0J80j2j48J28Q2j55l3J76l2j61P3J73j61j24J64O2j95M0
1856f2J68r6j52J39Q2j18m1J57m3j42R9J14j66K1J01o6q8Q3R4j42m6J61Oj45K9
1881e3J05l1j07J13N7j44K8J18o3r5J30Rj65L3J61n3j52J21Q7j71j1J09L7j68
1905a05M6J55j19p3J45lj08L1J13o6q5R9N9j44MJ51q3j27J07Q2j48%J46m2j27
1930i2Q8J18j27n7J56k5j46K8J16r3n9J36J0j59P7J39j53p9J67Nj32K1J51m1j63
1955a14J11Q9j29l6J60m9j29J18M9j32JJ11k5j18J11Q8j48o0J75l0j28L9J55j20
$$ plain form
1788 -140 4 81 -56 -69 100 -21 -129 44 133 -84 -87 155 36 -124 11 151 -6 -121 89 62 -161 -18
1810 -18 129 -8 -132 72 111 -115 -56 112 -16 -107 38 117 -96 -57 163 20 -105 20 118 -92 -98 105 35
1833 35 -143 -28 110 -69 -119 61 49 -99 29 111 -44 -77 99 67 -94 -21 152 -9 -133 31 93 -102 -62
1856 -62 106 10 -142 -3 79 -39 -80 77 34 -108 -9 105 -61 -40 61 -5 -93 -10 84 -58 -104 57 63 -82 -53
1881 -53 52 21 -86 27 84 -60 -32 86 23 -72 58 67 -98 -65 96 43 -109 12 99 -72 -83 26 63 -105
1905 -105 -59 96 -23 -96 49 46 -62 -31 82 16 -69 30 89 -55 -51 100 17 -110 -3 79 -69 -69 77 35 -92
1930 -92 -4 114 -13 -70 86 61 -85 -57 59 -34 -93 43 53 -106 -29 110 -43 -122 45 50 -82 -61 90 49 -114
1955 -114 -3 86 -43 -79 81 32 -97 21 70 -62 -61 50 25 -93 18 106 -42 -102 73 43 -85 -46 109 -11
1979a1p0J26J2j20MJ30o8q3R7M7j11J8R2o1q8R2Q2j59L2P7kj16Q5O7p7r6J43R
2007E1r7L0P4m0j09J00R0j34k8J04m0j09J20Q8j52j4J30J3j66Q0J06j25o3J18
2031B7K9j52O0J12j05o2J08O4j93P8J25n7j41J38O1j52j2J72j01j16J15Q4j47
2054f5j4J53m7j17R6R0j36l3J38l2j16Q5J04j38k2J28n3p1K7J62j43q0Q7N9j31
2079f9L9N9m9p0Q4P6q4K3N5l8j18J10N1j00k1P2j0o2M2P0n2j05J29N7j38mJ21
2106F8p0n2O3P7j11l7J24k5r4P9P2j31l1J50n9j24Q1J16j25n0J45Qj43O7Q3p7
2132Dp3J21Mj29N2J33p6r3J20%j35N2J44j35j20J40L7j02kJ25m6j02N7N4p8nJ17
2159F4n9q6J06M1j04l5J22j9r9O8O0m5j03J21K1q6rQ9m0q1P2O7q7l5Q9%o1N2O7
$$ plain form
1979 -11 -81 45 57 -63 -59 71 3 -80 17 64 -47 -29 63 2 -86 6 88 -71 -39 38 36 -80 5 72 -5 -101 42 51
2007 51 -46 -16 58 18 -91 9 99 -35 -63 41 1 -108 12 100 -52 -66 64 77 -89 -9 97 -28 -91 27
2031 27 56 -96 -36 76 -29 -91 17 81 -112 -34 91 34 -107 31 92 -60 -72 100 -1 -117 -2 82 -65
2054 -65 -79 74 27 -90 6 96 -40 -73 65 33 -83 2 106 -32 -54 74 21 -50 -23 139 -4 -84 3 62 -69
2079 -69 -30 29 -20 -90 -6 70 -14 9 64 26 -92 18 69 -31 -52 20 10 -52 -10 60 8 -97 32 89 -49 -53 68
2106 68 -2 -54 9 86 -25 -62 62 37 -57 22 94 -37 -68 82 23 -101 -20 96 -29 -79 66 74 -69 -2 81 4
2132 4 -69 52 56 -73 -21 112 36 -57 63 63 -72 -20 124 -11 -131 9 46 -56 -58 67 21 -81 -24 30 -48 -53 64
2159 64 5 -81 25 66 -38 -73 49 30 -69 -1 59 14 -89 32 53 -33 -42 47 7 -74 -2 65 -22 -57 32 32 -29 23 90
2188I0j30p6J43J9j15K4R4q0o6J09R9j68L9J00o6q0J07M1j28jJ13p0p0N9M8r6
2214f1%J31n6r7P3P6j14k4J41J3j45J3J38n7q6J04pj21O8L5k5p4J06M0j12%J09
2241F8n5r3R6N1q4l4J22p4l9O2K7q0n3J16op7N0N1l5r8J25mo5L2Q6p1p4J00L4
2270G8j21rJ28m5r5R7L1p9m2O7M5j18M6Q1j01l2R6J3p2J8R5q9o9J43j0j03lJ05
2298E5r0j8Q4J2q1j2J00k5m6L4L9j05K2O0po6N4N2p0j8P2kj05J8Q7p6%L3K0n5
2328c4rQ4l5n1O9L9r4J4Q0n5o3O7P1j36k7J28j2j05L2R4p3l9Q3K2q6RO7r1M7N3
2358D9nj12L4R9p5o2J21kj27M9P1l2p9N8P0r6qR6l0p9N8O1r5j4P1Qo4L1M5p5l6
2389g0P3J7p9K7Q9o4l0L5K7l8k1P0j9m7N6L5p4k7N5J5p8N5M1p0m6J07j0q8K6R0
$$ plain form
2188 90 -40 -116 27 46 -69 -45 49 -31 -97 12 111 -57 -18 82 16 -64 43 84 -44 -45 68 -2 -72 -13 35 -61
2214 -61 -61 70 14 -83 -10 66 -48 -72 69 82 -63 -50 88 31 -55 49 42 -79 -11 24 -1 -75 31 71 -41 -41 68
2241 68 13 -80 16 67 -17 -51 71 -3 -42 20 47 -33 -86 30 24 -53 -3 48 13 -85 40 36 -29 3 89 18 -56 44 78
2270 78 -43 -52 76 31 -64 33 64 -15 -57 10 55 -63 -17 64 -37 -69 27 40 -32 -14 81 -8 -77 66 56 -47 -50 55
2298 55 -35 -53 31 43 -38 -50 50 25 -21 13 52 -53 -31 29 22 -44 10 62 -8 -26 46 44 -61 -43 44 -32 -32 1 21 -34
2328 -34 -43 41 6 -45 24 63 -31 -17 63 8 -55 12 83 -53 -80 48 36 -69 -37 57 -16 -55 28 50 -36 -27 40 -51 -4 49
2358 49 44 -68 -34 65 -10 -72 49 47 -80 -31 40 8 -71 -13 57 -39 -47 49 19 -60 -2 59 -36 -50 21 29 -35 -4 41 -34 -70
2389 -70 3 20 -59 -32 57 -7 -37 -2 25 -13 -34 36 17 -30 26 61 -13 -40 15 30 -48 7 48 -22 -68 39 29 -59 -33 57
2419E7m1p8R7K2p9JP8k8p6O1L0o7J1N4l7j2K7J2m9m9J13nr4O6L4k7o7R7k7q1N0
2450gO2o8n2R9Rj32R5K5m4k7N8M1j09L0M6k9p6J10K1q0JO3j3p0O5J1m9qR0n0m7
2481c5L1O6q3l7N8L9n4JN9n1m2O5Lm5qN9J1j00P2L4q2j3P2j7p7R1K2p9QP4k8n4
2513d0L3P5o5m6J18m3n3J4N3o1l9P6Mn9MP1l3q5P9M3n5jL5J3p6M9O4j18L9P0l9
2544B7q3M5M0m4j3L7j6l9O3M0m1p2R2j3m6K2K6kq2O4N6o0n0Q2k8qk1M9n2j9O0
2575A4kl4J2L2m5jO2oq3L3R5n9p2O4O2j11j0O1J1o6N2L1q2%O7k7j4M1Km6j0J00
2607G1l1p1L5L2l7l7Q3j3r2M1M9l0l5L7Ro5L8O2m0m6O7J2o6j4O7j3p2N0L0m1%
2638b0N7j0o2OK9k2j9O5K3o7L7Rj3j9O6j1o2LL4j4p4O6L2p2nO3Mo9L6Q3p3l7N0
$$ plain form
2419 57 16 -62 35 57 -22 -21 57 29 -47 14 44 -23 -12 42 5 -7 20 32 -17 -66 47 42 -52 14 48 21 -46 51 24 -57 -7
2450 -7 55 -13 -65 34 43 -89 6 31 -13 -40 18 59 -50 -20 26 -3 -79 31 52 -28 -27 36 23 -47 18 29 -20 -28 62 12 -35
2481 -35 -4 62 -21 -58 0 39 -15 -14 45 -6 -48 17 20 -25 -33 26 37 -63 9 43 -39 -52 20 3 -74 17 39 -40 -32 42 14 -40
2513 -40 -7 68 3 -43 75 32 -21 -7 46 -15 -54 22 26 -33 -29 42 9 -76 3 46 -9 -10 25 38 -38 11 75 -43 -4 66 27
2544 27 -56 -11 29 -15 -28 9 -7 -46 17 57 16 -56 36 23 -23 -1 25 23 -59 5 61 1 -49 33 5 -3 -24 25 -27 -46 14
2575 14 12 -22 -10 22 -23 -24 38 32 -51 -18 77 18 -54 10 72 -39 -49 12 23 -43 9 40 -42 -42 25 -2 -16 25 27 -19 -29 71
2607 71 40 -31 4 36 -1 -38 45 32 -60 -19 30 0 -35 2 11 -54 -16 46 6 -40 27 39 -27 -41 26 13 -59 -9 21 -20 -20
2638 -20 37 27 -35 -29 0 -22 -41 24 47 -20 17 26 13 -6 60 49 -13 -10 24 10 -64 2 34 -38 -43 20 24 -45 -9 74 1 -36 14
2671A4Lo0K5O3o0j6O1rp6N7N8o6n5R6j8m1lQ2m8j7L4k1l9K5M1Jp5O6Jo8RL8No2
2705e5N5L4m1l7M3K3o7L8K2j3k0K1M5n9L8K4m0j7JO6r5K8J7ql2M1J8l4m1O3K6
2736D4q0K7K2%k7K9L3o4kL7j1k4K6L5o2rP2m7l4O7J0m5m3O2K8p7L4N6j05K6K3
2767AL3o1J9J7k6oN7Nq9M9L7p5K2O7j1o5L5L4j9n4M5L6p1K8K3n1k6N9Mo3K0N8
2799C2jn0K3O7p4JQJ0j7lK9m0J2L1Rm3L3k0j7NQj4LJ6MJj9K6J0o9M3MJl7L3L8
2835D3l5m3K7K7n5L1K6j5k8K4K0k1nK1km0M0J0n7PL0M5o2K3L8o1m1R6l9l5K9J0
2867HK2m1K3K2o1M0L2l4m6N9K9p3pK6J0p8R4J5n1qM7Pp8O3j8k9OM9k3l9M2J6k1
2900Ck2L1K2n4PL8nm4L3K0l3k5M5Ol3L9Jo0L2RLl8L0Ok8qO0k2l9MN6m4%K1K5n8
$$ plain form
2671 14 17 -43 -18 45 -15 -31 30 21 -55 2 60 -6 -61 35 17 -24 -27 55 7 -10 24 3 -36 -11 30 31 -44 22 23 -45 -36 2 7 -55
2705 -55 0 34 -7 -44 -1 22 -45 -7 15 2 -18 3 48 -11 27 51 11 -6 -5 61 -34 -6 11 3 -29 12 30 -4 -45 18 44
2736 44 -36 -9 13 13 -14 15 48 -16 -18 19 8 -16 10 45 -17 -26 46 -1 -35 32 42 -3 -46 16 44 -33 1 57 -48 -22 1
2767 1 34 -27 -8 9 -17 -23 34 39 -50 -1 36 -39 -17 50 39 -26 9 43 24 -30 15 51 -20 8 31 -20 -46 13 17 -46 -26 32
2799 32 31 -19 4 71 -3 -2 6 16 -1 -4 25 -15 -3 28 37 -6 27 7 -10 -5 3 -11 -8 8 12 13 -6 20 30 -39 4 8 9 -28 5 43
2835 43 8 -35 -8 19 -36 -5 21 6 -22 2 22 1 -4 17 15 -25 15 25 -32 -25 5 50 -12 11 49 -12 -53 43 4 -31 -2 8
2867 8 30 -11 12 34 -27 13 45 11 -35 24 53 -20 -27 -1 9 -69 25 40 -11 -19 28 35 -43 20 2 -27 -21 28 5 -34 8 24 3
2900 3 -19 12 34 -20 -13 25 20 -24 9 29 -4 -29 16 22 -11 28 29 -31 1 10 13 -25 5 11 -17 -25 35 13 -26 -22 34 -10 -10 11 36 -22
2936b2J1L0j7oJ7M0o6lK3l1L0mJ3l7JL7Qj7k2K0l8J3J4L4k7j1L1k4k4N8Jl1m3
2969d2N5qn5N2K0l0J3J4j3J1mK5n4J1J7J9k9kN6p5ML2j0j8JK9k9k9O9k8l4J6L8
3002B2j9k4M6pm5J2L4j1o1L6K8%JK5j5k8K8%k6k2L4j6L6j7krj6N0mk6J3J1k4P
3036A1nK4l3j6L0J5mk3J5l0QJ4J0m4L1%L2l7RRj3j1N4l1o6P3J2n2oO7m3l4L9K5
3070C0j4rJ8k9j1PL6n0J3O2l5q8L0L7l0M8J9m6j8P5j2l1nL9j9l0J7L7o4lN0j3
3102A1m4M6j5J7p4P6Lj3j0KQJJ4k3J3k7K3K4k4j5Ok4K5LK6m7k2N5k6RLK5j0k3
3136gJ0J8jk2jplN6l6l9K8K4k2l4O8J6o9L1J2kl2N8l4j7J9KJ1l9N3k9l3J4K2J
3170A6l9O2k6l1J3J9pj1L9l6k2ML4nnmOMNrJ0k2P5q9J7j8L3J9l8K9olj5K6j4k5
$$ plain form
2936 -22 -11 19 2 -4 13 53 -13 -16 7 -24 6 2 15 -22 -21 16 24 7 -15 5 -33 -20 -6 28 1 -10 21 -3 -27 31 32 1 -42
2969 -42 13 5 -50 2 22 -8 5 19 6 17 13 38 -16 -5 12 31 2 0 56 -19 -15 17 7 -11 -10 19 -10 -39 30 2 -32 -16 22
3002 22 3 -21 25 18 -27 -15 19 8 -53 -17 11 11 12 37 22 -6 22 22 -4 -26 8 -8 28 11 9 0 -16 34 30 4 17 28 4 11
3036 11 6 30 -3 -19 11 26 22 -1 14 -16 -8 6 16 -28 3 3 35 -2 7 16 3 -8 46 15 -51 22 34 -18 -24 43 0 -34 5 30
3070 30 16 7 25 -4 -15 -8 28 -22 -9 53 18 -70 -40 -3 -33 15 34 -12 -30 45 33 2 -3 36 17 -13 4 41 -23 -26 24 11
3102 11 -33 13 -2 15 -59 17 20 7 -3 -1 7 8 22 -1 12 -15 8 32 8 -7 -1 -25 0 3 29 -18 -40 15 -11 -2 1 26 16 -7
3136 -7 3 21 20 -2 -3 -10 -13 43 7 -32 -4 20 -2 -36 32 48 -21 10 22 20 -12 46 12 -5 14 16 27 -12 41 12 -21 -7 15 16
3170 16 -23 39 13 -18 -5 14 7 -4 35 -1 -23 -19 15 10 5 1 7 11 16 7 17 -5 70 -19 -2 -20 13 32 -6 23 17 14 -1 25 11 -14
3206a4oJ5K9j8J3j3Jk3M6k5l8JRMK1L5J1p0K4J8l7j1N1J0m1J9J8j8K4j7j0j2j1
3239a5J2J8j1Rj5m4M7J8j6k5K2LJ5j1K1m1pM5k1j1j7K5kl7N3qpj3K3J4mk8K5k6
3273ipk4L2L4m4K2Qk0j1J4J1l2O6l4pj1J8%k3L4k9j0L2njk4J1L5m0j3K7Pl5K4
3307dJ6j3J7mj3k9J2LKl4R4l8njJ6l4JJ9J2Mj9J1k6%MqoK0J1mk2J9J2k2nK4J4
3344B4n9L4Pk5PN0mo5M3m2N3k9J4Nk3K7k6J7J3%j0j4J3j9K1J3J1j3m2MJ8L0l6
3377cLmj1M3rqj9K3lk1J7Mj1k9K4JK4n4K9J2qk7L4J1Qj3mj4K5oRl0J7J7m6NM6
3414C2l9k5L1Nj1QJ3Lm9L1Pj6L3nk8J2%J5k8jM2l8j5NK6Jl7K2M7o9J4M2k4k0j6
3449c2N9j8Mj6kjJ0Mj8rL9j7j3Rj2J0j2KJ8k6lJ1L3j8kL7j6l4K6ok5J3L4k1j9
$$ plain form
3206 -14 -20 -5 24 6 19 6 7 -16 30 5 -33 -32 -23 -19 2 37 48 -22 2 20 -17 -28 23 33 -8 11 29 11 35 18 8 -4 -15
3239 -15 -3 15 4 13 -2 -46 1 19 3 -22 0 3 18 7 28 -13 -20 25 4 -7 -24 1 -1 -38 15 7 0 -13 10 24 20 -8 17 -9
3273 -9 -16 -40 -8 26 -18 4 12 -8 -19 -5 6 -26 40 6 -1 -12 6 6 -17 17 -12 -22 10 5 4 -20 -9 26 -14 -27 0 7 -28 -4
3307 -4 12 -1 16 12 -1 -30 -18 -15 -13 -47 47 9 4 3 19 -15 -14 5 17 21 2 13 -13 -13 -9 -17 -23 -3 8 4 -18 1 13 -9 -14 10 24
3344 24 -35 -1 6 -19 -12 38 34 -31 12 -30 23 -6 8 13 -10 17 -9 8 21 21 11 -3 10 -9 12 25 36 23 -19 -15 3 33 -3
3377 -3 0 -4 -15 28 19 11 -8 15 12 -9 8 12 1 -28 -4 -3 21 -33 -4 8 0 -27 7 18 26 13 9 -5 20 14 23 -7 10 27 -19 -14 32
3414 32 -7 -32 -1 4 -7 1 14 17 -32 -1 6 -10 23 18 -10 2 2 17 -11 -12 30 -8 -23 -18 8 9 -28 -6 41 -28 -14 28 4 -16 -32
3449 -32 27 9 13 -3 -5 -6 4 8 -10 -19 20 3 -10 -1 -13 -3 -15 -13 5 -21 -24 -13 20 2 0 37 21 -13 13 7 -18 -5 29 8 -11
3484a1J6Qj2OJ6jk4J1j5J0j6K6mkK0JNm2J1%k3j6K4mKRK3qKn6K7J2K5k2K7l3K9
3521B1j2k2L0j0O%j3K0k1RmkJ1k4J9j6M4l4l4M0J3OLl6L2l9mjL1j3qK6k4Lj6L
3557a6J1k6L6JnRK2Nj5Ln2L1K7k2J7Ol5KJ8j0Kk2J4j9Pj8M8j1k3K8lK6m3k3N1
3592B1j7j8JJ9kPrM0o3lJ3Lj6M0oJ4k5kQJ8l5M4m4K3J9l4K0MJj4nJ4kj3j9K2o
3629bLPmmKJ0k2L0k6oJrN3k6j9RJ4lmMk1J3j0N6m6km%rJ4J7J1pQPj3k7L1k3j1
3669hPOjj8J3j1L8qoJ6l4QlK8pk1Lk%K1j1j2prLM6rl5M2k6%K4j2j8J6Kj5J7j0
3708GMNm8J5K4Mk3K9j9k1J5RJJ3KlKk9JPOPMK1l5J7j7mK1l6KK4K1l1M9k3m1K7
3746GLk4J7J1j2j1mj8N1k8L1k6lMj8K7QQk4oL0l6K7k0j0K8k1K9k6Kj1J0K7mrN
$$ plain form
3484 -11 5 13 1 7 23 22 -2 9 -6 4 -12 14 10 8 28 29 34 -8 3 3 -20 -36 -12 -16 -14 -5 18 10 12 -44 -17 -5 20 -2 25 -8 21
3521 21 9 -13 17 7 13 13 0 20 -1 8 4 2 13 -11 8 -8 36 2 -32 8 21 27 30 -6 26 -13 -17 -18 13 0 -8 18 -6 -3 -19 -16
3557 -16 -5 -31 5 6 1 10 32 37 22 25 -27 4 31 9 26 32 -3 -1 17 7 9 -13 1 -18 -11 -29 19 8 -15 13 10 36 -7 -30 21
3592 21 4 -14 -13 6 4 11 2 42 -21 -24 -11 -8 -24 16 10 24 -1 -3 5 23 -12 32 -12 11 30 -4 16 20 21 7 2 16 14 1 -18 4 -2
3629 -2 1 8 4 0 2 12 -10 20 -6 -12 -11 -20 33 7 -12 -3 11 8 4 8 -13 0 -10 46 0 -2 -6 -6 -15 -1 16 27 20 28 35 22 -5 26 3 -8
3669 -8 -1 5 4 -14 -1 -12 26 18 12 28 -6 2 -1 27 20 -1 2 0 0 21 10 -2 -9 -18 -15 31 22 -13 29 3 3 27 15 -3 13 15 0 17 7
3708 7 11 16 -32 -17 7 11 -12 17 -2 -23 -8 1 2 15 17 14 16 -13 -12 -5 1 8 12 33 -2 15 -2 -6 15 -21 -19 5 26 -5 44 21 -20 7
3746 7 10 -14 3 14 2 -9 -13 -31 20 -8 23 -3 -6 -2 -20 7 15 23 -1 -7 23 -13 14 -6 -16 12 -9 20 -6 -4 -15 -5 22 18 9 14
3782A4Qj6k4J6k3M6k8j2L1Nj6j2J8l9M5j4j6K4j0J4l4J4K0l5jL6p%okJj1KK8j6
3817@L0mm1J4LJ3m5N1nkMLLl7J9kK3j8Koj0J1k6nM7n2L3j4k6L9Jj1L7l0K0k6j
3854hK5l2J1k%L7k2jOk1K4mMJ3j0k2LOK4o3L4Plj4L5l2M1j9m1N1l1J9j5J1ok9
3890b4L0oKk2J1NJ1k1l8M1J1Lj9J4K3j5k2K4L3n0nL9rkpmk7M7k4J0k5j0N0k8p
3925a1K4Ok3Onj0kJ9Rn0L5J8k4L1j5j1Nj0mJ8k0K6qNrJ7j3lJ4lj6pQj2K3mJ1k
3963A3l9N8m2J1LRj3K0l1qJ2N%J3jj6PnM6m9K1l2J4K5Jj4kj1oRQj5RlK2j7mJ2
4001A0l0N1j2Mjl8k9L8J7J8j6l7L0J0l9K7oK7rm6K8KJ0k0J8k5MJJ5l2L9j4J2l
4035DRJ1k9Rk9N6l2k8K0RJ4kKqJ2k7j5J8J1l5L0K3n6M0k1L2k9K3j4lJ1m4K6J2
$$ plain form
3782 14 22 6 -18 -2 -25 21 -7 -19 12 17 1 -11 7 -32 13 -1 -17 7 -3 11 -23 -9 11 -24 -25 11 4 4 -2 -4 -3 -14 -12 16 0
3817 0 30 26 -15 -1 2 15 -30 21 16 14 18 21 24 -13 6 4 27 9 11 5 -5 6 -20 -25 22 -30 3 -11 -37 2 3 -8 29 -1 19 -7 -8
3854 -8 17 -15 -4 -6 -6 31 9 8 14 -7 17 13 17 30 20 -2 1 7 31 -32 2 9 6 -8 27 -5 36 17 -24 27 -4 15 0 11 5 -24
3890 -24 6 0 2 -20 -9 -4 7 -14 -52 -11 0 3 -16 -2 21 6 -16 8 41 -9 -14 25 16 14 7 3 -24 23 -1 9 -16 -26 24 -4 -11
3925 -11 13 19 -4 2 -3 -13 -15 4 13 -37 -2 16 -8 23 8 -3 2 -8 -12 6 -14 12 4 9 0 17 4 1 15 12 -4 -11 -3 -15 8 4 15 13
3963 13 -26 32 -10 1 4 13 0 20 -11 -19 -7 -2 -2 11 10 -6 1 -4 42 -7 14 -18 -4 21 22 8 6 -5 -11 -2 6 -9 0 -3 19 2 -2 10
4001 10 -20 31 19 23 22 -16 -45 -7 10 28 12 -25 5 15 -24 3 -3 24 15 -31 -3 -1 9 -11 7 -18 -14 -13 2 -30 9 -5 7 4
4035 4 13 24 -5 4 -25 31 -1 -29 -9 0 14 12 14 6 18 -9 -24 -6 5 -30 0 23 -33 7 -14 18 -11 12 -2 -5 6 -38 -12 0
4069@jK0j2K6j8%Qk1J6m1K5J2lK6j7J4j5kK4l9k9L1K7k6MrOj2J4J1l3L1l9N0j5
4104A3m1K0LJ2k3N6j5k6K3j0j0Rk8KJ4Kk7K7J5Mjj7KkQJ5k9LLknOJ5j1nkJ0jj3
4143fKjPk9J1MJ4K1Mj7j4K4j6nl0K1L7qnJ8m9L6j6j8K5k4L0Nk1j9NRJ7k2j6M0
4179A4k7J0Kk3J3QJ8mm0L5k2j5N4l1qM5j0nLj9QK8j9k0Qk6J9Rk7L4k1K4k8J4n
4214dJ0k2K7k4J3nJ7Nk0L7k1k4J2jl9K7L1j3QOl2J7L1j5j7j2J3OJ2m6N4j0m4J3
4248a0J8j8K7k1mK1k3QK7l0J1qj6K7k5J7jj8L8k3pJ1k4K5mJj5L0j2J5j0l6M4o
4282Ij3J7j7K9j5j2k0J2L6k0k2O1n8J2M2m4J4qkQK3l2K0j1oQj8K2k5L8l8J7rP
4316EQk4oK7k0J0J0mj5LQjk9K8J1k0L4j5k0KMJ3lrJ0Rk3j8J8j1M8k5j2j7K0JJ2
$$ plain form
4069 0 -1 19 7 33 15 15 23 2 18 -23 2 14 11 37 20 34 19 17 41 2 -27 4 31 5 9 0 6 -6 8 19 -14 17 -22 28 13
4104 13 -28 -8 -5 7 -16 40 25 -1 22 12 2 11 -17 -15 -1 1 -26 1 16 20 19 2 4 2 10 25 -4 -1 2 0 -5 1 16 5 0 -2 8 7 -6
4143 -6 -4 -5 2 -27 -16 -12 2 23 27 10 -4 20 4 -1 -31 -10 27 19 14 32 -17 19 3 -15 10 -14 16 21 0 -19 -14 -5 12 -10 -26 14
4179 14 -13 -3 -1 -24 -11 -3 15 11 -29 6 -16 -31 23 -8 -16 29 19 14 17 -2 6 34 15 -5 3 -23 -4 5 -22 12 -9 15 -13 1 -4
4214 -4 6 -16 11 -13 0 -5 12 17 -3 34 13 -11 1 0 -39 -12 19 6 14 20 -12 5 36 21 4 -8 5 11 23 -23 31 21 -23 -10
4248 -10 8 -10 17 -4 -8 13 -10 -2 25 -5 6 -2 -18 9 -16 1 0 -18 20 -3 -10 1 -23 2 -2 -1 -16 14 2 17 7 -29 15 9
4282 9 -4 13 -4 25 10 -2 -22 -10 26 6 -16 45 -13 -1 41 -3 11 3 1 9 32 0 20 9 3 11 -7 15 -10 28 -10 7 -2 5
4316 5 13 -11 -17 10 -10 0 10 6 -9 -6 2 1 -28 0 11 -9 25 10 -10 -8 -4 9 6 -3 7 16 -7 -25 -7 -18 30 5 -7 -24 -4 -3 9
4353Ij7J1Pk5L4l6QOj9L3j3K4%k5K7l3J2Jj0QNJ3Qk5J3n1P9m3K5j3l7N3l7J2k
4388BL1j3m5L0l8oN0k4nPK1j9k4K2Mj0K6k6K5k2MK9l3J3lL0o1O7l1JRlj6JJ5k6
4424a8J3j3K9Pnj2k6LJ4J6j3j6J4mnRMkJ5l8M4j0j6J0kMK9l2mNlKj3K3Lk5K8O
4462B1nMk4kL0m9L0k2J8J0j1J6j3J5k9PN%J5k2L6j3rJ0j2opJ2jK2j6j1jJ4j0J7
4498A9Lj8jOj4J0lJ0k6K0Ql0KnK0lj5kRjJ7J3l7K0Pk1nK0L5m6j4J5k1J9RQk7M2
4536B3k1j8K2j0M6ql4lQJ9l3jjLK1Qk9j0qK9j0M1n2oL2j3oj1J0JJ3oqJ4pNJ0j0
4574@pNMk1k5N1J3qOj1J0j2j6K0k0K1k2k1J2oJ1rrK7K0l3JPJ3mj2MJ1LRl1%K2
4612CqJ2oKoLJ3j5J6Qk4K5j4Rj3J7k7Mj9kL0j5Kj3K9j5j1LjK9k8%j5L5j3olK0
$$ plain form
4353 9 -8 3 10 -15 19 -17 -9 -3 -22 11 -2 22 22 -3 24 -9 3 4 -6 2 7 20 28 3 16 -35 44 1 26 13 -24 29 -8 4 2
4388 2 33 20 -25 5 -33 -39 11 -13 -18 -11 10 -9 -33 -11 -7 -17 9 -17 8 -14 -10 19 -14 -1 -4 26 -35 32 1 2 11 8 -8 -7 8 -18
4424 -18 -5 -18 11 18 13 1 -25 -22 -8 8 -5 -21 -7 -11 -16 -7 -3 -5 10 -28 16 6 -10 0 -2 2 31 -1 -5 0 -3 -1 -14 9 12 -13 15 21
4462 21 16 20 -4 -6 24 -25 5 -17 1 11 0 16 3 18 -11 -4 1 1 16 -6 30 17 8 18 6 0 -7 5 4 26 10 -1 -2 12 2 19
4498 19 22 4 3 9 -5 5 2 12 -14 6 14 -16 -14 -19 1 -2 -17 -19 -10 -11 6 19 -18 2 9 -12 -17 3 38 -8 -22 -7 -28 -9 0 8 -19 23
4536 23 2 -16 6 -4 42 34 0 -3 5 24 -9 -10 -11 -8 13 21 -8 -18 -26 3 -7 34 -18 -24 8 -5 -11 -22 -12 -11 2 -4 -12 2 -5 0 10 0
4574 0 -7 -2 2 -19 -44 7 20 12 18 7 17 5 -11 9 -11 10 -12 -33 -21 -27 -16 -25 -34 -7 13 -20 -19 -12 1 -3 -15 -11 0 3 12 -19 -19 3
4612 3 -5 7 1 3 -3 0 13 -2 14 22 -2 23 9 18 5 22 -5 -1 -20 -22 8 -7 -5 -18 11 -4 -15 -12 -13 16 -12 -12 -27 8 -5 -11 -14 6
4650FLj5j4L3jmJ8l2mQK4l0j5N4l0Mk3K4j9j8J5Ml0K0K5lLJ5j8j1L5l8K7pjl0
4686b5KK3pJ4k2N4n4K8l1nK0L0k1k6K1J0Kk8j5L4mJ2lrj2L3j4j9K0lj5j9K0j9
4720b8L2j7j4K3J0j7nJ0Ok5K7j3KqMK3k5J3J8k2J4j3j5RPk2K2PkMOk6J1K5mk6
4756iJroL8j3opkOJ0lj3PK9m9J8j7J4J6K0k9j3K7oOj4%L3j4k6L7rk1JL5Kk4qm
4795bj7K8l2K2K4j8j7QK2jj2Mk7j7M1M%mpMj3J1j5okK0K3nm0K0J1j4K4j8K3l3
4831a1L1j8rLJ2j6J6J%NoLRkkj2mpL3k1k1J3nORj3nJ3Lk3OK0nj9J5mJ8j0qJ4l0
4872b1kLJ5J0J0l6J2J2j4J1kJ3k1K1Lk5j8K4jQk2J6k0J3mJ2j6mJ6rLJ5k9J0J6
4907aNl8M6rLmQj2J2knK0l3pK9k7L5k3oKK1m2O4j1m0J2qJ1%Oj5oK8k6J2j1j2j0
$$ plain form
4650 6 9 -6 -20 13 12 8 26 -6 -10 -2 22 -8 -23 31 1 5 -18 6 -13 -31 -16 -12 -42 -22 3 0 3 18 0 -11 24 -14 13 6 5 -25
4686 -25 -23 0 -7 7 -15 39 -15 13 -18 -23 -3 27 6 -20 1 11 13 -15 -30 4 0 12 9 0 -12 21 7 -12 8 5 -10 -29 -9 -28
4720 -28 4 -13 -27 -4 6 -11 -16 -6 0 -25 2 -11 -9 -17 -13 10 -15 -2 16 -6 8 -5 -20 -11 -4 -26 -4 3 1 5 11 -15 -4 21 17 -9
4756 -9 -8 -17 -23 15 2 -4 -11 -13 -7 3 0 -13 -6 23 -26 -8 -25 -11 5 25 -4 -17 10 4 10 -4 -4 29 15 -11 26 17 -4 -3 32 34 10 2 -2
4795 -2 -19 9 -23 -1 23 5 -12 -4 18 17 5 9 -18 -35 6 10 10 6 -1 3 -10 1 -14 -20 -22 -2 21 16 -24 -4 7 -7 17 -1 22 -11
4831 -11 20 2 -7 -4 8 -8 8 9 9 14 8 11 20 18 16 4 0 -7 26 5 -16 -3 -8 -2 7 -6 -11 2 5 -18 -12 8 3 -16 -1 -5 13 3 -5 9 -21
4872 -21 -23 -20 -5 5 15 -21 -9 3 -11 0 -2 11 -10 11 14 -11 -29 -5 -6 2 -20 -4 -24 -11 -15 -3 -19 -23 -7 -16 -13 2 -27 -17 -1
4907 -1 4 -34 12 3 6 2 10 -2 10 8 3 23 -10 -17 12 -15 20 -3 -9 -7 14 -28 36 25 -15 -3 -11 0 0 6 -9 -15 13 -13 -1 -12 -24 -34
4945c4K7J3lj3K6j2j3K3j6j8L6l8J1J4J7pJ0kj0j1Pk7K5J2j4j5K7m1K3J1j1J1
4977Hk5J5qJ3opKk0K3K1j5LmlqJ8NMl5J4qM0l9J6j4oJ5J0Lm3L4k0J5lj0K8k9K1
5015Ek6L0j2j9J4jj5K9j1jJ0l0J0j0N4ml7mJ9J8k8J9NK3n1%pK4K8l2J2%k5%LJ7
5051GJ8k4JK3k0j5J2j7KOJ4k5J6Knj2mRj8L8jmK2n8M0j2L6k1j8K4n8L2%RL0l7
5087hJ3Mmk7MK5J8l0J2rK8l2Pj1oJ4%Qpj4mj9M0J1qk6J7j7J5lJ6k3rK8J3%j9j9
5125b2L3jl3QJ6RojQj0J3m2M5j0k8K4JJ4k7K3l4PK2oj8J8j1KJ0k1K7kj5LMJ6l1
5162a5J9KMQpj6L4j4j5KJ7j5nJ2J2l3K3j3OJ6orKK2l0K1l1J4nlJMjjJ4l8JmK6
5201aJJ4ppj3NOOj9KNjK6jrknJ0j8L0jqJ5l7L9m7K1KKP%l2rM5j3k7L2j8j4RK5
$$ plain form
4945 -34 -7 6 3 -10 16 4 -9 14 -2 -20 16 -22 -11 3 20 13 23 21 11 0 7 -20 5 17 3 -12 15 -26 -3 8 -3 8
4977 8 -17 -2 -10 3 -3 -10 -8 -28 -5 16 1 4 0 -3 -11 7 12 16 -19 -5 -13 27 -12 4 -10 -16 -1 9 12 -31 3 -17 -2 -5 -15 13 -16 5
5015 5 -21 9 -3 -22 -8 -9 -24 5 -6 -7 3 -27 -17 -27 27 23 -14 -18 1 19 -9 10 15 38 -13 -13 -20 4 32 0 12 12 -13 -13 -10 7
5051 7 25 1 2 25 5 -10 2 -15 -13 -7 7 -18 -2 0 -5 -17 -21 -12 -30 8 7 3 25 -33 7 -5 31 10 -8 16 -42 -10 -10 -1 29 -8
5087 -8 5 9 5 -22 -18 7 25 -5 7 -2 26 -6 1 -10 -16 -2 -2 6 -1 -15 -19 -38 2 13 5 -21 -4 -21 -6 -9 7 -16 -25 3 16 16 -3 -22
5125 -22 11 10 -23 -15 1 10 4 3 11 1 14 -28 17 7 -21 3 4 18 -9 14 -20 -13 9 3 -15 3 -8 -6 4 -17 10 8 -7 -4 0 16 -15
5162 -15 4 6 10 18 11 -5 29 15 0 2 19 4 -1 11 23 -10 13 0 6 22 16 7 9 31 1 22 -9 5 0 -3 -2 2 1 0 14 -24 -23 -27 -1
5201 -1 0 14 7 0 -13 -8 -2 4 -15 -13 -8 -9 17 16 7 5 0 10 -8 22 21 13 28 -9 30 -17 4 6 8 15 15 -17 -26 19 6 -21 11 -7 -21 -12 13
5242A3jnj0k2J6J6oLL4n5J9L0l2K2m8j4N4m3N7j3jl9J0K2j2L0m9M2j5qk2OK1J
5276AOk0K4j7KKPl0L5J9k3qj2L0pk2J9j0k7M5j7K9j9rJ9k9KL6lk5j9M9l0k0K7
5311Ej4J0Nkj1KJ8l1J2K6n2K7Nk8L7J%m5K5K9k5J3J1qmPl0jK9kNJ8k2J1j1K4l9
5348eK8rpKj1qj3L6l3J4J1lmqNL7o4M1J0j4k4K6Kpj4MK8jRl1j4K1jKRk2Ro%k7
5388c2mK9K0k8L2j2J5k3J1kpMJ5k7j0K3Ql1nK4JL9k4knk5L2k5L5Kk5J0k3KqM1
5424B5l4OQj6L2Lk4R%j6PRk6K3J9n0QL8l4k4J5J9j6j2M0k0KL0m7J7K4JJ0l2Ol
5460cJ3j5j5L1j4koL4j5k9J6J4l4K1J8%ookkJ2j2Olk3N6j6j0J3l2J%JL0j1k0j3
5497b3J2MKK1jj1J1m1N2k9J7J1k1J8k7PNk2L8m4J3J0QNj3rRj3JmMo%J2nL3j1j7
$$ plain form
5242 13 12 7 -3 -25 -9 7 1 4 38 -17 2 32 0 22 -26 -40 14 -29 28 15 14 -25 -15 7 -5 25 -24 18 3 -5 -27 -21 0 1
5276 1 7 -13 11 -6 -4 -2 5 -25 10 29 6 -2 -14 16 9 -13 6 -4 -31 14 -3 26 7 -2 17 -12 -10 26 23 -2 -21 28 -2 -22 5
5311 5 -9 1 6 4 -7 -5 13 -18 -6 20 -32 -5 0 -28 9 10 10 -35 -10 19 -6 7 18 10 6 13 -17 -18 11 9 14 32 10 21 10 34 -5
5348 -5 23 14 7 9 -2 -10 -23 13 -20 -6 5 2 -2 -10 -5 32 -32 9 19 5 -19 7 9 2 -12 -8 20 19 28 -3 -17 4 3 5 14 -8 1 -5 -5 -32
5388 -32 -36 -7 13 -15 17 5 20 -3 8 6 -1 3 18 -9 -19 4 12 -19 -24 0 1 40 16 14 9 -16 16 -9 26 28 3 13 -10 -8 -16 25
5424 25 -9 -3 5 -11 21 24 0 9 9 -7 0 9 -17 6 25 -25 -17 21 -13 -37 -22 -3 -19 -31 9 -11 -9 21 -26 -9 15 16 26 -6 0 -3
5460 -3 10 -5 -20 11 -3 -5 -11 23 8 -21 -5 9 -25 -4 14 14 8 2 0 -2 10 -2 4 1 -22 34 18 8 21 -11 -10 -10 -9 21 10 -10 -23
5497 -23 -11 -7 -5 16 15 4 15 -26 26 -3 14 25 4 22 -5 2 7 -15 23 -21 -8 2 10 15 2 -7 2 -11 -10 -14 -10 -16 -16 -4 -9 24 13 -4
5535dl0K8OJ0Mj6k6N5k4Rk0j7M8l4oK2mkJ8j1k1M0k6K4j9loRk1J6pJ0Ol0L3Lj1
5572CkoqJ7j0k5L2j7L3m9J6K9j7NNj4J5pk0J6J5K8k5J4lk5J9rk4K5Om4K3J1j8
5607a1J5K1k4nmPj5J6KlJ5l3QK1nJ4pPj8NJ5k2k6N0j1k1jRJlJ1nK1j2J0lj1k6
5645a8J3L8l7KJ5j1qKk5K2j5ROj0L4j0ok4RK0%pK4m1L9l8M0J8n6L1kk5K3j4oj9
5681b7J0J4ROk8K2j1J1m2M7Pj7K8l8M1n3nK9Kj5rKk8K8J9K2k9QjjJ9l7J8j1K3
5716A3Nj4J9m4K4kj3PjRJ5l2K9Kk8oL0Pj0j3Kj2kj1L4lpLJ6m6L3J9k1Knk5ML6
5754A4kMj0J2j8K5k1j5mK6KnlnJ5krNkl0N2m2M6j9rK4l3QqJ1pNj1Qj5K6j7K9l0
5793eKj0J2k8M8l9J8kQj4L1k4K2k8mL0jl1RKkRJk5RJNKj7L5k4KJ6J2%j7rRoL0
$$ plain form
5535 -4 -34 -6 0 10 14 -2 -28 27 3 12 -8 -25 23 -11 -17 5 1 -1 17 6 -15 25 -1 23 4 1 -5 4 -17 -1 -8 2 8 -22 11 14 3
5572 3 1 -5 -13 4 -6 -31 1 -16 17 -32 -16 13 -4 1 6 -8 7 0 -20 -4 11 39 14 28 25 0 19 10 -14 11 17 -27 -4 7 -11
5607 -11 4 25 1 -4 -8 -1 -16 0 2 -1 14 -19 -11 10 5 19 12 19 1 6 21 -1 -27 23 12 -9 -10 -1 0 -3 8 3 24 12 22 19 8 -18
5645 -18 -5 33 -4 -2 13 2 -6 -4 -29 -7 -22 -13 -7 -17 17 7 1 -23 -14 6 6 -1 23 -18 21 -17 23 41 -15 16 14 -11 12 -2 -8 -27
5681 -27 -17 -3 6 12 -16 6 -5 6 -36 11 18 1 29 -9 32 -21 -26 3 5 -10 -19 -17 -45 -17 2 24 -5 3 2 1 20 -17 1 -10 13
5716 13 18 4 23 -21 3 1 -12 -5 -6 3 18 -14 15 17 -11 -17 13 20 10 -3 -1 -13 -15 -26 8 5 -2 1 17 -29 4 23 2 4 -1 -26 -22 14
5754 14 12 16 6 18 0 25 4 -11 -15 11 13 8 5 0 15 13 4 9 7 -23 29 -13 33 14 5 29 -4 4 -4 7 0 5 -6 2 -13 13 -4 25 -5
5793 -5 -3 -13 -1 -29 19 -20 -2 -4 4 -10 21 -3 19 -9 -13 17 16 -15 -6 -4 -6 3 4 -21 -12 -11 -6 -4 -21 14 -10 -8 8 20 20 3 -6 3 -3 27
5833B7l7l3O5l2PJ7pK0l3mLkK4L0m2jL0k4k2J3J2l2M2k9J1%jK2l1j0%LJ8m3L3
5868fNojK5j9JPMj3k2M1qjkj1L2rkom0J1kP1l3j6J1r%k0J9mK6l4NnL5nj4ln%k3
5910b6J5KJmRORNk5j4J1J3j3L5%j6%mm0M6j5RJ1j6RJNqJ2j0K2k4rK3k0Pj5Jj6
5949b3nL6l2J2J8l0J1J0k0OPjLJ3l1J0J4MQj8k6L9Jk0L4j6J0k8qK4j1L9j7mj0
5984a%Kpl0PNKjJ1J2mlL1l0k2J6kj8L4qRk2L8j7K6rj2nJ4m5J8J5j6K6j2j1jlJ
6023a2J3j7qM8l4M2j6l0JNj3j0nL0j9J4j5L9l5M3k9OK2k0J9k9J3j4J0J1Qk7Ok
6057eJ1Jj9mK6k0lK3l3K4nj7K1J6k6K8Rm3J0JNJ5m4L0mJ4Lj0lJ0j7J9Nj4JJ6M
6094B5n3J8%nJ4Pk3RMJnL5pj9J1Kk1QK3k6J1l6L4j8Ok8M1rj4Mrj6M7m6M7olL3
$$ plain form
5833 27 -10 -43 22 -10 -3 14 7 27 -6 -10 -7 -9 15 45 3 2 32 8 -14 -1 11 -21 21 -8 3 3 2 24 -7 -17 -17 -14 4 -39 -6
5868 -6 -1 -7 -8 17 -2 -1 6 10 -3 -25 16 8 7 5 -6 26 17 15 9 -31 -20 -22 49 16 0 11 2 2 -18 1 -3 23 -11 -6 -11 24 19 5 2 -3 -3 -26
5910 -26 -11 -9 -8 -12 -3 3 12 17 -8 -22 -11 2 -11 24 24 8 8 4 -36 10 -5 4 15 -1 8 9 14 6 18 8 30 6 -3 20 0 7 -8 -7 -23
5949 -23 -28 8 -24 -12 6 -24 -13 -3 -23 -17 -10 -11 -8 5 -26 -16 -2 2 10 -8 -34 5 6 -14 20 4 14 -14 -22 2 -9 30 13 9 -1
5984 -1 -1 1 -6 -36 -29 -24 -22 -23 -12 0 -4 -7 24 -6 -28 -12 -14 -32 2 -6 3 -19 19 2 28 19 7 2 16 -29 -11 4 -12 14 2 -9 -10 -13 -12
6023 -12 1 -16 -24 24 -10 32 16 -14 -13 -8 -21 -31 -36 -6 -25 -11 -26 13 -22 21 -8 -2 20 0 19 -10 3 -11 -1 10 18 -9 -3 -5
6057 -5 6 7 -12 -16 10 -10 -13 10 -23 1 -4 -21 0 16 -10 18 27 -16 -6 -5 0 15 -29 1 -3 11 14 4 1 11 -6 13 18 4 5 21 25
6094 25 -28 -10 -10 -15 -1 6 -17 -8 -4 -3 -8 27 20 1 12 14 -7 1 24 -2 9 -27 7 -11 -5 -33 8 -1 -15 -11 -20 -36 11 -35 12 6 3 36
6132C6k2K0j0l2Oj3N1k7pkL0k9J8lj0OoRj8nQPk0JK0j1l6M8%j1k6J8Oj1J3MQj7
6170gNl6L5jj8RmM0m9K1K9k3J7k8QKl2M5j5kL2l0j4KJ5kpJ8l5J3M3o2oL2rJ4k4
6207b4J2K2rk5J7np%ML1l4J3k0J8L5m2J6m6M5l1M0l7M1j3JK3j7j1K2k5llJ9K4
6241C1j7l3oL4j8J8l3J8QjNk9K3Lj0J7Lj6J4onJ4olj1k2K7J1j2K0j9J8j6j3J8
6276FKLQm8L6k2L6l6K1j9qkJ1LJ3Jn4P8l2j9K9j7K5jl3K8j2RQk6qL0mJ9J2m2R
6313DLj9K8lrj3mK3J1Rl0j3K1k1kkJ0mOK4Oqm1K5kpJ8Rj0Pj4Ml6M4K1m3M6m4L3
6352B7j6j4J9k4J9oj5J8jj1PMj9L7k5RJj2Lj8mjK5JJJ5m5K8Nk8pL7J0k8jrL6j5
6390CJJ3j0j1jPj6RoJ7Pj0jlrJ3Lj8K2k2J2k6LkJ6jlM4l4j1j0K8j9lJ1J6lj6k5
$$ plain form
6132 36 14 34 24 -8 -2 -15 36 9 2 0 30 1 19 16 6 12 6 15 -3 -8 0 7 -13 -12 8 -3 -39 9 9 -2 -28 -10 -4 -15 -2 2 10 -7
6170 -7 -2 -38 -3 -4 -22 -13 -17 23 -26 -5 24 1 18 -10 -2 0 -32 13 -2 -4 28 -2 -16 -14 1 -1 -8 10 -25 -12 31 -31 -37 -5 -14 0 -24
6207 -24 -12 10 1 -24 -7 -12 -19 -19 -15 16 -18 -5 -25 -7 28 -14 2 -44 1 -30 10 -27 14 1 2 25 8 -3 19 -6 -9 -12 7 31
6241 31 14 -19 -25 9 -9 9 -24 -6 2 1 6 -23 0 3 -7 10 13 -3 11 5 0 14 8 5 -6 -28 -1 10 -2 18 -1 17 1 -12 6
6276 6 8 11 19 -29 7 -15 21 -15 6 -13 -21 -23 -12 -9 4 5 -49 29 -3 -22 7 -10 15 14 -19 9 -3 6 14 -12 -20 10 6 25 37 -5 4
6313 4 7 -12 16 13 4 -9 -13 10 21 30 0 -13 8 -13 -15 -17 -7 -11 -5 19 25 17 -24 1 -1 -8 10 19 9 16 2 6 -30 14 35 -8 38 -6 27
6352 27 11 -3 16 -8 11 5 -10 8 7 -4 3 7 -12 25 0 9 10 -2 1 -17 -21 -22 3 4 5 20 -25 3 8 -20 -27 10 20 -8 -9 -18 18 3
6390 3 4 17 7 -4 -5 2 -14 -5 -11 6 13 3 2 -1 -10 3 6 -12 10 -12 0 -26 -23 -25 -9 -10 -13 31 -3 -14 -24 4 -15 -18 -7 9 6 -10 -35
6429c5L2K5l2nK2rNNk5J5J8J9o3L7j0k7J9K6k6J1MpK8j6j3qMMnLNrk5L0nQrKL3
6468B6k9k2jMK6Pk5J6rQj7K1j7J8j7K6Mk3K1k5j8L2Ljj1L6mm0pK3J1k0llj7K5
6504bK1l2P6p5K3kRrk2M2j6j5K9pj7L1omk6oK5m2NJ6mQJ2%Rl2KNjjJ3J0m9N3J
6543B2k7j5J9kjj1K4l8LM0j5J1oJ8Lj8%rK4%k5rK8k3Kj0L0j0J8k1oO5m1l7M1l3
6579iK5k1K3j0J0km9K4KJ3j1k8J5N2l2J3k1MJ0oJ8j4k7K6l4L9OLmqJ3k2L1n0L5
6614A4J7m8j1MRlnLL5k9mMN4k7l0M2m6J0nK9j7jJ4k2J6JOj4j1K2nlj0J4nkK1k2
6652ej7J7J4nlk6J2K3j6J8Lj4j2L5m4L3J3l3K4j7Kj3J2J4j5Qj4M1n1M2j6mj3J2
6686ERrpJ7Pk8L5m5OJ7J0J3m7L9Kk7J8k3L2j7J9l4j9M5j6mj6K5NL8p2nJ9l2K5
$$ plain form
6429 -35 -3 22 -10 -15 7 -2 3 8 -17 -2 16 35 -28 9 -1 -28 -9 17 -9 2 6 -1 27 11 -2 -10 -6 -2 -7 -4 1 -8 -33 -3 -8 0 -9 -7 26
6468 26 -3 -25 -26 -22 4 11 -14 2 -7 1 -16 5 -12 6 -11 15 19 -4 17 -8 -26 6 9 8 -3 33 29 -11 -18 5 16 -4 -7 -10 -27 -2
6504 -2 19 -13 63 -12 11 9 18 9 -13 29 13 -2 27 20 3 34 28 24 -2 -8 17 -25 -20 -4 -8 0 12 12 21 -11 -9 -4 -5 -6 7 17 -32 21 22
6543 22 -5 -20 -1 -3 -4 -15 9 -29 -26 14 -1 10 4 22 25 7 7 -2 22 22 -3 -12 16 -7 -5 -15 15 5 23 2 -4 61 20 -17 24 -9
6579 -9 16 -5 18 8 18 16 -33 -9 -7 6 -5 -33 -18 34 2 15 -6 -2 8 2 20 6 -21 5 -29 10 16 19 15 7 20 -2 29 -21 14
6614 14 31 -17 -28 -24 -15 -18 -23 -20 15 -14 -18 -14 40 13 -17 25 -21 -11 -16 13 -4 -5 9 -13 3 4 10 -4 -15 7 2 -1 -11 3 -2 -4 17 -5
6652 -5 -22 -5 9 4 1 -25 -13 10 -6 12 15 1 -11 24 -20 13 26 -7 17 0 2 -11 1 15 0 8 -6 35 -16 26 10 6 -7 5
6686 5 14 5 -2 15 22 -6 29 -16 -10 7 17 30 -17 22 24 -3 15 -8 24 7 26 -8 -27 18 2 -2 -18 7 12 50 -22 -27 -8 -40 -15
6721a5K5jJl2J3J6j0J2J1k1Lj3pK9jj3Lqk2J1L4rOrl1NJ3jk8K9l9K9rK8j1K4j9
6758gOJ1J2om8O3pj1pmnj3K9k3L4k1j1NNRqKJ8l5lJ7l2K0K6k5Rl8L9rJ4nj4nJ9
6797Aj5J5K8k5k0NK2oMjKqj6pL9Pj9mL2l8J4j6j8M2l4MM7k8j2Pk3J6J4Nj1r%L5
6835B9l7j1JK8k1J5mk1RM3j6k8K6k5Lj6L6pk7Q3o5j1L0k4K6k4j0L9rk2L8j2Mm1
$$ plain form
6721 -15 10 9 10 -22 -9 7 -3 9 20 -1 2 -11 -18 11 10 -3 0 -8 -30 -19 15 6 12 3 -28 -23 -10 -11 -39 -10 -49 -20 -29 -1 -12 12 -7
6758 -7 -1 10 22 16 -32 31 24 13 6 2 -3 -16 13 -10 24 3 -8 -3 2 11 3 5 23 -12 -15 2 -30 -10 16 -9 0 -38 1 -8 6 1 -13 -18 1
6797 1 -14 1 29 4 -16 -11 11 5 9 8 10 2 -14 -21 18 25 6 2 34 -4 10 -6 -24 18 -16 -12 35 7 -5 2 -21 -5 9 14 3 -6 -6 29
6835 29 -8 -19 -18 10 -11 4 0 -21 -12 31 15 -13 13 -12 -9 -25 11 4 -23 60 -5 -16 14 -10 16 -8 -18 21 12 -10 28 16 20 -21
$$ [...]
8191D
##END NTUPLES=NMR FID
##END=
