##TITLE=1H_Pr D-25
 200.13MHz, CDCl3,
 8 sc
 
 25.3.2025
##JCAMPDX= 6.0         $$ Bruker NMR JCAMP-DX V2.0
##DATA TYPE= NMR FID
##DATA CLASS= NTUPLES
##ORIGIN= UXNMR, Bruker Analytische Messtechnik GmbH
##OWNER= pz
$$ XWIN-NMR		Version 3.5
$$ Tue Mar 25 16:25:41 2025 Russian Standard Time (UT+4h)  she@DPX200
##.OBSERVE FREQUENCY= 200.1313
##.OBSERVE NUCLEUS= ^1H
##.DELAY= (6, 6)
##.ACQUISITION MODE= SIMULTANEOUS
##.ACQUISITION SCHEME= undefined
##.AVERAGES= 8
##.DIGITISER RES= 18
##SPECTROMETER/DATA SYSTEM= spect
##.PULSE SEQUENCE= zg30
##.SOLVENT NAME= CDCl3
##.SHIFT REFERENCE= (INTERNAL, CDCl3, 0, 14.3821)
##AUDIT TRAIL= $$ (NUMBER, WHEN, WHO, WHERE, WHAT)
$$ ##TITLE= Audit trail, XWIN-NMR		Version 3.5
$$ ##JCAMPDX= 5.01
$$ ##ORIGIN= Bruker BioSpin GmbH
$$ ##OWNER= she
$$ F:/spectra/data/she/nmr/H-C/1/audita.txt
$$ ##AUDIT TRAIL=  $$ (NUMBER, WHEN, WHO, WHERE, WHAT)
(   1,<2025-03-25 16:24:00.12 +0400>,<she>,<DPX200>,
      <created by zg, POWCHK disabled, PULCHK disabled
       configuration hash MD5:
       00 E9 B6 7A A2 85 ED C7 34 08 36 98 17 FE 4E 26
       data hash MD5: 16K
       C6 24 10 2F C7 B1 A9 29 CF E6 66 3B 09 C5 DE E8>)
$$ ##END=
$$ 
$$ hash MD5
$$ DC 9C 5B EF DE 0B D3 9A EC 59 EB 53 4D 41 A1 6B
##$RELAX= 
##$RELAX= 
##$RELAX= 
##$RELAX= 
##$RELAX= 
##$RELAX= 
$$ Bruker specific parameters
$$ --------------------------
##$DU= <F:/spectra>
##$EXPNO= 1
##$NAME= <H-C>
##$PROCNO= 1
##$TYPE= <nmr>
##$USER= <she>
##$AMP= (0..31)
100 100 100 100 100 100 100 100 100 100 100 100 100 100 100 100 100 100 
100 100 100 100 100 100 100 100 100 100 100 100 100 100 
##$AQSEQ= 0
##$AQ_mod= 1
##$AUNM= <au_zg>
##$AUTOPOS= <>
##$BF1= 200.13
##$BF2= 200.13
##$BF3= 200.13
##$BF4= 200.13
##$BF5= 200.13
##$BF6= 200.13
##$BF7= 200.13
##$BF8= 200.13
##$BYTORDA= 1
##$CFDGTYP= 0
##$CFRGTYP= 5
##$CHEMSTR= <none>
##$CNST= (0..31)
1 1 145 1 1 1 1 1 1 1 1 1 1 1 1 1 1 1 1 1 1 1 1 1 1 1 1 1 1 1 1 1 
##$CPDPRG= <>
##$CPDPRG1= <>
##$CPDPRG2= <>
##$CPDPRG3= <>
##$CPDPRG4= <mlev>
##$CPDPRG5= <mlev>
##$CPDPRG6= <mlev>
##$CPDPRG7= <mlev>
##$CPDPRG8= <mlev>
##$CPDPRGB= <>
##$CPDPRGT= <>
##$D= (0..31)
0 0.7 0 0 0 0 0 0 0 0 0 0.03 0 0 0 0 0 0 0 0 0 0 0 0 0 0 0 0 0 0 0 0 
##$DATE= 1742905439
##$DBL= (0..7)
120 120 120 120 120 120 120 120 
##$DBP= (0..7)
150 150 150 150 150 150 150 150 
##$DBP07= 0
##$DBPNAM0= <>
##$DBPNAM1= <>
##$DBPNAM2= <>
##$DBPNAM3= <>
##$DBPNAM4= <>
##$DBPNAM5= <>
##$DBPNAM6= <>
##$DBPNAM7= <>
##$DBPOAL= (0..7)
0.5 0.5 0.5 0.5 0.5 0.5 0.5 0.5 
##$DBPOFFS= (0..7)
0 0 0 0 0 0 0 0 
##$DE= 6
##$DECBNUC= <off>
##$DECIM= 32
##$DECNUC= <off>
##$DECSTAT= 4
##$DIGMOD= 1
##$DIGTYP= 9
##$DL= (0..7)
0 120 120 120 120 120 120 120 
##$DP= (0..7)
150 150 150 150 150 150 150 150 
##$DP07= 0
##$DPNAME0= <>
##$DPNAME1= <>
##$DPNAME2= <>
##$DPNAME3= <>
##$DPNAME4= <>
##$DPNAME5= <>
##$DPNAME6= <>
##$DPNAME7= <>
##$DPOAL= (0..7)
0.5 0.5 0.5 0.5 0.5 0.5 0.5 0.5 
##$DPOFFS= (0..7)
0 0 0 0 0 0 0 0 
##$DQDMODE= 0
##$DR= 18
##$DS= 0
##$DSLIST= <SSSSSSSSSSSSSSS>
$$ [...]
##$SUBNAM0= <"">
##$SUBNAM1= <"">
##$SUBNAM2= <"">
##$SUBNAM3= <"">
##$SUBNAM4= <"">
##$SUBNAM5= <"">
##$SUBNAM6= <"">
##$SUBNAM7= <"">
##$SUBNAM8= <"">
##$SUBNAM9= <"">
##$SW= 18.0517328524113
##$SWIBOX= (0..15)
0 0 2 0 0 0 0 0 0 0 0 0 0 0 0 0 
##$SW_h= 3612.71676300578
##$TD= 16384
##$TD0= 1
##$TE= 0
##$TE2= 300
##$TE3= 300
##$TEG= 300
##$TL= (0..7)
0 120 120 120 120 120 120 120 
##$TP= (0..7)
150 150 150 150 150 150 150 150 
##$TP07= 0
##$TPNAME0= <>
##$TPNAME1= <>
##$TPNAME2= <>
##$TPNAME3= <>
##$TPNAME4= <>
##$TPNAME5= <>
##$TPNAME6= <>
##$TPNAME7= <>
##$TPOAL= (0..7)
0.5 0.5 0.5 0.5 0.5 0.5 0.5 0.5 
##$TPOFFS= (0..7)
0 0 0 0 0 0 0 0 
##$TUNHIN= 0
##$TUNHOUT= 0
##$TUNXOUT= 0
##$USERA1= <user>
##$USERA2= <user>
##$USERA3= <user>
##$USERA4= <user>
##$USERA5= <user>
##$V9= 5
##$VALIST= <valist>
##$VCLIST= <CCCCCCCCCCCCCCC>
##$VD= 0
##$VDLIST= <DDDDDDDDDDDDDDD>
##$VPLIST= <PPPPPPPPPPPPPPP>
##$VTLIST= <TTTTTTTTTTTTTTT>
##$WBST= 1024
##$WBSW= 4
##$XGAIN= (0..3)
0 0 0 0 
##$XL= 0
##$YL= 0
##$YMAX_a= 79779
##$YMIN_a= -96717
##$ZGOPTNS= <>
##$ZL1= 120
##$ZL2= 120
##$ZL3= 120
##$ZL4= 120
##$ABSF1= 10
##$ABSF2= 0
##$ABSG= 5
##$ABSL= 3
##$ALPHA= 0
##$AQORDER= 0
##$ASSFAC= 0
##$ASSFACI= 0
##$ASSFACX= 0
##$ASSWID= 0
##$AUNMP= <proc_1d>
##$AZFE= 0.1
##$AZFW= 0.1
##$BCFW= 1
##$BC_mod= 2
##$BYTORDP= 1
##$COROFFS= 0
##$CY= -3
##$DATMOD= 1
##$DC= 2
##$DFILT= <>
##$DTYPP= 0
##$F1P= 0
##$F2P= 0
##$FCOR= 0.5
##$FTSIZE= 0
##$FT_mod= 4
##$GAMMA= 1
##$GB= 0.15
##$INTBC= 1
##$INTSCL= 1
##$ISEN= 128
##$LB= 0.25
##$LEV0= 0
##$LPBIN= 0
##$MAXI= 10000
##$MC2= 0
##$MEAN= 0
##$ME_mod= 0
##$MI= 1.114404
##$NCOEF= 0
##$NC_proc= 0
##$NLEV= 6
##$NOISF1= 3.799351
##$NOISF2= 2.8
##$NSP= 1
##$NTH_PI= 0
##$NZP= 0
##$OFFSET= 14.38212
##$PC= 1
##$PHC0= -467.5108
##$PHC1= 9.992209
##$PH_mod= 1
##$PKNL= yes
##$PPARMOD= 0
##$PSCAL= 0
##$PSIGN= 0
##$REVERSE= no
##$SF= 200.129724274929
##$SI= 16384
##$SIGF1= 3
##$SIGF2= 2
##$SINO= 400
##$SIOLD= 16384
##$SREGLST= <1H.CDCl3>
##$SSB= 0
##$STSI= 0
##$STSR= 0
##$SW_p= 3205.1282051282
##$SYMM= 0
##$S_DEV= 0
##$TDeff= 0
##$TDoff= 0
##$TI= <>
##$TILT= no
##$TM1= 0
##$TM2= 0
##$TOPLEV= 0
##$USERP1= <user>
##$USERP2= <user>
##$USERP3= <user>
##$USERP4= <user>
##$USERP5= <user>
##$WDW= 1
##$XDIM= 8192
##$YMAX_p= 0
##$YMIN_p= 0
$$ End of Bruker specific parameters
$$ ---------------------------------
##NTUPLES= NMR FID
##VAR_NAME=  TIME,          FID/REAL,        FID/IMAG
##SYMBOL=    X,             R,               I
##VAR_TYPE=  INDEPENDENT,   DEPENDENT,       DEPENDENT
##VAR_FORM=  AFFN,          ASDF,            ASDF
##VAR_DIM=   8192,          8192,            8192
##UNITS=     SECONDS,       ARBITRARY UNITS, ARBITRARY UNITS
##FACTOR=    0.0002768,     1,               1
##FIRST=     0,             0,               0
##LAST=      2.2672688,     0,               0
##MIN=       0,             -96717,          0
##MAX=       2.2672688,     79779,           0
$$ Real data points
##PAGE= N=1
##DATA TABLE= (X++(R..R)), XYDATA
$$ [...]
1555G7J16o5M7m6k21l7p7J45M3k5M3r0j36L16j39m6M2J9K8K87m73J15K25k19L41
1580B70r9m38L40k03J93o5k89L05J73m81L35n5j86J20J03K77k06J24k69J03k45
1601a93L42j92K9J27j00k41M36o7l37M12m35lL18j61J66J62k03p3J60j63J43M5
1623A72l8j18r1K98o1l13K7J5m9K83q9k94L98l89K24J25j31J1P6JP5l0k77J96
1647B1pk84M37k32O3O8j48j74L03l89L91N5k61M20l15j02M02j37j35J11j09J38
1669A16L0j31p3M2L5M9n1J3j9k40N9L19q8q3J3j64L39j85j17L59r7k88L40j78
1693@l6K82k43J25j70j99K92Q9l33K79l92L45OP9j61K01j05J70o1k51L60k80O7
1716F4J25k23j74R9lJ31P8k99K70j28m5M1J19n9J65j54P5J97k51M4J21k10j7J85
$$ y = [77, 193, 128, 175, 129, -92, -129, -206, -61, -18, -43, 0, -90, -226, 90, -49, -95, -53, -34, -6, 281, -192, -77, 148, -71, 270, 171, -267, 73, -130, 63, -2, -291, 14, 187, -294, 41, -14, -200, -80, 23, 300, 94, 218, -51, 52, -193, 149, -43, -14, 113, 13, -228, 208, 141, -196, 216, -219, -222, 96, -65, 101, 263, 60, -13, 147, -16, 127, 172, 134, 16, -75, 223, 162, -151, -124, -109, -158, 125, 36, -258, 140, -249, -25, 100, -31, -20, 56, 57, 132, 102, -175, 21, 14, -270, 167, -65, -2, 66, -82, -256, 47, -342, 49, 104, -157, 263, -52, -154, 248, 111, -24, 87, -22, 116, 146, 15, -58, -16, 19, 68, 17, 30, 11, -229, -170, 149, 61, -22, -9, -173, 166, -19, -136, 223, 126, -162, 178, 0, -36, 246, 3, 128, -42, -241, 51, 140, -193, 86, -306, 39, 45, 124, -37, 164, 59, 229, 168, -83, 277, -3, 64, 189, -34, -208, -109, -112, 19, 97, -202, 68, -60, -105, -64, 55, -4, 161, 7, 82, 279, 28, 72, 193, -17, -34, 151]
1740A51j02J9k21J15J86k70L10k6j30L0j95L8M03k32l04M65l13K19J65k43j92
1761a27M1r3R8R7l3M9j14l4K73l52K50J40l38j36L94j93M51k57o9l2RJ5J89k25
1785Cj84L81l26N8m6k86K24K16j12K26j46P2J30n0K7J0l23J86n8pJ41k19J76R8
1809A91j44j18R1j32J9J26J5O8j51r5K20J8l8j9L2J2J56l11J17p6OQ8q1k45J95
1834e6O7KJ85k57L19j98m3J87j97l9k5k4N1L23k43p9N2j00PJ57k30P5N8m1J41
1859I2j92J62n1M1J5J42q0k81K88l70J64L1n8J78l21J59Q4k54J88J5r9L8k0r0
1883b19M32j55j97J92j43K84p8m2J83k39j36M3K78m19J48R6j66J10k9L5M4n4K0
1906a2K62l51K00J32k15j38J78k38K78j19J24k19M8N9J96l60J44O1m0n6j32K22
$$ y = [151, 49, 68, -153, -38, 148, -122, 188, 162, 32, 62, -133, -95, 308, 76, -228, 237, -76, 143, 308, 65, -127, -86, -179, -81, 16, -17, 32, -82, -116, 157, -195, 55, 195, -143, -279, 115, -78, 373, 116, 47, 15, 24, 39, 228, 3, -181, 200, -126, -68, -114, -400, -176, 40, -72, 154, 8, 80, 210, 160, 187, 197, -126, 60, 2, -5, 136, -83, 93, 191, 47, -71, 20, -112, -93, 33, 48, 116, -35, -130, 90, 108, 70, 51, 83, 95, 251, -60, 57, -19, -13, 75, -6, -251, -56, 11, 13, 198, -59, 260, 62, 19, 206, 9, -30, -55, -79, -28, 295, 52, -27, 25, -75, -68, 89, -141, -66, -8, -49, 92, -100, 62, 11, 52, 67, 209, 129, -152, 136, -234, -70, -39, -97, 81, -240, -81, 3, -251, -63, -48, -147, -109, -129, -219, 213, 58, -139, 53, -90, 194, 116, 74, 257, 18, -118, -75, 203, -216, -68, 28, -138, -28, -57, -22, 22, -32, -12, 250, -101, 99, 231, 16, -122, 56, -182, 96, -23, 101, -118, -70, -11, 185, -175, -31, 30, -10, -66, -198, 24]
1928B4j7k20L44j32Q9k77J43M6Q8P4j31J92l00n4J52j31j6J27k17K72N1k71K24
1951F0j72J58J48%j42K6l27K28M6m19M70p7l0rj58L67j70k36L49j97J9l9K85j65
1975A5M6j6k03L33j51%L8l5L6N4k99J19K7j28K42n0J27l5k32J10M2o9j34K92r7
2000C2J16j94o3Q9L6J41l9k94J31J40j10J53j62k24J21J8J01k7P0L1%k37L20k
2024A47j35r9J88q1mk93nN35j63l05K47n3nn5Q0J38l71L06m3R8k28L86k82j3K3
2049A3k4j42J53j70O1J72j42J13O3k41J67j5j03K33o5Qj19m6K27j69L4K17j22
2072A03j88K07q4N2o0p1L1O7k46J36n2J95J76m41K73J5k74J96j70J17K54k37R8
2095I7l2r2L3j58J67k65K88q9R4J93l46J87k07J57j76K92J19j99J4l1N2j22Q1
$$ y = [24, 7, -213, 131, -1, 88, -189, -46, 0, 88, 162, 31, 223, -77, -131, 21, -110, -126, 1, -216, 56, 107, -164, 60, -112, 46, 194, 194, 52, 78, -249, -21, 25, -394, 76, -1, -31, -40, -198, 169, -1, -237, 112, -85, -66, -105, 180, 15, 61, 45, -158, 175, 24, 24, 62, 27, 63, 117, -182, -63, -36, -164, 78, 28, 155, 120, -112, -2, 40, -29, -163, 129, 32, 148, -46, -109, -20, 16, 157, 118, -176, -45, 95, -15, 138, -24, -248, -127, -109, -8, -35, 35, 66, 66, -171, 149, 147, 12, -87, 101, 20, 16, -277, -282, 253, 90, -215, 32, -21, -26, -81, -1, 137, -234, 72, 29, 127, -101, 285, 3, -10, 13, -11, -153, 0, -170, -109, 63, -79, 34, 97, -144, 23, 8, -95, 138, 73, 81, -38, -84, 143, -26, 8, 225, 103, -85, 122, 38, 90, 30, -41, -10, 57, -189, -53, -105, 90, 266, -175, 98, 113, -161, 35, -135, -18, 236, -1, 97, 65, -27, 6, -152, 15, -250, 38, -51, 43, 236, -110, 77, -130, 27, -149, 143, 262, 63, 77, 46, 98, -24, 57]
2118E7j53P8J08q0n9K41j04k29K55k86J35Q2k70K14P5k86o4L17n0J1j21K74j22
2141B3k35J41n5J33j25N2l1J22r9J04M9J48m40L99l15J91J4r8J45R3l09K39p4
2164G2j64J63r6M7M1j75P9R4j02K17j94O7o3O1R3r7J22k0n6j40M5O0j58k58M54
2189I2j82J86p1j89J87n9rM7J49k17P2j74L99l04L17j09k54M0k1K28p7J05k95
2212a39Q6K7j11K50k08J93k25m9J68K38k66J08Q8j23m9p2R2j0j70J02L25j21o9
2235F5j01p5O8QL7o6Q8k69L76j29LQ6j78L6Q0L1N1j96j15J80p6P8r4J92L8m5n8
2262A5J04j38j93J96K06N8j68O9p5L0k6k2j19M9K77j93j05L3r3NJ93j43qJ82k88
2287a54P6J43j32J23J54k75L5N7k7p7j79J79J37J74k52K33j65O0j31j52K47J04
$$ y = [57, -96, -18, 90, 10, -49, 192, 88, -141, 114, -172, -37, 45, -225, -11, 64, -222, -286, 31, -19, -8, -129, 145, 23, -212, -71, -126, 7, -118, -66, -97, 25, -74, 30, 79, 227, -213, 186, -129, 62, 76, -22, 123, 216, -93, 146, 72, -92, 71, -25, 22, 63, -112, -33, 61, -41, 176, -18, 49, -14, 47, 140, 43, 165, 145, 89, -51, -6, 54, -104, -362, 92, -90, 96, 25, -164, 23, -36, -45, 2, 151, -66, 6, -168, 231, -73, 244, 135, -119, -79, -100, 128, 51, 156, -139, -53, -26, -137, 113, -95, 98, -127, -176, -8, 230, -36, 72, 160, 37, -12, -84, 8, -2, -172, -70, 255, 134, 65, -36, -111, -43, -35, 2, -64, 24, -245, 131, 2, 5, 91, -87, -51, 29, 60, 111, -85, -200, -20, -96, -18, -112, 80, 118, 73, 15, 119, -19, -212, -16, 190, 248, 80, 149, 74, 104, 78, 56, -63, -14, 263, 70, -35, -2, -95, -90, 103, -40, -48, 134, -154, -78, 65, -67, 56, 210, -65, -30, 27, 0, -77, -256, -77, 60, 234, -18, 215, 50, 110, -21, -173, 74, 178]
2309A78j41K2K1j40Oq0K44q9j56J29O5j11K5k12J88J61j58N0Nr1m6K25r3k09J03
2334a04J27J08j36j4J65k01lJ06L1P4m1j20P3qj0Oj08J4Q0R6k92O0J08J24j65
2359c0P9L2L4l15J96k58P5J86k71K19J73L7m2j12j78J01J39j05o9RK14k84J75
2382Eo1K04j5lk92J39K02k57j2P9J76j28lL5j88K07j53J52n8R0j07o8N6j81K00
2407A9J3j49Q8O6M0L0j10Q8m0n8j33J81M6J4l9K12l11J33N7J55m80J23K50r4j16
2432a5K6Q2k4P8l31O3J96k26J22R9k57J46L4Q9kj77L45j2j45L9l43L31j86J50
2456H2k81M2O4Q6m2J13j13R0j12Q0J92k48k02P0K74p2q6k0Lj5J82j13J85m40L02
2481B1lMm0N6o7L7k32N8K36k17L55l17N8J99j12L8J7j46p3O9R1n7R2o0nNO7j88
$$ y = [178, 37, 59, 80, -60, -54, -134, 110, 21, -135, -6, 59, -52, -27, -239, -51, 110, -48, 2, 7, -84, -130, 95, 2, -207, -104, 23, 131, -5, -19, 146, -55, -58, 48, 79, 153, 112, -8, 65, 57, 47, 53, -55, -41, 39, 135, -157, -97, 11, 135, -30, 49, 81, 115, -200, -4, -262, -187, -1, -272, -53, 120, 157, 115, 3, -175, -74, 65, -40, -109, -100, 114, -170, 5, -56, 148, 133, 130, -162, -23, 179, -78, -90, -11, 165, 37, 34, 69, -119, 88, -65, 87, 29, 119, 12, -56, 0, -181, 19, 32, -117, -29, 37, 77, 107, -3, 85, 45, -13, -146, 35, 81, 95, 56, 268, -43, 90, 147, 302, -178, -55, 195, 101, -15, 11, 93, 69, 147, -184, -121, 75, -151, -29, 70, -187, -41, -7, 82, 80, -97, 248, 236, 91, 130, -213, 118, -68, 82, -199, -157, -93, -7, -49, 64, -49, 41, -71, 9, 201, -47, -249, -179, 95, 23, -63, -83, -80, -95, 87, -26, 159, -281, 21, 18, 22, -18, 38, -29, 8, -224, -166, 70, -147, 208, -109, -51, 148, 36, 74, 91, -55, -128, -59, 32, -25, 67, 7, 2, 7, 74, -114]
2509a14J94p0O7q5J6K73j95N4k54J25O3k24K06P8k80J03J58N6k85J58j23q4L92
2532B29l10m7p6J59J55j94m2Q6j19M1L1N9m4J32r0J03j11j72K04j24L1J30J9m0
2556A0k4j22L00k52l0J56k0j57J67J40j37L6N1q1j86K20K48k97k10O4j9J06J41
2579A04r6O4Pj03QMJ23j33M4K2j83j81J61P3R3l9jj42J64R7j87J32K63l31k2k13
2605b72L81j85J18N3R4k92K46j62k45L84p8r1J32n1KJ14k40j8p2L12j19J57k03
2628c5l2J66j79m2K26j98J04k8R6P2o0k0N5qmj53Q4j91J97l5k4r0Q7K93m57J7
2654a59K21J5n9j25K6J69p0n1j54J35m5j06K38r5Pj06K51o8L7L9j68K21k67K04
2678I0Nk37J81j22J64J7k59J41j26J55K4R0k18n8J79J4J53k62j20RJ88r0p7kK19
$$ y = [-114, 80, 10, 77, -8, 8, 281, 86, 140, -114, 11, 74, -150, 56, 134, -146, -43, 115, 171, -114, 44, -79, -163, 229, -81, -128, -204, -45, 110, -84, -126, -40, -159, -118, -87, -28, -72, 60, -30, 73, -38, -210, -6, -130, -99, 31, 50, 10, -14, -136, 164, -88, -118, 38, 18, -139, 28, 168, 31, 67, 118, 37, -149, 71, 319, 22, -188, -124, -143, -37, 104, 8, 72, 79, -24, -16, -12, 111, -22, 22, 44, -139, -320, -159, -86, 7, -32, -33, -175, -11, 86, -101, 31, 294, -37, -59, -272, 109, -76, 42, 95, 189, -103, 143, -19, -264, 120, 42, -49, 83, 32, 34, 148, -92, -110, -182, 130, 11, 168, -35, -67, 99, -80, -122, 104, -94, 10, -18, 78, 150, 90, 70, 125, 117, 113, -40, 44, -147, 50, 15, -9, -99, -12, 281, -176, -159, 62, 77, 18, -107, -81, 88, 18, -33, -187, -52, -97, -203, 35, -60, -53, -159, 92, 24, 61, 100, -68, 153, -114, 90, 95, -142, 39, -83, 81, 98, -161, -20, -146, 9, 33, 123, -95, -153, 26, 40, 193, -69, -189, -180, 8, -82, -159, -161, 58]
2703E8j25J9J26j11OK60j0j81j72L93j88Q6Kk13O8p1j82L39k08NK46k84k8J32
2727c3R0l26J50K82j14l6J26l2j51J21j14J58k23R5pJ27j78K69j89J0m9j09J73
2750D0O7L9k09K25k00K0J28j1k84L94l90K50j58P5M6k28K11j81N8J17p0r4Q8J22
2774E5O3n4m1j9Q5P1k12J73n9o5O5r9l3K51l48J80K54l81K29O2o5k89J77j05L92
2799B87m38NK71p4rp5j42O2O7J09o0n9m3M8J5O4n9o1J43J23k27J58k24K10j13
2824b2Lp5L2JJ7j17J52R0j05K93l35J02n9K44k11R4j89p4L24k51K29p7l5j9j8
2849fK25j55j65O9q7K20Lj39kq4j23L20j62J10R2P1j0j52J46r4Mj91L42l26M8
2874d6K1j11J51r9l8K6L3j26P0J12m3J03%j93K34j06Q7l3p0L6L8k3j18j6M6J57
$$ y = [58, -67, -48, 78, -33, -27, 233, 223, 42, -130, 263, 75, 161, 163, -50, 18, -53, -235, 104, -104, -99, 147, -137, -165, -33, 57, -269, -119, 163, 49, 13, 139, 107, -44, 77, -37, 121, -102, -7, -14, 113, -65, 204, 15, 25, -24, -133, 40, 107, 146, -63, 162, -38, -18, 110, 99, -185, 209, -181, 69, -89, -14, 32, -196, 15, -166, -108, 9, -61, -155, -67, 55, 118, 64, 23, 4, 89, 160, -52, 121, 62, -3, 62, -37, -70, 181, -167, 13, 267, -114, 115, 177, 112, -177, 0, -105, 287, -151, -146, 125, 51, 42, -33, -175, -113, -46, 63, 3, -56, -99, -51, -36, 28, -31, -92, 51, 174, -53, 105, -119, 91, -22, -19, -94, -62, -61, -44, -161, -9, 81, -24, 269, -66, 36, -23, 221, 10, 104, -85, -159, 165, -86, 143, 66, 31, 12, -6, 219, 64, -101, -32, -119, 101, 104, -35, -37, -121, -244, 76, -86, 24, 116, 187, 177, 25, 171, 77, 81, -110, 232, -94, -46, -25, -136, 15, -84, -122, -96, -63, -189, -119, -7, -50, 53, 53, -140, 94, -12, 75, 42, -28, 8, 46, 23, -95, -111, -65, 92]
2900I2j02J01j71p4J57J39j61m4K0j4O7j05O1k3j28K07jP3j15j63K33M7j43P0
2924B3J0j72J29J50j18K7J42k32j07J27K4K94l34P6L7j2Oj57J27k3n6n2N1j30
2948a70K57j70K8M9r3O9j20J52J03j28O6J43j20q4pL7L8j14N6P5l16M7K44p3K2
2973ij1MK1m1Jn5j17K90k05O7Q2o9L4n7R5j77Q5N2r1J79j82Q6O3Q0l08L13l03
3000a73J39J67qk02Q2J39k80K27j65J4J19m2l5J30k49K02K70m27J88l8n1o0L2
3023b1J40j20J25j28k9jq8K89J0k72N3k34Q3R5K32k04N3kK05l56K38P0m2J13k03
3048FJ21n9j28j66R3K81m00J6K15n3m4K33J1q3op7J78k05L7L0j33K33P9j45m9
3073a5o5O9J36j52l8K29k08k7k2N7o6Q5L09k68J82l2k68J72K2k68K75J69l55J18
$$ y = [92, -10, 91, -80, -154, 3, 142, -19, -63, -43, -57, 10, -95, -34, -57, -185, 22, 21, 94, -21, -184, 49, 96, -47, 23, 33, -139, -10, 140, 22, 49, 191, -41, -148, -21, 3, 297, -37, 39, 76, 64, 70, -87, 40, 17, -39, -91, -40, -170, 87, -83, -55, -6, -99, -30, -150, 2, 105, -23, 43, 186, 66, -18, -25, 12, 50, -64, -8, 67, -249, -202, 42, -31, -9, -20, -16, 5, -36, -35, -90, -207, 83, -122, -55, 27, -42, -8, -65, 30, -147, -62, -10, -101, 78, -104, -18, 45, 125, -183, 130, -173, -34, 133, 125, -77, 5, 144, -136, 91, -74, -60, 59, 17, -18, 112, -137, 65, 335, -92, 96, 58, 7, -53, -21, 119, -1, 124, -4, -33, -34, -122, 167, 177, -95, -42, -276, -193, -98, 134, -70, -17, -19, 186, -170, 68, 138, 96, 209, 6, 127, 68, -60, -226, -133, 148, -252, -236, -21, -74, -118, 115, 126, 43, 37, -40, 138, -67, -30, 0, -133, 100, 179, 34, -15, -80, -11, 125, -27, -65, 164, -44, -71, -93, -36, -102, -17, 292, 24, 206, 174, -94, 78, 100, -168, 107, 276, -79, 39]
3097C9r2O6m1O4n5r5J55J1j57K20k73K34L2j14M2J31l82J70P8J73k48N5R5j81
3121g3P1J10n8p1q1m1K35p7P2j09K11j19j21K76j73j13J63m5k73L5K03r8L8j35
3145a73L69k39J32k23J58J91J6l79l0K83L1j81J05J37k28n6J54j2k84J37j10K81
3167G9j19K2kj17J6j2P0K13r2j24J8L82l62K4L8j94J27o8k1L2J04P4j33J65k48
3192a28K30j63J44J44l11J95j54J20j34R8J79K2l27K11k81J14L6o8n5R0pN7k14
3215b02K58k38L30j67L7N4K8j74O2J24j36J09o1N6j61J43k07K1ll4J83K2k15J11
3239f0L22j56k70K70N0kj32O5P0l71K68k9k3P3o8Q6pn2L9j02n9K30l14J63r0o0
3265a59J32K1L87k65o0k31J52M7L39k71j56J5J51n9q1J14j24m0K06k81j5J35k
$$ y = [39, -53, 13, -28, 36, -19, -114, 41, 52, -105, 115, -158, 76, 108, -6, 36, 167, -215, -45, 33, 206, -42, 13, 108, -73, -2, 108, 50, -21, -102, -143, 92, 15, 87, -22, 189, 70, -51, 225, 52, -61, 102, 57, -216, -181, 22, -76, -38, -173, 196, -43, 89, -134, 24, 215, 231, -148, -178, 105, 136, -45, 60, 197, -31, -87, 67, 55, -229, -92, -202, 79, -40, -18, -20, -137, -121, -133, -63, 150, 58, -66, -48, 334, -28, -4, 34, -160, -33, -101, -122, -90, 14, 88, -45, 120, -128, 102, -61, 83, 227, -84, 111, -43, 77, -57, 41, 220, 242, -85, 126, -155, -41, -5, -73, -128, -38, -45, 12, -202, 56, -182, 148, -19, 18, 72, 100, -74, -12, 112, -24, 85, 24, 80, -81, 62, -145, -124, -127, -161, 22, 44, -171, -60, 262, 106, -164, 106, 156, 154, 22, 87, 157, -214, 54, 25, 2, 75, 7, 93, 86, 34, 73, -29, -88, 142, -172, -9, -99, -159, -27, -6, 381, 116, 56, -175, -23, 24, 363, 92, -64, -49, 102, 43, -38, 76, -48, -88, 118, -163, -178, -43, -45]
3288d5L4j38J34j29Q6j00R9J00K0K9r5m4R1j21K5J46k2k48M8J33j49K85k27Q7
3312aJ4Mo6K17l02K75k6j45j2j36J55o2p0J70K27j31k54J89r8J79j42J28j67n7
3336a11J53L2Q8k84J83O5j48Q8j46n8M4m0p5J45m1L1m9R3K3M4q1m3J01m8j9K15
3362A62q7j36j72K53j70P3k15L00L6Q2j17J9j29P8J49j78J07J45l2l2Q9p8j78
3385c1k40M26o4K0j63J5Q7m32L09J52n5L0j9k7K06k92J68K2q2m8p1J10r2O9J66
3410A64K0j78M4k66K50j26Q9J12k36j13M61l14q8J83J67k80J13J06k02L0R6j78
3432a46mj76J87J43k5k2J53j21p6K77j64j5l8Q3%p7o7m4K05j71l2R2l9K01k78
3457a54J02J28p2k30P0J40j00N4o1J05m8Q7O2k5l52O6J26J48j09k01L08k5J66
$$ y = [-45, -11, -149, -15, -144, -58, -158, -59, 41, 61, 90, -5, -49, 42, -79, -54, 92, 70, -178, -130, 3, -146, 139, -88, -1, 13, 17, -49, 168, -134, 141, 115, -30, -42, -178, -23, -85, -155, 15, 242, 111, -143, 46, -52, 127, -15, 113, -54, -111, 42, 74, 162, -122, 61, 126, -22, 66, -80, -138, -94, -134, -209, -64, -105, -74, -123, -30, -7, 37, -44, -87, 14, -34, -53, 162, 75, -61, -233, 20, -150, -77, -292, 8, 44, 126, 9, 28, -101, -23, 126, -52, 55, 200, 168, 136, 225, 147, -31, -271, 155, 91, 111, -52, -37, 50, -382, -73, 79, 24, 54, 35, 8, 214, -78, 90, 112, 30, -18, -89, 21, -71, -2, 164, 184, 6, 50, -216, 34, -92, -3, 109, -127, -240, 221, -93, -181, 2, 169, -111, 2, 108, -94, -64, 32, -146, -150, -326, -139, 4, -21, -43, 110, -11, -87, 190, 26, 11, -27, 56, 56, -21, -88, -132, 73, -98, -130, -38, -77, 124, -154, -52, 76, 4, -226, -156, -16, -116, -62, -123, -18, -66, 21, 83, 58, -294, -228, -102, 46, -63, -264, 44, 19, 185]
3480A85r8j17j48O5J49m8J80m5j8r5p5J47j7oj47J47p7M8J7j84J75j55o8K62q4
3505gM5P1j17J5j19L88k33J23j85L2l7P6j60K03j6j02J61k36J41r9j35J20k7j77
3529b75Q0L02j40J75J5k09J51o4K32k09r6p1J23J2r4L13l40N6J68p7O6L7j24j9
3553A2m5K01l14P3J85k9M7j20kK00j61j85K31j04Rp6m5J39q2O3k35J84k09N8J53
3578e2K17J8k55r2Q4J02k8k70M22n2j12j55J02K23k52j33K23Pm8L4l4M3K37k05
3602B4RQ2j18J52k04J33n6o7l7J22j95K22j38o3KJ73K16l77K54r8R1r2k9K4j25
3627i5Q4r%J35j32o8M0J0m8j0P6l0K0j38j8K42q6M0p7N4rJ73j96r7L12j35p1M2
3655Im8J5m8N8r7K9K38%k90K47j53M5J5p7J52M7j48J32j42J41k80J91J21Ok75
$$ y = [185, 87, -30, -178, -113, 36, -12, 168, 123, 105, 10, -65, 82, 65, 59, -88, 59, -18, 30, 47, -137, 38, -117, -185, 77, -7, 38, 109, -8, 7, -112, 276, 43, 166, -19, 13, -24, 52, -108, 95, 79, -23, 138, -98, 43, -56, -191, -71, -98, -275, -195, 107, -33, 142, 157, -52, 99, 35, 267, 58, -38, -109, 14, 26, -68, 245, -95, -39, 129, 52, 118, 155, 31, 12, -33, 168, -146, -73, 112, 83, 130, 10, 8, 208, 47, -138, 93, -11, -2, -78, -123, 16, -66, -3, -238, -54, -263, -205, -52, 165, 183, -72, -164, -80, 22, -6, -276, 146, 94, -18, -173, -71, 152, -100, -233, -10, -3, -51, -17, -51, -8, 229, 24, 33, 115, -3, 149, -55, 78, 22, -45, -82, 40, -155, 67, -71, -134, -132, 41, 257, -120, 134, 36, 127, 35, 6, 30, -95, -11, -20, -20, 115, -17, -85, -45, -35, -83, -93, -17, -47, -27, -165, -183, 59, -27, 13, -64, -10, -19, 154, -42, -139, 173, 38, -33, 9, -39, -24, -72, -14, -111, -82, 156, 156, -134, 113, -40, 5, 20, -57, 95, 142, -6, 126, -16, 125, -155, 36, 157, 163, -112]
3680a12K0K31p8k0K2j00j7l18K48j27J05K61n2j01P0r3Q8r6R8N6j35K26k52J30
3704E4J1k02K71L0k98N1K08j7M3k15l9K47j50r0J40Q9j26P2j73j74L29mN7k16
3728a02o9K92j54Q9J35r6P8j90l1J33lN2p8j76L37p0k88J89k80K49q8q4K76j67
3752d6j06J0K12p6qR9R8j53K01l68K71l12R2N0q6J57J3O2l6k86K39k5J04j53J87
3777A40k43j1OK29M8j40K8K4J25k0k5j34q5q3P5O7k14J59J57j62m5J20j83K69
3801A02n5j04L87k13k88J16N1J1p0J77n7k84J05J74j2n7j84J02k0R9j35K26N0
3824A21k66K91j04K75m64K80j04O2L1l41O2J10J6P7q9R0k47J05m7O6J52o0nqJ82
3849A85k87k9J72L8m8P9K7l87J44j4N8Q1j25KJ33j27J78jM4k54J93O4M0j52m0
$$ y = [-112, -92, 139, 61, 41, 63, -37, -54, -372, -124, -251, -146, 115, 63, -38, 32, -61, 27, -69, 29, 85, -50, 176, -76, 54, 65, -137, 134, 164, -134, -83, 125, 108, 151, -64, -103, 144, -6, -96, 44, 133, 7, 79, -94, -268, 61, 57, 114, -102, -171, 121, -33, 56, 191, 95, 173, -17, -48, 85, 82, 134, 56, -120, 217, 147, -141, 48, -232, 17, -71, -155, 121, -46, -152, -142, 70, -6, -14, 85, 183, 30, 231, -137, 134, -178, -86, -36, -122, 35, 48, 110, 74, -212, 27, 2, 106, -47, 140, -103, -114, -108, 121, 169, 29, 57, 81, 206, 186, 161, 27, -58, -141, -66, 1, -213, -54, 103, -59, -104, 16, -167, 102, 47, -57, 330, 117, -171, -55, -4, 7, -63, 114, 57, -227, -122, 52, 40, -17, -201, -99, -119, -20, -155, 71, 121, -145, 146, 42, 317, -147, 133, 29, 91, 122, -219, -157, -47, -31, 46, -43, 47, -200, -95, -142, -76, 76, 16, 11, 3, 185, -102, -131, 41, 79, 31, 110, 137, -250, -106, -120, -62, 19, -106, -104, 29, -98, 80, 79, 123, -131, 62, 126, 166, 14, -26]
3874b6K01l36K03j52K04q4ON0q1M2m5l0K87l05J17j10n1J11kJM8r6J20m4j42J89
3900G5j24r4J67jJ35k58m3L9qJ14K9r0J64m8L2J17l38K49j29m9J46J33j16j1k4
3925F7Jm3j57K68l54K55j30K13j2l46P7K62k9k8p2k9l6K20j55q5J59O5k11RJ45
3950E4%M4L3n7j26m8J29j8j46P5m7J43j56L23l91L63l12KK18o4j08P9o0P9J07
3975A16k39Q9J00k87L59k38r6K45O5j51j39J82J8O1p1Kj75MrJ54j8j07Q6M4J52
4000A47k0J58l43q1J43k04L81j77O1k10R6P0J21k24J6n4K29j6j84K43o0j77k20
4023c05L24K64l91P3N3l6Q8N3j74j36P1J93n5j23J85j38r4J96l6m9K26j11j69
4046i1l9k1N0k2q9K11o6l6J29j82J74O9j36K42j88j19J91k10O4R3J84j57J8n9
$$ y = [-26, 175, -161, 42, -110, 94, 10, 16, 66, -15, 27, -18, -48, 239, -66, 51, -59, -110, 1, -1, 0, 48, -48, 72, 28, -114, 75, -49, -143, 24, 23, 158, -100, -143, -104, -112, 2, 31, -59, 105, 57, 89, 206, -132, 117, -12, -61, 85, 218, 102, 91, 67, 68, 25, -132, 136, -218, 37, -93, 120, 108, -238, -161, 101, 72, 44, -28, -57, -93, 127, -28, -113, 46, 111, -100, -91, 54, 54, 98, 131, 74, -52, -100, 29, 11, -135, -60, -107, 36, -120, 203, -188, 175, -137, -135, 83, 19, -89, -10, -70, 9, 116, -123, -34, 66, -221, 138, -100, -196, 49, 114, -37, -176, 6, 24, 85, 14, 16, -159, -155, -164, -10, -28, -135, -49, -5, 147, 127, 285, -58, -139, 4, -200, 181, 4, 65, -145, -49, 21, 142, -82, -66, -120, 109, 93, -91, 152, 92, -85, -305, 19, 283, -108, -35, 18, -18, 70, 123, -51, -187, -116, 77, 22, -101, 84, -54, -148, 48, 12, -37, 189, 78, -91, -130, -151, -101, -123, -212, -1, -67, -103, 26, -156, 18, 87, -49, 193, 5, -114, 77, -133, -69, 24, 208, 51, 69, 10]
4070A0M8l2L8J5j50J0J34k2J56n10J71J31k5J41k63J54j9l8k5J15OQ3j31O2Kl2
4096B9j16J61J4j67m8o1K13K80j86K09l65J09NJ48l88K12N4j46J65k04nM0%J3
4120c4j16K41n5m3J65l75K17j5p7J5J30j77K15o8q1j06O0M26k82N1J46o6j02m7
4144B2k6l0P6n3j27j8O6J54M3j75M5M2n5j03K28k95K67M6m4J41m5p9j61J32j4
4169C7q7k8J8J56j90j48K86j0j9Jr6R1J71j59j35J56j3j30J31j34K41l09O0K46
4193A36K5j85j73M24k39K9j40n6K06Q6J6m6r2k7j45K85p9J19l9j39j52K76J2k15
4217a13K06j92q5n2J98k25J62j43M30j48L2J20r1n4KJ90l14L0lm7N4k5o4J66J56
4242A90k12K71m07K06o5j3j37L36j18N5j10p6O6n4L6M7J22k04K26j4k57L8Q5P6
$$ y = [10, 58, 26, 64, 79, -71, -61, 73, 51, 207, -303, -132, -1, -26, 115, -148, 6, -13, -51, -76, 39, 45, 128, -3, 59, 61, 29, -87, 74, 88, -79, -127, -188, 25, 305, 119, 328, -37, 72, 77, 225, -163, 49, 103, -43, 122, -82, -87, -47, -47, -34, -150, 91, 36, -7, 158, -217, 0, -15, -92, -77, 53, -124, 91, 23, -58, -164, -104, 322, 40, 91, 237, 171, 69, 22, -4, -34, 42, -11, -138, -156, -90, 64, 107, -68, -23, 19, -36, -139, 89, -206, 61, 107, 63, 204, 159, 80, -81, 51, 37, -50, -78, -60, 96, -94, -242, 44, 34, 15, 16, -80, 11, 182, 23, -112, 44, 31, -99, 32, -102, 139, -170, -110, 136, 161, -24, -197, 227, -12, 17, -123, -179, 27, 113, 129, 83, -9, -36, -181, 104, 25, 144, 105, -34, -186, 90, 102, -113, 93, -99, -184, -236, -38, -263, -101, -244, 186, 38, 70, 190, 99, 45, 47, 237, -77, -47, -50, -97, -43, -68, -132, 34, 190, -22, 249, -158, 48, -17, -30, -167, 169, 51, 106, -4, -80, -14, -68, -32, 15, 137, -67, 159, 145, -112, -74, 11, 87]
4266H7O8k91K41j42J49j40J57k20k8K09l46K84o9l2J92k23q4K5K04q7N1J17k09
4289h7J00L0N7j82J10j03O2q9J67j1j29Q6K65k00j78o0P6l7J32j02K04k15k47
4312c51L66j46J39J20j32J81p0k1P1O9l14j25R9K82l48J72K54k53O7j2m5o5j8
4335h0m1R3N0r6L4M3k03J20k6m1R4K09n2o5J7M8k86J90P7j89M2J67k30l0M60k27
4361G8J08j8k34J15J5q0M8J00k33K27j13J03J8j35l2m7N9O7j49M5K84o7K06l55
4385A0N8j83O9O2N1o9j51O3K42j76j40QK30j18J2jQ6j59J04j40j05L74l24L04
4409A07j80j7M9kJ39l04J11J09P2r4K30l9j31j34r2J23l1j6P7P3l10L09M1j31
4433d1K1n8N7%K5P7m6J36j99Q4k47K45j43L6K1m0P7R8k2p3j27L65l64K68l77J20
$$ y = [87, 155, -136, 105, -37, 112, -28, 129, -91, -119, 90, -256, 28, -41, -73, 119, -104, -188, -163, 41, -46, 5, 122, -87, 13, 43, 100, -82, 28, -75, -13, -102, 65, 54, -75, 11, 276, 76, -102, -162, -86, -123, 9, -93, 111, -104, -351, 15, -131, 8, 128, -4, 177, 107, 86, 157, 226, -88, -213, -114, 168, -180, -8, 246, -7, 60, 48, 3, -62, -80, -121, -28, 22, -74, -40, 3, -200, -80, -106, -147, -53, 156, 104, 39, 56, 104, -182, 8, 85, -104, -62, 105, -125, -155, 305, 78, 186, 168, -66, 49, 64, -16, 32, 132, -101, 126, 13, 116, 134, -1, -33, -80, -21, 46, -103, -58, 226, 159, 365, 10, 68, -115, -46, 16, 67, -2, -153, -90, 152, -24, -164, -156, 74, -44, -32, -33, 53, -106, -2, -142, -247, 127, -197, 107, -73, -90, -41, -43, 96, -208, -97, 12, 84, -10, 220, 181, 50, -84, -176, -53, -84, -100, -23, 50, -260, 49, 90, -41, -20, -78, -21, -21, 4, 81, 35, 171, -28, 56, -191, 54, -89, -53, -32, -72, 5, 103, 81, 8, -119, 246, -118, 150, -227, -107]
4459a07J52j08Q2J4mp5N2r5K5J32m8j50k9K78j28m7o4K60j30l6n4J8L60k81j11
4484i4m7K76k02n7J18J40J41k33Pp7O4J52k42J62j09Q3l6j2r1l9R4r4L65l42j8
4509i1J45J78l17J72k35j4L23q5J57m04M11j62l39K89j51J26K23j60j03P0k07
4530a74J60J05k28N5m7L6K0O0O8o5K0J09K12k55%j71K87j55m8N5l27J86j27K02
4554b2m1N8J86l91K85j31J79o5Q0j17r7j2K44j04m5J65j77J8M2J45n4j15Q7k63
4578a45K02r7N0r7M3N7N1j21K1R9j97oK35o1j62J31r9J5K08j19j00l1oK71m6j06
4604a0J04q5j8OR9j37K09q6k16J64j6K2M6k21K08j45R7o8J94o2m0j28j02J62m3
4629f6J2Pj1l9J98j74O4j01J62Q7j8j44O1N0J07l15R8J93k07J31j01j17R4r8J60
$$ y = [-107, 45, -63, 19, 33, 29, -46, 6, -89, -64, 68, 20, -130, -159, 119, -9, -56, -120, 140, 10, -26, -80, -62, 298, 17, -94, -141, 135, -67, -124, -6, 134, 275, 42, 49, -28, 36, 188, -54, 108, -1, 82, 46, 34, -57, -96, -2, -96, 269, -73, -91, 54, 232, -85, 87, -148, -162, 161, 76, 233, -171, 240, 78, -261, 28, -123, 3, 226, 66, -37, 33, -174, -14, 91, -137, -82, -129, -93, -73, -13, 55, -10, 10, 119, 331, 76, 76, -95, 192, 37, -11, 44, -283, -97, -224, -22, -63, -5, 181, -210, 75, -56, 123, 58, 138, 21, -76, -88, 156, 52, 7, 172, -5, 13, 55, 200, 146, 31, 118, -145, 57, -40, 10, -87, -44, 13, 64, -57, -36, 63, -134, -140, 95, 34, -128, 3, -96, -81, 127, 8, -92, -123, -129, 142, 96, -10, 94, 9, -9, -3, 96, -41, 168, 82, -134, 30, 14, 36, 82, -139, 69, -76, 21, -47, 147, 85, 45, -83, -185, -23, -66, -54, -47, -58, -97, 101, -73, -9, -110, 52, 139, 121, -23, 38, 88, 195, -120, -22, 171, -36, 95, -6, -123, -29, -127, 33]
4654C3q6q2K00k22Q8p4K60k36K16j28J05l10J58J1N0J94k94Q6J35j32Q4p2L0N5
4678F9k04J24k01K57n9p4L68rj81k3j96K10q5N4l0N1j14K76k51J68np7j04r1J03
4703b4R7Nk05J97k5k0L4P1j40J40n1j59J47k3k17P4L8Q1q6R7J42k05m1q8Q0K2
4729e9J1L8k35J01m6J85j6q9J78j01Q0k02J62P4J5k58K80k9k2r7n1m1p3K00n9
4754e4Kp0J28k88K71Q5k0q8r2J58K2m3j15L90n9N9l22J5P2l01J81J78j42Q3r8
4779d8O4J7K43l54K10k03r1L05l3n8j24mK41Rm7k34J69k75J25J66J0R3j79N0P4
4804A26jJ38k34j28J33k2K1l3O0k56J69k82J38J15J95o2j16m5l7O2J42j08O2%
4828C7r6J25j8K7k6mMO7j50M8j04K24j68J89l17K35O3m7l36J96P0j18q7L57m9
$$ y = [33, -53, -135, 65, -157, -69, -143, 117, -119, 97, -31, 74, -236, -78, -67, -17, 177, -117, -31, 104, -28, 56, -16, 14, 69, -135, -11, -212, 45, -14, -88, 280, 271, 90, 67, -129, 81, -4, 50, 20, 71, -43, 233, -18, 150, 145, 68, -36, -127, -24, 73, 78, -127, 70, 45, 25, 59, 130, -10, 130, 79, -80, 67, 44, -173, -99, -61, 20, -66, 31, 173, -32, -73, -161, -81, -59, -48, -10, -245, -144, -190, -5, -21, -110, 68, -33, 47, -155, 7, 81, 96, -162, 118, 89, 67, -30, -81, -122, -195, 5, -54, -52, -122, 6, -282, -11, 74, 54, -34, -126, 32, 54, 11, -104, 286, 227, 286, -36, -21, 51, -250, -69, 109, -33, 50, -48, 16, 33, 276, -78, 132, -71, -162, 143, 110, 52, -72, -76, 165, 174, 127, -107, 62, -213, -88, 78, 88, 181, 2, 52, 126, 125, 263, 29, -99, 34, 12, 33, 0, 60, -196, -27, -309, -171, -56, 139, 77, -39, -84, -121, -59, 83, -25, 37, 37, -59, 66, 48, 75, 49, 45, 49, 116, -34, 14, -90, 134, -34, 155, -162, 73, 136, 89, -247, -51, 19, -99, -186, 171, 122]
4853A22l53M43l74J82r8Q4k30K24q2j39R1K34j18j12J29j20K5R0j35k23L47q1
4875i4J1K25k14K2K56r8j02l3P0m9J45K9j14k35K56l2Mj47Q8k5K3J51k22k82K94
4900g3j06K40n4K4O6j69q6l2K21Kq4k7P4J66j12o8J81k02L5Q4j4k17K93j25J23
4925A40l69L14j63l7J13k3j3jJ44k15J56o7Q1q0pl7J42K0k0q0k00K34m0j05k1
4950a34K26j06q3o9P7K97j89L7P2j60L9J38l6j43j08K14J37j48q6N3p7L0k7N9
4974A3j33K53q7q9n9K32l7k25l3J49j18K80J3j60o4oR9j84Q0J22j45L5J63j34
4998c5j33J20J50j33Q6R4j26N9L4l8k31M04k98J27J61n5j14j68J91k39L21j76
5020AJ57o9N8Q8k56J22j13n5K29k46j28K47j09J88o9Kk69J22K75k43j43J68M0
$$ y = [122, -231, 212, -162, 20, -78, 6, -224, 0, -82, -221, -130, 104, -14, -126, 3, -117, -92, -2, -137, -360, -13, -94, -83, 142, -72, -50, 206, 108, 6, -27, 43, -6, 139, 168, 54, -181, 75, 43, 47, -100, -12, -37, -14, 137, -85, -367, -73, -179, 61, 7, 31, 97, -72, -158, -190, 31, 33, -51, -78, -4, 162, 50, -18, 163, -39, -4, 80, 66, -151, 142, 17, 140, -229, 85, -78, -115, -2, -25, -38, -39, 105, -110, 46, -21, 60, -20, -27, -64, 78, 98, 78, -2, -202, 32, -8, -113, -134, 92, -14, -97, -166, -89, 208, 19, 56, 128, -32, 7, 145, 109, -34, -142, 72, 209, 61, -25, 28, -49, -19, -46, 13, -120, 133, 46, -43, -102, 130, 93, -132, -165, -16, -134, 146, 159, -1, -65, -71, 28, -156, -76, 46, -99, -64, 99, -35, -168, -48, 102, -31, 55, 149, 23, 82, 116, 78, -153, 251, -47, 80, 241, 186, 72, -96, 95, -144, 177, 1, 158, 89, 147, 235, -21, 101, -12, -67, 162, -84, -212, 35, -74, 114, 45, 47, -222, -100, 175, -68, -211, -43, -3]
5043co8N2pP9K4J3j87J83k2R6j58o7j3k05L48K8j16m7m9J41j02J00k3j16L46j90
5069C7l3M8r6p6k9L66j27j47J9P6P6j60J63j3k0K3k08l6K02j37K7M1r4J77M4p8
5095D5J6n6n0J1Q0o4PNK89k07J42k72J96k01L7P4m4L55n22K47m8N1l49O1L75k6
5121A52j0M6p9k34N5nJ10k15O3J06m6o1oJ42Q0p7K14Ll62Q8M6O4j99J42J04k35
5147a14j6J71N0l9J07n9j09o9J97j20k01J66r0p6J36L40j58K5l8J6k74K0L4N9
5171d2M2j89J74J00n1j91J12k08K43p6JK48j68J48%k21K29k25n5m3J96k36P8N7
5195g7j18K66k24O5k6n1J12L49k36mm8l0r6J47p9K29j53Ok8%q5J49O2k03l8M0
5221g1J56Q2j74J20j04j7N7k34J19l7J20N1j2j49R4Q4o5o8k67K82J13k29K11J03
$$ y = [-3, -71, -19, -26, 53, 77, 90, -97, 86, 64, 160, 2, -65, -78, -283, 65, 93, -23, -70, -119, 22, -80, 20, -3, -119, 227, 37, 4, 52, -44, -120, -149, 217, 90, -57, -38, 38, 114, -46, 117, 104, 84, 107, -101, -137, 65, -72, -45, -4, -98, 79, 123, 45, 61, 5, -45, -34, 46, -18, -11, -6, 283, 76, 218, -54, 142, -59, -22, 52, 8, 363, -159, 88, 40, 91, -258, -197, 178, 152, 142, 188, 109, -125, -70, -75, 35, -180, -117, -11, -57, -118, -124, 18, 98, 21, 235, 238, -124, -36, 10, 74, -125, 17, 121, -114, -130, 41, 91, 52, 159, 100, -9, -78, 119, -1, -202, -36, -126, -202, -66, 274, 116, 141, 103, 119, -155, -135, -101, -42, 0, -189, -15, 85, 34, -157, -45, -253, -10, -86, -85, 163, -5, 143, 143, -78, 151, -74, -129, -172, 24, -212, -134, -77, -195, 71, -153, -88, -114, -165, -53, 296, 60, 56, 8, -22, -118, 29, -50, 179, 26, 32, 4, 4, -81, 68, 130, -73, -111, -71, 85, 167, -7, 113, 9, -8, 49, -185, -66, -103, 17, 68, 56, -93, 1, 85, 20, -48, -315, -33, 80, -149, 62, 165]
5245A65k73o0J49n3n4p2J24K3KJ40j01Q4j14o0J30l9j60J16L07m26J71r0j27L00
5269H2p1P4q0k0J59j77r8k1J43J40k2k91J48J84k65J38p1Q8L5j07n7O7J92k31
5293f1N2k06J63j13J35o1R4J29J52l25r4J12j91L77l60K07K69k60p0L1J33j02
5315A1pq3J10N8J1Q0l51K88J07o8k9l46K32Pj33J54k82K87l39K5R9L7nJ07N6J10
5341A36J51j85Q3n4j99j09J47O8j55n0J1P0M5J51Pj83K57j69p8Q9k27K93r0P8
5365H7j70p7N7J98j9n4k02N8J58m8r4J50j07K94j87l36L58j3k01J63K93j94j15
5388aJ9p8K1O6K6l8KJ86j95r0Q2j02J15Q7L2j40P7p9N1M5j89K14j37P4n9J11L2
5415A32r7M7m7r6Q6l75K70P3p5LqJ24k91K76K79k10p1R7J00q9k47J51l7J76j60
$$ y = [165, -108, -168, -19, -72, -126, -198, -74, -51, -49, 91, -10, 74, -40, -100, 30, -9, -169, -53, 254, -172, -1, -91, -218, 82, 11, 85, 5, -15, 144, -33, -131, -152, -9, 131, 109, -182, -34, 150, -115, 23, -48, 40, 75, -32, -89, -22, 170, -61, -9, -215, -52, -165, -30, -91, 3, 132, 284, -41, -135, -23, -214, 163, -197, 10, 279, 19, -51, -20, 113, 11, 4, -79, 31, 89, 100, 180, -171, 117, 224, 156, 127, -219, 13, 20, -113, 41, -241, 46, -293, -268, -169, -132, -137, -30, 26, 136, 287, 102, 185, 131, -68, -177, -30, 38, -117, -167, -156, -86, -41, 110, 117, -66, 191, 22, -56, 33, -194, 99, 9, 87, -83, -160, -103, 95, 76, 22, -180, -122, 36, -12, -106, 44, -63, 231, 44, -292, 66, 53, -148, 15, 308, 114, -1, 18, -60, -39, 27, 53, 15, 17, 203, 8, -82, 0, -102, 13, 100, 132, -8, 69, -10, 41, 86, -103, 111, -26, 48, -11, 100, 132, 35, 82, 35, -61, 25, -350, -80, -7, -82, -79, -87, 37, -254, 22, 301, 91, 20, 117, 217, 128, -119, 32, -5, 171, 11]
5440A1j98J45j08L00j90l3m7J11oJ64r5j06j33K89j47J78p0j41o4N7J02J25k46
5463a02J51J7k25J56o0K43k32l8K15J1j10J31k68K24m0n2j94M0J29k92K24r4N2
5486a14J2k7R4O9L8j76K9K07k04J50K1o1J60k63L07j98k9N5j74J92r3k9R6r3j17
5511a48rJ32k02L50k09K54j68r4J22j73Q7M31j84N9k15m1J00l84J74J63Q6k93
5533a62O0k9J3J34j28o6J37N2J27j18j75jQ7K34Q8l10P7m4J14oL3j6O2l10Q0L9
5559b8K5k2QJ01J85l72J58kj13K74j94n4n3J38p3J07j73J44j87M9J09k35J94j6
5583c0O9no8J8r4k9Q3N2n1K3pj1L6P4j17L14k24J20Qj32j46J50Q5n4J1j37O7Q7
5611I2j72o3J52J66j71L9M0j12n6K16j53l7j72J85O6k26L46k05O5P8nq0K22l98
$$ y = [11, -187, -42, -150, 150, -40, -73, -120, -9, -15, 149, 54, -52, -185, 104, -43, 135, 65, -76, -140, -83, 19, 144, -102, 49, 66, -159, -3, -63, 180, -52, -90, 125, 136, 26, 157, -111, 113, 73, 21, -173, -133, -4, -296, -72, -166, -114, -102, -129, -35, 34, 72, -104, -75, 132, -72, 78, 99, 38, 198, -65, 242, 44, 15, 70, -104, 88, -5, -34, 62, -31, -148, -157, -25, -227, 123, -86, 168, 0, -94, 28, -145, -58, 373, 189, 248, 33, -8, 92, -292, -118, 45, 131, -162, -102, -131, -118, 16, -112, -178, -41, 11, 138, 20, -155, -156, -69, 165, 253, -57, 20, -24, 90, 84, 117, 101, 163, -147, -67, -28, -3, -25, -17, 84, 269, -103, 55, 53, -60, 214, 20, -34, -87, 51, -22, 85, -88, 56, -131, -82, 27, -208, -14, -30, 39, 34, -34, -16, -110, -139, -56, -4, -55, -32, -39, -50, -14, 60, -57, 257, 33, 153, 161, 29, -117, 33, 118, 64, 75, -62, 5, 92, -80, -143, 9, 175, 4, 43, 83, -29, -85, 131, -22, -59, -231, -46, 20, -206, 140, -65, 0, 78, 73, -7, 215, -183]
5635a83J99J4J24k79J62M8rj56L64r5k40o2K11j10J13j12p2k3K04k37k5J41P6
5658E3N9k76J12KJ50o0J31m73J08N9P9kJ00J18k56J89n4K5j42o5J48q4J20k2j13
5683i4QJ40l9r2P5MJ87j82Mk72K48k1J0o1K32k13J54j89J55p0k3j27j05L46j82
5708a07J08p8R8p1j31K97poq8n6M7j89l5J88K3q6J75j1j00M6r2L8J8k11LM99k81
5735iM6k11M05n6k73J08o0J97k42m6J33q9K66r4k57K75k45K38k45J70k94L44j61
5758a00j37J56OJ46N5j39K00k61K2K25j61P8j81L0J20p8j4R1j14LJ95k44J18n6
5782d0q2O4l5K3J92p4k22l3K54m4L5j07O9m5L5R6k2k1k03K48L1j0j43N6K8J62
5808B12l76R5j15n3m4L14j80o2M59k60m9L7n7l5K08j14l7m0o3L8L6Q8N6o2J75
$$ y = [-183, 16, 30, 154, -125, 37, 85, 76, -80, 284, 189, -51, -113, 98, -12, 101, -11, -83, -106, 98, -139, -164, -23, 53, 112, -164, -52, -50, 100, 40, 171, -302, -194, -135, -56, -58, 42, 160, -96, 93, 39, 64, -78, -143, 5, -79, 41, 19, -94, -86, 54, 15, -77, -2, 2, 189, 7, 11, -261, -13, -34, -24, -85, 147, -66, 88, -101, 54, -16, -39, -166, -271, 75, -107, 1, -77, 21, -50, -181, 116, 109, 103, 15, -41, 6, -183, -218, -30, -7, -93, 82, 71, -29, 17, -75, -37, -19, -230, -227, 272, -9, 37, -174, 231, 175, -98, 10, -50, 147, -95, -141, -8, -97, 169, 75, -182, 93, -152, 86, -159, 11, -283, 61, -100, -237, -81, -75, 71, 126, -13, 187, -74, -52, 173, 12, 90, -91, -61, 59, -19, -33, 58, -56, -53, 142, -102, 16, -40, -122, -58, -93, -70, 122, 48, -174, -207, 47, 3, 38, -69, 0, -45, -10, 86, 64, 43, -160, 88, 119, 109, -34, 22, 50, 212, -164, -69, -184, -237, -281, 33, -147, -209, 250, -10, -59, -22, -79, -114, 94, -20, -57, -97, -160, -122, -86, 2, 58, -4, 171]
5833A71p0k49L16k32J27n6k74lJ95Q2j07K79l07Q5J4n4J80rj8O6k64L3J10J5j11
5858h1J27j88L1j72L97j03J5J8P0o3m7K1l02K59k01L23j16J35r8j48P2m2L0J8
5882d5q3k5J18o7L29l77K20pK2n2o4K9J77k44j02j2K12j21K06O5k28J84k97K35
5906G3N7P1j82r1P7J19k51J05J57k92K70N3l05P1J62l60J96L06j58q0k55L62q4
5929B1l1N2J54q9j75P1J6Q9r8r0J01J77k91N0J95k13j0k1p1L12k57M0J06k38M69
5954B69m57J48J34j44n7p7K53L7q7q2R6j4R8K15m84L10j90L0k43N16r5m09K31
5977bQ9J38k97J76j25k32N3J94q6q8K86j67J54m6j57P8J45o9J6j58J09m2J09r6
6001a8L2J09j41p7L65m62K50l30K04J95p7J67o4j15j79J43K2L1J85k55L0l9rK9
$$ y = [171, 101, -148, 168, -64, 63, 7, -267, -270, -75, 7, -100, 179, -128, -43, -29, -83, 97, 88, 70, 136, -128, -95, 15, 30, -81, 46, -142, -111, -283, 114, 11, 26, 44, 114, 51, 4, 25, -277, -18, -219, 104, -12, 123, 25, -123, -51, -93, -63, -45, -128, -153, -35, -102, 227, -150, 70, 63, 85, 33, -31, -2, 175, -69, -171, -183, 29, -92, 114, 179, -49, 135, -162, 73, 130, 201, 19, -72, 5, 124, -127, -22, 135, -157, 113, 166, -139, -68, 94, -266, -70, 236, 78, -2, -257, 105, 21, -10, 42, 196, 107, -68, 3, 19, 108, 10, -80, 21, 198, -93, -43, 152, -61, -71, -92, -163, 149, -108, -68, 38, -200, 269, -188, -40, 94, -50, -107, -184, 69, 106, 19, -63, 33, 19, 117, 332, -152, 158, -32, -2, -245, 271, 176, -233, -2, 87, 225, -72, 104, -21, -253, -200, -6, -92, -180, 106, -61, 93, 47, -110, -32, 113, 44, 60, -98, 11, -31, 78, -18, 14, 123, -18, -95, 270, -192, 58, -272, -68, 127, 50, 217, 153, 38, -141, 2, 24, 55, 240, -15, 15, -24, -33, -4]
6025do6M9j48j20L20j6j40K66p6p0o6J30j91L96j21l37o1J65j2R4j9K99j87k71
6049a86J11j42Q0Q7J20nj51P0r2J69N7k16J14j29j2K46%j24K06j00q0K2j15O6
6073dj52K70j77N7j09J73n3j2m1j09l3K85J32l57J83j15j83L7J57l8nq3K99m54
6097c32M33j48O4j42R1K79j30k3n0m7l2l4J34j09j8L28l96Q4J73k66K43l04Q2
6120a20J42oJ29j94J10R4l09Q2L3J11o4j81J90N3L4q2j30J89L1j33L4J50j21Q5
6144A27k38J73R1k95K44o2q4J5R2j91M0K17k36J24nj09j51L84k97M3K52j69o6
6167a01K35k98M6J22J16j10j07L14k73O4j46j47J17K23o0j0j1J26k00J70j52O3
6189a9j50N5J16Kj88K10O5j25Q0j23j35J57J9J61k30No7J98j01j76P4J52j77K94
$$ y = [-4, -70, -21, -169, -289, 31, 15, -125, 141, 65, -5, -71, 59, -132, 264, 143, -194, -255, -90, -102, -8, -27, 272, 85, -186, -75, -217, -137, -50, 70, 65, -86, -16, -108, 61, 118, -98, 16, -113, -125, 121, 121, -3, 203, 103, 23, 45, -70, -4, -156, 114, -63, -6, -115, 58, 5, -7, -48, -157, -190, 95, 227, -130, 53, -62, -245, -208, -51, -89, -94, -177, 122, -332, 101, -47, 17, -125, -34, 245, 115, 92, 42, -5, -37, -71, 63, -46, -64, 264, -132, -48, 125, -141, 102, -202, -120, 22, 16, 145, -49, 61, 155, -154, -72, -39, 72, 8, -173, 17, 70, 104, 22, -108, 81, 112, -21, 13, 163, 42, 127, -111, 62, 153, -142, 102, 40, -44, -29, 63, -128, -88, 129, -107, 17, 12, -97, -248, 136, -161, -118, 134, -35, -101, 134, -164, -118, 4, 120, 10, -97, 217, -56, 8, -138, -285, -168, 55, -5, -15, -26, 100, -100, 70, -82, -19, -169, -114, 2, 4, -184, 26, 91, -34, 46, -77, -212, -55, -36, 125, -105, -100, -167, 31, -70, -246, -172, -20, -197, 97]
6213I7j30k22M27j39%lj65J13n3M5J25j42J37k91J62K15l23K14j19O0o3j98K90
6236C7j12J02K2p9K53j49n6j61K10j46n4K90j55L5n7R6J39o4j35K9J06j18N8k80
6260a89J12N6m9P7J2Oj39L20r7j05L7K06m7k51L1m34N72p3K04k92r3K73k29j20
6284b12K57l1r7J71j1j00%%J19K0k17J2nm2J76q9Q5k87K49J88j16j27n5mJ12J69
6310A65k98j4M28r9j34j04M6j43J88p1k8k1K9K0M8J0J01l15Q7j2K27p3L1k95K19
6335hJ50k81P3J46O2r4m3k0m7j84J46n4J51j81K37P3k71K45j41J94k90Q4N3l8
6359c8K39j08k30r2L59j62P8KJ98j81o2l0Q0k43K41N7j98J9o3J24JK17l34J56
6383C0rm2R7j36pj9P9j44K74l55L94k01N5K63k53r9N0R3l6J9o3J41j09J7P4m1
$$ y = [97, -33, -255, 172, 33, 33, 30, -135, -22, -75, -30, 95, -47, 90, -201, -39, 176, -147, 67, -52, 8, -55, -253, 37, -75, 27, 49, -30, 223, 74, 18, -143, 67, -79, -133, 157, 2, 37, -20, 76, 215, 151, 16, 45, 151, 33, 91, -189, -77, -21, -70, 7, 19, 25, -114, 206, 109, 4, 41, 247, 200, -51, -20, -454, 118, 45, 249, -43, -136, 137, -92, -212, 45, 14, -83, 88, 77, -23, -23, -23, 96, 116, -101, -89, -94, -136, 40, -49, 36, -251, -2, 186, 70, -57, -112, -116, -4, 165, -133, -147, 281, 182, 48, -56, -10, -153, 35, -36, -64, -85, -56, -36, 12, 22, 123, -192, -105, -117, 110, 37, 68, -227, -8, 142, -139, -66, 80, 142, 48, 5, -15, -62, -246, -100, -154, -3, -184, 53, 126, -145, 100, -41, 153, -137, -53, 0, -38, 201, 93, -137, -229, 130, -32, 46, 48, 246, 65, 3, -27, 53, -190, 51, 108, -90, -71, -134, -10, -9, 208, -126, 30, 21, -21, 76, -60, -67, -86, -7, -151, 123, -232, 162, -39, 16, 279, 26, -73, -23, 70, 34, 53, -10, 131, 22, 39, 113, 72]
6409G2j03Q8j05j42P6K17k16J33q1J1j37p9J42J7J85r6J14k32r3L18K19l88k13
6432b93N05j11Jk75K38o9k4k0J12J26k94K97k25P5j12J30l62M16k31L26l55M17
6454B72k95j76L99m06J17j03K40N4k90K18j79J85j23J80j1Q2m03K89p4M9k2L4
6476C7l7k25L49q5M5j23j53M0J57OM1m8Nj0o5J73r5p3K00q8n9nK7j19J43o7j14
6503a43J48q2j06J69o9K1K03k49Q9K97k84M1l8j10J12j75K13o7K1r0P7j46J66
6526bj0J19J37j03j41j7J01j72N1p0K09j53l6K16N1j45N6k36K62O7j69L2K12j61
6550I8k97J86k2K06j17n6J6l7m9QK8J64o6r1J74k98K68m4q0l5j99R1Rm7J9J38
6576c3k3M1J29j77M0J64l23K12l3K75k86Rq3K13r9j13m0mK47K16k57nJ45j08j71
$$ y = [72, -31, 57, -48, -190, -114, 103, -113, 20, -61, -50, -187, -266, -124, -107, 78, -18, 96, -136, -229, 89, 308, -80, -293, 212, 101, 102, -173, 65, -4, -28, -48, 64, 190, -104, 193, -32, 43, -69, 61, -301, 115, -116, 210, -145, 272, -23, -199, 200, -206, -89, -192, 48, 102, -188, 30, -149, 36, -87, 93, 82, 164, -239, 50, -24, 25, 3, 37, 0, -225, 124, 39, 84, -39, -192, -152, 5, 11, 52, 4, 9, -1, -66, 107, 12, -61, 139, 51, -8, -13, 14, -105, 38, -29, -143, 5, -77, -183, -14, -83, -62, 141, -108, -19, 278, -6, 35, -3, -113, -1, -176, 37, -30, -9, -99, -22, -168, -2, -12, 107, 244, 141, 0, -17, 84, -88, -37, -107, 102, -51, -87, 129, 180, 35, 91, -145, 117, 184, 15, 47, 259, 98, -199, -13, -35, 171, 54, -2, 14, -23, -72, -64, -36, 128, 62, -29, 145, -153, 115, 71, -9, -44, -243, -152, -143, -190, -171, -33, -56, -15, 114, -63, -23, 141, -182, 30, -3, 272, -14, -5, -88, 125, 26, -87, -127, -131, 116, 332, 75, 70, 215, 107, -64]
6601f4J2j17O0K75j57p4J03j8l5j34l1K86J21m17K31m5N8j48K46J27j98j56j92
6624b67K27n9J53m2j54J05j18J74P6j89J02j14J36r9Jl5K80l8l37K62jJ01k25
6647f1J09K5p6r8J68o5J11J05l33O5q6J77M7K4j30j48L34j79r9k6L54k16j93K64
6671G3q6K9M7ON1k79K17Kk15K54k26J66q5J71j90J02Mk0J3K18l17K36q1k00P9
6696c1j5J36K59n00J14P2j50J40J10pk26L1Q2K2j51J60P1j39JR4J04l81K95k13
6720a22J15n9l2k0o4K79j27N8K25j42j95J23m5M8p2J87k74N0J40p1n5J76j40k37
6744b54J68J77r0k4q1%M0J29r9N7j17j40L67l2j97N1J6K23j97J2k52K14n5M4l3
6769g3P6J75j28j40J60K6j33j19K38r6k2M0l4n7K6n2J07k9N1J2J2n2J6m8R4k00
$$ y = [-64, -52, -169, -109, 166, 9, -65, 38, 20, -15, -149, -180, 106, 227, -190, 41, -4, 54, -94, 152, 279, 81, -75, -267, -40, -99, 54, 12, -142, -37, -155, 19, 95, -94, 8, -106, 30, -69, -68, -103, 177, 139, -198, 64, 63, 164, -61, 48, 73, -3, -101, 67, 2, 113, 218, -115, -50, -136, 41, 88, 112, -18, -166, 168, -11, -110, -136, 218, 2, -191, 73, -13, 16, 63, 69, 120, -159, 58, 60, -155, 99, -127, 39, -46, 125, -65, 37, 41, 21, 34, 252, -65, 171, 90, -110, -31, -46, 90, 349, -151, -37, 35, -115, 25, 135, 128, -98, -67, 15, 37, -114, 46, 117, -22, -21, 73, 177, -204, 91, -122, -7, -66, -98, -118, -182, 97, -30, 28, 253, 111, -84, 39, -6, 42, -30, 157, -117, -67, 73, 2, -53, 123, -17, -254, -86, 91, 1, -23, -104, -104, -64, 65, -34, 23, -94, -234, 133, 101, -96, -45, -29, 194, -3, 9, -243, -29, -84, -40, -73, 3, 178, 50, -90, 70, 96, -37, -156, 82, -14, -36, 4, -30, -87, -61, -113, -6, -35, 16, 28, 40, -12, 4, -44, 50, -150]
6795a50Q1n4J35j23K10k34J07l6J45N6k72J66j66K90l75Q4m7J41J21n5j62K66
6817A28j09q1N8J20N7p7k57J23J09poJ2J39j06j69j37J53O5j42Q6J23O8k5p1J21
6842A75j96j13J03J89l65J90P2j18j7l7K29n2l40J60N4K07k5j10n9K06k03J86
6864A36j03l2o1r1k9l8Q1J47J29k69Oj27K32J30k35L9Q9k0N8j0o9M3K8J69l55
6889a52K21M9j74j49J08M2j9%n4Q8M4J49k84J56Q4l3k24N9J23k20K14nQ5k5l64
6914b81L38J09j49K06l32J33J8k47J04k7J53j33R9n5o3J34K3J32Qk98L50k24J5
6937A3j05P1L8j58q0n6N13n7j10N2j85P4L3K0k6j1J3q5j57K11K37k73p7J70k32
6962a67J43l9J48k46K22k5m8L1K08l62J18P9j72K20j66pK4R7N8q0KO8O5j56J19
$$ y = [-150, -69, -123, 12, -111, 99, -135, -28, -64, 81, 137, -135, 31, -135, 155, -220, -136, -183, -42, 79, 24, -138, 128, 19, -62, -4, 116, 173, 96, -161, -38, 71, 64, 58, 70, 209, 103, -66, -203, -50, 15, -127, -41, 82, 150, 125, 54, 175, -21, -134, -31, 158, -207, -17, 55, -63, -80, -117, 112, 60, -280, -120, -66, 141, 116, 6, -53, 153, -50, 136, 33, 1, -60, -151, -180, -218, -137, 10, 139, -130, -124, -251, -19, 111, -124, -85, 4, -16, 42, 32, -37, 6, 34, 203, -152, 69, 118, -56, -205, -97, -55, -74, -74, -128, -40, 4, 153, -131, 25, 109, 76, -148, -89, 34, -186, 28, 23, 108, 83, -281, 57, 166, 17, 223, -109, 24, 42, -205, -101, -128, 25, -108, -9, -64, -127, 7, 30, 162, 170, -128, 222, -2, 13, -92, -21, 17, -141, -221, -277, 236, 179, 69, 121, -64, 10, 43, 63, 37, 26, 39, -46, -203, 8, 245, -28, -105, 65, -167, -24, -63, 85, -161, 61, 36, -12, 19, 227, -135, -17, 62, -110, 110, -56, -63, -39, 58, 116, 36, 38, 106, 171, 15, 134]
6987A34K39l34j25J54k70K05J27q2j93K33j47K36J88l66J7Q8j30J81l17K58Kk6
7009G2J81l36N8J16m2j26K31k57J29k24K88j58K46k07L1J39j83m6J99l44J39P1
7031b3k8J58k00K86k37q3K8Q2O9J60j4pO8j66j58K58l5k21J73L4j59J64j73K5
7055AL4J31l69K38j68J0J5Q1P1n9N2k9O2j61J81r6k7J42o8J76j19j09k1K16j48
7080C6o1q4M3n2p1O6J96j55M5n4l1J50k15K00QJ58l10P0j36J02j9L52l1j28n0
7105B9nj8rQ6j09L5L36n26J75O4R8l64K20K4n3j09J25N0J9j46J81j27L9n6K26
7130A85j45o1ol7k5J62j36j97K58K17k08q5K8qK17p6m4k15J74l7J39O9p8Jj60
7155f8K58k42R3Q0l19L24j23qJ26k57K20j10k20L01j24L16r9j22L6M3j10m2K0
$$ y = [134, 373, 39, -86, 68, -202, 3, 130, 48, -145, 88, -59, 177, 365, -1, 16, 104, -26, 155, -162, 96, 98, 72, 253, -83, -25, 91, 49, -77, 154, -103, 26, -198, 90, -68, 178, -29, 2, 141, -42, -88, 111, -233, -94, -23, -51, 107, -93, 193, -44, -127, -99, -17, 52, 212, 198, 191, 259, 93, -65, 193, 158, -63, 110, 144, -15, 149, -24, 1, 35, 166, -203, 35, -133, -123, -108, -27, 44, -15, 37, 8, 70, -91, 90, -6, -33, 109, 41, 217, 98, -11, -32, 184, 36, -25, -109, -66, -118, -189, -123, 73, -82, -37, -91, -122, 28, -187, 13, 21, 179, -131, -61, -197, -95, -114, 238, 207, 79, 29, 24, 6, -3, 83, -26, 9, 345, -181, -6, 58, 156, -208, 12, 36, -17, -126, -1, 49, 68, -78, 103, -24, 15, -41, 185, 40, -21, -27, -64, -89, 73, -63, -260, -2, 215, 7, -78, -50, -58, 159, 83, 39, -176, -2, -39, 100, 169, 91, 92, -68, 190, -52, 41, 121, -198, 126, 3, -5, 121, -136, 84, -26, -246, 55, -69, 247, 148, 26, 62, 105, -5, -47, -27]
7178b7q9J15k28L04l0j12L24l97J11l1l5Q1L9j17P0L2j74K60k42J84Q6j61O6j00
7202g1J65j48nj1N2L3%j30K30L0k48J15j22J59n6R1k54R8r5K43j09J14o8n4K08
7227A67j33q7J22%m8j7j77K55m32L22j62J53JO9O8j57J73j19n4N4K41l29j31J41
7251h0K04pp5L2j93K39j07J87k77J21j48J65k19L60k63K80l98K11j08M9N7Q1j65
7274e4j02L07m12M1L69m4r4K33k21m6k04K61k4j36K54K8j96L75m01J08j25pO5
7297b5Nm5O3j10j2J70k37L29l95K53j5N6Oq2Rj04j0J72QJ25j03J4k64J74P3N6
7323A11k2k1j67J17l9K1J56k09J19j06j8o9J36K0K6k6o4r7J24j74K37L0j09j59
7347a83J67n0P8K0J58l64L02k81J46J81r2j1k22qNJ71n1R0k43K20R2k5N5j25K
$$ y = [-27, -116, -1, -229, 75, 45, -67, 257, -140, -29, -60, -95, -14, 25, -92, -22, 10, -164, 96, -146, 38, 124, -37, 29, -71, 94, -54, -59, -70, -18, 15, 15, -115, 115, 145, -103, 12, -110, 49, -7, 84, -170, -72, -167, 76, -33, 81, 13, -41, 167, 34, -53, 69, 69, 21, 4, -173, 82, -350, -28, -190, -37, -36, 33, 101, -56, 117, -2, -56, -2, 239, -90, -221, -80, 124, 117, 42, 74, -119, 120, 13, 200, -77, 44, -104, 61, -158, 202, -61, 219, -179, 32, -76, -27, 30, 111, -54, -156, 151, -261, -220, 149, 105, 11, 244, 23, -23, -227, 34, 10, -126, 128, 156, -40, 335, -66, 42, -83, -90, -25, -20, -65, -2, -112, -124, 46, -191, 138, -257, -4, -19, 37, 43, -39, -30, -134, -144, 28, 36, 161, 58, 72, -192, -18, 55, 111, 89, 68, -99, 18, -21, 0, 156, -53, 66, -40, -58, -127, 9, 29, 55, 29, -35, -132, -8, -182, 55, 85, -24, -183, -16, -66, 12, 32, 190, -174, 128, -153, -7, 174, 82, 71, -151, -159, -154, 17, -34, 56, -187, 33, 125, 100, 155, 30, 32]
7372C2l0K67k18N6qj61J67j65J21j35J30P5n7j14Q8j2k0m9k8J25k00L1n6J89o5
7397c7L5P3J12j80p1R8j60J92j36N5R7r7K1j52NK73l6J40k72J07n4j94K51J9n4
7422C5j1J38k97J51o7J54j66k05Q9K83r8k00J81j28J40j06q3N0K24k02P6J32p3
7445A7L5j05K7L2P6k48L38l62K68p5Q3P2k28N6R4M6rk30K2L25l53J9J43j82K81
7470A42j04q2J44O5j22j9r9J18O0r6j60K14k11J97Nj79J96O3j29R2q3j44j4P5
7494g1N3J68J23j88k42J51Q3k24J15N6k20K29j21k5J82j33P4j7J00m8j69L07k61
7517g8O7M6l4K9j4o0l2R2l8O8j60K67rm02M17j14Mr2j14K46j46K9l5l2J63lk50
7544a85m3K75j73J0K52oj51RJ74n1j06J10n6jJ06j86J1J03j12k5J51l6m1J21l7
$$ y = [32, 2, 269, 51, 107, 99, -62, 105, -60, 61, -74, 56, 131, 74, -40, 48, 36, 16, -33, -61, 64, -136, -105, -161, 28, -37, -2, 71, 183, 3, -68, 30, -130, 62, -74, -19, 78, -19, 2, -150, -145, 128, 92, 232, -40, 67, 13, -181, 70, 89, 35, 24, 162, -135, 16, -51, 103, -63, -268, -179, 104, 6, -194, -13, -141, -1, -107, -190, -140, 84, -118, -42, 90, 17, 52, -53, -26, 6, 82, -166, 172, -190, 78, 3, 86, 158, -70, -14, 80, 126, 117, -113, -91, 234, -119, -100, 43, -139, 142, 38, -44, 100, 165, 43, 24, -75, 43, 103, 7, -153, 61, -150, 47, 52, -127, 69, 132, 3, 95, 12, -132, -146, -71, -18, 150, 273, 85, -157, -6, 77, -147, -32, 24, -196, 33, -88, -113, 69, -64, 10, -7, 93, 45, -124, 183, -78, -11, 35, 1, 30, 16, -44, -76, 16, -22, 46, -114, 153, 144, -258, 159, 45, 49, -43, -157, 89, -57, -28, -63, -95, 68, 65, -185, -228, 47, -126, -116, 136, 130, -21, -12, 162, 111, 5, 115, 59, 58, 164, -22, -11, 92, -20, -45, 106, 70, 29, 150, 113]
7569A13k7J40l48J19O0j96J35J69j3m3o9q7nO7l6J88k43R5k39K21j2R1K9j65J54
7594I8L9M7k37O9j97J58kk9O3O3j76J30R7j82q2K07j86K84l31M8K26l04R5j10
7618b12K49J07k35J11RM0Jl5L9Kj07J12p8p6K01k89o2J80L9j1J01k6j45J36q3
7643c2j78L30k3k24J22j8L9j3r1J49l3k0K10k35%j80J17r9L74k49Q1j04j9J30
7667C4o8O5j35J75j08n4R4K3r5J06j21K32p2j05J13j16K05k72J10q4m4K68j34
7690A7k85M02r0p3j50K14j3J26k15o9K85l4m7j49JR7j57L2l6J21R4j63K9J30j62
7715i5J22L0l8j53Q2j34K59J74j15rj47mn3O6K34k00J2M3q7J95n5N0j65j8R4j91
7741a03O5p0K1L9Lr3J89R3k07J9M4n8N4j85O9Q5K32k84K00k80M4J56M5Kj88J04
$$ y = [113, 86, 226, -122, -3, 57, -139, -4, 165, 152, 109, 40, -47, -52, 15, -21, 167, -76, 19, -220, 1, -11, 80, 109, -56, 98, 137, 184, -53, 16, -181, -23, -25, -54, 9, 72, -104, 26, 123, -59, -141, 66, -120, 164, -167, -119, 107, -197, -102, -212, 37, 144, -91, 20, 29, 69, 70, 35, 74, 76, -31, 81, 3, -73, 128, -161, -223, -43, -4, -15, 86, 60, -85, 51, -32, -210, 120, 97, -127, -5, -23, 16, 3, -88, 61, 28, 8, 218, -17, -17, -197, -80, -179, 195, -54, 27, -77, -96, 34, -34, 31, -104, 71, -37, -91, 3, 26, -69, 37, -84, 148, 76, -29, 84, -32, 173, -99, 11, -73, -117, 151, 17, -268, 134, 44, -29, -179, 35, 22, 148, -67, -136, 149, 115, 68, -81, -80, 17, -140, -108, -144, -23, 71, -92, -63, 67, -95, 27, 57, 19, -134, -52, -186, 73, 247, 132, 123, -24, -28, -81, -15, 219, 19, 31, 74, -13, 182, 127, 177, 12, -6, 88, -103, -38, -108, -87, -48, -45, -138, 51, 144, -63, -44, 0, -58, -4, -189, -120, -35, 197, -87, 113, -167, -123, 33, 78, 80, -108, -4]
7767dP2o2j82K33o8Kj6o4J5J64o8Kk08K61j65J97J25k16j75J90j7J53j19j28K99
7792B21q9k09J41j16J01p7r7J50J55j50j36J49j11J67k14J65M7l2K0j89J03M5
7814D4N4r2p4K18k01M1j09J19P5L1j21J6K00j35o9j37J80j62j2J30J45ok46J6
7838i5j2m7J12j17K70l0j72Q3j07m4j7J52o3K01k0p5M7j90PqN8O9k4P5K8r8K21
7865B04l21Nj0K38j10q9K56j34J7P0k84R4R6l18P3K38j04J04J08j39N3k23J45
7888c1O5J16l18m1J71J7n0m8L33j59Pj07L41j68N2j66j17K30O4l10R9l3p9O7J73
7913A08k47K45j22L9j53J01J8N0j75K01N5k90J19J63l7j20j17n0L23N5Jj15k06
7936a54K94j02L5k63M46k29K5n1R6j28K68j50r2o9J7J04J75q1j25j76K20k45J73
$$ y = [-4, 68, 6, -176, 57, -11, -9, -25, -89, -74, 90, 22, 24, -184, 77, -88, 109, 234, 18, -157, 33, 16, 169, 50, -78, 221, 132, -77, 64, -52, 49, -28, -125, 25, 180, 30, -106, 43, -68, 99, -115, 50, 97, 65, 85, -104, -1, 44, 98, 6, -68, 150, -51, -10, -119, 0, 75, 106, -15, 1, 201, 66, -3, -140, 40, -122, -134, -4, 141, 135, -111, -95, -107, -154, -42, -159, 111, 81, -91, -8, -115, -159, -176, -24, -87, 114, 94, 19, 66, -124, -117, -125, -67, 2, -22, 53, 81, -17, 204, -117, -112, -122, 116, 6, -83, 173, 39, 56, 126, -158, -64, 32, -286, -213, 25, -79, 25, 133, -6, 47, -176, -31, 34, 150, -168, -209, -38, -21, -71, -119, 214, 55, 62, -45, 296, 128, 180, 14, -103, 127, 191, -119, -20, -53, -132, -65, 108, -139, 106, -16, 23, -130, -29, -11, 39, -136, 65, 120, -170, -51, 112, 75, -45, -162, -212, 111, 166, 167, 52, -154, 140, 38, 73, -190, 256, 27, 52, 1, 97, -31, 237, 87, -5, -74, -57, 47, 222, 141, 16, -160, 60, -185, -12]
7959a2l1M6P7k26J61L8m3J8j27K7K3q9Q8K8j75J80J56j72m7j12K18J20j03J59
7983B02k10M7j57K82m1j50J22j02J90Lj49r3P2J61k79p5L06j24j64L22j58j25
8005a20K40j37K42k85K0J13l8K10l14J57j21J13mP7k62R7J54k43M1Q4r8J10n8
8028b2m1j54M20k37K7l7J1J02o0Q0o8j55J58J4j67L4k1n2j8J71k1j1k4R0j72M5
8054a08J13j11K56j26J28k96K11J65k7k68K43l30P8q7R0NJ24J7j11n5R9j46J09
8077b7rqj01Q3J18j13N6k3j75J76P5j72J08M0j82J7O8K58m7j80M3O2k2J1J17j42
8103C1j9p7J88k27K26m7j64J47j95J97m9q6l9K0J28k2K34j46k47k8J24Qj04R9
8127d8n1k8J10O0j83J41p0r8L63l04J28n6N7r9J01J73r6l9k7m5k3J41j80l8L5
$$ y = [-12, -43, 3, 80, -146, 15, 53, 10, 28, -99, -72, -49, -138, -50, -22, -197, -17, 139, -33, -80, -192, 26, 146, 43, 202, -8, 39, -118, 164, 123, -27, 95, -7, 183, 186, 37, -56, 16, 177, -102, -177, 129, 5, -159, 163, 5, -120, 120, -17, 225, -60, -40, 73, 35, 245, -69, 88, -33, 80, 76, 153, -109, -12, 142, -101, -60, 24, -74, 36, -22, -63, -217, 203, -34, -7, -44, -33, 69, 9, 89, 21, -134, 24, 38, -129, -95, -116, -168, -186, -15, -36, -47, -71, 19, -153, -108, 5, -106, 150, 24, 152, -144, 67, 232, 205, -63, 180, -150, -72, -159, -69, -64, 60, 77, -34, -89, 10, -136, -27, -36, -44, -145, -62, 56, -57, -1, -24, -199, -23, 52, -120, -12, 28, -154, -137, -69, 189, 142, -38, 5, 67, 45, 56, 173, 31, 12, -65, 123, -104, 122, 75, -89, 58, -137, 60, 11, -75, -114, -94, 34, 12, 246, 100, -147, -175, -51, -43, -147, -48, -99, -127, -17, 43, -140, 1, -69, -167, 196, -108, 20, -36, 21, -78, 23, 196, 100, 61, 34, -11, -34, 107, -73, -111, -76]
8152g6j56L73q9r2j58L09k60L7P2J04n9j6K8L6%j74J20k9R5j02qj8J45j07pm0
8178g2P7j01J43k6N9k14K61R2O5k86L7j08O1
$$ y = [-76, -232, 141, 52, -40, -198, 111, -149, -112, -40, 64, 5, -11, 17, 53, 53, -121, -1, -30, 65, -37, -45, -63, 82, -25, -32, -72, 5, -96, 47, 21, 80, -134, 127, 219, 284, -2, 35, -73, -12]
8191a2
$$ Imaginary data points
##PAGE= N=2
##DATA TABLE= (X++(I..I)), XYDATA
0@%%%%%%%%%%%%%%Qj6J6j6J6k4L2l2M0m8N6o4P2q8J03j18J34j51J69j92K18k45
36a30K77l12L49l91M35m84N37n94O58p26Q01q85R77j075J183j304J438j585J749
55I18j935K145k384K660k983L367l830M406n144O128p513R622j3273K1383p5973
70f2406L3491J08694o3726o3426J001O8001m127j2450q814P571k3279J5496K9387
83B5413j0028k0457k1348K5009K4396j8874j3939K480N926p082J7585j885j0010
96b814j8590J4954L5588k6085k2097J6452K0422j4041j3370J2471R218j0874j8928
109a7694K6594K216k1306L418J0129Q99j8027N342K3964l321l8608R540M4977
122B8123q802l3734j0626L8214J5579l5038j1298K2996O586j5766o76K314O153
$$ y = [0, 0, 0, 0, 0, 0, 0, 0, 0, 0, 0, 0, 0, 0, 0, 8, -8, 8, -8, 8, -16, 16, -16, 24, -24, 32, -32, 40, -48, 55, -63, 71, -80, 89, -103, 115, -130, 147, -165, 184, -207, 228, -256, 281, -313, 345, -381, 420, -465, 512, -563, 620, -684, 754, -831, 918, -1017, 1128, -1256, 1404, -1579, 1788, -2042, 2364, -2780, 3348, -4165, 5457, -7816, 13567, -62406, -28915, 79779, 16053, -47373, -46372, 21629, 17502, 5052, -3762, 3809, -19470, -3974, 25413, 15385, -5072, -26420, -1411, 22985, 4111, -9828, -7348, -1422, -8504, 9081, 7196, -2814, -21404, -6450, 29138, 3053, -19044, -2592, 17830, 3789, -9581, 2890, 12108, 1234, -17694, 8900, 11116, -10190, -6772, 3357, 4256, -13771, -8429, 15535, 12214, -26394, -16854, 28123, 19321, -14413, -25039, 13175, 28754, -6284, -17582, 5414, 12000, -3766, -4442, -2128, 4025]
135D025n592p662J1779m346q03N456k912o059L974Q108K419q690j1635J8453N382
150A1897j5460Q20O172J79j0624Q22J6851j612k6586K519K6431j716j1748j0012
164a2067O780J1396j568K038l779j4645M108K4757j083k0991j2947J2712K5970
177B0681j1702k3237K757J2563N262m494p395J725K993l414R774K259j2176N3
191d351M848O150l63q524r5L572k928N528K801j3874p68R207M737m386j2715O017
207e144J3042n822p936M840L363J339k809l517P334j916m729M740j871k504K330
222G40n99q84j242k961P160j98q908N051N197j926k787k318O627L712q492o94
238b522O529j894l92j984k114M782k919r95L061m609q09N553j727j626k74j61
$$ y = [4025, -1567, -9229, 2550, -1796, -2599, 2857, -55, -6114, -2140, 5968, 8387, -303, -11938, 6515, 11897, -3563, -2743, 3429, 3608, -7016, -6194, 10657, 9045, -17541, -15022, 11409, 9693, -2055, -12067, -5287, 6109, 4541, 6579, 2800, -11845, -7737, 17020, 15937, -5054, -18001, -5289, 20681, 8979, -14258, -11501, 1062, 6324, 1830, -5565, -3840, -847, -4261, 5513, 7772, -4404, -4351, 497, 6647, 6284, -2240, -2335, 1237, -1691, 3837, 6638, -7236, -8004, 1203, 5940, 1554, -11161, -5144, 7898, 2076, -5860, -1020, 2343, 3682, 873, -2644, 4690, 2774, -1955, 2785, 914, -1590, 740, 141, -743, -1985, -4946, 2214, 2016, -6892, -1841, 3356, 1430, -1357, -3675, 2952, 6664, -1828, -2522, 4007, 2113, 1721, -263, -2377, 2405, -514, -1509, 1552, -3057, -3866, 1687, -40, -1666, -1940, -2101]
254b101N436k942l217O824j808m362L516J674m55k705l912N935K312p026O18K91
270a922L53L627l732j235L061j914K564K579n095M48L543q1R13m459J06N649m040
287C65k735L672j442j145J58r35L237k023l129M880j44j850J997j413M33K151
303B077k158J469M11l407L263O85l170L88j341J944J478m708O68L793l049N44
319a113J376j683K062r45K51L357l405m38L279k062r0J068k776J726k86k161K483
336F43j571j780K724p57J73L06k286L144J746l780J568J308j243J810j380o65
352d0J994k278P77J195l641J025J622k392J669r65j088K984j451n42K485j640
368b86M52J318j718K195m83l029L027P3k321J708j645n62J499j654J267j86k862
$$ y = [-2101, 3335, 393, -2824, 4000, 2192, -2170, 1346, 3020, 2565, -140, -4052, 1883, 4195, -2831, -2213, -1922, -1569, 2058, -1674, -2909, 152, -1762, 802, 3381, -1714, -1266, 2277, 2196, 3109, -1350, -1244, 4405, 365, -2370, 1302, -140, -1285, -1127, -2062, 1175, -848, -3977, 903, 759, -1091, 906, -507, -74, 2077, -81, 1388, 1799, -1608, 1655, 2340, -830, -442, -1783, 161, 1639, -3069, -2401, 1392, -1657, -1113, 263, -1420, 642, -303, -52, 3305, -100, -538, 2741, 679, 589, 1657, -1119, 607, 321, -1840, 643, -928, -2708, 16, -741, -568, -262, -2548, 596, 2342, -1438, 130, 1438, 195, 2005, 625, -40, 1954, -324, 453, 1648, -1993, -968, 654, -1738, -69, -1034, -2122, 862, -589, -1131, 1354, -286, 166, 1484, -234, 1961, 1478, -1551, 1476, 1549, -772, 936, -709, -1271, 228, -1426, -159, -345, -3207]
385c207K893J300j922J232o89k78K962j369m61P61j964J721J209k706J364j582
401g36j178L140j428j508J180j164R85J416j978J297k78r48L213j036j707K369
417A639q18o86J082j351J145k0l106K149N15j424J128j693j106L336j085j19R73
434E59k390K217K069j840M98j270j030L542o97j640k33j837K171K258l562n22
450a707K46j43K784o77k106J367m29J047J764k432M35Q28j705K738j32k978J009
467i1L22l65M89j917J089J119l199J140K642j598L38j090l09L484r6j925j44q70
485i81K614J595l834%R40j816K257K24j953l94j196K466K755l635j499J314O28
502e15L563j096m280J700K295J81Mk561J35J596j499J181J97l315Q62J775m93
$$ y = [-3207, -314, 986, -936, 296, -393, -671, 2291, 922, 461, 1222, -742, 979, 2188, -518, 846, -736, -1914, 1226, -202, -1710, -530, -1694, -709, 707, -1271, 26, -252, -1200, 2013, 977, -730, 1639, 821, 135, 1217, -134, 1011, 991, -2115, 34, 549, -875, 253, -1440, -2546, 790, -295, -414, 559, -1831, 386, 2455, 615, 1113, -157, -1187, 2355, 1658, 18, -215, -2052, 119, 2377, -1185, -1707, -1461, -1604, 1180, 503, -1603, -236, -665, 382, 2146, -286, 149, 977, -728, 2010, 1878, -1100, -91, 231, -134, 355, -1562, -473, 646, -2553, -1413, 1229, -369, -31, -1121, -1430, 2054, 1958, 33, -111, -981, 1633, 3228, -606, -606, 334, -1482, 775, 999, -954, -1348, -2544, -78, 2677, -958, -2457, -1143, -515, 3048, 1952, -2328, -628, 1667, 1848, 1852, -709, -574, 1022, -477, 704, 901, -2414, -1552, 223, -270]
519b70N33j610j92K503j064r6J143j127Q91M24k148K334Q17k219k86q62K025J531
537B327l818q28K369p34P39qj358J227j099P46K814j832j764J210L73K380m46
554B298m260Q95K371J93p65k944K35L135j471o05J266j784N65J237p47J014k75
571C58q74J585p91K40J548k508q4J748j678K07O60j230L9j099J174K516k658j742
589b589K768J32O00p9k139J101J236l61J106j595j329J530l03Q77N56m351M70
606b370L380j05r19k206J20L326m0j554M89j523J685K218k111n78O45k22R65q81
624C19j149J629j626p37K366j164p58L52m66J571K08j586J488j9n21J184p95Q3
642C79P74j606O29J033j825N27J2p82J105p76k08J077j403j96J925n27j57k33
$$ y = [-270, 263, -1347, -1539, 964, -100, -196, 947, -180, 711, 1135, -1013, 1321, 2138, -81, -367, -1229, 796, 2327, -1491, -2319, 50, -684, 55, 47, -1311, -84, -1183, -437, 2377, 545, -1219, -9, 364, 2744, 2298, -1962, -1067, 1304, 1497, 732, -2212, -1977, 1158, -313, -918, 348, -1436, -871, 366, -381, 633, 358, -516, 1069, 278, 518, 2066, -442, -526, 1222, -456, -249, 411, -819, -780, -1879, -705, 1811, -847, -2589, 179, 311, 911, 832, -1307, -206, 1030, 669, 1775, 180, -1149, 381, 78, 955, 1511, -2840, -2370, 1010, 905, -14, -2220, -2100, 1226, 1186, -368, 121, -1402, 283, 2501, 390, -188, 457, 235, 1200, 319, -830, 799, -827, -1564, 802, -362, -1120, -768, -1234, 337, 545, -1041, 447, 428, -93, 1091, 296, 379, 1153, -453, 176, 1209, -616, -89, -77, -859, 246, -530, -738, 339, -1064, -1260, 665, 138, -19, -252]
660b52m24K212n75j519J725o22l17J283j725m90P57l98M02n26j128K162m14j538
678a387J461On9P83j374J000P07j289R18k7r02Q72n35n98J280j622l01J126n31
697d72J98J71r52Q37K48p67J561q18p96K109l03p21k48k79J183j63j732Q50L45
716B51q67O85q38l01J046r49N85P60j258R63O03j148J162k50n30J289j172O2J274
735A367j483k16O01n25M74o19r18J423l25n99R47n11PJ243j185O97q8o23J589
754A256n54r24O53k98k45N72j069K16O50j468P57N26r71P17k09Q1J064p54k37
773b37J132q55L03N24j171N75L01r11Q66m88q48J241q28j60M71q68Q71M58j319
792i43R78N51j138J124l36o3P70r85L97N13j180K84M72j003O53j99r69J082m81
$$ y = [-252, -676, 1536, 961, -558, 1167, 545, 228, 1511, -214, -704, 53, -345, 57, -469, -1597, 565, 151, -1387, 74, 80, 21, 804, -570, 430, 1137, -152, 766, 739, -163, 709, 174, -424, 856, -766, -1067, 59, -472, -274, -103, -1055, -218, 30, -737, 824, 6, -790, 1319, 1016, 295, 47, -232, 951, 788, -944, -94, 251, -616, 69, -769, -1070, -24, -973, -388, 372, -886, 77, 680, -468, 694, 444, -86, 1203, 31, 93, 1367, -116, -332, 269, -256, 218, -401, -1319, 104, -221, -820, 127, -384, -377, 866, -319, 378, 290, -333, 1256, 702, -222, 431, 133, -112, 460, -609, -393, 257, -1211, -454, 72, -899, -182, -391, -310, 754, 0, -237, 895, 40, 343, 867, -304, 271, 572, -339, 527, 39, -809, 432, -396, -556, -85, -953, -82, 376, -943, 35, 586, -552, 572, 236, 173, 943, -42, 355, 868, -312, -28, 444, -559, 94, -105, -1074, 8, -473]
811d73j76J165j134L24Q29p71N47M15p02R84l29j024J093o22k24N99r93K71L37
830A16j068R62Q9j033J121k31n62J038o04P8P82q18L05O47j025Q19k73p87J029
849E85o38o62R53p43j32O45o19O08J10o78R60j52o52J286p74j22Q16n41Q4L45
869F79j013L67J27q03O02r5m03O07o95R5R55r52M50N28o13O16j74l77P54m92m6
890A17O51q35j71J075j047J86P9p63O91j14n17O92n96K37O96n80K87P79j018N24
910C73K95m97M97l02q44R20o20j64O82j004J09P67p65M67Mm59R05k78r8Q01r50
931a61K74R04r89K59J11p38N93J26o40M30n73l96R15p13K05L33l91N94K41q47
951d63R42q4m09P43p73J51P26r11r5P12p20J91j74q82J123j59m99N85n83M9J155
$$ y = [-473, -649, 516, -618, -294, 535, -236, 311, 726, 24, 1008, 679, -345, 748, 126, -98, 501, -492, -221, 116, -952, 10, 99, -934, 187, -44, -606, 432, -172, -94, 688, -130, 175, 822, -203, 616, 343, -444, 585, -53, -715, 238, -505, -637, 8, -611, -3, 107, -571, 389, 237, -415, 871, 97, -25, 791, 250, 334, 679, -334, 33, 160, -643, -41, -136, -539, 68, -627, -532, 423, -529, -79, 449, -164, 452, 278, -99, 655, 163, 117, 768, -67, -238, 837, -210, -24, 55, -708, -17, -131, -648, 44, -552, -315, 381, -199, 88, 867, -151, 373, 668, 171, 668, 366, -478, 442, -178, -342, 340, -664, -555, 212, -553, -86, -82, -541, 364, 86, -12, 789, -161, 113, 1017, 28, 287, 398, -340, 253, 379, -261, 169, -404, -800, 115, -598, -393, -60, -451, 143, 384, -463, 479, 395, -14, 729, -44, 107, 833, -78, -173, 539, -181, 10, -164, -1046, 77, -82, -581, 4, -579, -530, 625]
972F25o26Q8K88n72P38J4o75P06o85j17Q63o44o17N30l70N09K22j067M39K08k93
993d36Q95m77m26R49l67o9O44q79L03J32n24Q03m34q50J145o43k76M07l79J72
1013c10L44o40L50L36k84Q97q29J30J008p42k72M76n12K57j06n18M94j45o17J161
1033D78p72n89Q67m5J8N10r02N07K66m24P41m96m89J083m44n02L90m62J98J02
1053C5o25N53o3p55P90rn99Q89k83j2Q73p47RL59n40M61k24n33O84n1o74M26k25
1076b61J2L63o44L99K46m98N35q3l29N27k14K40P5l45j27M72o73N27%r70R28p0
1098A10p79O26k73M9J15j00J88L28o01N12M42j014Q29P0m78M46l06j75K30l92
1118a73J63J06p97N71J02p52Q45J4l94M92m55L02N20p50M40K04o87N50L5l64L00
$$ y = [625, -1, 87, 375, -197, 541, 555, -120, 586, -99, -216, 647, 3, -614, -84, -454, 55, 277, -790, -351, -143, -436, 459, -18, -444, 505, 138, 69, 713, -166, 137, 269, -255, 548, 114, -736, 409, -234, -510, -103, -482, -310, 34, -606, -256, 80, -204, 693, -136, -6, 1002, 260, -12, 464, -48, 209, 103, -415, 79, -66, -683, 478, -294, -883, -16, -61, -43, 467, -435, 72, 338, -86, 655, 159, -330, 753, 309, -193, 197, -265, -67, 35, -590, -37, -100, -855, -65, -74, -673, 216, -67, -79, 794, 47, 56, 415, -125, 336, 112, -421, 263, 212, -462, -36, -261, -249, 114, -530, -131, 115, -383, 152, 69, -260, 267, 53, 293, 368, 23, -104, 368, -305, 222, 222, -748, 180, 110, -669, -43, -316, -267, -152, -252, -64, 264, -337, 175, 617, -397, 432, 502, 24, 470, 164, -11, 219, -173, -10, 96, -701, -130, -28, -780, 65, 79, -315, 177, -278, 24, 544, -206, 234, 438, -249, 301, 336, -28, 272]
1139B72k29k60K14k11J6K55q71O45L52n66L68K8l28O17q8l47N63n04L58Q1o08
1160b43N74m6p39P44m09m69O11l89K5M35n58K03L62l27K79K10k31K91j59k21O42
1181E85n46RL49o91K13L37o72M54j54m53O13k67j07N10k47O0L96k73J42Q0m36
1202i8M26j19l84M68m04N1K21m64K7M73p15J86L42l35N08k81j55M32k85R8N29
1223E21n11J52K76m84K29R9n67M86k28l38L21l70R3J79l96M68K35m36K35K83p8
1244A69M16m08q6L53n61K88K18o91M20J8l66K50l35j55K83j19n6N13l34K74K07
1265B98m39N86k05l38M54j46k21K92m30O1K51o53L49K7l70M40M5m23L46J11k25
1286a90M86l95J74K44k69L44J61n97J46J09l45L56l26k53M27m31L3J83k74L29
$$ y = [272, 43, -217, -3, -214, -198, 57, -814, -169, 183, -383, -15, 13, -315, 302, 214, -133, 430, -74, 284, 365, -243, 331, 285, -454, 290, -119, -588, 23, -366, -341, 94, -464, -261, 101, -226, 53, 263, 32, 323, 164, -57, 585, 39, 48, 397, -294, -81, 256, -416, 38, -116, -569, 44, -223, -330, 180, -67, -7, 389, 116, 258, 338, -98, 328, 209, -175, 293, -111, -60, 161, -303, -276, 197, -518, -332, 10, -325, 183, -98, -253, 179, -106, -8, 521, 10, 162, 438, -46, 183, 282, -285, 201, -27, -365, -44, -414, -321, -142, -538, -70, 165, -271, -36, 247, 169, 585, 177, 91, 444, -117, 171, 389, -302, 118, 136, -230, 20, -315, -470, -187, -306, -362, 151, -183, 91, 298, -141, 445, 240, -98, 356, 210, -11, 281, -149, -88, 163, -490, -141, -114, -484, -44, 1, -422, -76, 35, -190, 296, -99, 75, 319, 50, 394, 555, -42, 104, 213, -132, 224, -102, -355, 72, -359, -326, -143, -417, -88]
1306h8J83k71L35k30P5L06j06MK01l86j32K91m12L52Kl83K59j96m9K42k79J80
1328a02K45l06J26L07m65L46J85j94R8ql57L36k24k24L30n04M58O2n49L53j08
1349a95l65O01p7j27L24l77K69L66l10n6K23j02R4j45j91J11r7j29J96k05J38
1370e4n4k74N73k02p0M22k49r6M82m77K12K1k34K97j59j90J04q0l5lk61R6J50
1393h1q1J43k20K6J73L94o35L91J29j62O4Q5k45L88n43n3M67n25L70j93j29J46
1415i1k5l99O14j48J64J97m78K94Q3k97L55j30k29J87o5j37Q6j12O8K40l69K00
1437Hj02j56J81Q2k95N92j15k38R1R6P2j61k21L10J08l67K23k15J19J08k18m4
1459a42J34k37N2L57l31J69L06n46M38O1k2j80k42J41J96j48Q5J31m10L02ql37
$$ y = [-88, 95, -176, 159, -71, 4, 310, 204, 208, 409, 23, -109, 182, -230, 122, 124, -259, 0, -196, -245, -3, -282, -102, 143, -163, -37, 270, -195, 151, 336, 142, 240, 232, -125, 211, -13, -237, 93, -411, 47, 109, -440, -87, -195, -560, 41, -36, -163, 161, -216, 53, 419, 109, 53, 276, 174, 268, 123, -68, 43, -54, -183, 13, -192, -54, -108, -382, 191, -11, -81, 341, 92, -4, 478, 1, 213, 234, 0, 297, 138, -52, 52, -28, -63, -66, -327, -231, -81, -162, -19, -239, -213, -40, 354, -281, 110, 239, 77, 141, 226, -19, 369, -174, -227, 240, -285, 85, -108, -237, -91, -116, -515, 99, -49, 115, 312, -166, 128, 211, -86, 269, 139, -90, 97, 32, -105, -19, -131, -63, 177, -192, 8, -94, -250, -69, 13, -282, 310, 195, -43, 48, 144, 216, 55, -166, 144, 252, -115, 108, -107, 12, 120, -98, -142, -8, -245, -193, 164, -167, 2, 308, -238, 200, 261, 239, 59, -183, -42, 154, 6, 91, 222, -188, 114, 106, -231]
1481b31J01J02l9K11k20J60N0r7K19m3k3N0k08J26K16k86m0r3J3r2J65m11L76
1504Fl6n2j1j06n7M66j80K18J19k66R1R1l09K4R4k18P6l8J84J7k70p9L40l08K13
1529IR8j67P9L10k79M29m68J08J9m5Mj28j83L00l9k03j45J19p3J14J89l8J06k89
1553a73J5L97k38K13p7l32K91n2M5J91j34k17J59j19k2j50p8K34j01M2P1j47N5
1576a27L59o7j53J58p3j29J32pLj97Q3J41J1l44K41k93K10J57j96M7m8J30o3o
1600c1N1J08j42j6L34k84J06l1l71N90l68m3L96l69Q9m8j02l6K45k35L6J78j5
1623D2J19J05l60L79k16J00%j87J46j77O7j47J35j48N5j77n3L26m03K53o1K00
1645bo7J64j19K70j48j50L30k19j02J70k51MJ20l70K96J46k15J90j18j74K24q3
$$ y = [-231, -130, -28, -67, 144, -76, 84, 134, 37, 256, 213, 190, 240, 32, 158, 374, 88, 48, -45, -32, -124, 41, -370, 6, -30, -82, -93, -199, -256, 210, 30, 248, 367, 101, 192, 283, -26, -2, 92, -126, -50, -88, 96, 113, -157, -236, 104, -204, 9, 107, -60, 19, 329, 50, 479, 11, 119, 138, 93, 97, -31, -214, 86, 47, -156, -301, -182, -255, -141, 48, 10, 116, -173, -158, 239, 1, 214, 137, -195, 96, 44, 89, 280, 146, -71, 88, -31, -53, -203, -281, -47, -148, -106, -35, -182, -127, 232, 165, 12, 170, 97, -32, 100, 93, 96, -101, -18, 123, 134, -210, 31, -262, -52, 105, -91, -44, -92, 38, -25, -31, 20, 128, -14, -30, 304, 20, 126, 95, -276, 314, -54, -97, 299, -70, 19, -29, -131, -167, 78, -157, -121, 57, 42, 161, 266, -94, 285, 69, 169, 169, -18, 128, -49, 18, -129, 6, -142, -87, -264, -317, 9, -394, -141, -202, -2, -69, 95, -24, 246, 98, -52, 278, 59, -43, 127, -124, -120, 0, -370, -74, 72, -143, 47, -71, -245, -21, -104]
1667a04N3P5q3J20j78J66J36j18j0K0qk99K50l82L58J0j34R2k0k16K88qj37K01
1691G2k7m2K95n37J41K79k78n3L06n5l4p9k46J69O1MJ25J6k49J80%l0J08k04K13
1716A35J22k61K9R2Q2o5k32J01R2l14K06ok01J24j18J87l6J86l1j14n9J69M7j54
1740a9J09k44M2J96j00j42K36k74J02J39k65N49l42k32K39J23k13K91j85j54L62
1761B18j29J04j68J36K0L7j81q3J01K6J23m08K4O1J58J15k03k17L77j32n1K74
1783B02r6o6L4r2Q9J8j05J61o3k81J0J2J65N2P7j96J78j7k24K35o7m7L10l67K00
1808A22K4j88J67k92L90l26J6n2K09qj1j77P6n7J66l05M27k32J54J61j88Q4J66
1831C26k26j06J53l60M05m23K68Qj71j3K83k28j4L01j63p6J07l32K91l5O8j15
$$ y = [-104, -51, 24, -59, 61, -117, 49, 185, 67, 57, 77, 69, -230, 20, -362, -4, 6, -128, -36, -56, -272, 16, 8, -129, 72, 45, 3, 298, -239, -98, 181, -97, -150, 156, 101, 67, -12, -258, -89, -28, -24, 101, 117, -132, 48, 48, 18, 126, -78, 135, 257, -4, 25, 117, 199, 134, -98, 3, 95, -219, -13, -19, -220, -96, -214, -27, -63, 123, 92, -22, -81, 88, 135, -19, 90, -154, -112, 84, -16, -158, 78, -196, -94, 45, -220, 329, -13, -245, -6, 117, -96, 195, 10, -144, 218, 89, 193, 25, 161, 181, 218, 37, -46, 55, 81, 204, -204, -180, -119, 39, 154, -49, -266, 111, -21, -72, 202, 106, 40, 74, -18, 71, 89, -16, 145, 82, -199, -189, -177, -12, 40, 117, -79, 99, 82, -142, 93, 26, -21, 289, -78, 122, 146, -42, 125, -167, 223, -103, -87, -139, 70, 62, 51, -126, -50, -107, 59, -246, 181, -51, 103, 264, 76, 160, 326, 100, -6, 147, -213, 192, -231, 37, 45, -126, -139, 144, -84, -98, 203, 40, -36, 71, -261, 30, -5, 63, -52]
1853e2o4N8j31J76%K7r7O5k12J96K91k30k43M15j65K32l54J7J42J64m0k47J25
1876G3j22L10m19r9J99m4J82p9R8l19K34m70L63K22r0P8J16k60Q9j98K11j00j48
1899a73J47J17l51L06n3q4J45j95J5N8j0J1K48k69K11k51K59L4k98K93n9r0j11
1922a00J63o2J10J00j92o8n4J53j30J24k04K36J2N1j55J9R2Oj6p9L0l0j45K11
1946G2j16J63j92J2K54m31K64j07j60M12j24k52K40L7M4k42Q1K9O8n2L5l3j67
1969a65M49k55k0k03J29m0J1k07K80J94j84O4j3MJ05q7N0Q3k45Q4o0q1J00q9j32
1994b28K30l5o7p5K38l5j6j66K28j37J50O5j23jk4q2R6J55j84J9j47J28j4j85
2018b10N9J04O4k3j8O5j90J36P2jj79N8J45j08R5m2j57OK69k61p4M2P9r0J55j1
$$ y = [-52, -116, -58, -189, -13, -13, 14, -83, -18, -230, -34, 257, 27, -216, 199, 34, 266, -88, -71, 71, 235, 195, -52, 73, -49, 261, -158, -257, -58, -102, 80, 1, 99, -220, 14, -456, -93, 129, 39, 117, 233, -27, 62, -136, 75, -25, -173, -26, 91, -260, 46, -7, -91, 54, -141, -126, -68, -78, -67, 181, -88, 123, -128, 131, 165, -133, 160, 101, 11, -100, 63, 1, 111, 211, 19, -49, -103, 50, -80, 44, -160, 76, 88, 139, -16, 3, 95, 101, 85, 6, 36, 6, -139, 72, -44, 119, -73, -61, 193, -238, 26, -81, -241, 171, 47, -205, 35, 72, 116, -126, -45, -16, 52, 0, 35, 2, -165, 284, 29, 9, -194, -65, -105, -94, -301, -21, 173, -11, 53, 40, 44, 149, 62, 112, 195, -50, 34, -26, -107, -7, -96, -228, 2, -33, -100, -175, 63, 28, 12, -154, 74, -63, 87, 152, 29, 28, 4, -78, 18, 173, -11, 8, -139, -11, -25, -210, -151, -47, 17, -6, -24, 41, -149, -13, 59, 58, -121, -63, 82, -26, 69, 27, -130, -124, 145, -116, -190, -148, -69, -159, -4, -15]
2044a5%o7k11N09m6k01P7l6Q4K9k38L02J2l64K78l71K15k31K22m8j1KJ64k9j93
2069a67J34K28k12K46k31o5l9M7J97k56J64p0J07k60L59n4j54m3m5k9P5P3K16
2092B21l00n4J42p0k7O8J4m3l9k8J33M6q8K1l0J03m2r7M0p9J62q1J80k31j36K60
2118D5q0r0J13P2j54K95k89q2J78k0K31p6j93K2L5OK24m27K38l8m8j1J35k42J33
2143b3j0M9P2j35J88k35J91l30L10j90J89n8k0k90J94R1l0J44l80K02J50J05l6
2166A48k42K21k05n8M12k63J25j53j67K95j32l8N2J62j33j9n8N0j41K32j1L5k20
2189a08K16n3R2k59R0l9p9J33m8p1R4R1O9q7J1L3k19K63m7kQ0j18o6J78m3o6k05
2216a60K73l4k02J59mj5q5K66l68L51k56J74j11p8JJ75mj08O4l5N4j09o7O2K9
$$ y = [-15, -15, -82, -293, 216, 170, -31, 46, 10, 94, 123, -115, 187, 199, -165, 113, -258, -43, -274, -52, -100, -111, -109, 55, 26, -167, -33, 195, -17, 229, -2, -67, -106, -59, 138, -118, 46, -24, 83, -177, 182, 128, -26, -69, -114, -143, -68, 5, 221, -79, -133, 9, -61, -88, -20, -6, -49, -88, -116, 17, 63, -25, -4, -34, 69, 27, -70, -30, -109, 53, -28, 152, -79, -215, 45, -35, -125, -12, 60, -94, 201, -88, -170, 8, -12, 219, 143, -50, -28, 7, 13, 237, -190, 48, 10, -38, -49, 86, -156, -23, -33, 16, 88, -47, 141, -94, 97, -233, 77, -113, 76, 18, -2, -292, -98, -7, -37, 107, -273, -71, 79, 184, 148, -94, 127, -78, -136, 276, 13, 138, -15, -182, 113, -19, -57, -5, 157, 24, 5, -53, -3, -144, 88, 77, 112, -108, 108, 55, 147, -112, -22, -61, -140, -7, -55, -126, -32, 59, 128, 41, 52, 85, -134, 129, 82, 80, 160, 42, -24, 154, 111, 45, -160, 113, 79, -123, 36, 32, 17, -68, 198, -170, 181, -75, 99, -12, -90, -89, 86, 82, -26, 38, 3, 57, -52, -119, -57, -28]
2241b8l2K81k32p8K24j70j66J84R9j6M9k8J14j68j42K57k01j35K23j78n5K18J77
2264A97k44J22j41m5Q5J14J32k58Mm6J77k6N2k35n1K06P8j46K8N7J22l27K55j12
2288bj72K31J3m4o4n4L93k34k18J18K52k19K07n0k15K32l66R4J24RR0L8k57K16
2312A22p9l26M30j64k64M65j21j34K72k30l0j01M7r1J3J10J33j81O6o0K33j69
2334e9P5n3%N0P4p4P4j58k2K80j78j0J17n3j29J77j98J65j37KJ28J0j03Q3Jr6
2360c4Mj80J97P9p0K00j24J36k55p6J7K53l6j73J19m0q8K08j83J70l33J11J33
2383C5R9o0K44m00J96K2k56L16k41L3J62k08JK91r5k26K5N8j8J4j19J46o6k8K12
2408A37l53K57p5l0J16O7j05L6k2kK5j09j49l5N03k68N4k35L26l29J71L8J83k35
$$ y = [-28, -60, 221, -11, -89, 135, -35, -201, -17, 82, 66, 115, 87, 201, 33, -109, 148, -53, -188, 35, -143, -198, 20, 197, -47, 75, -66, -111, -26, 88, 220, -38, -34, -80, 97, 71, 123, -112, -163, 43, 121, -25, 3, 60, 182, -145, 110, -2, -174, 57, 70, 26, -38, -92, 301, 67, -151, -33, 219, 0, 207, 157, -58, 174, -192, -98, 26, 35, 125, 163, -94, 122, 43, -283, 147, -17, -281, 184, 63, -71, 201, -29, -59, -160, -113, -204, -191, -81, 52, -129, -63, -123, 110, -59, 16, -37, -37, 13, 87, 13, 87, -71, -93, 187, 9, -1, 116, 63, -66, 111, -87, 78, -59, -57, 71, 81, -22, 61, 62, -34, -30, -210, -13, 66, -4, 196, 72, 208, -47, -123, -106, 147, 111, -62, 57, 17, -71, 137, -46, 124, -209, -98, 35, 134, 74, 318, -82, 114, 136, -120, 196, -45, -12, 150, -58, -57, 234, 139, -87, -62, -4, -22, -8, -127, 19, -47, -75, 137, -216, 41, -34, -64, 52, 119, 14, 50, 28, 26, 51, -58, -207, -242, 261, -7, 47, -188, 138, -191, -20, 18, 201, -34]
2432c4K52l24L17k83M9Q0k73J20N0P7j65K21j28P1K5J16k83Q6P2q2q3J51Q0m3
2456F9pj82M7q1J57J4N1k02Q5J13j17k49K96O2N7P3Mj81K37o9j9j82J59o4k40
2481a69K12J5m3q5J22q9l3J01L8k92L00J2j11m0m8Q5M9k4J79J3m7j38J12j65R5
2506D9l30L04q9J62lk59Q1O3J80O9j06j91M3j17K87k38K63q2k19J16j17O2J13
2529D1J16j12p6J88m30L74j81QM6K17k96K9R8l0n4J87J3n3J99m55J12K48j21j31
2553f3Q7jl1j07J14Q3m3k36K49j24M3K06l08P6J55p6j31o0M16k37j13J53m7R6
2577A01j52l7K08l8p1P2j50LJ88Nj71K32j26j26K97l80J47o5k05L18K52n05K42
2600C9j59N4j73K28j32J80O8j11l6%j00K9J84j40J07k22N2J25K5J02j82J4N1O2
$$ y = [-34, 218, -106, 211, -72, -23, 57, -216, -96, -46, 31, -134, 87, -41, 30, 55, 171, -112, -26, 46, -36, -119, 32, 112, 69, 62, -120, -73, -154, 3, 17, 68, -134, -49, 64, -53, -302, -6, 56, 113, 186, 190, 9, 246, 177, 158, -24, 135, 71, -169, 43, 58, 15, -70, 52, -37, -70, 31, 69, -223, 77, 89, -22, -62, -110, -25, 24, 0, 179, 192, 145, 7, 119, -46, 49, -281, 23, -66, 96, 93, -166, -85, -22, 158, 227, 121, -70, -27, -144, 143, -95, 168, 86, -133, -17, -134, -72, 41, 157, 45, -31, 157, -273, 101, -80, -72, -26, 191, -105, -76, 22, -8, -62, 125, 138, 85, 284, -171, -59, 189, 68, -63, 24, 23, -8, -115, -1, 82, 39, -197, 52, -72, -29, 177, -131, -55, 100, 24, -107, -167, 249, 12, -101, 52, 5, 101, -51, -88, 120, 82, 11, 83, -67, -64, 124, 129, -42, 190, 64, -62, 235, -145, 2, -63, -268, 50, 302, -203, 39, -120, -66, -239, -11, -143, 37, 105, -6, -42, -42, -142, -113, 71, -69, 38, -184, -132, -7, 18, 120, -62, -48, 3, 65]
2624F5j71K98j49J63j66R5k32K47r6j11k7J7Q8p1J30k40k2K71N0l07l5L48r7l31
2648b83M23Pn9j73LJ25N0j30J40q7q1O6K10j75oj33m2K26O5j58j72J33r3K80j43
2673gM6K35l55J60j30J14J8q4J03Q3j1k45J94j82P0oN1lJ12j37p0j47J27K15l23
2698a72K8K28j14m3J80j81J31J45j87j67J99J76j11o3l9j69L5j54K82J27j85J44
2720I0j75K13k80K72o8j8o0k49L00j19L07k20J51K8j20j07p6k9Q9J78q2j35J63
2743E3k2J14r5j7L2J53q8q9LJ40k2k13J49o0q0O1k07L17j76Q6q1j8L10k24M8k9
2769D5j44m3J19n1O0K1lK3K8p9j9P5LN5k09O0J35j03J98l04J55k18J84Kj94P0
2795a34O9J83j34J5J07r8J07j79Q8q3K23j73j12Q0J9Nn3J39m8M6Q6j25Q0k3j82
$$ y = [65, -106, 192, 43, 206, 40, 135, -97, 150, 54, -57, -84, -67, 21, -50, 80, -160, -182, 89, 139, -168, -203, 145, 48, -283, 140, 147, 88, -85, -82, 43, 93, -37, 103, 16, -65, 1, 211, 36, 30, -103, -145, 81, 146, -12, -184, -51, -144, 136, -7, 39, 274, -81, 79, -51, 63, 81, -3, 100, 183, 172, -73, 121, -61, 9, 3, 54, 51, 163, 26, -44, -191, -64, 151, -172, -144, 84, -30, -73, 107, -74, 57, 202, 15, -152, 47, 223, 112, 49, 10, -159, -124, -278, 4, 131, -54, 90, -85, 128, -152, 120, 52, 34, -26, -275, 25, -94, 213, -7, 144, 172, 52, -55, -131, -160, -71, 107, 25, -110, 53, 31, 145, 50, 33, 65, 218, 130, 41, 44, 184, 162, -51, 98, 38, -42, 19, -188, 129, -47, 39, -42, -60, 250, 26, 74, 45, -99, -142, -23, -74, -14, 7, 4, 27, 55, -24, -43, 32, 35, 90, -119, -59, 76, -27, 171, -133, 22, -196, -12, -10, -204, -134, -65, 118, -16, -1, 106, 8, 115, -64, 24, -59, 164, -9, -121, -41, -22, -17, -70, 69, 21, 67, 153, 28, 108, 85, -97]
2820i7N7O3n3l1J2lJ25j79J59m3J00M6l6k32J41j11K05Pj36j03J40l3M9P2j38
2845a9O6qj14mL7N4J14j50o5K3J49k0J12k33L3qP1k4J40k60J00j26O2j36K26j43
2871a23M7P6j7J14R9j82L1j63K17j72K70k17J03p1k13L17k39J84j58K03j97J27
2893C6j05J00J2Jj71J07Mj8j3J39l36L03qj92L18l76L01j69J05l9k62J55J24r7
2917h1K84O2m49L33j18j82m0J60J73j28J11k55L24k98l9N3pK6J79R9k59J77j57
2940c2K40j18J25j90j75L8N6K25j82M5k19J89k03L13p2K8M8j65N0J63j15q7N7
2963A9m2j08J51J03j49N7J14l52L17j11q8L2Q2R8q2J70k38P3j97J69J15q5k19
2986a71L51q7j98K12j76J10k34R0M6j39K50r1k2J41j5L3l10L5M02j25j37J07M1
$$ y = [-97, -40, 23, -30, -61, -49, -52, 73, -106, 53, 10, 110, 156, 120, -112, 29, -82, 123, 130, -6, -109, 31, -2, 47, 119, -19, 47, 39, -75, -79, -42, 12, 126, -24, -89, -66, 83, 63, 175, -58, -25, -33, 38, 14, 154, -106, -6, -132, -70, -206, 20, -123, -76, 0, -17, 97, 196, 14, 45, -118, 99, -73, 197, -20, 83, 12, -201, 116, -123, 61, -97, 106, -91, 36, -69, 31, 43, 44, -127, -20, -16, -34, -47, 92, -244, 59, 51, -141, 177, -199, 102, -67, 38, -1, -263, -108, 16, -81, 203, 265, -184, 149, 31, -151, -191, -31, 142, 14, 125, -130, 194, -104, -143, -90, -97, -71, 108, 207, -52, 125, -32, 208, 90, 215, 25, -150, -112, -56, 169, -13, 32, -187, 2, -201, 112, 40, 68, 116, -49, 1, 164, 49, -38, 19, -23, -131, 20, 123, -26, 31, 145, -207, 110, -1, -89, -57, 25, 123, 41, 211, -27, 46, -151, 18, 133, 48, -171, 180, 93, -105, 107, -69, 41, -193, -103, -57, -196, 54, -37, -59, 82, 67, 100, -210, -175, 227, 102, -35, 72, 113]
3009A13o8J29j41k6L4j97k0n3%K05p2q3L46r9j87M4L31j37r1k48L33J0j12J77
3033A88n9j64j28J06R2n8l4J31M3n1q2j72K74n6J03J4j07LK6L6j20J79j69J78
3057A73n7O4k38N2l8J21p0j5J01k03k5J33J81j96p9Q3j65J97N7j73R4p1j84L70
3081A12j67J40k26N1p5J18k2J90j11L5P2k14L50k28l6j64J85m5K7M2Q4j73N5k34
3105b34L44q5K81m62J71J60n6k54J12k5L72l13Mq4M0l6J44k75K48R7M4J4k83L19
3129B43j71m3J30K0m51L40k51K71o6o5Pr4J91k33L42J55j21l37K14J12l01Q0J3
3152a5p7J07j9J1j19Q1Kj8J14k9l3P7l07K25k43M55j34N3k33J71L8o6K8Kq6J04
3178H9k01J21n1Q7p5L1K55j58J3N8j60j56j67L30J00j68j9J24j81L15j53j84J67
$$ y = [113, 45, 174, 33, 7, 41, -156, -176, -229, -229, -24, -96, -179, 167, 68, -119, -75, 256, 119, 28, -220, 113, 123, 11, 188, 129, -35, -163, -57, 35, -23, -57, 74, 117, 66, -16, -188, 86, 30, 133, 147, 40, 43, 69, 105, -15, 164, -5, 173, 116, 180, -58, -6, -44, 77, 7, -8, 93, -110, -135, -2, 179, -17, -96, -13, -178, 19, 76, -97, -3, -74, -258, 112, -55, 85, -141, -90, -165, -47, -69, 121, 10, 45, 117, -97, 253, 25, -11, -175, 10, -35, -8, 34, 118, -55, 0, -234, 110, 25, 306, -156, 15, 175, 119, -135, -23, -48, 324, 11, 15, -69, -29, -65, 79, -196, 52, 149, 193, 207, -76, 243, 72, 29, 159, 179, -272, 68, -183, 88, 22, -43, -36, -130, 61, -172, 170, 325, 204, -133, 81, 193, -108, -28, -15, -92, 15, -4, 7, -112, -31, -29, -47, 67, 38, 5, 82, -225, 0, -243, 212, 78, 131, -102, 69, 107, 41, 69, 71, -15, 89, -112, 9, -42, 45, -30, 1, 256, 98, 111, 169, 9, -147, -314, 16, 116, -52, -71, 53, -128, 187, 34, -150, 17]
3201A7j28R3pl6m0N7K67j77L7m5k48R4J81kk41K30qn2M1Q0j70J32k63N3L35j82
3227A8r0J70J21l32J53L2l57J67K13j2m5K9j67P5O7N8l04L57k16L9j23K34k25
3250a38N1J57j65J76J10q7J06j96j9K9J66j17k38J22m6L0r0J3O0j1J06Oj37K92
3274A80k33J83j43K12m03J61n6K71j71N3k00M3J03k84J39J60q3N1J02j57K44k06
3296c4O4j07J97j32R4K3J85n64R2K06K0j6k9j30R9LO4j54J31N1k13K39J23j02
3320A10p2R1k85K80k3l03J34R8J06k26L5l9K64k96J61m8j9r7L08j37J24j78k04
3343b16L32p5r2J14k69J80j74K06J78k19R4j4k3j15k4J76n3q3J72p6j15J15Pj19
3367i3K49nj72K60l58K36k29J36r9rP2L6j43J20j77L08k96K62oO1j82J20N3j89
$$ y = [17, -111, -18, -25, -61, -101, -44, 223, 46, 83, 38, -210, -116, 65, 63, -178, 52, 44, -8, 33, 113, -57, 75, -188, -135, 200, 18, -72, 98, 219, -113, 40, 72, -285, -118, 95, 83, 38, 67, -100, -25, 42, 100, -204, 153, -63, -24, -147, 87, -138, -87, 70, -95, 81, 191, 104, 210, 14, -5, 24, 190, 73, -165, -43, -89, -59, -149, -136, -76, -87, 19, 25, -112, 180, -53, 130, -13, 199, -204, -43, -99, 172, 1, 54, -146, -103, 0, -284, -145, 15, -68, -17, 85, -72, 172, -34, 30, -77, 120, -12, 82, 105, 290, -274, -182, 24, 44, 28, -1, -131, -32, -29, 35, -119, 12, 63, -150, 89, 212, 110, 38, 129, -156, 124, 101, -202, -68, 30, 136, -90, -55, -94, 170, -126, 35, -13, -32, -129, 179, 42, 166, -12, -216, 116, 41, -51, 63, -206, -26, -200, 6, 184, -35, 59, 45, 22, -93, -117, 59, 6, -77, 95, 19, -96, 19, 26, -93, 156, 151, -21, 239, -119, 117, -112, 24, -75, -84, -12, 24, -119, 1, -176, 132, -164, 98, 92, 153, -29, 91, 144, -45]
3391d5J23P3j92K37j75r4J46P6k74L2q5K04n3J1J66l63L22q0M3k72L18k03J85
3414A00r1j3o4k3J90j75N5O2K0k5j84K25r4j4k09M25k43J7Q3j6O1q7j44m0L6J50
3440Bk66M31j86J55k87MR7R7J00N8k03j15O6J10Q8K3p5q8K2j32J4K19l3m27L32
3465Fr7K39k45R3MNK70l82J75j41M13k77j53J08j01K18p0n3K2Kr8N3j33K4M8J94
3491A24k12N8J93k37Mj4J02j5Q7m1qk69J69k15L16J48l0j44j8%j09K84l4J4k75
3516a22k0J11LJ02q0J13J38j77k91K97k4j68N1P8k52J72r7j2M2j72N1J34L74l07
3540e6j5m5J62Jn6p1M0J45P5k76J63k94K30k7j58K28r0j45K14m8P5j23j8J19k00
3565a70K29J56l18P3J23j50J94k69kK40N7k43J16J09j41p5j38J82K58j31k38N0
$$ y = [-45, 78, 151, -41, 196, 21, -73, 73, 149, -125, -93, -178, 26, -27, -16, 150, -213, 109, 29, 72, -200, 118, -85, 100, 9, -4, -68, -91, 99, -76, -21, 41, 61, 36, -148, 77, -17, -31, -240, 185, -58, -41, 42, 26, 87, 0, -144, -184, -148, 2, -264, 167, -19, 136, -151, -147, -50, 47, 147, 205, 2, -113, -47, 63, 151, 174, 99, 11, 33, -99, -85, 134, 101, -326, 6, -91, 148, -97, -4, 0, 5, 275, -107, 68, -73, 340, 63, -90, 18, -83, 135, 65, 12, 34, 36, -62, -9, -142, -118, -70, 124, -88, -30, 163, -74, -70, -84, 18, 3, 90, 49, 41, -228, -59, -274, 42, 190, 160, 16, -2, -2, -111, 173, 139, 153, -122, -142, -31, -28, 74, -6, 107, 245, 68, -223, 74, 50, -118, -67, 11, -241, -69, -166, -178, -136, -308, -257, -123, 251, -56, -71, -116, 46, 47, -9, -80, -40, 105, 180, -96, 67, -227, 3, -24, -182, 46, -44, -189, 25, -23, 52, -71, -89, 30, -170, 59, 215, -103, -30, 93, -57, 137, -132, -134, 106, 163, -80, 36, 145, 4, -71, -209, -27, 231, 100, -138, -88]
3587h8J48N6q5k10L12j18j99K06L7J4n9J91j98o7RJ94o6P3pk2L7k22J42m9m5k2
3613c8R9j41N3L8j74k0K18j08J64k38K08j88K37l8j60MJ64l95M78j84m8q8K68
3636A11J3k4J03l18N8j8P6j1m7p2K75k88L7J82l8O9J2k7j90K46l36K67J35k92
3660g7K46k30J13q0j45J83J07m9j38O9j55J54j63K87l7p3Q4O0j00J47j96k0K03
3683A90j85m8J39q4p0k09K94j85K8r2J51K03L4l20J69L4J24r9j47PLR1J3j44J01
3708bM6L6j31N6L5k31J85K10r6k61J31l2J62R0j89J92q9p6j60P0k4k39L62k53
3732b08K66j88J69Kk34O8J77J2l2K1j12o1J99m8j30N2R9J6K4N0j48N3j16MO7o3
3758f1J45k30J05N2k06L51k83J79j50k8K8J72j34m7P9J41L1j98N2OP7j22QO2j05
$$ y = [-88, 60, 116, 31, -179, 133, 15, -184, 22, 59, 73, 14, 205, 7, -60, -51, 143, 77, 150, 143, 121, 158, -64, 78, 29, -16, -38, 61, -80, -27, 11, -163, -183, 35, -73, 91, -147, 61, -127, 110, 72, -88, -84, 80, -315, 163, -21, -69, -157, 111, 124, 100, 203, -115, -57, -75, 1, -10, -57, -129, 146, -142, -105, 77, 39, 108, 120, 93, -97, 149, -187, 80, 215, -77, 169, -61, 52, -28, -173, 10, 117, 68, -70, -1, -156, -2, -165, 122, 85, 12, 96, 156, 56, 203, 7, -13, 190, 5, -43, 96, 12, -58, -267, 27, -158, -130, -222, -71, 132, 166, -154, 15, 49, 173, 74, -73, -66, -63, 28, 41, -103, -2, 44, 80, -51, 5, 40, -191, -6, 204, 108, -153, -22, -54, 108, 198, 9, 201, 112, 36, -124, -54, -78, -317, 45, -208, 58, -130, 39, 41, -193, -125, 52, 64, 32, 53, -59, -120, 79, 31, -99, -47, 52, 68, 92, 142, -6, 47, -69, -65, 2, -61, 84, -146, -41, 11, -195, 156, -127, 52, -98, -126, -98, 74, -60, -107, -28, 113, 144, -54, -2, 4, 81, -41, -33, 29, -76]
3783g6K52k16J26O6j79Q8r8n0K30l01J8P9j52J74O7r5J51j83K7J5N5j8L7J08j32
3808gL9K22q0l18L98n54L16l0j8N0j65J99m6j8j3N7pl7J02k9l6n7P2nj43K69j91
3835c0k5M2J4J04N7k70J27m8K8j7Q7n9k72K07J47J34k16J03K4o5j66J59q5k1l3
3860g4J85j42J9K8k4Q9k22K35k72O4l1JK65P0l37J06K57k49J8pl16M22j86m7J88
3885D0J16j1j22j43J7R8J80p0Lj84M9j88J99K19r1L8M6j85k13L38j83J40r3O8
3909F8j22k02L81p8j38o2J74Q3k13K66k76N2m0L22k57j27L36J12n15K56n7o0J16
3932A9N0j79m4K7j7p5K91k06J63j3o0J7p3R7l4j03K36k87J81M1l5J33j10j21J39
3957C7k65M34l58J82l31M08rj01J03j19r3J54j5J07j44j08L47k90J91q9l0L0J2
$$ y = [-76, 176, -40, 86, 152, -27, 61, -37, -87, 143, -158, -140, -61, -213, -39, 28, -67, 84, -99, -72, -57, -2, -20, 17, 125, -7, 32, 254, 174, -144, 254, -300, 16, -14, -32, 18, -147, 52, 6, -12, -25, 32, 25, -12, 90, 61, 25, -32, 40, 35, -108, 161, -30, -55, -13, 1, 105, 162, -108, 19, -29, -1, -18, 69, 10, -262, -55, 92, 226, 10, 113, 137, 72, -94, 65, -20, -41, -74, 111, -31, -12, 16, -8, 81, -141, 94, -178, -114, -145, -144, 121, 191, -146, -40, 217, -32, -14, -21, -337, 85, -101, -148, 40, 156, 145, 23, -120, -103, -5, 175, 105, 108, -76, -27, -215, -16, 203, 112, 150, 196, 11, -202, 136, -47, 93, 0, 68, -54, -256, 125, 47, -91, -153, 21, 104, -109, 157, -119, -67, -107, 215, -42, -169, 167, 279, -236, 20, -37, -97, 19, 69, -110, -154, -127, -144, -219, 72, -134, 29, 16, -44, -27, -100, -3, -37, -140, 96, -191, -10, 31, -4, 129, 19, -102, 37, -228, 206, -152, 30, -301, 107, 98, -3, 100, -19, -112, 42, 27, 134, -10, -118, 229, -61, 130, 41, 11, 41, 53]
3980E3m9K8Q6o3j25q5L6K86k56J15m4j90N10l40J02j02j9j71J42Jj12K42r6N4
4004CJ25k45L0J59J67l45P2R3R8r1J42q2k86Q6R8J66k00q5L5nL3l19M22j8r5N9
4030A7J65j67j68Q4J60l9q6J01k0j75L80j73J24k44l9J37M5j9j40J34j98K81j74
4053a4J43k01pJ01N7N8j69O1j73O8L32l38Q6j16j10L29q0j91J20j30n8K64m7R5
4077H0j31j1j35J92j5R2p9j40J26pQ1j09K76k23j36L7J33Lk67J37P7K47j30r4
4101DM6m9J6P1k30K43k02m0K10k96L68j48r4J74j32P9o1P3r1M1P9q2J49j25k3
4126b0K3q1J40j5j73K27j20j04L54j28o5J33j32J68k86K3J19J16l22L61n7r9n2
4149A0N5j36J2J69J9k30n8N6J44r3j38K66p0k9jq4K50k00N3J6o6K13j24j73L0
$$ y = [53, 4, 32, 118, 55, -70, -155, -119, 167, -89, 26, -18, -208, 302, -38, 64, -38, -57, -228, -86, -85, -197, 45, -51, 3, 128, -117, -87, 72, 239, -106, -34, 59, 157, 66, 208, 126, -160, -74, 24, 190, -10, -95, -60, -65, -32, -351, 71, 53, -42, 17, 182, 15, -153, -69, 91, 52, -34, 67, 47, -128, 252, 79, 203, -41, -80, 57, 102, 83, -57, 77, -121, 160, -14, 129, -72, -79, 22, 79, 137, -32, 29, -144, -76, 256, -82, 4, -112, -222, 107, 27, -164, -44, -174, -232, 32, -15, 80, -51, -62, -197, -5, -20, 72, -7, -147, -21, -28, 53, -56, 220, -3, -139, -102, 31, 34, -233, -96, -19, 228, 98, 4, 50, 1, 17, 88, -142, 101, -101, -141, 69, -227, 141, -7, -101, 73, -59, 20, -41, 32, -59, -18, 61, -21, 128, 3, -20, 3, -78, 62, 47, -126, 101, -19, -123, 231, 103, 38, 171, 39, 207, -79, -56, 63, 179, -143, 218, 161, 62, 10, 65, -71, -59, 110, 129, -101, -159, -103, 41, -52, -190, 76, 6, -23, -24, -108, 142, -58, -5, 11, -55, 158, 34, -139, -109]
4174a09K56r0r5R5j5j75K52k05J86lq4l6J37Rj8k71p7L10m1j33J99q0p0J87j27
4199BJ10k70K48j33K9N9J6K8j77J77P2k22J97M8p3k7n0J29o2J24l13O7R9j92K14
4224A00k22N0N7j05K07j02K04l63O2K10j04k26L57Lj02J03q7Jj11j1K44l03k8
4247a66K14k51K91J00m28R7J15r8J95l3R1l8k38Q1L03j87j0M7k12N7mM3M3L2L6
4272H0j0l2j1j24K19n6k9k47J94j43K42q3r7R8l2k61L04P2k24M4j6k8J24j55L02
4297A31n1P9l9j53J61j53M1N3On1r4o4j5P8j58J89p5Q7l8q5J49j38J83J88k32
4322aj32J99M7n9j2l7Mj47O3J27j91N0q1P6mJ07k7J02j19J19p3j4n3j8P0O8m1
4349B3nj04oJ40J55l20J59j27O8J95j39p3k11J57J41q6L7Q4P6q2Q9j51r0J20o9
$$ y = [-109, 147, 57, -38, 57, 42, -133, 119, -86, 100, 97, 13, -23, 114, 123, 105, -166, -243, 67, 26, -107, 92, 12, -58, 129, 2, 112, -158, 90, -43, -14, 45, 61, 89, -88, 89, 161, -61, 136, 184, 111, 84, 34, 163, 101, 225, -88, -21, 78, -114, 100, -122, -72, -15, -120, 87, -15, 189, -174, -112, 98, -6, -232, 125, 128, 26, 129, 42, 43, -68, -79, 165, -138, -166, 48, -203, 88, 188, -240, -143, -28, -126, 69, 36, 127, 89, -149, -68, 235, 48, 38, 85, -127, -70, -74, -31, 12, 44, 80, 70, 38, 27, -97, 122, 66, 37, -210, -16, -159, 83, 0, -97, 1, -31, -292, 12, 84, -140, -96, -112, -140, -16, -171, 131, 80, 159, 120, -33, 128, -25, 16, 69, 75, 24, -70, -134, -149, -71, -229, -40, -115, -28, -66, -151, -2, -140, 43, 231, -1, -133, 66, 113, 54, 42, 5, 9, -138, -75, 52, -139, -89, -170, -94, -98, 9, -18, 84, -35, 84, 11, -3, -56, -74, -4, 64, 23, 18, -86, -92, 48, 203, -117, 42, -85, -17, 178, 39, -34, -245, -88, 53, -33, 4, 88, 164, 82, 171, 20, -70, 50, -19]
4374a9k7K22k6K8j94J40j33LJ36Qj83R4j48Q5P3k2K5j8P9o6M7r5P5k7J6l60L54
4401F7k58K69p1p5N0n2J8J84L3j42O3j02j37J08N4j3j4q8q5J95j7P7k90K03j34
4426a57N5K19j08q4N2Q0J6J23J9qj83q6R5n4o5J90k59K86l00QN6N0j16L77k04
4451Bj00Q1J19oJ24j02o2j76O3P5J26j53k2Nl7N0p6J87j06J74j69J5o8K10n9j66
4477g1O6j63K90n3L7l50L03r6j38J33n4j1K73j54J4J17j21p8J4J17j70K28Mk57
4501a20klK40j07l0k14L12o4o7M3J45j06j08p4K92o1j8o5n5K87j13O2L7l97L08
4526A22j78o5m6K77l1j01J02l92K97k44L44j09j11Q1N7k1j59J8J75n9j17K12j41
4549h9j8K29k54P9Q4r9n4J00p2N6L9k94M82k24J33j88K39k6j54J9n8qP4R0j2L3
$$ y = [-19, -46, 176, 150, 178, -16, 124, -9, -6, 130, 138, -45, 49, -99, -14, 59, 37, 62, 44, 123, 57, 104, 9, 84, 57, 73, -287, 67, -191, 78, 7, -68, -18, -70, -52, 132, 165, 23, 86, -16, -153, -45, 9, -4, -18, -106, -191, 4, -13, 64, -226, -23, -157, -102, 117, 9, -75, -23, 57, 73, 196, 215, 207, 24, -62, 33, -21, -86, 104, -155, 131, -169, -161, -105, -55, -171, 206, 2, -98, -17, 102, 96, 220, 118, 56, -120, -57, 18, 144, -9, -31, -26, -63, -13, -89, 98, -8, 166, -3, 12, -56, 154, 95, -71, -5, -168, 122, 69, 106, -244, 59, -37, -175, -42, -96, -107, 166, 12, 26, 143, 22, -56, -42, 75, -95, 133, 137, -120, -122, -125, 115, 8, -22, -236, 76, 12, -55, -12, 133, 27, -81, -155, 137, 76, 58, -7, -62, 225, 112, 174, 211, -186, 122, -56, -121, -167, 110, 79, -22, 80, -312, -15, -259, 85, -24, -135, -54, 3, -18, -177, -159, 16, -43, -160, 52, -89, -107, 122, -132, -53, 31, -68, -122, -22, -94, -38, 1, -293, 189, -35, 98, -90, 149, 123, -31, -12, -70, -78, -4, 86, 74, 107]
4575A07j5k2j65J40J4m3r8lJK67k54k44L66L0j56R5o1l3O7J5k97J27J91j27q4
4600a82K18j12RJ58q5o1j15J34j49K55j18j67K40j29JN9K50l13J14j69J74pQk28
4624b15J94j68K71j23J16n6Q2j77r3L51j66J49J7j44O7j05n7l8J04J40k50K36
4646A35k22p2K38l38N9L80j50m9j18Q9rJ00K0p6P2k4rN6j18P7n3j2R9j27l8J46
4672E6r6J02k94L40J59j61K7k66O3K16j40j5m6L54k51J25j96K19k89j6J44p6j2
4695e3J66j70K07k90K12L5l68J88J53K11k78n1K19j16L8Qn7M3k4q5J07m5JJ19
4719A70l63J72q3Q3r8Q5n6J60L4j17O1J24o4K24j89l01L7L25j71j64R6O0J04j2
4743A17j08j36K20m1j26J62P0k23j13L97m67J73j33K21j84N4J60j71J95J0j11
$$ y = [107, 92, 70, -95, 45, 59, 16, -82, -85, -84, 183, -71, -315, 51, 81, -75, 20, -41, -74, -7, 8, -289, -162, 29, -98, -182, 36, -76, -67, 91, 6, -55, -170, -36, -185, 70, -48, -215, 25, -104, -103, -44, 206, -107, 7, -162, 12, 5, 13, -215, -21, -189, 82, -41, 75, 19, 101, -76, -169, 182, 16, 165, 182, 38, 105, 0, -57, -95, 9, 149, -101, 135, -87, -159, 79, -259, -200, 180, 30, -19, -137, -48, -57, 43, 63, -13, 59, 35, 26, 82, -36, 41, -12, -24, 75, -52, -90, 56, -40, 62, -232, 108, 267, 106, 133, -133, -70, 146, 6, -9, -55, 299, 48, 173, -23, 196, -93, -109, 35, -41, -53, 113, -57, 150, -140, 72, 107, -261, -73, 80, 291, 13, -38, 181, 65, 103, 111, 54, 97, 73, -12, 95, 50, 51, 170, -193, -21, -104, -21, -119, -34, -90, 70, 104, -13, 48, 172, 108, 332, 143, -158, -121, 204, 33, -131, -35, 25, 129, 117, 9, -127, 93, 52, -74, 88, 158, -65, -178, 219, -248, -75, -208, 13, -171, -117, 43, -128, 67, 77, -34]
4764c4J35nM5k73J42J7j25L11j92J79k89L4J8k19L91m0j45O0j55J31J86k34J4
4787d8Q5Lr5k8J84JL7j23j23k4K81N3o5l03K14J11l62M4J59R6J05j77n0K05j39
4812D1o5N5m0j32K65Q7k17j19kM5J71j00J81r6j13O9k03M09o8k45R9n9P7q4P0
4837B6o0q7J98j43J46j42K6K1j00J44j43J09R9k77J19J09j32j8R0R4j93O3p8J09
4861b0J62l32L52j53n3Q7j16J05j02R4qP2P3k72K46j3j57J94j51r9P9O8j4L3p2
4886Cm3J87O1l22J53k35J94o0J18j33J94O4j20Ql2N4j29p6J42O1P4K1m00M11j37
4911E8M9l0j5k3k37K72N1M9m9r7q3J20J01J06k67j27l7j25K16L37k07j42J47k7
4935D0j90O8K4Q1Q2l5pJ6n4J19m5r2j92M7K92k44J79j51J23p7M8k25L84k88l8
$$ y = [-34, 101, 96, 141, -132, 10, 27, -98, 213, 21, 200, -89, -55, -37, -256, 135, 95, -50, 10, -145, -14, 172, -62, -48, 37, 40, -55, -83, 101, 102, 139, 16, -107, -131, 150, 203, 138, -165, 49, 160, -202, -158, 1, 97, 202, 25, -25, 180, 41, -24, 31, -9, -141, 124, 211, -6, -125, -127, -82, 89, -11, 170, 74, -39, 30, -173, 236, 168, -77, 22, -37, 40, -44, 26, -34, -121, 77, -66, 80, -62, -36, -15, -115, 29, -114, -5, 94, -183, -64, 45, -87, -105, -15, 79, -114, -51, -129, -20, 142, -190, 162, 9, -44, 43, -73, 32, -70, 24, 16, 88, 161, -111, 135, 122, -35, 159, 8, -91, -12, 56, 42, 75, 3, -40, 147, 208, -114, 39, -196, -2, -62, 56, -77, 117, 181, 61, 69, 37, 91, -38, -114, 28, 89, 163, 184, -216, 195, 58, 107, 77, 62, 39, -198, 74, 125, 174, 125, 28, -55, 65, 166, 272, 5, -122, -159, -284, -68, 269, 62, -80, 67, 40, -150, -82, -58, 23, 105, 70, 63, 79, 25, 144, 99, 7, -185, -138, 154, -90, 89, -62, 61, -16, 32, -193, 191, -97, -135]
4960a35Q3K2P2n3J25k11RJ74j76J13p9K15p5L9rL7j18k45O1K62n5Mk27J62OR9
4986A00j81K22j85J93r9K2m7k45K95j29J2K5j6j2QJ18n5r6J93j77o1k8J69p3l9
5011h6J57m6o7O9J59j90J90m1p2K34l38k8R9K9k29K29o5L2k23K41k81J86R6j2
5035D3r8Lo4J56j89L25lk24J51l08J80P0J60m01P8J81J64k54j21K11r0K65j69
5058F6P0k8k36J87m1P4n3k03J45R2j88K21k69K85k22n2K34j03pj11K81k15O7J47
5082A41o4q7J35j44J94j97l55K86N1r0J96j1k99J40L34l05L3J04O3j85K6O4M2
5105G2k30K77j40K17l91P9J01lj78K56k18J57k18Q0K89k3P2k15Oj9K00l07K98
5128A62K9k20J14j32N6p4J38k54J05j15J36N0j7r8J67J7j37J4j40J62n7P4J82
$$ y = [-135, -52, -30, 42, -11, 114, -97, -88, 86, -90, 23, -56, 159, 84, 123, 114, 151, 33, -212, -151, 111, 56, 60, -167, -5, 1, 100, -81, 141, -44, 149, 50, 72, 25, -220, 75, -54, -42, -17, -33, -45, -37, 81, 26, -70, 123, -54, -115, -143, 26, -47, -86, 71, 25, -42, 27, 186, -4, 186, 145, 73, 307, -31, -59, 40, 69, -160, 69, 4, 36, -187, 54, -227, -41, 55, 43, -55, -52, -116, 40, -149, 176, 173, -51, 100, -208, -28, 42, 202, -199, -121, 60, 224, -30, -151, 60, -30, 235, 66, 136, 108, -128, 59, 18, 92, 39, -164, -19, 73, -115, 106, -163, 122, -100, -152, 82, -21, -28, -139, 142, -73, -6, 141, 77, -10, 125, -19, 175, -22, -377, -91, -40, -130, 66, 55, -244, -104, 230, -75, -42, 62, 125, -60, -34, 30, 72, -158, 119, -21, 196, -195, -116, -15, -18, -196, 60, -158, -1, -219, -139, 150, 127, 199, -16, -10, -29, 171, -136, 162, 191, -29, 85, -47, 9, -65, 73, -181, -76, -191, -55, -5, -22, -120, 47, 64, -73, -59, -199, -37, -94, -20, 162]
5151A62k5K5k79P8J28j46K01n9J6k76K29p7j19l7J22p0M5J84j89L33j61j23j09
5174a47Q9P4l3L2J43j14N0j67k0J77k19J67J00k8J0j96J66o3q7j11K39J34L8k42
5198hj89L47r4j77J54j20Q3j16P8J60j58q0l3J84n3J0K4j33J69j62L39k33P0k29
5222a67j09M02k6r4j35K82k91J91l9Jj00l9l6M8R0j43K78J10l24L7M8p6K4J48
5246H0k52J02K8R8k98L64p6m3J23j36K01l58K17k44K11o6L3p9J95r0m5J80m8p9
5270A8K05k37j0j1J2Q0M1k70K38M5k15J68J53l70K50j7J49k24LJ06j45N5j21K57
5294A60j05L0j83J80j82J82j25j17J80k2N6P8l8j6j2K52k67n8K4k38L40j20j6
5317a7k0J56qk58K95j93J6J12j69k2J80k0k1q4O8m1J39j61n9J05P5q1M8j87J10
$$ y = [162, 137, 162, -117, -39, 89, -57, 144, 85, 101, -175, 54, -23, -142, -179, -57, -127, -82, 102, -87, 246, 85, -38, -147, -58, 16, -17, 15, 158, 44, 94, -73, -93, 84, -135, 32, 132, 104, 114, -82, 84, 21, -66, -177, 62, 196, 234, -8, -197, 150, 56, -121, 33, -87, -4, -120, -42, 118, -40, -120, -153, 31, -22, -12, 12, -121, 48, -114, 225, -8, 62, -167, -276, 126, 100, 6, -129, 153, -138, 53, 14, 15, -85, -124, -160, -112, -22, -165, 113, 223, -101, -64, -16, -92, -68, 80, -172, -70, -42, 56, -242, 122, 46, 3, 126, -10, 191, -167, 50, -194, 17, -49, -16, -95, 100, 10, -35, 145, 97, 18, 223, -14, -24, -35, -23, 57, 98, -172, 66, 111, -104, 64, 217, -153, 97, 80, 229, 5, 8, 114, -31, 24, -97, 160, 55, 85, -98, 82, -100, 82, -43, -160, 20, -2, 54, 132, 94, 78, 66, 318, 51, -7, 17, -221, 119, -1, -17, -37, 119, 111, -147, 148, -45, -29, 83, -86, -108, 72, 52, 31, -53, 15, -26, 113, -48, -107, -2, 73, -8, 40, -147, -37]
5342c7n7jJ7J25J0k15J32P9k3np4k6K26q9j39j27K26J03j39k70M13k29J30mp1
5367d5k18K34K45k21j17M4o5K39r3k23J32Q9J15j48P3j83J51L0J00p9n4O9Q6q8
5391G3m0M7k16r8M57Nm75J32k6K69j65o3J59m0Q5N3q1j21LJ34r2J03m78L67O2
5416E4q3l9L4J19j75J01m8N5L3k31J27q2L20l27o5L73j19j41J26Nj20N7j17K83
5440A40l58K91M6j36O8r4M3Q5j09Q5J55l13l1Q5K6q1K83j42k07K66n2j3N1k98
5464b10l2J83Q6q0j49JJ58K2j31k2L00j66J79o0l3q6Q6n7lJ5Q0k05K30r3r6K46
5490A63k64J20k22L07k71Q1j55K88J45j51q7K06j56j34K11l7%O6j34k1J51j97
5512i1j94K67l6L8P1J0k09O0J22l9qJ30j04o0N3j61J18J39k03J95k9o4j74J89
$$ y = [-37, -94, -95, -78, 47, 57, -158, -26, 53, 30, 25, -49, -75, 151, 62, -77, -204, 22, 125, -14, -284, 129, -100, 30, 26, -45, -263, -29, 216, -5, -122, -78, -143, 96, 3, -220, -88, 1, 116, -32, 41, -142, 9, 39, 139, 60, 6, 75, 161, 73, 33, 80, -136, -234, 223, 228, -247, -115, -141, 128, -37, -100, 59, 19, 104, 157, 76, -45, -42, 92, 0, 103, -375, -8, 54, -29, -68, -34, 85, -90, 11, -37, 18, 51, -180, -53, -135, 185, -142, -207, 166, 47, -94, 32, 37, -83, -26, -143, 140, -218, 73, 119, -17, 51, -43, 0, 85, -24, 61, 216, -97, -128, -43, -17, -98, 185, 43, -164, 102, 50, 37, 88, -210, -242, -59, 27, -53, -202, -201, -43, -21, -152, -174, 126, -40, 139, 79, 46, -40, 46, -11, -14, 1, 81, -124, 106, 13, -83, 163, -101, 19, -203, 104, -167, -86, -241, 47, 192, 41, -46, 160, 4, -130, 81, 44, 44, 110, -24, -45, 106, -91, -285, -18, -54, -16, 55, 65, -144, -84, 38, -1, -9, 121, 17, -43, 10, -151, -33, 106, -97, 98, 69, 5, -169, 20]
5536B0Q9k7r0j08K73k36J48j07j0K5q6j04K83j71K5J93j14n8J47q9j6n9n9m7K82
5561A04k01K23m2k30J65J17m6N4k83K39P5l09O5J15mL2k98k9L83k53q6K37n0k21
5585b43K91k7l9K0J27n5p9l12K57N3k37L47O9P4l25J62R6k06O3J37k72K17o9L
5609E2j73J28o6K3j4p1K04j13K72j77r7J15m4m5K09j34k0J68k68q1o2J79R4j45
5633f6R0r6K11j67j4j9J51L3n6j13Q0M7j13o6N5j78P8oJ18r1P7J23k09Q8j5P1
5659A3j20J75p9J6k9K01k07P8J40k14J49k56K02M0o6r1O7j07J42Ok3J49j55J41
5683A72P9l56L38j94P4p2J19l42P6K21j93q0K39k7J07k18p8L48m94J62J35M2J
5706E9l0j09N1J63K6p7j71%Q1J69l09j34K56J1L9K82k78J09j83J31j09m8qp1Q7
$$ y = [20, 109, 82, -8, -116, 157, -79, 69, -38, -48, -23, -109, -213, 70, -101, -76, 117, 3, -55, 92, 3, -13, -72, -131, -178, 104, -97, 126, 84, -146, 19, 136, 90, 144, -139, 100, 175, -134, -69, 46, 42, 74, -224, -253, 130, -123, -209, 28, -22, -243, 48, 21, -18, 2, 129, 74, -5, -317, -60, -7, -244, 103, 172, 246, -79, 83, 179, -27, 36, 173, -99, 118, 49, 52, -121, 7, -59, -36, -50, -121, 83, -30, 242, 65, -32, 83, 39, -6, 203, 69, 49, 217, -51, -132, -194, -15, 79, -66, 24, -72, 139, -28, -42, -61, 90, 123, 67, -46, 34, 81, -32, -98, -43, -221, -143, -149, -31, -122, -45, 78, -131, -43, -58, 13, -107, 68, -11, 5, -24, 177, -30, 48, 188, -26, 123, -133, 69, 109, 43, -48, 19, -88, 54, 60, 37, 186, 31, 172, 251, -105, 233, 39, 113, 41, 160, -182, -106, 115, -78, -158, 81, 54, 161, -57, -135, 213, -281, -119, 16, 58, 59, 29, -80, -29, 134, 160, 83, -88, -88, -7, 162, -147, -281, -25, -14, 25, 307, 29, 138, -45, 86, -23, -71, -79, -150, -63]
5731f3L09k02j13L3%K77j63k63L02k1o7j85k8K37k26J26j18r2J20J76j18P1j54
5754a62J61j57Q2K01Ml20J37M2M1P4M1k08jo7O9r2K01r3J68K2k02N6Q2m6J34j67
5780@j61Q9q8n6J11J61J19j04j3m4k5Q1k10J88j90K10j54K54K5j33J8k90N4K06
5804D8J19k08J35k87K16K6j32K1Pj4oK03L8l37K78j10n9j09K18Q2l52L09r3O1
5828E4n5k70L06m9J61Q5l76K47m6k6j00K15k2j03p6P0j8k2J7o5Q7j20K09k26J04
5853a9K2j7J13J15j25j05K7qM7j05O9R4rr5PM9j00k6R1j41J02R4j16J72o4l42
5879b70R1K39J11k94K01m3m1j51K18k2j6J9j60K90o8Qq7q8M1L1N3oJ07l63K53
5904E3k16K2L85j63O9k07J9P7j68K6J41j5K10l08J18Rr4o3J00j07K19ol48L27
$$ y = [-63, 246, 44, -69, -36, -36, 241, 78, -185, 117, 96, 29, -156, -184, 53, -173, -47, -165, -257, -137, 39, -79, -8, -162, -1, -158, -76, 125, 129, -191, -54, -12, 29, 103, 144, -64, -65, -132, -63, -155, 46, -47, 121, 143, -59, -3, 79, 33, 167, 0, -161, -72, -160, -216, -105, 56, 175, 71, 58, 14, -11, 70, -140, 48, -142, 68, -86, 168, 193, 60, 78, -212, -158, 48, 167, -41, 94, -193, 23, 49, -83, -62, -55, -69, -75, 128, 166, -171, 107, -3, -62, -171, 47, 129, -223, 86, -7, 54, -1, -271, 35, -14, 147, 232, -144, 103, 57, 31, -69, 146, 124, 21, -55, 15, -3, -25, -8, -73, 14, -106, 103, -123, -19, 3, -14, 99, 214, 89, -16, 11, 3, 50, -55, 14, 108, 99, 4, 11, 60, -40, -66, 25, -116, -14, 80, -36, 136, 72, -270, -179, 60, 171, -123, 78, 35, -6, -157, 61, 39, 23, 42, -118, 172, 104, 112, 25, -63, -22, 9, 62, 56, 163, -200, 53, -163, -141, 244, 81, 150, -57, -38, 39, -129, -103, 38, 23, 233, -75, 43, 52, -42, -105, -5, -112, 107, 101, -247, 80]
5928H0j52R2n1K08k92K17J44k82j1J38J3j81L8n6K12l92K77L9K59k45q3J7J23
5951A12k7J5l0m1j29RP1K75l81p2K12p6K00k89J37j62K13k06r2J73J89n1J26k25
5975d9K59l98Q7K68j68O2q4J06l17Q9J89j37K28k50K63j88n8mJ32k40L46n2L8
5998A22p9J5K8k15J25R4l30N20l38L4J53k10P4j95L98k78Q2k9j03%J83P9n1oQ
6023H1k05L33j45K04j63q1l53M13k7l2J19j69J27m8Nj06J08j92K27q3OJ37l67
6046b11mL08k06M3J15Q2k65J57r4J95j66J69r0K6j83R4P1Q1j59N9J1o5J37j44
6070c9q4J16M8J1j39P4p3j10J63P9k18l3J28m9n7J95r6K10q0j71J85j24jJ54r
6095H0r5J69k28J73j03q4P9J04Ko7Kn7K11q9j98j44L55nr3mk13J69J48l27J96
$$ y = [80, -72, 20, -31, 177, -115, 102, 246, -36, -47, 91, 104, -77, -39, -95, 117, -275, 2, 41, 300, 55, -28, -11, 112, 85, 100, 70, 29, -100, -91, -20, 255, -126, -198, 14, -62, 138, -151, -14, -176, 37, -169, -261, -88, 101, 50, 176, -49, 210, -188, -101, 167, -1, 61, -23, 83, -234, -145, 44, -93, 135, -115, 148, -40, -98, -102, 30, -210, 136, 84, 122, 43, 58, 86, -129, -4, 90, -240, 280, -58, -24, 129, -81, -7, -202, 196, -82, 0, -29, -132, -132, 51, 130, 79, 73, 81, -124, 209, 64, 268, 105, 24, -329, 84, 57, 25, 144, -25, 102, 54, 59, -47, 61, -131, 96, 13, 19, 156, -211, -215, 93, -113, -70, 45, 127, -138, 19, -75, 120, -46, 123, 33, 59, -124, -30, 41, 122, -37, 22, 33, -32, 105, -39, -123, -7, 41, 52, -87, -13, -86, -196, -33, 46, -172, -205, -77, -126, -183, 12, -84, 126, 46, -125, 60, -64, -65, 89, 80, -15, 154, -74, 99, -4, -88, -9, 95, 97, 30, 32, -25, 186, 97, -101, -245, 110, 105, 12, 8, -205, -36, 112, -215, -19]
6120a9Q7r7P0K2R6qr0L2j07m0j49J92J19j51N2j00R9R7M9m52L32j64nO9m3j46
6146b55L59j35M2K20k04q4R7n1J17l4j09O2k1n1M9O3j9L0j60J54j43Q6P7pm3j66
6172a26M6J81O6l50J54r2J08p3Q6J75k55K26N3k14k9m8N1J62n4j55J10K25k53
6195fm7j21O9j2J18p4P6l9LK07j70O6k91M20m00J68N8J73k86K1K47Q2k34n6j4
6220d2p8M6J92O5l5j28K52m58K59J06k19K91k08j13K7N0K4k98R9K71k01K77l0
6243A49k02J69Q5j47k9K0r8K73j78M8o3j48J37j17j8j2L77j45l68K44q3L27j11
6266A10j67K59j39j54K67j55k09L59k63J04P1k06l2L20k84J28j58m0K50J90k50
6287Ak18J29N2J23m1m9k5N1q3R6j02k6J94L3o4j94K1J07j41K39MO5l62K32M0l7
$$ y = [-19, 68, -29, 41, 63, 159, 151, 61, 93, -14, -54, -203, -11, 108, -43, 9, -91, 8, 105, 154, -298, 34, -130, -135, -66, -109, -255, 104, -31, 11, 231, 27, -57, 40, -11, 106, 72, -37, 25, 4, -47, 2, 65, 46, 76, -84, 70, -73, 13, 90, 83, 40, -126, -80, 101, 167, -183, -29, -121, -13, -86, 0, 175, -80, 146, 199, -15, -44, -92, -41, 121, 67, -88, 22, 247, -6, -53, -174, -105, -117, 1, -73, 3, -36, -33, 174, 4, 70, -221, 199, -201, -33, 25, 198, -88, -67, 180, 262, 28, -28, -42, -120, -74, 118, 183, 148, 20, 272, -186, 73, 179, -40, 251, 43, -70, -43, 7, 31, -267, -168, 103, -98, 179, 149, -53, 116, 201, 54, 25, 45, -53, 220, 42, 90, 27, -121, 16, -101, -119, -131, 246, 101, -267, -23, -106, 221, 110, -57, 202, 63, -91, 176, 21, -188, 171, -92, 12, 83, -123, -155, 165, -119, 9, -149, -189, 61, 251, 1, -217, -88, -36, 87, 46, -3, -28, 23, -60, 36, -66, -92, 102, 135, 71, -123, -102, 5, -136, 103, 107, 172, -190, 42, 82, 45]
6313D5Q7m3M8J1k16L5j38K36j68K90r1j34k41K45M8J5Lj61P7p0J28J11j43j2J77
6338A39M6k12Q3r4K0M1K30j19j52O8j00J61j10o7J10P2k75K18j10j03K34j13J88
6361A55j41J5n5K3m3K44k30J08K20l56j52K53l2N5k02J85l2j51J05p9O8K03k1
6384A40k20J75j48j8L4l5rK58j70j83K14K8j26J34j6l2k53o8M23j57R0J25O6j69
6408H3j30Q5k34L50k2j48l5P8oK7j27J66j95k2J80m1j5r8J23j64J60oo5q7K13
$$ y = [45, 132, 89, 137, 148, -68, -33, -171, 65, -103, 187, 96, -38, -279, -34, 14, 29, 32, -129, -52, -122, 6, 117, -26, -38, 139, 185, -27, 56, -38, -18, 23, 253, 134, -18, 50, -50, 111, 1, -66, 44, 116, -159, 59, -51, -154, 80, -33, 155, 14, 29, -26, -3, -46, 198, -32, 76, 296, -60, -212, 41, 9, 64, -138, 47, 15, -136, -31, -110, -42, 161, 140, -80, 95, -53, -71, -37, -72, -81, 177, 7, -176, 38, 66, -60, 74, 58, 26, -227, -295, 128, -29, 61, 186, 252, 83, -47, 38, -196, 154, 132, -16, -51, 27, 21, 48, -79, 87, -108, -130, 50, 9, -6, -104, 19, -145, 15, 9, -56, -143, 70]
$$ [...]
8191a43
##END NTUPLES=NMR FID
##END=
