##TITLE=1H_Pr D-2
 CDCl3
 8 sc, 
 2.10.2024
##JCAMPDX= 6.0         $$ Bruker NMR JCAMP-DX V2.0
##DATA TYPE= NMR FID
##DATA CLASS= NTUPLES
##ORIGIN= UXNMR, Bruker Analytische Messtechnik GmbH
##OWNER= root
$$ XWIN-NMR		Version 3.5
$$ Wed Oct  2 15:49:31 2024 Russian Standard Time (UT+4h)  she@DPX200
##.OBSERVE FREQUENCY= 200.1318
##.OBSERVE NUCLEUS= ^1H
##.DELAY= (6, 6)
##.ACQUISITION MODE= SIMULTANEOUS
##.ACQUISITION SCHEME= undefined
##.AVERAGES= 8
##.DIGITISER RES= 18
##SPECTROMETER/DATA SYSTEM= spect
##.PULSE SEQUENCE= zg30
##.SOLVENT NAME= DMSO
##.SHIFT REFERENCE= (INTERNAL, DMSO, 0, 15.7039)
##AUDIT TRAIL= $$ (NUMBER, WHEN, WHO, WHERE, WHAT)
$$ ##TITLE= Audit trail, XWIN-NMR		Version 3.5
$$ ##JCAMPDX= 5.01
$$ ##ORIGIN= Bruker BioSpin GmbH
$$ ##OWNER= she
$$ F:/spectra/data/she/nmr/H-F/1/audita.txt
$$ ##AUDIT TRAIL=  $$ (NUMBER, WHEN, WHO, WHERE, WHAT)
(   1,<2024-10-02 15:47:34.98 +0400>,<she>,<DPX200>,
      <created by zg, POWCHK disabled, PULCHK disabled
       configuration hash MD5:
       00 E9 B6 7A A2 85 ED C7 34 08 36 98 17 FE 4E 26
       data hash MD5: 16K
       42 AE F4 DE 29 AE 87 CE 94 7D D6 98 87 6D 2A DF>)
$$ ##END=
$$ 
$$ hash MD5
$$ 03 51 C0 D5 60 68 48 69 73 9D EF E0 AC 9D 6F 99
##$RELAX= 
##$RELAX= 
##$RELAX= 
##$RELAX= 
##$RELAX= 
##$RELAX= 
$$ Bruker specific parameters
$$ --------------------------
##$DU= <F:/spectra>
##$EXPNO= 1
##$NAME= <H-F>
##$PROCNO= 1
##$TYPE= <nmr>
##$USER= <she>
##$AMP= (0..31)
100 100 100 100 100 100 100 100 100 100 100 100 100 100 100 100 100 100 
100 100 100 100 100 100 100 100 100 100 100 100 100 100 
##$AQSEQ= 0
##$AQ_mod= 1
##$AUNM= <au_zg>
##$AUTOPOS= <>
##$BF1= 200.13
##$BF2= 200.13
##$BF3= 200.13
##$BF4= 200.13
##$BF5= 200.13
##$BF6= 200.13
##$BF7= 200.13
##$BF8= 200.13
##$BYTORDA= 1
##$CFDGTYP= 0
##$CFRGTYP= 5
##$CHEMSTR= <none>
##$CNST= (0..31)
1 1 145 1 1 1 1 1 1 1 1 1 1 1 1 1 1 1 1 1 1 1 1 1 1 1 1 1 1 1 1 1 
##$CPDPRG= <>
##$CPDPRG1= <>
##$CPDPRG2= <>
##$CPDPRG3= <>
##$CPDPRG4= <mlev>
##$CPDPRG5= <mlev>
##$CPDPRG6= <mlev>
##$CPDPRG7= <mlev>
##$CPDPRG8= <mlev>
##$CPDPRGB= <>
##$CPDPRGT= <>
##$D= (0..31)
0 1.2 0 0 0 0 0 0 0 0.06 0 0.03 0 0 0 0 0.0002 0 0 0 0 0 0 0 0 0 0 0 0 
0 0 0 
##$DATE= 1727869654
##$DBL= (0..7)
120 120 120 120 120 120 120 120 
##$DBP= (0..7)
150 150 150 150 150 150 150 150 
##$DBP07= 0
##$DBPNAM0= <>
##$DBPNAM1= <>
##$DBPNAM2= <>
##$DBPNAM3= <>
##$DBPNAM4= <>
##$DBPNAM5= <>
##$DBPNAM6= <>
##$DBPNAM7= <>
##$DBPOAL= (0..7)
0.5 0.5 0.5 0.5 0.5 0.5 0.5 0.5 
##$DBPOFFS= (0..7)
0 0 0 0 0 0 0 0 
##$DE= 6
##$DECBNUC= <off>
##$DECIM= 24
##$DECNUC= <off>
##$DECSTAT= 4
##$DIGMOD= 1
##$DIGTYP= 9
##$DL= (0..7)
0 120 120 120 120 120 120 120 
##$DP= (0..7)
150 150 150 150 150 150 150 150 
##$DP07= 0
##$DPNAME0= <>
##$DPNAME1= <>
##$DPNAME2= <>
##$DPNAME3= <>
##$DPNAME4= <>
##$DPNAME5= <>
##$DPNAME6= <>
##$DPNAME7= <>
##$DPOAL= (0..7)
0.5 0.5 0.5 0.5 0.5 0.5 0.5 0.5 
##$DPOFFS= (0..7)
0 0 0 0 0 0 0 0 
##$DQDMODE= 0
##$DR= 18
##$DS= 0
##$DSLIST= <SSSSSSSSSSSSSSS>
##$DSPFIRM= 0
$$ [...]
##$SUBNAM2= <"">
##$SUBNAM3= <"">
##$SUBNAM4= <"">
##$SUBNAM5= <"">
##$SUBNAM6= <"">
##$SUBNAM7= <"">
##$SUBNAM8= <"">
##$SUBNAM9= <"">
##$SW= 24.0689170037331
##$SWIBOX= (0..15)
0 0 2 0 0 0 0 0 0 0 0 0 0 0 0 0 
##$SW_h= 4816.95568400771
##$TD= 16384
##$TD0= 1
##$TE= 0
##$TE2= 300
##$TE3= 300
##$TEG= 300
##$TL= (0..7)
0 120 120 120 120 120 120 120 
##$TP= (0..7)
150 150 150 150 150 150 150 150 
##$TP07= 0
##$TPNAME0= <>
##$TPNAME1= <>
##$TPNAME2= <>
##$TPNAME3= <>
##$TPNAME4= <>
##$TPNAME5= <>
##$TPNAME6= <>
##$TPNAME7= <>
##$TPOAL= (0..7)
0.5 0.5 0.5 0.5 0.5 0.5 0.5 0.5 
##$TPOFFS= (0..7)
0 0 0 0 0 0 0 0 
##$TUNHIN= 0
##$TUNHOUT= 0
##$TUNXOUT= 0
##$USERA1= <user>
##$USERA2= <user>
##$USERA3= <user>
##$USERA4= <user>
##$USERA5= <user>
##$V9= 5
##$VALIST= <valist>
##$VCLIST= <CCCCCCCCCCCCCCC>
##$VD= 0
##$VDLIST= <DDDDDDDDDDDDDDD>
##$VPLIST= <PPPPPPPPPPPPPPP>
##$VTLIST= <TTTTTTTTTTTTTTT>
##$WBST= 1024
##$WBSW= 4
##$XGAIN= (0..3)
0 0 0 0 
##$XL= 0
##$YL= 0
##$YMAX_a= 237462
##$YMIN_a= -250769
##$ZGOPTNS= <>
##$ZL1= 120
##$ZL2= 120
##$ZL3= 120
##$ZL4= 120
##$ABSF1= 10
##$ABSF2= 0
##$ABSG= 5
##$ABSL= 3
##$ALPHA= 0
##$AQORDER= 0
##$ASSFAC= 0
##$ASSFACI= 0
##$ASSFACX= 0
##$ASSWID= 0
##$AUNMP= <proc_1d>
##$AZFE= 0.1
##$AZFW= 0.1
##$BCFW= 1
##$BC_mod= 2
##$BYTORDP= 1
##$COROFFS= 0
##$CY= 11.3945322036743
##$DATMOD= 1
##$DC= 2
##$DFILT= <>
##$DTYPP= 0
##$F1P= 15.6554695791079
##$F2P= 12.8336369535428
##$FCOR= 0.5
##$FTSIZE= 0
##$FT_mod= 4
##$GAMMA= 1
##$GB= 0.15
##$INTBC= 1
##$INTSCL= 1
##$ISEN= 128
##$LB= 0.24
##$LEV0= 0
##$LPBIN= 0
##$MAXI= 10000
##$MC2= 0
##$MEAN= 0
##$ME_mod= 0
##$MI= 1.114404
##$NCOEF= 0
##$NC_proc= 0
##$NLEV= 6
##$NOISF1= 3.799351
##$NOISF2= 2.8
##$NSP= 1
##$NTH_PI= 0
##$NZP= 0
##$OFFSET= 15.70392
##$PC= 1
##$PHC0= -25997.99
##$PHC1= 13.38747
##$PH_mod= 1
##$PKNL= yes
##$PPARMOD= 0
##$PSCAL= 0
##$PSIGN= 0
##$REVERSE= no
##$SF= 200.130013532006
##$SI= 16384
##$SIGF1= 3
##$SIGF2= 2
##$SINO= 400
##$SIOLD= 16384
##$SREGLST= <1H.CDCl3>
##$SSB= 0
##$STSI= 0
##$STSR= 0
##$SW_p= 3612.71676300578
##$SYMM= 0
##$S_DEV= 0
##$TDeff= 0
##$TDoff= 0
##$TI= <>
##$TILT= no
##$TM1= 0
##$TM2= 0
##$TOPLEV= 0
##$USERP1= <user>
##$USERP2= <user>
##$USERP3= <user>
##$USERP4= <user>
##$USERP5= <user>
##$WDW= 1
##$XDIM= 8192
##$YMAX_p= 0
##$YMIN_p= 0
$$ End of Bruker specific parameters
$$ ---------------------------------
##NTUPLES= NMR FID
##VAR_NAME=  TIME,          FID/REAL,        FID/IMAG
##SYMBOL=    X,             R,               I
##VAR_TYPE=  INDEPENDENT,   DEPENDENT,       DEPENDENT
##VAR_FORM=  AFFN,          ASDF,            ASDF
##VAR_DIM=   8192,          8192,            8192
##UNITS=     SECONDS,       ARBITRARY UNITS, ARBITRARY UNITS
##FACTOR=    0.0002076,     1,               1
##FIRST=     0,             0,               0
##LAST=      1.7004516,     0,               0
##MIN=       0,             -250769,         0
##MAX=       1.7004516,     237462,          0
$$ Real data points
##PAGE= N=1
##DATA TABLE= (X++(R..R)), XYDATA
0@%%%%%%%%%Qj6J6j6K1k9L2m0M9n7O9q1R6j12J29j51J75k00K28k58K95l35L77
32B00m22M74n32N92o61P37q20R11j011J121j239J369j515J679j862K065k294K557
50A349k861L212l624M123m738N511o513P860r737J2307j8704K49277j68939k85392
64b16869K44953J24484j91063o5606J69946M370j21452Q653M5855J5015L0835
75D9121r2138j9595J35005j8571j26161M3807J17084n2188j46536R1627J36714
86A18169j44338p8237J49431J8469j07742j097Q6875K597o9457L858K5362J0759
98A4649J5648p3603n36J13132o5702q8386J07494M4199r2719j9068P2386M438
110C1932n4664K3786Q920l7557M2923p806n2514O6640J5694p7126J4208O6749
$$ y = [0, 0, 0, 0, 0, 0, 0, 0, 0, 0, 8, -8, 8, -8, 13, -16, 16, -24, 25, -32, 37, -44, 52, -60, 69, -82, 93, -107, 121, -137, 158, -177, 200, -222, 252, -280, 312, -349, 388, -432, 479, -532, 589, -650, 719, -796, 883, -979, 1086, -1208, 1349, -1512, 1700, -1924, 2199, -2539, 2972, -3541, 4319, -5418, 6889, -11815, 237462, 68523, -216869, 28084, 152568, -38495, -104101, 65845, 70215, -51237, -42584, 3271, 18286, 49121, -43017, -62612, 72393, 53822, -72339, -28532, 88552, 36364, -110172, -18545, 118169, -26169, -104406, 45025, 63494, -44248, -45345, 41530, 44127, -25330, -21472, 3890, 14649, 30297, -43306, -43842, 69290, 3588, -84798, 22696, 66895, -25824, -44892, 27494, 31932, -22732, 1054, 9974, -27583, 15340, 7534, -44980, 21660, 37354, -39772, -25564, 41185]
122D1185j0239o7117K0512O3917o1289k8430P7403k3057m9331L6578J5327k1751
134f292M890K5166k9826k4946P1794j9436q3552Q0973L6782j09733J4834R3778
146E4432l1891p5413M1950O6736o2671l3075O8216j1224l5125J7166o323N498
158a724J1381j5463m593N991K0171j1869k7379M2943L604n3750K5770K6030k6998
171e886n489J3156K852j6928P419K5438k5524j635K3731k9608R953K6396l4680
184a0805k206K1680r480q586P659J7039j6878j6245L3364n382k0642K2121j1189
197D50j2936J6297M84n298j0718J0981J6813l1309P400L3240k7315r482J8676
210G283n588j930j066l51l460Q4J5710k1106k429M2094k9651k7867M5282K90l1007
$$ y = [41185, 30946, -36171, -15659, 48258, -13031, -41461, 35942, 12885, -36446, 132, 15459, -6292, -1402, 23764, -6062, -31008, 40786, 21350, -62202, 18771, 55553, -54180, -39346, 54432, 22541, -52872, -10922, 55814, -6857, -39932, 28284, 17060, -18065, -899, -7222, -1724, 9657, -5806, -10399, -4408, 15763, 3894, -23485, 19458, 23062, -30688, -4918, 21112, -5886, -11375, 1781, 4633, -12295, -4876, 20562, -4962, -6597, 17134, -12474, -2521, 23875, -10805, -13011, 8669, -811, -9397, -1738, 15301, -1577, -17822, 15542, 10160, -10482, 11639, 450, -12486, 3811, 4295, -1003, -11721, -740, 16073, -15236, -7836, 25404, -1911, -11393, 7283, 1695, -235, -1301, -1652, -5112, -5028, 10682, -10424, -12853, 29241, -410, -28277, 17005, 17295, -13712]
225a3712N590J7715l347k5811J3531K5402k5378l603J5318m781O089p034l213
238c234J2741j2544l152O248j864J1412j7588q054L1355p523j9043J4301O675
251I730o712j2766R149J5084k1764j082J1437j0500J3261j776j6528K0841K84
264H658j6813Q635P673k960j5583K471K0011j8175n073K0609j1160k854O918j876
278D81P033p868k868R029j1413O116K792j2994J1758j380r119J2686l34j791j084
293A044l964J1033r192l217J2837j6122J398J3916j4607N029Q419p975Q30n27
307a098Q239j483j4744J4137j937j4199J4185k426n701O411n481N963J943m866
321a057P924r422L81R517j4198N791N905j2875N827K612o87L448p136Q141M76
$$ y = [-13712, -8122, 9593, 6246, -19565, -6034, 19368, -6010, -9613, 5705, 924, 7013, -21, -3234, 9507, -3037, -6189, 59, -1805, 9607, -7981, -16035, 15320, 7797, -11246, 3055, 9730, 3018, -9748, -599, 14485, -7279, -8361, 3076, -7424, 5837, 4061, -12467, 8374, 8658, -8155, 480, 8153, 5193, -10390, -7919, 12092, -6083, -11156, 9453, -1707, -4561, 2357, 481, 7514, -354, -3222, 5807, -5606, 510, 3302, -9692, 2066, 686, -8433, 4253, 3919, 2128, 1044, -2920, 8113, -1079, -4296, 8541, -7581, -6183, 7733, -6874, -1845, 6574, -1401, -571, -1098, 7141, 5658, -9086, 5051, 3114, -11085, 3100, 674, -5027, 1384, -4097, 1866, 3809, -1057, 6867, -2555, -2174, 7343, -6855, -1064, 4841, -8034, -2207, 405, -282, 3166, -3970, 4171, 4647]
336D647j0629J2347l555q712R392q303P61P441o910M444j228o23P272r907N953
351B390O312j5998O988L706q079N786l970J202L532p356J0411o19p801R753p004
366g47j867Q759j0301K644K769p171P516l126J296N581j0241O915L775r848Q598
381D552l375n760O471o503L885K655p364Q669m011j667J0223r328J521N300r466
396d198M780J89l678N116p484L957N438q819Q440J58p404Q421n409p55N755r004
412d497L654M53m510Q153n445O87P022q991N368L142p648N899m158k278N534p097
428d712M971J875q095Q969k064l009P668o271J230K165o992O989l267l949O851
443B359o708L003N483p919O992q26m640O374m600O79K273p921O437q62n297Q470
$$ y = [4647, -5982, 6365, 2810, -5902, 3490, -4813, -4052, 3389, -3521, 923, -305, -928, 6344, -3563, 2390, 8702, -7296, -308, 3398, -4681, 1105, -2865, -1663, 1869, -5487, 4924, 4305, -3496, 6257, -747, -2614, 6145, -4156, -1512, 1257, -5914, 1602, -1524, -228, 5353, -4888, 2027, 5802, -4046, 4552, 1177, -4583, 1888, -4615, -730, 1925, -5439, 3230, -781, -2448, 7775, -1553, -32, 5268, -4198, 582, 771, -2907, 2209, -5275, -1318, 4120, -4699, 3741, 3899, -3505, 4916, -493, -1248, 4507, -4497, -843, -390, -4900, 3253, -2192, -1505, 5517, -3474, 1894, 5036, -2612, 3287, -871, -3149, 2385, -4712, 259, 2134, -5961, 3008, 944, -2065, 5603, -668, 562, 2727, -4265, 2724, -543, -4492, 2359, -4349, -1346, 4137, -3782, 3210, 2384, -2256, 4118, -482, 197, 2470, -5451, 986, 124, -5173, 3297]
459C297m788j22N946o789N781M79o889N535l683j204N046p302M373J957o863Q109
475B883k061o81M920q002M069L046q156N000j181l286M814n899M355L954o809
490c034M958m09j849M764p234L004K931r075N627Q96l631N098n074K170O138p304
506b024L166J862l695K469n541L055M867r753L573L323k754M502m818J768O935
521F935r659J619M910n222K172m114P39O277p001K535L118l154M079m252R65O773
537F720r891R46N266o008L314k258j348P230n939l55O500l578N63k066L71M959
553D426q727J920N381o797M143j486k434R975o168l681P555l373L90j891k011
568b778O412n575k671N098m25K176m383j412J1470p646m105R023n975j101K704
$$ y = [3297, -1491, -1613, 4333, -2456, 3325, 3804, -3085, 2450, -1233, -2437, 2609, -4693, -320, 1637, -5226, 2883, 822, 141, 5061, -2941, 1128, 4174, -3982, 1018, -163, -3449, 1365, -4534, -179, 3775, -3034, 1924, 1515, -334, 4430, -2804, 200, 3131, -5944, -317, 579, -3052, 2046, -3028, -858, 5280, -2024, 1142, 3004, -691, 1778, -3763, -708, 4159, -5594, -2021, 1302, -1452, 3050, -1768, 0, 6935, -2724, -1105, 3805, -1417, 755, -3359, -2620, 3657, -3344, -809, 2309, -845, 3234, -1018, -53, 6720, -3171, -2225, 3041, -2967, 347, -1911, -3259, 3971, -1968, -2323, 4177, 599, 1162, -904, -533, 4426, -4301, -2381, 3000, -3797, 346, -1140, -3574, 6401, 233, -3448, 4107, 734, 1124, -767, -2778, 3634, -1941, -4612, 486, 61, 2237, -2146, -3558, 7912, 266, -3839, 5184, -791, -1892, 812]
583H12m134M598j467l327M356n76J845j707k581P354n320l166P006m775P3O52
599c57n170J0106k433r974J1198J883o678n76L045M263p830j916P853n321L47
614a560K298n662Q610m48p936P370l11k396K246n947L591L036o243J503J121J883
630A155j791k876R246l499p829J0576l366n795Q118n042j866L893l391K807N77
645I17j388J432k455M801K62o883M178p40n21J993q354P365N893j3900M734R685
661G019n844k623p6L937J453o837J386J002K18J972p515M438P583q915J960L501
677B659k626L674o235r16R515p446m217O598J68k943j454O748Q66j0974Q201N360
693F978r679J446Q00k28L720p798K451O255o216J787J712q23M005n507j885N246
$$ y = [812, -3322, 1276, -191, -3518, 838, 262, 2107, 400, -2181, 5173, -147, -3313, 3693, -1082, -1009, -357, -5527, 4579, 2146, -7828, 3370, 5253, -1425, -2001, 1044, 5307, -2523, -4439, 3414, -1907, -1560, 738, -4924, 3686, 3238, -4698, 2672, 2361, -35, 2211, -3736, -145, 2891, -3352, -1849, -728, 1155, -636, -3512, 5734, 2235, -5594, 4982, 1616, -4179, 3939, -1103, -2969, 924, -2467, 340, 917, -471, 961, -1494, 3307, 3569, -3314, 864, 124, -397, 1596, -6758, 607, 6500, -7400, -2666, 7019, 1175, -1448, -1524, 2413, 3866, -2971, -1585, -583, -365, 1607, -5908, -1470, 6113, -2802, -842, 2659, 33, 3707, -2528, -3444, 6071, -1375, -5592, 1006, 1174, -1769, -3223, 3525, 4391, -6583, 1618, 6978, -2701, -1255, -455, -683, 3037, -4761, -2310, 3945, -2271, -484, 1228, 405, 4410, -1097, -2982, 2264]
709B264n4j762o767M215R006j0866r87J0101n162k9J537k301M583l845k876M463
725A520k464L31K90k377L935j913J467J585n048N339l87n898P105l856n395Q822
741C056k704l705K647N41L033l325j528N885k279k386j021P49O291q102l615J0291
757C828l973j268L733o036N711L111q095K327L739k079m077j54P207m608m626
772e260P859k792j54L691n359M007O53o523P159k176o498O195J60k460j14K047
788D35J949l580J502K954n933N206p40q153Q659N28p869M624J70N36K247m801
804b266K176L073k242r08j826L988j426n116O245j834k809O593n657j13Q003o024
820a43j831L734j619M88j688j60J199j753K495r09r99M564m660O23N479p598K412
$$ y = [2264, 2210, 448, -6319, -2104, 6902, -3964, -4951, 5150, -12, -41, 1496, -805, 3778, -67, -2943, 1520, -944, -613, -323, -2700, 1235, -678, 789, 2374, -2674, 2665, 2278, -3620, 3485, -371, -5766, 3056, 352, -3353, -706, -165, 2868, -457, -1985, 3900, 1621, -765, -1786, -1037, 5254, -2848, -6463, 3828, -145, -1413, 2320, -3716, 1995, 5106, -2989, -662, 3077, 998, -3079, -3233, 3974, -634, -5260, 2599, -193, -347, 3344, -2015, 1992, 2645, -3878, 3281, 1105, -5393, 802, 962, -1498, -1612, 435, 2384, -1196, 306, 3260, -2673, 2533, 1793, -6360, 2299, 2827, -5042, -418, -248, 288, 2535, -2266, -90, 2983, 741, -167, -1993, 1995, 569, -4547, 1698, -136, -2945, 3648, -2009, -2122, 5881, -143, -1974, 1760, 141, 629, -1059, -1219, -20, -1773, 722, -187, -1186, 3378, -1282, -659, 4820, -2778, -366]
837c66L347o487L098J277k576J561j092O26J956q13Q44l100K694L647q365J767
853a982M792m962J203K30r69N208m473j404N913k273j079n53j90K305l685R97
869i22J657l293L651o02k526N484l235j672M961m023l93J547k217J616j659K65
885a361L426l804J354J413r86K888m238k7N015n419J17K402k898L232j615k101
901b602N145k363o24K149j768J955j942j471L122l243J068J672m448M253M05k695
917a387L874k577k51K824l807J263O78k670K797k260J56K271k369K610j85k049
933a082M198k948j651L516l182Q71P43l344L622m36j828L051j644J214l0k094
949a024L146j966j803L089l583J756J670m016L467M09k680L870j978m95J697k516
$$ y = [-366, 2981, -3506, -408, 869, -1707, -146, -1238, -612, 1344, 531, 1375, -1725, 969, 4616, -3749, -1982, 2810, -2152, -949, -719, -1688, 3520, -953, -2357, 3556, 1283, 204, -349, -539, 1766, -1919, -922, 735, -2558, 1093, 491, -2035, 3449, 214, -1458, 3503, -520, -913, 634, -1583, 33, -1626, -1361, 2065, -1739, -385, 1028, 42, 2930, -1308, -1335, 3680, -1739, -1622, 780, -2118, 1114, -501, -2602, 2543, 180, -444, 1705, -63, 1892, -50, -1521, 1601, -1642, -574, 1098, -3350, 903, 1308, -1387, 2487, -90, -341, 2483, -1324, -61, 617, -2053, 744, -1516, -1360, 911, -1458, 1152, 967, -1082, 3116, 168, -1483, 2033, -1149, -278, 465, -2879, 743, 307, -1521, 1530, -114, 1100, 1070, -1024, 2122, 156, -1647, 1442, -2141, -385, 1285, -2731, 736, 1145, -1535, 2335, 357, -138, 1559, -957]
965i57J778r27k057L390k867O98K262l122L171k06k751M070k041j487K692k978
981a332J276L52k721L044r39n05K059k187K428j81k815L453k028j814L424l492
997a978J265J688l259L394p84j503L275k411O01Q25k773K392j048j780L232k733
1013a597P39K199k955K952n2k219L071k257m08J926l044J833J75k517L049j806
1029i11K10K569k977K322K10k765L195j696j265K240k911J600O17k514L398j049
1045B73j100L159k998J268L54k563K543j052j897K990k620J043J945k730K736
1060A351n47j837L087k324j83J781l278K018j9k309L469k019M56K124k467J984
1076A287l50k264L078k439l46K176l199K153N16k808L535j151n62K411k825J531
$$ y = [-957, 821, -106, -2163, 1227, -1640, -942, 1320, -1802, 1369, 1163, -1588, 2482, 441, -1046, 1646, -1332, -56, 296, -2425, 619, -320, -825, 1234, -953, 1475, 1294, -1521, 1932, -96, -1910, 1514, -1978, -713, 975, -2284, 1110, 326, -1177, 2098, -313, 288, 1113, -1660, 732, -316, -2096, 1136, -1597, -858, 1341, -1614, 1338, 1286, -933, 2138, -119, -527, 1399, -1645, 188, 363, -2154, 895, -911, -701, 1868, -1109, 1213, 1423, -1342, 1853, 157, -1108, 1132, -1779, -179, 438, -2076, 1322, 273, -827, 2332, -666, 602, 956, -1607, 936, -116, -2013, 977, -1643, -600, 1345, -1385, 1351, 804, -1033, 2054, -270, -453, 1328, -1950, 68, 49, -2260, 1209, -810, -354, 1770, -697, 1287, 937, -1327, 1751, -688, -1034, 1142, -2057, 96, 612, -2196, 1339, 188, -374, 2037, -788, 743]
1092G43M41l106K845j750q95K943k901J554J374k599K694m31j587K469k524O59
1108g1J025k936K585p13j806L253k166O27K194l070K269J76k214K134k363%J997
1125I21k953J885P35j706J928j303M69K250l315J946r2k427K564j983m94K555
1141I80k535J217J612k114K171j173J36J746l001J149Q16l231K556p39j144L205
1157A651k602P78K395k979J945m93j555J819j864J66J569k401J531k21m23K550
1173A866k497M10K223l148J821Mk334J808j172l33K141k211J700L52j544L181
1189B267k334o38K760l342P76J232k379K330j293r72K933j994P23J385j886J634
1205A202j164n06K189l077R41N10k408L753j353j891L800j640o72J527j798J858
$$ y = [743, 1184, -1922, 923, -827, -1722, 1221, -1680, -126, 1248, -1351, 1343, 912, -675, 1794, -730, -71, 954, -1982, 603, -110, -1916, 1337, -829, -202, 1992, -1078, 1191, 1367, -847, 1287, -1076, -1076, 921, -2032, -147, 588, -1118, 810, -493, -24, 2226, -1089, 857, 765, -1662, 902, -1081, -1575, 980, -1555, -338, 1274, -840, 1331, 158, 294, 2040, -961, 188, 1004, -2227, 329, -410, -1554, 1651, -951, -173, 2222, -757, 1188, 695, -860, 959, -905, -739, 830, -1571, -40, -261, -684, 1866, -631, -221, 2002, -1146, 675, 679, -1655, 153, -1019, -1352, 789, -1422, 278, 630, -914, 2267, -67, -705, 2055, -1287, -511, 721, -1658, 672, -621, -1593, 1340, -654, 69, 1454, -432, 1202, 38, -468, 1721, -1356, -415, 95, -2313, 1440, 87, -1804, 1996, 356, -316, 1211, -587, 1271]
1221A271p45j969J840p40k37M41j612L336r63j651L666k661j125L201k602J77
1237c73Q34k021J784r24J81J475k037K177Kk258K895j371j459K156k296J412J04
1254B81k773L436k30k652L126m42k98K10j240J757j278j010K046k376J215J407
1270A179k989K214N07j782K126j448M24J318k956J197N72j752J467p41L1J334
1286G01j664K172o10j646L138k270j154K515k800J306J350l314K487N70j002J008
1302G87j138J121N40k562J732q04k7J391l679K401K352l729J872L21r01K283k212
1319b52k38J917k094N03k18j29J231j734Q41Q65j589K852k054j674M327k669j480
1336a595L287l096J93K048j455O3l45J418J067k808K196Q7k285K574k444j09L156
$$ y = [1271, 526, -1443, 397, -343, -580, -139, -1751, 1585, 622, -1029, 2637, -24, -1149, 2052, -550, -373, 461, -1560, 224, -700, -519, 956, -1081, 1096, 1098, -1160, 1735, 364, -1095, 1061, -1235, 177, 281, -2492, 944, 714, -1938, 1188, 746, 448, 658, -582, 1175, -103, -1113, 933, -1443, -228, 1179, -1810, 404, 911, -871, 1255, -193, 231, 1549, -1407, -210, 362, -1390, 77, -664, -633, 701, -963, 1209, 599, -1047, 2091, -179, -1333, 1182, -1618, -312, 1038, -2276, 211, 781, -221, 787, -351, 770, 1310, -1252, 480, -324, -351, 1040, -2639, -238, 2114, -1615, 257, 578, -323, 1960, -252, -490, 1427, -667, -164, -382, -511, 720, -1014, -173, 692, -897, 1955, -99, -1773, 2554, -115, -1595, 1692, -1404, -1211, 837, -618, -555, -900, 518, 1585, -1223, 973, 1060, -1225, 1349, -1095, -1204, 1952]
1353A952l892O32L008k449J470m88j853L169p11j178k90L01J772k816j06L099
1369A620l079J453J428l288L342Q7l606L323m20j914J365j507P83J41k32J333
1385H29k355J803J656l474K640o0k885L241j627j940L181j596k05Q85p91K479
1401A781j371j103J168J9P95j711j646M012k592r84L385l445J219K890l924J591
1417H4J869k266J33r3O35k37j902K038o63p08K842k889Q33K477k915J422K85k439
1435a494K641j235j560K071m60K49k64o13J656n69L58Qk123K761n92l428L265
1452F71q43j292K717k627Q59K363k246K98K02M47J44j867J272N97j913J511j528
1469a235J88L350k695j81J931k106J899j90k909K720p35j180J224q40J078k83
$$ y = [1952, -1940, -1308, 1700, -749, 721, 233, -1620, 1549, 838, -340, -630, -329, 1443, -1373, -1479, 1620, -1459, -6, 1422, -1866, 1476, 1563, -2043, 1280, 860, -1054, 311, -1196, -413, -272, -504, 829, -1526, 277, 1933, -1541, 1099, 1039, -1846, 1395, -232, -2172, 1009, -587, -792, 93, -698, 1781, 410, -693, 475, 494, 1289, -422, -2068, 1944, -648, -1632, 1753, -1692, -473, 2417, -1507, 84, 1953, -313, -180, -273, 362, 125, -1777, 261, -402, -1110, 1732, -1157, -324, 2153, -762, 660, 945, -1494, 1147, -88, -1648, 423, -37, 212, -52, -665, 991, 422, 780, 788, -1335, 1426, 834, -2594, 671, -172, -1464, 1253, -1374, -515, 1848, -398, -100, 102, 549, 693, -1174, 98, 695, -1218, 293, -1235, -1047, 2303, -392, -573, 1358, -748, 1151, 961, -1948, 772, 37, -1143, 81, -759, 319, 36]
1485C6m87J341j393J555Q07l999K832J020l846K186k64r89K323j716J8J311n28
1502B07J061j803M35J559k546R86N76j770K420j857q79L434j862j37J670k441
1518i47J606L33j830P44j33O12o26j333K362j008n11K639l002J038K447l740Q17
1535e32J392j938R48n98K12R97q74J000q19k72K214k295O2J809k458J127L10k096
1553a811K849q41j636K913j219j27J010j522J153j005J40N50j942J838K48k586
1569a988K925p34j430L089j828r71K426j622M6O0l10N85r82J83Q66j228J734l91
1587D30j169K193j717k61J794k489J116M09j994K303n65o86J068q76J138P3j200
1604d33J059j280%J910l116J447J517k524K195l78q10J755j367J88L43j103J078
$$ y = [36, -451, 890, -503, 1052, 1859, -2140, 692, 1712, -2134, 52, -212, -1201, 1122, -594, -576, 735, 207, 1268, -535, -100, 1459, -1087, -101, 475, -1295, 1125, -732, -1611, 1823, -39, -176, 1494, -947, 659, 992, -838, -94, -227, 385, -241, -1574, 788, -220, -731, 1908, -1094, -56, 2391, -1349, -532, 860, -1078, -130, -728, -516, 481, -393, 607, -212, -484, 1730, -565, -503, 1306, -1152, -25, 285, -1811, 1038, 197, -1439, 1474, 255, 128, 1138, -384, 769, -236, -96, 454, -1488, 350, 598, -1988, 937, 203, -1227, 1862, 34, -937, 1489, -133, -87, -27, -337, 248, -734, -551, 315, -913, 821, 430, -739, 1454, -263, -524, 1270, -1219, -103, 306, -1688, 615, 50, -636, 432, -444, 694, 767, -433, 626, -654, -654, 1256, -1860, -413, 1104, -1420, 775, 397, -413, 1342, -25, 163, 506, -597, 481]
1621D81r53l04J580j447K39J206j747J980m88j397J943j316q7J127k102J430P
1638A52j310J413n00J74O96j067J338k03j342K077j961L2J474k120O73R30j417
1655i61J782l62j044K040j730R80j75j473J626q66q68J515j153N41O71j417J681
1672G87o24p38K009j700l7J465k511J214M02j211J536j151P57Q26j619J169K6
1689F00j166J492j280l07J305j478L82L52m52J621j085j79J421j653O60K21j397
1706i43J169m21q12J620j399Q23O19j396J639m70j051J645j146R8O62j558J094
1723A73m16q57J764j471Q16J147j778J236J29j580J781j204l02J201j497Q66J09
1740A17j024J687p21m16J680j988J161l1j396J233r68k91J524j156R39L87j548
$$ y = [481, -472, -776, 804, -643, -404, 802, -945, 1035, 547, -850, 1093, -223, -310, 817, -1285, 145, 152, -1158, 255, -245, -71, 625, -442, 896, 693, -649, 1428, -533, -501, 973, -1147, -474, 456, -961, 821, 459, -585, 1455, -275, 705, 530, -943, 683, -183, -1051, 464, -689, -148, 523, -894, 787, 163, -575, 1434, -266, -303, 1162, -1349, -135, 267, -944, 592, -559, 198, 1024, -595, 574, 600, -566, 926, -354, -661, 644, -834, -452, -100, -552, 1069, -16, -195, 1226, -427, 233, 454, -943, 226, -195, -1007, 613, -786, 37, 656, -740, 899, 429, -622, 1023, -123, -25, 637, -921, 173, -243, -1100, 664, -807, 9, 1156, -622, 614, 743, -837, 944, -260, -562, 639, -858, 8, 117, -907, 780, 59, -357, 1323, -665, 496, 465, -931, 302, -666, -957, 567, -589, 350, 737, -811]
1757h11J448l04p93J078j140M69K61j518J832j003m72J712r82J28J260j857R29
1774B37K05r72J402j684N53P25j719J459j6r73J698r64J23Q66j353R61l8j393
1792h83J644j403J17R61j315J025K52j040J351m94m85R70j291L79M50j517J554
1809B75o16n51J287r29Q72M40q86O82k73q43J342j631L70O61j243J276q6o71J873
1828A349j337P2Q36j436Q25l47j127J482r12l59J304q83P90J9q48J529q83k75
1846b01O82j284Q61l8j073J430o16m01J652j266O94n7n97Q64q45k71Q29j395O91
1865c41M96r90J316l59r30J501r22K34R32j470R93l37r90J335j034l1R23p26Q18
1884D18l20m04J406j207K78N72j385R14r6j251J384n06l43R23j114Q53L68o69
$$ y = [-811, 637, 333, -460, 618, -522, -53, 208, -1310, 522, -481, -953, 759, -223, -95, 1165, -692, 237, 442, -530, 872, -812, -259, 466, -1253, 206, 190, -783, 915, -49, 74, 940, -413, 548, 510, -883, 761, -642, -525, 436, -879, 146, 398, -642, 709, 215, -270, 700, -591, -212, 238, -1279, 275, -341, -892, 395, -534, 338, 778, -108, 574, 301, -542, 800, -831, -461, 200, -1043, 233, 147, -524, 1349, 12, 84, 920, -516, 309, -38, -1165, 317, -595, -954, 350, -533, 257, 276, -572, 957, 74, -201, 481, -803, 58, 20, -1053, 377, -239, -640, 1012, -254, 440, 383, -214, 650, -195, -466, 363, -1032, -341, 155, -835, 481, 122, -808, 693, -229, 5, 937, -533, 460, 123, -867, 468, -566, -597, 326, -400, 418, 98, -306, 1100, -107, 171, 743, -642, 272, 176, -1075, 309, -197, -540, 383, -731, 122, 490, -179]
1902a79R71r20J55N39j856J532j3j047J540n68n79J016r80O10O44j328O22j06
1920E3l43M88q22O09r6q46J869n97p70J688j458m4J143j438N49K22r86J088o36
1939c27K78K47p26J424n17p61J591j547o5J116j777R35P62j721J459k71l6P15
1957G79r09M71J0n58O25j025N03P03j586P78P29j524J629j81q47J148o34n09Q56
1976D58r48M41m63k07P79p11J120q5j202J834o62j074J706j242l39J213j349J48
1994e83Q08p93P88n07L56N84j042P04j6l93R71j735R8J725j648O04M98j389J286
2013C16M87r90M89j38K66l12o36P70o98J38O90j422J180N02j219J253j16j004
2031d44J239j069l93J306j310N25J14j03O33j058N63Q37j344J288r40n23J757
$$ y = [-179, 792, -128, 27, 566, -1290, 242, 229, -818, 722, 154, -425, 591, -389, 221, 865, -463, 159, 53, -290, 198, -624, -15, -111, -957, 912, 315, -455, 1233, -225, -269, 874, -564, -15, 207, -779, 309, -327, -49, 198, -528, 896, 379, -382, 1209, -338, -403, 713, -1064, -129, 633, -1088, 371, 100, 64, 779, -130, 341, 351, -207, 418, -607, -104, 599, -987, -209, 520, -1004, 625, 444, -403, 745, 111, -398, 458, -490, -49, -512, -719, 60, -651, 469, 384, -818, 1016, 354, -720, 986, -256, -595, 618, -731, -583, 225, -568, 220, -287, 69, 653, -389, 315, 299, -94, 877, -858, -760, 965, -683, -79, 419, -970, 316, 803, -187, 302, 164, 430, 118, -518, 252, -446, -308, 382, -1040, 140, 642, -577, 676, 560, -444, 795, -274, -667, 639, -671, -146, -32, -135, 498, -560, 3, 840, -504, 784, -156, -679, 1078]
2048A078j303p61J640j121N32L9q92R70K97l69K07r73R58j69j012J079n43p6J248
2067H29j804R87R75j684J010Q7p44R58q83j78N98l77N19r85K69J241j017L30M68
2086E99j284J682n65j858K153p59q20J094q90P72K67l11k73N8Q35L7j543J395
2104E89m08q50J154q39l50J649j544K90J385j123K51j21l67P05m17K98r26R3J384
2123H53j326k22J812j479P26Q45k088J400L22j585O82M5o9om21P87j79O1M21j089
2143e10O30P23j749R63j19q75J334q34l71J432p15j89K17N55J43o14j09Ql41P41
2163C20o43r48J976p16n91J165o58l25J401j117n7L87j0l25R6k47K66p24R71l07
2183h6k45J124j159L93R41q97J67k9j100J177n27j31N81k08J99k23J22M23p73
$$ y = [1078, -225, -986, 654, -467, 65, 104, -788, 182, 479, 110, 317, -656, 302, 133, -879, 200, -343, -419, 829, -975, 12, 987, -697, 313, 400, -344, 614, -269, -447, 151, -226, 293, -692, -423, 818, -199, 131, 599, -685, 997, 432, -1426, 727, -32, -852, 242, -648, 124, 391, 80, -193, -135, 700, 737, -806, 589, 181, -669, 485, -354, -704, 945, -599, -309, 1076, -47, 204, 83, -284, 421, 4, 302, -624, -531, 853, -473, -695, 1117, -362, 364, 1209, -879, 521, 843, -742, -60, -15, -84, -90, -511, 276, 97, 158, 579, -510, 120, 843, -906, 57, -62, -937, 397, -437, -808, 624, -91, -280, -63, 492, 635, 21, -88, -80, -421, 320, -323, -1271, 705, -11, -602, 563, -95, -420, 981, -136, -193, 194, 184, -141, -45, -292, -26, -750, 221, -86, -331, 793, -366, 27, 968, 71, 238, 209, -891, 286, -241, -372, 209, 1, 200, -23, 99, 522, -251]
2202b51L9P56j138Q39J47j314J059L5k13L10m50N8Q93q32J86m28k28J171j360
2221g21P58m9p02J035k02n18J324r64m31R07r78P08k27n17M23K83p7J05l26J038
2241H69q24k07Q78o94L30K13j394R78J06j300J375k97k03N83o59P41l27j24L39
2260C83p84Q4O16q98L65N28p34R28m31p85J298n75j50P36j268J062n64j39M39
2279A11n41M71K26m95Q60l95n38Q99p93N1O91j154L89M33n60N67o33N40J54l48
2299f5M01k50p31J464r31M7M85j218Q83J30j084J346m35m1O13o49N6J14m07L07
2319C5m34N0P16j043J040j39p34J089n02k59R45r28p3L78o96O54m32Q7M58p28
2339e16Q20L12q35O89n84r7O58p14j82Q64p72L72j71m70P97P0NJ37p00M63K6q93
$$ y = [-251, -212, 544, -594, 245, 392, -922, 137, 172, -41, 269, -181, -123, 770, -62, 124, -304, -532, 639, -721, 37, -12, -714, 321, 119, -399, 925, -39, -470, 437, -541, 167, -60, -577, -154, 129, 52, 157, -169, 869, 45, -162, 716, 22, 352, 565, -829, 149, 255, -1045, 330, 33, -170, 413, -246, 495, 168, 44, 383, -401, -317, 299, -599, -234, 294, -440, 488, 57, -728, 570, -5, -155, 581, -687, 375, -189, -328, 111, -430, 41, 267, -228, 632, 237, -301, 598, -195, -144, 547, -607, -218, 215, -345, 222, -411, 129, 283, -65, 336, 86, -645, 819, -112, -65, 420, -798, 85, 215, -869, 477, 42, 1, 614, -35, 21, 135, -272, 35, -399, -349, 367, -676, 364, 225, -509, 580, 78, -181, 764, -164, -237, 141, -555, 99, -333, -246, 212, -516, 304, 616, -219, 470, -114, -211, 447, -267, -449, 415, -357, 15, -156, -626, 171, 241, 246, 383, -317, 146, 172, -721]
2361g21J267q11j06R32j110P36Q5l49N37k29l69N82p95L80J41p97P92n05j19Q40
2381C81n17R1Q43j028M56o6l91Q22q78L9O94r82M62M41p66M27jJ19K70n11K09
2402A14p2q59J242p84J17N87n37N2j68K23P44n44J0M45p61j60M50m52M56J91o26
2423c32Q83n87L45J54q91Q08l74k39N75o78K44J9o05Q14j56j54N48o01K72M94
2443E39j075Q71%q41P24l29k94O81o68N88J12l95N43m17q7N14q69M10l0m29P05
2464B53k55n45Q79o28M04O96j143P81n12M6M33q60M97J22m53N55m18n6J171j051
2484h4J68K35l71K31n42o8P63p02R7N94n60M05L13n36K11j41j31N15o85rK63k59
2506b93N60k28p21J159n49J97K39l71M19n26n56N96l16K17M57q95J045m93j71
$$ y = [-721, 546, -265, -371, 561, -549, 187, 272, -77, 460, 231, -138, 444, -351, 29, 170, -627, 165, -340, -459, 381, -136, -45, 798, -230, 226, 160, -231, 591, -287, -248, 446, -536, -74, 367, -399, 28, 27, 146, 416, -95, 114, 42, -817, 425, -359, -242, 345, -192, -140, -308, -85, 659, 115, 125, 570, -191, -351, 99, -353, 103, 294, -332, 551, -36, 309, 463, -428, 380, 6, -233, 342, -336, -92, -73, -678, 136, -20, -174, 374, -227, 45, 539, -536, 335, 335, -506, 218, -111, -405, 276, -392, 196, 308, -87, 456, 39, -48, 466, -403, 7, -23, -452, 253, -2, -547, 332, -296, 108, 804, -339, 442, -70, -24, 409, -451, 46, 168, -285, 270, -148, -204, 967, -84, 84, 319, -52, 179, -363, -431, 332, -370, -273, 321, -239, 166, 479, -57, 154, 13, -118, 397, -288, -297, -34, -293, 267, 39, -682, 477, -72, 125, 364, -7, 412, -114, -670, -74, -390, -173, 284, -611, 434, -59, -230]
2525b30O05l34lJ95q05R04k36n49O24m55J74K21n35O18j98l17P68n70J37L57p31
2546c60N08q3n75N34l26J59M78m59L40k83p3J64l24j5M32p82P91J57r11R56m83
2567a55r0L61k32L26P5n46M04j40m04L31l20N44k37k44Q54o87l9O82q42K08L42
2588A91n28L24j33l07M82n47L10L62n85Q31p4l93N82p04J65J99p96M32K08l35
2608c16O22j40m05P36n61M7N23n80J28k62m08O88n12O39k33n41Q78l37j21M45
2628B90m76L10J43p06L30J21m43J70k85P72q3k75M76l84k1M83p27J87L95o85M69
2649F1j94j48M56j66j16L72k71K39p1p5N77r85L3O58j126P17K17o59R21j68m42
2670a70N12k97L63m04j93L88k99K07L8p49P18L56p73Q08l40m44R46q26k88Q96
$$ y = [-230, 375, 41, 38, 233, -572, 332, 96, -453, 171, -284, -110, 111, -424, 194, -4, -321, 447, -123, 14, 371, -360, 148, 65, -510, 24, -302, -143, 335, -124, 216, -67, -140, 24, -300, -315, 117, -665, 126, 283, -628, 328, -155, -245, 116, -116, 210, 285, -261, 143, 3, -401, -70, -390, 154, -83, -327, 527, -160, -199, 483, -359, -151, 191, -337, -13, -146, -453, 29, -518, -208, 154, -431, 400, 326, -67, 515, -189, -24, 175, -621, -189, 19, -316, 306, 166, -239, 497, -64, -17, 506, -74, 54, -208, -616, 72, -440, 199, -34, -575, 303, -34, -155, 290, -186, 124, 267, -439, -109, 12, -431, -261, -546, 226, 143, -132, 344, -40, -61, 422, -305, -118, 277, -408, 61, -133, -281, 175, 9, -107, 265, -6, 233, 162, 87, 664, -321, -288, 370, -756, -39, 178, -481, 440, 272, -170, 342, 45, 408, 4, -189, 199, -100, 107, 145, -604, 114, 470, -303, 505, 165, -279, 667, -159, -447, 449]
2690D49o00k21M34l40L69j70J57P4l44R92o44n88R28o36k3M26n96L38L93r65Q73
2711C06k72P5K66n90K54J59n15N72q24M75O45r38M39M06p96L18L35n77L51k67
2731a78L90k35j53O51p47K18j30N4M90q8q70J188m72p93P87m23K91R1l85J78M01
2752B65k87J46k30M32J28n67J76Mk48M43p22j28J033m01M5L45n11L59p5m93KL42
2774E8K06l04l11P13m07k23R63r40N16L68j067N27K36p07J72l12J25O69n12J52
2794g8J36P6K64n09K86L3l64M58j73r13R99o12M1O71l43r9K46k26L87j5m67L08
2816A06m44P02m65l06R09o78J6O34o84L4N27o21O10p5m91M76j61n88P16j99r3
2837g5k3o1R03p99L69J68q27M91k04n74R82k35l80L59k81L18K07j72K09o37M62
$$ y = [449, -151, -372, 62, -278, 91, -79, 78, 152, -192, 800, 156, -432, 496, -140, -163, 263, -333, 5, 398, -567, 306, 34, 109, 375, -215, 39, 198, -317, 255, -569, -94, 551, -387, 52, 458, -338, -20, 315, -262, 89, -178, 212, -23, -176, 475, -272, -54, -184, -130, 360, 272, -598, 590, 118, -675, 112, -311, -20, 71, -314, -136, 265, -22, 124, -106, 326, 454, -113, 63, 67, -181, 262, -460, -588, 445, 44, 89, 434, -77, 282, 207, -286, -284, 58, 264, -40, -351, 362, -45, -268, 695, -245, 271, 639, -428, 99, 335, -372, -200, -512, -387, 282, -230, -78, 58, 134, 398, -111, 175, 208, -156, 302, 129, -784, 215, -397, -356, 315, -28, -127, 119, -107, 280, 265, -202, 106, -338, 364, -101, -407, 502, -176, -160, 474, -210, -176, 351, -270, 340, 265, -226, 250, 89, -499, 217, 18, -75, -98, -159, 744, -55, 314, 482, -345, 146, -58, -632, 350, 115, -265, 94, -187, 131, 338, 166, 375, -262, 200]
2858B00J04j008R71k61m84N77k82j82J069q53J07K76m54M11l3j79L41m58K84m73
2878c27J07J043p45n47J210j078L05J36m96L86L56n48J86j11K20k74J6M13l92
2897a40J12L58o02N7O37j164Q59J29n75K99j11J50L09j67J90k37K24L7p89J74
2917b50M27m14kK42n33J195n88j17N42m56JN13o65J95k68J13J28k71K24L21p88
2938d51Q38n88O6L58m85lN13o74M95j13J29o1M3p9J69k75M00k05k80M05l54k6
2960a78M99j029Q84J83q61O09o3rK85m21J13K04l68K9kQ3J47l70K76L14p45P42
2982C22j99L1L99m64j99M02q44N94r3n52P28j42L45k12l17L28k63K9N64q44L60
3003b7P9l46K83K82n12M77k21J40K64n88K63J01k63J20j35J80j21j38M85k13n08
$$ y = [200, 304, -704, 267, 6, -478, 99, -183, -365, 704, -149, -42, 234, -220, 191, 158, -21, 320, -138, 146, -327, -220, 823, 78, -469, 741, -337, -32, 104, -392, -6, 350, -198, -12, -123, 97, -177, -161, 252, -140, -28, 330, -272, -215, 422, -742, 117, 246, -329, -30, -141, 9, 318, 151, 341, 104, 328, 365, -424, -250, 177, -237, -239, 3, -530, 665, 77, -40, 502, 46, 47, 560, -105, 90, -178, -65, 63, -208, 16, 337, -451, 387, -201, -135, 223, -262, -265, 248, -426, 69, -44, 85, 24, 67, -12, 157, -118, 282, 77, -203, 202, -152, -178, 321, -708, 176, 359, -502, 107, 44, 35, 320, -101, 12, 216, -152, -123, -125, -42, 105, -265, 11, 325, -420, 322, 123, 154, 553, 89, -110, 292, -552, 42, -51, -603, 125, -17, 328, 116, -201, 127, -136, -107, 457, -387, -27, 52, -294, -11, 271, -241, 236, 15, 155, 419, -169, 94, 195, -68, 52, -83, 97, -24, -162, 323, 110, -398]
3024c98N93j10j4J91n73K53K97o53K01K18K7J62n30O03n4n71P37l94q6M47r48
3045f02M82K99o28M61J73n44O39n38M77L32o74J97r1j80M06m85k53Q95p32O93
3065C27k47l25P51l52m40N77l78J48l94j31Q35l96k45O84m50J12K62m73N67m88
3085e6J09P2k75J36l35R4K11j09M7M50j01m2J62m52L4L61o86O95o05J58J91l84
3107c25K24J30k53K14J75k3J17n73N27l69k84N59j69j16K17k65J03O0R2n3K2k89
3129b79N51o72M06J41n30N46r3l86N96m83J99L74m94N3J64l14L49l98Q9N72n08
3150a17K07k49k03P03l9l65K74k82P9L5n99P01n42K89J28k45M27K18m53K97m52
3171a88j76M32m46L62J46k47K65l72k2O94p33N19j32k42N79l26l28J92k75N2M97
$$ y = [-398, 195, 85, 71, 262, -311, -58, 239, -414, -213, 5, 32, 194, -336, 267, 213, -358, 379, -15, -101, 346, -602, -120, 179, -449, 12, 185, -359, 280, -258, 219, 551, -123, 74, -17, -197, 209, -276, -529, 366, -366, 327, 80, -245, 506, 154, -286, 291, -87, 61, -333, -464, 371, -25, -270, 414, -36, 76, 338, -135, 432, -56, 53, 125, -150, -14, -349, -255, -44, -153, -106, 344, 243, 201, 363, -89, -55, 306, -380, 315, -290, -132, 59, -325, -101, 29, -224, -10, 165, 142, 259, -314, 213, -156, -440, 119, -50, -166, 51, -214, -111, -51, 41, -12, 10, -279, 272, -400, 6, 147, -383, 163, 70, -316, 280, -203, -4, 370, -124, -71, 93, -221, 128, -270, -181, 391, -117, 90, -159, -362, 341, 302, -63, 211, -71, 8, 43, -556, 145, -397, -108, 20, -225, 202, 420, -33, 264, -188, -364, 68, -378, -16, 130, -117, 148, -224, -246, 448, -285, 234, 102, -140, 439, 113, -215, -23, -298, -246, 251]
3192B51m85K82J88l33M28o20N62j57o19O53m77j86N21j36K19J8k51J99K02l67
3212a08O25n99N2k1j56NM3j53N07l36J76J73o94L09J70l33L96k22Q6K26j50K5
3234B1L6l2K38l07L8K20n16M92K35p24M73p8n82L77P7L72k11l4M2k20Q6M45n47
3257i9K85k15m56M88L4k89O92m18k22M93j69j90o8L89J75m19K09k24l86N41m5
3278A06j71K57r4k09K04k87K04K89l69J33j80m95J027n52j5M90o17O81m35k52
3298b85M40l88j5J39l8L83m40k0O6K97Q8j94j1K51m31J09L36n60J92R8l47M71
3320A41j53l63N28k76m7K43k26q7K26p5r6j28L24J86l87K87K7l82M85k8l53J06
3342d8k63J17K20k21L16p4j90K06k76O61q6n97M75j04k36K40n77L70J29n25L69
$$ y = [251, -234, 48, 236, -97, 331, -289, 273, 116, -503, 150, -327, -513, 8, -128, 91, 109, -142, 57, 259, -108, 517, -82, -30, -51, -207, -202, -159, -312, 195, -141, 35, 208, -486, -177, -7, -340, 56, -166, -80, 146, -4, 21, 57, 25, 263, -44, -6, 214, -302, 190, 425, -299, 174, 96, -486, -109, -32, 340, 129, 95, 137, -83, 3, 448, -99, 186, -29, -485, 3, 37, -252, 440, 22, -200, 293, 124, -66, -134, 255, 430, 11, 220, -4, -390, 151, 106, -65, 192, 98, -111, 93, -194, 10, 299, -70, 63, -117, -612, 415, -137, -152, 338, -279, 402, -33, -285, 155, -233, -248, -109, -147, 236, -204, -224, -158, 139, 227, 33, 22, 273, -158, -49, 287, -273, -81, 17, -330, 141, -12, -375, 153, -123, -170, 73, -153, -240, -14, -89, -185, -313, 11, 197, -190, 97, 124, -258, 227, 199, -154, -48, -311, -194, 26, -195, 121, 47, -143, 63, -213, 448, 362, -235, 240, 136, -100, 140, -437, -67, 62, -463, -94]
3363i4K82k29K67k56K55J4l07J14o2J31Q7m10P1L42k30L30p3m37K93j16j78N43
3385C37n02NK81k23m5J60K1n2n1K43m2n42R80n48j39K07l60r3N05j13j54J70k29
3408a84N23l51k88M22m36O85n23L87k25l25K87K44l57J66R1m73O23r9j05k5l03
3429b66M85k4m10K99j42L7K85n99L49M84n29M83n39k02P17m15k50L06l34N46l62
3450h1L8K22l33L59k21l09N89p9m84J45j53L75K92l73J51Q7k98L38j58j4p6l21
3472c04O99m44l41M41m12M57j4n65M47K39n55O04m33l51O10l9m2j50pK51j09j12
3494a30L75n38N35k16l63N92o79j50Q94o51J80M29n69N38q6L9J29p91M97K11j99
3515D7k54K82k37K46k81Q4N32n80L07P0j45O6r2o8K45m25M07l0n58O19j72J24
$$ y = [-94, 188, -41, 226, -30, 225, 239, -68, 46, -16, 115, 202, -208, -137, 205, -25, 305, 232, -205, 88, -28, -206, 337, -165, -160, 121, -102, -147, 13, 34, -18, -69, 174, 132, -410, 570, 22, -117, 90, -270, -363, 142, 29, -125, 45, -184, 339, -12, -300, 122, -314, 371, -152, 235, 10, -315, -28, 216, -141, 25, 116, -357, 266, 167, 62, 37, -266, 219, 195, -215, 84, -58, -21, 264, -335, 14, 498, -31, 452, -87, -289, 428, 13, -237, 69, -265, 281, -81, -43, 179, -154, 205, -16, -325, 264, 185, -299, -154, -307, 68, 360, -13, 138, 225, -73, 265, 107, 93, 17, -304, 395, -49, -390, 51, -361, 96, 82, -483, -36, 203, -352, 252, -181, -532, 78, 39, -3, -153, -160, 91, -18, -130, 245, -293, 242, 26, -337, 255, -424, -574, 320, -331, -151, 278, -291, 247, 161, 200, 329, -462, 35, 246, 47, -207, 75, -162, 84, -197, -113, 419, -161, 146, 216, 71, 137, 45, -23, 222, -203, 204, 174, -384, 235, 63, 187]
3537A87K15n33K76J02o20L49K82l22K41l96N24r8k68j10L19l0J18k99J60R9l87
3558a91L02j15j05L67k52l23J32N9N48k81k68L15m59L75L3j71J90k9n31M89J41
3579B26o9J04k94J74J45n01r1L49R5J7l55L64m26K23L1J37J74k72l41K90J76n01
3601c45O43j96m62O68j48j15j04N3K45m48J49J46m42K67J19k18j15J67J33L43
3621C40m64Q4M45m11K38k24j58J02M65m38N18p35J27l5J78J30k82k52N96l46L92
3642B70k44n30N52J75q7j83K70k37k04l7L53m39K00M02m30J40m8j68O00k21j18
3663A6M82o80J04K91j87l00P0K5M89l33k71M32o07L78Q4l48P63m16n4p2q6L39
3685A19j28L16k98p6M6L18o54P09j99m20K88K48m82L44k23j60K14n9K57k11RJ78
$$ y = [187, 402, -131, 145, 247, -373, -24, 258, -64, 177, -219, 305, 207, -61, -171, 148, 118, 236, -63, 97, 196, -191, 111, -4, -109, 258, 6, -317, -185, -126, 422, 141, -127, 188, -271, 104, 137, -34, 156, 127, -404, 85, 226, 157, 261, -33, 141, 286, -215, -306, 43, 138, 155, -200, 164, -262, -39, -8, 129, 303, 31, -310, -20, 156, -345, 298, 102, -360, 308, 160, 45, -59, -6, 239, -209, -60, 86, -356, -89, 30, -188, -303, -136, -3, 340, -124, -40, 405, -6, 232, 8, -150, -48, 417, -21, 497, -238, -111, -146, 32, 162, -120, -372, 224, -122, 270, 26, -504, 48, 223, 136, -47, 223, -14, -218, -255, 98, -341, -141, 261, -169, -29, -77, -245, 355, 134, 16, 498, -182, -78, 213, 26, -274, -204, -179, 310, -23, -294, 138, -469, -91, -7, -355, 408, -8, -62, -134, -220, 119, -9, 307, 9, -67, -21, 297, -357, 352, 153, -267, 21, 269, -213, 131, -92, -252, -38, -97, 160, -51, -42, 136]
3707A36j09k90L01r8R3P7k47L56j97p4K49l64M52j1l28L30k84m8K08m39L31J47
3729A91n92M90n4j46N89q02K13J69Q4n9j1M4M3j70o8l8J31J54k13r3L52l67K49
3752I6m3j14j04J79k15L1L3j86Q32o20L86j38j5J33l63O9L41n31K17j38o2L95
3774A83M5m71L70m8M4j73q2K31l64J70L28n70K37J19J0K63nm47L04l08L78J23
3796C37n03K14j75p5K52j63K58N0n07L70k4N4J33m01o2L58N7k06n2j54L57l81
3818b63K28M10n01M86k79o9M72o04O5J04m45N60m85J33L49l88M35r9k66R1J76
3839A10k50J85k24M41l15k62L71P8k21K8k7N3rO0J88k12q4M2J5j29J88J7o2j2
3863c1P6J6L9k59p2M15n6o9j45J43j40m7K89k41K89o0k33Q5k31K14K29k35p2K07
$$ y = [136, 27, -263, 38, -60, 33, 110, -137, 219, 22, -52, 197, -167, 285, 274, -54, 276, -8, -56, 152, -287, 44, 191, -401, 89, 35, -111, 478, -324, -111, 58, 142, 83, 72, 116, 159, -11, -79, -117, 14, 168, -45, -138, 214, -153, 96, 53, -61, -165, 14, -201, -170, -137, -323, 509, -111, 275, 137, 122, 255, -108, -39, 302, -229, -12, -150, -212, 183, 228, -243, 127, 79, 123, -50, -132, 99, -265, -95, 233, -337, -100, 19, 29, 292, 287, -160, 144, -164, 214, 337, -166, 48, -127, -202, 50, -113, 145, 195, -312, 58, 34, 88, 221, -180, -242, 116, 173, -33, -85, -239, 118, -263, -35, 375, -126, 360, 81, 12, 484, -120, -55, 49, -396, 164, -321, -188, 161, -227, 208, 109, -157, -66, 110, -140, 45, -179, 262, -53, -315, 56, 134, -87, -59, -86, -33, -42, 18, 206, -6, -90, -48, -33, -162, 26, 43, -19, -31, 45, 61, 100, -159, -231, 184, 128, 59, -86, 57, -83, -130, 159, -82, 207, 147, -86, -1, -232, -18, 211, -24, -96, 111]
3887A11K1p2k17k73P89l71N0J36l90L05J10n39M47n09MO01k71Q9J58l13L22J34
3909C22k45L73o31L65j62J77q3k57q8M01j66j76K37j4j7J33m42M40j87m3j44R0
3931a17n3J33j14K98K70o63L50r2K20j38j56J63m69J41L57l55J92Qr9K36l2j39
3953e9J55l30N3M37p40N36k2q8m7J62j68K26k46L05j82j95M68m18J20j70j58M06
3975D5j42j39L77j62q9L55l08l95N46k30J58r7Q9J74r1l42L21k95M93o12O9J55
3997a20J1J36J16j79N0J29k66M65l00j79J27J25k9j78J55J79k55K36J8m34J63
4018c0J77r5P6K12j97l4j42J09j91J66J63l10j62M27n72O66r9n41P40m70M87m32
4040e2m33P15k26k11M57k91j44L68k34M43l29r6L1R3l81J33OP9J77m40M75k6l04
$$ y = [111, 132, 60, -157, -430, 359, -12, 38, 174, -216, 89, 199, -340, 107, -402, -398, 203, -68, 21, 179, -134, 188, 322, 77, 450, -181, 184, 22, 199, 116, -141, -229, 172, 6, -170, 67, 53, 36, 169, -273, 167, -20, -63, -207, -117, -170, -37, -151, 147, 417, -246, 104, 12, 232, 94, -62, 101, -368, -227, 130, -225, -33, -25, -124, 112, 80, -59, 96, -234, -181, 256, -484, 52, 30, -58, -105, 57, -111, 115, -131, 174, -8, -203, 265, -153, -33, -203, -361, 45, -97, -236, 141, -21, -110, 245, -63, -458, 88, -142, 16, -81, 8, 182, 91, -251, 70, -225, 268, -344, -275, -120, -109, 27, 143, -36, 14, 143, -123, 342, 42, -137, -10, 115, 86, -92, 63, 242, -13, 223, 241, -193, -30, 147, 52, 128, 340, 143, 109, -33, 76, -115, 51, 214, -96, -258, 169, -403, 263, 164, -377, 363, -107, 380, -52, -485, 230, 4, -207, 250, -41, -185, 183, -51, 392, 63, -33, -2, 91, -290, -157, -151, -72, 105, -335, 140, 114, -190]
4063a90J75K39j71j45K0M06l37m6j33P4J52K40m08K54q0k87M5J50k10K96r7R1
4085C8j81M46m18J7K6K98p2j58j13k15P99o05M8M07p63L28K9k77M95m16J49L47
4107B09l34P9M2n0O1Q3k79K98j39l6L4J40J0l16Q6J78k16Mj8P9K34L2j50K13m08
4132a64K32k2l61O81m70r0K62m49J96L14p8K6K9j62k56J91qL05l00L89m8j90k17
4155a90J71k32J88J23K0n2j1J19J1j9l3k03J54l37O5O5j26LJ30j53M8N67m40K79
4179A47k09j73L30j97K55j95J93j41J9Q8l44L9K59J26p36L72N04m38J68P1l33
4200a95J45L13m42K00K78r5m3j11L01m64j49L75k73K52J90o21L13L7j7M5O6l89
4222b84K29oj10J18K34j07n60P55n39M2L92k99J66L02n22K77N5m98K34j17L05
$$ y = [-190, -15, 224, 53, -92, -72, 334, -3, -49, -182, -108, 44, 284, -124, 130, 50, -237, -192, -42, -252, 44, -53, 38, -143, 303, -115, -98, -72, 226, 154, -4, -117, -332, 467, -138, -90, 317, -446, -118, -89, -366, 129, -287, -138, 209, -125, -46, -4, -54, 7, 90, -189, 109, -30, -66, -32, 108, 118, -198, -112, 66, -150, -146, -164, -85, 149, 181, 31, 244, -164, 68, 46, -315, 366, -104, -194, 68, -381, -185, 129, 51, 77, 106, -56, -312, -121, -129, 176, -124, 265, 217, 27, -190, -19, -251, -63, 60, 80, 28, 17, 136, 147, 128, 95, -108, 46, -291, -226, -161, -287, -284, -154, -307, -259, 308, -132, 147, -62, -235, 95, -102, 153, -42, 151, 10, 29, 117, -227, -188, 71, 197, -539, -167, 337, -101, 67, 138, -195, -50, 263, -179, 21, 299, 204, 161, 50, 351, -113, -262, 113, -160, 92, 282, -339, -26, 11, -6, 39, 105, -284, -55, -61, -171, -53, 181, 74, -486, 269, -270, -228, 164, -135, 31, 333, -189, 88, 143, -355, -121, -238, 67]
4243F7nM8Lj92M1K29J50k43N0j77J7K2l44M86l57K75r8J46q4mj6l30K69l1%j13
4269a91J34L01n33N18m35j23N99k67J00k44J3K29n33L80p7K06j61K35m78L83k13
4290a57J81j34O3o4M33n87K09M2l70K62R6J08L18n81J17M21j31q0l0j83P8q4K8
4313d5L36j68j13J66j26j9J46n42M21j79K17k67K2N6j82L51j1M2J27j81N2l3m0
4336C0l9j96L24M3k56J31rm40M23r8n4M58k72L1M7m1k05K9L03k72M02k32l53L05
4360E9j67j34J84J89J04j52M0J02m19K86j12J59M43p13p0K21L07j26q5m95N97
4381B18m71L14m18N04k65K31j20K55k10k15K30j46K02k15K79k80j2p2M1J96MJ90
4403B40k61J52k5q0J51j67J81k78j6K51l23J9J06j06K66P0q3N5O6p2J60m94K39
$$ y = [67, 62, 110, 113, -79, -38, 191, 341, 98, 148, -29, -12, 10, -334, 152, -205, 70, -28, 118, 34, 30, 14, -316, -47, -78, -78, -191, -57, 244, -289, 229, -206, -329, 270, 3, 103, -141, -128, 101, -432, -52, -129, 77, -84, 151, -327, 56, -157, 24, -110, -47, -111, 322, -265, -56, -14, -384, -122, -26, 82, 400, -181, -64, 357, 226, 146, 116, -67, 11, -73, -45, 291, 123, 10, 176, 50, 31, 177, -365, 56, -123, 94, -173, -151, -95, -277, 74, 63, 105, 232, 51, 103, 70, 30, -9, -205, 119, 162, -94, 37, 28, -412, 11, -87, -141, 317, 45, 76, 123, 82, -123, -94, 209, -63, 339, 107, -246, 59, -108, -242, -58, 131, 235, 83, 123, 225, -194, 92, -20, 139, 582, -131, -201, 20, 327, 201, 116, -379, 218, -253, 61, -357, 147, -118, 113, -7, 248, 38, -177, 53, -93, 109, -106, 173, -107, -119, -191, -150, 46, 50, 240, -21, 131, 106, 26, 177, 10, 191, -87, -103, 148, -175, -156, -50, -156, 110, 180, 97, 152, 218, 146, 306, -188, 51]
4426E1J42j90K33j93r9K45m73L82j02m6J94j08R2K8j17j10J28k3R2jl47J42J52
4449G2Q3j94J25J04k88k17N56p73N02L5l4J36o6k67L28k51OK32k31M20l73K3O4
4472hq0J04L65m60qP3k08N55n74K0L95Pk26M5J9K13J4k86m8j4K57k77J5J03K86
4497B82m18J15j2j43J90r6J58j02R0p8N06p72N00l21J02j34p6J0k21K81M25o99
4519d13L93J72k23L16q2k19j17K9L86l7k08J6j96q0M28j08j40O2k24K21j50K40
4541F6j51P2M4j1l42L52k06K25J3m68M71rk00K02n4J9j82N0J78j48nJ14J04m5
4565H9P9k02l9L1qKj23O4J71k13K99J76n88L1K23L8K40k23j22K28m40K64M4j10
4589h9K32J46k57m6j24P2O5l69M03j11J06j26N3J72j77K2M2k8QJ12l35J23J99
$$ y = [51, 193, 3, 236, 43, -56, 189, -284, 98, -4, -50, 144, 36, 128, 156, 39, -71, 57, 34, 126, 125, -222, -80, 72, 155, -39, 86, 190, -98, -315, 241, -532, -30, 5, -29, 107, 41, -226, 102, -149, -143, 89, -142, 278, -95, -72, -8, -88, 16, 381, -79, -87, -14, -222, 333, -241, -221, 174, 181, -45, 0, 19, 232, 246, -40, -88, -102, 155, -122, -107, -4, 282, -136, -21, -33, -176, 14, -82, 76, -26, 64, -14, 492, -280, 220, -101, 1, -133, -209, -199, -420, -139, 286, -413, -20, 152, -71, 245, 163, -56, -173, -144, 242, 205, -3, 13, -183, -263, 165, 57, -83, -21, -245, -24, -174, 66, -85, -13, 31, 20, -322, 30, -176, 49, 62, -406, 65, 56, -144, 58, 4, 23, -159, -109, 69, -79, -84, 30, 134, 89, 168, -34, -73, -42, -50, -48, -171, -107, 64, -149, 150, 326, -262, -231, -8, 30, 270, 47, -75, 153, -287, -23, 21, -89, 143, 289, 32, -14, -138, -66, -1, -370, 33, -78, 28, -98, -45, 127, -50, -28, 14, -14, -6, 106, -229, -106, 93]
4612I3j26L4J50l92N43J14m84J79l67M63k51j13j60L99j80j01J71J35Lj77L57
4633B90l70M98m70Q8k5j24R0k78N07P2j65m19L56%k16K22j86K14K2l1r7k11K16
4656a7J12n13K22L98j22k75N00j53m9m43L60J3k40L61m38M78K08n99P3MK56J5
4678A51k58J04o8J51j17k02J81p7J60N1k3K10n5mK16n32M33l18J22k54K35j99
4700i3n6j8K82J2m4j95J97o3l7J16k94Q4J88o4k12L59j42j97J25R0J94L0l55L4
4724e9Q0k27l4K74J17l38K67K44m57K52R1k45K99l44L2J70r6l08M49k22j14J81
4746A2l78L98K76l13j23L6J04j62r9O3K20k26K17J09j70j89N2Q1J94l6N8j28J5
4769A1k01k0j97O68k78J10j48j04L17m51j3K37p2j17P1L94k05J40k3J09l59K71
$$ y = [93, -33, 1, 151, -241, 302, 416, -68, 111, -256, 207, -44, -157, -317, 82, -98, -199, -28, 107, 110, -67, 290, -80, 418, -52, 36, 11, -113, -23, -301, 206, 278, 113, -306, 50, 50, -166, 56, -130, 84, 106, 75, -22, -233, -17, 95, -418, -196, 202, 80, -195, 305, 152, 103, -340, 20, 33, -207, 154, -284, 194, 402, -197, -124, -120, 136, 151, -107, -3, -71, 80, -37, -239, -58, -135, 25, 76, 53, 263, 208, 204, 420, -112, 321, 3, 125, -129, 106, -93, -149, -167, 115, 127, 83, -112, 85, 22, -15, 101, -193, -109, 79, 15, -197, 162, 20, -177, -52, 38, 232, 262, -93, -59, 21, -206, -240, 34, 151, -187, 80, 324, -133, 119, 210, -35, 264, -80, -48, 122, 26, -282, 167, -55, -169, 12, -366, 32, 308, -5, -128, -92, 12, -150, -249, -186, 34, -192, 25, 134, -36, -225, -173, -92, 102, 66, 124, -4, 11, -190, -210, -407, 261, -17, 93, -55, -159, 158, -293, -306, -69, -141, -258, -187, 207, 2, 142, 119, 228, -131, 140]
4791A40Q2k47K12k88k81K94J37p4K26m35J78j83M03l60l2J58J1p7J64j02k30M47
4813A43k82K13n8p6M59m37j59K18j35P1J27k39J44J28m07M22k39J35M58p73O66
4834C79k12j76N9k42r5L32k01L24K6k68K77k14L4K20k80K45J46n12K20j22J07
4855D7L2r4kO4k18J78L2k65R6j45M52k59k5J44L5n2O1j28P3K46n52J75M74k36
4879A33j08p9L0n0j46M24m21K14K41j9l53M49l66Q8K41m04K42l00K12j00K61k15
4901b6J55Q4m35L78l71o5k4K66P2j99J42J66l27L79l26N9K81n66L12J70j62RM7
4924A9k41K45j18L71l31l15M46k36K88j26K21j59j32J57j46M3j11K15k36O4J66
4945H4k08L07j60k09K98k14j06K60j90M48l04j75J86N0r9mJ17j39K49l50K66n6
$$ y = [140, 222, -25, 187, -101, -382, -88, 49, -25, 201, -234, -56, -239, 164, -196, -228, -70, -59, -136, 28, -74, -304, 143, -139, 74, 16, -60, 399, -38, -197, 21, -114, -43, 84, -155, -11, 117, -290, 132, -107, 28, 486, -287, 379, 167, -9, 50, -192, -287, 45, -156, 168, 194, -74, 203, -11, 23, 243, -37, 208, 354, -158, 62, -60, 47, 79, -15, -17, 47, -171, 7, 39, -226, -130, -275, 177, -82, -107, 37, 72, 20, 81, -47, 26, 272, -280, -105, 369, 133, 25, -54, -24, -74, -220, 204, -217, -3, 238, 219, -134, 315, -51, 37, 278, -126, 116, -184, 28, -72, 189, -26, 129, 213, -222, 156, -215, -280, -304, -38, 34, -165, -23, 143, -184, 195, -131, -72, 209, -357, -45, 125, -37, -28, 19, -222, 23, -95, 276, -55, -370, 76, -160, 128, 2, 223, 64, -68, 89, -57, -14, -125, 90, -146, -82, 84, -124, 183, 23, -186, 112, -102, -208, 52, -138, 310, 6, -169, 17, 67, -32, -36, 81, -58, 191, -159, 107, 51]
4967E1j74j00J80K7n6M65n00K90j86l7j99L98k59k38K94K09l56J05q4J47j95k7
4989b45L88L2k25L10n03J58K04j72J36j80p8L80pl42j7N12l7k81p8j70Q2M01m3
5012B25m45N10l19j99L40l8j89J37j92J79pk71L43k37J27J43O0m58M16j42m6j24
5034a87L49J93k64J59l47l4M0k06J85K42Q8k44K29q5N9o61P11k57r4K80n0j30
5056b4J68r2j8j09m0K54p4j39K11l60J25k6p7J21L4j79Q8k5J39R8j91K10k91K10
5080A3nJ64j89M5J8j37M23o78O15j03o4J59l48o2k00M82j70J02J99L8m36K56J18
5103B40l12M3k52M03m13J39k31N63n28K50o3K29P3k91j6K70j74J1L03l23k9L6
5125g2O2J52k34K36O1l56K48j17r4K00J04K9Q1m98j8L76l04L47k6j40n01M53J31
$$ y = [51, -123, -223, -43, -16, -72, 393, -107, 183, -3, -40, -239, 159, -100, -338, -44, 165, -191, -86, -170, -23, -218, -245, 143, 175, -50, 260, -243, -85, 119, -53, 83, -97, -175, 205, 198, -144, -161, 351, 314, 33, -45, -215, -133, 268, 225, -220, 290, -29, -228, 112, 74, -115, 22, -170, 9, 2, -269, 74, -163, -36, 107, 167, -291, 125, -17, -63, -187, 162, 355, 91, 250, -97, -131, -91, -297, -112, 130, 218, -26, 203, 118, 177, -484, 227, -30, -124, 156, 106, -24, 144, 52, 34, -75, -115, 139, 65, -74, 137, -223, -98, -124, -201, -80, -46, -225, -137, -162, -23, 75, -116, 94, -197, 13, 8, 172, -17, 28, 46, -91, 332, -346, 269, 166, 102, 261, -87, -149, -349, 133, -37, 65, 264, 302, -134, 122, 240, -72, -29, -281, 122, -291, -152, -383, 180, -348, -98, -161, 68, 141, -150, -166, 104, -70, -59, 244, -79, -108, -72, -10, 142, -92, 144, 205, -151, 97, -20, -114, 86, 190, 219, 300, -198, -216, 160, -144, 203, 177, 37, -464, -11, 120]
5148A20M7j13R9l97J58K02l01J02NQ6j52J20L23j39k09k33M04m23L98l28J99O
5170b6l40M45K2r7l18M50m3M0Q5j68K4L9R8j35k78K59q9m4N3N7j49m8K10k68K52
5195C1p7j17pK61O4k94J55N2l02L39m99L59K56m43K08K64mj49k84j0J50j11K19
5218F1J23p7j58k00K0L35j35K12m85L37j6j94J27M80l08j26j3K27l41J42K91k72
5240C0L8J86l08O4J92k20J66l40K00K26k14O3K6o3n6n0l9N39Mp36L23j94J67J66
5264A70n27K24o2o2N84l27k27K65m5j15L79q3l80k2K23pJ86l40R4K94l84K85p4
5287D9j47J77J30k52J67k41L0J88K78m45R5k41K0o2L51k53K80k0J53m9m08M43
5309B43m48l6K82j91J40p1Q1K26L0j87J24k56K14k37J14Ql2q2j2R6K84l43J76
$$ y = [120, 167, 54, 153, -244, -86, 116, -185, -83, -78, 8, -144, -24, 299, 160, -49, -282, 122, -301, 97, -231, -32, -26, -366, 79, 101, 4, -314, 136, 93, 133, 218, 50, 74, 113, 211, 76, -202, 57, -32, -76, -23, 34, -115, -163, 47, -221, 31, -46, -163, -170, 91, 155, -139, 16, 68, -234, 105, -394, -35, 221, -222, -14, 250, 246, 97, -187, -197, -47, -158, 61, 184, 107, -51, -251, -231, 104, -31, 181, -304, 33, 17, -177, -50, 430, 122, -4, -17, 210, -131, 11, 302, 30, 68, 254, -54, 10, 202, -18, 148, -192, 8, 234, 20, 83, 109, 46, -10, -60, -99, 440, 444, -292, 31, -163, 4, 170, -357, -133, -195, -257, 327, 0, -227, 38, -7, -122, 257, 174, -206, -228, -5, -12, 174, -166, -72, 222, -162, 123, 49, -98, 79, 209, -43, 124, -117, -87, 101, 379, -66, 29, -212, -192, -254, 97, -156, 124, 104, 257, 208, -200, 243, -205, -241, 41, -150, -10, -81, 0, 226, 256, 69, 193, -63, 151, -86, 28, 36, 4, -78, -90, 6, 290, -53, 123]
5332A23n2N0J61k24l15RK42R6p8K7L4j45jR5J18j93Q9j36j52M09j15M7n8Q3j1
5357A03j18K56k24k0N0J67r1j01q0p3J78L73m16n8m8J20K36l26L98k34l38N8k00
5380c88M24j53M00j65q4o6qK8j87M05m18J58Q9K03j69%n1L24m92K29Q3k32L82
5403C12j55k98J54l70J83K59J58n32K06J55R9j1n7J8J31m65K68JJ32k54J41k17
5425a42k15L09J68q4M2qR1p3j38O1k17K98J46k13j45KL14r4r4k41K87j20J14J44
5449A92m73J41J94l6J49k07nK50k35J60l7n84K17J32n9M05j94L6ko6r6l8J06L29
5473B79j18j74L03m66L99q0m0J13k6l06M61m79K33l9j57K28p8r3l4J11q1J43R0
5496A89J68n25J53l1k42M44p4O2l23K8j88M66j87j85M28l57q4J28J63m78L07J89
$$ y = [123, 71, 121, 282, 58, -257, -248, -6, 90, 12, 39, 73, -72, -73, 22, 140, -53, 36, -100, -252, 157, 42, 89, 31, 114, 103, -15, 241, 17, -3, 47, 214, 123, 22, -58, -131, 47, 420, 4, -54, -102, 18, 254, -72, 326, 92, -246, -188, -388, 36, -117, 283, 118, 34, -32, -40, -12, -199, 206, -212, -54, 35, 238, 69, 69, 18, 342, -150, 79, 162, -70, 312, 157, -141, 13, -357, -174, 85, 243, -289, -83, 72, 171, 160, 103, 121, 252, -213, 55, 56, 188, -66, 75, -142, -357, -48, 120, 36, 78, 70, 161, 88, -50, 11, -206, 92, 238, 25, -120, -118, 196, 102, 8, -233, 54, -66, 48, 192, -281, -140, 54, 18, 167, -40, -45, 205, -30, 130, 93, -491, -274, -142, -201, 204, 10, 46, 44, -22, -118, -156, -50, 279, 161, -13, 290, -176, 223, 143, 103, 216, 190, -116, 345, -134, 99, 60, -97, 131, 53, -40, -74, 37, -44, 99, 189, 357, -168, -15, -46, -288, 156, 82, 144, -179, -151, -339, 127, -60, -245, 183, -174, -258, -130, 33, -445, -138, 51]
5518E1j09p8K94k32K15jj23m2l5l2M2p6M13q7j70l49N81j15j55j87Q2J35J6l99
5542c61K37O9k1O7p5L5L11k84o0qK12K28l13K01p6J78k25J23l06O4J76k37J68
5565A03k43M13m50j8N19l41j93J44L38p3n5k73M26q0K5kj4k96N4J05j61J31J1
5588G0J15l54l6K33j41p4L85pl4r9l68N5N19l33J35M4r9j72j47K31J19J66m38
5611b30o2M41l8P0q7m09M50k75L4K97R2p66O05l47J35O5Q2r0o9K12J4O4j12l40
5635b64M13j17j45jK79j57j87L64k79N6M2k62K02j78K63P0j70O4R7k0k46N17k17
5658A24J15k82L07lr3r1L75j69j17j67j11J0j30M81k94J54k15k2K25p8l51M78
5680A46m43L53Pj78JK9L3K36j54K93j22k87O8J80m12J37J8Q1Q2k54J2j56N45j9
$$ y = [51, -58, -136, 158, -74, 141, 140, 17, -25, -60, -92, -50, -126, 287, 200, 30, -319, 262, 147, -8, -195, -113, 22, 38, -361, -124, -55, -76, -9, -84, -49, 262, -22, -82, -90, 122, 350, 37, 238, 162, 340, 115, 238, -68, -4, 172, -65, 103, -140, 273, -177, -195, 324, -17, -210, -66, 272, 199, 144, -129, 297, 217, 242, 240, 226, -70, -16, 89, -72, 59, 70, 185, -169, -205, 28, -113, -187, 198, 191, 157, 58, -310, -255, 264, -69, 66, 110, 11, -161, -308, -77, 42, 208, -230, -292, 149, 111, 181, 94, -315, 135, -140, -106, 191, 283, -483, 122, -225, -90, -25, 57, -33, -102, 110, 124, 188, 76, -264, 149, 32, -113, -114, 165, 8, -179, 185, -94, -38, 4, -258, -56, -234, 29, 99, -71, -7, 90, 70, -176, 341, 124, 239, -43, 264, 261, 168, 77, 452, 283, 166, -1, -112, -102, -232, 249, -45, 109, -106, -128, 97, 19, -332, 146, -297, 56, 63, -115, -114, -85, -52, 184, 30, 323, 201, -86, -18, 162, -250, -113, -95, -14, 68, -186, -174, -330, 215, 196]
5704A96l26o0Q5j8m3J98j14L4k2K5k5j02K48M8J12k00L11o37L33j46j3J51N7j58
5728f6N00j69k42k92K25N30q56K44O6j62K70k9q5J94o2p8N3k75L26k49J00Q2j47
5751a22NJ97MM4j50m5J6o8K0Q4Nr1K91j32q2n7qk2J58J72m31J23L94l59J16R0
5777A52m6n9j32J08k28J07P9K6l6K1K01o09M79l5l00K89n1k24K70j27N7J66j98
5800i0R0L2l68L30Nn2J98l84K70j87O5O0j18q2K52j25l0r2N94l63n2L0p3K34k44
5825a00M22n9k10J65l38J41q6J21K28k75J7k34L21o3k56M37m38J55K02l4k0M5
5847A41l71K26J70j14J6l0N4O7l2k05J75j82j24K81rQ1Lj15K31l66LJ16O8J18
5871B02j36l7l25K60J8N30m75K0l02L7K01j34J97J10m22L36jk51P3J02qL6R2Q5
$$ y = [196, -130, -190, -105, -123, -166, 32, -82, -48, -70, -45, -70, -172, 76, 124, 236, 36, 347, -290, 43, -103, -116, 35, 92, -66, 434, 265, 23, -269, -44, 486, -370, -126, -60, -222, 48, 19, -66, 128, 66, -12, 41, -234, 92, -157, -57, 25, -122, -117, 80, 84, 128, -22, -67, -51, -119, -99, -15, -10, -101, 190, 58, -24, -81, -89, -111, 47, 219, -212, -89, 305, -54, 62, 152, 106, 47, -85, 23, -205, -98, -19, 7, -29, -8, 193, -416, 63, 28, -272, 17, -34, -258, 12, -115, -58, 108, -90, 0, 32, -336, -6, -1, -53, 145, -239, 31, -156, -91, -31, -149, -231, 21, -104, -134, -226, 368, 5, -47, -17, -90, 144, -100, 322, 263, 53, 218, -120, 21, -65, 56, 284, 9, 26, -208, 113, 50, -206, 231, -207, -52, 150, 116, 96, 141, -230, -4, 166, 52, 68, 38, 92, 159, 127, -78, 97, -85, -209, 72, 63, 144, 147, 32, 263, -103, -100, 16, 84, 202, 66, 29, -296, -36, -18, 512, 37, 57, -245, -208, -7, -141, 56, 166, -256, 80, 79, -172, -99, 3, -5, 31, 123, 208]
5895B08k25Q9j81O8K04Pj79O5n4j48L90n07O5L06RJ45l18j64L29k88K3K14KR4
5919A54n3K3mj11j81K29J21J2j17p1P5m14J02K0L28k08M8r5L7J16n7j62K92oj07
5944b9L31j96M5j15R4M2O3n99M59J42k27J99k36j86M23K1k07O3j1k92M22j86M9
5967F9ON6j90J65K29k23r0j09K21k95M0p6K64O4l25J73p3k6N45p15K75P3k17J61
5991BM0j34K09k18N9O9k47L17k44K1M46m07n1J01j31M70l19k45M02k54K59j03
6013D2m6J19m14L11N0o9L5Qj39L7P4k18M39J81k55j56l2K6k9k04K77k69J58J53
6037G9J07K60l70P5M3l4j80O8r7k03J92L5L1K9m0K58n15K00l5n8J23K44l06j21
6061b15r6K46L34k73k61O12o8k13L22m31R5m6o1L09l40J73l10J40J67j46O6k55
$$ y = [208, -17, 72, -109, -41, 163, 170, -9, 56, 2, -146, 244, -263, -198, 108, 117, 262, -56, -220, 109, -179, -156, 58, 60, 154, 101, 124, 120, 9, -172, 57, 178, 190, 73, 2, 77, -337, -235, -215, 113, -95, -47, -142, -105, 11, -46, -208, 84, 78, -29, 302, 106, 151, 36, 130, 172, 235, -364, 95, 237, 10, 209, -27, -213, 210, 231, 24, 87, 76, -216, 206, 20, 69, 75, 131, -59, 106, 335, 112, 22, -87, 134, -161, -121, -197, 67, 131, -194, -21, -94, -120, 425, -290, -15, 58, -159, 2, 42, -92, 117, -101, -42, 27, -220, 97, -147, -126, 320, -87, -138, -37, -168, 302, -17, -262, 140, -114, 145, 42, -4, 115, -299, 12, 62, -7, 28, 36, -103, -66, 8, -210, 229, 410, 155, -1, -33, -7, -36, -240, 37, -232, -74, 79, 186, 446, 76, 151, 194, 160, -20, 48, -49, -252, -60, -25, 6, 35, -5, 253, -262, -62, -97, -155, -32, 212, -94, -215, -311, -65, 269, -4, -265, 347, 279, 66, 388, -43, 52, 6, -55, 254, -86, 87, -223, -83, 84, -62, 4, -251]
6083b51J98o6K63j93j63L32k7k46l9J80j86m3J8L79m22K76M4k23K29j96K36M12
6105E12o99L83k27m9N5K76j14J89n15L41l11l5L82l36J02j22K64k93JL78q2m08
6127c08M90m37L36J02j44K26k08j14M4l16M12k94J41n8J11N3k35L72l35K88j67
6148d1l64L91O9J11k07L2k61L28Q0k77J08N7j88o6J96m6J75l86K6J75L76m82O5
6171a29L23j48O2KJ64k03k23rJ03j92M52j97j94L88k84o7J46K89o09M26l33K88
6193E5n0p8j63o2J86q7O00l05j51K81k67j20K60l37J92l8Kl2L75k56K90k74j76
6216a55L21r8q7K42k92L20K8j86M7n5k15L53k71K21l95K17j43q4L32k74l21L89
6238a06J8Q6kK6j20N0j47K31P1o8n4n5K26j8K8l78K49O4o8J88k41m2J9K4L00l27
$$ y = [-251, -53, -119, 144, -49, -212, 120, 93, -153, -192, -12, -198, -241, -223, 156, -266, 10, 54, -169, 60, -136, 100, 512, -187, 196, -31, -80, -25, 251, 137, 326, -189, 152, -159, -194, 188, -148, -46, -168, 96, -197, -196, 182, 100, -308, 182, -255, 81, 183, 39, 265, 57, -57, -13, -329, 83, -211, -70, -128, -17, 36, -199, 173, -162, 126, -41, -405, -14, 55, 166, -41, -9, -270, 58, 138, -139, -31, 26, -162, -228, -32, -78, 97, -289, -263, -88, 288, -194, -129, 194, 46, 108, 110, 274, 71, -152, -161, -58, -250, 202, 5, -189, 199, -85, -152, -6, 283, -326, 100, -233, 55, 5, -73, -236, -298, -112, -199, 401, 96, -55, 226, -41, -161, 99, -238, -46, -84, -82, -114, 261, 5, 295, 21, -155, 166, 68, -19, 223, -69, 251, 279, 93, 140, 85, -130, 223, -48, 173, -222, -5, -148, -232, 100, -174, -495, -106, -88, -2, -4, 22, -98, -48, -195, 36, 107, 39, -15, -70, 156, 138, 166, -212, 37, 101, 33, 221, -20, -62, -43, -19, 281, -46]
6264d6J85m2p0J76j0k16M7J18j76K39m1l71R0J64K3L3K37j64k86k8Q4m1K98k2
6288A81k50Q8k44M26l95L22o6j88J18n6P5k4N41p22J28J3J09m8j99nK26j82j43
6311b95M01onq9K7l00M74l12R6Q9j20p7N5o3L18k97L12j84r0J81j98r1K71J93
6335B90k33J22n06K40L00k75O5K32j63j45o2j7J06N3k78N41n2j30n1j23R4k5j2
6358b9qk21L91k34O2K77o54P20k78k93L79J14j91kr0J55K12n95L04K21k58n2j35
6381b05L33k4lj94j58K33q2n4J36j1l15L64l16M9O54m66KM84p7L6k97j68M7N4
6405B2kL3J84j54J94k55Q2j01Q8J07J3K9r7r8k48J84k46K48k12K83k47K88n0k18
6429a73K86k16L46j08J56m32M1L27n16L54j24K24k77J33j2Q1k03J35k8J91m56
$$ y = [-46, 139, 97, 27, 203, 193, -23, 24, 142, -34, 205, 164, -207, -117, 47, 70, 103, 340, 176, -110, -138, -54, -95, 203, 181, -69, 19, -225, 201, -194, 128, 62, -126, -8, -64, 11, -13, 528, -194, -66, -53, 56, 8, -191, -196, 30, -152, -295, 106, 100, 95, 6, 33, -267, 207, -105, -9, 80, -40, -117, -62, -125, 193, -104, 208, 24, -66, 115, -83, -174, 97, 290, 57, 179, -327, -87, 213, -62, 3, 235, 72, -73, -135, -152, -46, 7, -271, 270, 218, 88, 37, -86, 8, -17, -29, -37, -258, 133, -101, -39, 238, -416, 304, 26, -267, 112, 226, 35, 33, -57, 98, 310, -285, 19, 240, -18, -70, -205, 128, 104, 101, -93, -251, -18, -100, -154, -18, -29, -344, 20, -296, -247, 407, -59, -57, 427, 350, 386, 89, -79, -32, 22, 20, 53, 237, 83, 277, 22, 104, 3, 91, 198, 211, 240, 143, 45, -203, -19, -265, -17, -229, 54, -193, 95, 45, -173, 113, -103, 243, 135, 291, -141, -100, 227, -289, 65, -59, 165, -112, 21, 9, 90, -113, 22, -6, 185, -271]
6450b71K22L08k65L6J55n9pl44K89k54K57n66K48K17j9r7r3K77l6lo5k4J91M4
6474A41k29k2L8J04k44L19j82J46n9p6M3K07l0o0m56N22J5q4N1R9k13O3P2j21
6498D4k2p3R1r7k69J91K10l03J94R2j7j12O8O9j54K32j50J25O0r5m53N01P0l51
6522a49L55n26J63N9M0j57J34J5K01j0j70J21oj41j71L69K66n1n07M2J7L44r6
6545A42l01N21J99m26j96k53M31N5j57L4k2p3J48j29J14n6j30O0m8l1L14k96o4
6568a64j20J69K75j46N3L1j45j88K36nJ49j51J56k03k6j0LM15k5m78Q8J87N5N6
6592B12l32n5lJ70p1Q4J1L1J00l17m1J67J66N4M0l05J06j94K08j39l4k4K45j00
6616b1k41L71Mm75K46J49o8n7J36k19N4J70J19r6k41K50k25M83j53m43N03k66
$$ y = [-271, -49, 259, -6, 30, 185, 126, 119, -225, 64, -190, 67, -499, -251, -34, -53, -150, -243, 34, -2, -5, -70, -94, 97, 141, -88, -110, -72, 32, -212, 107, -75, 71, 12, -64, -21, 186, 156, 96, -360, 162, 177, 93, 144, 243, 30, 93, 165, 44, 22, -51, 40, -57, -326, -135, 75, -228, -34, 58, 41, -71, -3, 66, -88, 144, -6, 119, 179, 84, -369, 132, 202, -149, 206, -320, -157, -98, -58, -215, -81, -66, 135, 125, -45, 76, 70, -71, -242, 127, 393, 342, -165, -123, -106, 238, 142, -159, 362, 561, 135, -61, -314, 117, 172, 15, 49, 27, -46, 102, -27, 87, 31, -99, -39, -87, -118, 196, -100, -164, -284, -115, 160, 14, 67, 98, -47, -235, 1, -4, 145, -6, 150, -53, -79, -89, -86, 329, 304, -174, -86, 101, 156, 212, -120, -175, -178, -8, -79, 5, 16, 47, 147, -170, -211, -44, 122, 176, 216, -89, 17, -177, 31, -108, -142, -166, 79, -21, -262, 109, 113, -362, -116, 33, -35, -92, 44, -175, -121, 49, 168, 72, -169, 81, -144, 339, 186, -257, 246, -20]
6638b0o6m5M69o34M66j10j77J44J06k87K4L11J08r4j90O8q3J3K54j84n3k03M47
6661B64o39O2M14j39o7k9N1J36J64k82Oj7p7J99J30k74Pm5n3K69k35J13K9J43
6685A30j80k3J28j44J20J69J35j78K47n70J63k87M99k9l17l6K56k67J7K84j40
6706b3j16N2L56n74J76L34n50K29l1J05l07L93j40K66p9n0M3j46Pj58K48q6K51
6729B00r3m24K93J09J65l44K60j85J49k86J78J38p9j22J03q0JnK2j12rJ79j41
6752h3O1J82n0Q3j23J03k2j8P0o2K19l74N6R2k33rL7p1K82k8j58j0K22j44k37
6777b15K64l9k4N7L8l70L88o2j9o0K5%k03L69M7k58K0k93L25j4p6J16j97n5J08
6802a28M23l19O5m6K39r3q2j88J56k00M06k7l18Jm87L41L33k36J72J87m05n6K89
$$ y = [-20, -86, -131, 338, -296, 170, 60, -117, 27, 133, -154, -130, 181, 289, 195, 5, 73, -10, 3, 257, 73, 20, -183, 264, -375, -313, 101, -38, -105, -134, -83, 53, 217, -65, -59, -76, -153, 46, 176, -98, -91, -136, -189, 80, -155, -42, -13, 130, -50, -73, 55, -89, 31, 200, 335, 157, 404, -166, -3, -290, 209, 180, -137, -173, 83, -184, -167, 117, -23, -139, -87, 269, -305, -129, 205, -345, -116, -147, -42, -349, 44, -96, 170, 91, 41, 84, -62, -55, -213, 35, -51, 200, 107, -317, -24, 85, 250, -94, 166, -19, 130, -156, 22, 160, 81, -41, 62, -18, -17, -22, 0, -112, -121, 58, -83, -22, 160, 110, 193, 70, 173, 151, 133, 203, 141, 360, -14, 42, 134, -99, -108, -71, -142, 140, 112, -46, -56, 166, 22, -215, 49, 10, -14, 43, 81, -289, 99, 37, 18, -42, -17, -17, -220, 149, 196, -62, -42, -335, -10, -24, -100, 16, -181, -236, -128, 295, -24, 41, -5, 234, 141, 59, -129, 27, -173, 233, 206, -112, -111, -598, -257, 76, -160, 12, 199, -206, -262, 27]
6825B7l4j12P4m2L12k10L36n34N5J25J29k9l95K14qJ50k13K28P4l81J45J51JJ75
6849B38o8j91J3j46L23m22K61K24k63k7oR0R8l05L75j15J03K9k14K6Q2j05L07
6872C07l63J58o4K2L94n98N5K30om60M86m29J74L78k34k80J79K00n7rJ87j99m0
6895C1j56P5j51L40o0P7J32j79M9m77M06l10N7K11K6m27L62J38K9k07k41K83N7
6918F5k23k9K55J3j29L4k1K22m58J96J43j12j59m7L82k50J43J17k58Q5j70L67
6940A66j15J28l73J20J77k57L98l52L47k56k01K48K58m11L87l29J96k47q7P7N
6961a21J3j8P0K89j92M5j68K74l3k79J12rl0L05l64L75k59n1N08m38N3o7j73p6
6985b34J11J13j46J85j13j68m4M34j70o4m5J56L14k49j26O7n7k5J0j2n4J88J82
$$ y = [27, -7, -119, -45, -87, 225, 15, 351, -183, -128, -3, 126, 97, -298, -84, -92, 58, -155, 73, 147, -234, -89, 62, 63, 238, 170, -21, -8, -154, 169, -253, 8, 232, -31, -58, -64, 26, 124, -181, 194, 79, 182, 211, -3, 23, 105, 0, 307, -56, 102, 38, 60, 454, -144, -89, 141, 135, -325, 161, -268, -94, 284, 50, -230, -51, 149, 92, 83, 270, 71, 31, -125, -50, -201, 139, 79, 156, 288, 109, 158, -319, 87, -223, -166, 45, 71, -356, 6, 144, 173, -34, -275, 8, 65, -158, -187, 68, 81, -48, -14, -35, 187, -271, -75, 68, -44, -203, -250, 132, -118, 25, 142, -116, -31, -201, 166, 51, 179, -194, -74, 103, -154, 244, -108, 239, -17, -218, 30, 288, -123, 264, -65, 131, -116, -203, -126, -121, -108, -126, -56, 233, 41, 86, -82, 192, 159, -120, -8, -17, -47, 258, -106, 269, 10, -41, 467, 29, 82, 15, -158, -234, -123, -10, -156, 29, -84, -252, -296, 138, -32, -96, -141, 15, 329, 80, -46, 21, -36, -61, -51, -63, -117, 71, 253]
7008B53m22J29J03K00j92l54J89J76N7N46n71k16q5J08K08m5O2k29M7n5M85k88
7030A06l19L07k53M99j53K6j69MRl3J28l0j52j60K23J09j5j0K79k45o9r4l3M2
7054cn3K29p5k15J18n2j9N0K44l68O4j20M01j46o2L61l3l00j30qM52l70q0J81
7078F6j01J05p8j80J65LR8J58m40K53j60L71m96M65J37j16l37k7J54J77k83j09
7100a75K26n6l9q1p3mJ81L62l28l2J77j57j98j1K7J39J5J88l08K13l0j9J18n74
7124d39J75LL45r5L48k31j4j65k47N60M7k69k35J16j70K55M0JK9k13K78j6K8j27
7148Dj4l71K95J08o6j20M5L74m9j6n29M26K80l83l51J02K84mk6k80O6N32p73N49
7172H3j70J25j74J82j37K21r7k0NLJ27l44j34M62J03l96R5j20L33j08j2o8K53
$$ y = [253, -169, -40, 63, 263, 71, -283, -94, 82, 139, 685, 114, -102, -187, -79, 129, 84, 146, -83, -36, -91, 394, 106, -213, 94, -159, 340, 187, 213, 44, 48, 57, 24, 152, 122, -30, -190, 33, 142, 127, 117, 396, 151, 82, -12, -45, -3, -56, 173, 98, -117, 1, -51, -70, -20, 224, -144, -80, -200, 201, 55, -7, 354, 321, 21, -109, -117, 335, -35, -115, 66, -35, 70, -8, -188, -23, -20, 78, 236, -204, 49, -111, 260, -236, 229, 366, 250, -87, -114, 40, 217, -66, -175, 51, -5, -44, -125, -198, -202, -21, 341, 13, -19, 158, 1, -197, -208, -181, -42, -27, 161, -147, 66, 36, 17, 135, -439, -264, -261, 84, -11, 337, 106, 92, -73, -320, 240, 287, 18, -217, -101, -271, -16, 24, 25, 54, -159, 119, 103, 131, 4, -10, -381, -86, 22, -44, -164, -119, 255, 206, 190, -339, 87, 367, -16, -367, -265, 19, 15, -11, -291, -225, 307, -466, 83, -87, 38, -136, 46, -91, 130, 33, 13, 18, 21, 148, -196, -330, 132, 235, -161, -66, -186, 147, 39, 27, -41, 212]
7195B12j72J93k88J93L29n25k4k80O2M73m10M22l3j85J62k63k55L43O2M3M2j50
7217d9J34q6K97l57M32k29K0K2k49J48l2o3J38J7l03P7j8M27k86j71R5l11L01
7240d6J88k11j68L31m15K27L4r5L48k3k46j44m3J94J8J23j6j7j75K54l54N89k42
7263A11k95K7J35m6K9j64j01L36l75K18J42k87M01k57j61L02k3J46m7n7k18J23
7285f1K1K00l68j01M67O1k39k41K47L46n59J25n0K74k93j22M13%k48J81J59l19
7307a07pK97k02M2j0P9j28p9M5P5j51j2K48j70K03J28o47K29J5J49M9r7k0o0J98
7332F7k0j38J78k25J22n3K50k25K03j96o7J04j03J66k67K43M5j43N1J40j15J0
7354B7M4K51o04N59m88M57m06J89j34J08j86M30j86r1L4K72j15j8n90M32L12k01
$$ y = [212, 40, 233, -55, 138, 467, -58, -82, -362, -300, 173, -237, 185, 152, -33, 129, -134, -389, -46, 16, 59, 101, -49, 85, -1, 296, -61, 371, 142, 162, 184, -65, 83, 51, -12, 126, 143, -160, -83, -101, 326, 40, -131, -36, -347, -46, 142, -69, -237, 94, -321, -94, -60, -155, 193, 170, -76, -220, -263, -69, -51, 72, 56, 39, -136, 118, -236, 353, 111, -184, -157, -22, -68, -39, -203, -304, 32, -343, -125, 17, -270, 131, -126, -287, 15, -8, 138, 91, 34, -184, -61, -40, 160, -208, -309, 158, 219, -20, -261, -14, 332, -227, -102, -152, 122, -171, -293, 120, 120, -128, 53, 212, -107, -114, 183, -19, 23, 13, 92, -36, -115, -70, 5, -146, -158, 90, -80, 123, 251, -396, -167, -152, -3, 46, -51, -71, -131, 67, 47, -91, 87, -138, -16, -69, 181, -44, 159, -37, -104, 0, -103, 63, -204, 39, 84, -59, -8, 132, 17, 27, 71, 322, -282, 277, -211, 246, -160, 29, -105, 3, -183, 247, 61, -30, 4, 276, 161, 143, -447, -15, 297, 96]
7376I6J35l16j70K60k2l4j59K74j52%J0O0p3qJ72j93L20o4l32L53m7k20K17k23
7400a16R7P7k02p4k10O66k85L3R6l92K90L44n14J80J30k37mK39PR6k16l28j31
7423d54N02j86l5K68l73K48k9m8K42k69J81K96l30r3J55j77M16l12j76L50p0r8
7445Hn4J97l01J92L8N0K46l73j85M36l61J72q4l90M66J81J42n21K27Q5k08j94
7467b31j45K95m4K29p0J67j35l17L63j31OJ82n3k28J65K7L8M3k72J41k30J42L35
7490B77l88o6M35k67L2j85M76m37M97m14J16k4l0K3j26J80k34j00P9K0j78J95
7512a19K26k1N9j14l07J78N0L1N4k35O1K9J58j18l22P10m08O5J74p0M8n2K50j59
7536A68k24J10r3j97K44j52K12k05O3OK38l07L88l89q5M60m0q4N0l40J57J82k23
$$ y = [96, 231, -85, -255, 5, -17, -51, -210, 64, -88, -88, -78, -18, -91, -99, 73, -120, 200, 136, -196, 157, 110, -110, 107, -116, -19, 58, -144, -218, -428, 238, -47, -14, 82, -310, -20, 324, -190, -10, 120, -117, -121, 118, 125, 221, 5, -323, -454, 48, -138, -173, 95, -278, -30, -59, -107, 135, -134, 47, 343, 13, -80, 75, -102, 314, 2, -174, 176, 106, 8, -46, 151, -150, 42, 80, 130, 376, 3, -182, 254, -107, 65, -19, -409, 57, 238, 380, -141, 86, 171, -37, -231, -376, -81, -125, 104, 34, 201, 66, -251, 112, -19, -13, 169, 116, -112, 53, 80, 118, 161, -111, 30, -200, -58, 277, -111, -177, 258, -9, 23, -162, 314, -123, 374, -40, 76, 52, 22, 45, -81, 99, -135, -235, -156, -136, -314, -119, 107, 86, 145, 31, -276, -98, -48, -17, 37, -198, -137, -108, 50, -68, -390, 320, -88, -23, 151, 81, 129, 77, 327, 168, -56, 54, -39, -236, 8, -144, 68, -137, -74, -68, 170, -137, 251, -138, -223, 237, 197, 113, 163, -177, -20, 162, -61]
7559f1L6K19m0n01J29K46j14O9kJ8n1J47j47j97M87k26J63l29q4N35m81K81J05
7582B02l07K67l54K97K0j71J09r7j64L23M0l90K80J13l72J54L79l54L61m23K26
7603A39k03m9J37m24M98Pl41J73J94k90J13K5K1Q7J47M4n22L41j28K29l05k74
7625c81M38k50J78j29K62j39k8n6l32M90J3J24j52J36n4j25o1j68P7Q5K77j30
7647G5k13M24l97K52m13M03k44J19j24r3J77J3N10l91k92L18l60PJ57L40j52K95
7669D11k49K8l27O1r4O6J89n8J02k01J1K15j25R1k66K63m89K58J91j31Jl34L39
7692d8P3L1P5R4j35p5J50j54p0j7J6R1j32O7J3L82n17K07j99J05J27j81k3L83
7716B63j80p4l81O55n8k41Jj66N37k48k8m5K08l54J47j71j1L87j14P6j02O3r7
$$ y = [-61, -25, 194, 154, -347, -218, 28, -86, -17, -19, -1, -52, 95, -52, -249, 238, 12, 175, -154, -238, 297, -184, 97, 202, -105, 162, -192, 105, 125, -46, 63, -34, -198, 125, 165, -225, 55, 168, -204, -50, 329, -25, 336, -87, 139, -64, -113, 24, -400, 98, 105, -236, -63, 131, -159, -46, -21, 0, 87, 234, 278, -244, 97, -31, 198, -107, -381, 57, -193, -15, -144, 118, -21, -49, -105, -437, 53, 66, 190, 38, 174, 120, -5, -66, -234, -157, -72, 205, 75, -138, 286, -111, 141, -272, 131, -113, 6, -118, -211, -34, -21, 489, 98, -194, 124, -236, -229, -72, 268, 116, 411, 162, 190, -137, -76, -170, -104, 85, 27, 129, -72, -61, 154, 29, 120, -146, 117, -372, -114, 77, -54, -53, -387, -48, 25, 56, 131, 225, 90, 15, 165, 11, -59, -76, -60, 31, -101, -34, -21, 361, -156, 51, -148, -43, 84, -97, -120, 263, 83, 9, -372, 283, 225, -16, -15, -181, 356, 108, 80, 35, 243, -111, 36, -135, -146, 241, 127, 203, 101, 164, 67]
7739F7o8r3L78k04N4%n8k13k43K83m3J70j63L10l95L00k20l1j18K21J88R6l29
7762a11m5m1m8L04J11k28j0J78n54O18k02j6%J37l6N1p4j18l43M20j18K68j18
7785B5mK6j39J40QK9q7k4K5L7j69m2Q2K86m24J78j47O5J21J93l35r1K83r1j02
7810a57J33J2m0L35j59j63N1m2J25k28J31J06K60k28j29j19j83K17J42J63m7k44
7832f4K03k94J69o2k26L12j48p6K31J01J96m92M67m93K54J33m61J30J01J70m59
7853c08L08J31n3K0k00K46j04k19J13m4RR7q4Q9o7J97j45j31M20m8l03R1J06j93
7877g2K24j42m2N5l1n9K32k11O4m3l57J60J10K34j47M4L05m18k2K58j61j69K55
7900F7q9k80M61k32O9Kn2j50L84l06L21k32j78P8p5K28j66J90o6L18n08J29K23
$$ y = [67, -1, -94, 284, 80, 134, 134, 76, -137, -380, -97, -140, 30, -133, 177, -218, 82, -138, -169, -287, -66, 122, 218, -111, -156, -197, -245, 59, 170, -58, -68, 110, -444, 174, -28, -44, -44, 93, 57, 108, 34, -84, -427, -7, -125, 143, 25, 21, 47, -92, 48, 56, 85, -2, -26, -1, 36, -133, -175, -93, 193, -231, -53, -200, -135, -14, 179, -156, -247, 36, -55, -157, -24, -12, -52, 283, 124, -39, 12, -30, 95, -133, -2, 104, 364, 136, 7, -112, -295, -78, 64, 227, 180, -64, 139, -155, 14, -48, -274, 38, -110, -186, 45, 146, 342, -150, 317, -176, 78, 211, -250, -120, -19, 151, -308, 0, 131, 78, 98, -102, 144, 40, -179, -66, -110, -101, -4, -88, 1, -66, 131, -14, -145, 275, 227, -76, 15, 121, -72, 152, 10, -32, 23, -8, -67, 165, -46, 18, -25, -382, -222, -112, 122, -25, 19, 324, -94, -116, 142, -19, -188, 67, -22, -302, 159, -73, -4, -2, -54, -204, 180, -126, 195, -37, -215, -137, -212, 16, -150, 40, -26, 292, -216, -87, 136]
7923A36l11K19P6r7r8K67l55l7L88j98J52j42q9N9o7j99J67O5l22J34M04l72M21
7946B01k68r9L11k06J73m01L83j24j2k3J78q5l3j0q4L23j88M4p5k33M01j75L2
7969C0oK49j78J93k78J75m17J04K63q3L6J04k88J11j30o8K71J66k08P6n44P53
7991C31l06oj73L02n8l12J63K12j19ro3K52l47LN07k77j05M8J23j0j89j80J98
8014a5o0o6P5l06M47j24o8o5K22l12L93j60j28R3j13J57J30R3j61Or3k2K89r7
8038A15j50O9l2K2M8J6j85N50k33k07l09O07l20l60N53l11J55J34j73J34M9j05
8060F7l76L26l08L66o3j09QJ5J07O6k39K59l37J08P1n8J78j16l2R6N2M1k3m55
8084c56K20J53j67J40M8j67o3R1J97k23K08j58K21j17L1j79RN5j21K91k40L65
$$ y = [136, -175, 44, 120, 23, -75, 192, -163, -200, 188, -10, 142, 0, -89, -30, -97, -296, -129, -64, -386, -252, 152, -220, 201, -67, -166, 145, -61, 112, -289, 94, -30, -42, -65, 113, 28, -5, -15, -99, 224, 36, 80, 5, -228, 173, -2, 30, 24, 273, 95, 288, 10, 185, -232, -128, 135, 52, 88, 192, -96, 15, -115, -183, 88, 254, 46, 122, -422, 331, 25, 19, -154, 148, 90, -222, -59, 153, 34, 25, -38, 214, -133, -130, 377, 100, -5, 43, 166, 156, -33, -213, -15, -75, -141, -66, -372, 75, -49, -117, -182, 40, -272, 121, -39, -167, -74, -187, -30, 100, 193, 32, 38, -55, -77, 212, 115, -35, 34, 2, 24, 72, 88, -97, 453, 220, 13, -296, 311, -9, -369, 184, -127, 28, 162, -11, 123, 172, 67, -309, 17, -291, 75, 12, -97, -89, -74, 33, 99, -140, 119, -218, -110, -39, -97, 81, -35, -67, 29, 81, 122, 99, -356, -136, 17, -150, -10, 38, -129, -192, -101, 96, -127, 81, -77, 144, 27, 58, -121, -112, -57, -178, 113, -127, 238]
8106B38k04l54L71O3k61M4p6J50J78m4J39p8k05r5k6L1M6l11N01L9j23j31K60
8129A52p4J14m99M78k6l39M73k23j15m7Q9k09MK94M4J85l78L22k27J36j31O9r8
8152fJ27R7l30N13m23L2N3k70K91J9l60K48L2k8Q6l25M75j59q7l69L64K53n43
8175c10K30l1k9J16k79L33Q6q2j25j68M57j89J41j98PL24
$$ y = [238, 34, -320, 51, 114, -147, -103, -179, -29, 149, 105, 244, 166, -39, -134, -160, -129, -83, -394, 107, 146, 23, -108, 152, 78, 192, -307, 171, 145, -194, 279, 56, -59, -106, -17, -226, -222, 72, 116, 301, -77, 245, 18, 154, 23, 92, -6, 121, 218, -112, 401, -22, 10, 63, -207, 84, 103, -257, -9, 23, -5, 81, -244, 231, 72, -15, -384, -20, 233, -310, -80, -111, -140, -24, -303, 30, 116, 34, -91, -259, 198, 9, 150, -48, -41, 283]
8191B83
$$ Imaginary data points
##PAGE= N=2
##DATA TABLE= (X++(I..I)), XYDATA
0@%%%%Qj6J6j6J6k4L2m0M8n6P2q8J04j26J50j76K08k40K79l25L74m27M86n53O29
29C35p13Q01r00J012j134J265j410J570j744J935k144K376k631K912l223L568
45A875l956M394m893N462o118O890p812Q935j0338J2146j4578J8046k3410L2874
59A9517n4328J83911j2767l87102K55366J72351k03392j06032J90932K2484j41418
70f0478o78R5479j0605N820n6941k9623J17018M123j39038L7256J13659m4787
82C1205j33538O8945J47494j18152j12788J57164M3453j28382n869R4795J064
93D5391q0105m85N0174l234m58l9241j6294J01113l0143j06986R4375O5364j04688
106b5217k8212Q0511J2082o5732Q262L5840l6901J9585K1979n4322M0524L7940
$$ y = [0, 0, 0, 0, 0, 8, -8, 8, -8, 8, -16, 16, -24, 24, -32, 40, -48, 56, -70, 80, -96, 112, -128, 151, -174, 200, -227, 259, -294, 335, -378, 423, -477, 535, -599, 666, -744, 826, -918, 1017, -1127, 1249, -1382, 1530, -1693, 1875, -2081, 2313, -2580, 2882, -3236, 3654, -4158, 4777, -5561, 6585, -7993, 10053, -13357, 19517, -34811, 149100, 136333, -250769, 4597, 176948, -26444, -132476, 58456, 80940, -60478, -61156, 34323, 23718, 29538, -27403, -57026, 59992, 64115, -74923, -37667, 75992, 31205, -102333, -33388, 114106, -4046, -116834, 40330, 83783, -44599, -50468, 44327, 45391, -34714, -35199, 14975, 11741, 11283, -27958, -44252, 56861, 26718, -80268, 14107, 79471, -25217, -53429, 27082, 39164, -26568, -18306, 17534, -19367, 218, 22197, -32125, 8399, 46339]
118D6339p7992L499P2064j5041o5210R827O7938l9942n0702P5805L81o6828L6374
131c488L1116k8898m242K0729j5081k9541N0338P872q5235N1760O5488j01628
143d0810p273J05387k7037q2231L5817P2010n2277n4006O9719Q305n6240K0100
155h536J1966o382J3324j3181o799J2017J0506m917k7522K6431J8251n3367J3221
168a4988M1925l0502j2688K0043L858j2088Q0K3851j6978j7596K8833j6617r222
181a2089L2500k6933j4631L1448n863j2281Q943J1448r824j9611K6628O676l1859
194a5448J6966K902k0175J7835N045j0704l471N504J6976k1092p188L6250k0736
207B664k3108K6002j466r110L034r45J814j220J0587q274j2510L4400j3028l9573
$$ y = [46339, -31653, -28154, 43910, 28869, -36341, -26514, 41424, 1482, -49220, 26585, 26966, -39862, -3488, 27628, -1270, -5512, 15217, 136, -29405, 20933, 28805, -56430, -4670, 60818, -40810, -48083, 57304, 30267, -51964, -16147, 55863, 3586, -50420, 19299, 27604, -28636, -8536, 3430, -2952, 10372, -2809, -9608, 2409, 12915, 7998, -19524, 6907, 25158, -28209, -14988, 26937, -3565, -16253, 3790, 7648, -4440, -4360, 19491, 2513, -15083, 13750, -2867, -12089, 20411, -6522, -21153, 10295, 4432, -7849, 1094, 12542, 2718, -16893, 9735, 16411, -15448, 1518, 4420, -15755, 2080, 7125, -3579, -7050, -1546, 15430, -5662, -12850, 23400, 2664, -20444, 5558, 4092, -5018, -1984, -2929, -1115, -2335, 8252, -22, -12532, 21868, 8840, -30733]
221c0733M0675J3012m0361M899K2145l209k0724P352K8859k1233j5202K3702m069
234E113l566K07q963J2187n898r117J3061k365L858n894j2943K7926L04k7809
248a3899J3450J0131j0959q164N348J5943j6493r323K0445o759J904P265j8777
261i888J2895Q756k1337O555J0327o956r799L21K0262r748j4667K3380n010j2308
275g217J2413k555L85k387p780J0437n601k202R869j2063N732P890j2455R583
289D049L606q622J673l853O526j793j0217J3758p631p238J9230j0054l868J3366
303H932r285k026L578K250J335j4596P732Q181j6716J0294O715j1820P331r88
317I17m89O103q642L992k297o036J1765r199k505J2823j1545J511R224m883L157
$$ y = [-30733, 9942, 22954, -17407, -12508, 9637, 6428, -14296, -6944, 21915, 682, -14520, 9182, 5113, 1547, 1754, -7209, 4978, -920, -10037, 3024, 659, 4517, -1377, -14320, 13606, 13910, -13899, -449, 9682, -1277, -9441, -4093, 11850, -4643, -13966, 6479, -280, 1624, 8889, -9888, 3007, 11763, -9574, -3019, 7308, 352, -9447, -9126, 11136, 1388, -13279, 10101, 5091, -7217, 5196, 2641, 3026, 639, -7141, 3296, -2305, -4507, 5362, -6701, -969, 6921, -5534, 4049, 7655, -967, 706, -3147, 3379, 1586, -8631, 5127, -2504, -9742, 9488, -566, -4434, 8932, -353, -2379, 1199, 3449, 4784, -9812, -2080, 6101, -10615, -321, 6394, -5426, 1905, 917, 428, 6531, -2111, 1881, -416, -6452, 5313, -3886, -6391, 6432, -5113, -3602, 5622, 739, 3896]
332C896m942J290N830j2219O865M250j3657Q837j28n284J0668n261r17L804m169
347a137O293n300k600R981j3782P46J1892j0337K891K548l307O155n648L929M654
362F978j1953O224J71p802J0505o177l178Q391o919M070K842m279O377o987j92
377a929Q882j1146L520L303r438P156q22j865P015p607M080K936p446R264m765
392A138o419R402p688L9O345o012M215j772j609R259p901J158O166j0453N166
407A034N39o447P712n758j140O752n770N511l39m897Q557o273j652P775q950J988
423a358J858n678P057l146q74O722p992M570M264p813O009k723m656N944o385
438d201L306K868p502P347j595k855Q504o841R16M883q500N167o51m718N673o438
$$ y = [3896, -1046, 244, 6074, -6145, 720, 4970, -8687, 150, 22, -5262, 5406, 145, -772, 3032, -1137, 5156, -144, -2744, 7237, -6545, -5799, 6093, -4244, -1353, 1195, -2112, 4043, -1605, 2324, 6978, -4975, 1249, 1420, -6382, 4123, -2054, -5232, 3159, -3760, 310, 3152, -1127, 5250, -1737, -1929, 6953, -4193, -673, 2630, -6808, 348, -474, -2339, 4676, -2931, 1149, 4085, -3361, 5903, 1138, -5281, 4121, -3567, -3528, 2817, -3195, 1020, -752, -2361, 6898, -1003, 155, 6321, -4132, 1034, 1573, -4874, 2838, -2920, -4060, 2692, -3078, 2433, 2094, -2803, 5754, -519, -2171, 5604, -3346, -1358, 500, -5178, 1879, -1267, -2141, 4581, -3411, 1159, 5423, -2390, 3619, 896, -3760, 2184, -4201, -895, 1973, -5529, 1818, 223, -2632, 5872, -969, -53, 4830, -3670, 1497, 846, -3872, 1801, -4637]
454d637K575N618p665O556M98n816P452m453n36M759q854L550J661m919O434m154
470a931J02O187p262M653K719o135N206n568r71O982q395K335M405o362N646j827
486b16p15O490p026J386L700n620L859l208k029O551p523J769O770o605M302q68
502A017k678P425o077j949N248n344J658j108r15P305p579n49Q277m793J964l31
518A571l810P697p236k819Q450n641m12J177k037P186m192k051O425m363J232
533A177k93l450O688o044l826R297n353N7L253m021O299k599m135P653l964k175
549a436J107j554M703n079k422Q517n083n64M387m777O812j616q160Q209j524
564A520l606J472k562N194j598n517O913R02j655r42l181Q857l406r330R695k236
$$ y = [-4637, -2062, 3556, -4109, 2447, 2945, -2871, 4581, 128, -408, 4351, -4503, -953, 708, -4211, 2223, -1931, -1829, 4358, -2904, 1749, 4468, -1667, 3539, -2029, -3000, 3982, -4413, -2078, 2327, -4035, 1611, -216, -931, 5559, -1467, -81, 3619, -2001, 1858, -1350, -3379, 3172, -4351, -2582, 4188, -2417, 1885, 1017, -1661, 5764, -313, -2262, 2986, -2358, -700, -1808, -2723, 4582, -2997, -3546, 4731, -62, 1902, 1571, -2239, 5458, -1778, -4597, 3853, -1788, -2200, -1023, -3060, 4126, -66, -2117, 4308, -55, 1177, 884, -2566, 4122, -1922, -5748, 3549, -1804, -1747, 1506, -2515, 3784, 1185, -2950, 4703, 739, -1436, -329, -1883, 2820, -2259, -4681, 3836, -1247, -1811, 2576, -2201, 4611, 2995, -5165, 3044, 1520, -2086, -614, -3176, 2018, 420, -5097, 1816, 2718, 1063, 121, -3060, 5797, 2391, -6939, 2756, 520]
580E20n333N934k882J799K272n307M597Q92j349r1l682M999j397o625P813j874
596B86l897M561m154N788K586j1404P663O202j0284j84L424K568n164l908Q926
611C009j778m556N646m107L581M102j0492M691M774p023K367k649R9N982o236
626b590j4M519m93j78l296N680M33j0529Q001K202j0316Q123n35n688O210j426
642A03m62L197l501J766j120R18K053p118K176L772l761K758m293K488R229j2283
658d078m63J3505p159n558K972J744J681o144L11M224j391J862l464K77Q983q128
674h26k401P209m443J264k302l583R420l825p374Q649J194m149q1L965J792r493
690d984L573Q998j0834j675O005k299L170l747j411Q855n557k087M854k390J880
$$ y = [520, -4813, 1121, -1761, 38, 2310, -2997, 1600, 2492, 1143, 1052, -2630, 2369, 972, -5653, 2160, 286, -3611, 950, -3204, 2584, 5170, -6234, 1429, 7631, -2653, -2837, 587, 3155, -2009, -5917, 3009, 1231, -3325, 2321, -1786, 1795, 5897, -4595, 96, 4870, -2153, 214, -2435, -2336, 3646, -2590, -2604, 1915, 1422, 1244, -2052, 3628, 4061, -6468, 1533, 3735, -6581, 1542, 1007, -4681, 1529, 103, -359, 2838, -663, 1103, -17, 901, 2954, -4164, -1988, 1784, -1977, 781, -3512, -1024, 8205, -4078, -4541, 8964, 1805, -3753, -781, 963, 2644, -3500, -3189, 1035, -356, 1506, -1958, -1681, 7302, -826, -3227, 3982, -461, 803, -1499, -5082, 4338, 513, -6861, 1788, 2982, -1167, -1248, 2717, 4509, -4984, -1411, 7587, -3247, -4922, 1083, -1216, 1954, -1793, -3204, 5651, 94, -1993, 2861, 471, 2351]
705B351k913l705O239o32k959k695J593J0069p634n872J1891k872n579M810k994
720i02K103n38n495N799n87k111K513j929K464L97k114L061m523J824L097p528
736d469M860J505p847P415J444o897M591J461K19j636l230N292j150m477J360
751a559O47M091m252n807J0983r33o075N544l759R20N249p857l47O253l524k813
767c239O08O050j308p147P239J181m748M502m095m29M178o858M094K574p970N275
783i3L231m922J090J955J057k507q33L799m656J269L238q431N294N544r496L497
799i64M182k847J712l296J11M143k903j791j65K031R14n588M639K750n527N010
815B411j334m391Q380l969n782O049j010j100r4o37K533j835J196J582k875L354
$$ y = [2351, -562, -4267, 1972, 1340, -1619, -4314, -2721, 7348, -286, -6158, 5733, 2861, -2718, 2092, -902, 1201, 663, -4832, 967, 380, -1731, 782, -1147, 1317, 1714, -400, 2661, -1862, -38, 3059, -4469, 391, 1896, -5951, 1464, 2908, -3989, 602, 2063, 2282, 646, -2584, 2708, 1558, -2919, -1559, -912, 3179, -1073, -6880, 4103, 3170, -2905, 2639, -1120, -200, 5049, -2808, -3155, 3098, -426, -3239, -2631, 3419, 2111, -5036, 2203, 3384, -1364, 3138, -957, -1386, 2792, -4066, 28, 2602, -5368, -93, 3138, -1784, -694, 1261, 2318, -189, -1022, 2777, -1879, -610, 2628, -5803, -509, 5035, -4461, -964, 3218, 371, 2083, -1213, -1102, 3041, 138, -1653, -1818, 213, 1127, -4461, 178, 2928, -2599, 2411, 1077, -3314, 5066, 1097, -4685, 1364, 354, -746, -840, -1477, 1056, -779, 417, 1999, -876, 2478]
831B478j690l027N831n151j890O583n719K45N071l772J076N50o70K401j707p41
847a32o59J5L952n960r21P392m187j615L364k131L666j832m061O019j464l386
863a940J138l5J614k048j176L990k823J873K270m965M117k00m430M932k137l194
879c014M106k632Q67Q88j437L637k464r37L161k023J037j680k379N513l277k864
895c498N369k643O67J679l387L951m85k910K782j780J16J92k880L679j424j008
911a580L384k998J519K710m430K636K0l037L445k442q26K591k909J651P17j527
927a076L009k090K85J926l458K573n03l723M411j541j772L102k988K184J775l670
943a556K851j38j150J043k547J828J80l213L663j959l07L342l406J306K573l795
$$ y = [2478, 788, -2239, 3592, -1559, -3449, 3134, -2585, -2340, 2731, -1041, 35, 585, -85, 2316, 609, -132, -791, -776, 3176, -2784, -3705, 3687, -500, -2115, 1249, -882, 2784, 952, -3109, 2910, 1446, -1940, -802, -837, 777, -1271, -2447, 1543, -1280, 593, 2863, -2102, 2015, 1815, -2615, 2317, 180, -3014, 1092, -1540, -673, 215, -1222, 2415, -49, -986, 2175, 152, 1189, -491, -2870, 2643, -634, -3498, 1871, -772, -105, 1574, -1813, 2138, 1653, -1257, 1525, -255, -139, 53, -2827, 852, -572, -1580, 1804, -1194, 325, 3035, -1395, 1241, 1261, -1776, 1669, -773, -1599, 992, -1917, -266, 451, -1076, 1933, -157, 128, 2054, -1404, 1169, 666, -3057, 1354, -187, -1959, 1143, -1845, 339, 2114, -1556, 1295, 1157, 7, 1050, -1497, 331, 511, -2702, 961, -998, -1305, 2037, -1369, -63, 2510, -1285]
959a285K662l40k795K843k170k5J657k517K464k54j571L398k435P22J949m179
975a876K806J65l985L327j139o61K398k954K454J102k758L007j764j61J816l261
991a484J787M74l791L830r29j319L123k421R51J578k976L140j343k189K567k394
1007a396R14J006k738L204n98j752L660k635N70J997m022K380j66k574K977k234
1023a407L76K075k757K495L63k153L473k380m41K318l946J621J017k912L102j758
1039i14N5K506k716J843R86k615K381j571j137K249k822J520Q79k657K930o63
1055B54j274L039k122N11J273l197K397o91k403L038k533R08K277k875K630l12
1071I20j905K859k322QK278l680J771J94k019K906j550l16K909l108K168O28l100
$$ y = [-1285, 1377, 1037, -1758, 1085, -1085, -1110, 547, -1970, 494, 240, -1331, 2067, -368, 354, 2303, -1876, 930, 1095, -2890, 437, -702, -1363, 1035, -1919, 535, 1637, -1121, 1886, 122, -39, 1777, -1484, 303, 777, -3014, 816, -113, -1432, 1691, -730, 221, 1799, -1177, 1963, 620, -1569, 998, -1396, -482, 524, -2214, 990, 392, -1360, 2300, -335, 235, 2232, -1790, 590, 424, -2150, 827, -1407, -1031, 1044, -1713, 782, 1145, -1008, 2465, 85, -356, 1962, -1984, -363, 654, -2258, 844, -914, -859, 1647, -1069, 774, 1760, -855, 1526, -45, -1182, 1067, -1755, -235, 644, -2013, 917, 254, -1020, 2019, -103, 408, 1681, -1516, 881, 190, -2213, 825, -1708, -800, 1477, -1398, 1232, 920, -985, 1874, -448, -440, 1838, -1842, -71, 123, -1896, 1010, -540, -856, 2053, -1055, 1113, 1741, -1359]
1088a359K829j816o77K065k781J324R74k667K849p31l91K683k901J281Q93l157
1104a582K251p26j732K590k529P81K439l077K468j35j499L089k684Q0J537k724
1120a453J367L21k418L377k326L71K768k736J667J10j978K564k181o80K499l087
1136a815J711L77j809K739j356p47K957k450Q18P89k636K100j468o25K252k431
1152a594J161J832k172K188p39j649L258k731n9J515k347J767o76j363K816j792
1168e85K60J863k509K244p22k044L456k671m66K244k598J141N54j606K221o24
1184A58k87J673j822J301n84k254L080j746j397K737k332J165J217k243L171j240
1200E97j303K410j972K4M83k105K439o99j623K827j985J161J274l145K778K56
$$ y = [-1359, 1470, -346, -1023, 1042, -1739, -415, 559, -2108, 741, 10, -381, 2302, -599, 682, 1575, -1582, 669, -57, -1789, 801, -1728, -947, 1492, -1585, 883, 748, -751, 2338, -346, -266, 1271, -1453, -86, 235, -2183, 1194, -1132, -761, 2007, -729, 938, 1048, -930, 1634, -547, -1227, 1272, -1815, -104, 273, -1536, 1203, -153, -900, 2057, -393, 425, 1214, -1422, 678, -790, -1415, 837, -1594, -433, 1399, -773, 1415, 676, -973, 2285, -446, -505, 1010, -1337, 430, -246, -1609, 1207, -585, -325, 1538, -971, 1273, 551, -1493, 1963, -708, -1174, 1070, -1528, -387, 167, -1439, 782, 158, -129, 1544, -278, 1023, 439, -1815, 1265, -481, -1878, 859, -1473, -308, 909, -1334, 1837, 597, -706, 1704, -268, -244, 239, -1866, 573, -126, -1749, 1078, -907, 254, 1528, -1617, 1161, 1417]
1216A417k966K673j254o19R74k197K260J77j503J846j127J020P54k717K900o27
1232A011l023K947j203j299K282j614O55R73j231J814o89j087J956k459J717l49
1248D01k590K514r83n43K409l063K420J795l974K066R88k260J090j080R12J19
1264B21k018K552j121n62K914l022Q41K479l050J056J63j783K738k546l03K642
1280A201k597J386M95o42J181j060L07R50k675K710q60k839L430j601p85K978
1296A579k586Q26K250k617J246n24p24J669k380R21O13j351K171k692O12L970
1312B983l676l39K946k767J406m76j935K575j180m51J004j028J559m87p05K149
1328A578k160J422K53l178L051P8l588L287r06j329K932j114o87O76N91Q10k481
$$ y = [1417, -1549, 1124, -130, -749, 225, -1972, 288, 465, -1038, 808, -319, 701, 1455, -1262, 1638, 1011, -2012, 935, -268, -1567, 715, -899, -244, 729, -502, 1312, 623, -464, 1492, -967, 750, 401, -2189, 325, -658, -1201, 1208, -1855, 565, 2360, -1614, 452, 1440, -820, 270, -810, 102, 221, -1797, 755, -366, -928, 1986, -1036, -195, 2284, -766, 290, 453, -1330, 1408, -1138, -1441, 1201, -1396, -10, 485, -157, 1024, -36, 271, 1221, -1454, 1256, 396, -2443, 987, -614, -1399, 1579, -1007, -181, 2069, -548, 698, 174, -550, 1119, -1261, -340, 273, -1078, 1093, -1599, -987, 2983, -693, -1032, 1914, -853, 553, 77, -1858, 717, -463, -914, 90, -938, 621, 134, -571, 1578, -582, 840, 1093, -2085, 966, 1044, -2544, 743, -163, -1492, 1440, 326, -361, 315, 906, 1716, -765]
1345g65M66J786l010J516L11k010L557k386j161M232k768J5J519k414J870K36
1361I94k328M86O07Q46j206j150L603j913j063K867k679J113K233m683J555K192
1377A474k959J394k94l79J354l12O39j605Q2K960l281O25J539l501K320N80l005
1394b369L356m44j751K195q05P03k27k090J456N33k43o25j985L324k48l067L690
1411A403p95j842L799k956n17L030k981l22J351n68R36k047J525Q39j533K403
1427A725j821j179L379k565l92J853k897J927O73k668K131K79q05J108j267J334
1443H15K89j517P35j596J266J095l909K442J898l143K514n00j486L007j672j144
1459i06J644j040K73j151L58K298k413O17R84j621K872j090k138K848j857l6J339
$$ y = [-765, -299, 1487, -1523, -7, 304, -1706, 1851, -535, -1696, 2536, -232, -217, 1302, -1112, 758, 994, -1334, -848, -241, 605, -601, -1751, 1852, -61, -1124, 1743, -936, 177, 2410, -2273, -718, 1474, -1485, -91, -385, -764, 590, 278, 917, -688, -606, 2354, -927, -302, 1237, -2264, 56, 636, -2369, 987, 543, -1208, 987, 182, 885, 658, -1432, 24, 557, 314, -311, -2296, 1028, 780, -2287, 1403, 608, -1234, 2565, -391, -908, 2122, -859, -1181, 170, -398, 538, -1509, 16, 855, -678, 1725, -96, -1275, 2104, -461, -853, 1000, -1897, 30, 703, -1965, 166, 445, -360, 748, -519, 815, 1104, -413, 322, -1274, -8, 1087, -2822, -380, 1518, -1625, 889, 389, -1097, 1910, 238, -906, 738, -302, -29, -1180, -822, 1476, -937, -320, 664, -957, 1915, 825, -1313, 1535, -322, -358, 981]
1476I81l150J667J382k037J679m94J40P29j112J331r59j59J257l537J623K592
1492A933l489N58J718j621K025l73j646K170n53p87k54n65J874k149K45J707j784
1509i91J758k52j909K902m92j986K374j870l15J904k262M02R27l43N94j234J589
1526G96L15k044K810j270k028L658l334j001L591k243j8J032j027J517l09m36
1542IM98q64J409p52j949K681j782k43J598k095K001Q41k914K286K60j277J109
1559H16j250j08M59p76R01j063P59J721k989J622J526k743K572r10j848K347q84
1576A52j134Q22k60N27o4r07K118j634O13N40k191K186j0k030J762j141m93K129
1594I85k029J075J406k036J281n14k8O46j579Q76r4j173K087j606l59K834k306
$$ y = [981, -2169, -502, 880, -1157, 522, 28, 168, 897, -215, 1116, 157, -2, 1255, -2282, -659, 1933, -1556, -998, 720, -901, 1124, 751, -895, 1275, 722, -65, -319, -884, 990, -1159, -914, 793, -991, 767, 515, -1394, 1508, 1016, -970, 1404, -466, -781, 1123, -1139, -737, 190, -153, 441, -793, 796, 1111, -933, 1877, 607, -1421, 2237, -1097, -2098, 1493, -750, -768, 264, -763, 754, 445, 9, 507, -357, 1052, 300, -1649, 1032, -750, -993, 605, -1490, 511, 1352, -1562, 724, 984, -293, 816, -434, -542, -83, -859, 42, -1021, -262, 1459, -1530, 92, 1618, -1125, 1447, 537, -1311, 1036, 152, -982, -160, -420, 107, 43, -864, 1254, -380, 233, 773, -1418, 768, 758, -1272, 490, -651, -1144, 985, -1044, 31, 1437, -599, 682, 168, 140, 786, -793, 83, -11, -1184, 903, -703, -1062, 1772, -534]
1611e34K67J567k094J345L3j433J323j030l5P88j239J834o68q01K078j615N99
1628C85Q50k364J859m48j518J755j219o8J523j556P37O98l68J032j467q3J214
1645I62k192J573m28j353K266j161o17K012j408L65O67j362J241n29m79R75j561
1662a029R48N46j327J515o99k53J689j721O79N79j780J376q57q84J822j274M4
1679f26J210j129J036m38j56J556j915P03Q46k334J768k60j479J807r53k93J654
1696I97j353J170j59j454J957j387k80J085j693Q54O35j318J713q22nJ289j434
1713b05K24J076j895J087p4j403J622j107M60Q61j550J702m32r04J691j267k93
1730d07J142j845J361m19r55J658r70K60J017j238R09K20j363J150p14l88J123
$$ y = [-534, -267, 1300, -794, 551, 584, -849, 474, -556, -591, 197, -1042, 792, 124, -677, 1401, -214, 385, 1235, -1129, 730, 282, -1236, 519, -700, -768, 755, -801, -64, 634, 266, 1298, -169, -252, 962, -1230, 343, -85, -1438, 828, -333, -950, 1062, -346, 19, 686, -676, 565, 36, -443, 532, -1029, -81, 465, -862, 653, -46, -299, 1390, -331, 348, 927, -853, 523, -334, -1218, 604, -670, -626, 584, -545, 491, 53, -103, 1453, -462, 241, 1087, -1247, 521, 261, -1218, 589, -364, -657, 997, -356, 814, 655, -799, 1158, -229, -509, 576, -1117, -263, 372, -946, 767, -55, -60, 1229, -205, 19, 1095, -800, 287, 213, -1190, 432, -675, -215, 646, -904, 798, 366, -538, 1153, -114, -407, 735, -1110, 251, -168, -1123, 535, -435, -175, 842, -396, 513, 733, -630, 520, -194, -582, 541]
1747E41k176J820J94j273J676q60lJ550j970O43N18j438J284n14p64J516j524
1764g80P20M29j337K169r90r95J950j512L53O16j629J090m77o86J881j493M52
1781b39R44j451J294K15j235J044r68n0Q16j148J100m45o72J581o56o92J768j510
1799c04O08K08j341J471j162j07J193j448J068M20j062J302m00p08J433j581N56
1816A46J24j260J204m37m80J093o84J33Q57j333J468o42o37J264j359K30R41j601
1834i73R42N3q88J690p65m4P23j363J162n17j038J660r71k48J009j394J242J43
1852D23q67J489m23j015R77p94M34K60j462J095n07j97R53o06M28O06j461J813
1870A146q39o98R38j362L89Q25j438R03M30j116J675p67K30L09j126J153m23q40
$$ y = [541, -1635, 185, 379, -894, 782, -78, -81, 1469, -501, 142, 660, -778, 506, -8, -772, 744, -780, -60, 369, -968, 1201, 211, -784, 1166, -346, 7, 623, -1006, 84, -393, -1079, 802, -691, -239, 705, -746, 548, 763, -472, 572, -396, -446, 370, -778, 322, -123, -795, 786, 130, -562, 1206, -304, 304, 512, -829, 642, -520, -627, 566, -882, 186, 606, -456, 846, 446, -262, 1171, -410, 146, 270, -990, 214, -223, -703, 390, -294, -161, 696, -637, 831, 189, -448, 816, -543, -313, 628, -973, -31, 22, -866, 824, 59, 15, 738, -625, 537, 20, -1018, 642, -329, -577, 432, -962, 280, 423, -444, 1045, 622, -393, 584, -210, 224, 484, -978, 117, -390, -587, 366, -240, 188, 794, -667, 1146, 307, -391, 547, -815, -426, 399, -1039, -136, 294, -822, 853, 86, 316, 625, -501, 652, 229, -611]
1888f11R85q57j22Q59r89Q21L90r87R48j20k75L66j209R61Po59R92q30l1J057
1908F96j471R14O40j712J564n42l58O09j017K97O54j345J313o19P2J113j287O30
1926A51P16j453P71P7j324J860j448l17J287j032Q06L86n34N02n76N37M21j759
1944i29J200j06r69J136j045qJ684j568K64J298j146O53m21l44P98r82L71m07
1962e21j51J499j167l74K115j789Q12L54j536J410m95j109J132q64M90L62o70
1979e02R23m94J89Q90j392Q26M24k206J646n4j195J359n14n32J172n37M33P0o19
1998a13R56r67n21R49j150J358r72n00J867j133k25J187q82L45Q87j647O90o8
2016F1k28k39l30R11J29q03J069n69l54J222j272M33P89j381Q22m34p24J649p44
$$ y = [-611, 374, -483, -605, 254, -735, 86, 476, -511, 437, 317, 42, 408, -801, 160, 167, -492, 500, -330, -361, 696, -775, 139, 779, -933, 631, 89, -269, 340, -677, -380, 274, -1071, 242, -377, -305, 808, -479, 151, 867, -586, 185, 262, -1062, 798, -650, -967, 320, -712, 94, 480, -54, 448, -128, 409, 830, -929, 271, 165, -804, 332, -713, -721, 963, -605, -341, 957, -189, 464, 43, -301, 497, -485, -114, -521, -672, 827, -340, -714, 1401, -388, 424, 778, -758, 652, 157, -952, 180, -684, -194, 168, -502, 421, -73, 116, 1006, -386, 440, 864, -1342, 304, 250, -945, 414, -100, -632, 540, 3, 436, 506, -113, 843, -124, -645, 304, -846, 512, -460, -960, 907, -226, -451, 736, -146, 199, 1086, -561, 129, 61, -167, -406, -736, 175, 304, -499, 570, 1, -353, 869, -403, 30, 819, -562, 260, -174, -898, 751, 7]
2035Gk55M40l9K27Nl89R11j318M83J7j297J860j17j949J917j84q33J254j171O99
2055B68O70r35J27k80L4K66j072Q55L20n17J008p12l20J807j749J65P51r47K95
2074C4J15p29M28L67j81Q2J9J024j230j17R32j466R16N09k130J362M74j254R93
2093A48k83o9Q10p91O1K75p3L99j513N90R87j309R56j86p42J857j063r44J968
2112A078q98o47R63q68M06O2l69n0O9J241j090q46J842m35j082J510j443M27J260
2131A130j933J16J046o23L45J17N5K70o71N34q05L59J248j879J53J366j429P77
2149A76J80j240J570j33j150Q37j13l15J33m21P31m17K27j57j018J591L25j513
2167g07J569l55r73J337r09m38J135n17m54J25K7N47o46L90L46r36J284p51o35
$$ y = [7, -248, 192, 153, 380, 385, -4, 907, -411, 72, 89, -1208, 652, 535, -1414, 503, 319, -514, 740, -431, 268, 938, 3, 130, -150, -116, 150, -922, -67, 253, -264, 744, 32, -288, 1519, -230, -65, 686, -261, 34, 149, -580, -152, 215, 34, 116, 135, 1159, -71, -188, 744, -722, 194, 703, -1427, -65, 409, -845, 148, -135, -204, 606, -185, -124, 151, 78, 477, -1036, -446, 541, -768, 188, 2, -740, 1117, 54, -890, 1078, 180, -467, 496, -372, 34, 96, -273, -323, -254, 987, -103, -949, 893, 458, -624, 886, -557, -130, 1130, -803, -687, 359, -264, 81, 198, 253, 523, -148, 386, -419, -60, 1188, -691, -538, 828, -601, 176, 356, -884, 686, 553, -597, 240, 127, -188, -55, -476, 255, -162, 65, -92, -1110, 481, 806, -707, 862, 507, -466, 871, -38, -476, 659, 142, -312, -187, -160, 387, -259, 131, 477, -459, 825, 74, -561]
2186e61J537j255k85R67j179O53N72j045Q84K36k21J41p04O00l19n01R65j242
2204g57N24R54j560P04J000j218Q23J27q35O34n67P6pj65M40n05o6J045q74N54
2224C27K18q11J080q45p35J020o95K22N37o91N54Q7l18K55k00N03l01m98N06n5
2244A60o43R07q58o8J265j233K40J061j035Q43m30m43N97l37L10n11j14Q90r23
2263c22p5J229j253J015K3q68P93j92q11Q51p02j94Q16q92N34P3J9J93m40N72
2283C69K25r95P19k61k86O71m84l5M57k66J7l90K53N72q36J64K76o80Q90l58q12
2304g90J103n98N7P94q90N81M27r70P68n14j60M74o16N08k1n21P23k90o9Q65j229
2325c68K32N71p37P33l32o57O42l87N19j12k96M21J23p33J077q75K71J33p17P07
$$ y = [-561, 976, -279, -564, 403, -776, -123, 449, -596, 288, 524, 303, 444, -260, 340, 21, -480, 485, -757, -233, 721, -839, -135, 865, -353, 470, 597, -238, 396, -171, -95, -102, -267, 173, -332, -398, 647, -227, 327, 545, -266, 814, -31, -766, 254, -441, -219, 318, -373, 181, 268, -50, 205, 5, 508, 207, -291, 215, 160, -483, 424, -434, -502, 763, -470, -230, 831, -204, 639, 209, -234, 363, 26, 336, -175, -289, 601, -322, -397, 832, -421, 594, 617, -251, 542, 350, -461, 390, -312, -506, 310, -582, -48, 25, 44, 237, -203, 369, 594, -401, 318, 57, -229, 442, -42, -77, 380, 114, 131, -259, -6, 566, -270, -106, 170, -510, 380, 22, -790, 313, -285, -228, 566, -324, 257, 684, -286, 482, -32, -192, 282, -334, 174, 153, -368, 355, 65, -4, 861, -368, -136, 435, -302, 431, 99, -558, 84, -303, 216, 104, -192, 229, 352, -381, 696, -179, 92, 225, -492, 215]
2345B15l32o13R09o89J82Q12p96J65N08n94M97l42o0L97j050Q39n9j96O98n60
2365f9p3P97p10J70L67o30L98l95N8L9n36O38J51q14R73k44m64Q41q01K40K99
2386B35p02P02m55m10J445r49M21L18p27L65j73k62N82n80o3Q18j269O19Q0m63
2406d68O44k14q2N01o81M17O5n17P94q43J09M75o50O45L13q03Q47k65k33N11j083
2427e18O70o0r53J034l84j24N73n52J19P51o77M74m95j94P12n39j09O24q75L92
2447a31J77m17P84l27J66M18r89K18K01n92R32p92k62P72n24M73L16l11N59o26
2467D5P2N13q77l1N02n97M72j38j37L98n42O53N9r63Q68l83j5L23p02J63P29p33
2489c21N57j61k66M54l77p2O51j000N64J06p10P94n40K30K42o31P04j71m29P34
$$ y = [215, -117, -730, 179, -510, -328, 484, -312, -147, 361, -233, 264, -78, -138, 259, -791, 48, -11, -207, 491, -69, -142, 655, -55, 115, 482, -148, 250, -145, -87, -48, -584, 54, 205, -609, 364, 120, -344, 497, -304, -64, 235, -467, 235, -220, -630, 815, -134, 287, 605, -122, 243, 70, -192, 390, -190, -253, 565, -704, -85, -5, -468, 176, -38, -120, 381, -300, 117, 182, -335, 459, -384, -275, 200, -450, 195, 508, -295, 552, 287, 54, 565, -518, 152, 92, -861, 173, -211, -335, 238, -314, -195, 556, -121, 353, -142, -336, 376, -163, -272, 352, -523, -131, 46, -371, 413, 86, 252, 670, -319, -101, 100, -492, 440, -352, -614, 158, -366, 107, 423, 112, 671, 45, 117, 630, -247, -278, 224, -373, 99, -39, -176, 222, -320, 333, 392, -571, 297, -86, -101, 222, -480, -317, 412, -321, 236, 75, -191, 263, -114, -186, 465, -535, 29, 135, -575, 219, -321, -91, 151, -480, 224, 53, -376, 358]
2509C58K1o26M56k29j12J82m90N12m10L9O51o01L48M04m82N3r6j41Q08q63k5N37
2531B94p93O91N9o72R14p57M38L55o44K25r1l49M07m36N52k47m39O79J00n51N78
2552C13m97K3K38j89M0J15j39P44r56j79Q31p33L87N56o88N04j84n08N87p23K77
2573a81J97l16N86o56K7Q26p54L79L47p09N92o13k23P04m69R5M64p39K88L64j42
2594F7N95j310N07L39n61N39m31k68N76o2J17K71l78J22K36m71N68n45j99M82
2614A94n35L27j65n5P24k89l38O26q05K46L03o47Q09k76n56O66o97L11N26o92
2634c23O29m42J26J81n70O23j07m74J015q56k31Q50m16q6O31m37Q3K99o95K68
2654F8j14l4J33n83Q38o05l45J084p64J76P38o75L3N26q56J98K18k01O63q51K23
$$ y = [358, 379, -247, 209, -20, -132, 50, -440, 72, -338, -299, 352, -249, 99, 503, 21, 74, -22, -163, 645, -218, -243, 294, -499, 192, 251, -421, 493, -264, 174, 529, -115, 110, 19, -330, 77, -359, 193, -54, -493, 186, 286, -265, 313, -184, -161, 77, -112, -72, 43, -96, 648, -308, -487, 344, -389, -2, 554, -134, 370, 186, -322, 265, -458, -181, 16, -300, 286, -370, -343, 483, -271, 108, 455, -254, 338, -275, -498, 206, -263, -168, 296, -443, -155, 209, 67, 662, -648, -141, 198, -363, 176, -255, -523, 53, -9, 108, 379, 1, 123, 359, -112, 456, -89, -288, 194, -341, -14, -179, -234, 490, 201, -137, 489, -316, -70, 233, -414, 395, 119, -437, 229, -468, -157, 369, -323, 306, -136, -10, 171, -399, 224, 117, -357, 658, -198, -429, 421, 5, -81, 550, 113, 196, 495, -200, 68, -46, -80, 53, -530, 308, -297, -642, 442, -322, -146, 592, -83, -50, 476, -380, -182, 36, -165, 498, -353, -130]
2675a30J91j2J85m13J00O09r85M95o4l27R78p01m17Q21m25j97M13n0M45k88k07
2696B1K89o71M49K65j107P49N74p69N64n86J23N64l40j50M14l36k4k85K63J6m20
2717c97M59n13K01Q57q04j22R27q97L13N03j007P27j19k50j9j27L62L30q40P32
2737C16k86J9L04p11J96M29j270P73J43k55Q19n81j96N41J68J44o38m22O01l83
2757b89J52L07m93Q33m08o22J193o59k71R39j057J35P38q47N87J8p0m8m52O55
2777C41l0o39P58k75l33Q98r54j10O70r86O02o6k39O39o15K8P02pk18l26J29M46
2799D15l94K30k42o19R08P3q91P15J02l72J71m49K78K55k41l5l53N64k6o62O57
2820H4K37n67Q13m24l88O28n53M46K13n83K98j96j41J47r9K72l72J00L71j34l79
$$ y = [-130, 61, 49, 234, -179, -79, 530, -455, 40, -24, -351, 627, -74, -491, 330, -95, -292, 121, 71, 516, 228, 21, 310, -361, 88, 353, -754, -5, 569, -200, 364, -222, -99, 465, 125, -25, 389, 53, 29, -256, 7, 23, -397, 62, -451, -250, 607, -197, -319, 608, -289, 24, 527, -480, 247, 128, -122, -141, -268, 94, 424, -416, 316, 30, 49, 353, -358, -162, 267, -1003, -230, -87, -342, 477, -104, -300, 241, 409, 553, -85, -507, 94, -289, -137, 170, -323, 510, 102, -520, 673, 14, -257, 682, -375, -240, 498, -349, 238, 256, 186, 138, -314, 341, 311, -328, 430, 155, -178, 720, -234, -344, 326, -660, -58, -124, -363, 276, -339, -311, 391, 384, 166, -160, -31, 415, 21, 251, 9, -610, 298, 371, -520, 195, 297, -75, 96, -353, -75, 180, -61, -96, -449, 115, 89, -573, 84, 321, -246, 567, 143, -245, 383, -170, 276, 489, -94, 204, 8, -133, 14, -85, 187, -185, -85, 286, 152, -227]
2841b27O21r04L81M44p78P88L91j243O55r2L30j83j94j58K5L02j90m95L37N80
2861C90r07R14j03o03P50m83m61Q53o16L7j47J36L70l19K4M18m31Q35m92q28J193
2882E30l82m31O46n55L00K95r77M02L61m7J41k14Q8L0n59N52l05j90P91o07j40
2903b71Q07p20L22k6l25M68j20r5j45k41L08o2l46M97k07J89J48m88N24K99r44
$$ y = [-227, 394, -510, -129, 315, -463, 325, 716, -527, 128, 36, 366, 183, -11, -169, -144, 158, -32, -527, -190, 390, -517, 397, 294, -309, 441, -42, -503, 350, -266, -229, -376, -240, 130, -189, -165, 253, -178, 657, 165, -663, 530, 148, -283, 363, -192, 108, 403, -574, -172, 189, 142, 283, 69, 157, 187, -372, 180, -125, -315, 476, -131, -271, 536, -184, 138, 112, -213, 255, 135, 40, -105, -346, -38, -100, -446, 51, -156, 33, 181, -307, 217, 516, -428]
$$ [...]
8191A20
##END NTUPLES=NMR FID
##END=
