##TITLE=1H_Pr D-1
 200.13Hz, CD3OD.
 8 sc
 
 23.4.2026
##JCAMPDX= 6.0         $$ Bruker NMR JCAMP-DX V2.0
##DATA TYPE= NMR FID
##DATA CLASS= NTUPLES
##ORIGIN= UXNMR, Bruker Analytische Messtechnik GmbH
##OWNER= pz
$$ XWIN-NMR		Version 3.5
$$ Thu Apr 23 15:26:57 2026 Russian Standard Time (UT+4h)  she@DPX200
##.OBSERVE FREQUENCY= 200.131
##.OBSERVE NUCLEUS= ^1H
##.DELAY= (6, 6)
##.ACQUISITION MODE= SIMULTANEOUS
##.ACQUISITION SCHEME= undefined
##.AVERAGES= 8
##.DIGITISER RES= 18
##SPECTROMETER/DATA SYSTEM= spect
##.PULSE SEQUENCE= zg30
##.SOLVENT NAME= CDCl3
##.SHIFT REFERENCE= (INTERNAL, CDCl3, 0, 14.3821)
##AUDIT TRAIL= $$ (NUMBER, WHEN, WHO, WHERE, WHAT)
$$ ##TITLE= Audit trail, XWIN-NMR		Version 3.5
$$ ##JCAMPDX= 5.01
$$ ##ORIGIN= Bruker BioSpin GmbH
$$ ##OWNER= she
$$ F:/spectra/data/she/nmr/H-C/1/audita.txt
$$ ##AUDIT TRAIL=  $$ (NUMBER, WHEN, WHO, WHERE, WHAT)
(   1,<2026-04-23 15:25:39.06 +0400>,<she>,<DPX200>,
      <created by zg, POWCHK disabled, PULCHK disabled
       configuration hash MD5:
       00 E9 B6 7A A2 85 ED C7 34 08 36 98 17 FE 4E 26
       data hash MD5: 16K
       1E A6 8D C5 5B C1 91 30 40 86 C3 AB 16 29 9E 92>)
$$ ##END=
$$ 
$$ hash MD5
$$ E5 CA 94 CB DE 19 24 FF C4 1B 03 DE 31 D5 94 D7
##$RELAX= 
##$RELAX= 
##$RELAX= 
##$RELAX= 
##$RELAX= 
##$RELAX= 
$$ Bruker specific parameters
$$ --------------------------
##$DU= <F:/spectra>
##$EXPNO= 1
##$NAME= <H-C>
##$PROCNO= 1
##$TYPE= <nmr>
##$USER= <she>
##$AMP= (0..31)
100 100 100 100 100 100 100 100 100 100 100 100 100 100 100 100 100 100 
100 100 100 100 100 100 100 100 100 100 100 100 100 100 
##$AQSEQ= 0
##$AQ_mod= 1
##$AUNM= <au_zg>
##$AUTOPOS= <>
##$BF1= 200.13
##$BF2= 200.13
##$BF3= 200.13
##$BF4= 200.13
##$BF5= 200.13
##$BF6= 200.13
##$BF7= 200.13
##$BF8= 200.13
##$BYTORDA= 1
##$CFDGTYP= 0
##$CFRGTYP= 5
##$CHEMSTR= <none>
##$CNST= (0..31)
1 1 145 1 1 1 1 1 1 1 1 1 1 1 1 1 1 1 1 1 1 1 1 1 1 1 1 1 1 1 1 1 
##$CPDPRG= <>
##$CPDPRG1= <>
##$CPDPRG2= <>
##$CPDPRG3= <>
##$CPDPRG4= <mlev>
##$CPDPRG5= <mlev>
##$CPDPRG6= <mlev>
##$CPDPRG7= <mlev>
##$CPDPRG8= <mlev>
##$CPDPRGB= <>
##$CPDPRGT= <>
##$D= (0..31)
0 0.7 0 0 0 0 0 0 0 0 0 0.03 0 0 0 0 0 0 0 0 0 0 0 0 0 0 0 0 0 0 0 0 
##$DATE= 1776943538
##$DBL= (0..7)
120 120 120 120 120 120 120 120 
##$DBP= (0..7)
150 150 150 150 150 150 150 150 
##$DBP07= 0
##$DBPNAM0= <>
##$DBPNAM1= <>
##$DBPNAM2= <>
##$DBPNAM3= <>
##$DBPNAM4= <>
##$DBPNAM5= <>
##$DBPNAM6= <>
##$DBPNAM7= <>
##$DBPOAL= (0..7)
0.5 0.5 0.5 0.5 0.5 0.5 0.5 0.5 
##$DBPOFFS= (0..7)
0 0 0 0 0 0 0 0 
##$DE= 6
##$DECBNUC= <off>
##$DECIM= 32
##$DECNUC= <off>
##$DECSTAT= 4
##$DIGMOD= 1
##$DIGTYP= 9
##$DL= (0..7)
0 120 120 120 120 120 120 120 
##$DP= (0..7)
150 150 150 150 150 150 150 150 
##$DP07= 0
##$DPNAME0= <>
##$DPNAME1= <>
##$DPNAME2= <>
##$DPNAME3= <>
##$DPNAME4= <>
##$DPNAME5= <>
##$DPNAME6= <>
##$DPNAME7= <>
##$DPOAL= (0..7)
0.5 0.5 0.5 0.5 0.5 0.5 0.5 0.5 
##$DPOFFS= (0..7)
0 0 0 0 0 0 0 0 
##$DQDMODE= 0
##$DR= 18
##$DS= 0
##$DSLIST= <SSSSSSSSSSSSSSS>
$$ [...]
##$SUBNAM0= <"">
##$SUBNAM1= <"">
##$SUBNAM2= <"">
##$SUBNAM3= <"">
##$SUBNAM4= <"">
##$SUBNAM5= <"">
##$SUBNAM6= <"">
##$SUBNAM7= <"">
##$SUBNAM8= <"">
##$SUBNAM9= <"">
##$SW= 18.0517599122864
##$SWIBOX= (0..15)
0 0 2 0 0 0 0 0 0 0 0 0 0 0 0 0 
##$SW_h= 3612.71676300578
##$TD= 16384
##$TD0= 1
##$TE= 0
##$TE2= 300
##$TE3= 300
##$TEG= 300
##$TL= (0..7)
0 120 120 120 120 120 120 120 
##$TP= (0..7)
150 150 150 150 150 150 150 150 
##$TP07= 0
##$TPNAME0= <>
##$TPNAME1= <>
##$TPNAME2= <>
##$TPNAME3= <>
##$TPNAME4= <>
##$TPNAME5= <>
##$TPNAME6= <>
##$TPNAME7= <>
##$TPOAL= (0..7)
0.5 0.5 0.5 0.5 0.5 0.5 0.5 0.5 
##$TPOFFS= (0..7)
0 0 0 0 0 0 0 0 
##$TUNHIN= 0
##$TUNHOUT= 0
##$TUNXOUT= 0
##$USERA1= <user>
##$USERA2= <user>
##$USERA3= <user>
##$USERA4= <user>
##$USERA5= <user>
##$V9= 5
##$VALIST= <valist>
##$VCLIST= <CCCCCCCCCCCCCCC>
##$VD= 0
##$VDLIST= <DDDDDDDDDDDDDDD>
##$VPLIST= <PPPPPPPPPPPPPPP>
##$VTLIST= <TTTTTTTTTTTTTTT>
##$WBST= 1024
##$WBSW= 4
##$XGAIN= (0..3)
0 0 0 0 
##$XL= 0
##$YL= 0
##$YMAX_a= 371646
##$YMIN_a= -412127
##$ZGOPTNS= <>
##$ZL1= 120
##$ZL2= 120
##$ZL3= 120
##$ZL4= 120
##$ABSF1= 10
##$ABSF2= 0
##$ABSG= 5
##$ABSL= 3
##$ALPHA= 0
##$AQORDER= 0
##$ASSFAC= 0
##$ASSFACI= 0
##$ASSFACX= 0
##$ASSWID= 0
##$AUNMP= <proc_1d>
##$AZFE= 0.1
##$AZFW= 0.1
##$BCFW= 1
##$BC_mod= 2
##$BYTORDP= 1
##$COROFFS= 0
##$CY= -3
##$DATMOD= 1
##$DC= 2
##$DFILT= <>
##$DTYPP= 0
##$F1P= 0
##$F2P= 0
##$FCOR= 0.5
##$FTSIZE= 0
##$FT_mod= 4
##$GAMMA= 1
##$GB= 0.15
##$INTBC= 1
##$INTSCL= 1
##$ISEN= 128
##$LB= 0.25
##$LEV0= 0
##$LPBIN= 0
##$MAXI= 10000
##$MC2= 0
##$MEAN= 0
##$ME_mod= 0
##$MI= 1.114404
##$NCOEF= 0
##$NC_proc= 0
##$NLEV= 6
##$NOISF1= 3.799351
##$NOISF2= 2.8
##$NSP= 1
##$NTH_PI= 0
##$NZP= 0
##$OFFSET= 14.38212
##$PC= 1
##$PHC0= -4065.065
##$PHC1= 11.39229
##$PH_mod= 1
##$PKNL= yes
##$PPARMOD= 0
##$PSCAL= 0
##$PSIGN= 0
##$REVERSE= no
##$SF= 200.129724274929
##$SI= 16384
##$SIGF1= 3
##$SIGF2= 2
##$SINO= 400
##$SIOLD= 16384
##$SREGLST= <1H.CDCl3>
##$SSB= 0
##$STSI= 0
##$STSR= 0
##$SW_p= 3205.1282051282
##$SYMM= 0
##$S_DEV= 0
##$TDeff= 0
##$TDoff= 0
##$TI= <>
##$TILT= no
##$TM1= 0
##$TM2= 0
##$TOPLEV= 0
##$USERP1= <user>
##$USERP2= <user>
##$USERP3= <user>
##$USERP4= <user>
##$USERP5= <user>
##$WDW= 1
##$XDIM= 8192
##$YMAX_p= 0
##$YMIN_p= 0
$$ End of Bruker specific parameters
$$ ---------------------------------
##NTUPLES= NMR FID
##VAR_NAME=  TIME,          FID/REAL,        FID/IMAG
##SYMBOL=    X,             R,               I
##VAR_TYPE=  INDEPENDENT,   DEPENDENT,       DEPENDENT
##VAR_FORM=  AFFN,          ASDF,            ASDF
##VAR_DIM=   8192,          8192,            8192
##UNITS=     SECONDS,       ARBITRARY UNITS, ARBITRARY UNITS
##FACTOR=    0.0002768,     1,               1
##FIRST=     0,             0,               0
##LAST=      2.2672688,     0,               0
##MIN=       0,             -412127,         0
##MAX=       2.2672688,     371646,          0
$$ Real data points
##PAGE= N=1
##DATA TABLE= (X++(R..R)), XYDATA
$$ [...]
2207g4o43J199p70r6qJ19J93j48K74r2J26k36k07N57L97l89m61k5P62n34J64q9
2229A9m3k01Q13j04o51r5Q18k85k41j60l4j21R6M76k94n41M25J04K43P1p27j9
2251d51l7P83Qq2M51n68M09m95K14l33k01L86N55j068j20L06r7M37l2k26m44O52
2273D7p9N0k27j40K78q7O31l84J5j66l41N07L6m41j2N68p05P90n73n35M38L07
2295b3P58j63p86j59j84M76J65l06m66L27M47k59j33R9k53J089o36j10O60o20
2315g7K66J75j04q21K21q3M63K74M0o36P39j194R21L65p43J30Q9M88n18j82n10
2336f97P48M86l10L23q86J23k75M88N30n09PJ07K78m86L64n14r0Q72J42n88l86
2357b73n9O26K0j14l8j59j43L87Q2oo91k18N53K23J93m16k11P6L20j28L54k82
$$ y = [-74, -717, 482, -288, -384, -392, -273, -80, -228, 46, -46, 80, -156, -363, 194, 591, 202, -259, -284, 478, -56, 108, 19, -24, -225, 588, 484, -167, -262, 556, 271, 30, -130, -164, -285, -189, 287, -7, -548, -123, -19, 224, 295, -432, -451, -488, 295, 303, 221, 672, 104, 513, 18, 232, -101, -302, 84, 639, -429, -549, -243, -340, 97, 65, -161, -605, 47, -32, 18, -209, -349, -71, -158, 473, 89, 104, -62, -403, 104, 140, -301, -313, 255, -450, 340, -233, -768, -330, -23, 735, 572, -214, -373, -557, -81, 84, -222, -688, -361, 86, -173, -306, -207, -460, 629, -7, -117, 543, -77, 189, 364, 260, -561, -340, -423, 40, 314, 354, -282, 457, -737, 184, 549, -194, -64, 25, 513, -5, -187, -697, 51, 537, 227, 550, -336, -213, -488, 0, 530, 21, 28, 135, 413, -73, 291, -223, -313, 559, 701, 113, -273, -332, 294, 314, 200, 162, 3, -140, 247, 329, 323, -368, -586, -33, 190, 383, -33, -244, -168, 152, 24, 378, 96]
2379I6k09j73N51l65k53M26P9J75k58J9j74j67P81m42k65j97N11L68m24o0m15
2400c96k19R13j1n35J02k85J018j56m06k43R2J41N33o94M93o15m7N38O78o44l33
2421g6j00Q94o53k27l7K03Lj05L93k74j7l79M71P31j65l53k70o44J199l91L66
2442E69p16K19M97k32n30J48J73r6KK52r25O77K86L21l20n59j29L79N91n53q20
2463g66K35K57K35J55j08j72L73m17K34j91J87l06k1L89K36l20k05N23m54L27
2483A91J73n22N9K93r8J29l58p8n3M27K43m10j88j99L97L01k14m69p8N28R2j11
2505E5j93j98M54P2P6j81m67L74O1L35k73l31MJ61J80n8k08p0Q3L34j51L3j34
2528d2j59K40K5J07m09l9K45K78j97q9j86K10K34np7l20j36L53P5P7l08j30L32
$$ y = [96, -113, -286, 265, -100, -353, 73, 152, 327, 69, 88, -86, -253, 528, 86, -179, -376, 135, 503, 79, 19, -396, -615, 298, 287, -248, -146, -431, 587, 431, 25, -218, -126, 15, 548, -146, 347, -268, -315, 223, 901, 257, -76, -176, 718, 65, -162, -199, 4, 7, -98, 295, 21, 4, -375, 96, 827, 662, 309, 39, -605, 594, 203, 569, -147, 72, 569, 337, -193, -45, 128, 32, 34, 286, -639, 38, 324, 645, 325, -234, -363, 16, 607, 54, -766, -531, -274, -39, 116, 8, -164, 209, -208, 26, -165, 22, -284, -305, 84, 320, 0, -205, 318, -136, 191, 364, -158, -99, 194, 96, 225, -133, -211, -264, 163, 406, -4, -192, -391, 6, 307, 93, -376, -454, 74, 166, 55, -138, -336, 118, 190, 266, 85, -382, -8, 53, 388, 115, -216, -212, -51, 129, 71, -137, -207, -124, 210, 59, 92, -42, -201, 39, 64, 171, -238, -277, -32, 246, 49, -40, -226, -16, 218, 213, 136, -184, -320, 33, 108, 185, -123, -253, 79]
2551G9K7Pj48k03J78J75J8k06k69J81M06j26l1j04L2j48L83mj53j70jK31M2r6
2575A00l34L1K40Q1n0j90N7j1J63KJ21k86j55M55k39L53m42M2K36n2j09q4qJ54
2599G5L3l6m49M39J9j98J41M2j95J7O3K82j00l47J36J98R5m14P0n1L86J00m8l12
2623e4j46k72N44j18L11n44j51p6N95J22o7o5L6n7K25N34j519L48L46R6L16m37
2645c3n95K73K28R51q96o71J326j006J076q85K4j92Q14n38n96Q84q0p60L85J59
2665a32M40K63o34n12J66J090j666M06L14M31j92q12O3J430j90j55j056P57m93
2684d82O77j81j02P4M14l2N34p47n41k90O46Q6L79m25K07m34M89R2O5n45N9k87
2706c44P12J8p87J14K60N19p55L86l20j55K76K46k03l13K63J57M52j93k07Q2k82
$$ y = [79, 106, 113, -35, -238, -60, 115, 133, -73, -342, -161, 245, 119, 88, -16, 16, -132, 251, 247, 94, -76, -77, 154, 196, 100, -234, -203, 37, 118, 68, -122, -65, -76, 87, 89, 210, -76, -231, 224, -15, 338, -104, -62, 174, 122, 13, -71, -79, 75, 108, 72, -377, 62, 81, -117, 24, 66, -129, -112, -49, 233, 133, -214, -78, 120, 215, -199, -129, -180, 206, 306, 258, -54, -200, -472, 72, -46, 265, -279, -430, -506, 89, 211, 144, 79, 115, 58, 283, 817, -702, -354, -8, 88, 404, -33, -628, -355, -127, 824, -72, -743, 583, -423, 653, -232, -208, -400, 414, -124, -720, 164, 84, -676, -291, -132, 308, 571, -63, -575, -409, 681, -985, -579, -265, 166, -26, -838, -775, 655, 465, 310, -746, 11, -482, 195, 14, -88, -14, 400, 368, 902, 155, -386, -676, -30, 56, 435, 10, 217, -217, 272, 364, 429, -116, -57, -344, 368, 386, -401, -287, -27, 492, -263, 123, -197, -352, -76, 170, -33, -346, -83, 74, 526, 333, 126, 208, -74]
2727g4O54r0n85k58N17k09L05J10l19m99R83j003K33l92O34M79k52l7o03K18m27
2748f15O40L18l49k91M24k74K28m2q6m00N94j28K96l50j68R45n41J41k76k78K91
2769G9o7J40n63P25m53K74j88J85L47P6n51O1j99R4L79k39J73n37N91n74M44l95
2791a98j67k49L60O34n22J63n05O66K88k39l72o00O65J28J28L44o69L04K37q51
2811d55J93J83N6l03m13L66o1L49M1L81n83L23o4l29M82l16n8L01K1n12j23J72
2833c49j64K85N43m7j75J58q20Q63m59M31p03J41l55O34k92O25K16m73J77r13
2853f77Q79Ql48J76l70K98L03m36N85m38l99k0M04Q1r2N3K52l56o6p2q3J32L0
2876a56K31k88J22K81J8m50K4r1O27j55k97J91j55J58l90L48j7j06k03K90J83
$$ y = [-74, 580, 490, -95, -353, 164, -45, 260, 370, 51, -448, 535, -468, -235, -627, 7, 486, 234, 197, -406, -188, -615, 25, 343, -6, -297, 127, -147, 81, 39, -47, -447, 147, 19, 315, -35, -203, 742, 201, 342, 66, -212, 79, 12, 152, -411, 314, -139, 135, -53, 132, 479, 555, 4, 65, -134, -40, 339, 100, 273, -264, 327, -247, 197, -198, -365, -614, -254, 380, -142, 21, -484, 182, 470, 231, -141, -741, -76, 52, 180, 524, -145, 159, 396, -455, -262, -79, -23, -326, -739, -373, -434, -85, -44, 337, -246, 77, 13, -316, 166, -150, -208, 93, 114, -398, -521, -349, -513, -228, 315, 268, 93, 251, -569, 294, -165, 266, -437, -296, -651, -17, -309, 316, 532, 59, 236, -677, 202, 210, -138, 38, -332, -34, 269, -167, 418, -20, -419, -439, -35, 46, -46, 7, 259, -97, -163, -235, -318, -186, -156, 75, -213, -91, 190, 208, -242, -218, -309, 318, 163, -134, 57, -98, 60, -330, 18, 1, -105, -308, -18, 165]
2897A65J45k19n26O80l18r0q6O58k82r9J25k78L07j30l79N81k58l51L58j11N54
2918D46p6p95P93q88Q52m80K95j40K17o21K58K93n12N76k01m41N11l73Q88n88
2938A4p57Q10l88P30j47p26O57o04Q83m48j53j17N69p54L92N84p11K20n4m00O21
2959B21j33K56J25m62J77O43o58J1o70N02L41l58M55m13j19L20p51R45l96L84
2979D20o8L3j31n49k30P1L81K81o91k59J144k65k02m96L66O38J40j23p49q43J634
3000E02o42M15m7N5j125J264q42P28K32m85o8K87L8q64J020j534J330r61Q38r09
3020g68N58J070q06K72L8q7j276Q82k44q86K323q73m2Rk19m06J326o91q98Q01
3040H3k79L72q99J105q61L45j98J209q91J03n05O96J25n16o08R49m60l5M98N50
$$ y = [165, 310, 91, -435, 245, -73, -163, -249, 409, 127, 28, 153, -125, 182, 52, -327, 254, -4, -355, 3, -108, 446, 370, -425, 368, -520, 332, -148, 147, 7, 224, -397, -139, 154, -358, 218, 17, -424, 87, -286, 602, 14, -743, 67, -321, 409, 262, -464, 193, -411, 472, 24, -129, -246, 323, -431, -39, 545, -166, 54, 0, -400, 221, 88, 344, 469, 7, 184, 827, 169, 180, -490, 12, 353, -5, 450, 37, -82, 238, -513, 432, 36, 420, 352, 385, 254, -295, -525, -454, -73, 208, -483, -742, 402, 137, -65, -561, -195, 443, 583, 460, -289, -1132, 502, -140, 275, 228, 283, -842, 422, -420, 308, 540, 55, -13, 274, 312, -552, 468, -1066, 264, -697, 141, -768, -210, 860, 54, 326, 364, 277, -999, -117, -361, -1247, 1076, 203, 161, 170, -49, -455, 871, 180, -718, 83, -196, 176, -723, 382, -479, -134, -332, 877, -14, 89, -416, 280, 405, -111, -719, 230, -230, -265, 233, 783]
3060G83m60p53O91n14J58O8O3K04l1K75j353J066p11M92N54n61Q3m43N34n61O35
3081B19q9Q5j43J87k78j79L01J4k31k27M88m23m18J391k59r22K12k21j72M02N74
3102C11r7m33J88k7R22q01j24n6J18j93M06k51O08k98L10j187L87J63K01p8k63
3123a94n8j25J08R12m97q02J228n07p8O28m68j0o33l84Q80k67P1j90O33l63m7
3144a63O7N70j25J1l86M51q6m24K87r7l45K40k14K58j54Q84o91P2K35n33j6Q8
3166g1R9m0M22o10J49J20r7n2K09k36J64l7r3R1J61j47j12K06J71j60N5r3j46
3189d7j03N5L72j00k78J33N4j10J19o7m4J3q4J90l1k1m90N67oj38nqJ62K19k77
3214G5q6K6k48K33K92l83m1K0j8N4l9n6N3N8K79q3k13Q7j04P5m8J39j30K06m1
$$ y = [783, 323, -430, 261, -253, -95, -27, 36, 240, 209, 484, -869, 197, -514, -22, 532, -29, 54, -389, 145, -416, 219, 130, 215, 72, 259, -19, -198, 103, 117, -114, -341, 147, -276, -694, 697, 438, -484, -272, -493, -665, -263, 311, 214, -219, -31, -58, 864, 63, -61, -117, 1, -192, 214, -37, 571, 273, 583, -604, -217, -54, 147, 69, -194, -252, -377, -269, 643, 146, -656, 572, 65, -13, 615, 147, 137, -496, -880, 0, -267, -196, -386, 247, -116, -163, -96, 474, 349, 360, -26, 425, 339, -85, 202, 105, -240, 0, -214, 44, -110, 774, 83, 155, 390, -143, -159, -71, 28, -12, 410, -200, -51, 69, -28, -80, 129, -107, 57, 20, -73, 18, 179, 32, -80, 126, 297, 137, 192, 99, -47, -150, -95, 277, 177, -101, 32, 86, -24, 95, 28, -16, -3, -87, 103, 72, 51, -439, 128, 122, -16, -21, -29, 133, 352, 75, -11, 15, -233, 0, 292, -91, -132, -112, -130, -76, -115, -171, -118, -60, 219, 136, -77, 10, -94, -19, -67, 72, -58, 148, 107]
3239A07j36R4M5j51j54K77k53M14l63k2K63jk07M50p58M85M20n22l00Q3K21l41
3261c49L00j58J16%K35K89l03j94J07j8K4k2j07P9k20M16m46qN7M10l27pK32k
3285A04k36K01K9l6j12j62L02m15M33K0K59l60k7l50r0K65O6L43l92l8N69l05
3307F8J4P2k76k89P56j84j63j75J04o46P94J04N7j87k62K66K88l76k17N95p1m10
3329a38J28j27k81O49P31j029n02R09k72kK9M34n96P0l86M21l7K99q44L24N39
3350C19o92M27J38J9k6J59k10j56R2j39m10R02l89N83j23l94n21l7M13k93J83
3371a55J59J44J67j27q6J52l45L20l11J3J83R0r4K36l97o5K70nq6m92J53L54k04
3394a26m3J21J62j91j69n1j40K43K54j26N7J53l34M53l63P0J57K7R4n1l25L66
$$ y = [107, -29, 65, 110, -41, -195, 82, -171, 243, -120, -142, 121, 120, -87, 363, -395, 90, 510, -12, -312, -229, -8, -349, -49, -207, -91, -91, 144, 433, 130, -64, 43, 25, 49, 27, -80, -1, -221, 195, -251, -259, -202, 208, -119, -126, 106, 104, -132, 69, 98, 62, -50, -212, 90, -325, 108, 128, 387, 27, 0, -350, -440, -175, -109, 234, -158, -196, 373, 68, 82, 154, -122, -411, 345, 161, -2, -177, -73, -719, 75, 179, 236, 49, -213, 53, 341, -35, -252, 343, 272, -138, -10, -137, -418, 231, 962, -67, -569, 340, 68, 66, 95, 529, -67, 3, -383, 38, 1, 300, -544, -220, 319, -373, 54, 192, 211, 185, 344, 134, -22, 70, -69, -479, 423, 34, 617, 494, 100, -421, -458, -45, -338, -155, 4, 148, 315, 188, 102, 254, -91, 229, -82, -69, 114, 204, 110, 346, -51, -116, 154, 149, 63, -429, -276, 78, -126, -169, -48, 114, -77, -246, -297, -437, -194, 60, -66, -9, 144, -190, 263, -100, -30, 127, 154, 248, 197, -128, 238]
3416B38n11q9k2O35L37j234N59L69k00j21k34r6K44O8k71L43n69O95n9j70L83
3437B95O3k31J80k39j75P5J2J11j43J86l5j34r5K53j05m9J32O9l5k37j6J58j6
3460B4k9j10J16Q2j38l4P0J33q8o6j46J78J46l17R9kJ04r2O9r5J27o8j35M8Q2
3485d2J81k93M3j57Q8M0L8j7L14m25L67K33o86q0L36L13m10M04j94N28p08J65
3507C8k3k44K28J37l53L06l5k14J02J35k35J97l67K52j8O1j65K41j74p8K37k91
3529b63K85j41Q4j28K83n0K24m95L99m11L40K6j27j41K40K41l15K09o74L59o90
3550g45O59N12j92m10N85O10j122N55l48j09k72J3L60o97L1K39M78K24j21r1n51
3571c92K08rJ24l61J55J20l8L26J35l87o5k59J225j012j07K93K83J68n45Q7J6
$$ y = [238, -273, -362, -384, 251, 588, -646, -87, 282, 82, -39, -273, -369, -125, -57, -328, 15, -554, 141, 82, -88, 295, 358, 127, 307, 68, -107, -32, -20, 91, -52, 134, 99, -35, -130, 123, 18, -31, 101, 170, 135, -102, -118, 40, 24, -5, -115, 1, 83, -55, -89, -19, 114, 26, -40, -186, -8, 138, -179, -80, -82, 22, -70, -1, -96, 31, -37, -172, -124, -42, 139, -154, -111, -268, -180, -140, -102, -119, 195, -230, 137, 370, -316, -396, -60, 253, -157, 247, 53, 581, -127, 38, 15, -229, -1, 136, -217, 89, 54, -160, -58, 77, -158, 39, -328, -76, -94, -33, -198, 43, -131, -209, 28, -263, 22, -119, -35, -163, 120, 70, 294, -201, 198, -213, 127, 153, 26, -115, 125, 366, 51, 260, -414, -55, -745, -86, 426, 234, -176, 409, 1019, -103, 452, 104, -5, -277, -264, 96, -601, -570, -331, 147, 371, 250, 159, -392, -184, -193, -69, -430, -275, -155, -193, 133, 268, -119, -184, -443, 782, -230, -337, -44, 239, 407, -138, -51, -35]
3592c5L61n56M3J20N20p77N60j35K34k98n46J68L28l01Q31o10N4j33N72o22nJ60
3614f7m77M94l92Q37m57K7M45m10L85k83j7k93M04k08j77N33l28K41l75K82n73
3635d09L73L5j1k0Q0q5J65n82P47l33m29P15l80J21O87j56k57l27l39J72q8j03
3657d24N03k7pN19o89N22l01k28O3n7N96m73j79M11m58K38NJ44j08J21o1R9j86
3680B3q8K73j95o0M3r1j78K89K32l45K81j12R0l13pJ37ON2n8R7J81l61pJ64k7
3705B6J3jNO8n3M0j04j31K31j92J7J21k9j02L2J19n7j28L33k53k5J21o7RJ04n6
3731D1p4JPO2o1Q1J05k62J5J51j78J87p2J75k60J97K4o6j76k0J63m3J14p8k8r7
3757i2J59p4JJ11L5j48j12J88j17L1l4J78j69R2q4M0j5n0n1o5J96J35j63K20l53
$$ y = [-35, 326, -230, -187, -67, 453, -324, 236, 101, 335, 37, -509, -341, -13, -314, 517, -93, -39, -172, 400, -222, -227, -67, -544, -50, -442, 395, -62, -35, 410, 0, 385, 102, 85, -208, 196, -12, -189, 344, 16, 257, -118, 164, -409, -36, -1, -12, -32, 48, -37, 128, -454, 293, -40, -469, 246, -134, -13, 674, 518, 261, -66, -405, -233, -321, -424, 79, 52, 45, 564, -125, 397, 96, -132, -69, -126, 470, -3, -182, 229, -229, 9, 14, 158, 50, 171, 110, 209, 23, -65, 208, 13, -47, -4, -95, -273, 16, 248, -97, 184, 72, 162, -151, -158, -21, -15, 37, -21, 76, 257, -104, -111, 53, 26, 39, 38, 43, 111, 58, 98, -6, -137, 94, -98, -81, 40, 11, -91, -59, 60, 3, -125, 208, -45, -70, 51, -16, -7, 97, 41, -33, -32, -25, 37, -24, 57, 162, -100, -85, 66, -112, 75, 3, 178, -82, 115, 139, 73, -103, -123, 40, -3, 111, 33, 5, -92, 67, -7, -6, 105, 140, -8, -120, 68, -49, -18, -52, 126, -43, 49, -35, 5, -10, -60, -111, -176, 20, 155, -8, 212, -141]
3782a41k0N8L3K35k48Q9J39l7o9m4j51K23j75N8j8L95j19p6j46J05j10J69l02
3805a52J57J25k89K01q4j8J19L9P6k13j75K53jj7k23K10J62jK8j37j68K9j89J32
3829a36K51l5L6r8j29J04M38p57M68j94n9K56J53l77j80N67k15k41O45o68L63
3850A92m24N5k10N32K04r59Q96k83K18j95l25J076j318N29k92M39l18M5j44J67
3870a15m0P09p05L99l1k41M37r64J308j31J2p19P13o27RJ00K45l43P8m90L51K34
3892A89k30j99Q1M52m84Q3q5j9K45K39j91k03l61N62l91K23j00R9L2j34J80r5
3914a07l3j37K50P1K51j60p4J9Q3M82n68l80LK73m54J81M79k23K63J32n00k20
3936c69m43O21j2J24k27J41M53o49L08Mq6L65l92l35J67L24pP1N1j51O9j18K50
$$ y = [-141, -161, -103, -70, 165, -83, 6, 145, 108, 39, -5, -156, 67, -108, -50, -68, 327, 208, 132, -14, 91, -19, 150, -152, 5, 130, -159, 42, -42, -60, 59, 98, 174, -39, -214, 39, 38, 21, -202, 8, 170, 169, 197, 60, -108, -79, -268, -136, 115, 80, 116, 18, -111, -7, 431, -326, 142, -52, -111, 145, 298, -79, -259, 308, 93, -148, 497, -171, 192, -232, -177, -387, 145, 349, -610, 286, 3, 221, 26, -299, 777, -541, -12, -304, 135, -183, -138, -282, -115, -155, 554, -151, 248, 217, -24, 413, -551, 757, 626, 638, -81, 632, 5, 14, 114, 359, 16, 94, -396, -45, 189, -41, -240, -159, 293, -191, -108, -193, -212, 33, 272, 81, -122, -483, 79, -312, -89, -189, -90, -58, -192, -12, -107, -140, -277, -27, 44, 295, 135, 61, 80, 163, 645, 77, -303, -300, -27, -481, -300, 179, -44, 219, 351, -149, -369, -812, -191, -203, -79, -306, -165, 288, -361, -53, -49, -135, 230, -162, -497, -330, -6, -13, 58, 109, -42, 27, -91, 159]
3959A59l48K08n9L7q7J9J36n8L5k50J98J51q9J24j62o5M5k0J92j92n8n4J26J25
3983A13k54P1J06J9M8jk49K5J22J49j33k9K9p2J35q6K7j50J60P0N2k67l6J32J77
4008A58j18j84K44Lo3k7m4Q7j03N5R8J27k14o5o7K49q4J3j86r8K15O6J9m6O1l6
4034F0k4j6L9O7q6n1r1J0J05M9j9k08K27L33jm61j47N14n31q7K89q31R55Q6k86
4059a05J22ol7Q7p2K0k0M8l1o1R0ooO0o9k15L61k54J71Np2k5J42k1k9l1L6ol6
4088D0NJ18m0j59J41j54O2q9L1N2l7J35k7o0j41J32M2j67L2J0J49K1k42J24%k5
4114d7J03J8j26j9J4J35K7j46r5L4K20q7O1j85J49p5k5J56Lk2Mj51L1r2k9J53
4140Io8K4O3j13K06p2M5j41Lr3LJ70p3p3K6K2n6K66k89J3J41N3Lj27R4Pj30Q0
$$ y = [159, -189, 19, -40, -3, -90, -71, 65, 7, 42, -208, -10, 141, 52, 176, 14, -51, -6, -26, 166, -26, -84, -138, -12, 113, -141, -70, 36, 55, 103, 102, -147, -122, 0, 149, 16, -13, 16, -56, 79, -7, 20, -130, 30, 100, 152, -115, -151, -19, 158, 40, -144, 100, 103, 40, 13, -31, 56, -47, 8, 106, 233, 19, -46, -113, 136, 52, 65, -121, -219, -4, 62, 81, 35, 96, 60, 36, 20, 59, 126, 40, -11, -102, -92, 13, 62, 43, -165, 62, 395, 394, -67, -214, 300, -231, -318, -29, -860, 95, 181, -105, 17, 11, -26, 61, -11, 9, -11, 37, 6, -55, 35, 29, 23, 83, 14, -201, 160, -94, 77, 82, 10, -15, 127, 106, 77, 46, 82, 76, 40, 45, 163, 123, -36, 105, -49, 13, -76, -45, 7, -30, 105, 78, 18, -123, 9, 51, -116, -84, -74, 75, 96, -146, -22, -22, -47, 56, 74, -52, -71, -57, 78, 105, -41, -136, -102, 118, 31, 92, -93, 56, -19, -44, 112, 115, 93, 97, -54, -23, -115, -144, 9, -59, -35, 28, -85, 121, 49, 94, -47, -44, -137, -134, 36, -37, -110, -84, -62, -118, 148, -141, -128, 13, 66, 69, -58, 36, 43, -87, -7]
4168gl7J61q4M4l3K0j21K06l38N29k71q7n1j24J47p7r9Q6J22j26K71Lk04J21r3
4193d2l4K1l6K8k8J24o7R1k16q3K35K1K2N4L8j24J25J70j87k25j2Q1J04J89m04
4218a55J0L06j86p7J79o9m3j61J73r9N8k34K09l9K10k19j87O0K17J06k1j40N50
4241D48j81k50q9j02j06R8L90m20k94M61k77J66J63n5m12P41m38L61l00r4J23
4262f7nL1J88o7L29n84M25N16r83l8PN03o03K17J73j55K44k75J98j33l75K82M8
4285a24M69n1l90J5J48J1P6m19L18J34J0O2r8l39J10L75l07k12o9J9N30k49J97
4308B16k08k52L34j99R1j88J46j53K41K1J69k60l3J72O6j01k4Q1Ok52J78J64m53
4331b38M08m1j02j2j88K42K9N0k55J46o2O1J06N1k94L1KJ24p9J35k36J96j14J09
$$ y = [-7, -44, 117, 33, 77, 44, 64, -57, 149, -189, 340, 69, -18, -69, -193, -46, -123, -222, -136, -14, -140, 131, 134, -70, 51, -42, -76, -55, -91, -63, -91, 33, -34, 57, -159, -242, -7, 14, 36, 90, 128, 4, 129, 299, 112, -113, -125, -44, 60, 249, -155, -145, 161, -25, -102, 77, 8, -35, -196, -23, -122, -64, -298, -89, -128, 82, -137, -324, -264, -47, 59, 38, -102, 448, 267, 17, -72, -174, -280, -182, 208, -212, -506, -45, -322, -156, 7, -48, -460, 281, -157, 204, -96, -190, -67, -72, -41, 147, 80, 409, -175, 250, 766, -217, -255, -248, 255, -348, -131, 42, -113, 131, -144, 54, -79, -454, -172, -124, 345, 294, -96, -81, 67, 78, 154, -265, 53, 187, 197, 259, 161, -178, -68, 307, 0, -212, -281, -262, 268, 19, 216, 8, -244, 90, -109, -18, -206, -60, -213, 28, 49, 218, -42, -75, 97, 163, 62, 38, 119, 125, -127, 51, 215, -238, 170, 129, 27, 15, -173, 69, 98, 148, -107, 39, -23, 38, 144, 195, -99, -68, -66, 58, -21, 114, -122, 74, -40, 69]
4355F9k73K12p2j30M80m43j94r2M91j34P03k57j01J66j84n14L41k90l85Q83k68
4376Hj07N0L71j87M18o50j68J03j19J46%J45j41R6K42j82K46j25r2N68Jo77M50
4399C96O6p42N90l35k61l68M54J97M75k8p68K65J65M19K3o48m27J037r85j06P62
4420A81j41N48Q6n68l58P15m02k36J34K80m71K15L17j273J634k15l36k73P9L74
4440B90j025L33K61J78q78Q84J78p3r68R41O44n56OK58l80j98N33p64J91l01P95
4461C49m0k24j17n4k01L0L34l46J95R9J65r9K8j64j92N41N04r93O72o00N26j81
4483B32p37J59K91k44L21k55N80q84J63O09R9r57J165q19K91K85l61J89J09O93
4503I29o26j44r6m5j%m55Q78j90m60K23J45q69O60j71j70K58k71M21o8L20m06
$$ y = [69, -204, 8, -64, -194, 286, -157, -351, -443, 48, -86, 617, 360, 259, 425, 241, -273, 68, -222, -607, 276, 8, -99, -49, 322, 135, 553, -97, -265, -162, -281, -135, -135, 10, -131, -35, 207, 25, 271, 146, 54, 622, 623, -54, 396, 462, -280, 310, -25, -286, -654, -200, -3, 472, 444, -324, -59, 106, 525, 548, -100, -527, 510, -475, -581, 181, 40, 588, 674, 106, -252, 463, 61, -175, -41, 239, -232, -17, 300, -973, 661, 446, 110, -163, -84, 290, -735, -402, -141, 37, -841, 43, 221, 148, -820, 121, 765, 209, 215, 473, 93, -105, 428, -336, -145, -446, 349, 309, 85, -32, -86, -287, -257, 77, -269, -74, 25, 190, 91, 119, -45, -237, 304, 808, -185, 487, -113, 413, 232, -505, -346, -55, -299, 22, -233, 347, -537, -374, 235, 334, -623, 542, -277, 14, 299, -62, 127, 236, 929, 303, 159, 63, 18, 17, 17, -438, 440, 250, -210, 13, 158, -711, -51, -222, -392, -134, -405, 16, -52, 268, -138]
4525a38Q82n26p04M03j52O45m65n4K05M57q18J95j3J38j78Q0K14J36m35N44N3
4546D69q03Q2O11k82j89RL97p06j5M35Q5r7J43O8O4j15k61J27o4n9K78J43n94
4569b74L68k82j23N51m11J7L60j27q7M06j88n73L19M06q2q02M34M65k75L50k60
4590A92j0k65o46R52kK32o86M22k69Q2J93q46O65j76K77k49M29l83K07l68J00
4611a49j88j36J97R5K41j76j54J9O5q8J41J85k40N51p5k03p1j73L57j02k44k4
4633a72K08j55J27l8K6j68K22j67K37J23O0k3n02J06M2j92Q2l6N4M49k36QJ10
4656A65j59R2m14L60m36O09m99k9O14n75M1k52Q37n03J93L2m82M80l14K52j6l65
4678c69Q02o88l3J35K95n54M52O5l36L29m03%O16k07j83K8L52k93L9L2k55P7J96
$$ y = [-138, 744, 218, -486, -83, -235, 410, -55, -109, 96, 553, -265, -70, -83, 55, -123, -43, 171, 307, -128, 416, 469, -334, -252, 359, 77, -112, -103, 294, -412, -427, 8, 93, -4, 139, 207, 271, 156, -105, 22, -42, -101, 177, 320, -274, 94, -188, -311, 240, -171, -154, 206, 79, -8, 398, 210, -363, -44, 362, 280, -522, -88, 377, 102, 452, 192, 182, -83, -729, 223, 221, 453, -233, 189, -80, 2, 195, -651, 14, -162, 115, -134, 295, -88, 119, -249, -149, -337, -473, -276, -181, 60, -116, -270, -251, -186, -274, -133, 52, -188, 363, 288, 85, 14, -159, 198, 96, -148, -172, 36, -119, 8, -30, -4, -172, 50, -117, 120, 243, 303, 280, -222, -116, -74, -266, -184, -220, -166, 283, 47, 55, 165, 6, 98, -316, 44, -392, 217, -282, -311, 303, -272, -231, -483, 354, -149, 44, 76, -406, 74, -240, 12, -4, -369, 433, -255, -288, -153, 142, -412, 40, 105, -231, 98, -305, -305, 311, 104, -79, -51, 301, 8, 47, 79, -176, -99, 97]
4701I7L27m57Q2n51K75L7O40n86O0J56p1l33K26O10k82j36Q0r2j4p00P62n7N2
4724A25j62k41l62P36l74M15L0L51q03M83k39kj33N75K84p68L78O7m7p39M43l36
4746c19Q70j123R52l15q86N57J70P6m15L56m79Q36q9l83L10p38Q50k19o24O27
4766A4j62l77L3L57k18N08k75j13J44M67l80k70J54o6j0J124r10k44N66n21N90
4787D11j43J32o87R5K77j15m32K98L79o51P06q4k55l57O01l40O66m87j58K52K42
4808C50k80m45mO16p0k12J57j41J27J9K2J16k05J30N2l16M49m17r1L38J81l07
4830F9n09M89J07L16m78N5J81j61J57n11k95M96L21l6K2k30rn9J92J42l04J90
4852A45k90j23P21p92K83m3R3j20J10N18l73o4P6J6n29R8K98K12j50L53m64l84
$$ y = [97, 424, -33, 49, -502, -227, -190, 450, -136, -76, 80, 9, -324, -98, 512, 230, 94, 174, 82, 68, -632, 130, 73, 125, -37, -278, -640, 96, -278, 137, 167, 518, -285, 198, -41, -43, -176, 399, 683, -85, 293, 360, 313, -426, 17, -319, 551, -572, 380, 65, -821, -264, -94, -18, -433, -77, -556, 280, 191, -192, 118, -620, 230, 11, -613, 14, -148, -525, -492, -135, -353, 155, -120, -233, -89, 378, -2, -272, -118, -184, -194, 930, 20, -224, 342, -179, 411, 268, 400, -287, -192, 85, -30, -462, -164, 215, -436, 270, 186, -69, -426, 175, -165, 501, 14, -144, 108, 350, 70, -375, -379, 237, 167, -45, 112, -29, 98, 117, 139, 255, 50, 180, 232, -84, 365, -52, -143, 195, 376, 69, -440, 49, 156, 472, -6, 49, 230, 69, 226, -285, -580, -84, 237, 201, 223, -7, -16, -75, 117, 259, -45, 145, -145, -268, 453, -339, -56, -99, -6, -126, -16, 502, 129, 65, 141, 157, -372, -274, 24, 236, 86, 439, -25, -409]
4874d09M46k3N20p67L37m81Q38m78M64n27j47K18Q71j444K44M37l24M11J72m97
4894a39L73j14j63M2k3J97J50j50l49K53N0k46K50p38N50j77k74R08o36J66k28
4915b98P66m50n93Q24l00m38J011l33p56O06J30r38O66J10n10K02M78m87r0P02
4935C02p41j84N01l62nN26k13O49j55J76n05k28J66j12K67L56j29K8j4J39p33
4956b71N42m18M95l15N50m97p59J023k32l68Q2O71j99q91N64p5J00J77M3k58O1
4977B5l7m50O6N62j7j3k00o8M3p6l4K95ko0m0Q3J15l73M54n0k94J74K97j74m53
5002b27L05j07J92J9j27o9K17k81n0O4j7L97k46J12m68P63p23j77P93m33M81m72
5024e4j49K79n18O62l16J69K93l56k18M89L1l80m98Q19Q39j764J159p73K79L66
$$ y = [-409, 37, 14, 534, -233, 104, -377, 461, -17, 447, -80, -227, -9, 862, -582, -338, 99, -225, 186, 358, -139, 234, 120, -43, -1, -24, 173, 323, 173, -176, 77, 127, -119, 131, -607, -57, -234, -508, 400, -236, -70, -298, 468, 18, -575, 249, -51, -489, 522, 189, -567, 39, 169, -769, -103, 7, -503, -301, 177, -310, -400, 302, -439, -623, -122, -484, -489, 37, -176, 473, 318, 494, -11, -239, -73, -185, 82, 438, 309, 337, 323, 462, -271, 271, -147, 348, 33, 583, 86, -673, 350, 118, -250, -168, 503, 304, -587, -23, -98, 2, 179, 222, -36, 25, -12, -462, -396, 166, 149, 136, -64, -132, -89, -165, -199, 96, 94, 34, -6, 77, 192, -181, 273, 223, -71, 103, 400, 226, -227, 78, -29, 163, 182, 55, -14, 203, -78, -128, -64, -81, 316, 70, 182, -286, 477, -246, -423, 370, -63, 418, -54, -203, 76, -442, 220, -96, 73, 366, 10, -208, 281, 312, -68, -566, 253, 1092, -672, 487, -286, -7, 359]
5044C59Q6l22M76m19q9m31K99j78k80Q66p1l48j3o91Q03K7K1j00J57k88r6Q0L24
5067A72k67j87M07nkj96K82k19j61R3J17l5m1M55k46l04J70j35Q8L27m71J92o1
5090b7K4l3M27n63o7K05N1R7k65j00M37p70O17K0L08q17K61J68k11M62n92N58
5112A90R1j40K49k50k39K19L09n46K36n77P16q10Q52m71J48P9l94Q51n23J485
5132A475j648M66o1k43N1M42l08n36L87N81j77n74j75K41l12J004j002O2L29N51
5152E53n9q80Q84o65R84j452P58j69J88n26N45m51N76k98lM8K58l54MK56qj144
5174i55O27L82Q68q63K82j42l90P39L4p57j72j00J59k2M5N97J4o90J82KK64J5
5196A19l18K90J44L35p4l44P1J54m49N3o7k5N4M60r5j89l23K43J12K93m30j82
$$ y = [359, 445, 123, 599, 180, 91, -340, -41, -219, -499, 367, 296, -52, -65, -756, 47, 74, 95, -5, 152, -136, -232, -152, 172, -95, -282, 125, 120, 118, -78, 204, -15, -176, -83, 34, -1, -42, 413, 167, -137, 33, -102, -14, 313, -158, 34, -27, -3, -36, 391, -172, -239, -34, 17, 114, -151, -251, 186, -584, 33, 53, 361, -456, -195, -27, -238, 224, -368, 190, 281, 141, 390, 140, -99, 120, 429, -117, 119, -458, 258, -552, 300, -171, -23, 56, -338, 513, -10, 1475, -173, 293, 232, -11, 40, 482, 174, -362, 25, 606, 429, -145, -320, -79, -391, 613, -389, -327, 2, 553, 494, -386, 498, -167, 817, -635, 123, -46, 142, -384, 161, -290, 286, -12, -15, 33, 291, -63, -59, 197, 189, -955, -328, 54, 922, 59, 341, 199, -191, 548, 582, -175, -347, -447, -288, -310, -265, 332, 346, -344, -162, -160, 104, 119, -199, 91, 235, 570, 496, 152, 223, 377, -72, -19, -86, -111, -57, 403, 308, 119, -204, 39, 151, 444, 14, -168]
5218a68J41k10KJ51m87R93k58L4o7J61k51N6k31n4J99r2J2l3L49k16L48q48O18
5241A49k8l46K68n5kL05m91L42m47L75k9lk33K50P6k94L18n32J52J62K86k96k9
5264a02J28k33p4Q20l01o07N36k19m0l12J85N61k89L12k99O0m9j51m26O95O3m16
5286a58K00n23O84L2o4p9K26j94j36j22K91l86R02p74K99m06n8j20R33o14l19
5307c86J29j29j8O64k22n12O27n32j23R69l79L67k61L0m22N67m23P37q37L81n75
5328c48N7M81j42J00l79J60J37l82N3J57k40N79o24L8P3J88k25M74n28M13J9l0
5350C1o4R6o0K99j06q20N22K35J38J64o46K46J99o15J11j5L21P9jJ09n41J52q8
5373b54O48j214O36o20P24R7N6k48L02L70k32n91J26L9l92P88m99k51r1P40l96
$$ y = [-168, -27, -237, -235, -84, -571, 422, 164, 198, 131, 292, 41, 97, -134, -188, 11, -81, -69, -102, 247, 31, 379, -469, 149, 121, -225, 43, -12, -14, 291, -200, 142, -305, 70, 41, 38, -195, 55, 131, -163, 155, -377, -225, -63, 223, -73, -102, 26, -207, -281, 539, 238, -369, 167, -52, -92, -404, -219, 342, 53, 365, 66, 126, 77, -74, -500, 195, 258, -158, 42, -481, 203, 235, 171, 92, 318, 124, -12, -134, 157, -229, 673, -101, 198, -208, -266, -386, 547, -67, -386, -257, -386, -404, 260, 38, -474, 153, -379, -502, 467, 88, 455, 194, 224, -198, 369, -54, 683, -154, 227, -348, -291, 190, 48, 148, -231, -71, 66, -316, -263, -106, -346, 233, -391, -353, -280, -92, -317, 157, -371, 42, 61, 31, -33, 63, 3, 302, 196, -624, -102, 133, 271, 435, -211, 35, 234, -381, -270, -285, 36, 115, 114, 223, -318, -166, -254, 394, -820, -184, -804, -80, 17, 73, -175, 127, 497, 265, -326, -200, -161, -553, 235, -264, -515, -606, 134, -262]
5394b62Q12k91K09k81K56o13r6O07o44n05R19o84M78m6k87J117k23p16K23M60
5414D33o57J58K74q56O21L63j16R5m47O1M07Kq30R05J83j202N35K59j0J26l80
5435g6R4j38M74r57J72N53k00M96J13o31n9J65J44n32M25J95j64k7L97n75L4M1
5457e6O8j12L53l82l76N47n78L85J23j70R07r67l4K28n41M11K91o0K32K62m63
5478F8L09j96j82J89J96o34J06l76L84L40k95J67J28M9o70k83j80Q47j53p7L90
5499A27p84P87m52J18J306n32j020K76J09j03P23o22J3J65j81L38N23j225J88
5518b46K90P4n21J99K12m44M57K22J97m93K22n55L34m1k00l26Q30m76M88p81M15
5539a43k96J86K2m86M08L40k62j1N22p22K09O36n19j50Q0l44M18J74o07J035o83
$$ y = [-262, 550, 259, 468, 187, 443, -170, -266, 341, -303, -808, 111, -573, -95, -141, -428, 689, 466, -250, -27, 433, -224, -66, 208, -648, -27, 336, 220, 315, -132, -71, 336, 338, -492, 413, 596, -606, -71, 188, 178, 304, -76, 18, -120, 354, -603, -431, 122, -78, 418, 531, -100, -159, 6, 150, -382, 43, 238, 74, 47, 444, -131, -97, -56, 12, -100, 253, -129, -505, 42, -536, -151, -28, -198, 709, -258, -292, -64, -605, -194, 97, 37, 269, 531, 68, 377, 181, -1, 188, 384, -250, -144, -520, -136, 204, -91, 76, 204, 253, -417, -700, -880, -33, -186, -263, 127, -657, 130, -322, -204, 1102, 570, -450, -174, -65, -168, 555, -67, -54, 111, -70, 268, 791, -434, -246, 44, 118, -403, -204, 8, -436, 21, 243, 440, -53, 169, -386, -52, -93, -293, -619, 211, -265, 223, -558, -143, -439, -253, -231, -717, -309, 31, -231, -242, 280, -442, -233, 403, -116, -266, -186, -530, -112, 62, -545, 490, -193]
5560a93o98M79L00K62l9j84n61N44L35l05K20P4k69lj05L96j14m79P67K23m16
5581B34M60p33M36l95o6L44L67j51p34l2n6J25L78m15r0K13j01L30N1J23P8J72
5603E38k26j172L46Q82N7J95j155R40O3p73J70O12j026N88P23n56k91O38j069
5622e16O66m05L74L07N9J39j406N21o50J807o74j82o11K95M98j80J94o12Q61m12
5642G3n19j78J123l42K82m10n87O70J2k90M75j202J189n9p43N43K32k73n24J41
5662c87q8N9j56R31m43L76q08L84O88o07p3j00j97P18k92k13K68k95L42m34M79
5683A52r1j49M95l97M26l64K48k97O82q02j10J04k74O01m46O8N47J3j284P22n4
5704b10P07q72mM87R8k13M68l55p7N2j69M19n41M15k50j77M67p3K41q31N93k70
$$ y = [-193, -891, -412, -112, 150, 111, -73, -634, -90, 245, -60, 160, 234, -35, -38, -143, 253, 139, -340, 427, 650, 234, 694, -39, 397, 2, -64, 280, 647, 496, -238, -270, -326, -201, 177, -238, -328, -115, -216, 114, 165, 288, 366, 538, 312, -860, -514, 368, 425, 620, -535, 405, 468, -305, -135, 477, -549, 39, 762, 206, -85, 553, -516, 150, -255, 119, 426, 485, 624, -782, -261, -911, 896, 222, 40, -571, -276, 222, 42, 236, -376, 485, 73, -446, -624, 499, 157, 439, 29, -558, 112, 124, -166, 309, -893, 296, 237, -506, 37, 269, -4, -528, -387, -475, -416, -572, 359, -84, 292, -516, -132, 556, -51, -124, -224, -421, 297, 5, -208, 60, -235, 107, -327, 152, 61, -88, 407, 10, 436, 72, 320, 23, 705, -97, -207, -103, -377, 224, -222, -154, 393, 406, -878, -156, -210, 497, -375, -379, 108, 206, -7, 461, 106, 29, 81, -88, 331, -210, 205, -45, -222, 245, 172, 413, -418, 175, -95]
5726i5l8j70L47l24O1M39o19l45O66m01M24j10k88P38m17n70K81P37p48k65j45
5747h42P71k99L95O69l36q37N62R5p69Q88J07m40p70R30m11k57o83J498p86Q12
5767B97l41p3M36m71k66K58O81m97Q02n05m53J38n37M72N31j99k19Kj53N1n32
5788e78J186j390J037K1q22M42j57L12p0J70l37Q37r49J131j80r24N99l16J15
5807A27m50L51P4j74K67J9j38k60M6J76J6N24n98P4j22j41L75l72K90j27J79K98
5829D34l48J20l64N84l69j35K5K7l41k8rL69j90K62k53N37p03M00l66N19j38m28
5851c95M65M23l21k33J6Jj92N93j52m36K61m3j59J30L65j026P21K27j334J332
5871B43k63J94Np02N57K38N33j100N60j215N56N17KP18m26j203J174r0l44N01
$$ y = [-95, -133, -303, 44, -280, -219, 220, -399, -744, -78, -479, -55, -165, -453, 285, -132, -702, -421, 316, -432, -697, -842, -71, -370, 25, 694, 358, -479, 83, 178, -591, 297, 404, -36, -806, 124, -287, -544, -1227, 271, -515, 297, -44, -117, 319, -152, -418, -160, 521, 24, 826, 321, -132, 6, -531, -59, 472, 273, 54, 56, -97, -46, -578, 608, -782, 255, 276, -546, -104, -261, 51, -19, 151, -186, 651, -298, 833, 653, -271, 328, 12, 127, -323, 28, 102, -72, 195, 214, 76, -184, -138, 38, 54, 578, -20, 54, -68, -209, 166, -206, 84, -43, 136, 434, 86, 206, -158, 426, 57, -78, -53, -26, -367, -395, -404, -35, -225, 37, -216, 321, -382, 18, -348, 171, 33, -395, 70, 493, 172, -61, -45, -44, -236, 357, 205, -231, 30, -13, -172, -42, 323, -703, 18, 245, -1089, 243, -20, 174, 179, -523, 34, 272, 805, -295, 265, -950, -394, 123, 125, 843, 417, -786, 388, 298, -46, 455]
5891D55J18n59m68Q62q41j65N36N29m33N46r20O92o57k76P48j50M28o51O12k03
5911B03o23Q62p15O14M3m69r56Q74M76m12Q52p32n48J18P75q18J229n87L09n58
5931f3p5L37l53K5j50k1R57j401M64R61l40k99k48L19P3n95J42M55Rk00k15P09
5953D91L4n91l4k50K64j4r61J475P6r83J08M77L40j28o07m28M58P91P62j389p7
5974a86J052j465O35o23J317q89P33j630J579m80J13L06P7l06r07P63L52j78q12
5993e49j73J121M08j561J48J49P14l69J33K35M17j318N98j99N90o39P08o84l69
6012f40Q52M7o9l06L22J61o92j41R29l83o94R51k25l3J81o00R07k95k72M57o10
6033a53J82J73Q5K6k85K46j45q3o6o11J008o7r42M63P5j92L79l58R7J63m30M68
$$ y = [455, 573, 14, -454, 408, -433, -598, -62, 467, 34, 580, -340, 352, -305, -581, 167, 17, 445, -206, 406, 203, -420, 442, -273, 341, 384, -85, -1041, -167, 309, -103, 749, 17, -531, -413, 362, -456, 773, 186, 495, -63, -138, 199, -154, -129, -279, -300, 657, -744, -280, 681, 341, 42, -206, 113, 186, -409, -267, 188, 197, -3, -218, 491, 525, -66, -100, -350, -86, -100, -1061, 414, 490, -493, -385, 92, 432, 304, -303, -731, -273, 518, 1280, -109, -186, 866, -599, 36, -587, 730, -159, 574, -1056, 523, 43, 156, 462, 539, 233, -674, 89, 441, 263, -549, -722, 399, 807, -754, -606, -457, 257, -112, 21, 256, 673, -645, -47, -246, 344, -295, 413, -271, -640, 212, 259, 190, -116, 206, 367, -325, -466, 463, 80, -614, 337, 112, 79, 260, -340, 567, 272, 0, 457, -153, 29, 202, 287, 313, 28, 274, 129, 46, -20, -631, 377, 310, -632, -169, -94, -286, 93, -265, -168, -5, -435, 33]
6055C3l78M65k15m88J97P69n07J35o4J8J51l68JN27j67k11n01N69%l35L65K6j14
6078i2P82p24M5J12o94Q24k46L90j156J086r44J087l41m03N55k54J10J60P6p14
6098c41J21K02l31j06M35j066P11Q32p37j23K08K33j97k74J169r88J55j4M9Qj19
6119a73M09m5l88N52m14j12J66j39J36K03L02p36j04L44Q9l39Q1m84J62M35J83
6140A28l62k11K62K55J62l08K33p19N60M6J31m2J85p8j85m03L95J26m52K95j29
6161a11L1K02j86m15M42M31o39P5J81J29L84m57m06N50j52j74k58M43L5J69K26
6182E00m81J14n1J88j03n15J84P7L55l96m3j17K78n4L25o01M30m3l38M59j97J32
6204A03J39j73m30K38m7O8J31p42M52M87o53M51j82N02o94K56q02P42m77N25l94
$$ y = [33, -345, 120, -95, -583, -386, 383, -124, 11, -53, -35, 116, -252, -251, 276, 109, -102, -603, -34, -34, -369, -4, 22, -92, 690, -34, 11, 123, -571, 253, 7, 397, -759, 327, -617, 470, 129, -274, 281, 27, 137, 297, 373, -341, -220, -18, -349, -455, -20, -1086, -375, 457, -280, -403, -195, 38, -159, -433, 736, -252, -97, -111, -62, -54, -173, 236, 191, -197, 355, -59, -171, -5, -144, -8, 195, 497, -239, -343, 1, 90, -249, -168, -652, -490, -55, 128, -234, -445, -183, 72, 234, -74, 159, -560, 0, 46, 177, 135, 320, 242, 57, -346, 49, 175, -277, 18, -111, -80, 122, -64, -479, -37, 394, -245, -170, 11, 140, 524, 67, -339, 211, 59, -115, -373, 70, 105, 274, 500, 19, 133, 82, 270, 167, -348, -164, -87, 268, -128, -171, -288, -10, -64, 261, -340, 90, 47, -291, 168, -29, 103, 242, 69, -361, -123, -170, -102, 29, -713, -261, 226, -427, 24, -158, 344, -350, -94, -896, -154, -631, -106, -500]
6225e00P48j95k4j50k83P32K8j99l32L96J35n1o03O4L56o33R17m12j07k79O01
6246B09j32k99O62Q1q19j93J06L65Q6J58k10J66j68L49q47L60J40L16K34m56K62
6267C70k03k96J75RM2k52m6L2P1M3K98l79K51j09L53q8j21l84L29n41J14J44j05
6290b93J048r15p4L51p1R6O93r53o04O77M47q37O82J27L2m07n32J3L23R33k57
6311D79l98q97P7Q64l41N37l94J13k21l13M41j48R4l28J04J90N23l27j51m29L48
6332a77j5K66m20o2O11J60j56j63K3k73L09k07M1J7J93j53k69L90k96L08L61j50
6354C38k5n52N9l5J72j98J28O19q49P39n24j11N42k97l6r33R56n67N33J005j333
6375c69oM52j25J91m6NO5k03l67R47n43R1k7Kk70M82l56l6k65J35j80N22j36K33
$$ y = [-500, 248, 53, 29, -121, -404, 328, 356, 157, -175, 221, 356, 305, -298, -234, 122, -511, 406, -6, -113, -392, 209, 77, -222, 440, 521, -298, -491, -385, -20, 66, 224, 14, 180, 12, 361, -486, -126, 14, 330, 564, 108, 370, 167, -129, 46, 55, 97, -155, -201, -169, -98, -55, 243, -136, 115, 6, 359, 271, 150, -234, 95, -446, -332, -188, -293, 755, -160, -234, 117, 46, 142, 835, -118, -722, -45, 402, -435, 247, 374, 406, -1, -533, -520, -197, 736, 479, 81, -816, -739, 125, -216, 321, -73, 40, -181, -494, -53, -201, -107, -435, -331, -141, 382, 55, -96, -525, -177, -192, 74, -346, -408, 203, 363, 207, 44, 67, -206, 103, -104, -63, -46, 147, -6, -275, 115, -181, 127, 488, 338, 313, -239, -180, -215, -43, -241, -113, 506, -343, 396, -128, -239, 303, 6, -30, -963, -7, -574, -41, 964, -369, -375, 77, -48, 143, 97, 102, 167, -36, -403, 544, 1, 92, 65, 67, -203, 279, -77, -113, -378, -243, -423, 99, -37, 196]
6399A96K37j131M94K97m39J05N24j21q58Q34j78m20J034q69N54o38M83p67J119
6418D56n68N78m25p0M03l06l47R4k09K92J65L87q90O20L38m19m87LJ37k66P99
6439B85l31M39p37k63R10rm79L56k34K28k01M45k56K45Ml90J45n66R25p84p6K29
6461a15L5l82J94N79k92l72L01m75L26J17K89n12M06r5n7J2Q24o88K76l08k1m34
6483c92K85j73j49L71J7j15Q8j36M88o07k93O08j05J81k03P1l13k88O38j94N32
6504C11j50n33k00R83m99M63l14p74O88j78j35M06K9k40r9O04l94l06M55K40n10
6525a53N93l31o15K04J2L22o2n61R73l32J40o00N50p94R44k20k38o13Q49l84J20
6546a96k43Q8O81k96o5L62l70q3L6K36M14p82J07J91p6o0n69L96Q9L64l27K4j16
$$ y = [196, 433, -698, -204, 93, -346, -241, 283, 162, -696, 138, -40, -460, 574, -295, 259, -379, 104, -663, 456, -112, 466, 41, -29, 374, 68, -279, -185, -394, -102, 63, 450, -440, 180, 518, 99, -388, -385, -248, -514, 285, -46, 393, -344, -607, 303, 294, -185, 171, -63, 165, -36, 409, 153, 398, 402, 12, 157, -409, 516, -268, -344, -115, -80, -462, -268, 311, 19, -353, -52, -527, -201, -84, 205, -307, 99, 4, -53, -41, 783, 95, 371, 63, 42, -392, -107, -280, -429, -58, -41, -156, -68, -204, 284, -323, -616, -8, -113, 68, -135, -64, -377, -665, -27, -221, 311, 161, -372, -572, 411, -88, 375, 61, -713, -25, -203, -338, 68, 97, -143, -242, 362, -32, -338, 117, 357, -153, 440, 109, -506, -302, -290, 32, -30, -591, 382, 50, 190, -410, 140, -654, 290, 70, -168, -781, 68, -316, -196, -439, -351, 330, 34, -31, 331, -39, -122, -86, 150, 564, -218, -111, 80, 4, -56, -625, -229, -140, 224, -103, -79, -195]
6569a95M65o94P39K74q89M04m7k2j80lK2L53m53K10j13J75J23q9j62j94K58q7
6591a05j68m6M10J90m31M67k00jo0Q6J87l63k65L12J97R9m97J72o3K64l60M16
6613B41j75k6R2l31M31l11J22r3P0N0k24K93o4k42K38k09J39L6j40p4L60j21J57
6636B19j62q2r6o6J85j10R7Q4j3l1j30j09K44o6J14r5J01k44K62L9q4J71l5P4
6660B67j48o6j44L29q7j15j09J54K8j32o8Q8k62K93q3O4K7n4o6J29r3L48k33j18
6684e1j01Q0K42N9K43k63n27L39J6J71m67L61k78L3M59n25J35J49j91k01K77l60
6706d00L82N61r52p8N1j31M00%K39J28J06n87L88M2k86Q5l63L53K38l8N6L00l80
6729A14j58j56L05l81L59k09P7N15p03R8l26R62q10o78J237R7o59L75J88k48L8
$$ y = [-195, 270, -424, 315, 589, -300, 104, 57, 35, -145, -148, -126, 227, -226, -16, -129, 46, 169, 80, -82, -276, -18, -105, -273, -319, 91, 281, -150, 317, 117, 116, 56, 142, 329, -34, -299, 13, 210, 309, -188, -16, -79, 185, -175, 241, 66, 40, 132, -199, 232, -79, 43, -50, 20, 70, -154, 139, 75, -167, 71, -138, 1, 37, -103, -177, 183, 62, 219, 57, -25, -121, -187, -2, -112, -15, 69, 56, 25, -105, -214, 30, -36, 78, -17, 84, -160, 102, 141, 57, 228, 193, 267, 119, 53, -91, 238, 151, 36, -73, 81, 109, -23, -91, -3, -265, 28, -55, 9, 36, -18, -84, 45, -48, 300, 67, -51, -152, -72, 170, 229, 472, 209, -318, 21, 37, 208, -259, 102, -176, -143, 316, -209, -74, 75, -116, -317, -40, -400, -18, 543, -409, -487, -436, -567, -167, -167, 72, 200, 306, -281, 107, 149, -137, -52, -415, -62, 176, 138, 194, 494, 114, -44, -200, 105, -276, 83, -126, -49, 466, -237, -139, -465, 497, -313, -991, 246, 343, -316, 59, 247, -1, 37]
6750C7K91j90k48J08l55J109q73R6p42Q23M88l96J65O3m85l99K37j04J85L79j34
6771E5o37L48K86k61j34K84O7k06J44Lj43l70J109q01K31L38k76K18l9k98K38
6792A56L6rk94m37j81P05N09p27O7K02m82O37l26R2m08P49q44K50l08O10m19k4
6814d46N55k92K93k78N70k0m19n2j64j39N1J24L95j13K41j69j91P30o42n48N33
6835A9O3k22J2J17j6j81L16o7o4o5P4R2j63K63l03J62L5pJ9j42O4j35j80L39k
6860B8r6j27P4J68N1k38K98l24J72j21J58J11m87K61l9k32K19l09N15k28K31r7
6882a2n1K42o43k01M99k86R37l08j81k52M3K92J4j79J80Pn58O91rN08q21L36j026
6905g78P11l51J033m92n81L98K9l67L48J22n78O04k53m50Q22p27O82m71J27O60
$$ y = [37, 328, 138, -110, -2, -357, 752, -121, -25, -767, 56, 544, 148, 313, 376, -109, -508, -271, -375, -190, 189, 55, -582, -234, 52, -209, -343, -59, 8, -198, -54, -51, -194, -564, 545, -256, -25, 313, 37, 255, 216, -82, 156, 192, 183, -111, -548, -729, -24, 485, -242, -175, 27, -455, 182, -144, -52, -460, 289, -555, -305, -613, -3, -422, -446, 109, -183, 110, -168, 402, 382, -37, -89, -253, -392, -341, -217, 178, 65, 306, 137, -54, 676, 34, -514, 19, 82, -140, -128, -11, -27, -208, 108, 41, -23, -88, -14, 78, -85, 178, -125, 37, 72, 65, 84, -58, 6, -129, -309, 30, 28, -68, -195, -121, 47, 98, -140, 158, -166, 6, -115, 43, 154, -333, -72, -111, -343, -124, -433, 82, -146, 85, -12, -63, 179, -464, -665, -166, -452, 485, 177, -4, -256, -213, 79, 93, -86, 94, 101, -457, 234, 225, 733, -88, 248, -778, -67, -418, 615, 123, -458, -60, -31, -398, -50, 72, -506, 98, -155, -605, 217, -510, 172, -299, -172, 488]
6925D88o58J65r8L07Q5K09k81J46l12l15N94n62Q37r42K52ON7P32p64K45k62j52
6947b23O39o61K43j27K18n76K99J83K65Q1m66J84J59o51N92n50O2M69j200J274
6967B14l42j25L45j20k34M64K3r7k17K1J10k8k05M18l05Q5K93m67Nm4N18k62l31
6990b81L23J96o24N66l70K13n63R21l50O4K56J27o88N73k25k9m02M65k08Kk00
7011b34J11l44P43m55J08L20Q3m83Q8J67j00M00r01R95o66l7j07K54K87j9p24
7032e14O29J00J60r17O76j97j54r7L16N44o55P43p62N56n12j01L59K23n60n33
7052f96O80K9K44n51M17q72N31L01J11M53j017N58l70j0L2n0N23j62J20k63J52
7073A60l27O52p88M92L6l02M5L06l56N8K31l83l63O76k45M9O8j63K86J20l44l82
$$ y = [488, -170, -5, -103, 204, 289, 498, 217, 363, 51, -264, 330, -232, 605, -337, -85, -79, -22, 710, -54, 191, -71, -223, 416, -245, -2, -129, 89, -487, -188, -5, 260, 341, -125, 59, 218, -433, 159, -391, -329, 140, -1060, 214, -128, -253, 92, -28, -262, 202, 225, 128, -89, -68, 42, 14, -191, 227, -78, 7, 300, -167, -162, -206, 312, 50, -281, 42, 238, -386, 180, -190, 23, -540, 381, 31, 95, 351, 478, -210, 363, 138, 109, -293, 172, -36, -34, -234, -123, -467, 276, -179, -71, 249, 332, -151, -63, 104, 4, 404, -497, 498, -168, -205, -312, -58, 229, 210, -514, 115, 215, 375, -542, 134, -63, -217, -314, 2, 546, -109, 634, -128, 428, -84, -185, 174, 397, -163, -696, -16, 13, 257, -294, 123, -749, -218, 83, 194, 647, -370, 188, -182, -192, -160, -210, 313, 151, 271, 8, 160, -167, 485, -303, 189, 225, -77, -32, 274, -82, -24, 207, -176, -539, 137, -108, -59, 9, -154, 132, 252, -92, -474]
7095d74P63m65K81n38K94O9k0k63M82k35O2l13L35N3L41l20QN37k36l73j08K91
7117A71m76K98l38M51M93r89N27j32K28m03n46J142p57L43K79n75M49m22J87M7
7137b3m38K38K08j17K24m07K04J11R7L77o51J59p05O47Q9k36j93K14M32K27n71
7158a14L50J85p48K67K29Q5n04K51o7j91J31k00N94j95r9k81R37o8o04l18R66
7179F06o70M53q17K73L40l86K4O67n96J61K38n45N02n5m91J56j09M82k63j5q09
7200h54O71N6N82l02q21N96K63K43l62L25j65j83l90j99J84O25n14L16L6q8L39
7221C58l24l25M96j93L76r8j54J35o11K10J20k12o3L17J37j34l63K86K14k56J41
7242E7K11p74L05J78L4K5j21M82M1m43o23O14j32QM1K42J91l17O0r6K40L5l29
$$ y = [-474, 289, -176, 105, -433, -139, -70, -90, -353, 129, -106, -44, -357, -22, 31, 372, 52, 60, 597, 361, -12, -120, 171, -305, -7, -345, 106, 599, -390, 137, 5, 233, -170, -716, 426, -331, 12, 291, -284, 165, -257, -70, -23, -461, -223, -15, -132, 92, -315, -111, 0, 97, 474, -177, -18, -723, -76, 13, -223, -416, -202, 230, 457, -114, 236, 421, -327, -60, 169, 254, -250, 1, -66, -257, -126, -326, 268, 73, -26, -307, 630, 562, -42, -360, 606, -64, 389, -428, -155, 185, -201, -177, 490, -106, 55, 293, -252, 250, 195, -296, -140, -249, 233, -30, -45, -854, -183, -127, 455, 153, -668, -72, 191, 434, 72, 397, 232, 49, -341, -540, -356, 269, -245, 71, 107, 19, 358, 34, -291, 205, 12, 388, 290, 136, 271, -340, -130, -10, -222, -285, 32, 169, 35, -328, -42, 172, -84, 57, 268, -506, -201, -23, 11, 36, -85, 397, 438, -5, -628, -14, -146, -138, -97, 145, 336, 19, 79, -17, 223, 258, -71]
7265g1k92N70n73K51K0J81j79q8J06J6L2m2P9J80j84M9p6J31j08n7J8L3j01J32
7289B7mJ32k08K24r9o7k46J15L9J23J5o9R3j88J12K4j10K08o2o5R0n3r9O8j5L2
7315A7Kr5N6J76k60K36j17q3J77n4j91J97j82L72l07M5J36l21L80q38P29N11n82
7338DP4L01P9k41l26K79k16j2L6J05PL12m61k74P3j6K93K64l12o9L88j49j55L18
7362C02k25M6m13J20J14M14J16o35J24K18M0k07o7j27J36n7j15J96o6J2J15k90
7384b49J68N8Q3j46K55k32k88O58r0k13k76M37m9j13R1j99K36K4l49K99l69Q8
7406a76J77l5J27n07M11o2J16l95P19m26O5R0l91L37k49K4L27ml26n2K17l57J8
7429c52J99j06K34K50J75n36k58M16N80j59o77K64J75j1LJ97n28L67m92K59L22
$$ y = [-71, -363, 207, -366, -115, -95, 86, -93, -181, -75, -59, -27, -69, 10, 190, 6, 55, -21, 110, 2, -55, -37, -4, -105, 27, 23, 155, -53, 171, 72, 5, -241, -126, -87, 36, 51, -18, 75, -113, -1, 23, -87, 121, 59, -6, 84, 31, -68, 0, -15, 17, 19, -76, -20, 156, -104, 132, 15, -68, 109, 55, -136, 61, -121, 251, -56, -11, 125, -196, 184, -654, 75, 586, 4, 78, 379, 458, 217, -109, 170, -46, -58, -22, 83, 90, 402, -59, -333, -260, -276, 17, 281, -31, -100, 288, 139, -16, 302, 77, 123, -290, -170, -56, 358, 474, -161, -37, 181, 221, 14, -53, -180, -44, -101, -216, -20, -86, -74, 41, -249, -81, -23, 60, -86, 169, -63, -351, 307, 217, 4, -272, 165, 116, 3, 94, -105, 131, 155, -194, 105, -264, -176, 1, -34, 93, -414, -3, -65, 51, -344, 375, -51, 14, 104, -287, 50, -199, -175, 152, 148, -178, -230, -13, -370, -352, -153, -259, -25, 225, 400, -136, -394, 22, 602, 443, -234, 30, 205, 194, 197, 394, -134, 233, -259, 0, 322]
7450C22n63k64L12L19L20J02n86N1j34o5K54J00K6o92N80Rn51N62k74Q3N14o02
7472a77K12l47L21k89P8L66L2k10r9O03l49K70n31j38M05m9j62L61o16M75n1K4
7494A29l32J63J12K62l84pj08j27N14J62n94K03J45k06K32j59L80l76K2J42l1
7515A42j7l14P8L18m38J5J66L1q5q2K39M7k11k62O10l16J03J57r3l91O31Pk58
7538G7O3m13K03M96l98l06L63j17m3l50N82l41J90j66m48M70K30l90L17l1k55
7559b67N85l75J26j15O9J19J7m6m79K56L82j8l62Q7N7J85j14m67R1L92K74k99
7581I8n0l18M50j58J68n63L55J43k0l61M0K25m22P20m71j43K56m90M56q8J07K65
7603A99j92P0J02k82m27N81j4k95K42K35p63P69l83O51O3o16p10L43M65K55m9
$$ y = [322, -241, -505, -193, 126, 446, 548, -38, 13, -121, -186, 68, 168, 194, -498, 82, 91, -460, 102, -172, -89, 425, -177, 35, -312, 9, -280, -202, 164, 196, -14, -113, 490, 141, 411, -120, -258, 147, 98, -64, 297, -319, 156, 105, 129, -203, -40, 72, 334, -50, -57, -165, -292, 222, 384, -210, -7, 138, -68, 164, 5, 385, 9, 31, 173, 142, 125, -189, -111, 207, -231, -216, -50, -19, -104, -186, 53, 100, -111, -373, 237, -79, 24, 181, 88, -303, 328, 335, 77, 140, -273, -70, 426, 28, -278, 85, -32, -75, -425, 157, -184, 6, -160, -608, -138, 92, -298, 19, -12, -267, 318, -57, 69, -46, 23, 142, 159, 113, -366, -110, 272, 254, -108, -21, 36, 221, 107, -360, -269, 123, 397, 98, 48, -270, 180, 22, 190, -373, -18, 125, 105, -256, -216, 9, -413, 307, -164, -307, -51, -541, -85, -173, -66, 199, 7, 77, 179, -103, -530, 51, 37, -258, -16, 219, -544, 225, -158, 493, 556, -60, -770, -427, 38, 293, 244]
7624B44m7k71k1L27j5R8n92j91Q63l59k72L21M17o13L10j60k05k09K01M32r7n22
7646c61L6N23k01k64L73l09K49q6J14m14M61l78k08N78Oo59R76m22o69O66j08
7667i7K1P83k60l48j16j47J70N44l47p00O47j69k11M59K37q2k63j58N08j015P76
7688B32m84O2N22m99J35J82j72L35r40P95p1m7l46R8K62n97N52P65q00o20N98
7709c8L6l87L79K5l34O39q64M76L17M9l30q5K30K34q46J86O82j95j94j04o8K14
7731B2J93m66K04J1K24k49P7L50l64k20K92L41p98N1L44J35j26J46k20K29l12
7752a36l21O68J11q4n40M05j62m2j39J51l9jJ50n88O68l15J20N05k57j84O5J86
7774B21N0k03J81n74O10J5m66R7J09j62Q6L36l54N26m47N6k22N15m49k02J8M3
$$ y = [244, 197, -74, -95, 232, 217, 315, -277, -468, 395, 36, -236, 85, 502, -111, 199, 39, -166, -375, -174, 258, 161, -361, -325, 198, -3, -267, 106, -203, 46, -40, 74, -340, 121, -257, -465, 113, 119, -540, 436, 14, -655, 11, -97, -76, 707, 447, 99, -17, -164, 6, 550, 203, -497, 150, -19, -230, 229, 466, 384, 121, -37, 471, -544, 232, -252, -190, 332, -167, -32, 150, -22, 313, -627, 168, 97, 50, -296, -198, 64, -533, 19, 784, -16, -636, -38, -2, -389, -10, 15, -319, 320, -544, -68, 249, 298, -32, -117, 113, 347, -499, -313, 369, 174, -20, -124, -192, 22, 215, -251, -47, -36, 188, -61, 16, 366, 2, -218, 74, 415, -383, -332, 12, 147, 21, 167, -53, 176, -136, -457, 211, 322, 238, -302, 103, -59, -101, -240, -89, -128, -129, 21, -567, 101, -214, -94, 411, 154, -30, 35, 221, 271, 68, 249, -325, 285, 300, -166, -69, 40, -122, -36, 300, -54, 472, 25, 81, -141, 374, -75, -277, -259, -216]
7796b16p6J21p4l38J144o91J98o15N48J02p43Q1P7M84K72j50k62k2o8M27j71m92
7818d64N79N9k92J71J81l51L0O35k57k16l71N12n59K83k0J03L2L17m27K48m4k77
7840a28k07K30M7Q6k41J5K68j08n8L13m55K93k10K91O5l31L35k17K77j52K2k84
7862a49j66O02n56K69k44K14l5l76O88q9O0J13l80J14K10o08L42j78J21m25J50
7883c23N41l51P97m43m24q4Q27m79k63K50r2K19m66K44L38k71L26o9l25k1l86
7904d55O48o36O76n86l27O26k78O74o65O71l58l0j51n50J165j191Q15m28M09L08
7924C37n06m23J079o51N41l27o66N27j78O28m61m94Q14m69N80n95o2J374j554
7943e06K11n1R82j006K49L42p7m67K97J26j76j11p6M00m40j62O89k90J19l97O32
$$ y = [-216, -292, -171, -245, -583, 561, -130, 68, -547, 1, 103, -640, -559, -482, 2, 274, 124, -138, -160, -228, 199, 28, -464, 115, 174, -118, 53, 234, -117, -87, 548, 291, 75, -296, 216, -343, -60, -80, 23, 55, 372, -55, 193, 149, -128, -335, -105, -58, 28, -213, -198, 70, -38, -96, 217, -238, 55, -155, 136, 201, -130, 205, -12, 265, 113, 135, -149, -315, 287, -269, 0, -244, -30, -65, -441, 247, 158, 218, 331, -49, 65, 275, -333, 9, -169, -48, -473, -323, 218, -133, 664, 221, -203, -287, 540, 61, -202, 48, -44, 175, -291, -47, 291, 20, 346, 277, -48, -69, -455, 193, -443, 233, -353, -680, -54, -332, 342, -323, 348, -10, -40, -191, -741, 424, -767, 48, -380, 29, 337, -169, -592, 487, -164, 377, 50, -616, -89, -267, 361, -100, -594, 220, -249, 331, -264, -326, 1048, -506, -295, -346, 636, -370, -121, 221, 144, -323, -26, 100, -76, -187, -263, 137, -303, -465, 224, -66, 53, -344, 288]
7964B88k55K00k91m8j49L88Rk84L3J74j16j87j3K61J9j89K8K10j30l9l9J20m20
7987d30M39J74P6o1k50j70j60M60Q7r9j94n2L22j70j58j5k11Q67J5j74j016J70
8009e50K40N04n07%K09k50K15m97P82n04j43J31J134q91L3L90m46k5L55k1p88
8030f29N85j09L31k42l86J38M24k67k0K65L18n71K32L6k76K48k94q01N14M41j91
8051b54K79l93k55ON62Q33o79L5j97N2L5n50R33n63l18N65N83o39L8j79M36n15
8073a85Q5j57N62J7k95L3n47O00N5M0q7l21M10m23P4L00j29l10MJ81j1J17K89
8096C02k6q4l76J29p5o03O73L14o24J17K80k7%k48M11m8l6J87o21J59L28m95j61
8119e24O57l42J49PJ648j988J46J55K65k44Q7L2l90K91j36m1J8J11j18L53l45
$$ y = [288, 33, 233, -58, -106, -255, 133, 142, -142, -109, 65, -51, -238, -251, 10, 29, -160, -132, 78, -52, -91, -130, -10, -430, 9, 183, 259, 198, -52, -222, -382, 78, 165, 66, -128, -180, 142, -28, -186, -201, -412, 455, 470, 296, -720, -550, -310, 194, -313, -313, -104, -354, -139, -636, 146, -358, -501, -370, 764, -127, -94, 296, -150, -175, 180, 159, -629, -44, -153, 178, -64, -450, -312, 112, -155, -175, 90, 408, -163, 69, 105, -171, 77, -217, -1018, -504, -63, -254, 25, -368, -623, -617, -55, 778, 99, 134, -63, -11, 24, -526, 407, -156, -474, 91, 674, 35, 73, -106, 330, -185, -100, -257, 305, 322, 27, 60, -487, 113, 168, 208, 121, -200, 210, -213, -139, 161, 32, -278, -274, -93, -104, 13, 302, 276, 192, -184, -55, -130, -733, -60, 254, -370, -253, 27, 0, 0, -248, 163, 115, 79, 266, -355, -196, 132, -363, -524, 133, -209, -60, -53, 1595, -393, -247, -92, 173, -71, 16, 48, -342, -51, -187, -228, -210, -99, -217, 136, -209]
8140b09P9R8n00J71M64p2o9R8l56J59J75j14q5M93l06m41R6L78O0p0K83l03L10
8163C39M7m07N78K29n09p9m85P73n35K77l41N8j84K61J90j63n66N76k91J60j71
8184b43J93j76q3j05L14L45q68
$$ y = [-209, -130, -32, -532, -361, 103, 31, -38, 60, -296, -137, 38, -76, -161, 332, 26, -415, -319, 59, 119, 49, 332, 29, 339, 386, -21, 557, 786, 277, 198, -287, 486, -49, 228, -113, -55, -239, 22, 212, 49, -517, 59, -232, -72, -243, -50, -226, -309, -414, -100, 245, -623]
8191f23
$$ Imaginary data points
##PAGE= N=2
##DATA TABLE= (X++(I..I)), XYDATA
0@%%%%%%%%%qRrJ6j6K4l2M0m8N6p2Q7j04J22j41J65j94K29k64L04l52M02m58N21
33B77n93O72p54Q48r52J064j188J324j473J635j812K004k215K446k696K973l278
50a718L611l981M386m837N343n910O554p288Q139r138J0328j1776J3582j5908
64h613J9036k3495L0411m2705P1236k63312j45010L53041J28274J65239Q7544
75C71646k6206j97175j84270k20863j55259K7889K31649K05735J43712J11316
85C08174N2212j16551k11325k06245j33333m1268R6167J81882J91431J38428O5437
96C25009n0872j55346j97670j48314o3666J8052R9042J86709J93790Q8505l2496
107B62743r4291j44140j65013j04510j5471M1975J27901K08427J48098r406q4122
$$ y = [0, 0, 0, 0, 0, 0, 0, 0, 0, 0, -8, 1, -8, 8, -8, 16, -16, 24, -24, 32, -40, 47, -57, 65, -76, 89, -105, 124, -140, 164, -188, 214, -244, 277, -316, 356, -398, 450, -502, 562, -626, 698, -775, 860, -952, 1052, -1163, 1283, -1413, 1560, -1718, 1893, -2088, 2298, -2539, 2804, -3106, 3448, -3840, 4299, -4839, 5489, -6287, 7295, -8613, 10423, -13072, 17339, -25366, 45870, -217442, -362452, -9411, 118863, 284102, 371646, 345440, 148265, -36005, -256868, -412127, -384238, -152589, 53146, 196858, 308174, 360386, 243835, 32510, -173735, -307068, -348336, -252169, -70287, 121144, 259572, 325009, 274137, 118791, -78879, -227193, -290859, -272807, -173765, 12944, 206734, 295239, 262743, 168452, 24312, -140701, -245211, -260682, -218707, -90806, 117621, 265719, 256313, 172191]
118A72191q3206j20764j47425p5909K5230R0327J54917J72212O5166o1922p8706
129A12111p2269j27546j31438k4348P7881J18968J38884J09360J1673o4149p8901
140G0226r8183j19217p1304K6252R5423J19010J10584O3009j2082p4522j01655
151G541j00085p3950k1604M7683J02337J11860Q0320L0389l4923r8477j08778
162e7687o4871k8664l329N6350J12939R9501M8477J061o5413j13615p8781k2508
174a16540j9245J702Q3770J21756P0559J1071l2797q3364r0372m2561j9904j8227
186a34152L9525J09768R4953K8467j4648m8070p8867o8414l4207j5741J5781P2141
198c3464R2229N6049J0303k7789o0681p2316n3799k3964J0794M5063O4496O5384
$$ y = [172191, 88985, -31779, -179204, -255113, -229883, -139556, 15361, 187573, 252739, 190817, 112111, 39842, -87704, -219142, -243490, -165609, -46641, 92243, 201603, 213276, 149127, 70226, -27957, -147174, -218478, -192226, -96803, 22207, 132791, 195800, 183718, 109196, 7541, -92544, -166494, -188098, -140415, -38078, 73782, 154102, 184491, 149568, 51091, -57687, -122558, -151222, -154551, -98201, 14738, 114239, 162716, 163777, 98364, -15251, -94032, -116540, -135785, -134083, -50313, 71443, 142002, 153073, 120276, 36912, -53460, -96021, -115925, -134152, -94627, 15141, 110094, 138561, 123913, 75843, -3024, -71438, -105645, -121386, -105605, -33464, 58765, 114814, 125117, 97328, 36647, -35669, -89468, -113432, -102638, -57575, 6921, 72305]
210G2305M5828k148n2556o7890n6791l7883l880L4605M6719M7897N9871L8072
222A24149l1352p3513n7231l5605k0279J2841L9673M0056M9435N6991O020o0577
234E0608o6947l5819k3587q311K4847L8968M2287N1719L1002k8711o1495m5608
246c1047k8780j8012Q673L3411L8951M2293L7498J901l9120n1442l9832k4424
258f9930j81K3566L1930L7647L7359J7691j4642l8817m8883l8485o339J8768K2681
271b7635K8494L9156K6282j51k0932m0294n0338k4427J6026K3262J6306K9339
283A5088L6311J2330j1536k6221m4245m1531j995K5217J7495J7841L2671K4683
295E6108o23j7889l2870m2886k0869J2166K0552J6333K5335K6350Q611n527k2474
$$ y = [72305, 118133, 115985, 63429, -4461, -61252, -99135, -103015, -68410, -21691, 26206, 86077, 124149, 92797, 19284, -37947, -73552, -93831, -80990, -41317, -1261, 48174, 105165, 111185, 50608, -16339, -52158, -75745, -84056, -59209, -20241, 22046, 73765, 104767, 76056, 14561, -31047, -59827, -77839, -69166, -35755, 3196, 45489, 82987, 84888, 45768, -5674, -45506, -69930, -70111, -46545, -14615, 23032, 60391, 78082, 63440, 24623, -24260, -62745, -69084, -50316, -27635, 859, 40015, 66297, 66146, 45214, 4920, -45418, -69845, -53819, -30557, -14251, 15088, 51399, 63729, 52193, 25972, -18273, -59804, -61799, -36582, -19087, -1246, 31425, 56108, 55485, 37596, 4726, -38160, -59029, -46863, -26311, -9978, 15357, 41707, 50318, 44791, 22317]
308B2317l8507l2311j947J4788J7654K3388K3564J1195L595q047l0500l7500j5991
321d8302O626J5723K2346K3308J0585O167L403j7419l7025k4633l825Q539K0111
334a4396K6346J2478L390P285l602k7903l0660j1485J302J1726K6492J8896K579
347B2448N927M639j5979k8458j9899n875O049K0471K1891J0260K873N623n812
360B4158k1293k1707j3590l502J4195K4381J3385L252P017J41j5115j7583j5293
373b1554j2411L608K2366K0199N051M205L999q280j5149j3331j5287p031J3873
386a9742K2685J1505M135M552m105j1341r942j4376j4370M696K0022J5464O736
399A5919N037j717r171p382q726j6795p746J4146J9123R227O427K644q741p699
$$ y = [22317, -16190, -48501, -50448, -35660, -18006, 5382, 28946, 40141, 43736, 35689, 5189, -32311, -48302, -41676, -25953, -3607, 19701, 30286, 36453, 39856, 22437, -14588, -39221, -43046, -34507, -14396, 11950, 24428, 27818, 35103, 31501, 3598, -27062, -38547, -37245, -25519, 973, 19869, 22448, 28375, 33014, 17035, -11423, -31322, -37197, -31148, -10677, 11214, 21474, 24347, 29970, 24158, 2865, -18842, -32432, -35934, -21739, 2642, 16027, 19279, 26296, 26437, 11322, -6261, -21554, -33965, -30357, -7991, 12208, 17259, 21464, 25463, 17183, 2034, -11297, -26584, -33615, -19742, 2943, 14448, 18583, 23135, 19030, 7689, -2253, -16629, -30999, -26303, -6281, 9183, 15919, 20956, 19239, 10068, 2686, -6040, -22835, -30581, -16435, 2688, 11915, 18342, 20986, 12245, 4546]
413D546m866j2857j3419M759J5478J2953R149M211n272p477l749q837j4709l613
427b3703J0580J1436J1459R806k130r202l450m244j3419q570N064Q577R418J3545
441A5167N382r063p330j160q257j0670r05M570P058J4139J0941n063r362j503
455C944m562j0008m014J148K590J1777J5650O32r960k916j250q812p107K78O86
470a1924O580J4461P697n496n229k395o211o526k202q86L816J1061Q438N15j730
485I969l350q159n849K0k066j881P621J1322K937k14m54p481r587n87K502l612
501h869l84R989Q777J484r01m779r052l412K755k075m177N714J0888M890l81l220
517G247p525n570J512J6m924J168J0080O547L18j610l660n360k587m28k748l77
$$ y = [4546, -320, -13177, -26596, -21837, -6359, 6594, 15743, 19954, 14682, 7205, 3456, -5381, -20090, -23703, -13123, -1687, 9772, 19578, 17448, 8246, 4796, 552, -12867, -21437, -16373, -7796, 1622, 15167, 20549, 11486, 4156, 2996, -5261, -15931, -16836, -12266, -5208, 8931, 19872, 14809, 5447, 3944, -618, -10626, -14640, -13492, -10902, 875, 16525, 17157, 7197, 4281, 3031, -5781, -12888, -12610, -11924, -5344, 9117, 16814, 11318, 6089, 3694, -2517, -9043, -11245, -12131, -8315, 2746, 11184, 11699, 9969, 6619, -1540, -7389, -7369, -9435, -11316, -3695, 7627, 10564, 10350, 9896, 2415, -7172, -7759, -5257, -8869, -9253, 736, 9513, 10997, 10096, 5317, -3735, -7147, -4392, -6467, -10644, -4930, 5958, 10848, 10467, 7247, -278, -5848, -4336, -4320, -9244, -8076, 2004, 8551, 8869, 7259, 3599, -1761, -4348, -4776, -7524, -7901]
533g901O114O310K640J264k221n515l295j903l261R08N923K414j98N705L171o548
549C607o652j80k590k160N298M345k301L051Q374k558j0219k931J019j578J337
564d138L911p43J056P799K277q557n356J001p00j242J749J514R98N954L599n093
580D029n611o43n77j707O51J052J909M971K537k472k678n58l143l102R85J869
596b488J347L273L046j688j424O33k699n391m75M240J150P8K926R78j442J490
612C554n64o649l438M798K915j558M42M391M5j161M08m060n482J876N066p70j689
629a876L146L195m48k172j906l101o95K438J75n73K760K626k47o35j931l037k29
646b510J766j724p98M442K281j545l74Q83k222k332N42j104j152M092L221j398
$$ y = [-7901, -1787, 4523, 7163, 8427, 6206, 691, -2604, -4507, -7768, -6860, -937, 1477, 1279, 6984, 10155, 3607, -3045, -3225, -5815, -7975, -2677, 1668, -633, 2418, 10792, 8234, -1985, -4916, -3897, -5475, -4138, -227, -970, 86, 7885, 10162, 1605, -3751, -2750, -3450, -4692, -2943, -1429, -431, 5523, 9122, 4029, -1582, -2225, -2802, -4509, -3858, -2806, -897, 4074, 6611, 4139, 1461, 903, -2240, -5342, -4357, -2488, -1141, 2132, 5178, 3490, 2066, 2699, 0, -5391, -5866, -1626, -476, -398, 2528, 3506, 2064, 3554, 2990, -3659, -7097, -2299, 616, -942, -500, 3891, 3936, 2775, 3183, -877, -6359, -4483, 583, -187, -1876, 1270, 4465, 4017, 1845, -61, -3162, -3857, -1419, -1244, -1817, 943, 3569, 3322, 2687, 756, -2281, -2510, -744, -2468, -3266, 1176, 3457, 1912, 1538, 2421, 199, -2133, -1591, -2695, -3847, 245, 3466, 2068]
662B068j800K389m56l799o81L39j371J843M146r26k022J951K350m110k703R51
678a831P1p62L120J604j625N62K070j637l620n50J330O9L90J392J49J057R29j579
696A139j980o97M00p67R29P76R78L51J629j024k603j81J181k024j086K782J691
713A494r41J340L16j841j323P83j107j661J441K416k01J03J100r03j514P24l84
730a58k672R07K828m44n65J458J056k375k24K40j267j024J746J385p97P85R85
747A864j373k62m38j046m39J104J41j01J709N97r34j16k64r49j005J184K20q14
765i22Q59K390j219j255O03N51l094N99J771o24n50J152P20p92l25P32j456r77
783a837J586M32l13M9J542j261j32M7n6j494Q4J339o97M19J591Nj043O10nj634
$$ y = [2068, 268, 2657, 2201, -1598, -2279, -1940, -3311, -1468, 2678, 1752, -270, 1681, 4031, -79, -2782, -1831, -1760, -2522, 598, 2202, 577, 1139, 3209, 1572, -2048, -2598, -1268, -1199, -809, 583, 732, 1789, 2718, 1139, -841, -1538, -1138, -1905, -976, -200, 778, 1129, 2758, 1734, -869, -1050, 131, -1893, -2979, -197, 1494, 553, 1893, 2209, 368, -955, -172, -1279, -2940, -1499, 917, 716, 819, 1919, 1016, -498, 226, -158, -2830, -1923, 905, 461, -104, 1354, 2410, 35, -189, 51, -1216, -2240, -494, 891, 94, 879, 1864, 491, 229, -209, -1255, -1694, -590, -449, -550, 1159, 1756, 822, 706, 442, -507, -1512, -328, -108, -922, -63, 2327, 1108, -147, 456, 1007, -2087, -1488, 283, -341, -891, 261, 981, 189, -136, 596, -860, -1837, -251, 181, -132, -83, 1459, 198, 66, 113, 57, -1437, -1353, -14, -711, -292, 1299, 1304, 261, 871, 866, -768]
803g68P9R62m85n27P42P46o35Q87p49q96J46j53j05j55J607m79j04L82J58j428
823g75J14Q98l43j846J226K091j160m96J328K40k313K44J001j420K1K253k53j845
841a035J25K258o53j414K25p94N74J103M3P8k2O83m92l91J30p43k24Q17p4J3k10
862cJ001p65q94M59j95l01P46Q0p8N06M90r77o83R19J58q95m68J261o17k66J410
883H88J33j956N21J045m6j782Q06J189l91n97J006n8j536L13J051j155J25M81
901C7N64q10m87J096N50j276KM92k85M1q7N68l83R8J274q43q69k98L77L63k4o83
923e83Q50N24j023K15j8l17r03J656L6j321O04J583j234r27J206K15j662K81J450
942F32q58p89J563M74j463K92J060m12j512R53Q70r36p00J633jo97k59L98k65
$$ y = [-768, -689, 273, -212, -739, 3, 749, 114, 1001, 252, -644, -498, -651, -756, -911, 696, 217, 113, 495, 653, -775, -661, 237, -106, -1952, -726, 1365, 205, -291, 1037, 1277, -1036, -792, 209, -1211, -1190, 1063, 810, -1035, -910, 1348, 695, -719, -494, -1288, -714, 389, 432, 510, 488, 1171, 679, 288, 418, -325, -549, 268, 194, 207, -3, 998, 233, -661, -202, -397, -698, 48, 128, 50, 556, 1046, 69, -614, 305, 463, -432, -900, 361, -256, -522, 888, 1021, -935, -414, 631, 585, -1197, -391, 798, 407, -190, 816, 758, -778, -465, 586, -569, -444, 37, 601, -209, -696, 400, 950, -326, -324, 168, -117, -76, -163, 405, 22, 120, 1394, 551, -318, -616, -239, 124, 100, -583, 267, 791, -232, -17, -35, -352, -1255, 401, 437, -884, -280, 1303, 69, -858, 348, 563, -1099, -818, 632, -226, -1015, 548, 1022, -441, -149, 911, 499, -1013, -60, 810, -126, -826, 807, 806, 109, -150, 248, -17]
961a7n63M12P70n08l80J87L78p1r35N96M24p94j68J173q6j227Q04J009j068j000
981a064J199M49j414L1J798n39j287R85Q54j313l13J134l11j284R90J312j258
998c1j041J349Q96j491n32J123j68o71R89M56j570l15J570N04j605k10Q64J84
1016C01n71L89K55p47J88R40m32j159J26J293Q7j220J73R92l27p79N78M89r94
1035d18l98J419o2j443P08J456j062j471J542O44j631j70J535j76j246P13P67
1052G07j312k60J823j54j845j2J708mq80o9O04n45K92N77p52q67Q19J228o47j131
1072g20K23Q98J2m07j93J19l32N54N61m62j079R27O59q44o85Q38L66p21O1O98
1092D73k61q63P92O88j231l06J101O2j172L61J236n45j079M64J028p95l28R23
$$ y = [-17, -580, -168, 602, 94, -286, -99, 279, 208, -727, -131, 293, -501, -669, 504, 418, -809, -5, 1004, -64, -1064, 135, 584, -830, -799, 999, 460, -827, 158, 1012, -301, -614, 520, 209, -1075, -85, 1227, -31, -1072, 277, 1173, -318, -850, 273, 105, -566, 423, 879, -691, -1006, 564, 1068, -537, -747, 117, 301, -270, 119, 374, -373, -185, 755, 323, -836, -710, 583, 670, -550, -377, 615, 288, -491, 87, 576, -418, -816, 603, 541, -902, -194, 1262, 200, -1271, 271, 915, -716, -886, 649, 473, -773, -60, 707, -605, -865, 958, 804, -1041, -1053, 655, 651, -229, -298, 306, -239, 53, 630, -122, -989, -170, 1058, 411, -720, -497, 401, 413, 6, -187, -68, -400, 154, 715, 253, -826, 101, 760, -84, -769, 69, 435, -286, -225, 473, 212, -651, 141, 829, -402, -708, 393, 455, -717, -356, 880, 335, -744, -280, 748, -47, -375, 548]
1110E48n04p82Q64P74q90j032R87R37q50n39K96J81r4M30j02n28j63R20Q2m89
1130D6o99M13O83r8l71O2l67M34j09RJ24r51J047K61o40k41Q66m93m05K63N66
1151D00n69J6M03l1n90O88J92p49l46J012P9r57K02M81K2k14J46k12m08L92M85
1172D42j79o98N1N97J89m03j48J63q0J70J26j46l82O4O34J15o87j87K50K82j40
1193C3N4M2j96P8qK50k28k4K93m81L87j79k68Q6j01O14m37K2k03M39j07J28p4
1216A20m5k61K72N43n46l36L85j06l23N59L38j058M84k68J12L91q32P95o11K13
1236a74Jj36K16N1O01n00j58N2n4M17r7n22K64L09R7n86L49L12o44n2K58m2l41
1259c79J02J93j90J23k03L72M1P2m14M50o73O09K58J20l91l07k42K13K02J92m49
$$ y = [548, 44, -738, 126, 900, 10, -1022, -35, 902, 52, -487, -191, -10, -104, 326, 224, -304, -467, 453, 535, 46, -653, -240, 443, 345, -26, 36, -331, 103, -6, 3, 127, -824, 223, 484, -156, -397, 469, -24, -429, -166, 400, -169, -153, 250, 219, -371, 317, 509, -240, -586, 426, 505, -452, -250, 231, 253, 39, 185, -27, -435, -43, 442, 263, -435, -384, 213, 402, -1, -149, 14, -66, 104, 230, 84, -298, -234, 400, 515, -172, -359, -109, 173, 33, 87, 129, -67, 11, 3, 253, 25, 1, 294, -187, 200, 21, -247, -161, -262, 352, -85, -63, -266, 173, 66, 194, 120, 75, -186, 86, 629, 83, -253, 132, 26, -297, 262, 600, -458, 26, -242, -130, 261, -571, 224, -387, -174, -173, -309, -93, -42, 559, 59, -99, -47, -101, 316, 219, -303, -39, 270, 367, -219, 130, 442, -202, -254, 4, -38, -379, -277, -84, -274, -151, -354, 18, 59, 131, -283, 167, -506, 103, 361, 481, 90, -217, -459, -246, -44, 148, -301]
1280c01M79m52L73jk35m30L88O80o15O87p89P46m69j59n2L84r0j093O85P89k59
1301B66n65R45j100N85m65l50O61L5n3J06L53p02K37q4K99j47k28k2P76j305J437
1322F79l94q03J13O99m87p65O52l63N55K87M3k51k5l46Q27P62j372N60q2L35p24
1343a00M96o38N75k74J13N49r88Q44o88J84L18p38N56j4k05J19L93p30K09J74
1363A55J50j098O48J51k54L57J57m85O0L27j19q57M85K27K63m78O63l19J8m23
1383c72K65J75P4j08j32J22q1J76o4l1k38K32L2j83R9j59K13Q0j26J38k30m3N9
1406a02L0J87m48M69k39M19m67J76J2J60m89L11Ol85M75o0k09P6K76j16m12M8
1428b82M12K38j40l30O69k37l85m8K68j45L3K52K41j10k73m11Q49m80m33J23K9
$$ y = [-301, 178, -274, 99, 98, -137, -567, -179, 501, -114, 573, -216, 530, 61, -98, -150, 234, 144, -949, -264, 525, 266, -299, 646, -454, 131, -334, -684, -23, 12, -41, 65, 418, -284, -47, -131, 168, 21, -207, -229, 547, -758, 679, 285, -518, -405, 294, -193, -958, -306, -669, -114, 173, 216, -35, -60, -406, 421, 1183, -189, 371, 289, 624, -100, 396, -242, 333, 59, 172, 721, -267, 577, -111, 73, 391, -347, 209, 195, -10, 109, 502, -228, -19, 155, 305, -793, -145, 6, -248, 109, 266, -219, -159, 168, 49, -808, -323, -96, 167, -311, 352, 33, 51, -372, -107, 68, 142, 34, -98, 24, -57, 119, 55, 24, -214, 18, 50, -133, -34, -193, 20, 100, -26, 112, -118, -161, -102, -72, 115, -333, 136, -103, 316, -151, 25, 37, 197, -292, 19, 25, -360, 115, 55, -154, -78, 198, 82, -330, -282, 130, 368, 228, -102, 567, 330, -55, -103, 165, 20, 53, 305, 546, 436, 163, -248, 601, 121, -312, -189, -160]
1449a60O5K38l72k1j62J152j361P6P32j73N5n96N68k90Q30o75K0k45K11Q62r93
1470b39o60R74K18j75J58M04j200O86j2k96P25q14J036n83J0p50N32M74m29N3
1490A12R5l58l50R20n5j72M11m00j7r57O82k10Q1J008l10Q7j318Q24n3J05n81
1511d56L70L33k36M99q34N94O4k27j79L05J66n19K52j99n3M76p3l13m58M26P92
1532G30j068P24j67l66J26k57J88m0K75k9k23l47M09P52j23m88j84k94M19k41
1552b04K50Q7K52K84q9m3k58j056O50j47Q23n68L33P6l90J11m96P79l49N30l65
1573B10j20K54l50M48o85J246j253L88p18P77p7p4n49O04l14mJ05L51o24j25J18
1594c92R75m93l8j4n1J71j98J41m26j26J64L34n23M88J13j15M65m56k56K70N0
$$ y = [-160, -95, 143, -229, -250, -412, 740, -621, -545, 187, 14, 69, -527, 41, -249, 581, -94, -74, -319, -108, 754, -239, -899, 75, 293, 118, 276, 680, -520, 166, 154, -142, 583, -231, 805, 222, 232, -518, 14, 488, 59, 112, 207, -151, -501, 419, 364, 192, 603, 203, 186, -771, -89, -299, -218, 790, 480, 567, -751, 73, 20, 125, -456, -86, 247, 11, 510, -324, 270, 334, 107, -72, 233, 399, -120, 132, -67, -120, 356, 283, -30, -488, -62, 730, -338, 386, 219, -147, -21, -278, -90, -130, 145, 116, -107, -454, -45, 707, 584, 96, -88, -382, 37, -204, 46, 133, 385, 669, 580, 537, 279, -777, -127, -274, 549, -19, 314, 390, 0, 111, -385, 394, 45, 575, 210, 90, 344, -6, 442, -243, 1003, -250, 138, -580, 197, 120, 46, -503, 101, -213, -217, -112, 239, -385, -510, -392, 583, 90, 52, 38, -13, 158, -40, 101, -325, -451, -287, 47, -476, 12, 125, 10, 475, 19, -237, 33, 83]
1615H3l5k80J07r7L12l82QO75l17m11O92p79L95j57J01J3n6K60N9P4n41L46L49
1638D19p42J79N24o81L07K56k38l55K06J72J34j90j23L20l97M93n50J26L67K62
1658D89o82L17o28N72l24K58k63k1L30l98J45l3P96m54k79L38j45L7r6M2o4K80
1680B17m49J81M6J7m1K80l4l68K80j18KJ99j88J08k19J99k54J41J62k99J74M03
1702D39m74K72J3j91k8j15O3k46L57l36R1N1j88M09Pk58L47K41o5o63L26j09J79
1725A22p0k94K80J5j44K6K54m7j11M7j54J64J22k39R6l4r6o9J15J35k47J48K08
1748B27k09k8j18n0J92Q4j25p6K54j26Nj23R0j74K07j28P8r0M1j06R9J19J09k98
1772a46K41j23K33Rl2k40Q6m8J76m7j05j2N1j8q4J45q9j29K84m8m9r3P8r2j50
$$ y = [83, 48, -232, -125, -222, 90, -292, -284, 391, 74, -337, 355, -424, -29, -186, -85, -72, -128, 132, 191, 265, -276, 70, 419, -323, -144, 380, -301, 6, 262, 24, -331, -125, 47, 181, -9, -132, 188, -209, 284, -266, -140, 227, 489, -193, 124, -504, 68, -256, 2, -261, -282, 48, -350, -205, -238, 558, 104, -175, 163, 18, 55, -41, 1, -63, 217, -232, -51, -5, 12, -29, 251, 217, -151, 129, 11, 13, 212, 24, 132, -87, 112, -142, -1, 161, -138, 36, 439, -35, 237, 250, 59, 31, -84, -21, -267, 90, -246, -155, -104, -292, 117, 124, -134, 213, 454, 389, -274, 52, -57, 122, 52, -242, 38, 53, -91, -65, 189, 142, 31, 78, -76, 88, 210, -29, 67, 33, -63, -132, -17, 118, -129, 19, 227, 18, -10, -128, -178, 14, 98, -27, -103, 151, 25, 30, -93, -3, -177, 30, -98, -20, -110, -69, -175, -76, 43, 152, -146, 95, -28, 205, 214, 182, -58, 28, -20, 156, 109, 4, -8, 43, 25, -59, 86, -3, -132, 152, 104, 55, -38, 40, -52, -202]
1797b02K71k1m0J59m1N7k40j7P8J21Lj86mn1J17kJ93k09Q4m6M2J43j86j62N6P1
1823a2q2M8M3j18R2J51r2j32j37R5J32J5J4j4j30R8J72m2j3j19q7K49q4m4Jq7
1849h3N8Pp7J51k18P9L9K07j84j5n9L05j24q1k5r7K4J47Q4j66j7J24j34J68K8
1874A41l80J82R9J46l95J53o7Q6K56j53k81O2R8J86j48pJ12n4K6JJj2o0K2k8N3
1900C9Nj32j3K05o2M4l44J41J85M7j36N2j67M4K59J9k71M5k8J84j42K1L8p7%R2
1926D8qk66N7K28N9P3k15p8J26k48N98j93j70k05P4O27J8r56N59j9J00j91k7J17
1950A08n35J003o15p61M95J50j26N2nO23n98J06K04K73j71q74P44J35L28m72l23
1971b59r2m54J033J77r63P70j99j65M21m38o7j36L66n0L44j047Q00j84L81n56
$$ y = [-202, 69, 48, 8, 167, 126, 183, -57, -74, 4, 125, 128, -58, -62, -113, 4, 2, 195, -14, 70, 24, 66, 209, 23, -139, -83, -12, -94, -46, -3, -121, -29, 122, 30, -102, -239, -144, -12, 3, 17, 3, -127, -29, 143, 101, 88, -31, -118, 131, 47, 3, 4, -83, -25, -18, -95, 56, -162, -83, -44, 163, -21, -36, -95, 210, 86, 5, -20, -117, -93, 54, 138, -28, -45, 79, -55, 113, 141, -239, -57, 42, 188, -207, -54, -121, -35, 221, 68, -213, -151, -53, 133, -15, -22, 90, 36, 62, 63, 64, 52, -8, 14, -14, 39, 44, -88, -101, 104, 42, 86, -258, -117, 68, 115, -21, 31, -136, -92, 167, 186, -85, -40, -68, 116, -26, -5, 33, -44, -44, 48, 40, -226, -169, 59, 118, 191, -24, -102, 24, -224, 374, 181, 11, -194, -120, 507, 525, -431, 128, 109, 209, 18, -9, 108, -427, 576, -39, -800, -305, -155, -281, -229, -234, 389, -209, -103, 101, 374, 203, -671, 73, 208, 536, 64, -259, -351, -805, 228, 405, -558, 212, 13, -152, 269, -169, -236, -372, -6, -56, 288, -759, 41, -143, 238, -318]
1991c18L02p0m84R53k86M60n82o16j99J165m79M99j00q2j85JQ15q51m66J132l00
2012C09n4n96K54J09J82l50l4l06M09J81K5r07Q55n11M98qm81JR90k15o81P24
2034C94l05p20L78K88J69m74L83n6l05M92l46p1J09K65m4k62j43r5L45k51O15
2055C66m40n15M19M56K34o03j18R3oM07k04j22l34K05Q1j66K84o76Q01j45mj15
2077a02p5L79j79L65k78K93k48m04O75n70j88K36K65l10J47k49m16L21Q81l89
2097A54L04o10q20N14Q15l96j78M3R55l24q5p12l7J92J27M33k98n17M49J67n44
2118c68j15k5J92j77N50M73k31o15p26Q14O7K94l36k59P1M97q41P97o07N42k18
2139b21N17m30k25j33j27Q17M89o65k79J41o13m12J059m16K37M76o3k0p58N18
$$ y = [-318, -16, -86, -570, 383, 97, 557, -25, -641, -840, 325, -154, 345, 245, 163, -22, -21, 794, -57, -523, 609, 309, 255, -341, -87, 22, 204, -146, -180, -486, -77, 104, 129, -778, 77, -434, 64, 56, -425, -424, 566, 351, -330, 394, 89, -631, -253, 35, 204, -270, 113, 57, -248, 244, -102, -173, -64, 201, 157, -105, -248, -343, 2, -249, 366, -74, -589, -170, 286, 520, -83, -201, -108, -114, 293, 89, -33, -367, -162, -81, -247, 37, -639, 162, 17, 13, -102, -177, 202, 23, 388, 110, 403, 155, -249, 426, -144, -332, -96, 169, -141, 6, -243, -659, -338, 543, 154, 458, -152, -972, -458, 357, -39, -217, -174, 781, 457, 372, -340, -377, -185, -58, 375, 77, -440, 9, 176, -368, -483, -508, -316, -493, 57, 530, 299, -316, -1042, -228, -161, 133, -203, -462, -391, 106, -735, 62, -545, -3, -221, 296, -134, -359, -492, -619, 198, 687, 22, -257, -116, -729, -1141, -82, -498, -261, 215, 152, 132, -626, -108]
2159a08n80J274l27l29Ln59P86o3J54m26k84N75J26N38r79l77M20J36J40L2l67
2180b15M25k8P7M48j002Q13q06J46j73M7j60O33k59L98k95k49K2Q19p49L71Q8
2201C51p11M61n13K79l29R25j057Q69n05N0QN84k81P9l90K3M6J20n25O91p54O24
2223D5j61O54l1q89K33L7J93M4j79p56K6J109m3m44L3p47P62M48n07q6J36k45
2245c68K18O85o69J39j01J90n0O0O9n00L22M42m23j98l93K57R00k07L5r45K89
2266b48O03n7j77m63K43j79R94r20o7J98J79r8J47o74Q9k12N34L92o9m49K37m10
2288d07Q89l31j56K56l63L0P16m70j84m0L31J01o73K36k06j45N91n27O15m48m4
2309b29K0N44o13k34J58Q60m21K57o71j50Q75k74J70j3k59M0l1j12N06r73M43
$$ y = [-108, -688, 586, 259, -70, -67, -626, 160, 97, 251, -175, -459, 116, 242, 780, -199, -576, -156, -20, 120, 152, -215, 210, 182, 259, 707, -295, 518, -288, -142, -315, -268, -428, 205, -54, 344, 49, -200, -178, 641, -108, 263, 351, -360, 101, -412, -133, -462, 463, -594, 275, -230, -180, -172, 412, 131, 210, -180, -157, -111, 9, -516, 175, -579, 45, -116, 538, 507, -382, -149, -112, 81, 125, -54, -810, -784, 325, 282, -162, -129, -876, -114, 334, -173, -259, -123, -368, -150, 535, -134, 5, -96, 94, 44, 104, 173, -327, -5, 437, 14, -184, -577, -320, 580, 373, 408, -537, -248, 355, 298, 121, -342, -99, -278, 716, -204, -271, -73, 106, 8, 155, -519, -430, -642, -108, 284, 215, -234, 3, -407, 482, 151, -5, 251, -112, -82, 634, 164, -20, -60, 271, 372, -301, -65, -271, -416, 175, -352, 263, -185, -229, -209, 335, -278, -512, -354, 506, 85, 342, -329, -479, 396, 122, 292, 279, 20, 60, 29, -83, 423, -550, -107]
2330a07L47K04o41J75l47R7M42M60p29l7J33J41N71n88n48K55K09K15o1n46K28
2351a27K11O3L29l10k63j55M67O7LJ43j021P37n39P06n58L06m68Q44J31l37Lm96
2373b64J75J61J56n98k45O39J41J78l91j68P6L85R9k22k60m5K78J4O38j215M80
2394A2l08N32L90o52j22M19K3N2l86k11K34K55J29p10L67o9N87m77k18K45k79
2415a87M71r5k56M6j57%N71L8l93k31j5j49M11%k39l9j8J51N47r3n13nJ27k20
2439b48J024o41k53l04J341p76j52j30m6O80P8J2o61J54J41j94l17K22k32O46
2459C44m01J69n84j95Q92J65O0k51m91K15L68l45K68l57j25k40M28P78r14rM12
2480A87q2O2j87l13K49K0J12o3l68q1L44L15P4j66k52o8L57J87l76r8j87N73o9
$$ y = [-107, 240, 444, -197, -22, -369, -272, 170, 630, -99, -136, -3, 138, 709, 121, -427, -172, 37, 252, 191, -355, -127, 84, 147, 476, 166, -97, -252, 215, 282, 285, 428, -593, 144, -395, 311, -247, 59, -409, 435, 566, 229, 232, -264, -89, 72, 228, -370, -615, 24, 165, 343, -48, -216, -140, 245, 344, 122, -138, -183, 95, 109, 747, -468, 12, -296, 236, 626, -26, -148, 271, 294, 346, -40, -251, -17, 238, 367, -343, 24, -45, 542, 65, -153, 92, -187, 284, 189, -67, -21, -178, -178, 393, 431, 38, -193, -208, -357, 54, 54, -185, -224, -242, -91, 456, 363, -150, -155, -28, -248, 776, 135, -118, -422, 919, 143, -9, -139, -185, 495, 573, 585, -76, 78, 219, 25, -292, -70, -302, 344, -57, 112, -472, -667, 225, 390, 450, 199, -292, -77, 291, -54, 214, -143, -268, -508, -80, 698, -216, -225, 187, 105, 167, -20, -333, -84, -64, 48, -15, -383, -464, -120, 195, 269, 103, -149, -217, 140, 327, -49, -147, -334, 239, 170]
2503A70M7l14N6m0L21k23J38l79R2J50K85j35j74j24Q0o6J98m35J44K53P6Ql27
2526a99o5L23K7j23J05j79k04L41K83j53n4k27p2K52L7q2l09o8L08K57j64j49
2548a15j62L10N7K8j85j19R1L05L7k18j99K0M29j93J28l09K0J68J63j07k79j57
2570b87L22oJ32k17j65PK32R6m9k09J7J58M9j78K17k81J8K51P0j08l2j12J22R5
2594A42j5j76Oo6K05M1Lq7k02K54K65k81m75M33L80m50l21M16m07L40L45r9k0
2617B31o38O09R7l72Jk2N8L17n9l18j51Q16q66Q51k44p78j13R44o75l16J98K39
2639a91M03m63K02K76j26k75O0K15n22M96k26q96J420m79l71N34k04M10l98M83
2659C48l23k21L60M94q62L06p64N56l8J18j21L3Q40r95J032j008O29n11Q60m31
$$ y = [170, 217, -97, -41, -81, 240, 17, 155, -224, -132, 18, 303, 168, -6, -130, -50, -116, 82, -353, -209, 44, 120, 128, -199, -264, 59, 86, -37, 68, -111, -315, 26, 309, 156, 102, -125, -197, 55, 92, 10, -299, -367, -59, 198, 34, -115, -277, 33, 90, 118, -67, -186, -95, 210, 247, 29, -170, -150, 279, 86, 214, -95, -75, 93, 256, 149, -130, -287, 35, 29, 161, -56, -221, -214, 18, 114, 65, -144, -127, 31, 80, -98, 119, -162, -144, 107, 177, 69, 37, -75, 47, 142, 127, -49, -43, -109, 96, 137, 140, 53, -149, 105, 370, 89, -386, 47, 427, -23, -344, 72, -335, 5, 350, 251, 231, -407, 202, 299, -73, -72, -94, -36, 281, 222, -96, -247, 569, -297, 554, 310, -468, -581, 363, -312, -628, -430, -191, 212, -251, -49, 227, 101, -174, -114, 101, -421, 75, -151, -1047, 373, -106, -477, 57, -147, 263, -135, 348, 25, -196, 164, 658, -204, 102, -662, -106, -144, -26, -147, -114, 726, -269, 763, -245, 384, -127, 733, 302]
2679C02l85R09j24l93k22M2K55n93J6L66N97l62J53l38k77m88M30r18J943o99
2699B14n32P10q17K25K35k65P47l36M1o75R56j43o96N35k00J02k78K5L54m32M41
2720B11n71R30p6m56k97K55L64k34O45q78J67o98O08k34J6J1L65l17j06K46L71
2741C22o3o31J92L71k59J6J58N23j41q04N97q65Q65l50J69l94j02N1R3L79n44
2762d17M70J65K50n95Q34n67qj20j71l32M84j03J83m65j65L22L96J02j060O69
2782a28j9JL16l05M68Q9m84j52k33N12j67J28lK31j25j92l72P86j39j65P04j131
2804c80L86R1j92ML81K44k96K99l3k77N11r67J92k45M34P4o6K61q09P10n35K62
2826D9j81M36l69n39K14K17J33l38k16L95K34l02R89q0j36j104k31L59O18N61
$$ y = [302, -83, 826, 702, 309, 87, 129, 384, -209, -193, 173, 770, 408, 561, 223, -54, -542, -112, -1030, 913, 214, -318, 392, -425, -200, 35, -230, 517, 181, 222, -453, 503, 360, -336, 199, -1, 101, -177, -152, 202, -230, 211, -360, 570, 494, 38, -259, -4, 360, 126, 771, -107, 60, -638, -30, -264, -248, -237, 128, -189, -295, -49, 322, 259, -372, -180, 191, -68, -52, 106, 629, 488, -316, 281, -584, 281, -69, 100, -294, -396, -345, -252, 127, -417, 53, 218, 468, -127, 707, 140, 132, 12, -159, -491, -7, -110, 73, -392, -557, -235, 161, 263, -797, -128, -147, -146, 170, -135, 333, 422, -62, -214, -447, 65, -102, 26, 23, 254, 129, -63, -435, 351, 212, 47, 751, -380, 6, 97, -95, -91, 290, 534, 238, 537, 504, 227, 738, -229, -37, -282, 152, 226, 160, 421, -388, 322, -213, 49, -132, 304, -65, -604, -390, -173, -40, -378, -594, -199, 35, -267, 722, 642, 506, -598, -829, -470, 148, 709]
2846G09l87p53O20j91K77r0k00L82p08N63lk62o61O18M10P4n81N56n40M96j34
2867A95n21K16K02L3m1M20m76l77J3K37J93k93J04R9m84R6N38K8k87K5J19M0j95
2890a16Q6j67L34l8M3n36J036k44o07L85n26L75k43J9N30l70L77k74K18J7o60
2911c61N81n28K04N3J77k86l49M81K75j9l81L56q69P54k05M78j69J7l37K91m31
2932b68L32m25M10m04J6M82o17M01j47M50o12N39l69K14K68m72jj46L30J41q3
2953C9l39N10m7m81J37K57k07O9p3l99O8J427j149M10j332Q53K14l74O24n71N86
2974B22l72m44N01l06N1L87j66j61pJ80J45K87q44O65j445J760p94K06l75K39
2994b71J103j391o9N07M19l64j67o54M28N44j44o54J373j40j546J675q36L77k3
$$ y = [709, 322, -431, 189, -2, 275, 185, -15, 367, -341, 222, 219, -43, -704, -86, 324, 398, -183, 373, -167, 329, 195, -326, -110, 92, 125, 84, 504, 28, -349, -336, -99, 94, -199, -95, 4, -480, -384, 154, 182, -105, -80, 39, 79, -116, -30, -197, 137, 99, 142, -394, 642, 398, -209, 176, -350, 25, -218, -199, 331, -39, 338, 64, 282, 299, -361, 220, -308, -104, -51, 126, -160, -509, -28, 247, 228, -153, 203, -666, 88, -117, 361, 192, 209, -128, 163, -268, 64, -361, 49, -355, -339, 143, -474, -73, -220, 230, -382, 157, -212, 2, 270, -202, -203, -349, -19, 122, 39, -300, 210, 163, -318, -181, 76, -131, -62, -135, -534, -466, 961, -188, 222, -1110, -257, -43, -417, 207, -364, 222, -150, -594, -93, -399, -348, 39, -127, -288, -295, -115, 30, 317, -527, 138, -1307, 453, -341, -135, -510, -271, 832, -559, -628, -121, 298, -66, -233, -887, -459, 85, -59, -713, 660, 520, -1026, 649, -187, 190, 167]
3013A67r7O51p81j61L54M29r39k11O57J26j314K055p85l30J07r7K58J165p36J58
3033F76l22j34l92R83j106k53R12r6k20J01K80n00mj91j44K92j04j51K71n63R69
3054C04m83n64P89J14p22K75L3j57k25Q15n5J64l72M5J7l0n97N72m7j96P51L4
3076D65L66m57o77K74O11j151P68M1Q11j068J02l97J76k26P72k62J37R3p34M81
3096A25Q0o48J97P40o58J028j199p9K56R25r22N14k91o04Q95o75R16j082O25q25
3116f82K2P21q84L19q4P40J59L23j345J008J7M35p99L52p22P16l10M0J97q1Q3
3137B25k23J33N41l33K15q5l9n20O19k79r3n91K63l60L18K73n7k1p6L03mn9l24
3160a74m1L52l36K28j28k21O25k99P5p8K11j84k29J30J37N3k31J94j39n0K59r3
$$ y = [167, 70, 721, -60, -221, 133, 562, -377, -588, 69, 195, -1119, 936, 151, -179, -72, -169, 89, 1254, 518, 676, 354, 220, -172, 811, -295, -548, 364, 268, 48, 149, 429, -71, -75, -266, -410, -118, -222, -373, -102, -665, 304, -179, -743, 46, 160, -562, -287, -254, -411, -636, 179, 124, 288, -84, -39, -22, -52, -649, -77, -124, -320, 431, 465, 831, 374, -303, -29, 582, -569, 199, 240, 1051, -17, 85, -312, -136, -362, 410, 148, 285, 378, -356, 125, 205, -443, -246, 494, -164, 864, -335, -414, -158, 767, -155, 359, 68, -536, 359, -316, 600, -482, 143, -682, -660, 61, -823, -504, -588, 152, 311, 634, -711, 297, 314, 749, -50, 302, -420, 296, -14, 26, 223, 142, 225, 2, 135, 676, 343, 558, 473, 434, -86, 533, 254, 161, -430, -167, -527, -209, 64, 7, -14, -90, 213, 209, 150, -174, -215, 137, -199, 29, -99, -320, 305, 6, 81, 3, 214, 30, -199, -69, 68, 121, -110, 84, -55, -105, 154, 61]
3182F1j02n7K08q9j03L24k35J60k68R5j17J53j10K57l04j34L96j75L66n91K86
3203B1j38L0l26L84l2M27k08l00j72K19j73M16m3K7l37K45k69N5J35J00N1j62
3225e0K1K40k47J3O0J4K95n72m8K88q4m5O0j12K04j87L60l23J16j8j5l8K04j50
3249a4L01q6j41R6R0p9j93k83L57O0k5j61n5K13k17J20K93l61R5N6l21L21m07
3272c41M27Pj51m0J30j96j63N55k10j36o0N29n87J34J21j37%k3L36l02J34k77
3294b50l2L23J33l35J09R2q1J02j82l00N77N2j36k00J08K20N1l50O5J05m93M16
3316fm36M69J28j53m82M36rk15K23j90n8J68M70k1j94R2L0L46q38J03K25N1l83
3339b44L91k79J44K88q44N08l51O14R5k69j03M24k62k7L99n99N13j87l46j69j35
$$ y = [61, -41, -98, 110, 21, -82, 242, 7, 167, -101, -6, -123, 30, -80, 177, -127, -261, 135, -40, 326, -265, 21, -117, -87, -413, -29, -61, 366, 158, -142, -314, -95, -268, 148, 105, 132, -205, 40, -229, -174, -39, 61, 112, -50, -29, 211, -36, -23, 37, 51, 346, -226, -274, 14, -70, -115, -55, -167, 37, -150, 210, -113, 3, -15, -30, -68, 136, -14, 287, 201, 60, 156, 246, 167, -26, -309, 48, 108, 83, -78, -133, 80, -137, -17, 276, -85, 10, 66, -255, 66, -341, 86, 93, -58, -98, 32, -164, -327, 228, 18, -118, -178, 351, -236, -102, 19, -118, -118, -141, 195, -107, 27, -250, -282, 41, 174, -161, -52, 40, -41, 61, -121, -421, 156, 208, 72, -128, -20, 200, 251, -99, -34, 71, -422, -6, -442, 27, 155, 2, -480, -44, -53, -268, -45, -235, -293, -125, 345, 324, 130, 222, 252, 598, -240, -137, 88, 139, -244, 147, -132, 12, 300, -544, -36, -387, 227, 322, 53, -50, 374, 112, 85, 484, -115, 398, 211, -135, -304, -439]
3360d39K26M88qQ1l93K41L1J82k89k71K42J46n1l14K17J02j71Q1k29K70k32J04
3382A4q1l6L16k42J50l60M26l69J26K74l00K18k26R5l32J86N7k73N24J06j71k36
3404a34K00k38o0q8K21kL33k77l80M71p41R57m36N3j81O90k02L48o45J7K92j14
3426H4k6J89j3J6l16k6L02k91L09k47K89o79M75p4j32K47r9L9j27J58o6j32K67
3449A47j01K9r2m8n3r3O4L3J24j3O2q3m0j0J50r4j6N4N0k9J36k07k0N7O6K4l3
3476F4j15K04j71ko7K0M1l5K86j81l6o7J87o9l69N59l36L99n18N05n05K55k33
3499a84N29m56K14J49m20P76o71L75k57k4j65K61q5p5J0M7j55P9O2j65J49k3J60
3522A31k78N0L11o15L71N19n74O9L5J67l13O03m3r07M13M36n19K67n5O52n91q31
$$ y = [-439, -213, 275, 267, 348, -45, 196, 227, 409, 120, -151, 91, 237, 186, -128, 89, 191, 20, 101, -128, 142, -90, 14, -67, -103, 213, -29, 121, -239, 187, -182, -56, 218, -82, 136, -90, 5, -327, -141, -84, -357, 167, 273, 102, -134, 66, -172, -232, -320, -99, -101, 232, -45, -425, 46, -695, 262, -174, -121, -302, 388, 186, 534, -111, -94, 198, 84, 58, 247, 234, 250, -66, -92, 210, -81, 228, -19, 270, -409, 66, -8, -140, 107, 8, 47, -80, 78, 12, -120, 147, 46, 75, -17, -65, -118, -211, -147, -114, 10, -3, 59, -24, -64, -74, 76, -18, -34, 20, 70, 41, 177, -30, -50, 7, 73, 97, 64, -51, 153, -18, -20, -87, -67, -26, -61, 225, 44, 8, -59, 128, 59, -310, 249, -87, 312, -206, 299, -206, 49, -184, 345, -111, 103, 252, -168, 608, -63, 312, 55, 31, -134, 127, 42, -33, -23, 24, -131, -52, 10, -155, -6, -29, 131, -147, -97, 214, -401, -30, 489, -85, -16, 19, 186, -127, 476, 433, -474, -61, 375, -144, 123, 68, 720, 129, -702]
3544g02J110m72n2m82R84r24M01j17J057o68l87L16m62N99l29R1k92O45K31R53
3564A500j580j38k02R6L29n16L67J73j061J028J67n1K77p04N91j60k77K8O27q96
3584d02J02N46l85L51O3J14k75j97J64j10M54l17k82k2P91j34n86K20n56L67j67
3605b61N11m68O48r22Q28l19R4J39o08M18j68J70K2o91N50J6l06L24P1M58l13
3626A93m49K9K97k02N8K33%l06J9J76j35P7J50l28J11R3J89J37l21k00J03Pk08
3649b77L16K03J57k27L9J00j11P6m00k21R1P0L70K88Qq4n24k39M23j40J43k5J75
3672B11m30Q2K90l20j2K32l56K62K1L7q7J5K7J85l29M4K63ln1j88J20J19Mj96
3696f0p8KJ69M1j89N9J66o3j14Lr4R8N6k6J29k58R1M7J2p5K03l4Qp6p3R3J05q9
$$ y = [-702, 408, -64, -116, -598, 386, -538, -137, -254, 803, 135, -252, 64, -398, 201, -128, -37, -329, 316, 547, 1500, -80, -218, -420, -324, 5, -511, -144, 29, -1032, -4, 163, 112, 389, -315, 276, 116, -161, -133, 494, -402, -300, 246, -139, 212, 275, 389, 114, -83, 81, -29, 425, 108, -174, -196, 595, 461, -125, 95, -461, -94, -261, 250, -218, 430, -492, 336, 17, 111, 250, -358, 60, -108, 62, 84, -607, -57, -41, -347, -23, 48, 506, 193, -256, -227, 70, -132, -74, 159, 159, -147, -128, 48, -87, -10, 140, -188, -77, 16, 205, 342, 21, -179, -76, -69, -277, 39, 242, 399, 172, 211, 311, 200, 276, -124, -345, -254, -184, 186, 474, 482, 398, -126, -365, 58, -82, 61, 36, 211, -219, -137, 153, -167, -179, 53, -303, -41, -20, 17, -70, -55, -28, 157, -172, -128, 135, 132, 81, -107, 13, 132, 136, -60, -138, -136, 33, 74, -115, -56, 110, 47, -67, -64, -158, -60, -4, -30, 99, -159, -68, -21, -9, -84, 119, 85, 93, 17, -56, 37, 142, 53]
3724E3J06k21R7m3q5l0J89mj3R1m2n0K0m3Nk1P4k9nk43N0J30J17q8M3M3k31K11
3752H1p0R9o8K6n8K0p1l9K6J08Lk5p7m7P3m5J3K15j35M5j06J26k21P8J5k7j78
3779b39L44j83j2J75j51o9nJ50j9m5J9J24k4M3o0n5j1l9MK0pQ7k01K98o6q1O3
3806F0k38r3K38K02m2k78L17o9k96L17q4J07n4l21L01J26l40M4Q3N4j06J53j69
3829h8KJ71l67L34N1j18K34j54L2M1n1l8J74m86K94J93n59L41M2M86o17n9k90
3852d32M36l51N74j70j01l47O17k61L41n73K20N82l52J10o12R53q09P5M95p2L62
3873F85k58n58j38j69Q48m18N79r04K14o0p4J75k0J70L40l08k80k49M14j82j49
3894c42R2J14L06J8m33o3L18k12R7L63m88J61k44K54J59k7p3k66K70l09L18j97
$$ y = [53, 159, -62, 35, -8, -93, -123, 66, 62, 49, 140, 98, 48, 68, 25, 30, 9, 83, 54, 49, -194, -144, -14, 103, 15, 58, 101, -130, 81, 11, 110, 42, 68, 10, 30, -41, -80, -54, 54, 57, 32, -45, -92, -19, -64, -51, 164, 29, 74, -32, 94, -127, -49, -34, -61, -239, 105, -78, -90, 85, -66, -135, -140, 10, -9, -54, -35, 89, 65, 108, 48, -7, -18, -57, -53, -33, -40, 47, -154, 144, 78, -3, 60, -178, -271, -33, 169, 127, -151, 166, 97, -199, 118, 34, 141, 87, -234, 67, 193, -147, -103, -20, 34, -72, 81, -88, -86, 85, -282, 52, 103, -15, 219, 65, 97, 138, 87, 49, 223, -263, 31, 224, -335, 6, 48, 534, -83, -142, -432, 4, -347, 227, 57, -44, -391, 226, -35, 306, -267, -47, 535, 183, 293, -319, 634, -175, -100, 395, 323, 685, 427, -131, -269, -438, 410, -8, 571, -333, -119, -179, -253, -78, -98, 72, 412, 104, -176, -425, -11, -193, -342, -250, -136, 170, 188, -245, -308, 10, -202, -105, 258, -230, -69, -313, -59, 100, 73, 0, -266, 4, -305, 13, -184]
3916a84K92k83M09l16O5M65p05K0M7N67m18k48J88O17p39j91K05L63q05N38L43
3937B30N29j086M52p9M5J15p80M96l3K79l26J49j02J52j26K47k00j77M9J87k06
3958a85L56j48j08O3M6j34J54J25k87J92JJo2K0j31J48j60J92k59P8K5Q1k0K9
3982A7J9r8J44q9r6j9J9nJ4J69O7j84J06O4K9l3Jj30N2r4L9j19K2J59j05J15j36
4009g2P8J82k31M7j46J93k05OK84l4k73K97m9K8J4n6j64mJ02J9j03J03j74J88
4033C0J02j49j27J11o2J24J1k29L04j0k67N99n43j04M88o47P65k62L91l90k16
4054h1k13p0N34j14l09K08M5o3J80r3J23l11K43m9j79J33k3QM4j6l8J91k15K14
4078A49k19P7k7Q2k25J26J04k29L37k59l0l1K32jj38o2J45q7K96j01j61Q1q0L3
$$ y = [-184, 108, -175, 234, -82, -17, 448, -257, -237, -190, 377, -41, -289, -101, 516, -223, -414, -209, 154, -651, -113, 230, 759, -327, 125, 46, 91, 206, -574, -78, -111, 168, -158, -9, -111, 41, -85, 162, -38, -215, -166, 21, -185, 171, 23, -85, -22, 24, -110, 44, 169, -118, 74, 75, 76, 14, 34, -97, 51, -109, 83, -176, -98, -73, 8, -12, 17, 36, -62, 82, -7, -103, -122, -103, -108, -94, 75, 142, -42, 64, 128, 157, 124, 125, -5, 47, -47, -8, -127, -105, 54, -51, 64, -72, 6, 188, -43, 4, -142, 51, -154, -148, 136, 102, -171, 126, 77, 105, 119, 63, -101, -105, -3, 16, -87, 16, -158, 30, 132, -17, -144, -33, -95, 29, 40, -189, 115, 105, -162, 437, -106, -210, 278, -369, 396, 134, 525, 135, -81, -294, -364, 170, 56, -253, -45, 0, -63, 117, 24, 147, -164, 79, 30, -149, -16, -39, -31, 13, -3, -41, 150, -65, 149, -70, 7, -20, 62, -163, -37, 67, -162, 175, -84, -114, -145, 87, 86, -52, -114, 31, -56, 240, 139, -22, 59, -21, 12]
4102A2J06j3j70Mj3Q9p6k0M0P5m8J90k57k6M1J31j70M0P3j68J89J34l8l4k32J06
4128c5J34j52J07j37J61l0j3n9K07j32o2j3mN8j62J18J73K6q4ko9NQ2j77o1J07
4154a4L5j5J3j0r7J27J3k0R6k65L9J17L2J0l11L70P0m3j67J41k03j37J80K02j60
4179Cj06L70r0j99J66j25j84J43nk34K77k59J95Q5k23L15J23l62K1mm1O5J20j31
4203h0R0J50m24R4L48k4k77l7J63q7J0R9qk81J46R0k45N80m26j13N31l17L03k91
4227fj89J66J65l74N77q68J63L09L47k35k43J65O8j34l3K53J7k49K34P0K51J11
4249E65j70k56J91k24o12J10L27p3L19J79k67r3l0j07K06k8K60j48L12j71p45
4270d55M39K6J09Mn39OP77p53P43o21J37K77o5j37l75N88j51K59j50K7l08n3N8
$$ y = [12, 118, 105, -65, -61, -74, 15, -61, -81, -41, 34, -14, 176, -81, -107, -66, 65, -105, -65, 8, -160, 29, 163, 125, 91, -141, -35, 99, -53, 54, -83, 78, 48, 35, -24, 183, 51, -11, -24, -28, 30, -132, -14, 159, 185, 101, 99, 30, 35, 117, -60, -121, -14, 21, 6, 19, 9, -88, 39, 52, 32, 128, -137, -98, 19, 51, 61, -250, 120, 190, 147, -20, 121, -82, -219, -39, 163, 3, -103, 267, 177, -22, 144, 19, -165, -22, -27, -261, 16, -243, -48, 37, -186, 129, 252, -110, -89, -93, -134, -69, 51, -80, 10, 160, -264, -170, 178, 154, -123, -160, 3, -84, -74, 25, 17, -264, -118, -28, -273, 307, -119, -232, 299, -18, 285, -6, -195, -29, 136, -238, 339, -529, -366, -57, 290, 55, -188, -23, 45, -89, -122, 131, 148, -101, 133, 203, 454, 565, 395, 139, 330, 106, -506, -396, -69, -142, 177, 356, 89, -4, -34, -141, 65, 37, 297, 149, 461, 290, -455, -16, 10, 119, 123, -416, -410, 367, -386, 357, -264, -127, 150, 85, -52, -427, 161, 10, 269, 119, 146, -162, -215, -157]
4293a57n3J75M09p02J97L35j63L8j34l4J64k19K77j34j86J84J01j19K60m02P1
4314i2m7J82k81J05P8J27l10L46j52j41L8j40L21P7q3k17J99n6J00K2r1J57o6
4337G6j5m3j28K6M5K7j39J00n6N2K77m10J12l6L16j45j24L03l7j23l3m02O15m77
4361b19M37n64L73l3O8K53m79R9r5NK40N4m89Q82k38k68k94J47M69m10O6j87J60
4384b3K64m60L1J9K96L60L58r70k01O77k37L21m72N13k97L0l30P33o75J39j63
4405h7N82m65P9j95j26J80k02N1Q4J83j80P41j70m93l7j32O30j149J201p03j21
4426c29O11k00P2j17q7j75K36l11P54n27L2K17o36k9J154n34m31J95K54n01K25
4447a27J060j478J240J78j808J425p17N03J95q35L04k72N09j50j3J98k06J3K59
$$ y = [-157, -210, -35, 374, -328, -131, 204, 41, 79, -55, -89, 75, -144, 133, -1, -187, -3, 98, -21, 239, -163, -92, -139, 43, -238, -133, -55, 72, -238, 108, -44, -185, -147, -287, 34, 111, 28, -189, 10, -46, 54, 76, -15, 142, 76, 61, 18, -110, -84, -39, -12, -151, -51, -107, -55, 222, -188, -76, -112, 204, 59, -65, 238, 201, 78, 45, -357, 258, -219, 218, -346, 27, -6, 62, 315, -164, -65, -160, -155, 85, 139, -350, 532, 294, 26, -268, -121, 348, -62, 4, -183, -23, 241, -219, -188, -169, 127, 487, 845, -125, -326, 351, 114, 435, -37, 476, 179, 209, -121, 612, -63, 76, -87, 495, 30, 109, -86, -212, -32, -234, -183, -99, 84, -96, 645, 475, -18, -55, -187, 443, -706, 495, -208, -329, 282, 82, 154, 37, -50, -225, 11, -300, 454, -73, -41, 176, -460, -489, 665, 131, -300, -105, 149, -352, -127, 933, -545, 695, 873, -935, 490, -227, 276, 471, -364, -60, -332, 177, 27, 14, 212, 6, 19, 278]
4466B78p36N54K18o27N17j98L85M3r51N04N16o67R8k01K17K71o38OK85K85j77
4487a8o6J9n19K71K1J76K41J57n21M28k98mJ58l04N73m07L61o30L39j65p6M35
4509A71k31O99j93jn08J07J25q30O35J51m93L28j17L93q4K90n13K37m52L40mJ25
4531A75k25J38j28J80q5m32N82k08J4m2j41r1L25L22l71K56L9l95L42k55R0m1
4553D9M88q81J83J59j84P1k66N30j81M85q63L03k3L21J50o62N34m85M64n73p3
4574d54K57k88O51j59l4O5M7k61L60Pk55Q57m71r0l56K15O02m70j22J02k40o6
4596a03K42J07L16l57JL2k19l51K95r1O5n69N00q8Q9P5n19O66k47k0k73P04p8
4619A77J51l51K32j10l21L55p4O9m54P1j33K63K52K21j69K15j25m66J13J65Q1
$$ y = [278, -458, 96, 314, -313, 204, 6, 391, 434, -517, -13, 503, -164, -66, -267, -50, 221, -417, -411, -126, 159, -18, -84, -65, -584, -313, -292, -116, 125, 282, -239, 189, -109, -113, 45, -259, 314, -93, 268, -362, -23, -188, -264, 171, -60, 639, 446, 445, -63, 44, 169, -661, -26, 125, -368, -40, -157, 236, 152, 442, -71, 166, -286, 54, 50, 175, -50, 88, -40, 140, 55, -377, 205, -3, 11, -31, -172, -263, 62, 384, 13, 269, 308, -87, 255, 0, 90, 49, 537, -344, -161, -2, -186, -115, -381, 149, -32, 453, -410, -107, -130, 191, 341, -321, 213, -272, 192, -381, -454, -197, -485, 166, 7, -27, 38, 85, -176, 184, 191, -64, 793, 322, 232, -124, 91, 693, 223, 101, 203, -37, -103, 139, 246, 562, 205, 206, 238, 19, -332, -37, -128, -63, -632, -132, -220, -131, -56, -575, 91, -156, -176, -449, 255, 177, 328, -23, 209, 99, -222, 133, 59, 128, -326, -255, -388, -125, 127, 348, 179, 394, 269, -197, -84, 81, 162]
4640A62l59L18k47J33J81l73M00n92L23M04k76K38n93K82j63k67L95P0j5M26k5
4661D22l03J71J42m40M24m35K56j9j40L45j41k02O75r86N60o70N99n22j86P24
4681B74j49K1J5k20O5N7k77K01l37j19L84K4J39J45m03J86l54K65J38j44L1J02
4703D4m28Q03m90L49o00M40l25L04M93m22j94L37m5j67j12l48J06K76J65L0n04
4724b88M97l51k35N78k24J8l79P87o93N13P1k45K69o91O04l86M13k03J07Q7q4
4745A65k10K22l79l65N00n6j89P20J85q59K03J47K14k96l42K40M40n36L17K01
4765C22q8k48j02K6m5M68o44K64M95p33O22O02q18o7j51O7N08j88l47o69J136
4786D10m09j80K74P62m92l7n60K19n5j38J8J49M20k63m23J43P88n73j6j72J51
$$ y = [162, -197, 121, -126, 7, 188, -185, 215, -377, -54, 350, 74, 312, -281, 1, -162, -429, -34, 36, 21, 447, 422, 119, 290, 432, -8, 416, -19, 237, 218, 78, 423, 282, 80, 755, -231, 329, -341, 258, -264, -450, 274, 125, 146, 161, -59, 6, 63, -214, -13, -350, -469, -85, -61, 78, 223, -180, 6, -348, -83, 55, -89, -58, 44, -384, 419, -71, 278, -322, 118, -207, 97, 590, 168, -26, 311, 266, 99, -13, -361, -255, 21, 186, 216, -288, 209, -142, -377, 201, -23, -5, -384, 403, -290, 223, 294, 49, 318, -373, 231, -155, 258, 55, 162, 249, 165, -45, 177, -202, -567, -67, -123, -312, 408, 593, -266, -63, 84, 298, 2, -340, -100, 340, -196, 121, 322, 234, -14, -116, -90, -135, 333, -311, -47, 448, -285, 337, 939, 121, 54, -97, -30, 478, 290, -57, -726, 410, 1, -179, 95, 857, 365, 328, -232, -13, -68, -206, -188, -39, 381, 118, -305, -162, 626, 53, 37, -135, 16]
4807A6o04O01n2n01L85N7o7J0J49J45q41J385m83k22Q9k6R2k30j51K79j07N65
4829D89n0m08N2K86R8o7r08N86L94k63j99N28lp84O51p59J15N4M14j00k81L6M33
4852C14m93N97p27K65L89p50K50L48l60PK95l24M72n30j11M24Qj26J28M6j40M42
4874D24q68O82P6n53O39o90L03j42r9J7N65K9n70p20R85q2k14O14L9l87J57l07
4896a02m18M80k02L19p16L41L36p5L67m24k88L14K04K51o11O4k4R8l50R97r24
4917c63M53j43l76Q21n76j57K42J49k55k22N47j65J46j50J74P54j062M48k36J94
4937B23k72k65M43l03j69J90Q2N21m94n26N07q8q06J110j8o34N82l5m18N35J18
4958B83K68j4n81Q8l58N59on10M05j38Ok52O3P1O5K23k95R1K71l31K51k41l20
$$ y = [16, -588, 13, -39, -540, -155, -98, -165, -155, -6, 139, -702, 683, 200, -22, 67, 41, 133, -97, -248, 31, -76, 489, 439, 31, 83, 369, 467, 400, -508, 78, 472, 209, 10, 538, 535, -249, 402, -357, -242, -188, 226, 126, -155, -119, 314, -179, 418, -309, -44, 345, -405, -155, 193, -167, -160, 135, -189, 283, -247, -358, 66, 74, -52, 76, 122, -18, 424, -444, 238, 314, -239, 400, -290, 13, -129, -228, -211, 354, 383, -187, -907, 78, -4, -218, 396, 435, 48, 205, -102, -520, -40, -242, 77, -639, -298, 38, -37, 330, -94, -382, -68, 136, 387, -224, -160, -184, -86, -436, 561, -363, 90, -53, -429, 392, -184, -341, -99, 50, -205, -427, 120, -45, 101, -49, 125, 879, -183, 265, 29, 223, -49, -314, 129, -174, -343, -153, -71, 450, -44, -570, -63, -151, -957, 153, 135, -499, 83, 48, -370, 165, 283, 551, 537, -44, 44, -314, 245, 239, -271, 134, -4, 2, -250, -187, -116, -51, 172, -123, -32, 239, -92, 159, -82, -402]
4981d02M37j41q4K19k06J36j9on6j38J70M2J57L35n30K80m21N30k94n1J77oo1
5004F8l13K45o2L89m47J47k07k4N99n97M59m24K22P63r88K82m33J54k75N71m65
5025c36J66p3L09q0K04K4n27L88J03O0K34o24j24M55l36k51M50k79j05L99P8l3
5047A02P3K44j02o3R3o83L09O8o0l98J04L37k79L56j86j49K00q8j58K64k29L07
5069F2l91J88J55R9k74J76j26J49k18N46k21j69j29L24r7j70m8P7k7J14J19j60
5091b1M78n04J36K1m9o92O32jk76L59K18m7k57R7k87N38j9j48j77j76M80m56O58
5114E07j46l21n60M35K2j17M34l75l41R7O21J06j238L20R89o42K69l63l96J083
5134C84k11j97L6k39j79j05J98K86M5l18J7Q6Q0k33mM08K2l3J16n8l1l56K46j87
$$ y = [-402, 35, -106, -190, 29, -177, -41, -60, -66, -122, -260, -90, -48, 109, 444, -86, 194, -227, 303, 9, -42, 135, 129, 68, -245, 0, -62, 327, -120, 27, -180, -204, 395, -202, 257, -167, 55, 818, -170, 112, -321, -167, -442, 129, -336, -170, -243, 66, -14, 190, 214, -313, 75, 178, 238, 472, -152, -276, 179, -157, -408, 42, -237, -342, 57, 135, 102, 175, 419, 317, 254, 347, -336, -27, 41, -19, -417, -313, 24, -255, 101, -85, -234, -34, -122, -280, -16, -245, 62, -329, -141, 14, 113, -161, 15, -111, 38, -180, 366, 145, -24, -153, 171, 74, -96, -144, -67, -94, 20, 139, -21, 457, -47, 89, 110, 61, -631, 1, 0, -276, 83, 301, 254, -3, 94, -193, 345, 326, 178, 1, -175, 305, -151, 507, 361, 40, -520, -85, -63, -180, 254, -121, -462, -365, 256, 362, -876, -556, 433, -209, 60, -303, -699, 384, 173, -24, 12, -227, -406, -511, -313, -27, 18, -300, -283, -197, -117, -350, -354, 54, 76, 43, 159, 101, 70, -286, -40, -227]
5158b27M34o57O01R9q8Np7l69j08j12J033m8m22J31k53J33M85M14j137L16o14
5179d61N64n17L50j80N22n65M73j52m05j12P84O2n60n2R89r11P9K19l45p33O31
5200c20N35p41L22j73P48n44l5M91j7m62L73j11j09n9q3j34M79j00m15K98K44
5221A87l19K61Rq12O14k3J18L4n62N23K70l90J6R1L23J03o08O57n59j34N11o52
5243c42L42K59o87M01Q8l0o4p7J96R1k17j59O14k66j89l68N04R2k69K75o4L09
5265D39q25L51R6K11m30K19L0N56n75j41M55o72K66N14l80k09k95L44N35n68k23
5286c02P73o53M28j28K74o10K40q57N90K43O7m66O60k06l71o03P91J92oK76K63
5307E95m70m53p1K63p37O75m16O47k48o1L83n28Q18j54j13N50q48j96O30l00K68
$$ y = [-227, 207, -450, 151, 250, 162, 167, 90, -279, -387, -499, 534, 486, 64, 195, -58, 75, 560, 974, -163, 153, -461, 103, -414, -64, -244, 278, -287, 186, 34, -371, -483, 301, 363, -197, -249, 740, -171, -92, 127, -218, -951, -320, 215, -526, -204, -377, 371, -173, -208, 283, 266, -196, 177, 66, -43, -102, -185, -319, 160, 60, -355, -57, 187, -132, 129, 138, -674, -60, -83, 35, 69, -493, 30, 300, -90, -74, 17, 340, 443, -165, 492, -67, -201, 310, -342, 0, 259, -428, -27, 61, 31, -33, -110, 86, 177, -40, -199, 415, 149, -40, -408, 96, 188, -81, 194, 130, 439, -386, -35, 61, 272, -158, 61, 91, 647, 72, -69, 386, -286, -20, 494, 114, -95, -390, -46, 489, -79, -302, 471, -182, 246, 118, 392, -218, 22, -835, -245, -2, 65, -401, 259, 53, -318, -921, -130, 62, 56, 332, 595, 125, -328, -399, -136, -873, -198, -614, 33, -215, -276, 107, -421, 397, 243, 130, 680, -168, -364, 266, -34, 234]
5328B34m54P5K89J18n99K00O7j26J9J88l12K73K31m41J31k69K65j55K98J15N6
5349B03k86Q5m21R01p99L71K51o18L13o2j38J43l51j01P86n42P7K82J98k14N25
5370F03k47o48k78O70nK88m78j32K47k59n70O53J60K67m10M02M07r10K23J37k86
5391a66k34L58K44k35J80M97q07k89M57L65m03K11J34k48J45p01R24m36N86j274
5411f92N51R96o39l01M79K72p15k24L5O38o14K22j13J34m06O42k63n70M05K7K41
5432A05L87q64J81L03O7l34l14Q32o78K76M66n54K05J92J35q21O31Nj70k43J66
5453b7k72N87l09l25Q44m74k58k16N39p5P83p18O6n14j54Q57p43O54n67P4L59
5474A11r69J182M3l17j76L1L90m52m3j31J78J96k38R43j045J59m68P06j73L29
$$ y = [234, -220, -145, 144, 262, -337, -137, -70, -196, -177, 11, -301, -28, 203, -238, -107, -376, -111, -266, 32, 147, 203, -83, 2, -419, 482, -317, 54, 305, -313, 0, -62, -200, -57, -408, -509, 277, -265, -188, 94, 292, 78, 603, 356, -292, -570, 100, 95, 383, -95, -227, 20, -239, -809, -156, 4, 271, -139, 263, 670, -240, -17, 120, -166, -400, -42, 202, -33, 147, 644, -163, -452, 5, 370, -33, 178, 312, 64, 209, -492, 432, -4, 582, -692, -141, 855, 216, -85, 394, 666, -49, -273, -238, 400, -214, 8, -105, 29, -377, 265, 2, -568, -163, -136, 105, 492, -372, -191, 112, 179, -155, -469, 363, -315, -39, 427, -127, 78, 270, 405, -416, 215, 220, 50, -193, -27, -299, 288, -21, -346, 498, 24, -234, -450, 89, 14, 797, 79, 145, -369, -523, 334, -409, 245, -322, -248, 111, -858, 324, 367, 50, -126, -95, 295, -157, -200, -331, -153, 43, -195, 748, -297, -138, -606, 100, -73, 256]
5494B56k46n66J04J038k61L95m45Q6n96k5M53n14P90q47Q02q4p79O12l45O61n66
5515g7J20J38r1n6J3K32l21jm33M7J244j63q68O91l71J06o06r9O67j54l04k45
5537e31Q91n50M39K90n34j78J64j07J19K92l4l09N07o59K79k42J94r6k7L71m72
5558a93O83p30P32n19R8l62L02l30J30Q9k27K56l77J031q47K32J29l3l70q3N83
5579A94o04J062m29n63O03j062P02K10R1l11j02k31M22j98n6L01N80r81P6L58
5599F2l94N5K13oL84M29n46P6k54j18q5J86L0M61l2K17n69qO3r1j326J052O0M32
5623B91l99L0m75O87o1L66K56j621J004M77j23ll26l65j7L55K10j08m91N25l43
5644a31K36LJ02j045J270l70R7L59j382Q63L75O3n99k78K16l85L28N50M95q87
$$ y = [256, 10, -556, -452, 586, 325, 720, 275, 361, -235, -260, 193, -321, 469, -378, 424, 340, -439, 173, -172, 489, -77, 43, 181, 90, 34, 47, 279, -42, -43, -476, -429, 815, 652, -216, 475, 104, 210, -396, -495, 172, 18, -286, -531, 360, -190, 249, 539, 5, -173, -9, -116, 3, 295, 261, -48, 459, -200, 79, -163, 31, -65, -92, 279, -193, 490, -240, 492, -27, 71, -291, 11, -319, -189, -100, -327, -71, -448, 583, -264, -32, 97, 64, -306, -389, 194, -410, 652, 223, -340, 263, -799, -97, 113, 204, -107, -209, -440, -18, -216, -272, 29, 609, -372, -296, 62, -332, -277, -64, -70, 314, 743, 197, 273, 19, -99, -184, 2, 32, 493, 461, 678, 109, 101, 164, 73, -1253, -201, -141, 291, -108, -78, -553, 134, 73, 439, 695, -926, 78, 555, 432, 429, 103, -262, -279, 76, 286, 178, -313, 212, -131, 105, 108, 210, -835, 435, 65, 162, 521, -861, 2, 377, 440, -159, -437, -221, -606, -278, 272, 767, -120]
5664a20J43k92k21Q11M4j79n62K53m30M49K4l63N11J98p55k19R29j13J60J16o35
5685b51j59K18pj57K52o11K75R65r47L20M09j129J435j008P84m93Kj94K7L86j2
5706A05P22q90P14j062L96j28L28l99M4k6N62l21J34n52L30K1L85j383M90J464
5726I34j231k93K91k13j25o5O52J3j25J57J16M13q65l02Q32K51N51n48j044P86
5746A85l73M58q66Q65q77Q5P52j27l88M7N63n14J030j475M75o7K71J92j81K72
5766C27p37L73q2R3m68J1L82k3m21M83P4l29J56k60J214j064j11J81k96J085o04
5787a6k4K99K72m85n24J25M42j8p3m1M08q08j7K21L36M33m57L83n09L39m12J60
5809C4k75L42j31q0q3Q9Q7N7j45K69m87J1J32Q4K10q4q0j89K48N11o40J63j91
$$ y = [-120, 23, -269, -490, 321, 365, 186, -376, -123, -553, -104, -80, -443, 68, 266, -489, -708, 221, 108, 268, 384, -251, -410, -192, -199, -356, -104, -715, -440, 525, -422, -102, 307, -822, 613, -395, 389, -104, -102, -296, -269, 117, 105, 827, -63, 651, -411, -15, -143, 185, -214, -170, -196, 366, 45, 179, -373, -43, -22, 363, -1020, -530, 934, -297, -590, -299, -512, -637, -702, -50, -37, -162, -5, 111, 524, -341, -643, 189, 440, 991, 443, -601, 185, -188, 270, -596, 269, -608, -523, 229, 102, -286, -239, 324, -190, 840, -635, -160, -227, 44, 236, 55, 327, -410, -37, -119, -26, -494, -483, -101, -124, -545, -62, 12, -317, -161, -421, 793, -271, -382, -201, -497, 588, -16, -40, 259, 531, 46, -478, -353, 89, 71, -2, -43, 365, -443, -460, -239, 97, 530, 73, 456, -53, 286, -126, 34, -241, 101, -30, -110, -193, -104, -17, 40, -105, 164, -323, -312, -180, -96, 114, 30, -50, -239, 9, 520, -120, 43, -148]
$$ [...]
8191B0
##END NTUPLES=NMR FID
##END=
