##TITLE=1H_Pr Cl-Am3
 CDCl3
 8 sc, 
 14.04.2022
##JCAMPDX= 6.0         $$ Bruker NMR JCAMP-DX V2.0
##DATA TYPE= NMR FID
##DATA CLASS= NTUPLES
##ORIGIN= UXNMR, Bruker Analytische Messtechnik GmbH
##OWNER= root
$$ XWIN-NMR		Version 3.5
$$ Thu Apr 14 11:28:14 2022 Russian Standard Time (UT+4h)  she@DPX200
##.OBSERVE FREQUENCY= 200.1317
##.OBSERVE NUCLEUS= ^1H
##.DELAY= (6, 6)
##.ACQUISITION MODE= SIMULTANEOUS
##.ACQUISITION SCHEME= undefined
##.AVERAGES= 8
##.DIGITISER RES= 18
##SPECTROMETER/DATA SYSTEM= spect
##.PULSE SEQUENCE= zg30
##.SOLVENT NAME= CDCl3
##.SHIFT REFERENCE= (INTERNAL, CDCl3, 0, 15.7039)
##AUDIT TRAIL= $$ (NUMBER, WHEN, WHO, WHERE, WHAT)
$$ ##TITLE= Audit trail, XWIN-NMR		Version 3.5
$$ ##JCAMPDX= 5.01
$$ ##ORIGIN= Bruker BioSpin GmbH
$$ ##OWNER= she
$$ F:/spectra/data/she/nmr/H-F/1/audita.txt
$$ ##AUDIT TRAIL=  $$ (NUMBER, WHEN, WHO, WHERE, WHAT)
(   1,<2022-04-14 11:27:12.56 +0400>,<she>,<DPX200>,
      <created by zg, POWCHK disabled, PULCHK disabled
       configuration hash MD5:
       00 E9 B6 7A A2 85 ED C7 34 08 36 98 17 FE 4E 26
       data hash MD5: 16K
       4F 0D 8A F1 A8 16 60 3A 7F E3 FA 5A 6F AD BF 40>)
$$ ##END=
$$ 
$$ hash MD5
$$ C8 66 27 63 40 A9 20 88 D9 05 2F 7B DE 96 79 96
##$RELAX= 
##$RELAX= 
##$RELAX= 
##$RELAX= 
##$RELAX= 
##$RELAX= 
$$ Bruker specific parameters
$$ --------------------------
##$DU= <F:/spectra>
##$EXPNO= 1
##$NAME= <H-F>
##$PROCNO= 1
##$TYPE= <nmr>
##$USER= <she>
##$AMP= (0..31)
100 100 100 100 100 100 100 100 100 100 100 100 100 100 100 100 100 100 
100 100 100 100 100 100 100 100 100 100 100 100 100 100 
##$AQSEQ= 0
##$AQ_mod= 1
##$AUNM= <au_zg>
##$AUTOPOS= <>
##$BF1= 200.13
##$BF2= 200.13
##$BF3= 200.13
##$BF4= 200.13
##$BF5= 200.13
##$BF6= 200.13
##$BF7= 200.13
##$BF8= 200.13
##$BYTORDA= 1
##$CFDGTYP= 0
##$CFRGTYP= 5
##$CHEMSTR= <none>
##$CNST= (0..31)
1 1 145 1 1 1 1 1 1 1 1 1 1 1 1 1 1 1 1 1 1 1 1 1 1 1 1 1 1 1 1 1 
##$CPDPRG= <>
##$CPDPRG1= <>
##$CPDPRG2= <>
##$CPDPRG3= <>
##$CPDPRG4= <mlev>
##$CPDPRG5= <mlev>
##$CPDPRG6= <mlev>
##$CPDPRG7= <mlev>
##$CPDPRG8= <mlev>
##$CPDPRGB= <>
##$CPDPRGT= <>
##$D= (0..31)
0 1.2 0 0 0 0 0 0 0 0.06 0 0.03 0 0 0 0 0.0002 0 0 0 0 0 0 0 0 0 0 0 0 
0 0 0 
##$DATE= 1649921231
##$DBL= (0..7)
120 120 120 120 120 120 120 120 
##$DBP= (0..7)
150 150 150 150 150 150 150 150 
##$DBP07= 0
##$DBPNAM0= <>
##$DBPNAM1= <>
##$DBPNAM2= <>
##$DBPNAM3= <>
##$DBPNAM4= <>
##$DBPNAM5= <>
##$DBPNAM6= <>
##$DBPNAM7= <>
##$DBPOAL= (0..7)
0.5 0.5 0.5 0.5 0.5 0.5 0.5 0.5 
##$DBPOFFS= (0..7)
0 0 0 0 0 0 0 0 
##$DE= 6
##$DECBNUC= <off>
##$DECIM= 32
##$DECNUC= <off>
##$DECSTAT= 4
##$DIGMOD= 1
##$DIGTYP= 9
##$DL= (0..7)
0 120 120 120 120 120 120 120 
##$DP= (0..7)
150 150 150 150 150 150 150 150 
##$DP07= 0
##$DPNAME0= <>
##$DPNAME1= <>
##$DPNAME2= <>
##$DPNAME3= <>
##$DPNAME4= <>
##$DPNAME5= <>
##$DPNAME6= <>
##$DPNAME7= <>
##$DPOAL= (0..7)
0.5 0.5 0.5 0.5 0.5 0.5 0.5 0.5 
##$DPOFFS= (0..7)
0 0 0 0 0 0 0 0 
##$DQDMODE= 0
##$DR= 18
##$DS= 0
##$DSLIST= <SSSSSSSSSSSSSSS>
$$ [...]
##$SUBNAM2= <"">
##$SUBNAM3= <"">
##$SUBNAM4= <"">
##$SUBNAM5= <"">
##$SUBNAM6= <"">
##$SUBNAM7= <"">
##$SUBNAM8= <"">
##$SUBNAM9= <"">
##$SW= 18.0516967727041
##$SWIBOX= (0..15)
0 0 2 0 0 0 0 0 0 0 0 0 0 0 0 0 
##$SW_h= 3612.71676300578
##$TD= 16384
##$TD0= 1
##$TE= 0
##$TE2= 300
##$TE3= 300
##$TEG= 300
##$TL= (0..7)
0 120 120 120 120 120 120 120 
##$TP= (0..7)
150 150 150 150 150 150 150 150 
##$TP07= 0
##$TPNAME0= <>
##$TPNAME1= <>
##$TPNAME2= <>
##$TPNAME3= <>
##$TPNAME4= <>
##$TPNAME5= <>
##$TPNAME6= <>
##$TPNAME7= <>
##$TPOAL= (0..7)
0.5 0.5 0.5 0.5 0.5 0.5 0.5 0.5 
##$TPOFFS= (0..7)
0 0 0 0 0 0 0 0 
##$TUNHIN= 0
##$TUNHOUT= 0
##$TUNXOUT= 0
##$USERA1= <user>
##$USERA2= <user>
##$USERA3= <user>
##$USERA4= <user>
##$USERA5= <user>
##$V9= 5
##$VALIST= <valist>
##$VCLIST= <CCCCCCCCCCCCCCC>
##$VD= 0
##$VDLIST= <DDDDDDDDDDDDDDD>
##$VPLIST= <PPPPPPPPPPPPPPP>
##$VTLIST= <TTTTTTTTTTTTTTT>
##$WBST= 1024
##$WBSW= 4
##$XGAIN= (0..3)
0 0 0 0 
##$XL= 0
##$YL= 0
##$YMAX_a= 108008
##$YMIN_a= -88267
##$ZGOPTNS= <>
##$ZL1= 120
##$ZL2= 120
##$ZL3= 120
##$ZL4= 120
##$ABSF1= 10
##$ABSF2= 0
##$ABSG= 5
##$ABSL= 3
##$ALPHA= 0
##$AQORDER= 0
##$ASSFAC= 0
##$ASSFACI= 0
##$ASSFACX= 0
##$ASSWID= 0
##$AUNMP= <proc_1d>
##$AZFE= 0.1
##$AZFW= 0.1
##$BCFW= 1
##$BC_mod= 2
##$BYTORDP= 1
##$COROFFS= 0
##$CY= 11.3945322036743
##$DATMOD= 1
##$DC= 2
##$DFILT= <>
##$DTYPP= 0
##$F1P= 2.36226072786647
##$F2P= -0.459571619588291
##$FCOR= 0.5
##$FTSIZE= 0
##$FT_mod= 4
##$GAMMA= 1
##$GB= 0.15
##$INTBC= 1
##$INTSCL= 1
##$ISEN= 128
##$LB= 0.24
##$LEV0= 0
##$LPBIN= 0
##$MAXI= 10000
##$MC2= 0
##$MEAN= 0
##$ME_mod= 0
##$MI= 1.114404
##$NCOEF= 0
##$NC_proc= 0
##$NLEV= 6
##$NOISF1= 3.799351
##$NOISF2= 2.8
##$NSP= 1
##$NTH_PI= 0
##$NZP= 0
##$OFFSET= 15.70392
##$PC= 1
##$PHC0= -18749.74
##$PHC1= 15.20075
##$PH_mod= 1
##$PKNL= yes
##$PPARMOD= 0
##$PSCAL= 0
##$PSIGN= 0
##$REVERSE= no
##$SF= 200.130013532006
##$SI= 16384
##$SIGF1= 3
##$SIGF2= 2
##$SINO= 400
##$SIOLD= 16384
##$SREGLST= <1H.CDCl3>
##$SSB= 0
##$STSI= 0
##$STSR= 0
##$SW_p= 3612.71676300578
##$SYMM= 0
##$S_DEV= 0
##$TDeff= 0
##$TDoff= 0
##$TI= <>
##$TILT= no
##$TM1= 0
##$TM2= 0
##$TOPLEV= 0
##$USERP1= <user>
##$USERP2= <user>
##$USERP3= <user>
##$USERP4= <user>
##$USERP5= <user>
##$WDW= 1
##$XDIM= 8192
##$YMAX_p= 0
##$YMIN_p= 0
$$ End of Bruker specific parameters
$$ ---------------------------------
##NTUPLES= NMR FID
##VAR_NAME=  TIME,          FID/REAL,        FID/IMAG
##SYMBOL=    X,             R,               I
##VAR_TYPE=  INDEPENDENT,   DEPENDENT,       DEPENDENT
##VAR_FORM=  AFFN,          ASDF,            ASDF
##VAR_DIM=   8192,          8192,            8192
##UNITS=     SECONDS,       ARBITRARY UNITS, ARBITRARY UNITS
##FACTOR=    0.0002768,     1,               1
##FIRST=     0,             0,               0
##LAST=      2.2672688,     0,               0
##MIN=       0,             -88267,          0
##MAX=       2.2672688,     108008,          0
$$ Real data points
##PAGE= N=1
##DATA TABLE= (X++(R..R)), XYDATA
0@%%%%%%%%%%%%%%oJ4j6J6j6J7k5L2l5M3m9N7p2Q1q9J04j20J37j57J80k03K28
36A21k58K90l23L60m01M46m96N48o06O71p41Q17r02R95j094J204j327J463j615
55h48J788j985K208k465K767l128L568m118M826n778P139r251J3016k1807Q3731
70F9663L8345j12642k6234O647J5303l2382k0014O384L8910J9496j5115l9907
82e1546k449L6563L4183n336l670K4389L0575l904k4949k5448j2144m987L114
95e609j872m710L874J2270k381j8766j1422O940P409N07N076J2734R793P1p954
110E960q514J166J4295R922r294j1904P342J1907j0782k8171j3376J4081J9816
123B448J698j4120p022J7318K0321r199l1827j0601K8412L0038k957k1796n931
$$ plain form
0 0 0 0 0 0 0 0 0 0 0 0 0 0 0 0 -6 8 -8 8 -8 9 -16 16 -19 24 -25 32 -40 41 -48 56 -64 73 -84 96 -107 121
36 121 -137 153 -170 190 -211 235 -261 287 -319 352 -389 428 -474 521 -573 631 -696 767 -848
55 -848 940 -1045 1163 -1302 1465 -1663 1905 -2213 2613 -3165 3974 -5277 7739 -14068 69663
70 69663 108008 -4634 -30868 -24221 -8918 -41300 -61314 -54930 -16020 3476 -11639 -51546
82 -51546 -53995 -17432 16751 11415 7745 32134 62709 58805 33856 8408 -3736 -8723 -5609
95 -5609 -7481 -12191 -8317 3953 1572 -17194 -28616 -21676 -14267 -13760 -8684 4050 13843 13914 5960
110 5960 -2554 -1388 12907 22829 13535 1631 8973 20880 10098 -18073 -31449 -17368 2448
123 2448 4146 -9974 -16996 322 20643 11444 -20383 -30984 -2572 27466 24509 2713 -3218
136c218J5353Q305j9742l2139q132K8152L0417l145j9711L21K0450P038j9576
149D373k1804N60J9611J5354m866j7040o043R455L438j7158j6424P051J9751J1281
163G539J165N82K826K107o29o326r592L64J0536L821r996q351J926l99q891o435
179a9753L970Q399O055L637j465k41O800O618p755j2318M648J6150J727j5238
193A234q926P758P325m922j2525n720R175J6039K098j6947j1223J1376J3806p407
207A141j7113J884J8512J1580o049j1104k396Q033Q308m489j2994k582J2657P495
221A2883r478j2492m27O035J268m126k970J919Q265P689j699r034k957O076L808
236D760m258l805L329O343J973m337n765j223M921L064m846n665L715O852k070
$$ plain form
136 -3218 12135 20440 698 -31441 -39573 -11421 18996 15851 -3860 -3539 16911 23949 4373
149 4373 -17431 -16871 2740 18094 13228 -3812 -9855 -400 3038 -14120 -30544 -23493 -3742 7539
163 7539 8704 9286 12112 14219 13590 7264 -2328 -1964 8572 12393 2397 -5954 -4028 -4427 -13318 -19753
179 -19753 -15783 -7384 -1329 2308 843 602 7402 14020 6265 -6053 -1405 14745 16472 1234
193 1234 -7692 66 7391 2469 -10056 -15776 -6601 9438 11536 -5411 -16634 -5258 8548 1141
207 1141 -15972 -14088 4424 16004 9955 -1149 -3545 4488 12796 8307 -4687 -7269 5388 12883
221 12883 3405 -9087 -9514 -3479 -2211 -6337 -9307 -7388 877 8566 6867 -2167 -5124 952 4760
236 4760 502 -3303 26 6369 8342 4005 -1760 -2983 1938 5002 156 -5509 -1794 5058 2988
251B988r126l867N028L874j666m341J063Q348O985l530p582R86Q596K191p890
266B057m513M877N354l395q041m644J925M826L08n047k308O475P018k601o567
281d276J104N925J909k290j841M94K478L126j063n867l645L917L921l892m798
296d798J421M561j01l802l048n71L129M858L25m796q5P513L900o513n294K998
312c03N728m29l680k970J87L162K023m231o695J274P572J144o015k433M649M160
328C143j993l523q05K124L948J456k643k844K511L655j950m567K55K924j87k203
344f99m60L21n14l33J41l16l15J236P63q01M62K106O93k184p94K080R65l81n39
363A431M7m74J30P57j798k994JK731J013k370k435N68L074K637j605l982J63N477
$$ plain form
251 2988 -6138 -10005 -4977 -1103 -2769 -7110 -6047 2301 9286 5756 -1826 -840 7756 9947 2057
266 2057 -2456 2421 7775 4380 -3661 -8305 -6380 -1554 -1246 -6293 -8601 -2126 4892 2291 -4276
281 -4276 -3172 2753 4662 2372 531 1025 3503 6629 5566 -301 -3946 -29 3892 0 -4798
296 -4798 -3377 1184 1083 -2719 -5767 -6338 -3209 1649 1974 -2822 -2907 4606 8506 1993 -3301 -303
312 -303 5425 4996 1316 -1654 -1467 1695 3718 -513 -7208 -5934 1638 2782 -3233 -5666 -1017 3143
328 3143 1150 -2373 -3178 -1054 2894 4350 1707 -1137 1374 5029 3079 -1488 -1233 1691 1504 -699
344 -699 -1159 -838 -1352 -1685 -1544 -1860 -2175 -939 -176 -977 -515 1591 2284 100 -694 1386 2351 1970 1431
363 1431 1478 1004 1134 1891 93 -2901 -2900 -169 844 -1526 -3961 -3393 -319 2318 713 -3269 -3106 2371
381B371L636l945n498J640N894J143n054m424J699M914K035l669m957J126N620
396B531R10n387l189K914L793k19k462j399o4K426K673j54l385L5L245J668j473
413B463k002k60j52Q04N29k212k599P62L261K17l188j171K124J192p29L53P90
430A82q0O6J822N77q94j07K01o21L99J030j108l614k93L242R71m199l417J878
448c965L476N30k307j606J587M551L153k663l902J242N352R92m852l942J039L377
464B062K66k727l781p20L203K140k495l558O79N045L001j461j809O06K379J988
480D818p34l435j861J918K119j149l168j215J039Q19p57j909o89J300L084R71
496A151o49P4J464P96p28q94J34l36j174k60R44Q3j188m89m40N92Q72j244j792
$$ plain form
381 2371 6007 2062 -3436 -1796 4098 5241 187 -4237 -2538 2376 4411 742 -4215 -3089 2531
396 2531 3441 -1946 -5135 -2221 1572 1353 -1109 -2508 -2572 -146 2527 2373 -1012 -977 2268 3936 2463
413 2463 461 201 49 853 1382 -830 -3429 -2667 594 811 -2377 -3548 -1424 -232 -961 -608 182
430 182 102 168 1990 2567 1673 1566 1767 1146 1545 2575 1467 -2147 -2440 802 1773 -2426 -5843 -3965
448 -3965 -489 41 -2266 -3872 -2285 2266 5419 2756 -1146 96 5448 6440 1588 -2354 -1315 2062
464 2062 2328 -399 -4180 -4900 -1697 443 -2052 -5610 -4931 114 3115 1654 -155 451 2830 4818
480 4818 4084 649 -1212 706 2825 1676 -1492 -2707 -1668 -849 -1606 -3515 -4204 -2904 180 1151
496 1151 502 576 2040 2836 2108 1214 1348 1012 -162 -422 522 605 -583 -1072 -1512 -920 -48 -1292 -3084
515c084J3M031K482j997k606R50K913N47k573k847J9L325K061k764l645N59M098
532A482J293l847l142J614L467J141r38j535J76K408J763j522m157q01K777J209
548A388j471k406j3J371K274Mk216j565K032L009l58k494M68K812Q57j851j979
565a38m15NP8j064p50J41J289N89r68J69J702N96j965n82K311J679j028j606L36
584C79J761K17j484k702o19J928J423j684k359Q93L078J204j952k348Q68J904
600E07J471o63k407J32K827J976j620l461m97K144R98j749k185k21K502K185j073
617H66l055m24L071J551j670k206Q29K453J100j349j816jJ546O26j618j938R28
634a107K067J48j894l87R74J263q36j109l42J298Q07n95j482J30J679P67j355
$$ plain form
515 -3084 -3071 960 3442 1445 -1161 -211 2702 3249 676 -2171 -2152 1173 3234 470 -3175 -2616 1482
532 1482 2775 -1072 -4214 -2600 867 2008 1070 -465 -289 2119 3882 2360 -1797 -2598 179 1388
548 1388 -83 -2489 -2502 -1131 1143 1147 -1069 -2634 -602 2407 2049 -445 23 2835 3692 1841 -138
565 -138 -553 -548 -470 -1534 -2284 -2143 -854 -265 -1233 -1064 638 1234 -731 -1313 998 2677 1649 43 379
584 379 2140 2357 873 -1829 -2448 -520 903 -781 -3140 -2247 831 2035 83 -2265 -1397 507
600 507 1978 1315 -1092 -960 1867 3843 2223 -1238 -1735 409 1407 -342 -2527 -2748 -246 1939 866
617 866 -2189 -2613 458 2009 339 -1867 -1038 1415 2515 1166 -650 -651 895 1521 -97 -2035 -1107
634 -1107 960 1108 -786 -1173 -199 1064 228 -881 -1223 75 882 287 -1195 -1065 614 1381 26
651B6j698J537J764j64k033l84J493J214n83j925r80J267J885j088k430p42K350
668d91J791j329j633P57K000Q38j013j562n01J892J722j325k313O3K068Q92k011
685a55j834M28J471Q25n02j764l32K334J710j968k320J198K680K81k050j321J618
702B99J883m83k228j272J445K134n82k629o01J984J414j124k379N68K028P92j181
719F8q72K51J427Q44j378j548O45J861j76j340j212Q53J084J39j038r75N83J535
737G51N70j413j247P91J804j34k105n12J167J624m85j566n13J465J663r95k229
754a364J69K187J096j867j483L67J954K86j785j448P78K191M11j941j298J284
770d63K282n13k064r92J908J849m97k165r91J263K303o78k373j061J909J955r11
$$ plain form
651 26 -1672 -135 1629 1465 -568 -952 541 1755 1172 -753 -1733 -466 1419 331 -2099 -2841 -491
668 -491 1300 -29 -1662 -905 1095 1933 920 -642 -1143 749 2471 1146 -1167 -1104 964 1856 -155
685 -155 -1989 -1561 -90 735 233 -1531 -1863 471 2181 213 -2107 -909 1771 2052 2 -1319 299
702 299 2182 1699 -529 -1801 -356 1778 1196 -1433 -2034 -50 1364 240 -2139 -1571 457 1249 68
719 68 -804 -553 874 1718 340 -1208 -563 1298 1122 -218 -1430 -577 507 646 -392 -1367 -784 751
737 751 1321 -92 -1339 -548 1256 1122 -983 -1495 -328 1296 811 -755 -1268 197 1860 865 -1364
754 -1364 -1195 992 2088 221 -1262 -895 1059 1345 -440 -1888 -1110 1081 1492 -449 -1747 -463
770 -463 1819 1306 -758 -1750 158 2007 1510 -655 -1646 -383 1920 1242 -1131 -2192 -283 1672 761
787G61k108l96J819J320p42j793n68J960J813o90k560j44J765J279j325j527L84
804g52J329O40j228j089J27J232Q13j115j436O44J667M14j647q95J265J385n27
821H27j323m23J301R00m60j481m80J359J073j008k070M00K089N65j725j176P38
838h94J973P39k189j631J141K439n0k126j521J966K299o16k289j150J746J991
854A828n07k200j251J584K248n27k232o45J543J800n53j839p02J398J641m90j654
871e58p80J425J440o79k070k9J313J052p21j409j18J662J028j302j597M45J863
888I65L98j837p37J066J664q04j351m16J491R58p82j666k06J861J087j679j631
905a619O23J919M50j655j162O36J781M44j339j583O59J866Q54k213j423P66K435
$$ plain form
787 761 -1347 -1743 76 1396 654 -1139 -1707 253 2066 1376 -1184 -1328 437 1716 391 -1136 -752
804 -752 577 1217 -11 -1100 -973 259 1072 -43 -1479 -835 832 1246 -401 -1296 -31 1354 827
821 827 -496 -919 382 1282 822 -659 -1139 220 1293 285 -1785 -1385 704 1269 -456 -1632 -894
838 -894 1079 1818 -371 -2002 -861 1578 1528 -598 -2119 -153 2146 1530 -759 -1909 -163 1828
854 1828 1321 -879 -2130 -546 1702 1175 -1057 -1702 -159 1641 1088 -751 -1453 -55 1586 1096 -558
871 -558 -1338 87 1527 848 -1222 -1251 62 1114 393 -1016 -1134 528 1556 254 -1343 -898 965
888 965 1363 -474 -1211 -145 1519 715 -636 -1052 439 1397 615 -1051 -1257 604 1691 12 -1619
905 -1619 -996 923 1373 -282 -1444 -808 973 1417 78 -1505 -846 1020 1874 -339 -1762 -996 1439
922A439j50j831j351J065J879L65j767j492J085K145M53k363j495J687J829Lk124
939f23j096J495J393k72j783p27J726J357m79j905j02J442R36j039j404J13J307
956C39P46p83j617O63J284L81j057j410Q32J612l44j186l50R60J332p19j143n62
974a022J322Q90q67j318jJ493J108j341j642L0J909M51j240j232N30J946O70j483
992B03j444O57J602N44j577j244N88J403O69j496j398O45J541M51j564j166R53
1009f33J677K20j346j132Q22J579Nj649p75J163J316j41j968k33J462O93o21j486
1027a047J10J160O85p68j058J12J319P14j145q55L56J120J2r19p30L63J317j7
1045G29o44o18N63N33J91j217o32Q05J046J1j071n45Q41Q21k23j416K8P97J144
$$ plain form
922 1439 1289 -542 -1893 -828 1051 1416 -351 -1843 -758 1387 1840 -523 -2018 -331 1498 1501 -623
939 -623 -1719 -224 1169 897 -886 -1613 113 1470 991 -914 -1016 426 1362 323 -1081 -968 339
956 339 1085 302 -1315 -652 632 1013 -44 -1454 -622 990 646 -540 -890 70 1402 683 -460 -1022
974 -1022 300 1190 323 -995 -996 497 1605 264 -1378 -1348 561 1012 -228 -1460 -930 1016 1686 203
992 203 -1241 -584 1018 1562 -15 -1259 -671 732 1401 -95 -1493 -848 693 1144 -420 -1586 -633
1009 -633 1044 1264 -82 -1214 -392 1187 1192 -457 -1232 -69 1247 1106 -862 -1095 367 1060 439 -1047
1027 -1047 -937 223 908 140 -918 -806 513 1227 82 -773 -417 703 715 -204 -934 -571 746 729
1045 729 85 -533 30 563 754 -463 -1095 -290 756 767 -304 -849 -8 813 590 -826 -798 -1 1143
1064A143o28j038k23J121J132j064j282K3J324N00j004q87M87J261L92j442j096
1081a281P30J102N07j527o46R32R79K0j131n27L18J276j01j159o29J129Q38l06
1099E24j228l48R92O93n04q59j32J061N27k26j191J64Q33R31r28j005k2Q83N20
1118F85q76m52n5J266K82o70q70J49O96M81p83n40M88Q91J25q64n43L70P39p4
1138D45q84j41P96M25k30p90j92P56M08l10o48j48O49M70m36o92J79Q20L80j049
1158a92p73M14J084j40o79o98N94Q94J96r70o18P99Q84k20o93n37M15Q85k72q74
1178e01PK68Q75k26p29l97N54Q42j85o63q40Q40Q37L8j067l89N84J117n43j234
1198h12N0Q28O99m94j035M1Q35L49n53l83J00P43L4n10o5m5O67j8m54m06K43N22
$$ plain form
1064 1143 515 -523 -746 375 1507 443 -839 -816 508 1008 4 -883 -396 865 1257 -185 -1281
1081 -1281 -551 551 1058 -469 -1115 -183 796 816 -315 -842 -524 752 651 -508 -1137 -8 830 524
1099 524 -704 -1052 -60 633 129 -730 -862 199 726 500 -691 -527 306 1237 309 -696 -718 165 685
1118 685 -191 -643 -698 568 850 180 -690 -541 155 636 -147 -687 -199 692 817 -47 -590 -220 519 445
1138 445 -439 -580 216 641 411 -379 -571 185 593 283 -365 -513 136 606 170 -522 -343 477 857 -192
1158 -192 -965 -551 533 393 -286 -984 -390 504 700 -270 -888 -89 795 575 -118 -655 -240 645 373 -501
1178 -501 -494 -226 649 423 -306 -703 -149 693 508 -155 -995 -155 682 720 -347 -736 -152 965 422 -812
1198 -812 -762 66 765 271 -764 -723 112 461 -92 -475 -375 368 402 -108 -173 -218 449 431 -23 -429 -186 336
1220C36j42o82J52L77L38j20n01j85N27M01k71n74m1O33M07m82o15M1Q92L2n32
1241ij035M61R69N00j082n21M95O54L08q56o05K42J121L0o42j008O84R90K17j364
1261d51j94N22P01J75j059n30N51P84J88j010m89O70Q24k20q17lJ80O65k44o81
1281d38j29O64L12n16l14NN88J45l59l41L15M18l11l39j94K14O58r8p35q7O50
1302A08K28r5o43j16O83L21m20l70n4O19K95n16m63j45Q79K29l45q62J69J029
1322E31J65o33o39j4R82J59o23n52K48Q42L06r24m90L61J030k63q51j12N30M69
1342E22j13n42p68P83Q80m39o46l39N14M46p8n95J07M72L19k34o44Q4N08K07m83
1363c9l19L2Q07m6n33j46K68K39J59n70l17L72M10j83m48MK97N21m76l34j53M88
$$ plain form
1220 336 194 -488 -336 41 379 259 -242 -427 100 501 230 -344 -385 248 655 173 -442 -401 491 523 -9
1241 -9 -1044 -583 386 886 -196 -717 -222 432 740 -116 -721 -479 642 672 30 -978 -294 696 913 -451
1261 -451 -645 -123 578 753 -306 -836 -285 499 687 -323 -812 -142 682 462 -355 -358 -178 487 243 -438
1281 -438 -567 97 409 -107 -421 -416 172 317 -42 -383 -68 350 39 -300 -494 -280 378 280 -455 -542 108
1302 108 336 241 -402 -518 165 486 66 -304 -358 261 556 40 -423 -568 311 540 195 -667 -498 531
1322 531 696 63 -576 -590 392 551 -72 -624 -376 466 772 -152 -642 -281 749 486 -365 -477 53 522
1342 522 409 -133 -901 -118 762 323 -323 -662 -148 298 220 -375 -268 204 523 289 -355 -271 237 444 -39
1363 -39 -358 -326 481 435 -98 -244 24 263 422 -148 -465 -93 317 134 -314 -310 -13 508 32 -302 -455 33
1385C3N71l10q76J58J084k1o62n62K91P67r0l48n48N31K28n7l58k59K05O78J8
1406D73o91k74K23O41M8o16l00M23K61nk26m97N51O42m63o01J67J82N42m12m40
1427c72k24M47O56m56n04J21P73P6n57j09j90N44k1j18l88K09K74J45m36l94M90
1448c4L05j14k89k28L36L91j52k05l28L35L93l07n58J14K58N76n07m23L05M63
1468C31J62m40m61K19M22R3o71l21N64L50O4k49l85M39K49k93k44j59M17o3K28
1489B52n68K10J81K47k57j47j11L22K11k73j98j33M68j57P8m95J22K76J62j12
1509G8l35J94K24R0m83k65L70K13J44k48m55L77J51J57k87j07J37J84jl50O1J29
1531b2J73k88n26P09J96j51J2k99L38j33M6j56J12k6L48j36j06n26K82J76j0k08
$$ plain form
1385 33 604 294 -582 -424 660 639 -23 -585 -294 473 383 35 -513 18 246 189 -169 -428 -223 455 473
1406 473 -218 -492 -269 372 420 -196 -496 -73 188 183 -43 -540 11 653 190 -411 -244 -62 480 68 -372
1427 -372 -596 -149 507 51 -453 -332 441 517 -40 -149 -339 205 184 66 -322 -113 161 306 -130 -524 -34
1448 -34 271 157 -132 -360 -24 367 215 10 -318 17 410 103 -455 -341 -83 493 -14 -437 -132 331
1468 331 493 53 -408 -189 233 326 -345 -666 -102 248 312 63 -322 117 366 73 -171 -330 87 24 252
1489 252 -316 -106 75 322 65 -82 -193 129 340 67 -131 -264 204 47 125 -370 -248 28 190 78
1509 78 -257 -63 161 251 -232 -497 -127 86 230 -18 -473 -96 55 212 -75 -182 -45 139 138 -212 -151 -22
1531 -22 151 -137 -663 46 242 91 103 -196 142 9 55 -101 11 -15 333 197 91 -435 -153 23 13 -195
1553a95J9N16j89J61n02j74L80L24k81l83J66L21O4j64m39p7N21K76o7n85K97
1574a1R4J43k61j88J81J90l43K34j79k7M45j59j54N6j74K49q4j4k46J12J63K56
1596B83j18n12R0L27K8j19j19K45P1j83M4j41Ro2K99j69j38M08Qk44m08K47L72
1619B18p4l92J17K46P8k42Pj40J94J66l01N2n9J36K14j20l11k1J80K25j46J3m43
1642d03L92J12J04l22k94M47J12Nl45K46J9J67k00j78k36M67K24l62j95QM87L9
1664B94k62j7j44k7M9J57j09j44M99Lm19J99Qr6m1k9P0Q0j20M7oj91L85l9l90
1689b43K21j2J83%j97O9k8J5M1k11O6n0K76P5j31k94L47J11j53j66k53K88L98
1712C52l93N2j98j09O51l37J08k92N21j86q8k3k82J74J41m3j25q7J57MJ57J0m65
$$ plain form
1553 -195 -176 340 151 312 -190 -364 16 340 59 -324 -158 163 227 63 -376 -453 68 344 277 -308 -11
1574 -11 83 226 -35 -223 -42 148 -195 39 -140 -167 278 119 -35 21 -153 96 12 -2 -248 -136 27 283
1596 283 165 -347 -257 70 98 -21 -140 105 176 -7 37 -104 -95 -157 142 -27 -165 243 251 7 -401 -154 218
1619 218 144 -248 -131 115 193 -49 -42 -182 12 178 -123 -71 -130 6 220 100 -211 -232 -52 173 27 40 -403
1642 -403 -11 101 205 -117 -411 36 148 153 -192 54 73 240 40 -138 -374 93 317 -45 -240 -232 255 294
1664 294 32 15 -129 -156 -107 50 -59 -203 296 299 -120 79 87 -9 -50 -79 -9 71 -49 -2 -8 -199 186 147 -243
1689 -243 -22 -34 149 149 -48 21 -7 8 49 -162 -96 -146 130 205 74 -220 127 238 85 -81 -334 -46 352
1712 352 -41 11 -187 -296 355 18 126 -166 355 169 81 58 -224 -50 91 48 -77 -164 -7 -3 154 164 -301
1735c01J62K59j15J7J31j73J59j00j38L7p5J80j98l0J80K51m05J54L3J25O6j40
1757G9j75K93j40j28M8p7O8K9K88n0m40j49O27j12l19j45N8L00L10l22j96OJ42
1780eK66j64k24J0K77j15j10j73o4L31J78r0lj05K2K62l48p1K31P5J26n39jJ34
1804a00J60%j50r7J84K43j45k2q5M9J82k69k82K39K9J92K7k67J20K16n7j11j83
1827a27J34J64J53m51J18K6J12J69n35J88RQJ54j92q3K85R2l21m3M9L0J10j8M
1851C5l87K91J68M1l89P6L69r3j5j55k42K89J82j95j17J33J69K40k60k21k9L80
1873B70o3k35j37k0M21j07k36K6J03K23j25j70K02r8K0k07j15J38m5K46k69K9
1895a49lK16J70k55k40K95j83M13k13r7n6K38j34k5l28M05J93q6p4k40k2L58M5
$$ plain form
1735 -301 -139 120 5 22 153 -20 139 39 -99 -62 -137 43 -155 -185 -5 246 -159 -5 28 153 219 79
1757 79 -96 197 57 -71 -23 -100 -32 -3 285 235 -205 -354 273 161 -158 -303 -245 55 365 43 -153 -147 -5
1780 -5 261 97 -127 -117 160 45 -65 -238 -302 29 207 117 114 9 31 293 -55 -126 105 180 306 -233 -234 -100
1804 -100 60 60 -90 -187 -3 240 95 73 -12 37 219 -50 -332 -93 -64 128 155 -112 8 224 167 56 -127
1827 -127 7 171 324 -127 -9 17 129 298 -237 -49 -40 -32 122 -70 -153 132 224 -97 -140 -91 -61 49 31 35
1851 35 -352 -61 107 148 -241 -165 204 111 96 -59 -301 -12 170 -25 -142 -9 160 400 140 -81 -110 270
1873 270 207 -28 -165 -185 236 129 -107 -81 22 245 120 -50 152 54 74 -133 -248 -110 -155 91 -178 -149
1895 -149 -152 64 234 -21 -261 34 -149 264 51 -46 -102 136 2 -23 -351 54 247 161 87 -153 -175 183 228
1918B28m61J63J3K12l65L7M8M05q6j31l00l9L63J55j65k35Q3K60J29l81j22J68
1940b1J19J2l01J41j7J59o3j24n0J27J18j31m6Pj98L05K80k74k27K93J59j49r0
1963B9k75J38M31k05j07j44j03L31p0j42q1N02k83j75j04m0M92k04j55j7J56J29
1985A03L6l33m0K10K46p9J1l02J62J22j09k95o0K57K65j61l50N05NM4k61j11K07
2008G2J37K70o45J59n7o7K91j96j42J74q8L52l56j46L36K19k39l54j44N47J04
2029B27n6n39J35P66m23j1l37K46K73q6M3m76J04K12K07j31k43j02L61k38K23
2050A55l44K1K92K80m52j60R9K56J94l85j75K78j55K73k46j32K55J76k88j9n3
2071a30L53r8p2N6p1m9L04j04l11pK33lJ15q6l55L12R1j27k09J36N7K6Lk26Q5
$$ plain form
1918 228 -233 -70 -57 155 -210 -173 -125 280 194 63 -237 -276 87 242 77 -158 -75 185 314 -67 -189 -21
1940 -21 98 110 -191 -50 -67 92 29 -95 -145 -18 100 -31 -77 -70 -268 37 317 43 -184 109 268 119 29
1963 29 -246 -108 323 118 11 -133 -236 95 25 -117 -198 304 21 -154 -258 -298 194 -10 -165 -182 -26 103
1985 103 139 -194 -234 -24 222 143 154 -148 14 136 27 -268 -328 -71 194 33 -317 188 193 237 -24 -135 72
2008 72 209 479 -166 -7 -64 -131 160 -36 -178 -4 -92 260 -96 -242 94 313 74 -280 -424 123 227
2029 227 171 -368 -233 533 110 99 -238 8 281 195 238 -238 -134 78 285 154 -89 -191 170 -68 155
2050 155 -189 -168 124 404 -48 -208 -109 147 341 -44 -219 59 -96 177 -69 -201 54 230 -58 -77 -130
2071 -130 223 125 53 109 38 -11 293 189 -122 -129 104 101 216 130 -225 87 178 51 -158 -22 35 61 64 -162 -77
2096g7K12k6k0l81J11L69Rl73J02N2L40j80q9m3j10L27K7m84M0J48J36L34o27
2119b03K66j18L00l69j42J85L8L25k09l24P3J5K08M9k63Q5J16j2K54l23j49J0
2141a88K02l19M46k57L05q5j67o2j2m3K95j13k27L09j52P5l42L79J2K24l60o6
2163a46L2K26j8q0k78l3N09l6l49R0p9J27J80j65p6M0K41k23m5j85L6L73j02l23
2187b84pK93O2Q5k38k78P8N57m33k3j05L48J7j42m6j70J61Q4R4m85L97O1M5k20
2211a49K6J91P3J25k55l63J31K31k3O2j9j00L9j01J11n4n3N99m39k12j08K60J44
2234A16m5k19L6oK95j83j19J64O6M0l57l52O62p9N3l0k33L77j86j60j18J90J21
2257C3M73j67k99k40JL35K38l66R7j23j33O6l1J15j97L69k05J71l36J24N05l85
$$ plain form
2096 -77 135 109 89 -292 -181 188 197 -176 -74 -22 318 138 49 6 -104 223 250 -234 -194 -46 90 424 -203
2119 -203 63 -55 245 -124 -266 -81 -43 282 73 -251 -178 -163 45 94 -169 -84 32 20 274 -49 -198 -188
2141 -188 14 -305 141 -116 189 104 -63 -125 -137 -180 115 2 -225 84 -68 7 -335 44 56 280 -80 -146
2163 -146 -114 112 94 14 -264 -297 212 176 -173 -83 -162 -35 145 -20 -96 -56 185 -38 -83 -268 -232 141 39 -284
2187 -284 -291 2 64 149 -89 -367 -289 268 -165 -188 -293 55 72 -70 -116 -286 -125 -41 53 -432 -35 26 71 -149
2211 -149 -123 68 141 266 11 -352 -221 10 -13 49 30 -70 -31 -132 -21 -75 -128 471 32 -180 -288 -28 116
2234 116 71 -148 -112 -118 177 -6 -125 39 105 145 -212 -564 98 19 72 42 -191 186 0 -160 -278 -88 33
2257 33 506 339 40 -200 -199 136 374 8 105 -18 -151 -85 -116 -1 -198 171 -34 137 -199 -75 430 45
2279D5j88P4j05L75k97q8J89J93r7j74k03J44m8J97K1l7j72N16l11r6q2J48k2
2302a8J48k17k18L61j0L79n75MJ28K04j74q6k08N12q3k06N4l35M84r9j29K38j22
2325C2o9J06q4j80k8K31J84l98K72nr3J52Oj88n1L5O0J88j15J63n6o4r6K4O7J36
2351B29k76J68j19j65K70l00J26J75no6Q6k37M4j68P37m13l96K58K21k67K16k03
2373h5m1L56n4K5m32M36rk26ok4o4L30j13p3j63K13k3L1k40J77j90M32l56j82
2397b81J49J51m0O2j15j33J76J7j05P8r3M16K81n90j90M3K35k14K8K29j42K59
2419B21j1m02j15L55J39P0l25K80k12J52J57n08K17R1k58K99l13j57P30k60j52
2440bj66j46K01M03k72n8J7j10K94l01R0n4L5M50n19j73K27L10j80k32J67j27
$$ plain form
2279 45 -143 -69 -174 201 -96 -184 5 198 101 -73 -276 -132 -180 17 38 1 -171 345 34 -62 -144 4 -18
2302 -18 130 -87 -305 56 46 425 -150 -146 -18 186 12 -74 -282 230 147 -59 -5 -340 144 45 -84 154 32
2325 32 -37 69 -15 -195 -223 8 192 -206 66 61 -32 120 126 -62 -113 -78 -18 170 55 218 162 98 2 26 93 229
2351 229 -47 121 2 -163 107 -193 -67 108 103 37 123 -114 -70 -238 499 86 -310 -52 169 -98 118 -85
2373 -85 -126 230 176 201 -231 205 196 -30 -36 -60 -124 206 93 20 -143 70 47 78 -162 15 -175 257 -99 -281
2397 -281 -132 19 -21 41 -74 -207 -31 -14 -119 -41 -134 282 563 -27 -217 -174 61 -153 -125 104 -38 221
2419 221 210 -192 -307 48 187 257 -68 212 0 152 309 -199 18 109 -149 150 -163 -320 410 150 -2
2440 -2 -168 -314 -113 290 18 -40 -23 -133 161 -140 -50 -104 -69 381 -138 -311 -84 226 46 -186 -19 -146
2462a46N28k40K36l82k3K54l80j25QK29L6p8J16m8L21j19m5l6l9J12n9k37j41
2485b58O2K91k3l23K49m05N28j84q4qJ52M3k41J99M8M1K4O9n53J98M64m4j67l49
2509b71J19J24r4K74j14J03l65L35N2k93J25L0j09J31j77J3M7qR3p0p2J51j10
2532h6Pq2R4K35l73K27j37J51J8j60m3J68o1N7Qq9J41l99L93l86K20j25K53r%
2557B2k00k16N93k55J09l26P5K02J84m11K52J67P0o6m65P0O4L36j51P7l47K97
2579H1Q1J3k16J32j49J57j91J2N4K5K5Rj84K21k10L03%r8l5k4J85k33m38M76L5
2604C1PJ63k72n2M0K67l99P3K82L30j83m97L01J65k39m2j33N6J02n2R0M0p0Q0
2628H8p1j43K98k33nJ37J48m36R4L1K67N4j99k16PL39P0j05j74J3J85j39j30j4
$$ plain form
2462 -146 382 142 378 -4 -27 227 -153 -278 -270 -41 -5 -83 33 -15 306 187 142 106 67 179 120 -117 -258
2485 -258 -196 95 72 -251 -2 -407 121 -63 -147 -155 -3 40 -201 -2 46 87 111 180 -373 -175 289 245 78 -271
2509 -271 -152 -28 -122 152 38 141 -224 111 163 -130 -5 25 -84 47 -130 -117 -70 -78 15 -55 -127 24 -86
2532 -86 -79 -161 -67 168 -205 22 -115 36 54 -106 -149 19 -42 15 23 -66 75 -324 69 -317 -97 -222 31 22 22
2557 22 -178 -394 199 -56 53 -273 -198 4 188 -223 29 196 266 200 -265 -195 -131 205 54 131 -216 81
2579 81 162 175 -41 91 -58 99 -92 -80 -26 -1 24 33 -151 70 -140 163 163 65 30 6 191 -42 -480 -4 31
2604 31 38 201 -71 -123 -83 184 -215 -142 140 470 287 -210 91 256 17 -25 -158 -102 0 -52 38 78 8 88
2628 88 17 -126 172 -61 -66 71 219 -217 -123 -92 175 229 30 -186 -179 160 230 125 -49 -36 149 10 -120 -134
2652a34p8M49l96m5K42m3n3j41L2N0M24j59k29J85k51k67N01k54J62r8K21k3j64
2675f9K61pk11J75k09k08O19j05j25J7k09P6n6K11j91j1K07J15r2k61K32L4l01
2698a08j55J59J66J24l04L9J09j27R6K83l98K06n8mj25J00j08K59j47R3j84j88
2720b72J44J96m15L72o7J71JJ18l44J20j00P0m9j01K71j47Q9j61M2N7J85j56k60
2743b36J51K51J3l76L55j16q2n9P5J10K7k07J2N8Q1l4M6K11j29j37j84N2O8m3
2767i3J32K1l4K53j24j40K4J58k5q5r1J8N7nj27j9K23j62R4j68L9P5r3K59l16
2792a29J62n2L7J4l23J86k7J83j91O2J60j32k8j6J20q8K46q2k02j67L24J42k74
2815g5k04L12K7m5j73K2j05k6K94l15K37J35q9o1n4J23J19k19L82l94j91J91M04
$$ plain form
2652 -134 -212 237 -159 -204 38 -5 -58 -199 -167 -117 307 148 -81 104 -147 -414 87 -167 -5 -103 118 95 -69
2675 -69 192 185 -26 149 -60 -268 351 246 121 138 -71 5 -51 160 -31 -42 165 280 188 -73 159 193 -108
2698 -108 -263 -104 62 186 -118 -79 30 -97 -1 282 -116 90 32 28 -97 3 -105 154 7 100 -84 -272
2720 -272 -128 68 -347 25 -42 129 130 248 -96 24 -76 -6 -55 -156 115 -32 57 -104 -62 -5 180 24 -236
2743 -236 -85 166 179 -197 158 42 -40 -99 -24 86 113 -94 -82 -24 57 23 69 280 151 14 -170 -118 -50 -93
2767 -93 39 60 26 279 155 15 39 197 172 87 -4 14 71 66 -61 -80 143 -19 75 -93 -54 21 -72 187 -129
2792 -129 33 -19 18 32 -291 -105 -132 51 -140 -78 82 -50 -78 -94 26 -62 184 102 -100 -267 57 199 -75
2815 -75 -279 33 60 15 -158 -136 -241 -267 27 -288 -51 84 -5 -66 -120 3 122 -97 285 -109 -300 -109 295
2838B95m8l07J02j3L6J70j54p2P1l9P7l27L22J7j50K86j93j02K36j48J0J23j62
2861C0J17j92L2K9np1Q3j67q4L68l04k4M22j62j39L65m6k76J7j0K52l21J10r1
2885f7K32j64K60j54Q7j19P2k67K48k46O1J09L6j17QK9P2k41q8J37K60k3p1J8
2909G2j36L74k95K36m09J57K84k34j77J5p0pMj05j1L35jj8n2J56k08K29j52J34
2933A21l76K09L31j76n8r7r1j59J25J44K06j23j4k09J17N2RL0N5r8NO0N5k73J21
2958c4K2n9J36k17K03k21J06J63k19M6J39k55J74k9J56N6k6l8p8R7k17M53m71
2981a13lJ28J33Q4l64P5o1l7L25k42J45M4k21J87m3k92L54r5q9l1J2J52M0q9M4
3006D3L5J37k01j28O1J42J06nK6l68N6L15j86l6Q6l6L8k15J01j87L36k26J35J43
$$ plain form
2838 295 247 -60 42 29 65 235 81 9 80 41 118 -209 113 130 -20 266 73 -29 207 59 69 192 30
2861 30 147 -45 -13 16 11 -60 23 -144 -228 140 -164 -188 234 72 -67 298 252 -24 -7 -17 235 -86 24 -67
2885 -67 165 1 261 107 194 75 147 -120 128 -118 -57 52 88 -29 -21 8 80 -161 -249 -112 148 125 54 72
2909 72 -64 310 15 251 -158 -1 283 49 -128 -113 -183 -190 -186 -291 -302 33 32 14 -38 118 -90 139 -13 121
2933 121 -255 -46 285 109 51 -46 -137 -296 -171 -27 179 56 42 -167 -50 2 11 41 96 -2 3 63 118 -155 -34
2958 -34 -12 -71 65 -152 51 -170 -64 99 -120 -74 65 -190 -16 -45 111 167 141 103 25 122 -95 358 -113
2981 -113 -116 12 145 229 -135 -60 -121 -158 167 -75 70 114 -107 80 37 -255 99 4 -85 -116 -104 48 88 -1 43
3006 43 78 215 14 -114 -53 89 195 190 216 -152 -96 219 33 -3 83 47 85 -130 -29 -216 120 -106 29 172
3030A72k21J29j07R3j11J7M7R9k02p6L5J52l4N0O1j83J2J77k55M54k84r1Q6j9
3054Aj26J70O0j94M9L1j86K84P8j86j26j50M03O4j96M6j66R4K24l68J79K7o4L32
3078B80n23L38j45K37m76K0Q6J32K43j77K59o56L19L19k37N2j19O7QP4p7j19N3
3101d2K32l67J08K78j83l5J79l82M72k07j41J2k08L97j9j10J52j18L9J3k46k6
3123b02K00j02k0K76j21n7J67j52M3n9n1K11m8j74r6J95P8n4j0j91R8K57Q6j04
3147A70m17L6K30K0j16K25k29K23K2l66J42q4L0K28k38J60r7L90m71J09k36K15
3169e4n0J25j63O5L49j88J21j77j27P1J47q2m8R0j67J16ok53L48o4M2J08l55q9
3193b41L79o5j06k54K15K15l00J82j59L07j49K31m01J03p0n0M0j68L16j64K97
$$ plain form
3030 172 -49 80 -27 66 -45 -28 19 118 -84 -160 -125 27 -7 43 104 -79 -67 110 -145 309 25 -66 20 1
3054 1 -125 45 105 -89 -40 -9 -195 89 167 -19 -145 -295 108 172 -24 22 -144 -50 174 -194 -15 12 -52 280
3078 280 -243 95 -50 187 -289 -269 -183 -51 192 15 274 -382 -63 256 19 71 -48 19 27 101 24 -95 -42
3101 -42 190 -177 -69 209 26 -9 170 -212 260 53 -88 -76 -284 113 94 -16 136 18 57 70 -176 -202
3123 -202 -2 -104 -124 152 31 -26 141 -11 32 -27 -78 133 85 -89 -185 10 88 34 24 -167 -69 188 274 170
3147 170 -247 -211 19 39 -77 148 -81 142 164 -202 -60 -144 -114 114 -124 36 -61 329 -142 -33 -269 -54
3169 -54 -104 21 -142 -77 272 84 205 28 -99 -28 119 37 -11 79 -88 28 22 -231 117 53 95 203 -152 -241
3193 -241 138 73 -33 -287 -72 143 -157 25 -134 173 24 255 -146 -43 -113 -163 -123 -291 25 -139 158
3214A58l57p3K60J54Q9k54j14K03M0j42O4k51O8L99j56j20j63K11k54J96L65l50
3236b7K66o1k55R7J2O4l36k4j01L65K27k44N5m5l3L5R7j74m5J93K1k20J70q9K35
3261A83J01k28j58Q3m8K57k36K3j81M69q8Q0l88L14j40j25r7K00k72L14MK58k92
3284C3R0J2K0j4k93L68j42j40J82r5o8k92K79K2J33l2q8P2o3L6M7J13j30m8r5
3309i3lN20k92J5Kp9k60M8K38J50J03k09j20j94M2j76K41m3K0N6L7J16k28J1J07
3334Ik56L22k38J06j1j7J73m2n6j05JM1J24n4M7K73k10l22K67M4Kk08M6L5R1O3
3360A25l06m5K73R3n4J75l80L01k1j43j49L7R4j27l4j1j66J45N22m03k6K22l86
3383b64K20O5J04j05j41R8J27p1R3K4p5K8J95m28K43j54K13k84N1m5K48k12k00
$$ plain form
3214 158 -199 -272 -12 142 231 -23 -137 66 106 -36 28 -223 -155 244 88 -32 -195 16 -238 -42 323 -27
3236 -27 239 178 -77 20 32 96 -240 -264 -365 0 227 -17 38 -7 -40 -5 92 -82 -127 66 87 -133 37 -52 183
3261 183 284 56 -102 -19 -67 190 -46 -23 -204 265 177 257 -131 183 43 -82 -179 21 -251 63 67 325 33
3284 33 123 135 155 141 -152 216 74 -66 116 21 -47 -339 -60 -38 95 63 -25 47 -16 20 67 180 50 2 -93
3309 -93 -96 424 132 147 149 70 -190 -142 96 246 349 140 20 -174 -132 -308 -67 -110 -90 -34 3 119 -109 -98 9
3334 9 -247 75 -163 -57 -68 -85 88 46 -10 -115 -114 -73 51 -3 44 317 107 -215 52 96 98 -110 -64 -29 62 125
3360 125 -181 -226 47 140 86 261 -119 182 161 18 -131 -94 0 -127 -161 -172 -338 -193 329 -74 -100 122 -264
3383 -264 -44 21 125 20 -121 -23 104 33 126 150 75 103 298 -130 113 -41 172 -112 -61 -106 142 -70 -270
3406b70J39R1k2K37l18K39p5p1J47k22K94j04j86j25J86O4j04P2J96q3j12kJ28
3429I9j75O4L03k41N1m2k88K93k99J15J0M0J13Q9k59l4K02J5p8K5J4K62j63ok7
3454H3N3o6n5M8l2j32j05N23k89M1k40N5K21l4j80O3J17J45j63k74J41K24p5L2
3478A01jp7j56K62k38p8J01J34j60L05j2kp8j51j00K5J77J79n52L64n9r3J5J4
3502h0N8j20J77k44M42j02j52J18k3j1j46j13M01m18K99m3J13k34pmr3L0R9L54
3526C01m67J55l4K30j56O6k4P5j27O2j93jK38k70J38q1J82q9mJ60q6j57p7N8J08
3551GL3j52J71o0k06N8N8J26k87J77K23J5l7M4n6j23q2L22k69J32m4J33k10j03
3575a30J59P6k58O4J51j10p6K06j06p2J0r2P4PK38k69J99j05K47k4k45J99l12
$$ plain form
3406 -270 -131 -40 -62 175 -143 96 21 -50 97 -125 169 65 -121 -246 -60 4 -100 -28 168 85 -27 -29 99
3429 99 -76 -12 291 50 101 59 -229 64 -235 -120 -110 -70 43 132 -127 -161 41 56 -22 3 17 279 116 110 83
3454 83 136 70 15 63 31 -101 -206 317 28 69 -171 -116 105 71 -109 -46 71 216 53 -221 -80 144 69 101
3478 101 100 23 -133 129 -109 -187 -86 48 -112 193 181 179 101 -50 -150 -125 52 231 -321 43 -16 -109 -94 -80
3502 -80 -22 -142 35 -209 233 131 -21 97 74 63 -83 -196 205 -213 86 43 156 -78 -85 -89 -182 -152 -53 301
3526 301 -166 -11 -45 185 29 95 71 146 19 81 -112 -113 125 -145 -7 -88 94 5 1 161 75 -82 -159 -101 7
3551 7 40 -112 59 -1 -207 -149 -91 35 -252 -75 148 163 126 170 114 -9 -91 231 -38 94 50 183 -27 -130
3575 -130 29 105 -153 -89 62 -48 -124 82 -24 -96 -86 -178 -104 -97 141 -128 71 -34 213 189 -56 143 -169
3598a69K11O6J8k33J15J38P6l05J7J39p3j8N8J6p0k05n6L82J2ll4O3l17K30k04
3623a46J22O9l13K15K24k00j73j23K11J35J39l84K60k20J69O8k86J60J23k24L32
3644A58j57j82r0L09j45Q5j5R1m3j61K39R7l96J82J9N8j84J02J07j55k08K96m6
3667c9q3k1K09L18m45n6K26k14l2j4j5J85k70M08l25J9R0K15j69m9J34k0k10j03
3691b61L64J27n38N14l17J15j57M7L52l03J63P1j93J04k26K95n2j6k7k01K7L70
3713B58l03l4K22p5o8j22J88J25l35J14J35k31M16n39ML39Q6q3j48J70k29K00
3735I0l32Q3R5M0J77j87j79R6J21K18l06m1J54J10j79l01J40J79Q7L0J33j85K45
3758B88K3k76k89O3q2K46K2j61J92o2J13n8r3n1n6J97J52k44R0J57j35k81L73
$$ plain form
3598 -169 42 108 126 -107 8 146 222 -83 -66 73 0 -18 40 56 -14 -219 -275 107 119 116 82 145 -172 58 -146
3623 -146 -24 45 -268 -53 171 -29 -202 -325 -114 21 160 -224 36 -184 -15 53 -233 -73 50 -174 158
3644 158 1 -181 -271 38 -107 -22 -37 54 11 -150 89 186 -210 -28 -9 49 -135 -33 74 -81 -289 7 -39
3667 -39 -122 -143 66 384 -61 -117 109 -105 -137 -151 -166 19 -251 157 -168 -149 -59 156 -13 -62 72 52 -158 -261
3691 -261 103 230 -308 206 -111 4 -153 -106 246 -57 106 177 -16 88 -138 157 105 89 62 -139 -112 258
3713 258 -45 -79 143 68 0 -122 66 191 -144 -30 105 -126 290 -249 -245 94 180 97 -51 119 -110 90
3735 90 -242 -159 -64 -24 153 -34 -213 -117 4 222 -84 -125 29 139 -40 -341 -201 -22 65 95 228 43 288
3758 288 311 35 -254 -191 -273 -27 -5 -166 26 -36 77 19 -74 -125 -181 16 168 -76 14 171 36 -245 128
3781A28j49N1O0j14P0o6p9K11p2k89J22n0J20R3p6J63n5k03R8N5j23p7J79Kk58
3806b59M91m01K14j98L37k48p5J63l7P4O8j4j16K33k37r5J52n4Q7j62J22Q3M3
3829A71o3k53L78l13J45j26K29L3j48p9J54j61p0J21n1j43K74j21r9l2j12L0k0
3852b56M48l35q0J40Q8lP5J08l50K84l18L37j97jR5M9o2M4k18O1P0k07J52jJ67
3877I0K56k55k58K41N4k56K47p9P1k40P4K74k71oJ12J63m08K44l7jJ01J46k58
3900DJ53j88l6P4k4O2n7L7j17O3k6k86N89k09q9J3J95j36J24j26l5L1j41R5P5
3925D5j5P2j84q2J70j55K21p9J72m05L77p4J29k68Q6J90k53o8J02K17k79N5k41
3948b67K09J34%n7J80K5J42k51J0k76L64k04L0j04J9j15K84O0k3j11j3M6K3J54
$$ plain form
3781 128 -21 30 90 -24 46 -20 -99 112 40 -249 -127 -177 -57 36 -40 123 68 -135 -37 18 -105 -182 -3 -1 -259
3806 -259 232 -169 45 -153 184 -64 -139 24 -13 61 129 115 -1 232 -5 -100 52 -2 85 -77 45 128 171
3829 171 108 -145 233 -80 65 -61 168 201 53 -26 128 -33 -103 18 -33 -176 98 -23 -122 -154 -266 -236 -256
3852 -256 192 -143 -223 -83 5 2 77 185 -165 119 -199 138 -59 -60 35 84 22 66 -152 -91 -21 -228 -76 -77 90
3877 90 346 91 -167 74 128 -128 119 40 111 -129 -55 219 -52 -58 54 217 -191 53 16 15 116 262 4
3900 4 157 -31 -67 7 -17 45 -12 25 -92 -29 -55 -341 248 39 -50 -37 158 22 146 20 -15 16 -125 -30 45
3925 45 30 102 -82 -164 6 -149 72 -7 165 -240 137 63 192 -76 10 200 -53 -121 -19 198 -81 -26 -267
3948 -267 -58 76 76 19 199 224 366 115 125 -151 213 9 39 -65 -46 -161 123 183 160 49 36 82 105 259
3972B59l86N95p28K46o4Q2k3j94L58J51o21K73J23k7L4nj65J56j22J74l7J54k23
3995A0J5n4J13j02L8J1m2j80P8lK26k05j79Q5K21m3ok9R2m2k9j4P0j05O5j87K16
4022B0j24m6K86j73o5L28p1j80PM8K71m23R7J49j40n4k2j9J60P7j21J21M1j80
4046a3l7J65j71OR8kJ5k49N3o9J33J73J58k21p8J78k40J98r3j07J00j9R7n1m0
4071a6K21j63j71N0l9J96j66R9J00j64N6K01k68K06p5j77j41K42K2j49J22K0m7
4094d1l4L9K19k60K3L9J67l68K78J21l15P6J5J09n7r2K90k56J33j73kp5K87kJ8
4119A39j80N8j85K48j70p0K43j26P1O6l3L7m4j2j29P1J38j66J5l53K28K91n8l5
4143D4M4N9l43L05k47k23L80l4P3k6k07L90j63o1P2L4k58J18n3k00M47p4K2k11
$$ plain form
3972 259 -127 468 -260 -14 -78 4 -19 -213 145 296 -325 -52 71 44 78 73 -92 64 -58 116 79 233 10
3995 10 25 -29 84 -18 20 31 -11 -191 -113 -116 110 -95 -274 -189 32 -11 -17 -46 46 4 -25 -39 31 -74 -9 -196 20
4022 20 -104 -150 136 -37 -102 226 155 -25 -18 30 301 -122 -25 124 -16 -70 -92 -111 49 126 5 126 167 -13
4046 -13 -50 115 -56 -50 48 46 61 -188 -135 -204 -71 102 260 39 -39 139 -101 97 4 -103 -3 -22 75 24 -16
4071 -16 205 42 -129 -79 -118 78 -88 11 111 -53 3 204 -64 142 67 -110 -251 -9 13 -136 -14 6 -41
4094 -41 -75 -36 183 -77 -54 -15 152 -216 62 183 -132 -56 -41 68 11 -81 209 -47 86 -87 -89 -164 123 121 139
4119 139 -41 17 -168 80 -90 -160 83 -43 28 94 61 98 54 42 -87 -16 122 -44 -29 -382 -154 137 79 44
4143 44 88 147 -196 109 -138 -361 19 -15 58 32 -175 215 52 -9 63 97 -161 -43 -96 -296 151 77 99 -112
4167a12r3K70R7k91j33J58K2rJ6Q7l9Q1j17l4J76l08J69Pk35L12J70l88L19m25
4191c00M52j92j71K16j94K2L14j34j13R8j04N0P1Lj79J64n8j27J93O6l34J82J06
4214C1j7j17J88j27L01k57P9kq6J25l8k50J31J75p4q9l15L13N1m5J57l61K56P0
4238I9r6r7j3J67j87M2p5K09j39K85m21J20kl1J99R4J3k09M1r0P2j57K88q9j30
4263a07M52k65k08Q4k54K12K1K0J92j6j40k00J34K50j43O0j97K48M1k24k21J0
4285b51J81L02m47Q3L50Q6l88k8l1M52j53j52n0O0L5k9j7K9j47J68N3j34J23k90
4309a95K78k62J98r3qL5R5J71l43K23p8O6j04K33J1o9k37Q1L4k03J46j0K31k53
4333e3R4j18M3L3M95o27R0O3J65j82M4O5k83Q9J47o2j7R1j84j8QP6Q9j76K91j99
$$ plain form
4167 -112 -205 65 162 -129 -262 -104 -82 -91 -75 12 -27 54 -63 -97 79 -229 -60 -53 -288 24 194 -194 125 -300
4191 -300 152 -40 -211 5 -189 -167 147 13 -100 -2 -106 -56 15 18 -161 3 -55 -182 11 77 -257 -75 31
4214 31 14 -103 85 -42 259 2 81 79 -7 118 80 -170 -39 136 62 -27 -342 -29 22 -23 134 -227 29 99
4238 99 3 -94 -107 60 -127 -85 -160 49 -90 195 -226 -106 -108 -139 60 154 167 -42 -1 -91 -19 -176 112 23 -107
4263 -107 345 80 -128 -44 -298 -86 -65 -45 147 131 -9 -209 -75 175 32 92 -105 143 184 -40 -261 -251
4285 -251 -70 232 -215 -132 218 304 -84 -112 -143 309 156 4 -46 14 49 20 3 32 -115 53 106 -28 95 -195
4309 -195 83 -179 19 -74 -82 -47 48 219 -124 99 21 87 -17 216 227 158 -79 2 36 -167 -21 -31 200 -53
4333 -53 41 -77 -34 -1 494 -133 -43 20 185 3 47 112 -171 -82 65 3 -14 77 -107 -125 -117 -41 48 -128 163 -36
4359c6j9k00K28k1j99L29J0N5j39j31l4J46j06L12l3k11LQ7j17p7L47j21k28K58
4383A03j98j83K36L30j60r5o3J90o9K2M8k73J9L97l46J40n5j27k8J83j99J90J29
4406A91k59L9j72J61n7j1r3p6L64j66k5r2k9N26k47o4M0P3k41l1R4J34j13J16
4430F2k23J24q8J14jj03J49j80K10n2R8k83J78J0k37L19l5J13j16k52J83k8j95
4453b33L41J68k04j01O1J89k50j28M02n64K77%j58N33k42p7L7J38k88J69j31J0
4475e1J07P3R4j89k19K89j92J74j48k26K00Q9J73n3q4r8R9l8K29j67m9P6J31l59
4499a39j05J11J10J23J28k30J2K45k51j48N2L1L8R6k18N0J55L1m0j64J40j06L6
4522d3J3R1p7k94J29O0O0m6M6M0JJ68j24j18M9Q2q2Ol8K21j22J74j86k48J08J1
$$ plain form
4359 -36 -55 -255 -27 -48 -247 82 92 147 8 -123 -157 -11 -117 195 162 -49 -46 41 -76 -153 194 73 -155 103
4383 103 -95 -278 -42 288 128 33 -30 160 91 113 161 -112 -93 304 -42 98 43 -84 -112 71 -128 62 191
4406 191 -68 -29 -201 -40 -97 -108 -201 -277 87 -79 -104 -196 -225 301 54 -10 30 103 -138 -169 -75 59 -54 62
4430 62 -161 -37 -125 -11 -12 -115 34 -146 64 12 110 -173 5 15 -222 97 62 175 59 -193 -10 -38 -233
4453 -233 108 276 72 -29 32 221 -29 -157 245 -319 -42 -42 -200 333 91 14 51 189 -99 70 -61 -51
4475 -51 56 129 223 34 -185 104 -88 86 -62 -288 -88 1 174 121 37 -61 38 0 229 62 13 89 220 -139
4499 -139 -244 -133 -23 100 228 -2 10 255 4 -144 -92 -61 -23 73 -145 -95 60 91 51 -113 27 -79 -43
4522 -43 -30 61 -16 -310 -181 -121 -61 -107 -61 -21 -20 148 24 -94 -45 37 -45 -39 -77 144 22 196 10 -238 -130 -119
4548a19J03K1R8k93R4J12n2k4J44k19j11L33p1N7J2k3m1K11k77k5K40j80j5k50
4572b75K49K57l09j81K25k92L05J3J24M1j60Q1j15l5J73j76K32k9j35j8l4K3K75
4595B39k16j41K73J3q6j14J95k5j89N4k96K74k55K77K87k94K60m60J04j04L17
4616A13P2j68J96l14P9n4LJ58j79O4R9j85J92K2j11K20j78j52K89k62J32r4J21
4639F3n4K7M2j59J82k49K65j3Qk09K81k70J64j30k0m0J07k53J18J04J40j63J33
4662G4K29m94K22K26J03k83N0l17K16oJ21j49m8M3j38L03n9j74l1J42j24L56q7
4685A75K2p7l59L77k24K04j66J99j67o5M8J49k35q7J70O7j38J47nj8j69J18J58
4708A24k63j26K91k70J47L0L54k04k56J32r8K5L24Ol5r9k26L26j60j4j09n7J17
$$ plain form
4548 -119 -16 5 103 -190 -96 16 -36 -60 84 -135 -246 87 16 73 85 62 21 232 -45 -70 170 -10 -25 -275
4572 -275 -26 231 -78 -259 -34 -326 -21 -8 116 157 -3 78 -37 -72 101 -75 157 128 -7 -25 -59 -36 239
4595 239 23 -118 155 168 82 -32 163 138 -51 3 -293 -19 -274 3 290 -4 256 -204 -100 -204 113
4616 113 185 17 213 -101 -22 -76 -73 85 -94 -30 69 -116 76 98 -13 207 29 -123 166 -96 36 -58 63
4639 63 9 36 78 -81 101 -148 117 104 112 -97 184 -86 78 -52 -72 -112 -5 -258 -140 -36 104 -59 74
4662 74 303 -191 31 257 360 77 127 -190 26 20 141 -8 -56 -13 -151 152 93 -81 -112 30 -94 262 175
4685 175 197 120 -239 138 -86 118 -48 151 -16 -81 -33 116 -119 -206 -36 31 -107 40 35 17 -152 -34 124
4708 124 -139 -265 26 -244 -97 -67 287 83 -173 -41 -139 -114 210 216 181 82 -144 182 22 8 -101 -158 -41
4731d1qJ00m7k18K54jk91K30J13P5j47j24N13l10r7p0P4r7J89j94J79N1m7j70
4755h4NL0J37j42oK00k9j64M4M1J8k7K58k43o1J45k66J29J2J28r7j1k03K48l27
4780b65L28j23K1J31JMo3p6J09J5k66J49K08k3j17j3j69J59R6m3o1o1r3J31j87
4805b08J43R0K22j30k1nJ5k13K14j04j57L1K93k0q7P3o6r1qO9L1m37J46R1kK96
4831A65j28n2K9k0k4KJ86j82o7j06K94k9m7J3l1n7J64p0Q4l4j13m0m1K00k15K27
4857A08j27K61k21p7J5j51nO5K58j98L1j31pL61j14J95l01M7J3M3r7K36o5m9J25
4882B15m3k04K7n7J09m5L9J94k12j3k1J09q5K14j96l3j45N6J62K1k17j43J85P8
4906ej4J35N3k48Q9k3n4M6M7P7j52J23r0k76M02j67J97j32J35j98P9K20l10j04
$$ plain form
4731 -41 -49 51 4 -214 40 39 -252 -22 91 166 19 -105 408 98 1 -69 5 -92 97 -97 82 133 86 -84
4755 -84 -79 -49 88 -54 -60 140 111 -53 -9 32 50 23 281 38 -23 122 -144 -15 -3 125 28 17 -186 62 -265
4780 -265 63 -60 -39 92 93 97 34 -42 67 82 -184 -35 173 150 33 20 -149 10 106 63 2 -59 -152 -21 -208
4805 -208 -65 25 247 117 96 91 106 -107 107 3 -154 -123 170 150 63 136 70 -21 -29 40 71 -366 -220 -129 -131 165
4831 165 37 -15 14 -6 -30 -28 158 -24 -91 -197 97 68 21 34 3 -54 110 40 124 90 -23 -63 -104 96 -119 108
4857 108 -19 242 21 -56 -41 -192 -197 -132 126 -72 -41 -172 -179 182 68 263 -38 9 22 65 -32 204 139 90 215
4882 215 172 -32 -5 -62 47 2 41 235 23 10 -11 98 13 227 31 -2 -147 -91 71 92 -125 -268 -83 -5
4906 -5 -19 116 169 -79 10 -13 -67 -21 26 103 -49 74 -16 -292 110 -57 140 8 143 -55 24 244 -66 -170
4930a70m6K11Q6J9j87K62j16J41j21r5n5j38J01l7k9J15k9P4O2j34Q6K24j00k63
4954a39K23q3m7K58l82M4N0L32m63L44P2l11J65k07K02J19j44j27P8L6J28j73
4976b5J18j73j40j3J10J69r4Q6K1R0l76P6J02O7k9N4J09k4j25p0J33k5J71m09
5000a97K7P6O9n2N7J1R6j71J69k8j25j5J05p4J26j64j63L30l2J24l05R4o1n5N4
5025a04J2j15J88J51k27K27m4l00J44k07M0L75M1q9k51Q9j51J27k2J71J01k02
5047d6l6J79J10k34J64j54j25K87l38J87K03m08K24j70L85m23Q1J59k67J24K67
5068A69l52J46j09p6O6mO9J33N8m61O97k56j00j87M13j91k17L37rR3o4j45k2j17
5092a29J8k32L49M8k19K05j19j85K17M21n50J93j41J50J00j2m8nr3J03n4Qll32
$$ plain form
4930 -170 -216 -5 81 100 -87 175 59 200 79 -16 -71 -209 -108 -145 -174 -59 -88 -14 48 -86 0 224 124 -139
4954 -139 84 1 -46 212 -170 -126 -76 256 -207 137 209 -102 63 -144 58 177 33 -94 -16 20 148 -25
4976 -25 93 -80 -220 -233 -123 46 -48 38 59 149 -227 -151 -49 18 -11 43 152 128 3 -67 66 41 212 -197
5000 -197 -170 -94 -25 -77 -20 -9 87 -84 85 57 -68 -83 22 -52 74 -90 -253 77 45 169 -136 -42 -103 -158 -104
5025 -104 -92 -207 -19 132 -95 132 88 -212 -68 -275 -235 140 181 92 -159 -70 -221 -94 -116 55 156 -46
5047 -46 -82 97 207 -27 137 -17 -142 145 -193 -6 197 -211 13 -157 228 -195 -114 45 -222 -98 169
5068 169 -183 -37 -146 -222 -156 -160 -91 42 100 -361 336 80 -20 -207 206 15 -202 135 126 219 155 10 -12 -129
5092 -129 -111 -343 6 54 -165 40 -79 -264 -47 374 -176 17 -124 26 126 114 66 61 -32 71 17 25 22 -310
5116c10l2l5K78K27j11j11j04J81K92j54K0Q7l30K3L17l43O6k8j54J78N5p3j5
5139g6o4K13k97L49n4l14K37j3J38rl0j93O7K8J07n6j62Qk30N52k32J41k53P0
5163g3J80j88p5J99k3K14l70L77l75J83j33K3mj7K9q1P5p0n0M9p3M2K90q3L6k61
5189a79M74m86K91m5J28k67K58l80M9M5O4K59m10J17P6ml0k5J95J08k39J08q7
5212B0m2L6j41R5Pj35J69p9k16M29n1J52m53K64P2l3R7m16J95N4R8j05l06K59
5236c0J32L5p7ll4J0j72J18k48J57J12K61l95O3p4J26o6K44l46PL77j67mJ48R2
5261B66l90O5n0O7o2J97j44J87k21L19m09N02j82j87J21j91L47l45j87L69k27
5282a55N4jJ54j24j68L52j41K3K36l17K5k6n8L07j22k05mL75j92J15J79k90n5
$$ plain form
5116 -310 -342 -377 -99 128 17 -94 -198 -17 275 121 141 228 -102 -79 238 -105 -39 -67 -221 -43 12 -61 -76
5139 -76 -140 73 -224 125 71 -243 -6 -19 119 110 80 -113 -46 -18 89 33 -129 -121 -351 201 -31 110 -143 -73
5163 -73 107 -81 -156 43 20 234 -136 241 -134 49 -84 -61 -65 -82 -53 -134 -59 -129 -179 -130 -203 -161 129 46 82 -179
5189 -179 295 -191 100 55 183 -84 174 -206 -157 -112 -48 211 -199 -82 -6 -10 -40 -65 130 238 -1 107 20
5212 20 -22 14 -127 -32 -25 -160 9 -70 -286 143 92 244 -209 55 127 94 191 -225 -30 24 122 17 -289 -30
5236 -30 102 137 60 57 23 33 -139 -21 -269 -112 0 261 -134 -71 -145 -19 -85 159 -187 -180 197 30 26 174 266
5261 266 -124 -59 -109 -42 -104 93 -51 136 -85 234 -175 327 145 -42 79 -112 235 -110 -297 72 -155
5282 -155 -101 -102 52 -72 -240 112 -29 -6 230 -87 -62 -88 -146 161 39 -166 -170 205 13 128 307 17 -38
5305c8L3J51l5q6oj6PL05j73j90K86l33M04l60l8PK02j91K38l2j62q5j9L8M0J29
5331G6j44O7p0J92n3q9O4R6k46Q9P9j37K40l33J42J2q5J46j00kJ28l3r5K02j23
5356B3l2q3K13l8l22L30J05j65j27K35Nm7q5k08J63L21l94J5m9Q2k36K44J20j12
5380d2J12K13J9k58j66J58r0J09PP9k34K98j36k55K46R7P3k79K43j44r2M1j45
5403a46K8M83m77m4J36M1K3J57l18l24N56j51J53l64J60J74m51L96k10J76J08
5424A06j67K89l24M7K27k71O5r4L39j87p3Q9j73j4L04k66R5O6j85K81k57P4n2
5447h1O7M3R0J58k63j0m4O1RJ41j30k36J61r1N6qJ28k07Q4J35RO4O2J02l71p9
5473a50O9J6J20J7J0J50k99J79K8k29J91p7r5K74l34j56K90L8q7O7J11j40q4N1
$$ plain form
5305 -38 -5 146 111 25 19 3 10 315 142 -48 238 -95 309 -51 -89 -82 120 -71 167 135 -27 -112 -131 -93 -53 76
5331 76 -68 -1 -71 121 68 -21 43 139 -107 -18 61 -76 164 -169 -27 -15 -100 46 -54 -56 72 39 -56 146 23
5356 23 -9 -92 121 83 -239 91 196 31 -96 139 144 97 12 -196 -33 288 -106 -91 -140 -58 -294 -50 70 -42
5380 -42 70 283 302 44 -122 36 -54 55 62 141 -93 205 69 -186 60 157 230 -49 194 50 -42 -1 -146
5403 -146 -118 365 -112 -156 -20 21 44 201 -117 -441 115 -36 117 -247 -87 87 -364 32 -178 -2 106
5424 106 -61 228 -96 -49 178 -93 -28 -122 217 30 -43 46 -127 -141 163 -103 -8 58 -127 154 -103 -29 -81
5447 -81 -14 29 119 277 14 4 -40 21 30 171 41 -195 -34 -125 -69 -77 51 -156 -72 63 72 136 198 300 -71 -150
5473 -150 -81 -65 55 72 82 232 -67 112 140 -89 102 25 -70 204 -130 -286 4 42 -45 22 133 -7 -91 -40
5497d0R0p1p3NJ92L6Qj56j17J24k00J87PO4J03j54M8Q6j45K65l67K54k9O3k61
5522h1nJ74L5l3k85J97j29M14l44J8J40j1j64k35K68j31o6K95j29Q1J61j29q8
5545d7O4o3j79L67n3m6J31j94R7j06L6J31j48j08K35j8k39K11m5l3l4M0J26J0
5569A35l79J53n2R1K0j58K09j81p6J35J39l12M08j45J00Q0O2l06J63qj41j96R0
5592a69L88k44lj54J53J64j40N8n2j45k8J16J51j33K86N0j06k15j22J16P8j59
5614a10J04j79K45k6Kj52r5L11m2j37K67j98J42j43K5M0j09k9L31l12RR4J5M4
5638I7n2j18K3j39M05k06j5Jm0L7lm3J44Q0k10K6K95q2n8q4j60KK55j68J04nj80
5665i4K60j35k10l2J37J90l09J29j10K45k68M06j75J5r5J03J79l95J55q2J97j56
$$ plain form
5497 -40 50 -21 -94 -89 103 139 147 -9 -126 -2 -202 -15 -8 56 159 5 53 139 -6 259 -108 146 117 180 -81
5522 -81 -86 88 123 90 -195 2 -127 287 -57 -39 101 90 -74 -309 -41 -172 -238 57 -72 9 170 41 -47
5545 -47 17 -46 -225 142 89 43 174 -20 77 -29 7 138 -10 -118 117 99 -140 71 26 -7 -41 -1 125 135
5569 135 -244 -91 -143 -52 -32 -190 19 -162 -238 -103 36 -276 132 -13 87 167 229 -77 86 78 -63 -259 -169
5592 -169 219 -25 -28 -182 -29 135 -5 53 1 -144 -172 -56 95 -38 248 298 192 -23 -145 -29 49 -110
5614 -110 -6 -185 60 34 36 -116 -211 100 58 -79 188 -10 132 -11 14 54 -55 -84 247 -65 -56 38 53 97
5638 97 45 -73 -50 -189 216 10 -5 -4 -44 -7 -10 -53 91 171 -39 -13 282 200 142 58 -102 -100 155 -13 91 86 -94
5665 -94 166 31 -179 -211 -74 116 -193 -64 -174 71 -197 209 34 49 -46 57 236 -159 -4 -86 111 -45
5687d5O2n7N2j06J81J9l29oK82M6J09l15L31l8k42nJ0K04K4o3j67j60L56j98o3
5712a18J94j18M1O7m2k50K75j18j56L24l9r5N8L3o0j21J38J02m1k50J68J5Lj04
5736i4N0K74k79j50M28m82M10K8j22n0k15J36N7o8J35j08J3P9M8j86J48j62K67
5759A57j73o2K23m31J46m6L63j12L6k03J47j17K15kj48K2o7n7l9J29J14j72J62
5782H5k7k07J47k18J04K41j48r2j03K6J66j20J61j0K67k65J8j07k1n1R7J29j48
5805g6M1r5J48k74L10MJ40k68J47q5N7j60o3K04k62L74j02j45K14m24K77K3n8
5828g3j05J52l4r7J94L5j75J23j3r3j71L04q3K39j25o0k01J79P7l5j13n8k0L35
5852A82k49K2L8j47k10J93K07k2J8kj25J38l10J57L9J11N1j19r7J67J76l43J12
$$ plain form
5687 -45 17 -40 12 -94 87 106 -223 -229 53 99 208 -107 224 186 -56 -61 -51 153 177 114 -53 -213 143 -55 -118
5712 -118 76 -42 -1 66 24 -226 49 -69 -225 99 60 -35 23 56 -4 -125 13 115 74 -176 -8 7 10 -94
5736 -94 -44 230 -49 -199 229 -253 157 185 63 13 -202 -66 -9 -77 58 -50 -37 42 90 -96 52 -110 157
5759 157 -16 -78 145 -286 -140 -186 177 65 101 -102 45 -72 143 141 -7 15 -52 -109 -148 -19 95 -77 85
5782 85 58 -149 -2 -220 -116 125 -23 -115 -218 -192 -26 -146 15 5 272 7 25 -82 -103 -154 -57 72 -76
5805 -76 -35 -130 18 -256 54 58 198 -70 77 -8 49 -111 -174 30 -232 142 40 -105 109 -315 -38 -15 -73
5828 -73 -178 -26 -60 -157 37 72 -103 20 7 -86 -257 47 -36 203 78 18 -183 -4 73 38 -75 -133 -153 182
5852 182 -67 -45 -7 -154 -364 -171 36 14 32 30 -95 43 -267 -110 -71 40 91 -28 -125 42 218 -125 -13
5875a3J88k95ko5L37K23j63m15O5K74j7k4J43j79r5l0p5N4J09M2j27J31p2J26
5899A20P7j43J89j01k16J92J4k41L96k57j29K3R6J58k36Q0k3oJ22k15K65Rm10
5922b36J83J56k76p0J76l8L0K57k30J07L9l77K86n4j63K11l4J3j6j74K79P5J01
5945B45J00q1m67M12n7l1j2j80K7O9J71j32k04R4J15k80J49N0J00k7L3l8q4O4
5969C6O8q0Rj48n6J10j21J54J19q1j49K06o4M8O1j95K13k01O4o6P4o1J84k58K
5994a32L26q6Q6l1k65K03k23K01j13R8j92J50j58K67l66L30j31N0q2J86j82M2
6016b2l54K33M02k46j36J38Q5k61p0J64J81j79O2J0j1OJ83Pk40J04j34L28r9n
6040A46j47J47k76q9K84k14J40k08J32J87J84k85Oo6J9%m3P7P1j30M7K93j94j53
$$ plain form
5875 -13 175 -120 -122 -187 150 373 210 -205 -140 134 117 93 236 57 -38 -68 -143 -89 20 62 -65 66 -6 120
5899 120 197 54 243 142 -74 118 132 -109 287 30 -99 -76 20 178 -58 22 -1 -7 115 -100 165 174 -236
5922 -236 -53 103 -173 -243 -67 -105 -75 182 -48 59 98 -279 7 -47 -210 1 -33 -20 -36 -210 69 144 245
5945 245 345 264 -203 209 152 121 109 -71 -44 25 196 64 -140 -46 69 -211 -62 -12 88 61 94 56 -28 36
5969 36 104 24 33 -115 -171 -61 -182 -28 91 10 -139 67 3 51 112 -83 130 -71 -7 -73 1 -60 124 -134 -132
5994 -132 194 108 194 163 -102 101 -122 79 -34 64 -128 22 -136 131 -235 95 -36 14 -68 118 -64 -22
6016 -22 -376 -143 259 13 -123 15 100 -161 -231 -67 114 -65 -3 7 -4 2 185 192 -48 56 -78 250 151 146
6040 146 -1 146 -130 -219 65 -149 -9 -217 -85 102 286 1 7 -59 -40 -40 -83 -6 65 -65 -18 275 81 -72
6064g2j20O3J43j97J31L36n44K08J80j73J22j10k48M24K4j34J77j76j45P2Q0l2
6086IO3k91K65p1J92j92k6P9o1m7N32m54j36J28J14j00k2J21l69N2M6r9Q7K21
6110D1Nj83K48j88J05L7l0r9J71m3L21l90l0O2J16k14rJ01K9j24Q1m0J34p5K07
6135B33k27k47L54l14L06j04J94k44J12j21J53j16J0n6K96m09J88J06o8j38o4
6156a56Q3P2N2Rk27K28o7K49q5k4j38q4K69l94K00N9l6o1m8K38j54q2J27p2J63
6181A21n4j04J57j34J64Nk0k87K40j28p9J55J22K5n9k5j47K57k8k59M8J10k97
6204b17K02J11k73K13L3k12J96j2j35j8J44n1P6q2N1J25O1j49q9J16Q2J12j79
6227A05k1k0%j30j76K94j8j65L35j81k53K10j37K36K9k3O4p3q1M1L4j74K11O1
$$ plain form
6064 -72 -192 -129 14 -183 -52 284 -260 -52 128 -45 77 -33 -281 143 167 33 210 34 -111 -39 41 9
6086 9 72 -219 46 -25 167 -25 -51 28 -33 -80 452 -2 -138 -10 104 4 -18 103 -266 -214 -168 -267 -180 41
6110 41 46 -137 111 -77 28 65 35 -64 107 64 385 -5 -35 27 143 -71 -80 21 50 -74 7 -33 101 26 233
6135 233 6 -241 113 -201 105 1 195 -49 63 -58 95 -21 -11 -67 229 -180 8 114 46 -92 -156
6156 -156 -73 -1 51 60 -167 61 -6 243 158 134 -4 -88 181 -213 -13 46 10 -51 -99 139 -15 -97 30 -42 121
6181 121 67 -37 120 -14 150 155 135 -152 88 -40 -119 36 158 183 124 99 -48 209 181 -78 -30 80 -217
6204 -217 -15 96 -177 36 69 -143 53 41 -94 -112 32 -19 57 -25 26 151 212 63 -26 90 172 284 105
6227 105 84 64 64 -66 -242 52 34 -131 204 23 -230 -20 -157 79 108 85 149 76 -5 36 70 -104 107 168
6251A68j48J70j85N6j18K37k25J84o1K7l99jL79j20j8p0L00k24m9J51m0K1J20
6274A55m08J10K81k9J3j86j19K84k58L31m09M60k21l3J59j94k9L1K52j89Pm6M3
6297EQ6J47l47J30RL2k04K07q4r3J23J63k81pn9n5K29L3j33j19K38J20j95J89
6321A34k59K66j5L2n6J27j91k25L28l3j27J33j02J05m13P6L28j60P0p9J80j53
6343c4J13j26K49m14M55j27k58K01l10M58kl90J05M8J84k19m6K89l47M3k7P7j29
6366b07K97j45oR6J6K9K0j67K01J60n09L92k14K30j59j37j36J03k7Q9R0k47L42
6389A11Rl36M86k19pj39JJ81l54M52k81L8R6L07l34j13J9m4J85k62K42j13M75
6412D00k35j6k82J69j65K90k14m0K60j12k3k0k31L77o8l39J69k20L38o4j2R7k35
$$ plain form
6251 168 20 190 5 61 -57 180 -45 139 78 105 -294 -295 84 -36 -54 -124 176 -48 -97 54 14 35 155
6274 155 -253 -143 138 109 122 -64 -183 101 -157 174 -235 225 4 -29 130 -64 -93 -62 190 1 8 -38 5
6297 5 91 238 -109 21 30 62 -142 65 -19 -112 11 174 -107 -114 -173 -228 1 34 -99 -218 20 140 -55 134
6321 134 -125 141 126 158 102 229 38 -187 141 108 -19 114 12 117 -296 -220 108 -52 18 -61 119 -34
6343 -34 79 -47 202 -212 243 116 -142 59 -251 207 205 -185 -80 -32 152 -67 -113 176 -171 -128 -155 -78 -207
6366 -207 90 -55 -61 35 51 80 100 -67 134 294 -215 177 -37 193 34 -103 -239 -136 -163 -74 16 -231 111
6389 111 120 -216 270 51 44 -95 -94 87 -267 185 -96 -58 38 345 11 -102 -83 -127 58 -204 38 -75 400
6412 400 165 149 -133 36 -129 161 -53 -93 167 55 32 12 -219 158 90 -249 -80 -300 38 -26 -38 59 -176
6435a76J23L02J19k54k11j8L09j61m5K61k53r1O0J29k03j44M14n35N55k08K57
6456B30k23J82k92K4J6j69J21N5M4l5K59l57P4M3L2o0m2rL50j04r6p8L51o26M15
6481A05j32O4j1M9J12l97M7K96j39J9j68J63J2k00J8J55J35j51R1j58k26K31p7
6504a62J45J1Pm4j71J09K77k49j02L2J68K81j68j46j02K38j73J69k58P0K16q1
6526F7p0o6O1j70J09J54m9j98J31j29K2J39R1k62K98l16q2M03l8kj53L1L6M7m
6551E0k57J68K29m73K41p1K33l36J62j85N7J92J7j26K28j49J87n4j79o9J6Pj8
6574a30Q7O8j1L3j73K02n3O7n3L8Rk55J0J88q3j03J28K66q9k92K51j52J47j9l23
6599b42J77m9J1K84k53RJ03j06P4K4l95K94j91J38J63J60n8n63M58j76K78R2l64
$$ plain form
6435 -176 -53 249 368 114 -97 -115 194 33 -12 249 -4 -95 -35 94 -109 -253 161 -374 181 -27 230
6456 230 7 189 -103 -79 -63 -232 -111 -56 -12 -47 212 -145 -71 -28 4 -56 -98 -107 243 139 43 -35 316 -310 105
6481 105 -27 37 26 75 187 -210 -163 133 -6 13 -155 8 20 -180 -162 -7 128 -23 68 -90 -316 -85 -162
6504 -162 -17 -6 1 -43 -214 -105 172 -77 -179 -147 21 302 134 -12 -114 124 -49 120 -138 -68 148 67
6526 67 -3 -69 -8 -178 -69 85 36 -162 -31 -160 -138 1 92 -170 128 -188 -270 133 95 93 -60 -29 7 54 50
6551 50 -207 -39 190 -283 -42 -113 120 -216 -54 -239 -182 10 27 -99 129 -20 167 113 -66 -135 -119 -112 -130
6574 -130 -43 25 14 47 -126 76 23 90 37 75 84 -171 -161 27 -56 -159 -31 235 146 -146 105 -47 100 81 -242
6599 -242 -65 -114 -103 181 -72 -63 40 -66 8 32 -363 -69 -260 -122 41 201 143 -420 38 -138 140 232 -132
6622a32O5O2J71j6j31J09l4m02J53K83k88K71j1m79M32q1qJ24l8m5k09J91j99
6645b12J05K12j15N2j22M7M9k2k03J05Q0M6L29m93K23J9k70J41J16m0K4k7R2q7
6669D9Q6p1j53j43K78k10J10J81J13l41L17J21n71K84J9j88J02k58J10J41P6L0
6691H2j61m9J92j55q6K61j7j68r3j38M15R9J88k14j08P8j46Q9p8n0J21j56R2o8
6715g0j9J51j25j8L48l80M6K5J39J96l72l8j16J54j1j72J88n9j34K78o7Q1J7k01
6739a59J29L78j53l92J78j2Q8j35P7J66k9J90k56M3j32K7J85k27j9j14J11K86
6761B30m64Q5R0p0J93l4j8j52L16m33J34p0Q6K56J26q6q6j06N4j0k2l07K07J07
6785B6OK5q4j69K55K8j40m6nJ33J52J6q6j41J45K80l13j15j03n1MJ54J52j60Q5
$$ plain form
6622 -132 -67 -5 166 150 19 128 94 -308 -155 128 -160 111 100 -379 53 -28 -36 88 50 5 -204 -13 -212
6645 -212 -107 105 -10 42 -80 -33 16 -6 -209 -104 -24 22 351 -142 81 100 -170 -29 87 47 71 44 136 49
6669 49 135 64 -89 -232 46 -164 -54 127 240 -101 216 337 -234 50 69 -119 -17 -275 -165 -24 52 82
6691 82 -79 -128 64 -91 -177 84 67 -101 -194 -332 83 182 370 156 48 126 -20 69 -9 -59 62 -94 -2 -70
6715 -70 -89 62 -63 -81 267 -113 -67 -42 97 293 -79 -117 -233 -79 -90 -262 -74 -133 -267 11 -56 25 42 -159
6739 -159 -30 348 195 -197 -19 -31 57 -78 -1 165 136 326 70 113 -19 8 193 -34 -53 -167 -56 230
6761 230 -234 -149 -59 -129 64 30 12 -140 176 -257 -123 -193 -107 149 275 189 103 -3 51 41 19 -288 -81 26
6785 26 32 57 -27 -196 59 87 -53 -99 -104 29 181 197 111 -30 115 395 82 -33 -136 -187 -183 -29 123 -37 48
6810D8M4r0q1J47N7J9k25J02q7J2J44Q5l52N46n78K15L2L1jk8J41n8j95K22j69
6835a9Q8O3Jj12p6j66K43oP5J8j36L2n2M5J05l08J61K5j25J63j26Q2k08L99j59
6860Gl0L1j23R4L14q6k25j25PK12j43L9j9l5K82k08j36M14k79m4k18L14K3J18
6884A84n5O2j28l7Jo8k2M9M9J17pj73j13K53Ok58K0J6K3J96M2j26k24K35K06j01
6910A47k94j09J80J22J73l04j8J65J06k34J56J39j08K2j07k72L85j7j99k17L63
6931G9n0n3q8R8j81R5l3J75K1l07K60L4l5m7RJ40p9j06j08L40j59R6r9O1J22k71
6957h6K61l18J3n8R9K70l6m14K05L9j7q0K49l29L61j28k44j31L78J19l63K27P1
6980H8j66L05l33p1J69j3L7p2L42l06O7J0r9N2n1K71p7Jj32R1k12K27q7k33K70
$$ plain form
6810 48 92 2 -79 68 125 144 -81 21 -66 -54 90 175 -177 369 -209 6 38 69 68 40 181 123 -72 150 -19
6835 -19 69 132 133 21 -55 -221 22 16 91 109 -27 5 -47 -2 103 -205 -44 -19 -144 19 -107 -25 -233 166 7
6860 7 -23 8 -115 -21 293 207 -18 -143 -136 76 -67 -28 -47 -82 200 -8 -144 270 -9 -53 -271 43 66 184
6884 184 129 191 63 26 27 -41 -63 -14 35 152 145 -28 -141 112 118 -140 -120 -104 -81 115 157 31 -193 42 248 147
6910 147 -147 -256 -76 46 219 -85 -103 62 168 -66 90 229 121 143 36 -236 149 132 -67 -284 79
6931 79 29 -24 -112 -14 -195 -100 -133 42 63 -244 16 50 15 -32 -23 117 38 -68 -176 164 5 101 2 63 185 -86
6957 -86 175 -143 -130 -188 -89 181 145 -269 -64 -25 -42 -122 127 -202 159 31 -213 -344 34 153 -210 17 88
6980 88 -78 227 -106 -177 -8 -21 16 -56 286 -20 47 57 -42 10 -41 230 153 154 22 113 -99 128 41 -192 78
7005G8k20K06M1p5pj01K71l30LK78k39K3J7O6J70q4k63N2K65j32j3k8j12K7j6
7030a23Q7N4j64K04q0J88j95L8k7P7J6k21K02j25Q0m4j10MJ2L26k41l0q2L02k5
7055A23J29j15j05o1J31M9k42q0J89j34K73n4j01J38k13N7j3k98L94j02j85K23
7077Cj39M32j07n7J59p5j82n5MJ67k18J95m02M20r3m9M2k15M20k23j98J71p5J00
7101B5j9j44J05p9L48j79j49L02q4k57J62Kj11j32J70P6M0l9L0k55L4J37K47l35
7125a05kJ22PO6j66K39j83J06l47L23p5N6n1k7O4J5j23K8J43k04j48N72k18l02
7149b10L89n4j64J30Mr8o7J07l47K64J12j99K24k06R4R7Oj39q4K12j03P4Jr3J82
7174A32QR8j77j91J88j92J85j80K61j82n4m2K36j47q8j8J33Q9j45J4M7J10k01
$$ plain form
7005 78 -142 64 105 30 23 -78 193 -137 -134 144 -95 -72 -55 11 181 97 -166 -114 151 19 6 -22 -134 -107 -123
7030 -123 -36 18 -146 58 -22 166 -29 9 -18 59 75 -146 56 -69 11 -33 -143 -139 -127 199 -42 -72 -154 148 123
7055 123 252 137 32 -29 102 151 -91 -171 18 -116 157 103 2 140 -73 -16 -29 -327 67 -35 -220 3
7077 3 -136 296 189 132 291 216 34 -21 -17 150 -68 127 -275 145 52 3 45 -170 250 27 -171 0 -75 25
7101 25 6 -138 -33 -112 236 57 -92 210 126 -131 31 33 -78 -210 -40 36 76 37 67 -188 -154 -17 230 -105
7125 -105 -107 15 22 88 -78 161 -22 84 -263 60 -15 41 -10 -37 27 42 -81 -53 90 -114 -262 310 92 -210
7149 -210 179 125 -39 91 95 -3 -70 37 -310 -46 66 -133 91 -115 -21 76 82 -57 -141 71 -32 42 43 -50 132
7174 132 140 238 61 -130 58 -134 51 -129 132 -50 -104 -146 90 -57 -145 -163 -30 59 -86 -72 -25 85 -116
7197a16m2r6M35r1Q5j95M6mO9l47M65l32L30o4K5r5k73L23n5r9K31k55J52k3k91
7222b17K44K01k85j11J92qN2k69J26J35j11J69k45J92l58L97K7O6l88K88m1k04
7244a48J53J8q1K10Lk71J88n3J7J58m42J09P8k3N7pN1O8P2l15K10J71l29%J66
7269F0j56Q3k41J49Q2k33L16l9k30O0J09L6j15M6N5n3N7j46L20k07J54j57k6K40
7293A64k73L8R1l0m4l5J03K84l73J58o4J31q2j82Q7J47o3k05p2L90k19J84m2o5
7317B8J34k83L18j62K66j21j12r3q7J8M0L07j32j77j69L51q3j4k30K69J72k05
7339C5m8J89k40J27r0q2N5n1PJ41N1J13m42K67l23N24J1k97N1j91R0J47R5k45
7363a06K77j54J56k38n4O9k65L94O5j55j92L7R4n5J01J30M8l9k18J23k99L67J57
$$ plain form
7197 -116 -158 -254 181 90 175 -20 26 22 91 -256 209 -123 207 143 168 73 -200 123 68 -31 200 -55 97 74 -217
7222 -217 27 228 -57 -168 24 16 68 -201 -75 60 -51 118 -127 65 -293 104 131 197 -191 97 56 -148
7244 -148 5 23 -58 152 155 -116 72 19 36 194 -248 -139 -61 -84 -27 -34 17 85 157 -158 52 223 -106 -106 60
7269 60 -96 -13 -254 -105 -23 -256 60 21 -209 -149 -40 -4 -119 -73 -18 -71 -14 -160 160 -47 107 -50 -76 164
7293 164 -109 -71 20 -10 -54 -89 14 298 -75 83 19 150 68 -114 -27 120 57 -148 -220 170 -49 135 93 28
7317 28 162 -121 197 35 301 180 68 -25 -112 -94 -54 253 121 -56 -225 126 43 29 -201 68 240 35
7339 35 -13 176 -64 63 -27 -109 -54 -105 -98 43 94 207 -235 32 -291 233 244 -53 -2 -193 -103 44 139 -106
7363 -106 171 17 173 -65 -119 -50 -315 79 144 -11 -203 -166 -72 -127 -26 104 152 113 -105 18 -281 86 243
7386B43m59L69k96L15j66p0J89k99K2Q6M9j28P7J36j69M18j11q6k6m1M9k24R0
7409c2j10J52kj63n0L31N9k5k04LL7J3J76P9j49l60L72Jk54o2Q8Q5J08p1L2j02
7435d8J23r7j09R2k19N16k45R4O0j20L58m06m4J20j44nJ34N0k56q4N11j26k84
7458a29J21K22l62K67k26K09J48m14L5p5K18l7o7N22m19K06l8l53L71l64J47R4
7480G6K2K8j27P4k16O8J31L2k8l9K7p9O1n3Q0k21J01J60k1o6J22j6j65J07j60
7505a02J5K4M4q6J10O8J13j26Q8k13J97k18L05m10K11k6J08l4j93L7Q7j60O9j44
7529b36N7K63J0j58j48J58M4M9k00K53j76J51n1N8j39J5J64p9j87J50O8r5m1Q3
7553A3M5J45r4j72J75N8j65J97k84J44l04O4K55k25K03o9k4j73J83J03Jo7J2J8
$$ plain form
7386 243 -216 153 -143 172 6 -64 125 -174 -152 -66 -17 -145 -68 68 -101 317 206 120 94 53 102 -122 -32
7409 -32 -142 10 8 -155 -205 126 185 160 -44 -41 -4 9 185 264 115 -245 127 128 -126 -188 -100 -15 93 22 54 -48
7435 -48 75 -22 -131 -39 -258 258 13 107 167 47 405 -1 -45 75 -69 -74 60 110 -146 -230 281 155 -129
7458 -129 -8 214 -148 119 -107 102 250 -164 -129 -204 14 -23 -90 432 13 219 181 -172 199 -165 -18 76
7480 76 98 126 -1 73 -143 -75 56 88 60 21 48 -31 30 -23 57 -164 -63 97 76 10 132 116 -49 58 -102
7505 -102 -87 -63 -19 -105 5 73 186 60 148 -65 132 -86 219 -191 20 -6 102 68 -125 -88 -1 -161 -92 -236
7529 -236 -179 84 94 -64 -212 -54 -10 39 -161 92 -84 67 16 74 -65 -50 114 35 -152 -2 66 -29 -70 13
7553 13 58 203 109 -63 112 170 5 202 -82 62 -242 -178 77 -148 55 -14 -38 -211 -28 75 76 9 21 39
7577C9J21o2p8m0p5K2j77K66k3n9K35k77K39j59j57J61Q6L9m9k05J89k41L99j50
7601D4lJ9j67J61j32P2k56J08Q8J97k24K41k30J16k1r2k44K06K14k31J59j6k12
7624b03K44j92J52Q7n8O4J2m8k30K11J16j38J04o5lj89L6N8M7k89K8L06j34n9
7648a43J24R8qQ7m83N30J7k50j02P3Lk60M23n8j00J59k56j6K32K68l29RP5J1O
7673A10J44j81p8k6M30k26k00j09K04K1L8l31J75Q7O5j51J33j2J72k83N3k43J55
7696e3l8J73J55k02L5j53r1K72J25l26r6L58l9j00J4K9r4J39j80K47r1j41J57
7719A00m4j36K90l08L63j30p4q6L4N2J47j57r9K0L9K60k43j90n9P8j09K51n3j81
7743b35M05m91K35J48k8j58Mm0J79K5j89O8J09j34J05p7N0J6K1J66k29J13n6o5
$$ plain form
7577 39 160 98 20 -20 -95 -73 -250 16 -7 -66 169 -108 131 -28 -185 -24 62 101 52 -153 36 -205 194 44
7601 44 41 60 -107 54 -78 -6 -262 -154 -66 131 -93 148 -82 34 13 -79 -323 -117 97 -134 25 9 -203
7624 -203 41 -151 1 88 30 94 106 58 -172 39 155 17 121 56 53 -136 -100 -42 5 -284 -256 50 -84 -143
7648 -143 -19 79 71 158 -325 205 222 -28 -130 -57 -54 -314 109 51 -49 110 -146 -162 70 338 9 18 93 104 110
7673 110 254 73 -5 -31 399 173 -27 -136 68 89 127 -204 -29 58 123 -28 105 93 265 -18 35 -208 -53
7696 -53 -91 82 237 35 70 -83 -174 98 223 -103 -199 159 120 20 34 63 -31 108 -72 175 84 -57 100
7719 100 56 -80 210 -98 265 135 61 -25 9 61 208 51 -48 -28 11 271 28 -162 -221 -143 -252 -1 -54 -235
7743 -235 170 -321 -86 62 34 -124 -120 -160 19 44 -145 -77 32 -102 3 -74 -24 -8 13 179 -50 63 7 -58
7767e8K4j3J8J58k61M6J09P1J82m04M8q8K03K05k48n7J10J14m58K78k7K10k38
7790g6Kk09N12l29L11k48R4j87J74K0L2J3j50n8j37K59j89N5P9J2n4J6J12n3J7
7815A8j00n2K9P5j89L04P2j57K10j66J26j39J6J52j25k18L34J9l5k73L5j44L00
7838I2J20J01j71j40P6q2k42L17j91j20K14J72m53L73Q9N3k17N5K14k16j86L0
7860a12L02j08j85Q8j33K30p3M4k21J75m3n2K15J2K90m08J19n7j85J99k14k1N0
7883h8j1L0j76K36qk64L41J20j30j59J36l7J77j02j17L15l02J22Pk99J26K43j08
7906E2k58L64k8N9k64J22R1j21j4j13J55J36l02P7J21O2k0l78M13ml37J57K6J71
7930A67k69R9J1j2j0j2O1o1p9K54n7r8L19l01M3j5m2j71j40N81l75J08j69K02
$$ plain form
7767 -58 -34 -47 -29 129 -132 -86 23 94 276 -128 -80 -168 35 240 -8 -65 45 159 -299 -21 -48 162 -76
7790 -76 -74 -283 229 -100 211 -37 57 -130 44 64 96 109 -41 -99 -236 23 -166 -111 -32 -20 -74 -58 54 1 18
7815 18 -82 -134 -105 -30 -219 85 157 0 210 44 170 31 47 199 74 -144 190 209 174 -99 -64 -208 92
7838 92 212 313 142 2 78 -4 -246 71 -120 -240 -26 146 -307 66 155 208 -9 46 260 44 -142 -112
7860 -112 190 82 -103 -15 -148 82 9 53 -168 7 -36 -88 127 139 429 21 140 83 -102 97 -117 -138 -88
7883 -88 -99 -69 -245 -9 -17 -281 60 180 50 -109 27 -10 167 65 -52 263 -39 83 90 -209 -83 160 52
7906 52 -206 158 130 189 -75 47 138 17 3 -110 45 181 -121 -44 77 139 119 -259 154 150 -187 -30 -4 167
7930 167 -102 -3 8 -4 -14 -26 35 -26 -105 149 92 -6 313 12 55 40 -2 -173 -313 268 -107 1 -168 34
7954C4Nn4j1k19J75mJ50J54k38j21L49k12J6oj81J23J55j66J26j69o6J43O6j9
7978C0M8k62N12n02L37k77K26n5J03k26J4K60m06L39q6k65L06n1R0Oj38k33K26
8001dJ5J00j27j33L28k61l9QJ82R2L1j56j81K54n0p6l3K45k46Lj1j05J07P3J89
8026B05k58m8oJ81r8L1j18K20j82o6L28N3k80MN9J08Q6j01J67k22r8J13k33K47
8050I2j28K23k67L99k79r1Q6J39k15n5K14k80%K13j7k12K57J63j81J9o4j28m4
8073a56K08r8k42J83K47p5l2J32k52J79nj62R7j44J07l17K26J55n4k07L10n3P
8096E4k44N7K15l2J9K7j37L29j32j39p7N9m2J9r7K87j69n2p6o9L70m90L63m16
8120c73M18R2j16J80j79j66J28n1R6k3r3j08J11R3k6j05J49O0J1Q9j96L2J16j43
$$ plain form
7954 34 39 -15 -26 -245 -70 -74 76 230 -8 -129 220 8 24 18 -163 -40 115 -51 75 -94 -160 -17 49 30
7978 30 78 -184 328 -174 163 -114 112 57 160 -66 -52 208 -198 141 55 -210 96 45 135 141 3 -230 -4
8001 -4 11 111 -16 -149 179 -82 -121 -113 69 161 192 36 -145 109 59 -17 -50 195 -51 -48 -59 -164 -57 16 205
8026 205 -53 -101 -107 74 -24 7 -111 109 -73 -139 189 242 -38 -34 25 133 219 118 285 63 -35 78 -155 92
8050 92 -36 187 -80 319 40 -51 35 174 -41 -96 118 -162 -162 51 34 -178 79 242 61 80 16 -112 -156
8073 -156 52 -46 -288 -105 142 67 35 167 -85 94 89 -73 24 -120 -13 -330 -104 51 -3 -210 100 47 54
8096 54 -190 -133 82 50 69 96 -41 288 156 17 -60 -1 -43 -24 -121 166 -3 -55 -131 -200 170 -320 43 -373
8120 -373 45 137 21 201 22 -144 -16 -67 29 6 -87 -195 -84 9 -17 -122 27 87 98 187 -9 23 139 -4
8144dJ22JM3j53p3m0k8J22kp6Q6k73M41j03q0R1k12K12r5q0P6j55K34J40l5n8
8170A01k47R4O3j6oJK03l76P9K81m50J17J32J59J9j7k79L04k23K08k49
$$ plain form
8144 -4 118 119 162 9 -64 -104 -132 -10 -12 -88 -2 -275 166 63 -17 74 -138 74 -21 -101 -25 -180 54 194 159 101
8170 101 -146 -52 11 -5 -11 -10 193 -183 -104 177 -273 -156 -24 135 154 137 -142 162 -61 147 -102
8191a02
$$ Imaginary data points
##PAGE= N=2
##DATA TABLE= (X++(I..I)), XYDATA
0@%%%%%%%%%%%%%%%%%%%%Qj6J6j6J6j6J9k7L2l2L7m5M9n7O5p3Q3r1J01j13J27
41F7j42J58j75J94k12K35k61K86l14L47l84M22m65N14n70O33p03P82q78R93j131
62f04J304j527J825k250K909m079O811k3711l0783p170l0992M808L5231M2840
76e388J7997l866j8764k803K0665K1309m216n827J6342K3851k475k3982k8683
89D160k4060j2798N481N772o630l966K0018K2339m447k1783r065J0116J6314J0967
103A2418J752l344L580R715k231j9190j2262Q596J2431k86o931m975n953o330
117a3010k376L86j088K268R051R895N299K77o238r153r71R125N814m056j218Q633
133A2638N433r624j9056j3988O1J1914J3291L341k90Q913J0498m652j8340j3216
$$ plain form
0 0 0 0 0 0 0 0 0 0 0 0 0 0 0 0 0 0 0 0 0 0 8 -8 8 -8 8 -8 11 -16 16 -16 21 -24 25 -32 33 -40 43 -48 53 -60 67
41 67 -75 83 -92 102 -110 125 -136 150 -164 183 -201 221 -244 270 -300 333 -370 412 -466 527 -604
62 -604 700 -827 998 -1252 1657 -2422 4389 -19322 -50105 -57275 -88267 -83459 -48228 -5388
76 -5388 12609 8743 -10021 -12824 7841 29150 24934 19107 35449 59300 56825 32843 4160
89 4160 -19900 -32698 -27217 -21445 -28075 -32041 -12023 10316 5869 -15914 -24979 -14863 1451 12418
103 12418 14170 10826 14406 24121 21890 2700 -9562 -966 11465 11179 4248 -727 -6680 -13010
117 -13010 -15386 -15000 -16088 -13820 -4769 5126 10425 10702 4464 -4689 -5660 3465 9279 5223 4005 12638
133 12638 18071 8447 -10609 -24597 -24536 -12622 669 4010 3720 12633 23131 18479 139 -13077
147a3077P25P217N698J757m239l287L255L290q038j2346O57J3999J3516P148J856
162A8131l085k575K257l124j5352j3689O379J5408R62j1602o840K623L153j29
176g483k468k305O489J5613Q455p284q410M466N372n663p229M62K053j049k80
191G39j06n679n444J446L948j42R42M784K026j570L71Q13n324m032N935P993L74
208G074k895K087J510l575l128k34j577k867J229L220j156l728j826j299Q2K560
224d523K550j539O23Q788P349m825r898j102N772J822m828m459K982O949L172
239H833o905r264J34Q774K630p289n046N418N888j504o350l502K495N331L317
254B960k160j603M809O509p54n999l565J069Q28k90j922l652p85L001N62n478
$$ plain form
147 -13077 -12352 -5135 563 2320 -1919 -5206 -1951 1339 -6699 -19045 -18388 -4389 9127 16275 18131
162 18131 15046 12471 14728 11604 -3748 -17437 -11058 4350 5312 -6290 -13130 -10507 -7354 -7483
176 -7483 -9951 -12256 -5767 9846 18301 11017 2607 7073 12445 6782 -447 15 2068 1019 739
191 739 633 -5046 -10490 -9044 -5096 -5238 -4296 488 2514 944 1315 2128 -3196 -7228 -1293 6700 7074
208 7074 4179 6266 7776 4201 1073 839 -738 -3605 -2376 844 -312 -4040 -5866 -7165 -7083 -4523
224 -4523 -1973 -3512 -2889 5899 13248 8423 -1475 -2577 3195 5017 189 -4270 -1288 5661 8833
239 8833 1928 -7336 -7202 1572 4202 -3087 -8133 -2715 3173 1669 -4681 -8183 -5688 -357 2960
254 2960 800 -803 4006 10515 9761 3762 197 1266 2094 1804 -118 -3770 -4555 -1554 -992 -6470
270f470m236M100O987J380k594j71L590L050j95l935l676K838O412p96p710j826
286c252O754K618p050o341K157M559P14k556k482Q08M551K304n051m584M602Q812
302F563l44o145j37N271J300m528l360m77K051K700j375n163j500N291L054n532
318b331n449L462O428j82l989m47K955K890O69l305m248K341P338J324o916m328
334c788M007M870k663o352k100L696M751M29n536m848M031Q094j08q690l142P432
350H3P266k294p174k079N594N844k136q094l073P270O719m614q917p50P050L070
366C765n254n217J613O269K497l390m328K179N749P28m526k021L534K604k053
381B149l043n5J632P93j455k180l18K776K130k755l217J153L531n7l363j350K270
$$ plain form
270 -6470 -10706 -6606 381 1761 -833 -1004 2586 5636 5441 1506 -2170 668 7080 6284 -1426 -3252
286 -3252 3502 6120 -930 -7271 -5114 -555 159 -2397 -4879 -4071 480 2784 -2267 -6851 -2249 6563
302 6563 6219 74 -63 5208 6508 1980 -1380 -1857 194 2894 1519 -3644 -5144 147 3201 -2331
318 -2331 -7780 -4318 2110 1928 -2061 -2508 447 3337 4006 701 -3547 -1206 6132 7456 540 -3788
334 -3788 219 5089 2426 -3926 -6026 -2330 2421 2850 -2686 -7534 -3503 4591 4483 -4207 -7349 83
350 83 7349 5055 -2119 -4198 1396 7240 5104 -2990 -6063 1207 7926 3312 -5605 -6355 695 3765
366 3765 -1489 -6706 -5093 1176 3673 283 -4045 -1866 3883 4611 85 -1936 1598 4202 2149
381 2149 -894 -949 683 1476 21 -2159 -2477 299 2429 -326 -3543 -2390 1141 1084 -2279 -3629 -1359
398a359L381J435l372l693J521O330J727n858m841M548P055j311p950l626M122
413a891O135p64p549n116N744R116r19r810l490Q516P222l605p507o12O238O107
429G815k371o815l069N421O020l101q140j623N898L370l779m498n4L272K646p80
445B12l483j064M218M596j591k995R18L758K59k737j333N74O8j081j933j807O08
462b813K297q70l053N9L806K231k930k484L234N102J352l731k635J616M248L30
478E759n793n400K479O170j28p041l837M261O219m38o312l371M846P492J229o335
494b00l295N354O387k153p708l134L910M719j521n883k274M183N147j531n316
509c315j840M126M069j405l006l86L465K465p03l524j850J710K418j642l140j51
$$ plain form
398 -1359 2022 3457 85 -3608 -2087 4243 5970 112 -4729 -181 6874 5563 -2387 -6013 -1891
413 -1891 4244 3480 -4069 -9185 -3441 5675 4756 -5054 -8544 -28 7194 3589 -3918 -4530 1708 7815
429 7815 5444 -1371 -4440 981 7001 3900 -4240 -5863 35 3405 -374 -4872 -4926 -1654 992 212
445 212 -3271 -4335 -117 4479 2888 -107 811 4569 4828 2091 758 1332 1400 319 -1614 -3421 -2813
462 -2813 -516 -1386 -4439 -4380 -574 1657 -1273 -3757 -523 4579 5931 2200 -435 1181 5429 5759
478 5759 -34 -5434 -2955 3215 3087 -3954 -7791 -3530 2689 2251 -4061 -7432 -2586 4906 6135 -200
494 -200 -3495 1859 8246 6093 -1615 -4749 -839 3880 2359 -3524 -5798 -1615 3532 2001 -3315
509 -3315 -5155 -1029 3040 1635 -1371 -1757 1708 4173 3470 -54 -1904 -194 2224 582 -2558 -2709
525b709K862J330j829j353O87J373K15j190j207J271L002O80k805j213K544K041
541C699l191m303K87L947J385l190k513J309M614K340l733m753J908O204R72n192
557b10l483M079M718j298n248l408K170L677K45m014k852L163N591L58m149k246
573b907L242L402n06l275k184J665L581N71l345l547J574L152m38l909j664K678
589a910L301j00k165r82K041K515m84l036q16K676J947j835k129Q80J985k48k591
606i51j778Q67J912j43j838n61K363K481j341k756J39K989J135j827k380O71K842
623A824J286j957l126J6K946J171k834k794J453L569J030k878k088N33L124J062
639B337k555k677J485L635P21l254k237J986K532K7k152j767J255K173O90k351
$$ plain form
525 -2709 153 1483 -346 -1699 -1012 361 576 -614 -1821 -550 2452 3132 327 -886 1658 3699
541 3699 508 -3795 -3508 439 1824 -1366 -3879 -2570 2044 4384 651 -4102 -2194 4010 4982 -210
557 -210 -3693 386 5104 3806 -1442 -4850 -2680 997 1242 -2772 -5624 -2461 3130 3488 -661 -2907
573 -2907 335 3737 3231 -44 -2228 -563 3018 3589 244 -3303 -1729 1423 985 -2924 -4588 -1910
589 -1910 1391 1291 -874 -1856 185 2700 2216 -820 -1636 1040 2987 1152 -977 -97 1888 1640 -951
606 -951 -2729 -1862 50 -93 -1931 -2492 -129 2352 1011 -1745 -1606 1383 2518 691 -1689 -1018 1824
623 1824 3110 1153 -1973 -1957 989 2160 -674 -3468 -2015 1554 2584 -294 -2382 -1849 1275 2337
639 2337 -218 -2895 -1410 2225 2946 -308 -2545 -559 1973 2000 -152 -1919 -664 1509 2199 -152
655a52k334J379K849m62k700j130J909J901o47j783q49J623K413r6k119r15J806
672F93J925j687k679N33K530O24k029j501N20J572N81j898j678J339K562O0k236
689g69r56K195J678j334k068R5J753J071n17j379q25J412J119j145j957j96J738
706h5R04o21j659M18J224J218q69j640K75J334J662j208j969m0K442N73k192j494
724a727O89K183L36k091j647J368K266J0k379j066J982K304j054k265o12J999
740B96J102o76k018m41K028J828j443k039J60J817J135j290j720L44J400Q28r23
757C88j716R9J569Q42j309j334L74K109L48j078j221O38R56P35q43j301L98J468
775A122j11j496p23Q26J157n49j134O5P28Q37j27j277k10J157J031j078j454P70
$$ plain form
655 -152 -2486 -1107 1742 1280 -1420 -2550 -641 1260 613 -1170 -2019 -396 2017 1921 -198 -1113 693
672 693 2618 931 -1748 -1215 1315 1939 -90 -1591 -1071 501 1082 -816 -2494 -1155 1407 1467 -769
689 -769 -1725 470 2148 814 -1254 -1159 594 1665 1148 -231 -1056 356 1475 330 -1627 -1823 -85
706 -85 819 198 -1461 -1043 181 1399 530 -1110 -835 499 2161 953 -1016 -1056 1386 1959 -233 -1727
724 -1727 -1038 1145 1481 -610 -2257 -889 1377 1387 -992 -2058 -76 2228 1174 -1091 -1703 296
740 296 1398 722 -1296 -1737 291 2119 676 -1363 -1203 614 1749 459 -1261 -917 483 1311 388
757 388 -1328 -1229 340 1182 -127 -1461 -1087 1022 1370 292 -929 -291 665 1400 557 -744 -346 1122
775 1122 1011 -485 -1208 -382 775 226 -908 -843 -115 722 595 -682 -892 265 1296 218 -1236 -466
793d66J760q2j107j080P75J122q3j267q42Q46J400J30k074q11J320J717m86j676
811i04o33J676J345j97k025m19J683J120n56k085l19J432J646j240j752k77J602
828I7P66n20j214k58J284R02l26j641m29J454J235p31j283j14R12P72n31o90m08
847g23P52P90p48p32m6J068J28q28o33O81Q76l12r73J56J086L68n91j143M97J235
867I08J9j075j043P34J558j80j638p18J211J209l32j217o45J151J512n97j433
884e76k86J055Q51k44r86n10M57J337j32j821q14J204J464l56j211q60J033J292
902H97J12j436n86O21J693k46j600n13J133J227q14j432N9J258m2o6p76k44R19
921A64M55n05o96L6J129j38o92j81K82L77l44k0j7K63O16n69n65Q6O65K66n92
$$ plain form
793 -466 1294 1212 105 -975 -200 922 839 -428 -1270 -424 976 1106 -968 -1779 -459 1258 772 -904
811 -904 -1537 139 1484 1287 -738 -1157 526 1646 1090 -995 -1314 118 1764 524 -1228 -1505 97
828 97 863 343 -871 -1129 155 1057 731 -910 -1339 115 1350 619 -664 -778 134 906 375 -315 -723
847 -723 29 819 71 -661 -707 361 489 -339 -972 -291 585 273 -700 -544 542 910 319 -824 -327 908
867 908 927 -148 -1191 -457 1101 921 -717 -1435 -224 985 653 -564 -1209 -58 1454 857 -576
884 -576 -862 193 1044 800 -186 -696 -239 1098 966 -855 -1669 -465 999 643 -568 -1428 -395 897
902 897 1009 -427 -1013 -392 1301 1055 -545 -1058 75 1302 488 -944 -885 373 331 265 -511 -755 164
921 164 619 114 -582 -546 583 445 -247 -428 -146 231 -113 -133 -150 113 729 160 -405 -319 346 612 20
942B0q61N02J100Qo43q91N80Q49j48p97p20N02J313r3j082r89J146J287m79j276
962f72m37P49Q90M25j039p60Q37R37Qj450n84P77J111j77j087m82P89O60n7j229
982g91k37P92J044l07p65k29R34N39n76o63k38M85Q58q73m57j18J214J60j059
1001b87l71O06L83J81q12l29P28Q10o50n87J88N70K08n58o97P3J072J09p75m20
1021e58N22K86J86n35m15j75Q93P83q71j000N38J051nj008l85j8J579q0j034j037
1041a283R53J296Q2j329q92J031Q45k54j216j71J145Q11n40j041k91J167N35o88
1059A60j059K14J120N27q29q97L60P53K65p59o13K97Q26M01q27n40M34Q72k36
1078D69q71m19N53R55k51o58k13O62N78k18q51k09N81P24n28j055K21Q63N79p77
$$ plain form
942 20 -841 -339 761 769 126 -765 -185 664 516 -281 -1001 -499 814 721 -361 -1350 -204 1083 604 -672
962 -672 -1109 -360 530 955 -84 -844 -7 930 938 -512 -1096 -319 792 615 -472 -954 -165 495 438 -791
982 -791 -1028 -236 808 501 -264 -493 441 980 404 -259 -497 -12 846 -27 -484 -602 612 772 -287
1001 -287 -658 -52 331 512 -300 -629 99 909 259 -328 -140 430 638 80 -617 -544 528 637 -138 -558
1021 -558 -36 250 436 -99 -514 -689 204 987 116 -884 -346 705 700 -308 -693 -711 868 788 -246 -1283
1041 -1283 -330 966 1048 -281 -1173 -142 703 449 -767 -938 207 1018 478 -563 -854 313 848 160
1059 160 -899 -685 435 962 133 -764 -404 349 614 -145 -758 -461 365 766 -61 -601 -167 705 469
1078 469 -402 -821 -268 687 436 -222 -435 227 805 587 -264 -473 108 832 304 -751 -530 333 912 135
1098A35j032K17Q66P36p58p41K10J108K30j204n27O43Q90k03p64q97O55J009j
1117E72r79o36R50Q93k49j118l04J124M58j53j147Q0P38N61n50j199R6J425K32
1136G94p88q99K60J379L4q71o12N2J217K48r35p41M25J035J69j149m22Q61O04
1155F61l64o24l60M90R39k52n46o32M46R29l15q42j47P17Q67o41j025K44O86M60
1175F91p62n76L7J270L3r65n88O57P98mr01o69R13J032m59j209k09R99O66n41
1195B13q18j16R50P83r63j030K63J081L85m84r21r2J191M31q09q40K48J079L25
1214H76q41p23J58J074M71r53r95N43J169k8j075o82P76J046j85q94o67P02J047
1233H19l63p82j86M30J042o38o73j15Q11M56o03o88K32N34M11q44l29L26P75K3
$$ plain form
1098 135 -897 -680 186 922 164 -577 -367 741 971 -233 -760 -117 773 570 -194 -1091 -436 573 572
1117 572 -407 -1043 -93 800 551 -567 -871 253 711 558 -589 -509 229 790 240 -959 -863 562 794
1136 794 6 -893 -633 746 780 -91 -703 -651 566 814 -121 -862 -437 598 767 -382 -804 57 661
1155 661 297 -327 -687 -197 742 490 -56 -688 -242 687 372 -470 -617 100 967 326 -699 -455 231 691
1175 691 -71 -647 -610 660 693 -272 -860 -203 595 591 -310 -979 -66 966 507 -702 -911 88 754 213
1195 213 -605 -721 229 1012 49 -981 -718 363 748 264 -657 -749 442 873 64 -776 -528 551 876
1214 876 35 -688 -530 544 1015 62 -933 -390 779 751 -324 -1006 -230 816 631 -263 -930 -228 819
1233 819 456 -326 -512 -82 960 322 -351 -466 345 801 198 -490 -258 276 687 -157 -486 -160 615 638
1253F38q82k98J88J113l04o12p09R33P81p01p60n5Q25O45l84r57k27R22P47n54
1273C49q37k52Q75P92q57o95j17J110M51q17r34L10R98K44n96p90M52P38J90o92
1293g8o37J36J187pp64m43K99O47L4p47n8M68N08j18n39l23M34M67l04n40j73
1314e51P06N41m34p57J47N59L29n52p14Q46J18K9n32n37O46P62l97o98k27Q77
1334A61L42j53o10j13N19L71j27p71k45N68N98k5r09j66R12K31l54o07k70O31
1354a7P82n19p66j91R51N43m63r17P1N64O88q27m55m6Q58M99o98p70M39N80K56
1375E62n83n34L34N23K26p57j40K60N15l73j78M9K33J86k66k73j74M40J32j14
1395F8k54P6K34M05k76n73J36N3N25k64o81K48M60N22p34l52K02N14L0l71m69
$$ plain form
1253 638 -244 -542 -354 759 455 -157 -866 67 848 147 -613 -668 157 802 418 -539 -766 156 903 349
1273 349 -488 -740 135 927 70 -625 -742 368 819 2 -932 -622 376 620 24 -766 -314 424 614 -78
1293 -78 -715 -579 608 601 -163 -606 -307 340 374 -373 -431 37 545 427 -112 -435 -1 466 162 -378 -551
1314 -551 155 696 262 -495 -348 211 540 -12 -726 120 238 267 -265 -802 -156 606 209 -489 -716 161
1334 161 503 350 -260 -373 146 517 390 -381 -626 -58 540 515 -394 -560 352 583 229 -378 -648 -17
1354 -17 765 246 -520 -711 240 783 320 -597 -526 38 726 -101 -556 -602 256 755 57 -713 -274 306 562
1375 562 -21 -555 -221 302 528 -229 -369 -109 406 33 -145 -96 137 323 57 -216 -390 50 182 68
1395 68 -186 -110 124 529 253 -320 -184 -131 394 130 -551 -303 157 679 -55 -407 -205 309 339 -32 -501
1416e01J70Q14O2o21q05J036J39P0p03j1Q4P23k83n89k13P27L16K3o05k00M36
1437F9K24j6o16k05N35M16n31k07l2O84J16j70r41L36N22L57m78m65L35K40K51
1458D24m20l66J65M51K58p88k18M67M36k22l68k18N07K53j46n29R3M23J06P1o15
1479b36k14M44N30k99o46k29Q82K61l41m09n0O67J63n04p27L71O86O1l53m94N7
1500c80O23K62n92n00K97O25o6l85q1m5M27N9o11q0K98N17m3n77j69K69N96m57
1522a3k58j14P26L30l85p79M5P07J57l25o16J04N63K54l76m14O3M84L36n68k52
1543c31Q7O77k66l25m22M34N31j83m05j07K27N16r0m95j26N62O4m26k21O4L45
1564A10L17m15n75M22M86J38m30m55J43L88J62k53l83J89K10L94n40l64K99K74
$$ plain form
1416 -501 -331 483 545 -76 -881 155 294 364 -339 -350 -266 457 174 -415 -628 99 415 438 -167 -367 69
1437 69 293 277 -339 -544 -9 407 -124 -331 -363 321 437 267 -674 -338 184 541 63 -402 -67 173 424
1458 424 4 -362 -197 254 512 -276 -494 -27 409 187 -181 -399 108 361 215 -314 -221 202 308 379 -236
1479 -236 -450 -6 524 225 -421 -650 232 493 152 -257 -307 360 523 19 -708 -337 349 410 57 -437 -380
1500 -380 243 505 -87 -587 -290 335 269 -116 -197 -242 185 244 -367 -447 -149 368 325 -252 -421 -152 444 -13
1522 -13 -271 -385 341 671 286 -493 -448 259 416 91 -525 -421 142 396 20 -394 -331 153 489 -79 -331
1543 -331 -244 433 167 -158 -580 -146 385 202 -203 -310 -83 433 343 -152 -278 284 348 -78 -299 -235 110
1564 110 427 12 -563 -141 345 483 53 -402 -259 129 291 38 -345 -156 54 448 -92 -456 -157 117
1584A17J61m65m08J74Q51k48l69l8L86K74m54l30o1M52N34k38m99j93N47L21P4
1605E88j087jN42L05n4r69K39Q82P2m16n35L4M79L69l50l64r8P54j1n48l80L81
1627a68L41%k17l25M10L09J67n92l07L48L11j4k99k85M48J88k86L1j22J50K33
1648C21k00n99K71M29K5l96j30m6N53J05n67j05J04P84l17n13q2K31O35n4r42
1669d93K7K80N73K4q35n4O15M31k94n13j50L25N29l74j78l64Q04j14j68m63P6
1690c16K26L63j84k88pL31K24n64k6M7M79K8m68j59Q5O26J54m79n79N15K78k00
1712H6l00j85L63L26j14l65J50J76J96l61k74K9L90L40m64l84L37J11J52k07l54
1733c52L22N3K36l76l16N29K53j06k96j91J82M83k01m26nK01L61j33j55n14M54
$$ plain form
1584 117 278 -187 -595 -421 430 182 -187 -225 161 435 -19 -349 -410 42 576 338 -161 -354 193 514 588
1605 588 -499 -500 42 347 293 -676 -437 445 517 101 -434 -400 79 448 98 -266 -364 390 379 -169 -549 -168
1627 -168 173 173 -44 -369 41 350 517 -75 -382 -34 277 263 -36 -321 127 315 29 60 -62 88 321
1648 321 121 -478 -207 222 247 -149 -279 -325 228 333 -234 -339 -235 549 232 -281 -363 -132 503 449 -493
1669 -493 -466 -186 387 411 -424 -478 137 568 274 -239 -389 -64 465 91 -87 -451 353 239 71 -392 -316
1690 -316 -90 273 89 -199 -206 125 349 -215 -241 -194 285 313 -155 -314 -229 397 551 72 -507 8 286 86
1712 86 -214 -399 -36 290 176 -189 -39 137 333 -28 -302 -273 117 457 -7 -391 -54 57 209 2 -352
1733 -352 -30 23 259 -117 -433 96 349 243 -53 -244 -62 421 220 -206 -211 -10 351 218 63 -451 3
1754CL70l86j03l17P17K81k67n61KK17J18Q2m20O0L61K97l53m93M59O2P6j15n29
1777d39K44K43K59l49j51J56J46J78l62k08K49L74l07j94Q4J48J39j62j24j91
1797b67L14J28j87k1k21K78K85l84k64J78L07J83k03n57L22K99j02l40j10L54
1817hP5J65n44J94KJ81J7k24j27K47J19j42Nj13J57K28l5r3k83L07J61J18o48
1840b41k4L49K53m12J97k98L51K50p06J32k34Q12j91k51p2j58M59O3n43J67J32
1861C5j3R2l25J28R7J68j32n7j97K48L08j16l13P4J23Nj24K5k83L01K80n28j1
1884b15k7M45J09k30k78J70P3L21k87j38q0M41j50J4j91J57Kj31r8l26L58L64
1906C03l64j72K56P6K47l20j52j89N34k79L51l13j91L35o0n3l28J81M5M03k13
$$ plain form
1754 3 373 -13 -116 -433 284 565 298 -263 -261 -44 74 156 -264 -204 157 454 101 -392 67 129 205 90 -439
1777 -439 -195 48 307 -42 -193 -37 109 287 -75 -283 -34 340 33 -161 -77 71 210 48 -76 -267
1797 -267 47 175 -12 -33 -254 24 309 -75 -339 -161 146 329 126 -431 -109 190 88 -252 -362 -8
1817 -8 67 232 -312 -118 -116 65 82 -142 -269 -22 97 -45 -40 -153 4 232 197 104 -179 128 289 407 -241
1840 -241 -265 84 337 -75 122 -176 175 425 -281 -149 -383 429 238 -13 -85 -243 216 279 -264 -97 35
1861 35 22 114 -211 -83 14 182 50 -7 -204 44 352 236 -77 -3 120 125 1 26 -257 44 324 -204 -215
1884 -215 -242 203 312 82 -196 -26 47 368 81 -57 -137 304 154 168 -23 134 136 5 -93 -419 -61 303
1906 303 -61 -233 23 99 346 26 -126 -315 219 -60 291 -22 -213 122 62 9 -319 -138 -93 310 97
1927I7k75k27O84j2l65K8o5J32R4o5m59N30j41K30l45j3K50J15j02N2l28J96K69
1950B80k05j96J41p3R5J26l70R6J09m2j7k27L65O8l1j51j51R3L07K43k28l54N1
1973g1L3K31j54k67L16O8j36r2j39L32L12j85l28k12OM21n0j18k38M31K10k28
1995A42n08O7J96K81m7k71p9K15J97m40m2J26J17J39j84J41k09M35P1l25l4k18
2017b30L36J52k12l13K88k5K79l12r3J63Q8L2R3l68K27j46J89m6j58o4J63N3k67
2040a71k1O1L28m05J13J18J69M4k60k24K49K37j04m84J36O8L79l47R8J66l24M72
2062B98l75J89k91J29L50o3l62l05M69q4R9k6q2K8K41k74q1k0J71K09q0k86j51
2085b97L70L5j47k01J26L33O5Nn23R8L36O9m08r0J33K08L5j47p3P2K15k01j82
$$ plain form
1927 97 -178 -405 279 267 -98 -70 -135 -3 91 26 -433 97 -44 186 -159 -172 78 193 91 143 -185 11 280
1950 280 75 -121 20 -53 42 168 -202 -106 3 -39 -56 -283 82 150 119 -32 -183 -90 217 460 232 -122 -71
1973 -71 -38 193 39 -228 88 156 20 -72 -211 121 433 248 -80 -292 -286 135 85 -33 -271 160 370 142
1995 142 -366 -299 -103 178 131 -140 -219 -4 193 -247 -289 -163 -46 93 -91 50 -159 276 347 22 -12 -230
2017 -230 106 258 46 -267 21 -4 275 -37 -130 33 121 153 246 -122 105 -41 148 102 -56 -120 43 96 -171
2040 -171 -192 -131 197 -208 -95 23 192 236 -24 -248 1 238 134 -350 -214 -146 233 -114 -16 150 -174 298
2062 298 -77 112 -179 -50 300 237 -125 -430 39 -45 54 28 -54 -26 215 -59 -140 -160 11 220 140 -146 -297
2085 -297 73 108 -39 -240 -114 219 284 289 -234 -136 200 269 -139 -229 -96 112 147 0 -73 -1 214 13 -169
2108a69K34l90N65j50j07m7K54l48J84n2J7L2Q1Q3k34r2K05j35L3j78K04p0K25
2131A45l4l01j31L47J20l73L28RR1R8j36j53j48K26j31j37J96J07m5j34L3j17
2153a40K11K3J29l19r2J64K54r5k88O2P5L00l72J54j09j84L98j66k48L5L47P3
2175B12j38k78K99q1L7j91k0O9J75n1k88J87J86j30J59k44m2N00k67R3J6l44J63
2198B2J0k24Q2K38N4m8k90Q2q9L02Pk81j84L85N2j5q7j15J76j22R6q2l93L89K32
2223A97l15k1m6J6N2L86j80k82L00J31o9j58J30k60L11j79n2n4K39Q8r9l58J08
2246a15P8J33j63n0j20L12O6j74Mj11J04K5r8j15J10K15k24K68k05l4K99k06j77
2269a78JL02P1j1j58p6J87p4k10j84J57L61j7l88K9J74k3L13k39k20J58P6j56
$$ plain form
2108 -169 65 -325 240 90 -17 -64 190 -158 26 -26 -9 23 104 187 -47 -139 66 -69 -36 -214 -10 -80 145
2131 145 111 -190 -321 26 146 -227 101 110 201 299 163 10 -138 88 -43 -180 16 123 78 -56 -23 -140
2153 -140 71 94 223 -96 -188 -24 230 135 -153 -91 -16 284 -88 66 -43 -227 171 5 -243 -208 139 212
2175 212 74 -204 95 14 51 -140 -160 -91 84 33 -255 -68 118 -12 147 -97 -139 361 94 187 203 -141 22
2198 22 32 -192 -110 128 182 134 -156 -74 -163 139 146 -135 -319 66 118 103 16 -99 77 -45 51 -31 -424 -35 197
2223 197 -118 -139 -185 -169 -117 269 89 -193 107 238 169 11 141 -119 192 13 -39 -93 146 234 135 -223 -115
2246 -115 -37 96 -67 -117 -237 75 141 -33 -29 -140 -36 -11 -109 -224 -114 101 -123 145 -60 -94 205 -1 -178
2269 -178 -177 125 196 185 27 -49 138 64 -146 -330 -173 188 171 -217 -188 -14 -37 276 37 -183 -25 51 -105
2292a05K1J7J44m6l0Q8l68Q9J19O1N2m31L87J74n9q2J3k63K44n2pm9K00K39l16
2317D0Rk13J88o2N6Q9j47PK34j87j93R2J15L3J70n84K54K39j22j66J7J11q7L17
2341B10n73K71L7J79o1l3k12J76O3p0J14j3K6j6K21m88J64J3j19O3r9r8M97o6
2365A86l13O7J9O6j32p8L44R4j26n2k73J19LL67j65k63m7J24K2R9j68j41M55o1
2389A46r4k15R8PM3K04l60K10P9n8k9l46M14k63K55j9k34L43Q1j26k95L5J58J93
2413B27k82K2k0L1L56l64k15J17j62M22K6j93m3P8J21K9j87o1Q3J17o0n0%Q0q0
2438hj99J82k4J76J03j88k59j21M62j81j68K34j00j31K96j13J89J3k06N7J49j60
2460CP9k7m0l07J78J47J28l13J22o3J71N6k77q8O8K07Qm1r1j79M48K31k96j75
$$ plain form
2292 -105 -84 -67 77 31 1 89 -279 -190 -71 -10 42 -389 -2 172 113 31 44 -219 25 -27 -34 -83 117 356 40
2317 40 49 -164 24 -38 18 107 -40 -33 201 14 -179 -87 28 61 231 -353 -99 140 18 -148 -131 -20 -107 210
2341 210 -363 -92 -55 124 63 30 -182 -6 57 -13 101 88 114 98 319 -169 -5 8 -111 -48 -147 -245 252 186
2365 186 -127 -60 -41 25 -107 -185 159 253 127 75 -198 -79 -76 291 126 -137 -184 -60 -38 61 -107 -248 207 146
2389 146 52 -163 -65 -58 -15 189 -171 39 118 60 31 -315 99 -164 91 72 -162 181 262 136 -159 -124 34 227
2413 227 -55 -33 -53 -22 334 -30 -245 -128 -290 132 158 -35 -78 0 121 150 -37 -98 -15 102 42 -8 -8 72 -8
2438 -8 -207 -25 -49 127 230 42 -217 -338 124 -57 -225 9 -91 -222 74 -39 150 163 -43 14 163 3
2460 3 82 55 15 -292 -114 33 161 -152 -30 -93 78 134 -143 -231 -163 44 52 11 -80 -259 189 420 124 -51
2484e1N0J01j99j1J05j81J44M0L3k00k9K10J41j38p7K78j24K85m53p2J37n9J22
2507E2r6J30n0rk06p0K24k10K80O1j11J21P6l28Q5j95L33J46k41J66j66J65p6
2530H1j23L8O7k96M96l5l70O7L53m9l04j04J64p1L83n35J56J52j48J72r6R0j78
2553i0J68j74K15m69L36K16k14K6k67J38R0M07m34n3J89J43j6k76j4J46N5K6k67
2576a19N2K24j93L49n93K55R7M8j31qJ78K7o4m4J0l12K52o7K31l82L56k75J25
2599A6l4o7K6j1J63j81K7K46N2o0J15m69L02J13k66JO3l3L1k8j20J43K43k45J93
2624B20j07j28Q9k31j11M4Q4J22L5Qp9N3K46m59L61j07j4O2j42Q9j74j82N20k0
2648A79m59R7K54M0K7k45M3l2K03K2k34k28J32J04J10J14j77J90l65K50q7R5n
$$ plain form
2484 -51 -1 100 -99 -110 -5 -186 -42 -2 31 -169 -198 12 153 15 -62 216 92 377 -76 -148 -11 -70 52
2507 52 -44 86 36 27 -179 -249 -25 -235 45 106 -5 116 192 -136 -51 -246 87 233 -8 158 -8 157 81
2530 81 -42 -4 63 -233 263 228 -142 -75 278 229 -75 -179 -15 -86 297 -238 -82 70 -78 94 -2 88 -90
2553 -90 78 -96 119 -350 -14 202 -12 14 -253 -115 -25 382 -52 -105 84 227 211 -65 -79 67 122 148 -119
2576 -119 -67 157 -36 313 -280 -25 72 120 -11 -19 159 186 122 78 88 -224 28 -39 192 -190 166 -109 16
2599 16 -18 -85 -59 -70 93 -88 -61 185 237 177 292 -177 125 238 -28 -27 36 3 34 6 -114 29 272 27 220
2624 220 113 -15 74 -157 -268 -224 -140 -18 17 25 -54 -1 245 -214 147 40 26 88 -54 35 -139 -321 199 179
2648 179 -280 -183 71 111 138 -107 -64 -96 107 129 -105 -333 -201 -97 13 127 -50 140 -225 25 -62 33 28
2671B8O6j20O4k47K72K3k75K98m14L05P9k31J84j50Q0M3J10j61K73k20M8j13J26
2694F8O7j1M0j68J14k85K95L2l55m0K10R9Oj34LJ37N8j58N0Q5k5m1o3j49P3J06
2720A4k23K00l14M9M20L9k85K72j49j53P4k78K90L93m32P3j31R7O3J28j47N7k29
2743a72k7J71N2m8R7p3j22k1R1m9K78j16q8K4J87k2k43q2K35j35J2J90l51J21
2767i1R5J07J45k74j69M08k53K17l38L99l69J71m9Q2J7j58N7nm4J02R5n4l73J94
2791h8Q8J04j24J7J43l56L02j27j1Pl2J49k42k0O9M22m01RJ50O1Q1k64J9j41K14
2816B9J30k05Q7j75J31j18J48o7r4l02N84p4j23J69k14L75j78l40L92l70K42K28
2838B55l63k7K12q6J57K2j08j72J54N3k45J09K3r7J44K81n51K96K29k62KJ82k96
$$ plain form
2671 28 94 -26 38 -209 63 86 -189 109 -305 0 79 -152 32 -118 -38 5 115 -46 227 7 55 -58 68
2694 68 135 124 164 -4 110 -175 120 152 -203 -243 -33 66 72 -62 -59 78 136 -22 28 113 88 47 -16 -165 -92 14
2720 14 -209 -9 -323 -274 146 185 -100 172 23 -130 -56 -334 -44 349 -83 -10 -141 -44 19 147 0 57 -172
2743 -172 -199 -28 24 -24 73 0 -122 -143 -52 -101 177 61 -27 -3 184 162 -81 -163 72 -63 -51 139 -212 -91
2767 -91 4 111 256 -18 -187 221 -32 185 -153 246 -123 48 -1 81 98 -60 -3 -8 -52 50 145 91 -282 -88
2791 -88 0 104 -20 -3 140 -216 86 -41 -52 -45 -77 72 -170 -190 -121 301 -100 -91 59 120 201 -63 -44 -185 29
2816 29 159 -46 41 -134 -3 -121 27 -40 -134 -436 148 74 -49 120 -94 281 103 -237 155 -215 27 255
2838 255 -108 -135 77 -9 148 170 62 -110 44 97 -148 -39 -16 -113 31 312 -239 57 286 24 26 208 -88
2861h8L30l19j44L09k32L2Q6k05J4L02k02J09R8k17J25P9p5P6j37K27Qm8r8j67
2885a37J10J20O4k04O5m6J4MO0J67j22j26Q8q6K29k16R7K3j11Q7ok65J38K22j14
2910E5Q1p0M0j37M7J16o4m87L17J46j40R0j31J81M7k29M10n88L73j57r3J47M4
2933bQK0p6o1K42j01J49k00K77k63M83l93p6j00K15L9k47M1j95K07K28k75K26
2956A46%m5Q3j48j95m9K71KN2j94j33J68Q5k5j25J46J03j13J34k98K84n51L52
2979e0j54O2M5N6J23K00l06L3N7P1j88J25j37K28l38J40J18j1j17j3K53j33N2
3002A16l18M52l84P9j22K38k32M54j10k74N9J39o0m8K32o9k00o4j35K50r4M7m3
3025h7O2J90j39j61K2J15j0K09l97M37j20K7k20j64L36q4P1p4k15R3J55R0j99
$$ plain form
2861 -88 242 -77 -221 88 -144 -112 -26 -231 -217 85 -117 -8 90 -127 -2 77 2 78 -59 168 176 128 30 -137
2885 -137 -27 93 157 -47 18 -28 -14 -10 50 217 95 -31 57 -29 200 -16 81 104 -7 80 74 -191 -53 169 55
2910 55 136 66 106 -31 16 132 68 -419 -102 44 -96 -6 -137 44 91 -138 272 -316 57 -100 -193 -46 -2
2933 -2 6 26 -50 -111 131 30 179 -21 256 -7 476 83 7 -93 122 161 -86 -45 -240 -33 195 -80 146
2956 146 146 101 184 36 -159 -208 63 65 117 -77 -210 -42 43 18 -107 39 142 29 163 -135 149 -402 -50
2979 -50 -204 -142 -97 -41 82 282 -24 9 66 137 -51 74 -63 165 -173 -33 85 74 -43 -56 197 64 116
3002 116 -202 250 -134 -55 -177 61 -171 283 173 -101 -42 97 37 -11 221 152 -48 -112 -247 3 -91 -44 -87
3025 -87 -25 165 26 -135 -113 2 -8 201 -196 241 121 148 -72 -236 100 16 87 13 -202 -109 46 136 -63
3048f3K93l7J44m16L41l90L22k56K37k29k6j7N6J28j1p2k96L77j28l58L71J51
3070A21p1k37J50k40M02J9LK3j15PJ70J22l57l5K04Q4k29k49L22j50o1k7p7J99
3094b2J21k1N2k75J89n5Pp7J50mo6NK0k01L3K28k20J16M6L10m21j3L56j49j43
3119c4P3Po9k38K54p2J75j33L3J6j7o7j10Q3J81j04M4K36j33k90K01j48K80l17
3143a49K00J56m20J96J5J39j65J56j94l9O8K42k31j35L57p4ml67k1L25m7k6L0
3166A2n1O0j41J01L0p0J91J09n3k31l5J91k23K18r8l0J15j10k80M58j74J55j88
3189d4o5J22K12q2k7j54j07L4j7P7j07K07l8l6p7J20j21K85j23n5j10K50j60M4
3213B8K72k81q4k86L27K61l19J41K11l61P4k95J52K49p9k87K72O5P5o6Q4q1o5
$$ plain form
3048 -63 230 193 337 -79 262 -128 194 -62 175 -54 -80 -97 -41 87 76 4 -292 85 -43 -401 -30 121
3070 121 50 -187 -37 -277 125 144 147 170 55 62 232 354 -3 -38 166 250 21 -228 94 -56 -117 -144 -221 -22
3094 -22 99 78 130 -145 44 -11 -4 -81 69 65 -1 4 24 -177 -144 84 -136 -20 26 336 -85 -98 258 109 -34
3119 -34 39 46 -23 -261 -7 -79 96 -37 -4 12 -5 -72 -182 -99 82 -22 22 258 125 -165 36 -112 168 -149
3143 -149 51 207 -213 -17 -2 137 -28 128 -66 -105 -37 205 -26 -161 196 122 118 -249 -270 55 8 -18 12
3166 12 -39 21 -120 -19 11 -59 132 241 188 -43 -78 113 -110 108 10 -20 95 -15 -295 163 -11 144 -44
3189 -44 -109 13 225 143 116 -38 -145 -111 -128 -51 -158 49 11 -25 -102 18 -103 182 59 4 -106 144 -16 28
3213 28 300 19 -65 -351 -24 237 -82 59 270 -91 -17 -312 -160 89 10 -277 -5 60 135 69 153 72 7
3236Gj21J10j08n8J69k07J74jl1J9J2j32j53M04k8j47KK1k38O38l97J48l62Q4
3260a95L40o2r6J48k39K27j94R3n4K40P4k49j89j6L02n5j50N0K37k62J80o1j66
3283i7K0J86l48J41J78K1j15r2K60k11O5J38j86q9l0N05j33j82O0k54L20k69k6
3306a38q0J43M6K35l13J87p3O5q6ko1k5R8j44Q9Po2K35O9k01o5r9L28l35K80j76
3332g8k0K15j15K50m83L46Q4k33N4J77k26o8J14J3j63J57j67j67P1J7J85Om2Q3
3356A0P2kl76L44l2R0K5j82j62O1J53M3P8j72K86l09M05l13j18J34k7j29J80O9
3380A28l2o9J26k02k67M22j89N0J38j29j03J62l3k06K94m6M9L17k81n2L9n4l9
3403B3k60O5K09J56m0k46K03J61l71J96j66J8J24j79K52k35K22R7j35k48M7rJ37
$$ plain form
3236 7 -114 -4 -112 -170 -1 -208 -34 -35 -66 -47 -35 -167 -320 84 56 -91 -89 -68 -306 332 -65 83 -279 -195
3260 -195 145 83 -13 135 -104 123 -71 22 -32 208 282 33 -156 -172 130 75 -75 -25 212 -50 130 69 -97
3283 -97 -77 109 -239 -98 80 101 -14 -106 154 -57 8 146 -40 -129 -159 346 213 31 91 -163 157 -112 -138
3306 -138 -218 -75 -29 206 -107 80 7 72 -14 -16 -77 -102 -4 -148 -59 -52 -114 121 190 -11 -76 -175 153 -182 98 -78
3332 -78 -98 117 2 252 -231 115 199 -34 20 197 -29 -97 17 30 -133 24 -143 -310 -239 -222 -37 -31 -73 10
3356 10 82 80 -296 48 16 106 131 -51 -213 -152 1 44 122 -50 236 -73 332 19 -99 35 8 -121 59 128
3380 128 96 27 153 -49 -316 106 -83 -33 105 -24 -127 35 2 -204 90 44 93 410 129 77 116 62 23
3403 23 -237 -172 37 193 153 -93 110 271 -100 96 -70 -52 72 -107 145 -90 132 229 94 -154 -107 -116 21
3426B1m9j9l10J90N0K3J90j63r9K99j02j27Q8k92N26j10o0k65R8J82J5k25L3K68
3450A62j63J20o2j20%J66J6j72k4J25m8p5J36O8J28l64q6J70o6J54j33P0J35j67
3474c0K2j36qO9J77l8MP2l22O9J09J27n8m5o5p0j26K7J76J28k10J69p0J86l27
3499a70M1J99j41L1m4J88l48L89k29J52J69J15l14pJ03k22OL9J39O1N6q8k07K56
3523A74k42L8j48M3L09j93K22p0k38RM83m79K52m40R3K70j24J81kJ76k25p8K28
3546B39k56ok3P2k47K95J15j22j08j9K45j75J14l5j29J51o8J53j75lm8QO7m0j15
3571a10J30J29k39J22N2k9P7j74R3J23k12n0j10L02j29n7MK8M1j08Q7l4J05l8
3595Cl5J65j66K02k35n5J22J54k9j46N2o5LJ39Pk03O9P7l63J10J52J42N6j70l3
$$ plain form
3426 21 -28 -47 -357 -167 -117 -94 96 -67 -166 133 31 -96 -8 -300 226 116 56 -209 -111 71 86 -139 -106 162
3450 162 -1 119 57 -63 -63 103 119 -53 -77 48 0 -75 61 129 257 -107 -193 -23 -89 65 -68 2 137 -30
3474 -30 -8 -144 -152 -83 94 56 60 132 -190 -121 -12 115 57 12 -53 -123 -249 -222 -46 82 -128 41 -29 157 -170
3499 -170 -129 70 -71 -40 -84 104 -244 145 -84 68 237 352 38 31 134 -88 -82 -43 96 157 213 125 -82 174
3523 174 -68 -30 -178 -135 174 -19 203 133 -105 -96 387 -92 160 -280 -187 83 -41 140 138 314 89 11 239
3546 239 -17 -23 -46 26 -221 74 189 67 -41 -60 185 10 124 89 -40 111 43 196 21 18 -30 -22 45 5 -110
3571 -110 20 149 -90 32 84 55 132 -42 51 174 -38 -88 -198 104 -25 -82 -78 -50 -9 -117 -30 -64 41 3
3595 3 -32 133 -33 169 -66 -121 1 155 126 -20 32 -33 -30 109 116 -87 -18 59 -304 -194 -42 100 156 -14 -47
3620d7J48pj00r0J54N3j41o6J5K05pp7J12j46L4r6r6K16j07J96j80o4N9K5m0R3
3646D6j78J5K20j96M34l61M4j06K60j80r6K74j42r5j2j63M01m2p3l4qj06rO8K19
3671A80j92j64J42O0o5J3K5k69M05k90K87k05J23n4l3J56k35J59j29Q4nl02K80
3694b9M0j60L5k9K61j85O6M2K27k86L1L8K3k31K26P1o4Q2lj7j53K4j7l4k0j00
3720a62OK58Nl12j11K16K50l9l8l52P0R6l03M55J96l19J30Rn3j74K93j99J12j69
3744a35l4Q9N9L5J61j51J27j46J18k88L1J40n0J86k4l02K26oj18J12L9L4r8o0
3768e5n2J15j2M5K43l80o2N5J12j05kK5j03J84k61L09m6k15pL10m8J6k4K4j03
3793c7n2J47l59J44l0L56p7j84J98l35L57l47J15j92J59L43q2J75q2j16k94K95
$$ plain form
3620 -47 101 94 -6 -96 58 111 -30 -96 -81 124 117 40 152 6 40 -56 -152 64 -43 153 -27 -91 -32 -7 -47 46
3646 46 -132 -117 103 -93 341 -20 24 -82 178 -2 -98 176 34 -61 -73 -236 165 123 50 16 8 -98 -107 -39 180
3671 180 -12 -176 -34 26 -39 -26 -1 -270 135 -155 132 -73 50 -4 -37 119 -116 43 -86 -2 -7 -309 -29
3694 -29 11 -149 -114 -143 118 -67 -1 41 268 -18 13 51 74 -157 69 140 76 158 155 138 -15 9 -8 -42 -62 -162
3720 -162 -156 102 107 -205 -316 -100 150 111 73 -279 -209 -113 -416 39 235 -84 46 55 2 -172 121 -78 34 -135
3744 -135 -169 -80 -21 14 175 24 151 5 123 -165 -134 6 -44 142 118 -184 42 36 -82 30 69 103 5 -55
3768 -55 -107 8 -4 41 284 -96 -158 -103 9 -96 -98 -73 -176 8 -253 56 10 -205 -212 98 50 66 42 66 -37
3793 -37 -89 58 -301 -157 -187 169 92 -92 106 -229 128 -219 -104 -296 -137 206 124 299 217 101 -193 102
3815A02l9o4J43r6O5J39k84j49J77j70J96O5j63M4J12O8k23J91k03L01j90m4L26
3838C04n55K57j08J53J1j6J59j81K9j74L02j67k89L96q3lK73l11j37J62l7k98
3860c13L68k2j44j3j7O1L7LL02k90P0J54k61M9O0J5N2n8K8l7K8k07J91l6j06J95
3886A09j66j12L81j78mO0n0mL0L4N8j80K42j28m23J71R0q4J82J81l04j44J87l3
3910h5j3No8J68L05l93J0l3q5K24M6n1o1J81j25J7k97L63M9j72J2N9n9J11j78
3935g0Q0J63l13K23k23K23l00M8J13M74n80J53P2q8m7j89J60J00K2k13K31k13
3957a74M21k42P1k48L99j40K09l24j25K51Rm8O2Pk36K1N3J29j03K9j13K8m5J31
$$ plain form
3815 102 63 -1 142 46 111 250 -34 -183 -6 -176 20 85 -78 -34 78 146 -77 114 -89 212 22 -22 304
3838 304 -251 6 -102 51 62 46 205 24 53 -121 181 14 -275 121 38 35 308 -3 -140 22 -15 -313
3860 -313 55 33 -111 -124 -141 -80 -43 -40 262 -28 42 196 -65 -16 44 59 111 53 81 44 72 -135 56 20 -86 109
3886 109 -57 -169 212 34 30 90 40 36 66 100 158 -22 220 92 -331 -160 -70 -154 28 209 -95 -239 -52 -85
3910 -85 -98 -93 -161 7 312 -81 -71 -104 -189 35 81 30 -31 150 25 42 -255 108 157 -15 -3 56 -3 108 -70
3935 -70 10 173 -140 83 -140 83 -217 -169 -56 418 -162 -9 63 -25 -72 -261 -101 -1 21 -192 39 -174
3957 -174 247 5 76 -172 227 87 296 -28 -153 98 107 59 121 128 -108 -87 -34 95 -8 21 -92 -64 -109 22
$$ [...]
8191D6
##END NTUPLES=NMR FID
##END=
