##TITLE=1H_Pr Cl-Am
 CDCL3
 8 sc, 
 11.04.2022
##JCAMPDX= 6.0         $$ Bruker NMR JCAMP-DX V2.0
##DATA TYPE= NMR FID
##DATA CLASS= NTUPLES
##ORIGIN= UXNMR, Bruker Analytische Messtechnik GmbH
##OWNER= root
$$ XWIN-NMR		Version 3.5
$$ Mon Apr 11 10:47:16 2022 Russian Standard Time (UT+4h)  she@DPX200
##.OBSERVE FREQUENCY= 200.1317
##.OBSERVE NUCLEUS= ^1H
##.DELAY= (6, 6)
##.ACQUISITION MODE= SIMULTANEOUS
##.ACQUISITION SCHEME= undefined
##.AVERAGES= 8
##.DIGITISER RES= 18
##SPECTROMETER/DATA SYSTEM= spect
##.PULSE SEQUENCE= zg30
##.SOLVENT NAME= CDCl3
##.SHIFT REFERENCE= (INTERNAL, CDCl3, 0, 15.7039)
##AUDIT TRAIL= $$ (NUMBER, WHEN, WHO, WHERE, WHAT)
$$ ##TITLE= Audit trail, XWIN-NMR		Version 3.5
$$ ##JCAMPDX= 5.01
$$ ##ORIGIN= Bruker BioSpin GmbH
$$ ##OWNER= she
$$ F:/spectra/data/she/nmr/H-F/1/audita.txt
$$ ##AUDIT TRAIL=  $$ (NUMBER, WHEN, WHO, WHERE, WHAT)
(   1,<2022-04-11 10:45:48.00 +0400>,<she>,<DPX200>,
      <created by zg, POWCHK disabled, PULCHK disabled
       configuration hash MD5:
       00 E9 B6 7A A2 85 ED C7 34 08 36 98 17 FE 4E 26
       data hash MD5: 16K
       AC 19 62 F0 66 85 09 8C 45 41 89 9D 7F 0E E2 0A>)
$$ ##END=
$$ 
$$ hash MD5
$$ CB 28 46 7A 1F 0B 66 AD 6C 07 3B B2 06 22 93 F7
##$RELAX= 
##$RELAX= 
##$RELAX= 
##$RELAX= 
##$RELAX= 
##$RELAX= 
$$ Bruker specific parameters
$$ --------------------------
##$DU= <F:/spectra>
##$EXPNO= 1
##$NAME= <H-F>
##$PROCNO= 1
##$TYPE= <nmr>
##$USER= <she>
##$AMP= (0..31)
100 100 100 100 100 100 100 100 100 100 100 100 100 100 100 100 100 100 
100 100 100 100 100 100 100 100 100 100 100 100 100 100 
##$AQSEQ= 0
##$AQ_mod= 1
##$AUNM= <au_zg>
##$AUTOPOS= <>
##$BF1= 200.13
##$BF2= 200.13
##$BF3= 200.13
##$BF4= 200.13
##$BF5= 200.13
##$BF6= 200.13
##$BF7= 200.13
##$BF8= 200.13
##$BYTORDA= 1
##$CFDGTYP= 0
##$CFRGTYP= 5
##$CHEMSTR= <none>
##$CNST= (0..31)
1 1 145 1 1 1 1 1 1 1 1 1 1 1 1 1 1 1 1 1 1 1 1 1 1 1 1 1 1 1 1 1 
##$CPDPRG= <>
##$CPDPRG1= <>
##$CPDPRG2= <>
##$CPDPRG3= <>
##$CPDPRG4= <mlev>
##$CPDPRG5= <mlev>
##$CPDPRG6= <mlev>
##$CPDPRG7= <mlev>
##$CPDPRG8= <mlev>
##$CPDPRGB= <>
##$CPDPRGT= <>
##$D= (0..31)
0 1.2 0 0 0 0 0 0 0 0.06 0 0.03 0 0 0 0 0.0002 0 0 0 0 0 0 0 0 0 0 0 0 
0 0 0 
##$DATE= 1649659547
##$DBL= (0..7)
120 120 120 120 120 120 120 120 
##$DBP= (0..7)
150 150 150 150 150 150 150 150 
##$DBP07= 0
##$DBPNAM0= <>
##$DBPNAM1= <>
##$DBPNAM2= <>
##$DBPNAM3= <>
##$DBPNAM4= <>
##$DBPNAM5= <>
##$DBPNAM6= <>
##$DBPNAM7= <>
##$DBPOAL= (0..7)
0.5 0.5 0.5 0.5 0.5 0.5 0.5 0.5 
##$DBPOFFS= (0..7)
0 0 0 0 0 0 0 0 
##$DE= 6
##$DECBNUC= <off>
##$DECIM= 32
##$DECNUC= <off>
##$DECSTAT= 4
##$DIGMOD= 1
##$DIGTYP= 9
##$DL= (0..7)
0 120 120 120 120 120 120 120 
##$DP= (0..7)
150 150 150 150 150 150 150 150 
##$DP07= 0
##$DPNAME0= <>
##$DPNAME1= <>
##$DPNAME2= <>
##$DPNAME3= <>
##$DPNAME4= <>
##$DPNAME5= <>
##$DPNAME6= <>
##$DPNAME7= <>
##$DPOAL= (0..7)
0.5 0.5 0.5 0.5 0.5 0.5 0.5 0.5 
##$DPOFFS= (0..7)
0 0 0 0 0 0 0 0 
##$DQDMODE= 0
##$DR= 18
##$DS= 0
##$DSLIST= <SSSSSSSSSSSSSSS>
$$ [...]
##$SUBNAM2= <"">
##$SUBNAM3= <"">
##$SUBNAM4= <"">
##$SUBNAM5= <"">
##$SUBNAM6= <"">
##$SUBNAM7= <"">
##$SUBNAM8= <"">
##$SUBNAM9= <"">
##$SW= 18.0516967727041
##$SWIBOX= (0..15)
0 0 2 0 0 0 0 0 0 0 0 0 0 0 0 0 
##$SW_h= 3612.71676300578
##$TD= 16384
##$TD0= 1
##$TE= 0
##$TE2= 300
##$TE3= 300
##$TEG= 300
##$TL= (0..7)
0 120 120 120 120 120 120 120 
##$TP= (0..7)
150 150 150 150 150 150 150 150 
##$TP07= 0
##$TPNAME0= <>
##$TPNAME1= <>
##$TPNAME2= <>
##$TPNAME3= <>
##$TPNAME4= <>
##$TPNAME5= <>
##$TPNAME6= <>
##$TPNAME7= <>
##$TPOAL= (0..7)
0.5 0.5 0.5 0.5 0.5 0.5 0.5 0.5 
##$TPOFFS= (0..7)
0 0 0 0 0 0 0 0 
##$TUNHIN= 0
##$TUNHOUT= 0
##$TUNXOUT= 0
##$USERA1= <user>
##$USERA2= <user>
##$USERA3= <user>
##$USERA4= <user>
##$USERA5= <user>
##$V9= 5
##$VALIST= <valist>
##$VCLIST= <CCCCCCCCCCCCCCC>
##$VD= 0
##$VDLIST= <DDDDDDDDDDDDDDD>
##$VPLIST= <PPPPPPPPPPPPPPP>
##$VTLIST= <TTTTTTTTTTTTTTT>
##$WBST= 1024
##$WBSW= 4
##$XGAIN= (0..3)
0 0 0 0 
##$XL= 0
##$YL= 0
##$YMAX_a= 620449
##$YMIN_a= -548125
##$ZGOPTNS= <>
##$ZL1= 120
##$ZL2= 120
##$ZL3= 120
##$ZL4= 120
##$ABSF1= 10
##$ABSF2= 0
##$ABSG= 5
##$ABSL= 3
##$ALPHA= 0
##$AQORDER= 0
##$ASSFAC= 0
##$ASSFACI= 0
##$ASSFACX= 0
##$ASSWID= 0
##$AUNMP= <proc_1d>
##$AZFE= 0.1
##$AZFW= 0.1
##$BCFW= 1
##$BC_mod= 2
##$BYTORDP= 1
##$COROFFS= 0
##$CY= 11.3945322036743
##$DATMOD= 1
##$DC= 2
##$DFILT= <>
##$DTYPP= 0
##$F1P= 2.36226072786647
##$F2P= -0.459571619588291
##$FCOR= 0.5
##$FTSIZE= 0
##$FT_mod= 4
##$GAMMA= 1
##$GB= 0.15
##$INTBC= 1
##$INTSCL= 1
##$ISEN= 128
##$LB= 0.24
##$LEV0= 0
##$LPBIN= 0
##$MAXI= 10000
##$MC2= 0
##$MEAN= 0
##$ME_mod= 0
##$MI= 1.114404
##$NCOEF= 0
##$NC_proc= 0
##$NLEV= 6
##$NOISF1= 3.799351
##$NOISF2= 2.8
##$NSP= 1
##$NTH_PI= 0
##$NZP= 0
##$OFFSET= 15.70392
##$PC= 1
##$PHC0= -18390.54
##$PHC1= 12.40078
##$PH_mod= 1
##$PKNL= yes
##$PPARMOD= 0
##$PSCAL= 0
##$PSIGN= 0
##$REVERSE= no
##$SF= 200.130013532006
##$SI= 16384
##$SIGF1= 3
##$SIGF2= 2
##$SINO= 400
##$SIOLD= 16384
##$SREGLST= <1H.CDCl3>
##$SSB= 0
##$STSI= 0
##$STSR= 0
##$SW_p= 3612.71676300578
##$SYMM= 0
##$S_DEV= 0
##$TDeff= 0
##$TDoff= 0
##$TI= <>
##$TILT= no
##$TM1= 0
##$TM2= 0
##$TOPLEV= 0
##$USERP1= <user>
##$USERP2= <user>
##$USERP3= <user>
##$USERP4= <user>
##$USERP5= <user>
##$WDW= 1
##$XDIM= 8192
##$YMAX_p= 0
##$YMIN_p= 0
$$ End of Bruker specific parameters
$$ ---------------------------------
##NTUPLES= NMR FID
##VAR_NAME=  TIME,          FID/REAL,        FID/IMAG
##SYMBOL=    X,             R,               I
##VAR_TYPE=  INDEPENDENT,   DEPENDENT,       DEPENDENT
##VAR_FORM=  AFFN,          ASDF,            ASDF
##VAR_DIM=   8192,          8192,            8192
##UNITS=     SECONDS,       ARBITRARY UNITS, ARBITRARY UNITS
##FACTOR=    0.0002768,     1,               1
##FIRST=     0,             0,               0
##LAST=      2.2672688,     0,               0
##MIN=       0,             -548125,         0
##MAX=       2.2672688,     620449,          0
$$ Real data points
##PAGE= N=1
##DATA TABLE= (X++(R..R)), XYDATA
0 0 0 0 0 0 0 0 0 0 0 8 -8 8 -16 16 -24 24 -32 40 -48 64 -72 88 -104 127 -146 168 -200 231 -264 304 -349
31 -349 397 -450 510 -575 648 -728 816 -910 1015 -1132 1257 -1394 1542 -1708 1885 -2082
47 -2082 2294 -2529 2784 -3070 3381 -3727 4114 -4545 5035 -5590 6230 -6973 7853 -8910
61 -8910 10210 -11855 14011 -16974 21321 -28348 41622 -75710 360565 620449 -58605 -270516
73 -270516 -242159 -119554 -238977 -329902 -314175 -84171 119284 90362 -196065 -289901 -92020
84 -92020 148324 170910 141078 187921 279201 300451 216066 -21161 -214727 -190597 -39453
95 -39453 -26239 -124274 -119422 -15213 -6775 -78351 -122479 -96964 -30247 50617 110780 124275
107 124275 117898 109822 39577 -40993 -28184 38503 42080 -9458 -1341 65837 54824 -63701
119 -63701 -182356 -181012 -63338 31291 16637 -35904 -4263 98276 110273 -15845 -126738
130 -126738 -80036 87481 188354 134260 43748 34680 74649 37788 -109103 -238434 -221758
141 -221758 -63178 79173 54009 -52254 -40008 85520 118414 -15444 -118793 -39669 120111
152 120111 189522 114889 -1093 -28238 19496 5578 -123226 -207862 -118934 18393 55650
163 55650 28434 15307 20518 27672 39265 19873 -36940 -28808 59726 94073 31497 -23944 -19833
176 -19833 -18830 -41741 -43089 -35389 -30041 5230 37468 14512 -17422 4182 25849 -9590 -17658
189 -17658 41887 62867 8772 -29572 -14287 -6414 -29050 -41100 -38858 -16064 47516 84008
201 84008 29905 -33694 -12438 34246 3684 -55679 -49899 -3487 30961 39524 11598 -34894
213 -34894 -38123 14024 36095 -9956 -35706 5733 52379 48896 3395 -41450 -45957 -5315 26170
226 26170 -5950 -44910 -9175 52146 48949 -10302 -40914 -16430 12486 13054 -3669 -13705 1334
239 1334 21305 16344 -10643 -29995 -19657 3524 17014 16012 7414 8095 15547 10898 -7972 -27221
253 -27221 -27909 -9459 6506 6124 -4695 -1378 16644 14235 -8152 -13296 2706 11717 5368 4129
267 4129 7919 2191 -2519 -2757 -12171 -17290 -2989 8698 -1426 -7100 7946 8662 -10312 -8559
281 -8559 8427 5991 -3111 9775 21296 2659 -12003 -2115 -1768 -14342 -12821 -1340 1264 5727
295 5727 16178 6167 -11850 -988 11483 -10037 -24749 737 21804 2607 -9728 9575
307 9575 14854 -2834 -7093 -78 -2476 -3870 5598 1434 -14422 -7127 9174 665 -11561 -2309
321 -2309 9640 7344 7056 8515 -6609 -14210 8165 16735 -10363 -25458 1445 26272 10464
334 10464 -15162 -18454 -4242 12577 12160 -11480 -25196 688 35171 22579 -18926 -26393 3673
347 3673 24517 10230 -18297 -24634 627 27143 18617 -17260 -28718 -490 23934 12816 -16628
360 -16628 -24174 -999 22818 19372 -8494 -23241 -3764 23636 21337 -8648 -26106 -6083 20648
373 20648 14183 -16291 -24845 1554 19807 7557 -7346 -5212 2677 3088 130 -2860 -6700 -4803
387 -4803 974 2798 4853 7935 2175 -6605 -691 12541 6620 -11749 -11711 1175 4624 2264 -36
402 -36 -10061 -16408 2297 21674 3825 -23226 -12060 20539 26713 2464 -17379 -12430 11740
415 11740 28103 6165 -32867 -28420 16387 30712 -6153 -35253 -16477 17362 26611 6324
427 6324 -22639 -22944 14691 39107 8538 -33575 -21884 20665 28731 -1303 -24442 -17566 7892
440 7892 24383 10319 -21997 -25571 9596 29527 4263 -25425 -19878 7486 20462 8261 -13208
453 -13208 -16609 6922 24804 8483 -16963 -13185 8501 12956 505 -4530 -1489 -214 1241
466 1241 2501 -2135 -10971 -13159 -5814 2943 5804 2337 -1931 1724 11882 14868 4876 -8091 -9565
481 -9565 814 11279 8466 -7083 -15820 -3761 12582 8111 -16559 -30333 -12807 15820 18905
494 18905 -6007 -17958 7074 35966 28021 -5890 -22070 -5783 16149 14137 -12062 -30060
506 -30060 -13282 17957 18143 -13636 -29780 -9967 14445 13260 -3532 -12404 -616 21403 27657
519 27657 7059 -13576 -6304 11729 8646 -8853 -15764 -9322 581 6211 718 -12914 -13932 1098
533 1098 6952 -4154 -6914 4261 10497 6825 9108 14388 7191 -2900 -1817 2337 -733 -6322
547 -6322 -10859 -11409 -3426 5821 -864 -15859 -12595 5317 10261 -604 -5300 2892 13656 19443
561 19443 16118 783 -9021 514 10604 -1773 -21829 -21125 -2215 7780 1203 -10727 -12753 184
575 184 13202 7711 -8061 -7564 11715 23587 14055 -459 -3781 2365 5676 -2075 -16075 -19992
589 -19992 -8352 4467 2861 -5418 -5770 2027 7275 4940 -367 -2918 1739 8859 11378 6994 375
604 375 -2435 914 2599 -4107 -12601 -12163 -4085 810 -383 -2192 -1160 1796 5341 7717 4377 -1275
620 -1275 -1353 4380 6974 3157 -3962 -7074 -1741 5706 2271 -9495 -11764 -75 7300 142 -6369
635 -6369 -2498 4163 7258 6496 996 -5287 -2451 5653 5013 -4227 -6897 -83 4893 3470 -632 -5914
651 -5914 -6074 1365 4953 -1885 -6500 -8 7349 4754 -652 -1560 -1990 -1418 2201 2194 -3130 -3271 3950
668 3950 6138 -496 -3618 -920 -435 -1537 297 959 -1374 -1414 1986 1998 -1376 -2587 -1105 105 1971
685 1971 2925 432 -1233 2174 4240 -818 -4928 -1911 1156 -741 -1995 492 769 -1174 13 2023
701 2023 275 -1932 -641 2235 2256 -764 -2360 -981 1781 1337 -2093 -2430 1307 3521 243 -2811
717 -2811 -757 1246 855 -1003 -1116 386 1955 1450 403 -1357 -1979 -1317 188 386 -1112 -1513 1967
734 1967 4163 1541 -2249 -930 1755 954 -959 -1279 -1282 -204 1157 793 -2368 -3588 168 2489 1001
751 1001 -620 31 1031 2289 2043 -902 -3601 -1252 2521 603 -2338 -1014 383 -363 -15 1224
767 1224 -968 -3326 755 5565 2330 -3507 -2265 1981 2802 -329 -2710 -2862 -34 3581 2407 -2484
783 -2484 -2948 797 2011 327 -586 -1407 -2072 1291 4936 1308 -4774 -3084 3712 3804 -1545 -3681 -927
800 -927 2011 2407 651 -2347 -2690 730 3077 1301 -1949 -2076 -364 1791 2256 -437 -3401 -2084
816 -2084 3372 4063 -375 -3305 -953 2167 2165 -238 -3329 -3103 725 4037 1777 -3213 -3569 1266 4648
833 4648 1967 -3523 -3724 1025 4661 1893 -3000 -3519 159 3199 2310 -1708 -4128 -1048 3402 3318
849 3318 -1399 -4457 -1238 3961 3703 -1717 -4473 -1326 3864 3136 -2144 -4062 134 3027 1367 -615
865 -615 -974 -512 -104 1743 1275 -2003 -2940 333 2510 573 -1928 -1309 169 1300 1682 -413 -2013
882 -2013 -854 1945 1929 82 -740 -1184 -816 1567 2214 -1402 -4295 -1261 3410 2096 -2400 -2907 42
899 42 2706 2909 322 -2962 -2307 2818 4609 -501 -4861 -2224 2592 3659 -3 -4114 -3215 1830
915 1830 4658 589 -4572 -2923 2306 3608 614 -2200 -1841 991 3661 2789 -1575 -4513 -651 3336
931 3336 1637 -3050 -3773 342 3087 1497 -1733 -2596 -392 1733 1615 -804 -820 -87 1305 1587 1014
948 1014 -717 -2130 -1082 1020 756 -1437 -1514 -242 1466 950 -583 -1008 -534 132 1153 861 -226
965 -226 -1321 -143 2290 2189 -1160 -2927 -624 2274 1625 -1056 -2517 -551 1637 2094 -411 -2724
981 -2724 -1663 1699 2078 -610 -2592 -1434 1765 3443 946 -2174 -1406 2405 3039 -789 -3675 -1306
997 -1306 1659 1433 -732 -1963 -1596 288 1775 300 -2375 -1533 2002 3747 1428 -787 -328 1584
1013 1584 2112 -509 -2979 -2521 491 1407 -1211 -2378 -145 1037 -75 -770 -350 -37 554 1445 1982
1030 1982 855 132 1045 798 -324 -1386 -919 -368 -653 -973 -684 -268 49 -123 -554 45 1432 722
1048 722 -640 358 1594 1348 -24 -682 263 414 -113 -600 -1183 -1171 -279 624 15 -1062 -367 1173 1528
1067 1528 394 -1102 -74 1443 1004 -358 -1178 347 1382 782 -916 -1243 -925 33 88 -731 -1390
1084 -1390 -680 1129 1278 68 -1481 -419 1548 1572 -325 -1432 597 2599 1078 -1833 -1806 226
1100 226 796 -776 -1792 -947 283 1307 816 -728 -1089 326 1627 866 -480 -820 858 1875 726
1117 726 -1735 -2344 152 1631 -35 -2218 -1062 1497 1539 -249 -1089 -409 906 1000 623 -1056 -1052 491
1135 491 1324 -27 -1570 -928 569 1018 -37 -815 -542 823 867 -333 -781 260 1277 339 -740
1152 -740 -122 357 -90 -635 -320 133 39 -104 276 -217 -85 539 136 -648 -1055 322 1237 135 -1200
1171 -1200 -840 892 1434 -476 -2223 -708 1831 1932 -1068 -2348 52 2192 1158 -1384 -2071 -532
1187 -532 2010 1859 -462 -2589 -832 1871 2293 -599 -2877 -1085 2530 2415 -1007 -2943 -910 2392
1203 2392 1664 -1195 -2477 -451 2099 1721 -402 -2088 -546 1519 1600 -528 -1944 -709 1508 1584
1219 1584 -475 -1703 -292 1587 935 -867 -1203 166 1112 108 -738 -322 180 618 19 -193 137
1236 137 434 86 -449 -405 145 505 129 -566 -488 745 1064 43 -1029 -884 1072 1413 -348 -1734 -395
1255 -395 1846 1191 -1396 -1719 73 1574 637 -966 -1289 94 1385 999 -1251 -1665 -15 1727 1175
1272 1175 -1371 -1682 307 1884 820 -1459 -1624 727 2193 343 -1912 -846 1152 1536 -453 -1712
1288 -1712 -635 1281 1316 -413 -1318 -829 1078 1272 -406 -1716 -708 979 1285 -651 -1612 -128 1414
1305 1414 504 -1055 -1463 661 1250 119 -1193 -498 514 640 -581 -864 -37 679 817 -342 -641
1322 -641 53 958 822 -677 -1344 190 1628 643 -1313 -1649 696 2170 188 -1575 -1188 1276 1545
1339 1545 -297 -1356 -726 1300 1348 -388 -1518 -841 956 1306 -177 -1399 -783 675 1227 98 -1509
1356 -1509 -897 1152 1381 -472 -1303 -46 1314 382 -762 -594 350 686 29 -396 -148 241 817 150
1374 150 -334 -11 201 182 -320 -385 -118 299 381 -563 -809 -15 803 258 -877 -133 852 842 -368 -1107 -37
1395 -37 734 208 -367 -605 -10 638 434 -216 -819 -335 442 403 -82 -755 -419 639 825 -331 -674 161
1415 161 814 357 -768 -317 351 574 -101 -547 -264 226 311 -109 -366 -136 -24 455 269 -6 -453 269
1435 269 811 245 -389 -574 427 434 -149 -621 129 302 194 -219 -106 127 113 -49 21 -23 105 -272 6
1456 6 256 59 -393 -2 455 300 -363 -201 71 76 -20 -267 188 67 -44 -48 54 -262 -76 13 449 150 -313
1479 -313 -542 312 673 25 -399 -234 393 437 -356 -356 206 95 -36 -74 -217 -137 82 169 84 -141 -53 305 393
1502 393 -225 -718 106 614 62 -481 -779 321 348 -346 -700 231 401 200 -292 -154 371 0 -76 -145 -286
1523 -286 -111 353 88 -90 -477 -49 414 290 -311 -467 383 390 -69 -714 -138 887 310 -627 -500 596
1543 596 655 199 -674 -445 527 463 -158 -723 -433 603 983 285 -702 -670 501 1067 75 -1301 -494 1057
1563 1057 1046 -262 -1400 -335 1201 850 -777 -1441 89 1215 871 -668 -1087 -50 1204 1096 -427
1580 -427 -1174 -195 1287 1142 -822 -1395 14 1165 627 -1146 -1403 448 1352 20 -1030 -608 488
1597 488 715 -19 -656 21 469 397 -214 -386 38 271 262 -579 -473 134 186 44 -649 -498 659 864 -141
1618 -141 -1139 -95 1366 787 -955 -1409 -4 1159 557 -1175 -897 373 1362 563 -947 -1070 138
1635 138 1463 477 -1180 -1230 640 1430 601 -1495 -1170 682 1633 -25 -1800 -849 1274 1476 -385
1652 -385 -1650 -885 1377 1066 -315 -1234 -515 1252 1006 -455 -1370 -355 1017 1010 -691 -1337 -292 1062
1670 1062 894 -704 -1070 164 1136 251 -1123 -382 599 660 -35 -865 -424 352 393 -34 -672 -139 559
1689 559 510 -290 -944 -251 826 545 -576 -847 371 1001 295 -1117 -611 880 1080 -128 -995 -377
1707 -377 860 855 -232 -1329 -256 956 817 -266 -884 -449 1038 1173 -614 -1287 -486 1554 1102 -851
1725 -851 -1448 -468 1454 997 -775 -1325 119 1261 535 -623 -790 43 924 282 -648 -787 253 825
1743 825 328 -712 -400 213 767 -65 -575 -249 790 836 -452 -819 116 951 96 -538 -506 476 784 -85
1763 -85 -726 -592 312 730 -63 -747 -353 634 862 -199 -903 -515 995 976 -475 -1032 -61 1008 979 -777
1783 -777 -1416 21 1137 553 -610 -724 189 1006 384 -622 -933 105 1210 716 -653 -1122 13
1800 13 1278 512 -872 -924 302 1148 349 -926 -367 632 767 -284 -880 -244 626 374 -19 -557 -299
1819 -299 578 328 182 -353 -86 372 303 -156 -598 -274 559 317 -441 -436 82 572 -22 -588 -123 546 324
1840 324 -204 -498 -120 200 -82 -500 -343 6 421 141 -269 -664 162 640 361 -209 -376 82 804 167
1860 167 -898 -627 258 579 155 -627 -255 469 558 -65 -614 -434 226 471 -73 -289 -384 173 403 94
1880 94 -418 -274 353 581 -221 -614 42 400 267 -325 -215 -217 288 238 -98 -154 -43 194 377 110 -238 5
1902 5 -14 165 -131 -318 -132 190 141 -177 -432 -172 201 209 -145 -280 -126 -66 -108 -310 -81 -132 169 456 -223
1925 -223 -358 13 -10 60 -145 -285 -265 294 -65 -156 -65 -107 136 221 -223 97 233 236 157 -47 -142 -144 69 63 -64
1950 -64 -235 -103 289 268 -236 -112 87 317 -47 -281 -273 171 -128 -326 -294 34 345 69 -219 91 280 -34
1972 -34 0 -25 12 179 247 62 8 -236 435 311 57 -466 -295 478 447 -24 -415 -184 700 393 -138 -399
1994 -399 -293 463 598 -256 -658 -214 362 772 -133 -447 -224 463 603 -163 -794 -275 699 401 -493 -824
2014 -824 -23 751 541 -26 -591 -20 294 78 -292 -370 -237 459 427 14 -457 -309 334 370 -268 -537 381
2035 381 402 128 -246 -396 144 352 -247 -209 238 307 -34 -222 -133 346 184 -59 -215 -137 336 500 109 -388
2057 -388 -80 466 495 101 -538 -163 406 685 -293 -636 -94 856 448 -554 -489 108 1045 373 -387 -745
2077 -745 250 565 461 -477 -360 -130 781 577 -457 -763 111 740 459 -852 -558 466 708 211 -520
2096 -520 -419 201 652 27 -222 -200 282 321 163 -436 -15 131 51 -24 -253 53 103 77 -78 -348 -126 447
2118 447 -47 -201 -69 284 98 3 -180 -94 463 -75 -183 -142 107 541 189 -436 -369 -28 591 146 -414
2139 -414 -404 109 731 97 -635 -741 357 796 124 -750 -745 356 666 21 -518 -652 177 639 101 -479
2159 -479 -502 -55 919 457 -579 -516 246 951 175 -368 -435 354 625 93 -327 -204 227 332 89 -351 -141
2180 -141 114 468 182 -7 -8 -11 9 70 8 -2 172 126 58 -16 -58 324 121 24 -175 118 -42 -226 -235 -38 366
2205 366 -193 -147 150 298 271 2 -254 -169 13 174 27 -668 -242 55 688 -187 -371 -265 315 717 -34
2226 -34 -582 -214 229 335 0 -235 -477 89 282 -73 -404 -327 321 351 312 -91 -346 226 308 -75 -587 -146
2248 -146 235 339 -218 -365 -54 -23 282 -169 -141 -317 11 222 37 -111 -35 -56 302 50 111 -49 287 65
2270 65 56 12 -40 -47 142 -78 -131 -200 30 157 -168 254 -58 91 -180 53 -124 -52 -187 328 173 -116 16
2293 16 50 -79 39 24 134 -47 -88 -45 19 -66 178 -403 -318 252 330 -3 -242 -1 34 -29 -24 -155 124 352
2317 352 148 -20 -134 -78 68 258 220 -212 -216 94 35 -84 148 199 167 -55 -132 -6 42 -129 126 -60 -86
2340 -86 228 -35 169 -26 -178 -185 29 21 -166 -198 -132 262 -39 -60 -123 81 512 -168 -102 -34 34 61 70 -83 -103
2365 -103 24 126 21 -58 62 2 301 110 -122 -216 -5 161 158 -48 -196 -99 166 -266 85 -68 5 355
2387 355 30 169 -220 64 38 61 -77 8 146 173 193 -57 -45 -50 214 -396 85 -39 -53 -31 16 106 -181 98
2411 98 -247 109 105 160 -89 -91 -250 206 59 -89 70 -71 418 269 260 -190 -93 263 303 -14 -295 -155 265
2434 265 121 -35 -54 -310 5 168 224 -111 -207 -108 -20 366 -54 -204 78 7 -42 -486 -206 -268 78 84 -150
2457 -150 -72 -132 344 65 4 -421 -147 -55 518 -142 -301 -14 -128 89 78 -105 -151 -34 48 76 -27 32 91
2480 91 124 -111 35 64 -23 -12 228 123 65 147 -215 195 4 -204 -28 -286 154 218 35 -94 -130 63 193
2503 193 147 -237 -347 -13 238 -131 -281 -179 134 341 55 -325 -89 118 159 137 -411 35 215 374 113
2524 113 -182 37 15 374 267 -78 -254 -173 368 283 -299 -249 -69 342 -106 -256 -251 -79 323 106 -68 159
2546 159 79 266 84 4 -226 -184 118 180 231 164 -214 107 117 -54 241 -10 18 115 309 -43 -38 23 -149 10
2570 10 67 -10 30 -84 -160 -75 -65 -260 52 218 87 -168 12 -128 12 211 -50 -220 -16 -14 260 -133 27
2593 27 -88 -37 32 203 -154 -72 59 -58 118 -46 -26 -71 260 87 -55 -186 24 -28 48 5 -158 -6 13
2616 13 -278 -202 -148 -147 -88 -238 9 58 17 61 -139 -11 -268 23 222 150 -16 -118 -114 311 37 -55 -187 186
2640 186 160 -77 21 -160 -61 -29 172 119 273 -56 -66 -121 -22 2 -51 -164 -97 -100 137 5 -175 37 231 45
2664 45 161 45 270 78 -158 20 -89 -239 -26 -68 -28 66 -136 37 44 154 98 144 -16 109 129 -73 -83
2687 -83 127 -73 12 -233 -107 51 65 188 -30 -86 87 71 -174 9 31 -20 167 -289 -155 -214 -238 12 -37
2710 -37 -118 3 -236 127 -233 -186 -43 289 -202 -43 -129 -200 198 142 -24 52 19 27 40 122 -46 -57 130 -128
2734 -128 317 -142 156 168 78 56 31 -48 -20 -18 -180 -103 61 -40 5 91 -197 -83 72 135 307 -215 -261 20
2758 20 291 -370 -55 -84 18 -157 -108 -69 -195 -38 -57 160 -54 -28 219 349 -82 -102 -153 -195 70 -109 -87
2781 -87 -165 -3 59 137 47 -84 -127 -236 91 79 114 87 -97 30 215 -206 106 43 109 238 67 127 -254 -196
2805 -196 274 151 -195 58 -62 71 218 99 -39 41 180 52 129 -141 -99 34 -23 33 18 -142 -152 81
2827 81 119 -46 -167 125 -33 25 -267 -147 41 89 79 -17 -229 101 73 81 -134 -157 -26 143 58 -118 -300 -4
2851 -4 148 40 3 -195 118 -99 -59 -158 -84 -20 -57 -50 -76 159 166 -131 53 32 104 -142 -14 -7 104 28 -91 187
2877 187 147 60 150 6 98 124 293 22 -46 -71 -200 219 136 57 -312 9 52 134 41 -162 18 -7 102 2
2901 2 -172 -54 -214 61 80 57 -21 224 294 54 -259 -11 -63 -171 -191 -78 -33 -61 136 87 -447 -5 13 265
2925 265 192 -176 93 65 115 120 -201 43 43 234 -18 72 76 -124 -144 149 68 22 -100 -32 112 191 -103 79 -105
2950 -105 -32 145 -79 100 -80 -268 -90 133 -93 132 -160 -91 158 -12 -48 -36 -44 34 -229 -163 -227 147 10
2973 10 -324 -143 -66 187 163 -94 -169 -178 61 270 63 -68 -25 -63 35 64 -225 -168 335 96 -138 -275 -144 47
2997 47 208 58 -239 -41 224 -92 -107 -243 -177 -167 76 230 -101 -97 -41 1 -27 206 -72 82 250 -65 -120
3020 -120 127 27 132 -60 54 104 -263 -69 80 175 -203 107 52 20 157 257 -13 211 -143 37 39 45 -100
3043 -100 -264 291 11 122 -50 244 -8 9 56 26 -146 139 150 196 -5 -132 8 74 -143 -152 0 -173 244
3066 244 -73 -224 -83 177 337 159 -3 97 35 101 52 -254 -72 156 9 41 -187 -39 219 180 78 -15
3088 -15 -334 272 81 46 -5 -282 -65 94 22 -196 65 132 -13 -82 -19 -5 -225 -114 29 -219 5 288 33
3111 33 -161 17 -48 119 221 89 -131 -159 360 18 -165 -64 -13 0 202 77 -263 -238 9 108 137 75 -10
3134 -10 150 258 -107 -76 37 0 -6 -104 18 61 -225 -255 -108 117 -198 10 28 -59 -59 101 -131 -33 28 116 -85
3159 -85 24 104 -215 -99 -69 -215 35 92 42 187 -31 -177 133 116 -13 -52 77 237 269 113 -95 -232 110
3182 110 292 362 -22 -102 -84 227 143 -146 -172 -68 -2 109 -109 -355 90 88 112 -194 -211 61 183 -159 52
3205 52 -13 13 77 44 221 -265 68 65 40 -112 -177 73 272 185 -50 -24 183 259 -4 -398 79 -36 220 113
3229 113 22 78 -183 -90 98 54 66 -43 19 26 -55 -55 138 110 -6 -51 -143 277 38 -15 242 314 218 -277 -15 164
3255 164 341 1 -198 56 -10 177 21 -57 -305 109 140 -117 -96 -126 211 180 95 -277 -396 104 298 85
3277 85 -272 -299 350 217 -17 -344 165 -4 194 187 -271 -183 -90 210 259 -109 -175 205 167 -111 -230 -112 73
3300 73 166 -92 50 -86 221 49 -283 -208 -71 -28 41 5 -171 236 -162 183 -130 -17 396 19 286 -43
3322 -43 119 196 -107 -170 -60 61 153 158 -109 19 185 182 -126 -71 114 196 -19 51 -176 -68 58 85 -26 -217
3346 -217 -100 293 35 47 -299 -191 86 -69 48 -303 -137 81 451 -88 -108 39 105 132 -73 -47 -136 196
3368 196 -141 -79 -247 -107 -58 75 80 -103 -224 285 67 114 -208 -7 22 -52 -137 -21 74 36 75 128 300 -12
3392 -12 132 -5 -28 -362 160 55 -265 101 164 -33 7 -292 -55 32 1 15 -65 -143 -15 4 -140 -245 33
3415 33 262 -276 -143 -20 183 -198 18 -66 -59 -232 -17 -28 45 -197 -178 -43 211 -52 100 233 133 148 -10
3438 -10 -149 -23 80 27 33 -104 151 80 224 228 82 -62 -20 170 221 -175 13 141 14 48 -71 74 -119
3461 -119 -264 -36 -329 188 72 -322 -99 -39 -283 56 114 -26 -286 151 -28 -68 -46 -19 246 127 131 -155
3483 -155 -141 -228 76 -111 -54 18 44 123 242 3 -189 -3 33 -54 38 -188 28 -129 36 116 -57 51 104 -2
3507 -2 -177 160 149 -181 33 84 39 152 31 -41 -6 -50 -125 249 -51 16 -24 -180 222 -97 3 171 138 273
3531 273 -55 -130 181 240 108 -54 21 70 36 18 -58 117 17 70 269 -88 -23 393 -216 13 -228 -88 179
3554 179 -128 -72 169 158 119 -83 -77 -122 97 188 -3 55 110 160 -101 44 -195 -233 -39 45 30 23 89 73 -52 -64
3580 -64 -101 -41 5 137 28 74 -27 59 -278 -86 204 -70 -36 -22 30 -34 273 -171 -25 -214 -87 -16 -93 134
3604 134 50 -190 132 -50 -169 -160 309 242 78 53 2 -116 -14 -341 -131 -41 82 -143 4 86 -85 18 39
3627 39 94 -88 26 -21 109 121 -98 34 126 210 -10 62 -44 55 33 -261 -120 78 -12 67 80 -209 -144 -116 78
3652 78 0 99 -88 -72 275 -31 -149 98 -22 136 -14 -211 16 52 -56 73 -205 9 69 31 9 12 -4 126
3676 126 -213 27 84 42 -77 6 -48 -108 -44 -102 -283 169 20 38 156 -50 -146 117 229 -98 -121 -3 57 140
3700 140 93 30 -11 49 -148 74 6 151 -34 -148 -289 125 -69 23 32 105 -101 3 101 63 -60 167 -35 120
3724 120 7 -334 269 -246 65 22 -202 -148 -16 128 156 48 -86 -8 -147 142 -77 169 -143 -66 -58 -31 150
3747 150 -53 -177 -42 -101 -215 111 -129 141 7 36 -156 54 -76 14 -214 189 -95 -115 -75 28 211 -12
3769 -12 8 199 199 31 -160 -72 50 259 129 200 -168 174 93 85 -162 -36 -88 87 -31 -66 97 -111 277 -112
3793 -112 153 -125 -54 79 9 123 201 37 -289 99 -80 119 -85 -148 158 -21 -41 56 -36 -74 -135 -182 193
3816 193 -36 198 25 172 398 159 53 63 122 -81 -249 107 34 26 -59 38 177 -208 2 155 -157 -107 -57
3839 -57 -5 166 123 173 41 -7 22 -81 -28 -1 -171 227 -307 95 183 44 -146 46 -51 45 -53 -110 64 262
3863 262 -78 -37 -151 -41 261 41 44 37 -202 -28 -32 47 43 118 115 132 22 318 -56 27 -98 -253 -73 -162 -78 -17
3889 -17 -34 -112 107 -28 -179 -148 160 -66 -76 102 54 -148 -65 -208 19 95 200 60 -204 -227 5 160 18
3912 18 154 -67 323 -7 51 -79 -8 38 -134 -18 -73 28 -40 105 82 -349 -70 -88 137 -223 24 -80 -67
3935 -67 61 -65 -19 321 -39 -83 -99 -174 -48 -67 217 -105 8 -9 92 -124 -73 38 85 174 28 -127 -252
3958 -252 -80 -33 -20 -243 -112 127 90 59 48 -217 -13 46 32 -24 -47 -53 69 -9 -178 -140 -44 91 -73 -46 -9
3983 -9 -201 141 153 52 222 -112 -176 174 -28 215 -75 157 -40 -231 175 4 -143 52 227 150 73 -208
4005 -208 -208 -47 9 17 46 -74 -121 -177 79 56 -207 -156 204 -43 76 120 -144 48 -130 9 -86 42 -178 207
4029 207 116 -32 -44 -118 212 162 -259 -148 -63 113 -150 -62 -117 102 185 -212 141 -121 40 -113 13 107 75
4052 75 -177 106 107 -10 221 34 211 -70 -286 -161 -20 -91 70 -71 79 -39 -13 -32 69 -90 -2 -153
4074 -153 250 10 165 155 122 -206 21 127 -73 65 -226 67 -25 -17 8 -10 -253 152 374 -167 -216 -84 90
4097 90 -46 36 138 -126 -66 -21 -183 -69 -14 -242 186 -130 133 131 146 -110 -176 -43 1 105 -225 275 -120
4120 -120 -288 -23 214 -76 205 180 -28 -23 -105 121 -23 21 93 -299 -17 143 171 -143 27 133 -157 -264
4142 -264 -88 -236 106 -32 52 -65 33 171 -137 -185 64 48 229 102 -38 -392 7 4 58 33 -73 -124 191
4165 191 188 -93 96 107 174 245 185 -124 -18 378 -34 33 101 -12 323 178 -204 -102 102 115 -26 -285 -6
4188 -6 113 -52 -84 27 -115 19 -177 154 -53 -27 111 70 173 -18 -38 -41 -40 -264 24 -262 180 137 -40 -6
4212 -6 -146 39 148 26 17 88 167 34 -142 -318 97 126 101 -66 108 218 -176 262 123 54 182 71 -51
4235 -51 57 -14 -64 -218 -75 320 -267 -261 199 -15 103 -328 -30 52 -150 -81 -87 46 168 28 77 168 22 194
4259 194 -58 124 68 120 191 91 -224 71 186 60 56 -158 122 98 187 -179 -22 93 -42 -40 -325 19 -32
4282 -32 -199 122 51 -120 -304 -83 -145 58 -84 0 141 334 -194 -44 -31 84 -95 -84 -27 226 190 131 53
4305 53 154 43 -10 -26 217 301 212 -43 10 48 89 218 -145 46 -95 -2 56 -68 -116 175 -14 147 -258 254
4329 254 66 -80 -91 30 167 94 97 89 112 -231 12 -62 1 40 61 -27 8 17 -132 -139 -129 -36 -78 8 42 -243 -68
4356 -68 47 -125 85 -239 -62 58 -54 48 44 1 -132 298 -50 38 -111 4 -122 -33 44 23 -39 79 -256
4379 -256 3 306 -87 52 -136 229 23 76 -315 189 85 -129 125 36 126 57 65 -36 12 19 60 -242 74
4402 74 37 -12 7 120 -60 -43 142 -55 -158 309 81 79 94 -87 -72 -49 29 86 82 79 -21 1 105 -62 -227 -63
4428 -63 107 -264 -199 -168 90 -228 -131 110 -197 -22 193 220 3 -39 36 -173 -157 -156 75 -33 102 -54 -72 -62
4452 -62 50 143 -10 -190 -68 134 229 129 -199 -42 41 -117 214 108 147 -111 133 26 36 -119 -185 155
4474 155 -14 42 -147 254 71 59 71 -209 249 -92 117 320 169 139 -129 -312 -76 -143 70 -98 66 163
4496 163 57 -94 -405 -87 -82 151 63 -2 67 -90 -39 -110 33 -61 -30 258 4 -341 -114 -99 103 -19 -157
4519 -157 -59 54 191 54 -290 20 -46 -142 160 -67 19 44 11 293 211 -18 120 120 90 -71 88 -147 102
4542 102 -8 108 -196 -142 13 -84 33 122 106 154 81 -157 71 325 25 -14 -75 -10 212 247 -89 85 116 -5
4566 -5 92 -187 305 -178 -13 97 44 -89 69 106 9 79 90 12 166 -227 125 209 40 156 -125 -6 52 -119
4590 -119 2 49 26 59 -36 103 -93 -115 184 301 -10 16 -161 92 81 158 -100 -64 77 -131 -69 31 90 113
4614 113 -37 61 -142 242 -57 -91 -70 -53 52 -105 -203 -130 34 -69 61 195 -104 -165 -134 152 53 174 51
4637 51 -59 103 267 -59 -2 48 142 -49 -79 108 -160 129 42 -288 98 102 -193 58 127 200 6 -132 25
4660 25 -36 65 -9 -57 -18 -206 141 -215 259 -49 67 -20 -41 -142 -298 50 73 8 157 59 -6 -104 -56 109
4684 109 57 -24 -12 65 222 124 108 -27 -32 25 -18 -72 8 -67 66 178 266 -26 -362 22 -115 128 75 167 267
4709 267 -107 171 124 129 30 -330 54 -3 23 123 -72 -67 73 132 -108 -97 -144 1 191 -68 -193 5 -161 -30
4733 -30 -294 -161 -146 125 98 -64 -16 107 29 -52 36 -53 -132 -68 163 -17 -194 -285 86 45 -149 -110 -113 40 37 -202
4759 -202 26 209 261 15 -86 42 181 -141 68 -66 1 -224 -33 94 -28 86 -24 45 -59 40 -145
4780 -145 -129 189 -94 132 -119 86 72 -74 -97 33 142 -384 147 12 167 171 4 -55 140 -28 -90 1 -101
4803 -101 -58 -91 -94 31 -113 75 -18 37 33 -82 -36 94 -78 -155 -19 58 -146 124 90 -102 -8 -37 27 -6 118
4828 118 30 151 70 10 -149 97 241 -165 28 -4 -46 55 80 -133 -76 33 39 73 -68 -196 104 117 -139 -41
4852 -41 -193 -196 -20 -261 -1 71 152 -125 -50 -213 -23 171 -135 -130 65 -155 171 28 89 34 106 -118 71 -52
4876 -52 -83 -4 83 116 117 204 -15 -152 52 -64 77 28 -193 148 -49 -144 -59 -89 -33 13 118 -170 -117 -3 -97
4901 -97 -58 -55 129 62 341 27 56 60 58 0 -224 242 -63 78 4 -113 -155 -171 83 70 158 105 -211 79 34 169
4927 169 -41 55 -43 33 96 140 -177 107 -90 211 16 127 -45 94 184 43 -178 26 62 128 -94 -56 -59 -177
4951 -177 62 54 -32 -6 -31 -62 -85 137 -29 -31 56 -108 -86 -9 -258 -79 187 -8 113 227 -28 -13 -113 59
4975 59 220 -18 76 210 121 -12 -157 -15 58 -236 -2 132 -101 -123 16 -111 -131 99 48 59 -70 -3 24
4998 24 -83 9 88 124 -313 -126 47 -135 101 -15 -134 242 6 247 -150 145 -398 -80 -28 272 129 -375
5020 -375 -213 -125 65 35 155 -11 42 -80 -197 278 125 22 137 -66 -22 -78 84 28 -368 56 333 222
5042 222 105 -72 141 66 203 -91 -71 -152 97 -96 -280 107 85 101 -45 65 40 -82 -152 -21 117 30 102
5065 102 76 195 69 -133 -5 -236 17 164 22 -9 -205 -135 164 -1 147 -125 59 22 -185 59 51 200
5087 200 162 20 46 106 145 -119 136 -190 -29 65 -96 91 66 85 -242 -184 359 -31 -206 35 218 164 89
5110 89 138 -66 246 150 55 355 -51 -23 182 -88 172 83 -75 -250 -79 -7 19 35 135 -152 25 52 119 -62
5134 -62 -28 -36 -27 111 77 -38 40 85 189 71 -104 80 73 104 -137 -31 -183 22 141 295 -139 60 281 2
5158 2 -189 4 -147 300 396 -39 -208 -51 149 -24 -75 65 3 55 -130 -76 24 -93 69 -14 -83 -81 154 -29
5182 -29 -176 -41 39 61 29 167 -116 -301 75 3 -202 -183 53 48 65 45 89 140 100 123 60 217 30 9 72 35
5208 35 -31 76 -93 226 250 249 246 -65 -17 64 12 79 8 -101 60 49 228 103 128 -42 36 29 -246 -40 46 145
5234 145 -30 92 -72 169 95 49 52 21 137 51 -25 -38 -64 108 -18 -55 7 68 221 37 215 -123 -21 248
5258 248 -132 -60 -70 -96 -45 22 -64 92 -49 211 -40 161 -146 68 -77 36 87 -32 -83 -67 -175 -29 -9
5281 -9 106 -41 144 -60 238 109 4 37 133 -104 -92 -9 -34 140 -48 64 -107 62 -66 -347 27 -172
5303 -172 -177 -36 -20 110 -67 62 -57 68 -263 -226 95 57 -65 186 -164 83 -433 -26 63 4 -4 28 -191
5326 -191 52 -21 -223 10 -257 99 -24 26 -11 127 -277 -55 104 -36 54 -120 -136 -104 -37 21 25 -60 -150 -102
5350 -102 -88 -26 -146 -22 237 136 216 197 -83 -31 -10 94 -97 -115 -32 119 205 -118 58 -115 18 138 71
5373 71 100 133 74 -35 143 256 4 179 -69 -119 -8 87 -5 -111 72 11 -18 -6 70 42 -21 -266 190 113 36
5398 36 9 -41 144 62 -131 132 84 104 128 -166 -75 -131 -270 25 -43 -211 25 -144 74 -194 3 -49 10 -141
5422 -141 -39 -17 95 88 275 -151 -146 99 69 -93 79 41 48 177 -112 -39 -193 162 -81 -110 -107 178 181 -130 -139 81
5448 81 207 -209 22 119 -63 65 3 -70 -27 -30 156 -197 -17 151 12 216 -181 -158 -55 251 118 30 255
5471 255 96 -169 15 -7 -43 102 143 217 292 -175 17 -52 188 63 -88 37 -76 9 24 11 308 -125 95
5494 95 126 1 97 36 -64 13 -125 156 -148 -169 -71 404 35 41 -131 -60 -45 72 -1 -180 -83 -70 -108 -31 -23 -6
5520 -6 213 -87 90 -79 278 79 -127 -169 36 164 -56 -338 -3 107 -27 131 -2 -32 19 80 -107 -24
5542 -24 -94 -65 53 -51 -223 76 -59 -83 -166 217 2 -360 107 108 2 -244 15 82 116 -18 -42 117 92 159
5566 159 -41 147 100 -114 -44 204 107 -280 7 -9 -25 34 165 -55 13 -200 190 -2 275 -15 199 -231
5588 -231 115 261 124 285 -117 183 75 74 212 -180 -68 6 -281 -100 -37 26 83 -166 29 -60 270 264 70
5611 70 -139 -39 -80 -54 -222 -97 77 -64 -50 132 -23 -163 101 80 -46 -16 -212 29 227 18 -37 63
5633 63 101 -109 -84 105 -86 -98 -101 -2 -11 -20 38 -43 -23 11 91 -160 35 56 -3 -127 -53 -6 200 -4 -92 -187 28
5660 28 174 40 -152 26 224 -148 44 90 151 189 -217 88 -1 -195 -90 23 -125 10 -160 -47 193 -25
5682 -25 103 -116 -179 127 -421 107 183 158 -141 -58 39 131 -65 42 63 -65 -22 222 25 21 -98 159 51 -139
5706 -139 -111 107 1 -20 21 -26 230 147 132 57 65 -149 49 -54 78 68 439 165 4 -7 125 79 81 28 -39
5731 -39 145 175 -243 84 76 -165 12 -114 -60 158 157 -54 60 -59 -10 49 22 47 66 -8 -54 44 -275 -39 149
5756 149 -52 -156 -78 -18 69 145 -37 -20 -51 -56 79 -21 35 419 188 -43 73 38 117 107 -38 -157 -107 7
5780 7 1 -115 -225 -144 -171 -2 128 -159 -200 -72 63 157 -24 -80 -6 -28 11 -104 -23 167 224 -4 -37 95 221
5805 221 114 -68 -156 -51 64 -78 -37 37 101 312 46 88 12 111 94 202 -103 -11 66 -239 116 84 74 -41
5829 -41 26 266 170 48 162 107 64 27 -90 39 171 115 354 143 135 -245 54 94 -47 -61 7 102 0 171
5853 171 397 233 -108 125 37 -253 -51 -7 212 46 -322 66 98 37 33 44 211 -6 -94 -158 -21 -172 -20
5876 -20 57 130 -191 -129 74 187 -63 36 51 103 -76 -98 -15 -19 -52 73 194 304 177 -183 174 -140 -85 31
5900 31 194 55 134 -19 70 2 115 93 116 23 -125 31 -7 -119 125 48 -70 -50 -1 50 -21 -1 25 -9 85 96
5926 96 -377 -1 -9 -5 -108 -43 63 169 6 -6 216 -164 124 25 108 -161 340 123 -89 -135 -22 202 176 -141
5950 -141 -124 42 126 27 -85 -64 89 -17 90 164 103 -122 -45 -282 27 -278 67 -274 3 90 -220 106 -34
5973 -34 78 -15 -31 111 133 130 0 66 -52 -40 -54 110 -11 191 40 -35 248 215 -111 -98 100 -21 327 274
5997 274 184 33 -115 129 169 24 87 -147 40 -28 236 25 149 -158 29 44 122 123 252 -124 -164 -187 -171 30
6021 30 -294 5 -111 64 -32 95 126 -143 -190 119 51 63 -83 145 -34 7 -1 147 62 27 18 -8 81 -36 -8
6046 -8 68 40 112 -86 -187 -244 94 24 -62 -255 32 60 -54 -71 55 0 428 -52 -241 -126 -211 33 123 -94
6070 -94 40 64 25 -363 94 -164 -85 -26 -51 45 123 122 -117 208 -56 -149 -52 -15 -49 171 -19 -46 -2 103 -101
6095 -101 29 -111 -125 27 -135 -115 177 -54 123 85 -152 -15 -106 80 412 -92 -36 193 -173 33 7 37
6117 37 236 134 -173 143 25 184 218 98 38 125 -121 207 33 58 86 -183 -74 122 -105 -119 142 -130
6139 -130 258 -23 179 -41 -105 -80 155 -80 77 20 -96 -184 -121 133 -174 -85 -107 144 -139 -213 39 -15 -123
6162 -123 23 -59 4 -92 119 128 82 -177 -107 107 45 -35 56 9 -70 -130 -183 -79 -70 139 203 0 252 -149 6 -56
6188 -56 -62 294 19 -114 -75 28 -44 -63 -254 -266 257 205 -208 200 -74 54 -54 -50 -47 -7 -106 242 -28 133 179
6213 179 139 106 127 66 129 9 -70 -34 3 -161 40 -197 255 -7 -108 154 -216 -154 -114 -109 71 -303 70 196
6237 196 75 6 4 163 63 56 -38 -139 -189 -25 -84 157 -253 -148 104 136 110 -4 -15 0 240 -14 89 37
6261 37 -22 -113 65 -15 199 181 76 52 16 98 61 167 18 -256 149 42 178 72 1 -37 -85 82 -13 -44 67
6286 67 302 -71 23 8 -23 -8 -75 -158 184 104 -16 -83 225 49 47 -90 269 108 122 -44 157 28 -119 208
6310 208 50 144 -103 -45 39 -255 -28 67 -164 -174 25 42 -189 -111 43 -72 -77 204 -36 -96 33 -197 -176 -168
6334 -168 3 173 274 -7 -130 -25 -43 -119 160 150 112 183 5 -69 -42 204 -11 125 -91 310 -72 -160 166
6357 166 -86 -21 -101 221 -94 156 -32 180 87 195 -257 281 177 167 53 83 -140 -234 186 8 74 -236
6379 -236 246 46 35 57 32 -34 83 148 -88 3 102 -201 -22 -113 155 68 -11 -32 -23 85 -25 10 -79 -27 -246
6404 -246 -208 112 -23 -10 -242 -37 -14 -255 -69 116 -193 -122 49 -305 41 269 -81 62 -110 -108 18 9 -132
6427 -132 20 134 -65 201 -67 20 100 -208 152 128 77 64 -16 -41 -51 139 -112 63 -152 -305 58 -12 25
6450 25 23 -112 6 98 -132 -162 84 26 -77 48 -21 -284 172 260 -2 49 -44 83 -29 -143 -97 87 92 99 103 64
6476 64 50 144 -77 59 -35 219 76 -204 -206 120 67 34 -253 -29 -125 164 -193 10 170 -152 85 -147 -181
6499 -181 156 -45 -40 119 -88 -150 141 -124 117 240 -116 -59 28 134 19 13 137 -18 138 17 39 -35 46
6522 46 -120 157 33 189 -36 -106 -82 44 100 47 -108 -135 -9 -127 -21 -25 4 -44 41 -102 71 137 -68 -36
6546 -36 11 -71 192 84 124 -40 38 -207 -73 -109 112 145 -17 20 305 183 -10 74 180 171 95 209 128 -181
6570 -181 -203 -90 117 -163 -6 0 -107 27 25 104 126 -6 12 -53 -25 -48 -35 -131 -123 191 63 -42 93 -61 -158
6595 -158 173 -166 153 46 -70 -204 57 44 227 109 -61 32 -15 41 163 34 315 89 35 230 -20 188
6617 188 55 -407 -58 -174 -359 68 83 213 81 43 119 -25 67 12 30 -233 102 83 -72 -12 -141 -129 -109
6640 -109 4 124 -134 -164 -15 228 -131 6 -32 134 -221 -242 104 144 86 -195 65 31 139 -12 129 -54
6662 -54 235 94 -14 11 -94 78 65 117 -111 128 -95 60 -214 -48 74 94 -95 -125 -26 -163 -63 291
6684 291 155 17 25 -141 -96 -101 136 73 -27 10 -130 124 205 -192 -103 -1 172 -5 -228 -148 24 -92 -43 98
6708 98 -6 111 -64 117 -225 -157 72 -26 26 -44 -151 53 143 -151 145 -44 37 -74 79 -48 30 -83 -120
6731 -120 -123 -271 -73 124 109 -139 -81 -8 -7 -64 -103 -55 -123 111 241 -167 105 -165 47 14 -92 117 -82 -145
6755 -145 8 125 -130 -256 -35 -158 -33 -7 127 40 -121 115 318 -63 -4 -18 163 -89 -36 -15 114 423
6777 423 346 108 -249 -125 69 -20 5 102 116 89 17 -12 112 -42 139 -112 166 -126 -103 1 8 -16 106 260
6801 260 109 -158 33 -30 49 108 102 -116 -278 -154 149 -20 124 160 272 -5 0 -25 87 -22 -6 -154 -435
6824 -435 -21 68 165 202 -91 130 -104 -57 -156 259 51 22 -93 -8 0 -175 -13 329 -305 -112 33 -199 15
6847 15 34 56 -41 32 39 29 108 148 -245 36 -25 55 -214 -11 -43 -24 4 -38 167 -174 54 -48 -195 119 351
6872 351 -119 -21 -53 -165 45 -26 -40 135 40 -24 166 -59 22 36 -63 -51 -159 14 2 -237 -17 66 285 -45
6896 -45 -64 -62 -110 -35 -118 -21 187 93 92 -147 -54 -30 -8 93 -5 161 -221 -35 68 67 46 -121 -11 -30 150 88 -37
6923 -37 53 -143 -13 225 5 140 231 137 113 116 -70 -34 -91 -96 92 -50 -78 -237 -123 -257 32 149 -29 -3
6947 -3 -182 -57 -81 1 -280 -17 -108 102 206 -183 -95 51 -47 125 -153 10 223 198 -85 -18 -89 -45 -177 -27
6971 -27 -39 -10 109 82 -302 -47 -32 -73 -110 -300 -33 -54 -101 -290 -133 18 71 48 -119 -133 -9 -57 45 49 -235
6996 -235 -30 44 -10 46 -231 95 122 219 -19 98 46 27 -78 -196 106 -205 210 -59 70 158 -129 -38 -283
7019 -283 34 138 27 225 -36 -36 -6 -123 150 -16 -215 78 447 -131 -35 -143 91 162 78 -30 -11 33 -86
7042 -86 -124 -3 -48 -78 -34 80 -31 56 -63 -7 -261 -2 -338 -184 145 10 189 -225 131 -109 -70 -152 147
7065 147 -44 -106 269 -114 -132 148 -167 23 106 77 -43 104 -174 -241 -138 -47 -11 194 108 -34 2 -13 89
7088 89 -57 49 52 -37 122 -51 3 -99 -199 61 399 108 88 163 -2 185 11 40 -23 118 96 -119 -165 46
7112 46 45 145 114 0 -136 44 52 -44 64 -41 8 -46 -22 78 -136 -204 -31 101 144 -242 -200 85 -50 -22 -208
7137 -208 -146 321 62 39 -119 -17 -41 22 -37 49 79 -44 88 -35 -41 -94 144 -47 -94 -188 -68 191 121 -119
7161 -119 -277 77 -47 -117 13 160 48 235 54 -9 -40 -89 -97 -36 109 -43 20 -26 -105 20 187 -48 323
7184 323 30 -118 -71 56 119 66 -47 -42 -112 -117 10 83 -130 122 -48 32 -205 -96 10 -20 -106 383 -8 137
7208 137 36 -164 -80 262 239 -186 140 5 -224 130 17 103 -112 -315 -81 -121 -47 112 -267 73 225 57
7230 57 -295 213 38 -21 -128 47 45 20 36 -182 -49 -8 78 37 -57 60 39 158 -123 -58 -41 -199 137 123 112
7255 112 113 -188 22 136 16 25 184 -6 101 77 125 -24 -5 -102 -70 -71 28 251 22 42 84 -98 -109 88 36
7280 36 -85 -22 -62 7 -92 159 -129 -39 -24 -107 -74 -69 -12 -35 -101 -238 -63 21 -131 -5 -103 91 -11 -128 143
7305 143 -87 -57 128 -197 1 205 51 503 -78 189 20 -41 -21 10 132 88 -84 355 212 -80 -56 -69
7327 -69 -99 217 -86 -159 86 -226 185 106 -51 -38 124 125 -64 27 49 44 176 -128 121 67 -22 83 251 91
7351 91 -111 -240 -160 46 2 -16 155 -60 -18 -197 240 47 89 -168 -301 201 171 -38 30 321 -184 43 165
7374 165 -261 79 -7 14 -80 -3 123 -212 116 -80 -45 -24 3 104 -25 182 0 78 -53 286 -189 123 64
7397 64 207 191 12 -77 354 -39 153 71 237 -19 77 168 181 219 -112 -210 -187 17 -9 -45 -92 -9 -134 -139 181
7422 181 88 -88 -168 10 -111 -59 -96 112 -68 -90 36 -269 -188 15 -52 76 -51 57 -34 107 64 -7 192
7445 192 118 135 168 26 34 -18 -19 29 133 6 -81 110 -64 -20 72 -140 -311 22 -9 -161 154 -68 -258 57
7469 57 264 -34 -25 20 13 -4 -166 133 13 184 218 221 -71 192 133 -80 11 46 256 -56 192 -111 139 367
7493 367 147 244 -76 -6 -80 -39 170 -57 -42 86 -72 108 109 -47 -134 -91 270 83 17 -240 -288 -144 -92 122
7517 122 73 94 -15 131 73 -171 -297 9 118 68 -35 -160 -134 -77 93 -21 20 -230 94 106 58 286 166
7540 166 188 -17 -64 208 -160 0 65 92 -80 -48 16 -126 10 75 47 47 163 -179 49 -166 -176 -252 142 -195
7564 -195 -38 5 -48 -128 -21 -69 5 -42 45 18 -260 -340 231 295 71 -95 -134 -109 -68 -24 -24 27 -44 130 209 108
7590 108 -128 134 -149 164 96 0 -85 109 265 -62 104 54 -7 -179 -104 96 -147 -261 -88 -40 -173 94
7612 94 -270 -109 -103 132 66 59 155 275 255 -94 252 -22 38 -128 118 313 -369 182 83 -131 238 -13 205
7635 205 -123 83 110 69 164 8 14 -93 75 137 -123 -279 -50 73 48 -321 -110 106 114 -147 -118 -127 -231 137
7659 137 -104 1 -213 -71 -92 -62 106 342 108 17 99 85 215 -53 -98 -81 128 109 91 106 136 60 93 -73
7683 -73 -81 -253 -34 54 -200 -47 -130 -236 72 -311 -48 46 160 -103 22 -89 11 -141 -150 52 -75 101 -136
7706 -136 -253 30 162 -71 -11 -130 -15 26 -20 93 -261 -279 369 -10 -139 -30 -16 -8 50 137 -76 -26 14 294
7730 294 1 198 95 -58 211 -64 35 -327 60 315 -182 -175 128 -167 264 68 -90 97 -166 211 110
7751 110 -52 -110 234 9 -199 51 253 49 67 141 130 13 200 -5 153 -3 120 -70 -224 -45 41 82
7773 82 61 215 -138 201 6 14 29 174 53 113 -108 -71 -87 -180 249 -77 -206 146 -4 -144 -16 -112 -48 67
7797 67 -234 -228 145 13 26 -66 155 -117 -171 141 -82 -112 33 -86 258 -73 -76 441 -59 -137 -83 103 -232 -111
7821 -111 197 259 -100 -188 118 164 -3 117 39 -220 144 -74 -53 -192 -256 -92 256 96 42 15 90 128 118 30
7845 30 -55 -294 -104 -114 103 179 -13 -9 -128 144 93 -45 -69 146 121 137 -21 -12 130 108 -72 -187 -103 -43 72
7870 72 91 -73 39 -60 161 41 15 -182 45 104 -95 -57 28 -72 -63 -175 -163 94 -58 -4 -98 -85 122 -379
7894 -379 120 -8 -11 -249 -4 -157 14 -116 -130 86 192 90 36 156 -53 -53 5 -104 199 -181 -120 -188 92
7917 92 34 -166 -67 126 45 117 -26 12 -45 -143 280 -49 114 108 -3 -100 26 22 -87 -147 -247 -84 64 -199 -213
7942 -213 86 146 -219 -184 -59 50 -48 253 28 -233 34 -236 -235 251 -15 25 36 -84 213 -176 -19 -59 -130
7965 -130 -31 26 134 -5 93 -33 -35 -92 -358 -141 225 142 -120 124 -262 295 129 18 19 39 -168 19 187
7988 187 150 279 -68 -89 -176 16 -63 131 35 -18 63 115 16 -54 -15 276 262 -113 153 87 -176 -62 -22 -98 -18
8013 -18 -113 150 138 243 -55 68 187 -53 172 172 -244 106 21 -8 87 -119 11 -24 -217 -154 146 55 19 149
8037 149 215 -269 -104 -247 146 -122 -13 -62 -127 -229 -23 303 123 -50 97 28 84 52 79 -372 258 256 24
8060 24 -136 -318 31 -169 236 3 176 -2 52 179 61 13 17 198 -15 128 28 96 250 -114 -212 -45
8082 -45 230 -131 20 -58 -155 -15 2 189 -272 -6 -178 125 33 -39 -116 -146 150 80 33 107 4 21 80 125 -61
8107 -61 45 -328 92 39 -149 -119 104 -37 68 32 -234 -21 284 -191 -19 196 80 -33 73 13 -48 140
8129 140 148 -124 39 -181 -157 80 -90 0 -107 130 261 29 -241 78 -200 -123 -225 -145 -136 232 119 -2 128
8152 128 -176 78 -29 106 39 127 44 -36 -29 202 -11 20 -123 -9 90 -14 -78 72 166 112 73 -69 -2 20 197
8177 197 -336 229 296 -30 -60 33 104 309 199 -72 35 193 -141 45
8191D5
$$ Imaginary data points
##PAGE= N=2
##DATA TABLE= (X++(I..I)), XYDATA
0 0 0 0 0 0 0 0 0 0 0 0 0 -7 8 -8 8 -8 16 -16 18 -24 30 -36 40 -48 56 -65 78 -89 104 -118 135 -156 175 -200
34 -200 226 -255 285 -322 359 -401 446 -497 550 -609 674 -745 822 -906 999 -1099 1212 -1336
52 -1336 1472 -1623 1793 -1986 2202 -2452 2742 -3084 3491 -3991 4620 -5435 6544 -8153 10706
67 10706 -15411 27131 -124459 -188974 -245075 -548125 -527689 -210212 146612 227320 100748
78 100748 -77588 -52526 138057 210086 66154 25413 207644 379641 298225 68924 -147270
89 -147270 -259496 -230056 -153555 -187658 -230291 -105618 107367 140876 3911 -63988 -16874
100 -16874 30228 60481 86972 108375 113143 109029 74139 -4838 -52648 -45840 -56923 -64913 -12024
113 -12024 47179 4874 -110535 -148459 -81131 -17186 -14630 -31829 20471 136243 188548 98521
125 98521 -56599 -104163 -9641 74351 53255 -4794 17817 113190 122449 -20708 -194581 -245094
137 -245094 -151113 -39917 -7352 -22480 6543 125035 214132 126348 -55721 -107078 17512
148 17512 117363 60434 -30979 -26670 40078 54156 -46096 -175594 -188555 -62678 49407
159 49407 30730 -8270 45090 105914 85226 22969 -18972 -35035 -14923 46972 64708 115
171 115 -37759 -9447 -7177 -59119 -82955 -47516 -11866 16187 53020 51633 17677 11826 19707
184 19707 -6452 -27622 7508 29403 -10024 -20508 22693 20808 -40779 -65547 -22051 20275
196 20275 30695 28713 6857 -4575 30418 41867 -25848 -83786 -37431 40622 37236 -8435
208 -8435 -18110 -3665 11003 17166 -2835 -37703 -24614 43935 70913 18864 -29349 -26105 -5139
221 -5139 -3658 -24200 -44052 -31682 26711 70501 35366 -22344 -18957 17876 14318 -27469 -40759
234 -40759 -10166 20771 26736 8782 -9788 -8852 2344 5488 -1958 -5287 3197 11105 11824 3068
248 3068 -12214 -19317 -14671 -5006 3079 3238 2110 6961 13184 9138 -8114 -12323 2559 8007 2542
263 2542 6048 14635 7201 -9511 -11554 -9836 -17742 -15663 -2151 3894 7488 17144 16558 -2891 -6727
278 -6727 9730 3594 -16357 -6840 15789 10032 -10203 -5462 5225 -6259 -11440 -1509 246 -2122
292 -2122 7111 9956 -4208 -6495 7350 975 -13794 684 17214 2774 -8951 9072 14087
305 14087 -12649 -19628 3685 8432 -6214 -5119 6662 3889 -1626 1852 -6315 -15866 -234 15209
319 15209 5096 -4305 7122 13249 1755 -1648 239 -14307 -18607 5214 15968 -6719 -20107
332 -20107 2542 21382 8798 -9713 -13036 -3113 14488 18886 -3775 -24735 -7963 23403 17312
345 17312 -15084 -23046 516 21803 15556 -9611 -24574 -11253 15210 16421 -10030 -22051 -1959
358 -1959 22819 21271 -2253 -17824 -9848 10919 16245 -2899 -21301 -12801 12829 22409 1346
371 1346 -21697 -13755 12043 17225 -5326 -17040 -2429 10700 6393 -1507 -2291 -2623 -2711 3266 6826
386 6826 1528 -3831 -4266 -625 6771 9666 -2599 -16021 -5539 14915 9398 -12629 -15696 -3469
400 -3469 4279 6615 4919 -7847 -13210 11004 32289 11148 -21833 -16630 12531 19814 -1700
413 -1700 -24202 -24206 2432 28433 11507 -28701 -27847 16294 35398 3075 -27136 -17154 12191 28423
427 28423 15003 -17176 -26402 7065 35159 9635 -32377 -27261 9890 22627 3210 -16823
439 -16823 -17060 3000 24430 17466 -15781 -26532 1367 22776 7619 -16191 -15486 4573 20015
452 20015 15736 -4671 -16612 -2035 15453 5526 -14332 -12423 3053 5528 -436 -535 -1108 -6503
466 -6503 -7101 1064 6419 872 -4671 -1280 9823 17824 10240 -6030 -10986 -538 9990 4137
480 4137 -12108 -18207 -6484 11139 11312 -9280 -24254 -11371 14986 20872 -1463 -18338 -2391
493 -2391 30344 34476 25 -26449 -11044 17986 15684 -15378 -33222 -16397 13510 20535 -3895
506 -3895 -28249 -15311 18409 24611 -2481 -19153 -1025 24137 25430 6843 -11110 -10093 6063
519 6063 11116 -8075 -25822 -15296 5724 7902 -3208 -7506 -4777 1090 6683 3732 -6382 -4726
533 -4726 10408 14930 5393 4499 11377 6420 -6743 -7221 -683 -5782 -15844 -14541 -4844 3417 4954
548 4954 -2842 -9715 -329 15838 11604 -7600 -8603 10849 21902 12351 -935 -5548 -1459 6726
562 6726 3258 -17557 -30497 -13977 9438 7648 -10588 -12923 5410 20437 15225 -2563 -11757
575 -11757 2135 20865 17225 -4327 -12737 1701 12317 1386 -17840 -23233 -10967 3206 4169
588 4169 -6220 -9416 4219 16851 12426 -1062 -5123 2762 9862 7542 491 -3238 -801 2601
602 2601 495 -6173 -11488 -10721 -4148 676 -320 -2750 669 6551 7538 4302 3705 3018 444 346 3082
619 3082 3249 -1789 -6102 -4964 -852 1270 -2592 -9659 -6948 4318 8567 -1312 -6824 1639 10021
634 10021 8051 832 -2808 -3448 394 5345 1345 -8739 -8072 3995 8896 1015 -6685 -5842 167
649 167 4785 2399 -5898 -7564 4196 12472 4867 -5507 -4055 3060 2907 -1109 -4309 -5610 -528
664 -528 7482 6645 -3638 -6539 1656 5074 -1583 -5811 -2537 987 2609 3027 74 -3123 -888 3765
680 3765 1812 -2494 -1661 1875 2573 1763 219 -2863 -2907 1449 1773 -3421 -4045 2284 4459 -697 -3099
697 -3099 560 2453 -185 -1073 140 1533 804 -65 -703 -959 -607 -614 -416 503 603 -243 439 1483 859
716 859 -1971 -1933 1085 1350 -601 -1595 506 1869 89 -2007 -1270 686 860 -627 93 2045 1559
733 1559 -257 -537 230 -538 -1223 -255 -49 -1172 -203 941 -648 -2449 -450 2228 1621 -259 317
750 317 1531 2485 1378 -1101 -3888 -2104 1868 948 -2971 -2440 1477 2553 915 -418 -2083 -2208
766 -2208 2380 5474 78 -5843 -1431 5910 3958 -4150 -5825 -645 4241 3225 -1660 -5223 -1388
781 -1388 5119 4169 -2814 -4742 -135 3980 3159 457 -3078 -3399 1416 5465 279 -6703 -3637 4831
797 4831 5491 -1388 -4378 -1297 2461 2846 -178 -3094 -1907 1916 3518 531 -2210 -1229 342 1172
813 1172 1319 -116 -1953 -899 1983 2054 -569 -1983 -894 230 607 945 60 -1783 -1115 2382 2631
830 2631 -642 -3199 -1156 2563 3049 -387 -3725 -1949 1532 2835 -258 -3009 -2387 1314 4035 1700
846 1700 -3008 -3727 1319 4679 1519 -4175 -4138 1578 5372 1823 -4330 -3984 1579 4686 633 -4082
862 -4082 -2575 1327 2954 1753 -1234 -3599 -1521 3076 3284 -1776 -4457 -463 4058 2661 -1732
877 -1732 -2834 -356 2850 3303 -729 -3471 -1212 2288 1944 -1244 -2029 -1525 -94 1772 2035 -1190
893 -1190 -3016 186 3621 1551 -1738 -1531 595 1502 1501 186 -2098 -2484 863 2398 -244 -3005 -2042
910 -2042 1026 2423 1390 -1253 -2769 181 3306 1885 -1693 -2283 86 2019 1544 144 -2217 -2687
926 -2687 589 3030 139 -3962 -2853 2023 3372 326 -2792 -1856 1205 3033 1158 -1852 -2025 750
942 750 2751 1724 -903 -2631 -1605 1350 2267 -925 -3659 -1596 2904 3271 -632 -3043 -925 1940
958 1940 2362 -526 -2173 -812 1691 2388 792 -1390 -2187 -209 2004 1133 -2207 -2613 361 2674
974 2674 1020 -1438 -1680 86 1402 1007 -881 -1976 -275 1584 1720 104 -837 -328 1172 1753 129
991 129 -2523 -2243 405 1125 -853 -1757 -182 849 432 231 163 -580 -307 1555 2163 405 -388 303
1009 303 1451 385 -1214 -2296 -1809 -255 -13 -822 -1062 476 1312 584 42 436 144 -134 1172 2329
1027 2329 316 -1383 -97 1362 17 -2118 -2405 -1022 188 174 -488 -691 -33 1237 1170 -34 -401
1044 -401 92 1149 1682 923 -790 -1264 238 1173 -603 -2627 -1435 437 657 -643 -1232 -51 974
1061 974 1075 828 -324 -292 847 1061 573 -1068 -610 517 1217 71 -1744 -874 413 473 -1100 -1546
1079 -1546 -304 821 794 117 108 658 603 341 273 -143 -377 320 777 676 -413 -911 -128 457 -854 -1850
1099 -1850 -552 879 712 -89 119 646 674 275 -148 -266 -72 -62 375 538 -121 -613 -394 -227 170 -490
1119 -490 -970 378 1253 734 -578 112 978 498 -140 418 254 -279 -311 60 123 -890 -541 199 416 -24
1139 -24 123 100 112 120 49 -12 -280 -116 88 421 551 -130 -981 -536 821 571 -1020 -1216 693 1401 550
1160 550 -1082 -855 333 569 539 -295 -1006 -92 1288 1325 -645 -1845 -444 1631 1929 -961 -2131 -27
1178 -27 2549 1520 -1700 -2558 -238 2241 1005 -1343 -1690 36 2098 1262 -719 -1977 -819 2008
1194 2008 2245 -392 -2450 -497 2044 1962 -1086 -2524 -160 1874 1252 -953 -1505 126 1632 974
1210 974 -867 -1419 -261 893 895 -356 -881 -517 524 503 -340 -385 262 892 396 -782 -278 823 260
1229 260 -565 -618 855 307 -490 -885 206 912 513 -345 -763 -211 1004 869 -806 -1627 -724 1159 1281
1248 1281 -697 -2028 -401 1727 1640 -1135 -2342 -429 2509 1323 -1428 -1753 674 2020 598 -1534
1264 -1534 -1874 184 1697 924 -1463 -1937 437 2135 818 -1328 -1825 561 2153 660 -1923 -1695
1280 -1695 1327 2355 44 -2761 -1224 1759 1754 -660 -2028 -696 1703 1641 -413 -1887 -450 1620
1296 1620 1358 -616 -1888 -74 1776 1292 -1080 -1948 18 1954 803 -1784 -1513 1230 1826 -222
1312 -222 -2017 -870 1348 1245 -682 -1508 -143 1591 1073 -860 -1694 -375 1771 1396 -981 -2236
1328 -2236 -281 2368 1183 -1691 -2479 503 2937 684 -2505 -2052 1119 2371 186 -2077 -1216 1267
1344 1267 2369 162 -2078 -1303 1260 2006 253 -1831 -1117 1055 2197 4 -1753 -1072 1573 1817
1360 1817 -907 -1976 -274 1738 805 -850 -1391 254 1346 665 -1024 -920 453 1369 55 -1227
1376 -1227 -670 591 894 113 -1082 -608 884 1432 -506 -1832 -456 1722 1116 -1093 -1394 230 1341
1393 1341 522 -1194 -967 289 793 380 -735 -1061 346 1302 524 -970 -1145 616 1578 425 -1421
1410 -1421 -1295 614 1426 26 -1532 -858 1297 1106 -292 -1272 7 1098 505 -667 -856 -91 737
1427 737 771 -259 -816 -493 573 1009 -475 -1014 -284 890 836 -544 -1122 34 1114 456 -805 -722
1445 -722 449 1056 204 -437 -505 -47 571 361 -475 -693 33 359 526 -734 -901 -75 958 470 -710
1464 -710 -485 664 591 -154 -417 -384 331 465 112 -654 -109 111 294 243 -461 -648 314 499 100 -880 -695
1485 -695 285 910 -50 -876 -313 654 555 -390 -318 -268 416 479 5 -196 -260 271 315 -45 -516 -25 330 577
1507 577 -29 -829 -215 715 524 -274 -710 301 1093 -40 -750 -115 634 707 -350 -426 -161 469 321 -260
1527 -260 -800 -517 561 593 53 -779 -193 1122 850 -782 -1095 -103 1350 802 -753 -1053 291 1276
1545 1276 268 -1101 -1105 493 1065 484 -1152 -882 603 1424 415 -1453 -1144 617 1754 278 -1398
1562 -1398 -1242 901 1800 -260 -1936 -677 1501 1718 -420 -1908 -463 1418 1321 -759 -1752 -453
1578 -453 1569 1505 -646 -1682 -393 1421 1202 -894 -1934 -270 1660 1111 -965 -1586 420 1655
1594 1655 461 -1283 -974 598 1341 157 -1027 -735 512 832 -44 -997 -336 931 769 -473 -907
1611 -907 -34 883 655 -881 -1180 342 1432 75 -1580 -801 974 1417 -469 -1344 -622 1375 1393 -252
1629 -252 -1471 -70 1342 1077 -1007 -1652 -233 1565 1279 -1026 -1857 -74 1824 1329 -1028 -2101
1645 -2101 98 1843 929 -1684 -1575 539 1962 222 -1366 -1113 1019 1567 518 -1258 -1194 564
1661 564 1656 289 -1407 -1050 749 1883 109 -1757 -1017 1271 1468 -197 -1613 -413 1260 840
1677 840 -790 -939 -203 1000 695 -551 -783 14 1217 350 -735 -942 114 1067 265 -1091 -389 446
1695 446 979 -24 -1194 -387 1049 874 -627 -1119 125 1334 449 -918 -1080 361 1188 300 -1030
1712 -1030 -938 502 1430 391 -1122 -1063 502 1501 437 -1356 -1261 592 1533 108 -1533 -845 1022
1729 1022 1315 -78 -1310 -299 704 1055 -1 -1185 -507 731 930 32 -759 -487 628 1066 65
1746 65 -984 -289 766 548 -724 -677 24 733 255 -700 -235 452 716 -203 -506 -236 579 324 -39 -484
1766 -484 -41 609 301 -240 -645 209 736 485 -587 -865 444 1141 320 -954 -835 754 1360 -97
1784 -97 -950 -740 556 1056 -207 -985 -50 805 735 -97 -1018 -477 474 943 102 -896 -230 765 924 -67
1804 -67 -1143 -193 655 637 -200 -982 49 725 438 -375 -584 215 554 262 -329 -439 309 395 182 -89
1824 -89 -429 -245 124 89 -311 -510 120 417 176 -21 -252 163 152 -152 -51 52 -10 -183 -225 -149 291 -2
1846 -2 -113 205 105 137 160 40 -36 192 292 216 -216 -713 -1 470 237 -524 -190 111 237 151 -47 -308
1868 -308 51 324 -149 -361 -143 72 206 223 7 -34 -91 261 274 39 -317 111 232 230 -342 -196 136 -32
1890 -32 -30 51 72 13 63 7 293 11 -259 106 275 -16 -187 -71 234 342 207 -294 149 381 304 36 1
1913 1 -139 52 27 9 -99 -196 -4 311 58 -275 -3 326 401 -208 -412 -109 288 100 -180 -404 11 225
1935 225 84 -248 -78 -75 172 6 -63 -337 -99 295 484 57 -374 -189 241 407 -391 -58 -73 474 83
1956 83 -283 -39 92 381 122 -206 -244 90 1 19 -64 -286 34 70 113 -242 -183 20 231 109 -265 -84 287
1979 287 90 -194 -187 357 346 103 -420 -16 406 75 -437 -383 254 499 144 -440 -358 233 392 423 -306 -548
2001 -548 306 617 -40 -602 -754 -50 673 97 -575 -310 150 544 371 -452 -424 426 701 -196 -540 -394
2021 -394 59 594 354 -336 -463 -7 614 112 -500 -229 266 506 80 -613 -261 321 316 -249 -234 42 179
2042 179 6 -65 -70 -145 5 -294 -239 -278 101 155 -77 -85 -63 101 127 -207 -274 -61 319 142 -563 -48 397 173
2066 173 7 -632 -310 551 535 -171 -434 -148 179 403 -344 -568 -210 413 231 90 -346 -313 496 752 -155
2087 -155 -770 -179 446 579 -132 -709 -333 442 319 -321 -248 14 286 537 47 -273 -484 123 442 45
2107 45 -58 -257 160 123 24 -257 318 146 -63 120 112 76 -133 -95 -139 375 99 -421 -405 316 492 -136 -203
2130 -203 -280 -23 565 -164 -156 -466 -130 320 180 -494 -375 131 527 216 -405 -498 -47 595 164 -389 -353 124
2152 124 514 179 -433 -603 131 489 422 -307 -524 -188 831 635 -235 -625 -223 378 157 -245 -452 -58
2172 -58 398 240 -340 -390 -358 149 670 -68 -26 -276 -80 77 351 -146 -127 -44 151 95 11 -194 -42 -38 66
2195 66 -82 -264 -294 318 -39 114 -424 -508 171 393 108 46 -588 -236 360 121 73 -237 -28 2 179 -199
2217 -199 -153 -372 68 133 21 29 -257 303 272 105 -299 -337 74 244 -49 -233 -248 52 242 290 -40 -218 150
2240 150 219 157 -342 -43 -45 98 45 7 -201 269 68 55 -74 -143 -43 -83 77 -195 -195 85 -149 125 -149 -45
2264 -45 -88 108 146 15 -53 24 86 156 126 207 -91 79 67 57 209 -436 -80 30 190 -83 -399 -220 110 262
2288 262 -45 -77 -373 84 -29 132 108 230 15 164 -18 157 -281 290 340 167 -115 -156 336 356 -73 -277
2310 -277 -202 305 -69 -107 -253 203 21 258 81 118 -54 -76 54 -5 47 -15 -127 95 33 -91 -4 -82 42
2333 42 -172 -150 -33 328 152 -270 56 30 -79 46 107 -46 25 9 167 118 -122 -46 17 -3 69 -106 -133 -73
2357 -73 -33 107 -281 69 208 270 -36 -79 155 91 -232 126 43 24 -189 -78 106 -1 -102 -7 167 -167 323
2380 323 43 -34 -76 -44 24 45 -93 126 2 -13 -19 -191 268 145 146 -218 -270 -107 164 19 52 157 -178 -1
2404 -1 62 89 -36 -249 -31 153 171 -183 -152 122 229 -81 -36 -175 33 309 114 -4 121 -95 135 378
2426 378 53 -189 -65 306 383 19 -244 8 44 257 -5 -201 -144 -42 46 13 204 -32 -125 -8 -91 -13 -198
2449 -198 -66 47 332 -43 129 40 239 80 -53 -7 -89 -82 -11 96 -91 -89 -163 90 145 -54 -199 -32 68
2472 68 21 -354 -145 75 173 125 -89 -146 51 100 7 58 -97 -201 -117 -85 199 83 -326 -352 290 230 -105 -189
2496 -189 -127 -25 198 -50 -295 -241 192 496 1 -334 -221 201 289 38 -279 -101 314 221 86 -195 42
2517 42 232 211 245 24 -130 25 175 185 -83 -138 52 -5 319 -86 -89 37 176 160 50 -148 -65 -57 277 65
2541 65 -76 -95 -178 91 270 -197 -165 106 194 47 176 -312 -145 39 -32 -59 -147 41 70 62 52 -162 -218 116
2565 116 264 123 -249 -263 61 266 -44 -53 -160 20 172 164 -193 -13 107 199 116 1 -255 -328 57 225 -66
2588 -66 -222 84 214 184 -167 -79 -62 174 319 -29 43 -38 42 257 -3 -73 -175 -44 100 -6 -62 82 -42
2611 -42 373 -16 -92 68 -62 -82 -341 -56 58 114 257 -81 37 -66 22 108 176 -20 -35 -149 -287 -32 131
2634 131 80 -287 175 206 -120 -72 -186 -214 45 106 -284 -194 31 126 87 -110 -50 -217 -7 138 77 -137 26
2657 26 -43 -39 -73 32 -146 289 -129 -225 -98 -293 247 200 107 -127 150 129 36 -166 -121 133 213 34 -184 -34
2681 -34 20 34 139 75 30 81 59 4 -83 -58 -254 -76 183 -78 94 -98 109 347 -126 13 -288 -67 81
2704 81 -82 -130 111 50 131 35 -122 143 201 185 41 -221 -151 208 -12 -106 46 82 72 -169 -34 298 -154 -116
2728 -116 -47 8 157 -208 -64 -164 74 116 -178 48 41 -76 92 88 -54 117 120 59 299 -39 -273 -13 298
2751 298 135 -51 -222 -17 -150 192 -270 158 121 86 -238 91 95 89 -74 -181 -180 -203 66 125 155 -367 -126 -47
2775 -47 198 201 21 -259 89 46 169 -189 -78 -287 -87 110 -14 -104 -40 68 138 -112 -219 -128 -4 91 -1
2798 -1 -51 44 142 171 -206 -238 92 96 57 192 46 -252 6 -1 203 -48 -286 93 -256 -371 21 -201 91 -217
2822 -217 93 62 187 139 -175 -48 104 43 -155 -35 181 206 69 -159 -392 112 282 257 -82 -110 -133 159
2844 159 240 -26 -330 -4 306 267 -214 -130 -45 -8 247 -198 -248 -38 272 93 -208 -102 -68 159 228 -8 48
2867 48 11 80 12 43 -233 -24 21 293 -128 -66 93 136 -172 -69 -325 -52 167 8 38 -143 -154 -378 106
2890 106 43 -52 -327 -40 75 -30 -235 -56 96 -101 52 -109 -73 -74 -373 22 322 -33 -145 -226 28 138
2912 138 46 -196 -150 31 150 -220 -169 -163 267 -4 -36 -183 -326 -28 347 83 -262 -316 -158 112 110 -69 -179
2935 -179 196 157 185 -36 -153 -40 328 -188 -80 -90 151 -19 80 -150 -139 -13 210 -89 -290 67 134 233
2957 233 -2 160 -31 -166 217 -22 169 203 -217 -166 96 -1 -200 -218 -61 200 -90 75 -207 -41 10 -113
2979 -113 -135 73 80 -126 -5 86 -53 -68 182 -58 110 171 -25 36 130 -298 -262 -193 -62 199 -151 -40 -113 -99
3003 -99 4 169 216 -92 -38 -3 -76 25 -84 1 197 75 173 73 5 116 93 -56 -68 31 -161 59 116 45
3027 45 -16 -232 47 229 14 79 208 28 -80 -194 104 -9 187 -123 -288 61 -27 46 -105 -31 -67 -8 124
3050 124 139 313 -294 61 -44 -66 -150 29 -191 70 85 258 26 18 97 93 -181 139 211 97 78 -231 15 17
3074 17 170 -125 -36 -90 -46 158 -108 -95 -21 -202 -69 78 7 -152 -170 -13 -73 117 56 -2 -14 60 -60 -41 -192
3099 -192 16 49 -62 122 122 -30 -146 81 320 -204 -232 -174 60 202 -91 -73 386 105 81 -65 -79 107 -142
3122 -142 360 20 198 -200 74 -67 274 110 -63 130 18 48 -130 -118 112 -123 -57 -96 271 133 -206
3143 -206 53 9 103 -35 110 77 62 -28 227 284 32 -333 144 25 -64 138 25 76 -99 -156 -184 -29 68 -10
3167 -10 112 89 -69 252 -166 -38 -113 -140 99 -16 228 -3 -22 -112 27 13 -49 153 39 9 9 111 133 29
3191 29 -153 -36 112 -98 0 20 115 266 -16 -267 18 66 14 94 65 -73 -99 5 102 126 -119 -156 109 -33
3215 -33 149 -350 -77 178 78 101 -10 -19 54 32 11 -29 130 -154 95 246 -7 -44 -189 -79 -125 154 -187
3238 -187 66 331 121 87 198 135 -87 -74 221 -10 -60 74 88 192 213 -214 18 197 155 -273 99 -79
3260 -79 104 172 -183 -243 85 -20 -66 10 176 -258 232 261 -6 -148 -232 -47 59 17 -444 -8 180 -23 -76
3283 -76 55 -214 -171 171 176 187 -16 -71 0 123 -91 -120 -120 75 -9 -52 84 -37 222 -55 -172 -86 -105 142 55
3308 55 -158 94 -63 -99 92 90 -81 -79 112 236 236 6 -5 -302 67 333 166 -113 -106 -42 -25 55 -328 -42 -11
3333 -11 85 131 -40 96 -4 210 232 19 76 -154 467 208 89 -74 -296 348 202 -219 -198 132 125 -89 -3
3356 -3 -271 25 287 31 144 -200 -12 121 72 -70 -203 -45 -36 190 -162 24 73 -24 187 -165 115 -304
3378 -304 113 -128 -44 95 176 105 66 61 12 102 -322 -23 -151 37 270 -109 -9 45 26 -94 171 -246 -157 11
3402 11 165 -60 -55 -223 340 214 -70 -186 38 134 158 -42 -129 183 151 35 -167 134 -165 106 23 -14 -149
3425 -149 16 382 10 -227 -310 -92 233 50 -41 -208 34 40 55 -192 -76 182 113 100 -146 -3 -69 20 241
3448 241 -270 103 111 -129 -75 64 -44 46 77 -91 -320 -127 -81 107 -68 2 181 185 -72 -200 -67 303 95
3471 95 117 -129 113 367 13 117 139 -77 65 -156 133 77 36 99 -245 -23 115 70 204 99 -378 153
3493 153 4 41 38 87 154 229 -6 23 -235 -117 -91 -21 17 -185 -12 37 22 -21 -105 54 -15 231 62 118 116 186
3519 186 -9 -126 -127 -69 90 -26 -22 -120 202 -29 57 -107 136 31 17 178 -1 48 142 65 -14 -50 101 84 138
3544 138 -136 -272 11 74 114 21 95 50 107 81 55 -46 109 -7 125 -57 123 -97 -97 -82 -242 -137 20 37
3568 37 -1 -193 13 -51 -81 68 188 -171 -194 14 -131 -104 -129 -201 -160 117 31 189 28 139 226 -70 -42 1
3592 1 82 218 205 -53 -115 7 -19 -73 175 -56 77 9 -86 -181 118 15 175 -144 144 46 197 166 -309 62
3616 62 334 101 -64 116 137 106 39 165 -43 -12 0 125 137 -222 112 -113 230 -122 -89 59 110 161 124 -21
3640 -21 237 192 -129 -77 9 90 -18 81 -179 -50 -214 39 209 28 95 -121 -285 -35 -183 -16 148 -5
3662 -5 245 -31 -186 215 145 -71 -8 190 72 -72 31 22 184 153 -297 -36 152 229 34 -101 -143 2 97
3685 97 197 -338 -49 -87 169 -162 29 -343 72 65 81 -341 117 52 100 -49 -176 -100 93 302 -64 -121 -60
3708 -60 -50 303 160 -104 -146 -93 378 -71 27 37 -112 -71 -103 174 -230 109 274 252 -109 -14 59 -78 189 -61
3732 -61 79 -87 -69 -156 -97 -69 -35 -147 -169 -148 -227 -54 -38 -53 -342 -262 172 -60 -113 -191 -82 56 234 -33 210
3757 210 -125 39 -252 -128 -112 281 -115 155 -199 -1 300 98 -100 -169 -124 19 209 -6 88 95 250 23
3779 23 -51 -146 44 -110 -29 60 -206 107 54 4 210 170 8 -55 25 -67 -84 -157 -61 -22 46 26 137 178 -66 -86
3805 -86 -232 279 70 -241 -209 84 48 154 -91 -240 -56 170 330 -251 -2 26 273 -43 13 -51 -49 -193 -23
3828 -23 -60 -70 -42 -342 -170 138 12 217 -153 126 274 -131 -40 -41 -48 99 25 -215 -206 181 -231 107 -26 94
3852 94 -25 -157 9 -47 -76 -204 136 256 -52 35 128 18 10 -56 -23 53 -98 320 209 -64 -244 116 -11
3875 -11 191 -24 -103 143 173 348 -140 -149 -97 217 -70 187 -11 117 -102 53 -53 -259 -64 -106 214 -120
3897 -120 39 -187 53 160 199 -126 264 -9 -30 -281 -132 -35 -61 -43 1 221 175 112 -29 -90 97 111 78 -196
3921 -196 -49 -167 -188 -42 -177 95 -144 25 -121 -110 -82 237 66 15 -74 -178 106 15 139 -103 -22 340
3943 340 -174 -108 -133 207 -126 60 -118 -44 76 5 140 -3 137 -130 -85 4 59 126 104 -165 -60 86 -228
3966 -228 6 32 -118 -35 -69 -128 -177 48 62 -154 -219 209 23 -100 16 -18 162 -120 136 -152 -119 256 -150
3989 -150 -63 86 -31 148 -93 95 -25 241 -41 96 -163 -136 12 -72 -94 -132 -55 -12 270 85 41 49 -115
4012 -115 -83 -134 -106 94 32 71 -57 -27 -181 161 -74 -106 11 96 -261 100 -44 110 -36 -30 67 -130 -136 39
4036 39 155 -36 14 -186 140 186 67 -82 -25 -87 91 -150 275 -110 -39 143 -8 167 -230 357 181 67
4058 67 -46 -203 14 153 117 -83 167 351 329 -140 94 -165 303 31 39 -182 -53 116 272 -51 151 403
4080 403 265 -11 223 93 210 30 -167 -57 -17 149 254 53 84 -131 -62 -40 -167 -124 -39 3 129 -65
4102 -65 -70 131 81 -4 23 -84 -49 134 -10 -214 64 71 -115 23 23 -249 34 151 99 251 -186 -96 -36 -10 32
4127 32 -6 306 -33 23 114 -85 194 -96 -4 144 -186 89 24 -61 -329 -28 111 -37 -148 -53 -162 -294 40
4150 40 163 -96 102 215 54 188 10 139 45 144 -9 -17 -35 -163 -79 176 144 -98 -13 159 -193 -172 -63
4173 -63 -18 49 17 -53 280 176 166 -135 -44 81 57 6 126 85 -154 175 262 -121 16 -59 -61 -108 -106 146 189 -169
4199 -169 83 166 -152 294 214 -166 -147 88 192 83 -3 46 129 87 -69 -30 -156 408 86 295 2 -17 183
4222 183 87 -54 139 -68 53 115 55 213 -33 -66 102 40 -4 11 142 96 133 -171 126 38 -55 -23 -9 -90 -149
4247 -149 31 -77 204 -138 -141 -3 242 -36 56 -2 292 -76 -271 209 397 57 35 -12 129 21 45 -96
4269 -96 -55 186 -267 156 -133 -40 -101 32 -27 101 338 -15 -11 -77 21 -127 85 187 -98 -85 -32 228 -304 -325
4293 -325 152 -90 -105 -40 -85 41 7 66 -17 147 -98 -254 -265 -56 30 -60 -32 200 134 48 -135 174 -3 -148
4317 -148 -101 285 -229 -84 -168 -132 -60 -175 -216 122 -129 -88 20 -93 -53 42 8 -6 -76 -33 -57 -12 21 176 -71
4342 -71 -213 23 -137 -59 -247 -255 -13 -32 54 -249 79 -391 -222 168 -82 -170 -25 -83 122 -213 -108 42 -56
4365 -56 198 26 18 15 -61 40 -76 144 66 185 -119 -12 27 -48 72 -132 -54 -96 -93 79 -27 -65 -201 32 93
4390 93 28 -68 48 -134 19 110 43 4 59 117 47 229 -47 -170 -132 153 -184 -54 -7 -27 -25 -123 135 224 118
4415 118 -93 100 10 -27 143 11 204 22 -163 -78 32 56 89 -84 -75 -187 -65 25 64 -190 -30 162 106
4438 106 -168 -104 178 -14 154 204 -142 134 63 162 171 -298 -69 49 126 -225 9 -69 -121 205 -138 -57 -177
4461 -177 158 187 38 24 43 -102 181 132 97 181 -131 -38 -63 41 -142 -71 178 21 75 257 -35 245 185 26
4485 26 -18 278 -184 140 153 -92 -43 -142 18 48 -73 -166 -124 -3 -103 -242 132 -193 78 -43 -129 114 131
4508 131 72 4 -16 21 -73 -4 186 -64 171 -198 42 108 -14 -108 -229 95 -178 267 -238 -90 134 49 36
4531 36 73 157 16 209 -38 86 -139 -10 17 22 -118 122 -61 165 47 -38 -197 38 79 0 -254 -181 47
4554 47 -78 73 80 -39 -11 222 -36 89 151 135 -2 7 -220 -274 170 22 60 -251 194 -23 -76 -93 78 -10
4578 -10 -1 -40 34 -135 21 47 16 -78 -217 67 -10 122 -195 -40 -120 14 -15 136 112 -55 15 3 12 -143 -246
4603 -246 -13 49 -127 -120 1 6 -118 99 30 -17 261 -69 61 -167 -71 29 141 249 43 -11 -59 -74 -215 -112
4627 -112 224 170 46 61 85 100 -23 -27 114 92 -109 208 115 -67 -88 -164 -57 -121 -13 -108 -86 -51 35 -18 -72 -132
4653 -132 130 122 -212 116 -9 92 -10 16 -67 220 -102 59 -29 67 -71 -44 -31 116 55 117 28 -201 39 -304
4677 -304 208 -229 -102 196 51 -161 -152 139 80 -67 74 242 -69 13 222 -115 115 134 -31 67 -78 16
4699 16 90 -38 -175 166 -238 -34 95 194 -265 -145 -84 -89 78 -181 -118 -166 -152 188 -46 -8 45 -147 30 -131
4723 -131 -232 163 10 125 218 -182 6 -44 57 -117 59 -42 -48 11 72 -266 279 -139 -99 162 -24 1 146
4746 146 -61 115 -133 -233 -139 213 -14 -216 -35 -100 62 -45 -213 -79 55 -50 67 -38 -222 28 -32
4767 -32 6 -225 46 199 35 176 -45 -90 -124 -23 -43 103 -42 -21 71 -146 109 102 62 -108 63 -103 -167 -82
4791 -82 62 -18 76 87 -33 -147 -3 -81 -22 101 -156 -95 66 116 124 71 -159 211 -29 -159 -49 29 -305 116
4815 116 -124 9 179 99 -123 -40 61 15 163 -50 29 32 192 -79 -50 139 128 198 51 40 141 -105 287
4838 287 131 -86 -85 68 70 -119 -34 234 -82 -63 -110 -120 -45 -2 16 -234 119 -236 -93 174 -27 -40 -2 -347
4862 -347 -81 -122 -43 75 -164 -44 93 -229 83 91 6 -171 256 -8 -33 10 -221 -210 316 107 270 176 -62
4885 -62 -210 -271 -27 -125 -203 -193 -66 8 -232 56 128 -62 134 -116 -135 59 35 67 6 -103 105 -118 13 -116
4909 -116 -76 169 -132 94 18 -9 67 199 -60 87 8 -264 44 81 -8 -326 107 27 59 -173 29 83 3 -219
4933 -219 83 86 68 -167 -18 93 -32 -189 -240 138 154 -92 -105 -114 67 -67 191 29 298 156 28 211 -4
4956 -4 -96 -96 -53 -65 258 -209 -120 -115 -111 13 -29 -94 -274 -214 -90 108 -144 -99 99 0 -99 -210 64 63 -60 154 92
4983 92 -187 -83 -101 -41 7 -55 -149 246 15 -66 -61 -149 -179 2 -98 41 138 -100 15 104 214 -20 83 -26
5007 -26 92 20 -99 -13 87 138 -147 -80 316 191 34 -148 -102 13 -16 -29 52 100 134 -56 -357 5 -133 -182
5031 -182 -96 167 -174 73 -13 -127 -109 159 128 148 -29 -34 114 -46 -19 86 -109 -26 69 89 76 -41 106 -30
5055 -30 -54 -47 27 -167 87 119 44 23 41 -193 183 114 31 35 -142 -77 222 -116 236 -55 44 202 -32 -17 105
5080 105 -79 -353 192 20 -35 35 21 -69 -135 -58 -97 -26 -23 84 -44 28 -18 -29 -28 -53 -85 -14 73 -140 -40 -54 120
5107 120 -68 169 -144 -109 -126 -112 31 -74 -34 -59 -85 -161 -115 71 -297 -10 -99 -123 -54 -8 33 -204 -97 -139 170
5132 170 165 -145 24 -51 -8 28 -77 -130 -130 177 -143 62 21 48 -40 90 -122 -222 -159 34 -119 57 208 -164
5156 -164 120 -207 47 -40 28 132 126 -96 109 -19 6 24 -125 46 71 -34 -90 220 2 -14 -20 -95 -34 188
5180 188 -22 5 -68 -34 -25 121 39 150 179 114 -27 -91 142 -105 -59 -139 10 -90 250 47 58 140 149 -271 57
5205 57 113 -50 -83 228 32 267 -159 -170 -21 63 90 163 92 90 -91 -118 -53 -64 238 140 -129 -131 199 125 -18 -210
5231 -210 -116 -28 -32 53 -19 -68 286 31 -4 -4 134 -51 201 251 7 -15 78 85 88 -94 12 111 61 64 -83 53 -77
5258 -77 65 46 -180 -282 12 -14 -68 -301 152 51 329 -150 13 -6 -188 -66 267 -43 -107 -136 -5 124
5280 124 -275 -179 -102 56 -36 54 29 -91 157 -195 -148 64 -267 86 223 38 -21 261 -149 -4 -201 112
5302 112 216 -30 1 -53 41 208 -45 -207 48 -167 -158 -19 -106 -141 55 55 -19 -42 219 120 17 119 -46 11
5326 11 25 -49 80 186 8 24 -56 284 220 -71 13 231 17 -71 89 160 117 -157 128 -145 55 95 -28 -134
5350 -134 131 12 74 5 -246 -318 -289 23 -235 20 3 -162 187 288 -49 198 -495 122 151 59 -55 -162
5372 -162 218 -53 -126 -82 20 48 -10 364 60 -133 57 -93 -87 0 33 109 311 -244 233 -113 -27 100 66 104
5396 104 112 -172 -48 100 -82 288 -308 68 74 -4 34 -5 33 111 39 -75 -9 294 68 16 -75 -105 209 72 -64
5421 -64 54 -19 -51 -205 -100 -52 -127 -3 -183 -4 -77 -176 159 154 -86 80 110 127 177 -163 -79 94 192 133 250
5446 250 188 -16 31 346 121 120 122 187 51 53 -177 8 -43 -37 -277 -201 -57 -24 -217 -188 -34 33 91 19 58 52 87
5473 87 -111 -12 17 -117 -63 231 125 -272 49 -4 122 -129 -135 -75 31 65 115 -303 -91 -181 -12 -93 102 -214
5497 -214 -153 -114 -157 -92 141 18 67 40 114 9 -37 189 -68 -65 39 90 -100 24 22 -68 -100 -130 -79 -254 96 29
5523 29 149 74 74 12 57 -122 -98 160 -52 -130 17 -179 33 -172 380 83 103 28 2 24 -177 200 -85 -177
5547 -177 -13 30 -219 102 -330 172 -7 -72 100 110 77 139 -41 89 -137 64 305 199 130 -53 37 -5 35
5570 35 183 -85 -150 -72 -164 93 218 10 -72 121 25 -13 19 -8 212 189 37 -216 146 35 -11 -9 6 -108 -114
5595 -114 187 -100 -84 90 8 101 -81 -147 -37 -141 -5 228 36 60 19 246 134 -80 -124 -197 -139 -81 73
5618 73 -51 -30 -66 30 77 147 7 41 69 -165 33 -42 48 -90 15 127 54 -54 -20 -29 193 -124 75 70 58 -98
5644 -98 -28 -137 -82 106 25 36 -282 -64 -232 206 -1 -262 -166 88 0 -84 -75 -48 -46 30 58 66 -2 -22 -2 109 -190
5671 -190 -18 60 30 -68 -290 313 -185 146 -60 -5 -131 25 -110 -6 74 -172 224 20 -144 28 -81 47
5693 47 -83 94 202 50 38 272 -52 -175 -34 -47 354 -80 6 285 98 105 76 -76 108 -73 137 19
5715 19 -42 -79 99 -19 -232 72 -51 -26 17 158 0 -46 -62 -50 59 23 23 -103 -218 -292 151 -70 -99 -59 -53
5740 -53 -12 -63 -102 -84 166 17 -69 90 -37 -66 95 -161 295 21 106 -354 78 -325 205 184 222 -99 -158 -51
5764 -51 -90 174 193 81 153 -73 91 140 -27 -44 -28 37 -132 -22 87 69 -346 150 46 -96 116 48 291
5787 291 136 -66 -7 -45 25 104 290 132 -3 144 53 -139 109 -310 9 111 42 249 124 68 -103 125
5809 125 -134 253 62 29 154 -30 49 -221 19 -299 -166 -99 -72 -219 -238 -85 114 -38 -103 -11 94 -143
5831 -143 -48 40 187 -97 98 101 89 274 -132 160 15 -17 -53 -156 120 51 70 283 114 -292 155 266 53
5854 53 221 25 -73 97 -159 13 -92 -250 63 157 86 -11 8 -53 46 -149 157 27 -32 34 12 11 -81 190 128
5879 128 -196 80 18 -45 193 27 -124 -159 149 221 123 -99 -125 -41 51 -18 44 -201 56 10 294 30 99 117
5903 117 -113 -271 108 155 118 -67 69 -115 -230 -25 -19 -219 -27 -100 -139 -5 -184 111 3 -7 6 56 -73
5926 -73 130 -68 128 -73 -30 239 81 -176 -12 236 140 102 1 76 -59 81 255 133 38 182 64 134
5948 134 -188 -213 -89 -52 117 61 114 68 39 -18 118 -47 145 133 270 -114 83 158 -5 158 -126 -75 194
5971 194 -22 84 -55 206 -255 71 84 -256 -177 -55 217 -40 207 -50 -65 185 114 -83 -61 -174 97 -27
5993 -27 137 122 -227 92 172 178 -55 -112 373 29 89 -23 74 -9 -122 -13 -17 151 4 124 -29 -196 46 67
6017 67 25 9 -131 -35 -34 161 -5 72 -265 123 46 -195 177 289 -53 -244 -34 113 -74 47 133 19 93
6040 93 -88 -207 -84 -140 -43 -165 -151 5 76 -16 -288 70 -265 -218 16 -63 47 11 163 47 158 -55 172
6063 172 206 -81 124 -185 -75 -244 -91 231 -132 13 -143 -45 160 -108 42 18 -89 -36 59 -64 -204 177
6085 177 72 117 -144 160 -268 -119 -41 -115 124 -170 -11 244 213 6 79 -151 -152 -66 -223 172 18 -52 158
6108 158 -122 259 -3 -27 -138 4 152 29 30 -25 71 65 -132 -120 -92 -14 63 119 142 119 -34 -96 6 30 118 30
6134 30 -117 -165 -154 155 -116 -145 -158 -3 155 83 3 -111 13 96 -30 51 145 -112 -102 -71 216 12 -138 -201
6158 -201 -361 -100 -148 22 -219 -48 20 88 145 116 -44 14 208 33 157 -145 -86 40 32 1 -73 243 3 122
6182 122 -32 -16 82 76 110 -105 -243 55 -205 98 152 -62 -1 52 47 43 26 -29 -210 -107 10 -146 -115 81 -192
6207 -192 27 -146 -2 -41 30 -12 157 -72 -199 117 162 207 164 5 -73 134 -30 54 130 -243 -218 -60 133
6230 133 -46 -82 -283 -119 156 -47 -57 -180 -41 -1 -91 170 111 129 51 96 -71 327 -27 -85 -90 -160 -111 86
6254 86 134 -3 39 79 -39 177 199 -25 13 -49 72 90 282 14 102 69 18 -44 -73 97 -32 -219 228 -201
6278 -201 149 -189 -68 105 -56 -38 -44 -179 -4 -96 117 -51 -138 -92 146 130 131 36 -224 -80 -51 172 -106 -22
6302 -22 -147 11 86 64 -314 71 351 -67 -6 -192 3 -14 -37 -3 -73 -297 -296 84 -10 140 -121 -187 -197 -52
6326 -52 79 160 1 -161 110 161 -20 -210 6 89 182 114 -74 -16 -46 17 126 93 84 -109 159 0 256 -79
6350 -79 -84 -63 -88 61 -56 -106 -160 38 59 43 207 -187 142 165 -67 47 -125 -15 100 128 -74 105 10 193
6374 193 -183 5 205 -119 -91 -195 2 273 -9 54 226 336 32 55 -94 -168 -99 -28 63 -124 70 -120
6396 -120 -33 8 -16 -3 -130 57 225 64 -95 98 -133 -154 -69 -10 173 -117 -188 174 89 -15 263 25 -46
6419 -46 147 -86 14 132 75 -131 -73 3 296 -25 -468 -82 -127 -84 175 25 120 -41 -118 -38 -141 -101 8
6442 8 -214 -16 6 -90 102 -193 -54 145 228 -46 75 -91 -189 41 -181 16 -103 72 3 86 -40 99 101
6465 101 50 61 -59 52 -89 -126 133 237 -19 209 -140 254 -116 -1 65 7 -135 -162 111 -75 -80 -81 281
6488 281 52 194 -46 -15 10 -187 -149 142 -47 76 64 -122 130 -96 62 -5 -11 -81 -71 -72 -13 106 386 36
6512 36 417 -172 40 24 59 -104 -29 73 -290 -189 -240 217 -49 -12 31 -118 193 28 5 -6 -18 96 -53
6535 -53 -154 132 159 -142 -44 -324 -9 117 139 374 -3 -2 133 -168 -167 -73 55 15 -102 72 -263 43 -103
6558 -103 -159 -162 -11 132 -52 -39 -80 0 6 -222 -69 140 109 -75 90 178 -144 -200 17 -230 -146 -254 -147 99
6582 99 14 -136 -10 146 -113 57 -78 109 169 -252 -40 -127 -9 -1 -138 36 -97 -153 185 192 -107 196 168
6605 168 -60 248 -27 -84 178 -5 90 -13 -66 226 -18 208 41 196 160 -20 -67 -139 -104 63 48 -177 159
6628 159 -66 -101 -59 247 -79 -15 -302 -117 -91 90 -99 10 14 176 -16 -72 206 463 2 143 -193 -43
6650 -43 -76 27 -129 -156 -227 71 1 -171 37 202 139 -81 159 118 -39 178 115 69 129 -22 44 -152 -256 230
6674 230 77 -32 37 -169 -96 -148 199 -27 -199 -112 -105 -27 -115 -57 70 35 347 -26 -115 -130 -23 -6 88 210 165
6699 165 55 118 60 -48 69 -92 -21 243 223 10 -127 34 255 381 33 -54 -4 -102 153 71 20 92 141 -90
6723 -90 -187 -142 31 -81 -33 363 149 25 -58 116 239 -78 -60 -34 55 -21 -181 -85 112 3 8 -41 -273 -187 137
6748 137 125 147 -73 -39 155 -182 -77 173 -213 -150 3 49 -103 -44 102 -80 -47 -140 -136 -154 -127 56 -102 56
6772 56 -14 73 -205 -28 -5 188 -40 -142 67 -118 -213 -89 44 -46 125 -89 310 34 7 121 -252 -59
6794 -59 -167 -60 -17 3 -9 265 69 104 -93 39 69 177 -44 -5 12 1 -1 14 -18 -165 -2 -141 123 5
6818 5 164 12 -72 189 132 -177 -35 -79 -44 136 -83 -68 156 -25 4 -18 222 18 71 35 136 8 110 15
6842 15 -89 69 233 -70 -73 9 215 -15 103 -100 88 170 -153 360 110 -150 -93 -75 102 -102 -141 -80 -29
6865 -29 184 11 -133 -155 245 -1 -111 -72 19 118 -105 -8 158 -171 -52 -191 119 224 -78 140 96 1 6
6888 6 27 34 24 -55 100 201 34 -250 -298 -212 -120 60 -97 269 159 -154 -153 246 101 116 66 40 -16 -85 390 -327
6914 -327 -54 307 -7 -169 -156 97 68 162 -130 -73 -154 -98 143 -98 -13 -246 -77 -64 216 -138 -24 -217 -60
6937 -60 4 -91 -93 105 187 -48 72 -88 50 -20 69 -21 23 163 113 101 -142 -256 54 66 218 -15 69 35 -1
6962 -1 43 -194 201 79 -92 -43 140 -135 -196 338 -34 -92 -74 167 105 5 -209 -80 -90 -11 66 -256 6 -65
6986 -65 -204 39 139 -27 -72 103 -108 64 74 210 58 70 -10 -246 -33 -280 -100 96 -36 -124 -94 -121 -32
7009 -32 7 -296 59 -9 6 1 19 -198 -165 -236 88 160 60 176 -33 21 -159 166 51 109 -101 24 169 -54
7033 -54 43 -83 -136 -3 66 13 -168 -120 179 -62 53 213 -62 13 248 25 114 -81 -22 -173 212 30 49
7056 49 -26 156 201 -154 -64 34 203 202 16 67 134 59 68 182 256 -7 -63 195 -19 207 102 62 -156 116 200
7081 200 -215 231 -206 55 59 -142 -89 -124 -90 51 291 135 64 -80 -80 -129 -115 9 -221 15 137 -139 -208 -266
7105 -266 -109 -6 -21 -6 -9 -204 41 -71 74 -51 95 -77 -60 -121 -18 103 -192 28 156 16 85 -188
7127 -188 109 59 119 -7 -44 -36 143 88 109 155 -43 276 -144 135 -233 -122 -128 13 87 -25 -17 -42 -9 -175 -104
7152 -104 -191 -142 81 95 -38 141 -56 -32 -22 -81 -7 76 153 -133 -264 -11 -68 -62 -265 33 171 8 116 -90
7176 -90 258 -218 -42 28 118 -143 151 342 -20 187 -124 60 136 82 -216 -218 21 -126 85 -209 -212 63 -169
7199 -169 -41 86 29 -88 23 100 -79 6 -120 30 43 46 -116 30 132 144 108 102 233 36 113 19 -110 -88
7223 -88 -17 104 -12 -225 238 67 264 11 47 69 -14 178 224 -41 -33 20 -165 126 -61 65 31 -238 33
7246 33 91 -14 -52 -154 103 -208 -66 -61 -56 -294 -96 -307 -201 201 -125 83 -158 74 -81 -38 24 50 -84
7269 -84 55 29 120 80 -11 -125 -10 -58 14 -135 174 -105 207 -84 -26 140 -8 -64 -268 -24 -165 -42 -8
7292 -8 195 -20 65 -79 -115 -83 -51 -60 -125 -27 91 -57 80 37 83 82 323 41 -35 172 -163 -179 -95 -123 -221 -116
7318 -116 -128 18 -206 -2 144 -40 350 69 -202 229 153 -75 -118 -128 38 303 1 166 71 -85 243 -65
7340 -65 -12 -72 40 31 -410 -43 -254 -29 64 153 -163 -188 -156 -147 -81 -241 63 -200 123 -80 -46 -105 -321 -207 269
7365 269 -8 -187 7 143 -147 -43 -91 148 -34 -11 -104 24 -3 75 -74 47 86 -90 125 79 169 163 130 -31
7389 -31 -123 -98 -79 -40 251 -149 -169 -76 3 188 50 19 85 53 155 169 -94 163 -51 303 8 -20 3 -44 -146
7414 -146 -79 -237 64 52 -41 -35 -95 -32 -41 -14 78 62 91 -175 -30 80 -122 -132 134 164 -49 -207 -210 -75 59 -144
7440 -144 34 -113 -119 56 63 158 -261 -66 188 -18 -67 36 149 29 -141 96 -285 50 19 143 -120 -26 12
7463 12 -167 162 103 -258 -197 137 89 198 -145 5 297 46 84 -13 -75 219 139 194 75 33 -148 77 -40
7486 -40 -71 89 -55 -170 62 -17 -6 238 -36 -101 160 188 -189 -29 -33 58 -82 -3 50 -123 103 202 -84 -25
7510 -25 67 -81 3 117 17 -136 -198 159 -140 -60 -32 -46 26 103 32 79 78 -39 -11 -39 -90 -121 -204 33 -107 -3
7536 -3 146 38 -145 -27 -140 11 22 108 55 98 29 65 -75 293 78 -156 268 -231 -145 -200 -149 42 -74 208
7560 208 104 -227 -69 58 139 -39 -91 -86 56 150 41 71 41 15 -265 -10 87 162 152 155 124 224 -12 137 323
7585 323 -198 -254 -269 56 143 111 36 -99 220 57 37 62 -15 279 44 -94 -95 -358 49 132 14 -76 113 -219
7609 -219 182 -81 -190 -108 10 -63 -83 123 -91 -173 -177 53 -138 44 -109 28 78 -60 -99 95 102 79 -44 262
7633 262 136 208 96 133 -68 112 108 140 75 12 105 148 -61 -85 47 150 -171 71 -16 116 -72 -102 -140 -39
7657 -39 194 -295 -59 -132 -49 -206 -88 116 -125 -48 -11 -28 -5 -175 -140 -216 105 -5 34 -2 -156 -118 -355 67
7681 67 74 166 74 184 -37 141 -31 -90 73 69 182 -28 72 36 -204 -67 -119 122 167 -129 238 156 -151 -132
7705 -132 -4 -13 51 -123 -26 259 -169 18 68 24 14 87 54 -154 -202 59 -1 -38 -143 -145 -44 -21 -159 -80 13 -8
7731 -8 -61 243 42 16 42 125 -108 -122 217 110 184 -73 -71 -330 147 372 236 3 35 245 -24 3 109 -107
7755 -107 51 183 -25 12 -23 -45 -55 -147 -244 -19 197 42 29 74 183 -297 -73 -119 205 160 74 30 82 -40
7779 -40 76 189 -51 -41 -138 -53 110 -72 -195 21 66 -63 -39 -7 181 123 -209 -141 187 50 57 -55 -21 -49
7803 -49 -173 -2 20 -168 -118 -58 -226 141 -37 -25 -47 84 22 193 -12 137 -85 208 -129 59 -19 -198 198
7826 198 -34 -86 -185 -22 -99 -22 -90 -29 -334 -29 66 -91 -224 128 -255 -123 224 15 -123 -195 -83 -137 102
7849 102 116 45 205 135 33 -1 -65 -17 19 -1 -86 47 -10 -124 -6 -6 107 -72 -14 125 -35 -335 -43 143
7873 143 -40 -57 22 -114 82 63 -222 128 -202 64 111 25 -90 -25 63 -77 -155 54 53 -15 4 -42 -171 22
7897 22 -81 194 -145 141 131 -49 65 204 -250 49 -173 56 108 -127 -66 -200 -183 284 -151 -261 77 77
7919 77 -28 -152 -216 70 51 -39 36 115 201 -65 -28 -29 81 185 25 19 -79 -87 -21 252 -149 69 -42 -140 -101 124
7945 124 -216 -335 44 -126 -91 48 -204 -146 -90 75 -5 23 66 142 165 -45 248 23 -188 -132 -74 -31 123 -37
7969 -37 -153 -109 -42 116 -83 -78 -78 -76 216 59 65 -25 -59 -53 65 -49 -8 45 -97 118 19 140 -30 -5 -182 -28
7995 -28 64 -146 31 -266 -26 -102 85 -151 231 -100 47 -26 31 166 -94 -171 -2 98 20 -80 -208 35
8017 35 10 217 -94 -34 217 -43 89 76 -238 -46 -34 60 358 62 -7 -78 -49 98 -247 -31 88 108 -29
8040 -29 -18 -63 -47 -31 61 -185 131 -63 125 -192 0 -200 94 -68 -185 201 -227 156 6 75 86 198 84
8063 84 -191 -384 -4 -136 -92 -156 -6 -104 -5 -134 54 81 -31 86 143 25 -22 -16 -60 36 21 69 -38 216 -123
8088 -123 -37 -20 195 53 -230 -294 83 -46 15 271 165 64 24 167 105 -99 -98 39 -179 -181 148 -151 -2
8111 -2 -158 -251 25 3 -15 20 -96 -223 65 -149 80 159 -24 -102 166 -41 -65 50 148 144 167 50 26 159 -26
8136 -26 34 -165 -9 -189 107 -25 123 -315 -72 -67 118 -61 56 151 49 -45 -16 234 -93 67 59 -84 -100
8159 -100 134 -30 172 59 -205 -354 107 -41 -121 108 113 282 81 290 145 36 -56 -149 -204 -11 -42 203
8181 203 19 65 53 -141 -60 113 226 173 -81 -67
8191f7
##END NTUPLES=NMR FID
##END=
