##TITLE=1H_Pr Cl-2
 CDCl3, 8 sc, 
 9.06.2021
##JCAMPDX= 6.0         $$ Bruker NMR JCAMP-DX V2.0
##DATA TYPE= NMR FID
##DATA CLASS= NTUPLES
##ORIGIN= UXNMR, Bruker Analytische Messtechnik GmbH
##OWNER= root
$$ XWIN-NMR		Version 3.5
$$ Wed Jun  9 13:04:51 2021 Russian Standard Time (UT+4h)  she@DPX200
##.OBSERVE FREQUENCY= 200.131506
##.OBSERVE NUCLEUS= ^1H
##.DELAY= (6, 6)
##.ACQUISITION MODE= SIMULTANEOUS
##.ACQUISITION SCHEME= undefined
##.AVERAGES= 8
##.DIGITISER RES= 18
##SPECTROMETER/DATA SYSTEM= spect
##.PULSE SEQUENCE= zg30
##.SOLVENT NAME= CDCl3
##.SHIFT REFERENCE= (INTERNAL, CDCl3, 0, 15.7039)
##AUDIT TRAIL= $$ (NUMBER, WHEN, WHO, WHERE, WHAT)
$$ ##TITLE= Audit trail, XWIN-NMR		Version 3.5
$$ ##JCAMPDX= 5.01
$$ ##ORIGIN= Bruker BioSpin GmbH
$$ ##OWNER= she
$$ F:/spectra/data/she/nmr/H-F/1/audita.txt
$$ ##AUDIT TRAIL=  $$ (NUMBER, WHEN, WHO, WHERE, WHAT)
(   1,<2021-06-09 13:03:41.04 +0400>,<she>,<DPX200>,
      <created by zg, POWCHK disabled, PULCHK disabled
       configuration hash MD5:
       00 E9 B6 7A A2 85 ED C7 34 08 36 98 17 FE 4E 26
       data hash MD5: 16K
       91 76 53 AF 3C BE 94 7E E6 D3 62 6C 6B 03 F5 D7>)
$$ ##END=
$$ 
$$ hash MD5
$$ 88 B3 82 14 B6 50 B3 35 50 88 F3 4E BD A1 1F D1
##$RELAX= 
##$RELAX= 
##$RELAX= 
##$RELAX= 
##$RELAX= 
##$RELAX= 
$$ Bruker specific parameters
$$ --------------------------
##$DU= <F:/spectra>
##$EXPNO= 1
##$NAME= <H-F>
##$PROCNO= 1
##$TYPE= <nmr>
##$USER= <she>
##$AMP= (0..31)
100 100 100 100 100 100 100 100 100 100 100 100 100 100 100 100 100 100 
100 100 100 100 100 100 100 100 100 100 100 100 100 100 
##$AQSEQ= 0
##$AQ_mod= 1
##$AUNM= <au_zg>
##$AUTOPOS= <>
##$BF1= 200.13
##$BF2= 200.13
##$BF3= 200.13
##$BF4= 200.13
##$BF5= 200.13
##$BF6= 200.13
##$BF7= 200.13
##$BF8= 200.13
##$BYTORDA= 1
##$CFDGTYP= 0
##$CFRGTYP= 5
##$CHEMSTR= <none>
##$CNST= (0..31)
1 1 145 1 1 1 1 1 1 1 1 1 1 1 1 1 1 1 1 1 1 1 1 1 1 1 1 1 1 1 1 1 
##$CPDPRG= <>
##$CPDPRG1= <>
##$CPDPRG2= <>
##$CPDPRG3= <>
##$CPDPRG4= <mlev>
##$CPDPRG5= <mlev>
##$CPDPRG6= <mlev>
##$CPDPRG7= <mlev>
##$CPDPRG8= <mlev>
##$CPDPRGB= <>
##$CPDPRGT= <>
##$D= (0..31)
0 1.2 0 0 0 0 0 0 0 0.06 0 0.03 0 0 0 0 0.0002 0 0 0 0 0 0 0 0 0 0 0 0 
0 0 0 
##$DATE= 1623229420
##$DBL= (0..7)
120 120 120 120 120 120 120 120 
##$DBP= (0..7)
150 150 150 150 150 150 150 150 
##$DBP07= 0
##$DBPNAM0= <>
##$DBPNAM1= <>
##$DBPNAM2= <>
##$DBPNAM3= <>
##$DBPNAM4= <>
##$DBPNAM5= <>
##$DBPNAM6= <>
##$DBPNAM7= <>
##$DBPOAL= (0..7)
0.5 0.5 0.5 0.5 0.5 0.5 0.5 0.5 
##$DBPOFFS= (0..7)
0 0 0 0 0 0 0 0 
##$DE= 6
##$DECBNUC= <off>
##$DECIM= 32
##$DECNUC= <off>
##$DECSTAT= 4
##$DIGMOD= 1
##$DIGTYP= 9
##$DL= (0..7)
0 120 120 120 120 120 120 120 
##$DP= (0..7)
150 150 150 150 150 150 150 150 
##$DP07= 0
##$DPNAME0= <>
##$DPNAME1= <>
##$DPNAME2= <>
##$DPNAME3= <>
##$DPNAME4= <>
##$DPNAME5= <>
##$DPNAME6= <>
##$DPNAME7= <>
##$DPOAL= (0..7)
0.5 0.5 0.5 0.5 0.5 0.5 0.5 0.5 
##$DPOFFS= (0..7)
0 0 0 0 0 0 0 0 
##$DQDMODE= 0
##$DR= 18
##$DS= 0
##$DSLIST= <SSSSSSSSSSSSSSS>
$$ [...]
##$SUBNAM2= <"">
##$SUBNAM3= <"">
##$SUBNAM4= <"">
##$SUBNAM5= <"">
##$SUBNAM6= <"">
##$SUBNAM7= <"">
##$SUBNAM8= <"">
##$SUBNAM9= <"">
##$SW= 20.0188882624521
##$SWIBOX= (0..15)
0 0 2 0 0 0 0 0 0 0 0 0 0 0 0 0 
##$SW_h= 4006.41025641026
##$TD= 16384
##$TD0= 1
##$TE= 0
##$TE2= 300
##$TE3= 300
##$TEG= 300
##$TL= (0..7)
0 120 120 120 120 120 120 120 
##$TP= (0..7)
150 150 150 150 150 150 150 150 
##$TP07= 0
##$TPNAME0= <>
##$TPNAME1= <>
##$TPNAME2= <>
##$TPNAME3= <>
##$TPNAME4= <>
##$TPNAME5= <>
##$TPNAME6= <>
##$TPNAME7= <>
##$TPOAL= (0..7)
0.5 0.5 0.5 0.5 0.5 0.5 0.5 0.5 
##$TPOFFS= (0..7)
0 0 0 0 0 0 0 0 
##$TUNHIN= 0
##$TUNHOUT= 0
##$TUNXOUT= 0
##$USERA1= <user>
##$USERA2= <user>
##$USERA3= <user>
##$USERA4= <user>
##$USERA5= <user>
##$V9= 5
##$VALIST= <valist>
##$VCLIST= <CCCCCCCCCCCCCCC>
##$VD= 0
##$VDLIST= <DDDDDDDDDDDDDDD>
##$VPLIST= <PPPPPPPPPPPPPPP>
##$VTLIST= <TTTTTTTTTTTTTTT>
##$WBST= 1024
##$WBSW= 4
##$XGAIN= (0..3)
0 0 0 0 
##$XL= 0
##$YL= 0
##$YMAX_a= 544866
##$YMIN_a= -535743
##$ZGOPTNS= <>
##$ZL1= 120
##$ZL2= 120
##$ZL3= 120
##$ZL4= 120
##$ABSF1= 10
##$ABSF2= 0
##$ABSG= 5
##$ABSL= 3
##$ALPHA= 0
##$AQORDER= 0
##$ASSFAC= 0
##$ASSFACI= 0
##$ASSFACX= 0
##$ASSWID= 0
##$AUNMP= <proc_1d>
##$AZFE= 0.1
##$AZFW= 0.1
##$BCFW= 1
##$BC_mod= 2
##$BYTORDP= 1
##$COROFFS= 0
##$CY= 11.3945322036743
##$DATMOD= 1
##$DC= 2
##$DFILT= <>
##$DTYPP= 0
##$F1P= 15.9154993809931
##$F2P= -4.1035820241983
##$FCOR= 0.5
##$FTSIZE= 0
##$FT_mod= 4
##$GAMMA= 1
##$GB= 0.15
##$INTBC= 1
##$INTSCL= 1
##$ISEN= 128
##$LB= 0.24
##$LEV0= 0
##$LPBIN= 0
##$MAXI= 10000
##$MC2= 0
##$MEAN= 0
##$ME_mod= 0
##$MI= 1.114404
##$NCOEF= 0
##$NC_proc= 0
##$NLEV= 6
##$NOISF1= 3.799351
##$NOISF2= 2.8
##$NSP= 1
##$NTH_PI= 0
##$NZP= 0
##$OFFSET= 15.70392
##$PC= 1
##$PHC0= -11496.09
##$PHC1= 28.00101
##$PH_mod= 1
##$PKNL= yes
##$PPARMOD= 0
##$PSCAL= 0
##$PSIGN= 0
##$REVERSE= no
##$SF= 200.130013532006
##$SI= 16384
##$SIGF1= 3
##$SIGF2= 2
##$SINO= 400
##$SIOLD= 16384
##$SREGLST= <1H.CDCl3>
##$SSB= 0
##$STSI= 0
##$STSR= 0
##$SW_p= 3612.71676300578
##$SYMM= 0
##$S_DEV= 0
##$TDeff= 0
##$TDoff= 0
##$TI= <>
##$TILT= no
##$TM1= 0
##$TM2= 0
##$TOPLEV= 0
##$USERP1= <user>
##$USERP2= <user>
##$USERP3= <user>
##$USERP4= <user>
##$USERP5= <user>
##$WDW= 1
##$XDIM= 8192
##$YMAX_p= 0
##$YMIN_p= 0
$$ End of Bruker specific parameters
$$ ---------------------------------
##NTUPLES= NMR FID
##VAR_NAME=  TIME,          FID/REAL,        FID/IMAG
##SYMBOL=    X,             R,               I
##VAR_TYPE=  INDEPENDENT,   DEPENDENT,       DEPENDENT
##VAR_FORM=  AFFN,          ASDF,            ASDF
##VAR_DIM=   8192,          8192,            8192
##UNITS=     SECONDS,       ARBITRARY UNITS, ARBITRARY UNITS
##FACTOR=    0.0002496,     1,               1
##FIRST=     0,             0,               0
##LAST=      2.0444736,     0,               0
##MIN=       0,             -535743,         0
##MAX=       2.0444736,     544866,          0
$$ Real data points
##PAGE= N=1
##DATA TABLE= (X++(R..R)), XYDATA
$$ plain form
0 0 0 0 0 0 0 0 0 0 0 5 -8 8 -8 15 -16 22 -23 31 -38 45 -53 67 -76 91 -105 127 -144 166 -192 220 -250 284
32 284 -324 366 -411 463 -521 581 -649 722 -804 894 -991 1095 -1210 1338 -1475 1625 -1790
49 -1790 1972 -2172 2393 -2640 2914 -3221 3570 -3969 4429 -4967 5606 -6379 7337 -8560
63 -8560 10183 -12442 15805 -21344 32048 -60098 285271 544866 -418330 -470048 307320 455480
75 455480 -226026 -359549 118459 282658 -14738 -157245 -96938 72632 186862 34097
85 34097 -251589 -109904 304322 186803 -338877 -204522 343612 208398 -324881 -179989
95 -179989 300180 139803 -260940 -67053 214977 -3633 -153730 68507 107586 -119923
105 -119923 -73546 162601 43984 -186555 -24283 169264 11234 -135831 -16845 79557
$$ packed form
0@%%%%%%%%%Nj3J6j6K3l1L8m5N4o9Q3r8J20j43J67j96K32k71L10l58M12m70N34
32B84o08O90p77Q74r84J102j230J371j526J698j885K086k305K548k813L100l415
49a790L762m144M565n033N554o135O791p539Q398r396J0573j1985J3716j5897
63h560J8743k2625K8247l7149N3392r2146L45369K59595r63196n1718P77368J48160
75D55480o81506j33523M78008J64199k97396j42507O0307J69570J14230j52765
85C4097k85686J41685M14226j17519n25680J34355N48134j35214n33279J44892
95a79989M80169j60377m00743J93887K82030k18610j50097K22237L9079k27509
105a19923M6377K36147j18617k30539J62272J93547j58030j47065J18986R6402
$$ plain form
115 79557 8135 -12313 -6781 -81392 -1150 167780 -4994 -253483 -8221 313355 24127
126 24127 -371314 -51073 388666 64387 -376952 -101516 334017 129090 -279045 -155753
136 -155753 198007 163806 -104532 -176948 485 180423 87999 -171761 -170214 147456 241121
147 241121 -124641 -289909 102941 310009 -69016 -303084 36354 288121 -6224 -242765
157 -242765 -12233 192244 36549 -128291 -49657 77139 58692 -19313 -50722 -26594 53976
168 53976 65896 -48095 -75093 47317 83019 -36904 -73075 44708 60080 -46841 -27436
179 -27436 57932 3120 -59755 22670 76390 -38715 -90520 56339 102772 -57665 -106120
190 -106120 47048 112760 -27552 -113228 7214 102891 22368 -84126 -57874 63447 86905
$$ packed form
115G9557p1422k0448N532p4611Q0242J68930j72774k48489K45262L21576k89228
126B4127l95441L20241M39739l24279m41339K75436M35533k04927m08135J23292
136a55753L53760l4201k68338p2416J77433J79938r2424k59760J547L17670R3665
147B41121l65762j65268L92850K07068l79025k34068L39438K51767k94345k36541
157b42765K30532K04477j55695j64840P8634J26796j8447p8005l1409K4128Q0570
168E3976J1920j13991k6998J22410L5702j19923l6171J17783J5372j06921J9405
179b7436Q5368n4812o2875Q2425N3720j15105n1805J46859M6433j60437m8455
190a06120J53168O5712j40312q5676J20442R5677q0523j06494K6252J21321K3458
$$ plain form
201 86905 -41176 -109449 7000 123650 22977 -138800 -53744 135280 72168 -125043 -97880
212 -97880 102470 110448 -86322 -118737 52601 110998 -24422 -110263 -9324 95560 27920
223 27920 -81428 -51781 54926 67936 -39500 -78445 20174 73456 -3789 -71836 -14404
234 -14404 64780 19574 -55726 -23021 40116 26796 -27148 -25199 22155 20598 -11593 -10586 5180
247 5180 9592 -360 -4793 8043 2784 -7104 3961 12697 3851 -13613 -4308 23935 11265 -22809
261 -22809 -10873 22576 23379 -16360 -29160 18773 34152 -8495 -30705 1122 38052 8794
273 8794 -34747 -11260 30903 20818 -21364 -28255 18091 32558 -12407 -31190 2703 31215
285 31215 5780 -32993 -10341 28043 12514 -21431 -21257 13866 20705 -15152 -20668 6074 14758
$$ packed form
201H6905j28081o8273J16449J16650j00673j61777Q5056J89024o3112j97211K7163
212i7880K00350P978j96770l2415J71338N8397j35420q5841J00939J04884o7640
223B7920j09348K9647J06707J3010j07436l8945R8619N3282p7245o8047N7432
234a4404P9184m5206p5300L2705O3137j3320n3944J949M7354j557l2191J007J5766
247E180M412r952m433J2836n259r888J1065Q736q846j7464R305K8243j2670l4074
261b2809J1936L3449Q03l9739j2800M7933J5379m2647k2210L1827L6930k9258
273H794m3541K3487M2163j0085m2182o891M6346J4467m4965j8783L3893K8512
285C1215k5435l8773K2652L8384j5529l3945J74L5123O839l5857n516K6742Q684
$$ plain form
298 14758 -2140 -18793 -4347 13073 788 -11129 -6223 3087 7118 -6281 -9344 2711 1544
311 1544 -2164 -4682 -3261 4274 -1214 -4453 668 -1236 284 -1516 -2672 2716 -2225 -2334 3119
326 3119 -729 -1364 240 592 3147 -1485 -1471 4820 271 -895 570 2731 4409 -2349 -548 7001
342 7001 2187 -946 918 2443 5169 -1450 -1301 5700 1662 529 17 2444 5679 -819 -1776 4346
358 4346 2463 929 -1394 -1057 6392 824 -2900 228 2115 3213 -2427 -3824 6610 1877 -3180
373 -3180 -1930 1638 5291 -3477 -6475 4493 3708 -3915 -6054 -327 7262 -1915 -10452 746 4870
388 4870 -417 -6628 -5215 5251 3176 -8021 -4480 642 4741 -1561 -9444 -659 4724 433 -4958
403 -4958 -7059 3633 6360 -4557 -6224 609 3733 4164 -6025 -4251 4475 3925 23 -7460 -3789
$$ packed form
298A4758j6898j6653J4446J7420j2285j1917M906R310M031j3399l063J2055j167
311A544l708k518J421P535n488l239N121j904J520j800j156N388m941j09N453
326C119l848o35J604L52K555m632J4O291m549j166J465K161J678o758J801P549
342G001m814l133J864J525K726o619J49P001m038j133n12K427L235o498r57O122
358D346j883j534k323L37P449n568l724L128J887J098n640j397J0434m733n057
373c180J250L568L653q768k998J0968p85p623k139N727P589r177q537J1198M124
388D870n287o211J413J0466k075j1197L541N122M099o302p883Q785N383m291n391
403d958k101J0692K727j0917j667O833L124M31j0189J774Q726n50l902p483L671
$$ plain form
418 -3789 8591 4140 -5394 -6611 2806 12454 -488 -11994 157 12105 7502 -9291 -10396 11501
432 11501 15002 -4774 -14069 557 20932 7930 -19784 -8519 19580 15915 -11832 -18853 12624
445 12624 24250 -5734 -19304 519 20522 9458 -17572 -9750 14047 12932 -3917 -15845
457 -15845 -932 18041 5757 -14198 -9879 10133 16083 -7681 -15441 3824 12079 1426 -10150
470 -10150 -6446 6025 6193 1441 -6765 -12966 3913 19019 -3570 -25699 -5529 29756 10952
483 10952 -35627 -19072 30391 22232 -24224 -30812 13641 33253 -5092 -35300 -11040 29628
495 29628 26073 -28281 -41502 18579 51530 -7144 -62657 -5964 70218 16052 -69850 -25677
507 -25677 62002 37232 -52241 -44413 40685 45420 -23049 -42495 3511 41855 14857 -33160
$$ packed form
418c789J2380m451r534j217R417R648j2942j1506J2151J1948m603j6793j105K1897
432A1501L501j9776r295J4626K0375j3002k7714J1265K8099l665k7747p021L1477
445A2624J1626k9984j3570J9823K0003j1064k7030P822K3797j115j6849j1928
457a5845J4913J8973j2284j9955M319K0012N950k3764p760J9265Q255j0653j1576
470a0150L704J2471J68m752q206o201J6879J5106k2589k2129K0170L5285j8804
483A0952m6579J6555M9463q159m6456o588M4453J9612l8345l0208K4260M0668
495B9628l555n4354j3221O0081L2951n8674n5513N6693P6182n4166q5902M4173
507b5677Q7679k4770q9473P828Q5098M735o8469j9446M6006L8344k6998m8017
$$ plain form
519 -33160 -26284 24633 43616 -11406 -51772 4577 57754 4571 -54172 -9821 53647 15961
531 15961 -43888 -10564 34648 7716 -17644 267 6935 -7570 4348 21836 -12879 -29275
543 -29275 18807 35393 -17340 -38239 12686 39188 -5560 -33247 -2516 19385 14191 -3669
555 -3669 -26887 -15313 35940 36116 -42829 -59252 45686 77559 -48875 -91622 39727 97121
567 97121 -28820 -103079 12428 95083 714 -82393 -23091 62518 40120 -41523 -55885 12660
579 12660 63521 16394 -72983 -44226 76930 63429 -74177 -81824 66287 91608 -60300
590 -60300 -94122 47962 85162 -32877 -71321 15960 56937 -3275 -35470 -7043 13011 17368
602 17368 7775 -23588 -22179 24433 33806 -23369 -38115 24058 38158 -23040 -26786 21878 12209
$$ packed form
519c3160O876N0917J8983n5022m0366N6349N3177n3183n8743M4351O3468l7686
531A5961n9849L3324M5212k6932k5360J7911O668j4505J1918J7488l4715j6396
543b9275M8082J6586n2733k0899N0925K6502m4748k7687L0731K1901n194j7860
555c669k3218J1574N1253J76p8945j6423J04938L1873j26434m2747J31349N7394
567I7121j25941p4259J15507Q2655r4369q3107N9302Q5609k2398q1643j4362O8545
579A2660N0861m7127q9377K8757J21156j3501j37606p647J48111K5321j51908
590f0300l3822J42084L7200j18039l8444Q7281M0977o0212l2195K8427K0054M357
602A7368r593l1363J409M6612R373n7175j4746O2173J4100o1198l746M8664r669
$$ plain form
615 12209 -18103 4084 20423 -23205 -20856 43905 26041 -56957 -28892 67982 39235 -68591
627 -68591 -46231 67929 52695 -52606 -52600 34632 57156 -10540 -53845 -13817 48154 41811 -36936
640 -36936 -68852 26222 90526 -13483 -104021 -5111 111747 21565 -114776 -35504 106463
651 106463 46658 -90285 -58649 68751 64854 -47438 -65947 19285 60563 6049 -57119
662 -57119 -31805 46929 47384 -36610 -64159 23304 69779 -16642 -73088 6267 61305 -206
674 -206 -55112 -4182 41313 3058 -27826 -1474 13950 -836 -4565 5567 -1058 -11820 5113
687 5113 16195 -5399 -17718 -850 17066 8810 -15516 -15579 9494 27413 3009 -35825 -13159
700 -13159 45647 26860 -45821 -37225 44707 50816 -37976 -58860 30152 65995 -13845 -67112
$$ packed form
615A2209l0312K2187J6339m3628K349O4761j7864q2998K8065R6874k8747j07826
627f8591K2360J14160j5234j05301OQ7232K2524o7696m3305M0028O1971o343p8747
640c6936l1916R5074O4304j04009r0538R8910J16858r0182j36341P9272J41967
651A06463n9805j36943L1636J27400l897j12292j8509Q5232M1278n4514o3168
662e7119K5314P8734M55q3994k7549Q7463M6475q6421n6446P9355N5038o1511
674b06n4906N0930M5495l8255l0884K6352J5424j4786l729J0132o625j0762J6933
687E113J1082k1594j2319J6868J7916q256k4326o3K5073J7919k4404l8834K2666
700a3159N8806j8787p2681Q596Q1932O109q8792k0884Q9012L5843p9840n3267
$$ plain form
712 -67112 -1507 68350 19414 -61528 -35140 52305 50348 -37196 -62686 24019 70685 -10000
724 -10000 -70342 -7615 70316 22203 -64202 -30626 55770 41379 -41287 -49075 27596 49344
736 49344 -14637 -46304 -531 41872 11207 -39005 -20247 30904 21514 -22810 -26324 15105
748 15105 24046 -12806 -21465 9349 13808 -4999 -9767 5627 5287 -8621 -2488 9010 -3107
761 -3107 -11605 -1133 12892 3206 -15950 -7518 14326 11412 -12532 -19167 8924 26816 -4867
774 -4867 -31584 -3195 32768 9611 -37965 -17972 36797 23330 -33839 -29096 26355 36155 -20084
787 -20084 -35691 12502 37947 -641 -34718 -7325 32691 18128 -25946 -23734 20356 31678
799 31678 -12927 -34495 7643 36674 -1967 -31733 -5291 32654 10637 -26660 -11882 21859
$$ packed form
712f7112O5605O9857m8936q0942K6388Q7445j957q7544k5490Q6705M6666q0685
724a0000o0342O2727P7931m8113q6405L3576Q6396j4391q2666p788P6671K1748
736D9344o3981l1667M5773M2403l0665n0212J8758N1151r390m4324l514M1429
748A5105Q941l6852q659L0814M459j8807m768J5394l40j3908O133J1498j2117
761c107q498J0472J4025r686j9156Q432K1844k914k3944o635K8091J7892l1683
774d867k6717K8389L5963k3157m7576J9993N4769j3467n7169M743N5451R800n6239
787b0084j5607M8193K5445l8588l4077K7393M0016j4563m4074K212M4090J1322
799C1678m4605k1568M2138K9031l8641k9766K6442L7945k2017l7297J4778L3741
$$ plain form
811 21859 13826 -14779 -15151 10805 13015 -5575 -11279 1211 9662 2398 -10427 -2185 7321 3427
825 3427 -7455 -4709 7318 3772 -7041 -4567 6945 2 -8780 -1002 9691 1075 -11887 -2412
839 -2412 9826 344 -9184 -5003 9634 5471 -11089 -5584 8024 7538 -5760 -10745 2100 11680
853 11680 -2859 -10744 -2894 10808 6709 -11567 -7962 10166 6859 -7628 -10143 5541 10006
866 10006 -4109 -11416 2909 10117 1068 -8288 -2200 9563 2037 -7126 -3599 5496 6080 -3577
880 -3577 -5961 3855 5849 -1207 -5017 944 6967 1137 -3730 2225 4040 1664 -2741 -1522 3628
895 3628 2218 -2253 -32 1475 1125 -29 -2110 1317 1663 -965 -1262 674 1190 -84 -1974 2544
911 2544 642 -2070 85 -801 -357 -2150 -2728 145 330 -1466 -331 74 842 -95 -2136 -440 44
$$ packed form
811B1859q033k8605l72K5956K210j8590n704J2490Q451p264j2825Q242R506l894
825C427j0882K746J2027l546j0813K474J1512o943q782P778J0693q616j2962R475
839b412J2238r482r528M181J4637m163j6560N505J3608m86j3298m985J2845R580
853A1680j4539p885P850J3702m099j8276L605J8128l307j4487k515J5684M465
866A0006j4115p307J4325P208r049r356O088J1763p526r163L527R095N84r657
880c577k384R816J994p056l810N961O023n830m867N955J815k376m405J219N150
895C628j410m471K221J507l50j154k081L427L46k628k97J936N16j274j890M518
911B544j902k712K155q86M44j793n78K873J85j796J135M05P68r37k041J696M84
$$ plain form
928 44 -603 -1802 -2394 594 397 -2266 -1221 -167 -114 -477 -1319 -168 315 -1226 736 -714 -905 113
946 113 -542 786 -1323 -1370 1352 -6 -1351 -1099 463 2748 -1321 -2588 1099 2725 794 -1888
962 -1888 -746 3522 2182 -1723 -2413 3516 4825 1282 -4736 980 6103 1537 -3743 -2344 4466
977 4466 4324 -2178 -3962 3152 4859 724 -4336 -1384 5538 2527 -3712 -2959 2660 5912 -1180 -5762
993 -5762 538 4043 2221 -3050 -3946 3950 4429 -468 -5057 -2601 4728 2789 -4863 -5002 1656 4796
1009 4796 614 -7330 -1586 5498 2890 -3999 -6987 2427 7344 -2843 -8840 -1820 7384 5292 -8306
1024 -8306 -6940 6468 7815 -3282 -11289 2042 11728 636 -9961 -4425 6427 6285 -5236
1037 -5236 -10001 1892 8399 2602 -9667 -6431 7350 8177 -7461 -8989 3981 11555 581 -10892
$$ packed form
928D4o47j199n92K988j97k663J045J054N3l63q42J151M83j541J962j450j91J018
946A13o55J328k109m7K722j358j345K52J562K285m069j267L687J626j931k682
962a888J142M268j340l905o90N929J309l543o018N716N123m566n280J399O810
977D466j42o502j784P114J707m135n060K952O922l011o239P53N619L252p092m582
993e762O300L505j822n271q96P896M79m897m589K456P329j939p652j39O658L140
1009D796m182p944N744P084k608o889k988R414M917j0187n997P020R204k092j3598
1024h306J366J3408J347j1097q007J3331R686j1092j0597N536J0852j42j1521
1037e236m765J1893O507n797j2269L236J3781Q27j5638j528J2970P574j0974j1473
$$ plain form
1051 -10892 -1501 9426 4641 -3693 -7177 1436 10199 3586 -6963 -8145 7556 13730 -3680 -14428
1065 -14428 2613 17313 3937 -17741 -5748 16738 9873 -9774 -11594 5827 16614 458
1077 458 -15231 -5837 13688 14066 -11892 -19900 9329 24133 -5913 -26095 -818 28523 5817
1090 5817 -25105 -8340 21034 12023 -15784 -16165 9274 16465 -2238 -16233 -7126 12947 14321
1103 14321 -12241 -19781 6857 20578 -3262 -22542 -1451 20435 2606 -17964 -6557 10654
1115 10654 6275 -6021 -6531 635 2292 6795 390 -11617 -4357 13270 8576 -13480 -13991 13466
1129 13466 16380 -10941 -17146 4166 16164 2499 -14579 -8084 9987 16499 -3426 -20959 -3686
1142 -3686 26591 11189 -27375 -19027 27065 27293 -24639 -31349 21462 34838 -12665 -36107 4312
$$ packed form
1051a0892R391J0927m785q334l484Q613Q763o613j0549j182J5701O174j7410j0748
1065a4428J7041J4700j3376k1678J1993K2486o865j9647j820J7421J0787j6156
1077D58j5689R394J9525L78k5958q008K9229J4804l0046k0182K5277K9341k2706
1090E817l0922J6765K9374r011k7807l81K5439P191j8703j3995R107K0073J374
1103A4321k6562p540K6638J3721k3840j9280K1091K1886j7829k0570J1407J7211
1115A0654m379j2296n10P166J657M503o405j2007P260J7627m694k2056n11K7457
1129A3466K914k7321o205K1312J1998j3665j7078O495J8071O512j9925j7533J7273
1142c686L0277j5402l8564Q348M6092K28n1932o710N2811J3376m7503k3442M0419
$$ plain form
1155 4312 35002 6110 -28188 -13258 22480 22699 -13431 -28317 5505 31026 4585 -32407
1167 -32407 -12493 32411 18032 -28245 -23017 23063 26809 -15086 -28800 9785 24583 -4834
1179 -4834 -20701 -2275 14925 6719 -6662 -8505 249 9134 5436 -8022 -10253 5884 10401
1192 10401 -2394 -11440 -1444 9217 2314 -4488 -6052 -1764 7461 7313 -6498 -15178 2094 20427
1206 20427 2338 -26350 -6937 28176 11726 -27962 -21081 26125 25480 -22134 -29679 13921 31557
1219 31557 -5446 -33959 -4776 31121 13285 -25505 -22976 19804 30974 -10765 -34778 3091
1231 3091 40092 8058 -38710 -14084 36311 22391 -30771 -25640 25936 28963 -17423 -27599
1243 -27599 10972 26432 -2005 -21054 -4427 16928 9243 -10982 -13035 3681 14965 2208
$$ packed form
1155D312L0690k8892l4298J4930L5738K19l6130j4886L3822K5521k6441l6992
1167c2407J9914M4904j4379m6277N228M6080L746m1895j3714L8585J4798k9417
1179d834j5867J8426J7200q206j3381j843Q754Q885l698j3458k231J6137M517
1192A0401j2795r046R996J0661o903o802j564M288R225j48j3811q680J7272J8333
1206B0427j8089k8688J9413L5113j6450l9688O881M7206o45m7614p545M3600J7636
1219C1557l7003k8513K9183L5897j7836l8790K529M2780J1170m1739k4013L7869
1231C091L7001l2034m6768K4626N0395j3920n3162N131N1576L027m6386j0176
1243b7599L8571J5460k8437j9049J6627K1355p685k0225k053J6716J1284j2757
$$ plain form
1255 2208 -16144 -3836 14461 6498 -12008 -7304 11374 5005 -7468 -1229 6181 -2052 -3019 6272
1269 6272 2415 -11900 -4401 16520 6132 -18992 -6865 18880 9424 -19152 -13418 15217 15441
1282 15441 -8627 -15889 2376 17600 4842 -18363 -13487 14245 21599 -12753 -30066 7529
1294 7529 31873 -4883 -35839 -2749 34830 6663 -34688 -12441 31474 14530 -24068 -17740
1306 -17740 18146 20449 -9884 -18818 -80 17042 7935 -15470 -13924 15725 16224 -11649 -21025
1319 -21025 7784 22956 -7205 -21925 5982 19037 -1876 -15101 2187 13427 -2348 -7683
1331 -7683 3869 5435 -949 -541 3124 199 -2914 2764 3047 -2081 -2435 138 967 2609 -503 -2756
1347 -2756 -1258 6381 6668 -9043 -9007 10613 12325 -11707 -12287 10067 16997 -8922 -17243 6906
$$ packed form
1255B208j8352J2308J8297p963j8506M704J8678o369j2473O239P410q233r67R291
1269F272l857j4315P499K0921j0388k5124J2127K5745r456k8576N734K8635K24
1282A5441k4068p262J8265J5224j2758k3205M876K7732P354l4352j7313L7595
1294G529K4344l6756l0956L3090L7579k8167m1351K2247M3915j6944l8598O328
1306a7740L5886K303l0333q934J8738J7122r107k3405J546K9649M99k7873r376
1319b1025K8809J5172l0161j4720K7907J3055k0913j3225J7288J1240j5775n335
1331g683J1552J566o384M08L665k925l113N678K83n128l54K573Q29J642l112k253
1347b756J498P639K87j5711L6J9620J712k4032n80K2354O930k5919q321K4149
$$ plain form
1361 6906 15798 -2669 -16453 -1224 14433 5112 -12684 -8977 7694 12845 -5724 -13507 1260
1374 1260 15201 1116 -15058 -3919 14986 7758 -15942 -8480 12654 9939 -10000 -11386 7890
1387 7890 10235 -6257 -10667 1923 8297 -149 -7210 -519 4997 2826 -4080 -4520 3119 5281 -3215
1402 -3215 -4272 2616 4385 -1963 -3132 2122 3880 -2226 -4132 2079 2084 -1480 -2567 2678 3668 -2542
1418 -2542 -3509 1616 2764 -280 -3984 1126 5779 1402 -3472 -1542 4487 2376 -3828 -2967 4816
1433 4816 4018 -1880 -4035 2299 5849 -925 -4913 959 5770 128 -3807 -1103 5782 2642 -3555
1448 -3555 -1577 3700 3478 -2257 -3655 867 5045 1129 -3606 -1195 3873 1047 -4286 -1141 3209
1463 3209 1535 -2626 -2465 610 1317 -1496 -243 -1269 518 -295 -1266 -120 2293 -1172 714 -1375
$$ packed form
1361F906Q892j8467j3784J5229J5657r321j7796L707J6671N151j8569p783J4767
1374A260J3941j4085j6174J1139J8905p228k3700P462K1134k715j9939j386J9276
1387G890K345j6492m410J2590O374q446p061O691N516k171o906m40P639K162q496
1402c215j057O888J769o348j169N254J758o106j906O211Nl564j087N245R90o210
1418b542r67N125J148l044l704N110M653m377m874J930O029k111o204Q61P783
1433D816p98n898k155O334L550o774l988N872M811n642l935K704O885l140o197
1448c555J978N277k22n735j398M522M178l916m735K411N068k826n333L145M350
1463C209j674m161J61L075P07k813J253j026J787q13r71J146K413l465J886k089
$$ plain form
1479 -1375 863 1067 -1768 -597 393 263 1041 -94 1416 484 -1166 387 1210 -1112 -627 1227 1245
1496 1245 -243 -226 1783 1543 -271 -142 -20 1451 886 -949 639 1042 1064 414 -380 808 2011 -257
1514 -257 511 628 480 595 -400 167 -119 -591 -376 2029 -260 -811 1384 1860 -547 -1624 1788 2778
1532 2778 -362 -504 763 1629 1435 -2564 -707 2059 2439 -549 -3511 924 3313 -257 -3385 -1963
1548 -1963 3374 3209 -4159 -4099 1973 2798 -2214 -4174 145 4414 909 -4216 -2113 3183 2677 -3495
1564 -3495 -3287 1883 3317 -637 -4556 -1725 4168 1184 -4375 -906 3153 2199 -1106 -3679 -467
1579 -467 2957 315 -2035 -2849 1543 2773 -1031 -2801 -392 2023 2993 -1339 -1451 889 3266 3439
1595 3439 -2984 -1714 3578 2325 -1738 -4363 -498 6341 1343 -5873 -1753 5024 5857 -3940 -5043
$$ packed form
1479a375K238K04k835J171R90j30P78j135J510r32j650J553Q23k322M85J854J8
1496A245j488J7K009k40j814J29J22J471n65j835J588M03K2o50p94J188J203k268
1514b57P68J17j48J15r95N67k86m72K15K405k289n51K195M76k407j077L412R90
1532B778l140j42J267Q66j94l999J857K766L80k988k962M435K389l570l128J422
1548a963N337j65p368O0O072Q25n012j960M319M269l505n125K103N296n06o172
1564c495K08N170J434l954l919K831N893k984n559L469M059r54l305k573L212
1579d67L424k642k350q14M392J230l804j770K409K415R70m332j12K340K377J73
1595C439o423J270N292j253m063k625L865O839m998p216M120O777Q33r797j103
$$ plain form
1610 -5043 3781 6271 -751 -6405 -387 6869 2120 -4484 -3554 3650 5984 -622 -7070 -1402 9314
1625 9314 2797 -7325 -5701 6549 7030 -5809 -7172 3851 7198 -1537 -6657 -1569 4705 2865
1639 2865 -3833 -6159 473 5991 1203 -5836 -5563 6704 7092 -5522 -9315 3857 8388 -1282 -7714
1654 -7714 -1413 6682 2944 -5685 -5399 1537 6610 670 -6958 -5436 7996 8626 -5159 -12203 5046
1669 5046 12826 -3460 -12644 810 10990 1540 -9541 -4458 7646 6274 -2622 -6631 -1506 8409
1683 8409 4729 -6996 -7550 6641 10590 -2656 -12041 1237 12194 323 -10786 -2721 9217
1696 9217 3262 -6973 -3312 2210 4705 1234 -4402 -4930 792 7286 545 -11556 -631 12235
1710 12235 4150 -9977 -4807 9310 8602 -7088 -7325 3513 8214 289 -8001 -6569 4285 9910
$$ packed form
1610e043Q824K490p022n654O018P256m749o604R30P204K334o606o448N668J0716
1625I314o517j0122J624J2250M81j2839j363J1023L347q735n120N088O274j840
1639B865o698k326O632N518m788p039K73J2267L88j2614l793J3172M531r670o432
1654g714O301Q095l738q629K86O936N073n940p628J522J3432O30j3785p044J7249
1669E046P780j6286r184J3454J0180r450j1081N083J2104j372q896m009N125R915
1683H409l680j1725n54J4191L949j3246r385J3278J0957j1871j1109Q065J1938
1696I217n955j0235L661N522K495l471n636n28N722O494o741j2101J0925J2866
1710A2235q085j4127N170J4117p08j5690k37J0838M701p925q290J432J0854N625
$$ plain form
1724 9910 -1711 -13943 -3008 15286 4371 -15804 -7957 15368 11821 -13692 -13170 10852 13479
1737 13479 -8197 -13658 994 12963 2771 -10355 -7222 4725 10598 -2663 -14064 -1618
1749 -1618 15008 3640 -15203 -9898 15272 10790 -14664 -10926 10311 9987 -6263 -9744 2800
1762 2800 7874 -1098 -3918 -2335 -190 5708 3007 -5722 -4129 5343 7689 -3620 -9421 3031
1776 3031 9715 -117 -6436 -1834 5755 2824 -2782 -2646 -2674 5117 7974 -3807 -9500 3171 15416
1791 15416 -673 -18128 -436 18089 3660 -17147 -5629 15271 8299 -11705 -11639 7441 11555
1804 11555 -479 -12076 -3135 9339 8812 -9897 -13235 6720 17994 -5703 -20287 3003 21240
1817 21240 1569 -19099 -2892 17194 4033 -14303 -6500 9900 6388 -5522 -6863 555 6371
$$ packed form
1724I910j1621j2232J0935J8294j0915k0175P847K3325l547k5513N22K4022K627
1737A3479k1676n461J4652J1969j0192j3126L133J1947N873j3261j1401J2446
1749a618J6626j1368j8843N305K5170m482k5454L738K1237l24j6250l481J2544
1762B800N074q972k820J583K145N898k701q729J593R472K346j1309n801J2452
1776C031O684r832o319M602P589k931n606J36k8P791K857j1781n693J2671J2245
1791A5416j6089j7455J7692J8525j4429k0807J1518K0900o972k0004O6J9080M114
1804A1555j2034j1597Q941J2474n27j8709l338J9955J1274k3697j4584K3290J8237
1817B1240j9671k0668J6207K0086j3161j8336P803J6400l512j1910j341P418N816
$$ plain form
1830 6371 3801 -4448 -8185 3820 7268 -2295 -9965 1521 8878 -1404 -7280 1534 6088 -1078
1844 -1078 -2235 328 1249 -2297 1842 3693 -2963 -6586 5215 7801 -4370 -7876 4554 9023
1858 9023 -3115 -10373 640 8035 2329 -4372 -4957 4530 9165 -1192 -9983 -2133 11027 6327
1872 6327 -12656 -8210 12527 12442 -11593 -12557 10036 14830 -7170 -13439 2578 13363 -61 -11589
1886 -11589 -1672 9749 5879 -6646 -7689 3653 9961 -979 -9051 1320 10572 2339 -11028
1899 -11028 -5074 10611 5565 -7744 -3942 5853 3955 -4719 -3871 3147 2275 -2014 -227 -632 2
1914 2 -11 -744 132 -395 920 322 -675 1132 -960 -2319 1135 2799 -1697 -3377 -695 5366 -776
1931 -776 -6487 205 6905 1882 -7128 -2215 7869 2941 -7613 -1877 6014 6008 -3437 -7252 2074
$$ packed form
1830F371k570q249l737J2005L448r563p670J1486P357j0282n876Q814M554p166
1844a078j157K563R21l546M139J851o656l623J1801K586j2171l506J2430M469
1858I023j2138p258J1013P395n706o701n85R487M635j0357q791P850J3160m700
1872F327j8983M446K0737q5k4035r64K2593M794k2000o269J6017J0785j3424j1528
1886a1589R917J1421l870j2525j043J1342O308j0940q072J0371R252q233j3367
1899a1028N954J5685n046j3309L802R795j898q674Q48P018q72m289J787m05O34
1914Bj3p33Q76n27J315n98r97J807k092j359L454J664m496j680K682O061o142
1931g76n711O692O700n023r010M913J0084m928j0554N736P891or445l815R326
$$ plain form
1946 2074 6745 -821 -7153 -1211 6908 3669 -5573 -5138 6491 6204 -3920 -6789 2756 7913 -2728
1961 -2728 -6371 1318 6174 1303 -6047 -1627 5109 2915 -2819 -1902 2078 4375 -2254 -3191 574
1976 574 5315 240 -4273 -443 4069 1326 -3782 -790 2568 441 -2374 38 3159 -176 -1999
1991 -1999 -185 1701 -445 -923 -185 2076 435 -2781 -295 1226 2744 -1868 -3570 1372 2438
2006 2438 -1468 -2492 -124 3087 71 -2674 -1062 2120 1185 -2560 -1373 3155 851 -2214 -2608
2021 -2608 588 2971 -1609 -2094 834 2553 388 -2292 -1883 2530 1181 -3258 -995 3090 2963 -751
2037 -751 -2391 2050 2265 -502 -1986 782 1403 795 -1102 -950 1868 820 -623 -658 -123 -192 -428 -1345
2055 -1345 476 -508 -141 -1138 -572 853 -723 140 289 466 1052 -297 406 1308 -436 -787 351 183
$$ packed form
1946B074M671p566o332N942Q119l239r242M35J1629k87j0124k869R545N157j0641
1961b728l643P689M856m871p350M420O736k194n734R17L980K297o629r37L765
1976E74M741n075m513L830M512k743n108K992L358k127k815K412L121l335j823
1991a999J814J886k146m78P38K261j641l216K486J521J518m612j702M942J066
2006B438l906j024K368L211l016k745J612L182r35l745J187M528k304l065l94
2021b608L196K383m580m85K928J719k165k680M09M413j349m439K263M085j27l714
2037g51j640M441K15k767j484K768O21o08j897J52K818j048j443l5N35o9k36r17
2055a345J821r84L67r97N66J425j576Q63J49J77N86j349P03R02j744l51J138j68
$$ plain form
2073 183 -648 64 446 -231 -1036 -749 482 772 -298 -981 -625 575 910 -562 -1373 -260 1222 -559
2091 -559 -2058 444 837 -116 -1734 -774 -138 659 -821 -376 -212 195 -490 -668 -765 352 1789 -22
2109 -22 -1179 19 2158 29 -1668 -811 521 1609 -1107 -1829 844 1353 304 -1441 -639 1435
2125 1435 1528 -563 -1921 -95 3635 862 -1941 -606 2840 2115 -2180 -956 3170 1649 -1324 -2552
2141 -2552 661 3367 926 -2502 -118 2000 1238 -983 -2084 253 3146 179 -1816 -20 1710
2156 1710 1080 -1246 -1386 353 301 -88 -822 -470 1060 1340 -444 -1937 1143 2407 570 -1978 -1138
2173 -1138 1292 2791 -439 -3137 556 2321 337 -1812 -2058 1165 2488 -848 -3098 -1129 4367
2188 4367 1839 -4468 -2138 2961 2128 -1512 -2732 1443 3506 -830 -3537 -2616 4254 2517 -2907
$$ packed form
2073A83q31P12L82o77q05K87J231K90j070o83L56J200L35j472q11J113J482j781
2091e59j499K502L93r53j618R60O36P97j480M45J64M07o85j78r7J117J437j811
2109b2j157J198K139k129j697Q57J332J088k716p22K673N09j049j745Q02K074
2125A435R3k091j358J826L730k773k803J335L446p25m295J224M126j521k973j228
2141b552L213K706k441l428K384K118p62k221j101K337K893k967j995J796J730
2156A710o30k326j40J739n2l89p34L52J530K80j784j493L080J264j837k548Q40
2173a138K430J499l230k698L693J765j984k149k46L223J323l336k250J969N496
2188D367k528o307K330N099q33l640j220M175K063m336k707R21O870j737n424
$$ plain form
2203 -2907 -2978 1080 4558 -1781 -4127 -167 5163 1297 -4339 -4429 4433 4806 -2002 -3638 1629 3820
2219 3820 1083 -3496 -1304 2877 2363 -1378 -2117 -426 4375 2056 -4837 -1666 3114 3848 -3031 -3441
2235 -3441 1326 4065 -478 -3462 -1358 2353 2052 -1481 -3866 583 4411 2108 -4730 -4994 4007
2250 4007 4246 -2681 -4791 1968 6719 -114 -6295 -845 4132 2819 -2401 -2656 2399 3763 22
2265 22 -4424 -3171 3531 3306 -3874 -5532 2089 6794 -2423 -7329 226 5719 1106 -5895 -1027 3562
2281 3562 3160 -1802 -2728 229 4101 3409 -1989 -4060 2922 5095 -265 -4244 -1338 6895 1528 -5768
2297 -5768 -1998 6561 4520 -3423 -2400 1239 4499 1953 -3050 -4167 2462 4659 -1090 -6854 -1120
2312 -1120 7702 2803 -7667 -3233 7317 4935 -5493 -4587 4647 4968 -1827 -5217 -1445 3754 3393
$$ packed form
2203b907p1M058L478o339k346L960N330l866n636r0Q862L73o808j636N267K191
2219C820k737m579K192M181n14l741p39J691M801k319o893L171M780P34o879m10
2235c441M767K739m543k984K104L711l01l533k385M449L828k303o838k64R001
2250D007K39o927k110O759M751o833o181N450M977j313n220k55N055J364l741
2265B2m446J253O702k25p180j658P621M705r217m906P555N493m613p001M868M589
2281C562m02m962r26K957L872o92n398k071O982K173n360l979K906Q233n367p296
2297e768L770Q559k041p943J023L639L260k546n003j117O629K197n749n764N734
2312a120Q822m899j0470M434J0550k382j0428R06R234L21o795l390L772N199l61
$$ plain form
2327 3393 -3155 -4123 2489 6920 -356 -6345 -1524 6972 3576 -6350 -3719 4275 4884 -4270 -3810 3230
2343 3230 3201 -360 -1756 -928 3055 2310 229 -2659 -3390 3445 2749 -3354 -3254 4135 5669 -2091 -4285
2360 -4285 1741 4139 5 -4461 -1979 2343 4141 888 -3453 -1585 3949 5033 -3858 -6611 4111
2375 4111 7158 -2215 -7709 189 7202 832 -6565 -2110 5309 3938 -3612 -4851 1330 3728 1309
2390 1309 -5336 -4082 5858 5063 -4545 -6102 3917 7370 -2442 -6369 2122 7475 -38 -5985 -1101
2405 -1101 4697 3493 -3258 -1194 2470 3732 1533 -2296 -1093 3305 2213 -1771 -3676 1318 3022
2420 3022 -279 -2412 902 2018 667 -481 -1154 587 -35 748 211 -1946 -844 2470 1589 -3341
2436 -3341 -2748 3990 1243 -2370 -4095 830 4115 -1846 -3474 -1292 3743 1748 -2285 -3123 1570
$$ packed form
2327C393o548r68O612M431p276n989M821Q496l396r926K631P994O09r154M60P040
2343C230k9l561j396Q28L983p45k081k888p31O835o96o103J00P389J534p760k194
2360d285O026K398m134m466K482M322J798l253m341J868N534J084q891k753J0722
2375D111L047r373n494P898P013o370p397M455P419j371p550j239O181K398k419
2390A309o645J254R940p95r608j557J0019L453r812l927Q491N353p513n947M884
2405a101N798j204o751K064L664J262k199l829J203M398j092l984j905M994J704
2420C022l301k133L314J116j351j148o73J741o22P83n37k157J102L314q81m930
2436c341N93O738k747l613j725M925L285n961j628K182N035j995m033q38M693
$$ plain form
2451 1570 4680 -1825 -5542 127 6335 1340 -5059 -2941 5335 3103 -3904 -3961 2556 4299 -2630
2466 -2630 -4841 -955 4493 738 -3927 -2447 4020 2807 -2834 -4098 1880 3181 -220 -3082 464
2481 464 3535 416 -3054 -1009 2623 1531 -475 -1155 538 1651 -117 -564 886 1095 -1165 880
2497 880 22 1237 -1311 -738 1347 -403 181 179 1888 554 -769 595 643 1717 -1681 -2290 1721
2514 1721 2033 240 -2325 1756 2467 586 -1778 -1506 4196 1148 -1932 -3287 2019 3679 -2037 -3268
2530 -3268 1991 3211 -346 -4133 46 2360 514 -2756 -1081 2494 1788 -1561 -1461 -81 3296
2545 3296 -1199 -2813 -1394 2848 232 -3541 -1479 1490 1127 -1478 -832 1970 248 -1858 -701
2560 -701 622 1098 -487 -1150 1010 831 -382 -1219 195 1171 -33 -708 -25 981 221 -574 1225
$$ packed form
2451A570L110o505l717N669O208m995o399K118Q276k232p007n7O517J743o929
2466b630k211L886N448l755m665J480O467j213n641j264N978J301l401k862L546
2481D64L071l119l470K045L632j092k006o80J693J113j768m47J450K09k260K045
2497H80q58J215k548N73K085j750N84kJ709j334j323J364M8J074l398o09M011
2514A721L12j793k565M081P11j881k364K72N702l048l080j355N306J660n716j231
2530c268N259J220l557l787M179K314j846l270J675L575p06l349J00J380L377
2545C296m495j614J419M242k616l773K062K969l63k605O46K802j722k106J157
2560g01J323M76j585o63K160j79j213q37J414R76j204o75O83J006p60p95J799
$$ plain form
2577 1225 -203 -817 -726 542 1651 1046 -557 -42 1219 170 -671 -1241 853 1751 -1085 -1286 1529
2594 1529 1535 755 -1293 294 1291 30 -1586 -121 726 1535 -1487 -1342 1128 2261 -325 -1868 -212
2611 -212 2171 373 -1023 -172 -317 1846 -702 -772 349 781 -1268 -575 1177 643 -850 -815 130 -8
2629 -8 184 137 -2074 172 592 -1183 -558 -375 1289 426 257 734 -792 606 352 -729 -595 1218
2647 1218 -629 2289 534 -908 692 702 308 -1027 237 83 -1309 -836 -587 1625 2617 -87 -619
2664 -619 1145 770 292 -459 -673 661 1192 -542 -707 159 224 -289 -994 1282 538 -1066 830 124
2682 124 443 892 615 -1186 170 961 772 -986 -1328 1499 726 -857 -1461 932 953 621 127 -336
2700 -336 1436 615 -556 -1122 713 2372 1150 -1647 -1178 1174 1446 -295 -1435 887 2401 548
$$ packed form
2577A225j428o14R1J268J109o05j603N15J261j049q41n70K094Q98k836k01K815
2594A529Op80k048J587R97j261j616J465Q47Q09l022J45K470J133k586j543J656
2611b12K383j798j396Q51j45K163k548p0J121M32k049O93J752n34j493L5R45j38
2629hJ92m7k211K246M20j775O25J83J664q63j69M77j526J398k54j081J34J813
2647A218j847K918j755j442J600J0l94j335J264j54j392M73K49K212R92k704n32
2664f19J764l75m78p51k14J334N31j734j65Q66O5n13p05K276p44j604J896p06
2682A24L19M49k77j801J356P91j89j758l42K827p73j583o04K393K1l32m94m63
2700c36J772q21j171n66J835J659j222k797M69K352K72j741j140K322J514j853
$$ plain form
2716 548 -1047 296 659 1552 -1074 -794 491 1898 -1229 -1042 -1577 280 677 -762 -1586 1358 1389
2733 1389 402 -2628 -540 845 -132 -203 -1526 1315 742 100 -1026 -61 501 1405 -41 -650 559
2750 559 2026 776 -1176 -688 1629 1486 -791 -507 -148 896 544 -838 -238 1844 635 -889 -1514
2767 -1514 -65 2941 1352 -2378 -1698 2733 960 -1746 -2265 1503 2648 -215 -1601 1604 3328
2782 3328 1 -2042 2 524 1300 -420 -2879 -284 3700 374 -2752 -1305 4009 2047 -2421
2797 -2421 -2133 1111 1559 -329 -2240 -489 82 908 -996 -1680 1112 2443 277 -1951 -165 2214
2813 2214 1057 -3233 -2537 1665 1856 -983 -1619 -195 1024 1013 -56 -523 1289 1379 -259 -2198 -1431
2830 -1431 2901 1721 -2828 -3077 3130 2413 -1373 -1092 1409 2987 67 -480 -847 423 2636 147
$$ packed form
2716E48j595J343L63Q93k626K80J285J407l127J87n35J857L97j439q24K944L1
2733A389r87l030K088J385r77p1j323K841n73o42j126R65N62R04j446o09J209
2750E59J467j250j952M88K317j43k277K84L59J044l52j382O00K082j209j524o25
2767a514J449L006j589l730O80M431j773k706n19L768J145k863j386L205J724
2782C328l327k043K044N22P76j720k459K595L984l326l126J447N314j962m468
2797b421K88L244M48j888j911J751N71Q26j904o84K792J331k166k228J786K379
2813B214j157m290O96M202J91k839o36J424J219j1j069m67J812R0j638j939P67
2830a431M332j180m549k49O207p17l786K81K501J578k920n47l67J270K213k489
$$ plain form
2846 147 -2114 -689 3482 711 -1850 -2392 2060 3829 -1835 -2333 2189 2942 -564 -1082 1698 3035
2862 3035 -274 -1303 -853 594 1423 1066 122 -1433 1964 1901 -2348 -2952 977 2798 -11 -3265 -415
2879 -415 1649 1115 -1783 -2507 2026 1129 -677 -1915 -1448 858 1366 -1714 -2393 -491 2399 257 -3941
2896 -3941 -1045 4046 1573 -2633 -2196 2800 451 -2033 -1493 369 2114 315 -67 -487 2006 2739
2912 2739 -622 -3350 -513 4358 1734 -2812 -363 2703 2163 -2408 -1910 1601 1016 -845 -1576 -412
2928 -412 1770 1741 857 -1556 -900 2678 994 -2945 75 2818 909 -1825 -1304 1895 2686 -360 -2005
2945 -2005 -87 1721 437 439 -1510 -1571 2147 989 -989 -665 2366 2650 -2092 -1741 1736 3857 -737
2962 -737 -2609 -339 2989 1047 -2973 -1062 -432 2322 -591 -2710 568 2045 399 -1944 -2377 1585
$$ packed form
2846A47k261J425M171k771k561n42M452J769n664m98M522P53l506n18K780J337
2862C035l309j029M50J447Q29l57r44j555L397o3m249o04L929J821k809l254K850
2879d15K064n34k898p24M533q97j806j238M67K306N08l080o79J902K890k142m198
2896c941K896N091k473m206M37M996k349k484N40J862J745j799l82m20K493P33
2912B739l361k728K837M871k624m546K449L066n40m571M98L511n85j861p31J164
2928d12K182k9q84k413O56L578j684l939L020K743j909k734N21L199P91l046j645
2945b005J918J808j284Kj949o1L718j158j978L24L031K84m742L51L477K121m594
2962g37j872K270L328j942m020J911O30K754k913k119L278J477j646k343m33L962
$$ plain form
2978 1585 2616 -2058 -2363 529 2782 -17 -1963 -212 1525 -389 -1829 -1333 1709 1034 528 -251
2994 -251 -280 1093 205 -2311 -910 580 1469 -346 -1666 -434 790 388 -199 -965 487 -215 -542
3011 -542 -1251 -781 1209 102 1119 -135 -139 2461 393 -1934 -1492 -75 2189 -1291 -1093 693 1806
3028 1806 -244 -2208 -349 1507 2009 -685 -2044 1839 2149 806 -2487 -414 2132 1849 -1060 -1222
3044 -1222 2702 1258 -1036 -1401 1178 1767 8 -2203 -482 1962 280 -784 -788 280 1943 310
3060 310 -1855 986 1616 489 -1938 155 900 -135 -1376 -1632 1093 1005 -29 -139 517 447 -4 143
3078 143 -302 228 -907 -47 919 -656 -602 154 206 -867 -1250 294 74 -916 -678 -252 1085 651 -903
3097 -903 -737 453 101 -356 -2232 1028 1775 445 -1290 -1807 1909 715 -1285 -624 2148 691 -1518
$$ packed form
2978A585J031m674l05K892K253k799j946J751J737j914j440M96L042o75n06p79
2994b51k9J373q88k516J401J490Q89j815j320J232J224m02n87p66J452p02l27
3011e42p09M70J990j107J017j254mK600k068k327M42J417K264l480J98J786J113
3028A806k050j964J859J856N02k694j359L883L10j343l293K073K546k83k909j62
3044a222L924j444k294l65K579N89j759k211J721K444j682j064mJ068J663j633
3060C10k165K841O30j127k427K093P45j035j241k56K725q8j034j10O56p0m51J47
3078A43m45N30j135Q60R66j575N4P56N2j073l83J544k20r90K38M26J337m34j554
3097i03J66J190l52m57j876L260P47j330j735n17L716j194k000O61K772j457k209
$$ plain form
3114 -1518 -905 1646 1421 -583 -2203 -488 1380 382 -843 -1913 586 1366 -786 -708 508 1119 77
3131 77 -379 -281 269 380 -975 578 136 -183 -838 -1026 472 156 -877 -454 399 1469 -283 221 469
3150 469 -631 98 -356 135 25 -93 -121 -341 89 -123 -539 221 -159 -852 93 -258 815 -2 -842 -47
3170 -47 692 332 -540 -339 -428 893 -1064 -1018 1660 458 -395 -638 -114 907 -525 180 -1567 240
3188 240 1466 -606 22 716 305 -675 -691 666 683 210 -272 39 1635 61 -1438 213 169 -24 40
3207 40 1051 741 1462 266 -849 381 905 -202 316 -973 673 -75 -81 429 -37 -237 397 1017 128
3226 128 268 405 1643 -494 -844 -48 143 312 497 556 -352 977 -79 38 -98 322 507 621 -783
3245 -783 513 1297 -1101 -1261 -333 964 964 12 -2720 83 447 -1184 -179 -848 -993 -56 -905 -45
$$ packed form
3114a518O13K551k25k004j620J715J868r98j225j070K499P80k152P8J216O11j042
3131G7m56R8N50J11j355J553m42l19o55j88J498l16j033M23Q53J070j752N04K48
3150D69j100P29m54M91j10j18k8k20M30k12m16P60l80o93R45l51J073q17q40P95
3170d7P39l60q72K01q9J321j957M6K678j202q53k43N24J021j432P05j747J807
3188B40J226k072O28O94m11r80j6J357J7m73m82L11J596j574j499J651m4j93O4
3207D0J011l10P21j196j115J230N24j107N18j289J646p48oN10m66k00O34O20q89
3226A28J40J37J238k137l50P96J91J69J85N9r08J329j056J17j36M20J85J14j404
3245g83J296P84k398j60R28J297%r52k732K803L64j631J005o69j45R37q49Q60
$$ plain form
3263 -45 1475 -202 733 -895 74 808 -639 -1522 257 650 41 -1605 -1013 632 231 253 111 236
3281 236 616 498 400 -119 8 1562 30 -1046 341 1214 996 93 -814 -34 951 267 13 -439 1697
3300 1697 319 -477 660 40 534 1107 -322 -291 1448 1830 -791 284 173 1658 -1467 -857 1073
3317 1073 1497 1410 -187 -785 272 -131 -367 -646 -162 797 349 -145 -696 1422 907 -277 -135 -60 382
3336 382 502 697 -119 1074 453 -713 -1087 279 -617 -47 -453 -98 2989 1155 -970 -571 -522 3137
3354 3137 408 -1185 -532 329 2047 339 -711 1715 674 326 -1134 803 1554 379 -261 -1262
3370 -1262 504 1355 -115 -568 40 163 1595 -57 -44 1087 1168 -1942 -1420 414 909 990 -329 -160
3388 -160 1191 1303 -89 -2737 130 1453 1186 -2405 -386 953 1538 -98 -1858 1601 433 163
$$ packed form
3263d5J520j677R35j628R69P34j447q83J779L93o09j646N92J645m01K2j42J25
3281B36L80j18r8n19J27J554j532j076J387Q73k18r03r07P80R85o84k54m52K136
3300A697j378p96J137o20M94N73j429L1J739L82k621J075j11J485l125O10J930
3317A073M24q7j597n98J057m03k36k79M84R59m48m94n51K118n15j184J42P5M42
3336C82J20J95q16J193o21j166l74J366q96N70m06L55L087j834k125L99M9L659
3354C137k729j593O53Q61J718j708j050K426j041l48j460J937P51j175o40j001
3370a262J766Q51j470m53O08J23J432j652J3J131Q1l110N22J834M95Q1j319J69
3388a60J351J12j392k648K867J323k67l591K019J339N85j636j760L459j168k70
$$ plain form
3404 163 -625 -124 341 1656 -713 -776 537 52 1599 -939 -1254 1991 -139 -312 -1430 -149 2196
3421 2196 -568 -1590 -350 964 696 40 -1806 -1007 2286 639 -1422 -1898 781 -21 -1514 -818
3437 -818 1783 2626 -803 -844 694 1824 -532 -589 -1435 328 1646 -932 -185 -563 888 -1480 -376
3454 -376 -747 813 1262 291 -741 112 183 -624 -791 -352 811 984 -353 -1019 -325 788 174 -1399
3472 -1399 -505 1235 1410 -709 -1437 1592 2253 80 -711 -511 1890 -332 455 -332 64 -272 1757
3489 1757 -797 -989 1139 243 -215 -1874 -1034 3279 -6 -1252 -473 1684 1056 -660 -1224 1281 344
3506 344 -1293 -1921 426 1331 -4 -505 -550 -3 -86 -235 -1038 413 1662 342 -248 -784 901 2316
3524 2316 -321 -813 -435 1603 110 -1219 -1371 1017 660 -1521 -1144 -517 145 1069 -1567 -850 241
$$ packed form
3404A63p88N01M65J315k369o3J313m85J547k538l15L245k130j73j118J281K345
3421B196k764j022J240J314k68o56j846P99L293j647k061m76K679q02j493O96
3437h18K601Q43l429m1J538J130k356n7q46J763J318k578P47l78J451k368J104
3454c76l71J560M49r71j032Q53P1q07j67M39J163J73j337o66O94J113o14j573
3472a399Q94J740J75k119p28L029O61k173p91K00K401k222P87p87L96l36K029
3489A757k554j92K128q96m58j659Q40M313l285j246P79K157o28j716n64K505r37
3506C44j637o28K347R05j335n01m5N47q3j49q03J451J249j320n90n36J685J415
3524B316k637m92L78K038j493j329j52K388l57k181L77O27O62R24k636P17J091
$$ plain form
3541 241 1725 -432 -1454 112 1797 -529 -1014 546 827 1491 -90 -1461 232 1335 1142 -262
3557 -262 229 1580 1148 -612 -1127 334 1784 -81 -1974 677 2466 1379 -621 -876 763 -443
3573 -443 -447 -1641 177 308 24 -499 -2191 1268 388 209 -1563 423 295 404 -78 233 1498 113
3591 113 269 -96 493 407 1033 -61 -1590 -441 2239 1285 -892 -342 1571 -352 -238 569 381 62
3609 62 1431 -1404 355 1761 -189 174 -788 1185 -528 89 -951 -514 2116 646 -864 -534 1231
3626 1231 -911 -535 -170 531 -852 -906 -1365 509 179 893 -1061 -990 1265 -124 -811 -723 499 -275
3644 -275 -132 -727 85 212 -442 -319 -736 935 -97 -440 1115 -614 1419 76 -610 375 804 -1116
3662 -1116 622 276 -401 835 653 741 -733 509 881 -254 -752 -681 838 200 150 -420 -1011 -129 348
$$ packed form
3541B41J484k157j022J566J685k326m85J560K81O64j581j371J693J103j93j404
3557b62M91J351m32j760n15J461J450j865j893K651J789j087k000k55J639j206
3573d43mj194J818J31k84n23j692L459q80j79j772J986j28J09m82L11J265j385
3591A13J56l65N89q6O26j094j529J149K680r54k177N50J913j923J14Q07j88l19
3609F2J369k835J759J406j950L63r62J973j713O17j040M37K630j470j510L30J765
3626A231k142L76L65P01j383n4m59J874l30P14j954P1K255j389o87Q8J222p74
3644b75J43n95Q12J27o54J23m17J671j032l43J555j729K033j343o86R85M29j920
3662a116J738l46o77J236j82Q8j474J242L72j135m98P1J519o38n0n70n91Q82M77
$$ plain form
3681 348 -911 212 905 214 91 -796 698 367 -156 -1153 943 929 897 -1428 -812 459 122 -1176
3699 -1176 -1375 831 333 415 -596 -616 -496 1524 418 -1065 -471 -305 -184 -1784 382 -128 1019 -617
3717 -617 -162 1317 -703 -385 -765 510 456 477 -739 505 574 -83 -435 -986 -53 1376 -1145 -642 259
3736 259 -518 -161 -161 282 235 414 -66 -1084 -56 -454 -357 -119 75 94 -1207 -78 -755 646 -1115 427
3756 427 -480 -43 -836 285 428 423 -44 185 1167 -313 -977 1414 175 1440 -387 -293 940 218 -624
3775 -624 -1304 -255 -314 -418 488 130 734 -712 -774 26 -373 576 -72 -358 -125 1351 1130 -105 -1357
3794 -1357 -1806 -1240 -183 533 -906 -377 80 729 -687 889 1036 -446 -384 374 1213 -483 -25 147
3812 147 -249 906 1877 -297 524 -1556 711 785 -693 413 92 -1013 -41 -153 351 43 160 17
$$ packed form
3681C48j259J123O93o91j23q87J494l31n23r97K096j4l2k325O16J271l37j298
3699a176j99K206m98Q2j011k0J20K020j106j483N94J66J21j600K166n10J147j636
3717f17M55J479k020L18l80J275n4K1j216J244O9o57l52n51R33J429k521N03R01
3736B59p77L57%M43m7J79m80j018J028l98R7K38J94J9j301J129o77J401j761J542
3756D27r07M37p93J121J43nm67K29R82j480o64K391j239J265j827R4J233p22q42
3775f24o80J049n9j04R06l58O04j446o2Q00l99R49o48k86K33J476k21j235j252
3794a357m49N66J057P16j439N29M57O49j416J576J47j482O2P58Q39j696M58J72
3812A47l96J155R71k174Q21k080K267P4j478J106l21j105R72j12N04l08J17j43
$$ plain form
3830 17 1330 -200 203 -978 -662 492 785 -1513 -867 -117 -261 291 -1221 854 407 305 -431 396
3848 396 4 1510 -1564 993 -591 386 -1401 -920 -816 493 -12 -629 -11 -392 342 506 -377 1341
3866 1341 -54 88 -516 -447 188 144 506 -965 1084 -718 1300 -908 -168 -140 -1641 -438 -335 -837
3884 -837 801 59 856 817 -1015 -1323 457 -1113 -502 350 1286 -623 -1415 -328 922 885 -714 68
3902 68 -584 750 265 -945 266 -287 801 -58 -238 -286 885 -116 268 -804 -16 -549 -888 568
3920 568 1056 1215 -1032 -1472 696 -254 -1519 -1963 -509 1544 -480 44 -1519 -106 839 -83 -695
3937 -695 -30 861 880 -89 524 50 266 -2209 -531 611 784 -759 -178 384 -321 747 163 320 -520
3956 -520 1184 248 398 -737 888 1779 -122 -990 1784 -76 803 -398 317 1086 -624 1534 -255
$$ packed form
3830A7J313j530M03j181L16J154K93k298O46P50j44N52j512K075m47j02p36Q27
3848C96l92J506l074K557j584R77j787M81J04J309n05o17O18l81P34J64q83J718
3866A341j395J42o04O9O35m4L62j471K049j802K018k208P40K8j501J203J03n02
3884h37J638p42P97l9j832l08J780j570O11Q52R36j909p92J087J250l7j599P82
3902F8o52J334m85j210J211n53J088q59j80m8J171j001L84j072P88n33l39J456
3920E68M88J59k247m40K168r50j265m44J454K053k024N24j563J413R45r22o12
3937f95O65Q91J9r69O13m74K16k475J678J142J73j543N81N62p05J068n84J57q40
3956e20J704r36J50j135J625Q91j901q68K774j860Q79j201P15P69j710K158j789
$$ plain form
3973 -255 449 1287 -132 159 514 636 628 -653 6 14 955 -1299 -1390 -222 -568 1179 -842 -1208 1138
3992 1138 965 1148 -245 338 412 46 -310 -338 2029 657 -38 -1603 -504 1148 -349 -496 15 319
4010 319 474 -186 -36 1042 158 1713 1184 -796 940 728 -1015 -1161 79 1382 284 165 -457
4027 -457 1065 -637 -844 -1650 301 -328 25 187 -517 -155 1775 49 -165 -647 1887 -705 -381 -831
4045 -831 1015 260 313 -712 1036 2685 1233 308 492 -414 -131 109 -1284 1452 -78 -677 -1740
4062 -1740 17 876 1314 73 -392 977 555 -546 -1361 -568 -494 -317 1073 -353 -634 -1093 204 -666
4080 -666 -282 613 1851 -2522 -1569 183 1521 -496 -339 1819 689 233 -431 448 256 -248 -471 -430
4098 -430 1281 -86 -150 -239 -265 299 786 1280 -1215 75 61 -641 -379 -178 -15 716 45 -67 76 38
$$ packed form
3973b55P04Q38j419K91L55J22qj281O59QR41k254r1J168l46J747k021l66K346
3992A138j73J83j393N83P4l66l56k8K367j372o95j565J099J652j497j47N11L04
4010C19J55o60J50J078q84J555n29j980J736k12j743j46J240J303j098j19o22
4027d57J522j702k07q06J951o29L53J62p04L62J930j726k14m82K534k592L24m50
4045h31J846p55N3j025J748J649j452r25J84r06K83K40j393K736j530n99j063
4062a740J757Q59M38j241m65J369m22j101q15P93P4J77J390j426k81m59J297q70
4080f66L84Q95J238m373R53J752J338k017J57K158j130m56o64Q79j92n04k23M1
4098d30J711j367o4q9k6N64M87M94k495J290j4p02K62K01J63P31o71j12J43l8
$$ plain form
4118 38 150 140 -857 1552 1412 -1011 974 -195 788 -70 -909 1524 -179 1602 873 -751 698 323
4136 323 556 917 -27 1085 2187 -131 -1328 169 439 -1424 -1773 -1310 787 611 -282 -479 1076
4153 1076 138 -789 -1028 99 92 -765 -147 209 1655 -470 -97 -744 176 362 -1243 -1343 -298 -632 429
4172 429 -1694 -362 541 -222 934 -675 585 397 -391 -375 -539 -81 692 -834 -485 -660 -950 467
4190 467 -945 131 -487 0 679 -680 -208 1973 602 -609 377 499 554 -442 -2017 208 504 -500
4208 -500 -196 -640 -355 -329 -855 546 8 909 -553 -1820 -679 342 1793 322 -885 -1357 481
4225 481 889 356 -115 318 655 -319 -11 633 -24 811 -1077 -225 5 429 -78 734 -1763 -701 1145
4244 1145 -532 627 -629 376 1009 -64 -125 -133 -1153 -1706 -509 -4 817 -1548 -22 -182 371 840
$$ packed form
4118C8J12j0r97K409j40k423J985j169R83q58q39K433j703J781p29j624J449l75
4136C23K33L61r44J112J102k318j197J497K70j863l49M63K097j76q93j97J555
4153A076r38r27k39J127pq57O18L56J446k125L73o47R20J86j605j00J045l34J061
4172D29k123J332R03p63J156j609J260j88p88J6j64M58P73j526L49j75k90J417
4190D67j412J076o18M87O79j359M72K181j371j211R86J22N5r96j575K225K96j004
4208e00L04m44K85K6n26J401n38R01j462j267J141J021J451j471j207m72J838
4225D81M08n33m71M33L37r74L08O44o57Q35j888Q52K30M24n07Q12k497J062J846
4244A145j677J159j256J005O33j073o1qj020n53J197N05Q21k365J526j60N53M69
$$ plain form
4262 840 -275 397 1143 1211 43 242 -367 35 -659 -128 536 -788 -439 700 -1007 151 -51 -823
4280 -823 -1731 377 -378 392 -607 -45 345 592 -490 212 1363 1018 249 -1143 -130 1374 171 -21
4298 -21 1250 132 -301 1042 -691 -427 1569 202 -516 82 914 83 -993 -447 496 1009 -529 984
4316 984 -21 468 -1316 389 -89 -688 -1763 1820 180 -13 863 611 1410 -56 402 -574 476
4333 476 761 415 -622 1326 489 -509 -350 -125 -120 -779 -383 -405 1 153 -1031 -21 796 970 -69
4352 -69 743 242 958 -494 79 -213 577 102 844 150 745 -275 -413 514 -694 433 199 -188 -952
4371 -952 -463 612 411 266 -482 -333 160 -109 -568 367 139 -846 257 163 715 -447 -406 498 531 260
4391 260 -217 600 -530 74 206 -422 -716 -23 -146 1059 163 194 444 -616 -568 -23 258 190 418 -471
$$ packed form
4262H40j115O72P46O8j168J99o09M02o94N31O64j324L49J139j707J158k02p72
4280h23r08K108p55P70r99N62L90K47j082P02J151l45p69j392J013J504j203j92
4298b1J271j118m33J343j733K64J996j367p18N98Q32q31j076N46R43N13j538J513
4316I84j005M89j784J705m78n99j075L583j640j93Q76k52P99j466M58r76J050
4333D76K85l46j037J948q37r98J59K25No59L96k2M06J52j184J010Q17J74j039
4352f9Q12n01P16j452N73k92P90m75P42o94N95j020j38R27j208J127k34l87p64
4371i52M89J075k01j45p48J49M93k69m59R35k28r85J103r4N52j162M1R04L3k71
4391B60m77Q17j130O04J32o28k94O93j23J205q96L1K50j060M8N45K81o8K28q89
$$ plain form
4411 -471 1075 -384 -518 -253 -700 51 1014 -552 -500 250 707 -781 -1544 52 341 133 -298 -694 714
4430 714 -578 -440 977 235 1106 -578 -327 -549 -83 416 -352 -548 377 171 -462 -744 -401 -658 -134
4449 -134 122 -513 -560 -358 -154 -474 285 564 735 -160 -393 102 822 -187 -849 -159 -26 208 -590 180
4469 180 -142 104 509 -53 798 44 -301 -372 79 122 396 -296 535 405 419 302 -286 427 -80 34 -138
4490 -138 -1053 468 81 698 -590 -755 294 -34 -372 -475 -1110 -280 204 -1321 -949 -955 419 -298 -775
4509 -775 377 31 -83 -504 -652 1259 789 127 -693 -563 778 -102 -1972 -306 140 -40 -71 -442 1104
4528 1104 -51 280 -516 -1020 324 -202 33 -1239 633 765 227 -44 -1145 -1207 781 -580 -1232 451
4546 451 152 -1252 262 -122 207 -907 54 31 -473 493 142 -632 -1559 783 -374 -107 640 460 -127
$$ packed form
4411d71J546j459j34K65m47P51R63j566N2P50M57j488p63J596K89k08m31l96J408
4430G14j292J38J417p42Q71j684K51k22M66M99p68j96R25k06o33k82L43k57N24
4449a34K56o35m7K02K04l20P59K79J71q95k33M95P20j009o62O90J33K34p98P70
4469A80l22K46M05n62Q51p54l45p1M51M3K74o92Q31j30J4j17n88P13n07J14j72
4490a38r15J521l87O17j288j65J049l28l38j03o35Q30M84j525L72oJ374p17m77
4509g75J152l46j14m21j48J911m70o62q20J30J341q80j870J666M46j80l1l71J546
4528A104j155L31p96n04J344n26K35j272J872J32n38k71j101o2J988j361o52J683
4546D51k99j404J514l84L29j114R61k3n04R66l51p74r27K342j157K67P47j80n87
$$ plain form
4565 -127 -339 -631 38 1389 -898 776 -692 709 288 1004 -346 -44 699 962 -141 -81 -881 4
4583 4 260 -1354 -108 50 397 -1373 580 -276 546 387 204 -675 -663 713 114 -123 15 432 170
4602 170 -38 339 660 647 -218 212 514 328 -338 -1025 -414 -613 -1106 -1322 292 322 -42 -738 -1251 -1126
4622 -1126 860 1062 -1612 452 269 87 -1339 -876 301 206 123 -105 40 150 1269 -700 163 1493
4640 1493 3 568 -2053 61 510 502 -109 375 395 57 -442 307 619 -8 392 156 508 1007 1096 102
4660 102 -1200 870 352 -143 -141 706 597 312 162 81 -72 726 472 -1169 144 421 535 -663 -521
4679 -521 -141 748 440 99 -616 974 56 215 253 93 499 266 -276 16 83 -554 659 510 595 515 382
4700 382 -645 -552 1010 408 -589 -943 -413 -213 -121 -169 260 -341 162 356 439 1272 312 -54 -187 -237 -359
$$ packed form
4565a27k12k92O69J351k287J674j468J401m21P16j350L02P43K63j103O0q00Q85
4583DK56j614J246J58L47j770J953q56Q22j59j83q79J2J376n99k37J38M17k62
4602A70k08L77L21j3q65M30L02j86o66o87O11j99m93k16J614L0l64o96n13J25
4622a126J986K02k674K064j83j82j426M63J177r5q3k28J45J10J119j969Q63J330
4640A493j490N65k621K114M49qo11M84K0l38m99P49L12o27M00k36L52M99Q9r94
4660A02j302K070n18m95KQ47j09k85j50q1j53P98k54j641J313K77J14j198J42
4679e21L80Q89l08l41p15J590r18J59L8j60M06k33n42K92O7o37J213j49Q5q0j33
4700C82j027R3J562o02r97l54N30K00R2m8M29o01N03J94Q3Q33r60l66j33n0j22
$$ plain form
4721 -359 -173 -976 -308 -47 556 -872 144 -20 -120 109 -587 -68 257 567 588 43 161 923 -67 255
4741 255 32 812 -1101 457 -243 366 119 -259 -177 -533 196 128 1057 -557 -87 -725 -331 -430 1065 -116
4761 -116 367 -641 -744 977 -258 -339 -1209 194 877 476 -213 135 105 -16 -466 -513 705 949 86
4780 86 85 499 971 1350 -42 105 -436 -337 -434 -751 -776 1269 207 -62 -75 695 -324 -1097 210 447 1289
4801 1289 -1074 522 648 439 -362 -700 -838 -1549 501 -720 157 -835 1307 243 -127 -52 -635 753
4819 753 552 -23 232 -312 -1015 -300 382 191 395 -710 300 -268 1015 938 -400 -1081 44 -219 -288
4838 -288 563 -639 182 624 -691 621 -23 673 1384 -198 812 460 -864 -131 88 -571 633 160
4856 160 -807 120 1253 686 -531 -754 942 -80 545 -708 169 552 1432 -174 -1392 475 -1314
$$ packed form
4721c59J86q03O68K61O03j428J016j64j00K29o96N19L25L10K1n45J18P62r90L22
4741B55k23P80j913J558p00O09k47l78Q2l56P29o8R29j614M70o38L94r9J495j181
4761a16M83j008j03J721j235q1q70J403O83m01o89L48l0j21m50m7J218K44q63
4780H6jM14M72L79j392J47n41R9r7l17k5K045j062k69j3P70j019p73J307K37Q42
4801A289k363J596J26k09q01l38j38p11K050j221Q77r92K142j064l70P5n83J388
4819G53k01n75K55n44p03P15O82j91K04j105J010n68J283p7j338o81J125k63o9
4838b88Q51j202Q21M42j315J312o44O96P11j582J010l52j324P33K19o59J204m73
4856A60r67R27J133n67j217k23J696j022O25j253Q77L83Q80j606j218J867j789
$$ plain form
4873 -1314 722 -1236 -88 -317 -561 552 49 -59 234 -127 -533 316 835 -305 -58 166 -297 18
4891 18 745 -588 -588 -934 175 25 445 7 676 292 -478 102 1377 1042 -111 -72 -372 -258 215 786
4911 786 -247 -323 -242 -159 873 76 -724 859 682 643 486 852 -812 -1020 595 -38 -195 291 -812
4930 -812 -10 -537 -800 -922 734 0 -325 -49 -754 489 -519 74 -530 -332 23 -303 445 479 -415
4949 -415 416 204 117 106 166 -857 -525 273 -504 754 18 -135 55 -22 -715 -438 -75 588 -300 -544 817
4970 817 418 12 193 -524 -1019 408 593 -571 -27 333 -162 -798 359 436 -162 947 -784 -214 334
4989 334 -354 -58 -733 -78 1481 156 100 319 -731 983 103 657 -772 -172 -24 635 155 924 354
5008 354 -967 -447 178 358 -828 -26 -529 824 -74 191 -707 417 630 -69 203 -71 126 -366 503
$$ packed form
4873a314K036j958J148k29k44J113n03j08K93l61m06Q49N19j140K47K24m63L15
4891A8P27j333%l46J109j50M20m38O69l84p70N80J275l35j153L9l00J14M73N71
4911G86j033p6Q1Q3J032p97q00J583j77l9j57L66j664k08J615o33j57M86j103
4930h12Q02n27k63j22J656p34l25K76p05J243j008N93o04J98L55l26P48L4q94
4949d15Q31k12q7j1O0j023L32P98p77J258p36j53J90p7o93K77L63O63q88k44J361
4970H17l99m06J81p17m95J427J85j164N44L60m95o36J157P7n98J109j731N70N48
4989C34o88K96o75O55J559j325n6K19j050J714q80N54j429O00J48O59m80P69n70
5008C54j321N20O25J80j186Q02n03J353q98K65q98J124K13o99K72k74J97m92Q69
$$ plain form
5027 503 -57 238 -296 752 432 -70 -2 127 321 141 795 415 169 495 325 -149 -275 71 179 582
5047 582 -27 -774 -165 -111 498 52 -299 414 -273 -113 -145 -386 -151 1289 -512 -549 -309 473 -381 775
5067 775 281 313 12 899 199 -457 732 -305 -590 142 642 -229 -659 -339 1353 77 -383 90 462
5086 462 521 -420 -305 363 271 591 -837 -137 -628 -101 -149 -177 566 -178 -264 407 190 -331 657 1085 38
5107 38 8 597 -20 756 123 -135 467 56 672 -1093 85 806 -613 -295 -430 347 391 -379 -172 -269
5127 -269 778 827 -487 326 -528 -281 -66 118 -529 864 -72 -1010 744 -32 -113 -228 -436 321 938
5146 938 -67 232 -271 -372 -32 -127 630 82 214 342 -82 -494 -322 400 -1185 -395 231 -710 -179 -344
5166 -344 -59 611 236 -238 -76 372 441 -926 84 409 -368 25 -603 -103 377 -325 -646 -1346 890
$$ packed form
5027E03n60K95n34J048l20n02O8J29J94j80O54l80k46L26j70m74j26L46J08M03
5047E82o09p47O09N4O09m46l51P13o87J60l2k41K35J440j801l7K40P82q54J156
5067G75m94L2l01Q87p00o56J189j037k85P32N00q71m30L20J692j276m60M73L72
5086D62N9r41J15O68r2L20j428P00m91N27m8k8P43p44q6O71k17n21R88M28j047
5107C8l0N89o17P76o33k58O02m11O16j765J178P21j419L18j35P77M4p70K07r7
5127b69J047M9j314Q13q54K47K15J84o47J393r36r38J754p76q1j15k08P57O17
5146I38j005K99n03j01L40r5P57n48J32J28m24m12J72P22j585P90O26r41N31j65
5166c44K85O70l75m74J62M48O9j367J010L25p77L93o28N00M80p02l21p00K236
$$ plain form
5185 890 928 -309 376 -418 613 -454 -64 685 -118 472 -1094 -1221 460 64 -359 664 -1106 700
5203 700 59 -18 -175 38 -159 -314 -1147 -104 -808 84 -46 -685 -573 -602 -600 -1082 99 115 -106 -694 983
5224 983 -889 -255 717 -516 864 595 -386 -1616 -869 486 -171 -257 -1376 -417 341 343 172 230 371
5243 371 720 -1262 1129 1000 1127 597 -356 69 -14 -54 474 394 228 1007 483 200 198 8 473 -346 -64
5264 -64 801 -379 275 -484 -213 498 -62 -1008 57 1226 223 308 -269 -659 169 1611 469 -688
5282 -688 1684 327 -340 -450 777 198 124 201 173 1557 506 -50 -1094 769 410 392 1018 -468 1125
5301 1125 -55 395 -925 -668 -200 45 -47 711 -78 1089 -1037 786 -507 179 378 -1138 -653 1310
5319 1310 230 -570 947 21 267 650 -438 -705 -477 1477 -599 212 1108 726 -761 311 1003
$$ packed form
5185H90L8j237O85p94J031j067L90P49q03N90j566j27J681l96m23J023j770J806
5203G00o41p7j57K13j97j55q33J043p04Q92j30o39J12k9Km82J181J6k21n88J677
5224I83j872O34R72j233J380k69r81j230P47J355o57q6j119R59P58Kj71N8J41
5243C71L49j982K391j29J27n30r53M25q3m0N28q0j66P79n24k83kj90M65q19K82
5264f4Q65j180O54p59K71P11n60r46J065J169j003Q5n77l90Q28J442j142j157
5282f88K372j357o67j10J227n79p4P7k8J384j051n56j044J863l59j8O26j486J593
5301A125j180M50j320K57M68K45r2P58p89J167k126J823j293O86J99j516M85J963
5319A310j080q00J517r26K46L83j088k67K28J954k076Q11Q96l82j487J072O92
$$ plain form
5336 1003 167 88 -30 -384 370 -64 -423 186 -584 -1045 -563 106 -101 -328 -365 711 416 154 1288 367
5356 367 -201 -753 531 -1748 221 3 402 837 113 -501 -562 -414 -270 -841 80 -772 993 827 -133
5375 -133 34 771 631 -140 -653 -309 1544 -759 261 186 722 701 -450 -281 -763 -92 648 -548 313
5394 313 -637 186 140 154 231 270 -613 50 635 370 228 184 -404 786 576 190 -860 1028 -509 595
5414 595 -584 -455 304 191 -82 326 -205 -266 -12 1407 113 -287 283 675 -411 -1354 -261 1009
5432 1009 1042 26 -28 -466 101 -686 358 3 1482 -642 192 247 -567 -48 626 -594 704 3 262
5451 262 739 194 339 -728 1153 -593 279 -644 534 -322 928 -383 -470 84 1318 404 -82 -1459
5469 -1459 -361 -58 -53 -410 -535 -348 -1043 -261 -617 -171 -559 80 -1480 -529 672 736 71 1875 261
$$ packed form
5336A003q36p9j18l54P54m34l59O09p70m61M82O69k07k27l7J076k95k62J134r21
5356C67n68n52J284k279J969k18L99M35p24o14o1J48J44n71R21q52J765j66r60
5375a33J67P37j40p71n13L44J853k303J020p5N36k1j151J69m82O71P40j196Q61
5394C13r50Q23m6J4P7L9q83O63N85k65j42m4n88J190k10l86j050J888j537J104
5414E95j179J29P59j13k73M08n31o1K54J419j294m00N70L92j086r43J093J270
5432A009L3j016n4m38N67p87J044l55J479k124Q34N5q14N19O74j220J298p01K59
5451B62M77n45J45j067J881j746Q72r23J178q56J250j311q7N54J234r14m86j377
5469a459J098L03Nl57j25J87o95P82l56M46l88O39j560R51J201O4o65J804j614
$$ plain form
5488 261 1992 -782 -51 -432 42 -172 131 -327 -364 128 1063 -473 -254 378 487 -1086 -900 591 490
5507 490 1213 750 389 -476 150 223 573 276 1025 674 42 -126 836 -162 -286 -1257 264 642 38 -274
5527 -274 -31 292 524 258 -320 569 -327 460 -52 -74 341 467 1030 236 317 1548 222 -384 -285 960
5547 960 153 -166 600 465 -317 -1006 486 -817 740 -121 -134 -469 -163 -540 747 120 -282 910 -326
5566 -326 1161 2286 -669 706 683 -152 -1021 -635 -498 -222 20 -183 -933 -802 -30 298 -369 -178 403
5585 403 -176 131 454 114 495 462 141 101 -514 1130 192 28 117 310 210 462 -799 -490 -987 327
5605 327 334 -508 -355 376 -255 -1201 -169 225 836 -809 561 724 452 435 -360 88 209 -51 -55 -682 920
5626 920 439 439 446 109 -283 328 470 369 103 -603 -164 -69 -1015 -114 678 520 -439 335 -109 -141 72 -206
$$ packed form
5488B61J731k774P31l81M74k14L03m58l7M92R35j536K19O32J09j573J86J491j01
5507D90P23m63l61q65O26P3L50k97P49l51o32j68R62r98j24r71J521L78o04l12
5527b74K43L23K32k66n78Q89q96P87n12k2M15J26N63p94Q1J231j326o06R9J245
5547I60q07l19P66j35p82o89J492j303J557q61j3l35L06l77J287o27m02J192j236
5566c26J487J125k955J375k3q35q69L86J37K76K42k03p50J31P72L28o67J91N81
5585D03n79L07L23l40L81l3l21m0o15J644r38j64Q9J93j00K52j261L09m97J314
5605C27Pq42J53P31o31r46J032L94O11j645J370J63k72j7p95M48J21k60mo27J602
5626I20m81%Pl37l92O11J42j01k66p06M39R5r46R01P92j58r59P74m44l2K13k78
$$ plain form
5648 -206 368 -1122 -178 822 -191 -7 741 -191 235 -449 806 335 -165 374 1243 -346 -1806 -644
5666 -644 870 -748 -756 1222 265 965 853 -1215 -1024 544 -251 -420 580 359 -206 -384 -740 -366 108
5685 108 -289 -751 -524 746 -318 -580 -834 126 180 587 347 -444 327 -84 425 -247 -724 -939 970
5704 970 -383 -401 -129 -775 431 218 -841 -255 575 -570 -922 -1762 261 -284 -1016 -303 480 -796
5722 -796 598 177 -521 368 -240 -205 224 14 123 -622 238 396 519 318 -445 -641 -25 472 260 -690
5742 -690 232 427 -471 178 -162 -530 -694 -421 47 866 964 -320 -278 348 341 528 406 604 -728 -286 162
5763 162 -169 875 603 370 106 -891 385 858 499 267 1042 95 -399 -717 -4 1171 446 491 -1158
5782 -1158 150 -283 -356 -59 -1426 -445 -646 -518 -530 -304 -573 -171 -154 22 113 174 -48 125 -375 -5 171
$$ packed form
5648b06N74j490R44J000j013J84P48r32M26o84J255m71n00N39Q69j589j460J162
5666f44J514j618qJ978r57P00j12k068J91J568p95j69J000k21n65j78l56L74M74
5685A08l97m62K27J270j064k62k54R60N4M07k40p91P71m11N09o72m77k15J909
5704I70j353j8K72o46J206k13j059N86Q30j145l52q40K023n45p32P13P83j276
5722g96J394m21o98Q89o08L5M29k10J09p45Q60J58J23k01p63j96O16M97k12r50
5742f90R22J95q98O49l40l68j64K73M68Q19R8j284M2O26pJ87j22J98j332M42M48
5763A62l31J044k72k33k64r97J276M73l59k32P75r47m94l18P13J175p25M5j649
5782a158J308m33p3K97j367R81k01J28j2K26k69M02J7J76R1O1k22J73n00L70J76
$$ plain form
5803 171 -315 147 495 1078 -533 -543 958 -3 314 -57 1330 120 473 409 539 576 -219 336 124 -689
5823 -689 672 1072 185 602 388 570 -203 -671 -407 -72 -569 -600 163 318 1381 -634 -42 -495 -255
5842 -255 -341 571 450 -660 -240 -234 -1390 324 854 198 55 454 1152 914 -718 -473 261 584 -339 -804
5862 -804 119 -448 494 -335 -443 -484 -132 22 -400 -484 193 -577 -337 -210 -77 -324 -99 -479 21 192 -611
5883 -611 -403 -8 -778 -201 -599 -396 788 97 -175 103 295 598 1091 -1000 91 124 81 337 711 1023
5903 1023 -757 -732 311 -302 -80 917 -726 305 -317 574 808 137 -501 -68 246 -562 811 37
5921 37 164 -875 568 -303 414 -74 667 -280 8 611 -936 -1194 -705 985 -217 71 1206 -376
5939 -376 205 -109 -684 -221 -1051 336 -231 -310 -518 369 -572 -404 -1107 -692 165 124 -375 68 -412 -210
$$ packed form
5803A71m86M62L48N83j611j0J501r61L17l71J387j210L53o4J30L7p95N55k12q13
5823f89J361M00q87M17k14J82p73m68K64L35m97l1P63J55J063k015N92m53K40
5842b55q6R12j21j110M20Oj156J714N30o56j43L99O98k38j632K45P34L23r23m65
5862h04R23n67R42q29j08m1L52J54m22q4O77p70K40J27J33k47K25l80N00J71q03
5883f11K08L95p70N77l98K03J184o91k72K78J92L03M93k091J091L3m3K56L74L12
5903A023j780K5J043o13K22R97j643J031o22Q91K34o71o38M33L14q08J373p74
5921C7J27j039J443q71P17m88P41r47K88O03j547k58M89J690j202K88J135j582
5939c76N81l14n75M63q30J387n67p9k08Q87r41J68p03M15Q57m1m99M43m80K02
$$ plain form
5959 -210 -577 -255 162 -182 803 -905 -661 487 646 -543 -92 -625 1365 -22 -499 627 290 -309
5977 -309 -465 948 -1278 30 -680 107 64 588 572 963 -301 260 -871 596 430 -733 -245 -1389
5995 -1389 -513 886 212 -407 -382 -325 -906 797 519 336 -113 -308 -605 -221 982 187 378 735 -124
6014 -124 89 -9 556 -942 -947 1089 217 76 100 1156 145 525 -109 735 -163 943 845 100 365 563
6034 563 1573 136 336 -348 -428 -690 -253 122 -1500 1305 -894 28 -504 916 859 -118 47 -18 901
6053 901 383 287 -250 -885 -273 -346 480 248 530 -158 -160 483 -1102 -203 1016 -467 -932 -230 -1478 -716
6073 -716 -148 25 -136 121 131 536 -720 327 497 1085 -3 38 856 516 528 403 430 -1001 -946 36
6093 36 -955 -425 -412 -1733 1318 108 -368 490 -91 -145 267 686 -358 296 -248 997 96 84 1223
$$ packed form
5959b10l67L22M17l44R85j708K44J148J59j189M51n33J990j387m77J126l37n99
5977c09j56J413k226J308p10P87m3N24j6L91j264N61j131J467j66j163M88j144
5995a389Q76J399o74o19K5N7n81J703k78j83m49j95k97L84J203p95J91L57q59
6014a24K13r8N65j498nK036q72j41K4J056j011L80o34Q44q98J106r8p45K65J98
6034E63J010j437K00o84q0k62M37L75j622K805k199R22n32J420n7r77J65o5R19
6053I01n18r6n37o35O12p3Q26k32K82o88kO43j585Q99J219j483m65P02j248P62
6073g16N68J73j61K57J0M05j256J047J70N88j088M1Q18l40J2j25K7j431N5R82
6093C6r91N30J3j321L051j210m76Q58n81n4M12M19j044O54n44J245r01j2J139
$$ plain form
6112 1223 420 -262 362 78 -30 797 -87 172 -1296 652 -1291 -263 542 643 306 629 -66 -793
6130 -793 -94 -394 -114 705 -105 -64 540 -232 -793 -31 -1450 -60 -84 205 988 836 488 -327 -48 754
6150 754 312 -563 -334 -412 -123 207 739 166 126 328 565 81 384 425 -645 249 -1089 914 1158 -856
6170 -856 746 -507 662 -1188 -249 773 111 -311 -673 -144 -162 -229 58 112 479 1259 -387 1592 263
6189 263 -442 374 291 902 -583 185 -466 578 1022 -1113 116 1153 225 -1876 -959 -531 739 753
6207 753 946 9 -178 -1461 1039 251 -465 -441 -1052 436 -1002 231 90 -725 435 458 465 -978 574
6226 574 614 -114 695 -544 -575 -1137 -1136 700 914 -77 1242 621 194 36 -1311 701 -90 530 1016 490
6246 490 -238 828 302 -1329 -925 -4 16 -386 861 -411 -345 478 -56 548 1034 315 -396 -298 33 -148
$$ packed form
6112A223q03o82O24k84j08Q27q84K59j468J948j943J028Q05J01l37L23o95p27
6130g93O99l00K80Q19q10M1O04p72n61P62j419J390k4K89P83j52l48q15K79Q02
6150G54m42q75K29p8K89L30N32n73m0K02K37m84L03M1j070Q94j338K003K44k014
6170h56J602j253J169j850R39J022o62m22l62N29j8o7K87N4L67P80j646J979j329
6189B63p05Q16q3O11j485P68o51J044M44k135J229J037r28k101R17M28J270J4
6207G53J93r37j87j283K500p88p16K4o11J488j438J233j41q15J160K3Pj443J552
6226E74M0p28Q09j239l1n62JJ836K14r91J319o21m27j58j347K012p91O20M86n26
6246D90p28J066n26j631M04R21K0m02J247j272O6Q23n34O04M86p19p11R8L31j81
$$ plain form
6266 -148 808 31 62 -661 1263 58 -1845 1483 -231 1439 -172 792 -385 330 -810 430 -649
6283 -649 324 834 -245 -125 827 575 1646 332 418 -407 -658 -84 -403 1041 641 364 305 1080 -1217
6302 -1217 634 -680 825 -489 -179 -1463 -1281 290 -361 1161 -156 22 -1124 -167 126 -605 -63
6319 -63 -677 572 768 -534 210 -415 148 -403 1408 655 977 -363 -246 287 160 -725 126 -109 490
6338 490 534 541 89 48 -10 -191 -33 -339 -369 920 -613 -34 -575 1 371 -830 -185 747 -1266 -1555 352
6359 352 566 -749 -1136 -1058 -208 329 71 186 254 -527 194 17 -136 815 354 -95 780 565 580 128 -468
6380 -468 -254 -436 -828 498 689 -786 -242 -119 -1618 -344 -373 -849 -895 917 -1291 320 1031 7
6398 7 -864 1317 -213 -348 734 78 -1426 514 -1022 -490 121 -451 697 -1041 664 -142 -403 441
$$ packed form
6266a48R56p77L1p23J924j205j903L328j714J670j611R64j177P15j140J240j079
6283f49R73N10j079J20R52k52J071j314Q6q25k51N74l19J444m00k77n9P75k297
6302a217J851j314J505j314L10j284J82J571o51J522j317J78j146R57K93p31N42
6319f3o14J249J96j302P44o25N63n51J811p53L22j340J17N33j27q85Q51k35N99
6338D90M4Pm52m1n8j81J58l06l0J289j533N79n41N76L70j201O45R32k013k89J907
6359C52K14j315l87P8Q50N37k58J15O8p81P21j77j53R51m61m49Q75k15J5m52n96
6380d68K14j82l92J326J91j475N44J23j499J274k9m76m6J812k208J611P11j024
6398Gq71K181j530j35J082o56j504J940j536N32O11n72J148j738J705q06k61Q44
$$ plain form
6416 441 1280 168 72 -404 515 -125 -278 -1073 -501 774 -276 1189 383 -597 991 1606 140 -996
6434 -996 -242 -14 -168 -308 -693 -67 -844 -371 833 1248 -100 230 -187 -281 524 623 -703 -676 249 1195
6454 1195 605 -6 -1296 -148 1023 -368 -75 -149 -201 1151 575 -145 670 -143 762 314 435 1021 -956
6473 -956 -359 -254 486 -68 -1554 396 -12 -570 359 -1593 146 470 -6 -260 4 -947 1418 -53
6491 -53 -555 -543 20 -884 -849 210 -580 84 302 -453 -1326 -1547 225 -595 107 2108 305 400 874 1018
6511 1018 381 -713 1963 768 923 134 425 -523 504 -867 -1127 -820 -318 -195 1022 192 952 76
6529 76 96 362 545 -963 284 274 -1639 338 167 39 -75 -856 263 -127 -99 79 -846 -667 -803 630
6549 630 -1811 255 -216 938 -759 -500 -887 -162 32 -514 803 1138 789 466 -251 1242 366 337
$$ packed form
6416D41Q39j112r6m76R19o40j53p95N72J275j050J465q06r80J588O15j466j136
6434i96P54K28j54j40l85O26p77M73J204M15j348L30m17r4Q05R9j326K7R25R46
6454A195n90o11j290J148J171j391K93p4n2J352n76p20Q15q13R05m48J21N86j977
6473i56N97J05P40n54j486J950m08n58R29j952J739L24m76k54K64r51K365j471
6491e3n02J2N63r04L5J059p90O64K18p55q73k21J772q20P02K001j803R5M74J44
6511A018o37j094K676j195J55p89K91r48J027j371k60L07N02J23J217q30P60q76
6529G6K0K66J83j508J247j0j913J977j71j28j14p81J119l90K8J78r25J79j36J433
6549F30k441K066m71J154j697K59l87P25J94n46J317L35l49l23p17J493q76k9
$$ plain form
6567 337 -175 -172 1043 -13 -600 -69 555 -417 -402 742 -171 -792 230 -413 301 265 40 -569 1115 -411
6587 -411 -156 764 -187 -1129 -625 -353 674 1204 471 366 -62 1551 -262 -790 489 26 -642 -65 726
6606 726 906 338 -288 -66 -728 -1082 -363 470 160 -1114 -357 -269 111 107 597 184 408 537 1124 -758
6626 -758 401 -794 347 256 -174 292 663 -1874 -273 -533 420 87 205 1207 693 -12 750 -152
6644 -152 730 167 283 -510 -581 -286 -976 -221 -278 -421 970 115 -246 -471 1252 -74 121 360 331 577
6664 577 -166 -350 -592 -839 627 1005 -648 -567 -1348 -494 -1098 -151 -411 565 -598 -928 -798 -720 -403 -563
6684 -563 256 -17 -491 -383 -278 -813 -222 338 -685 -205 853 741 399 -113 -326 -445 205 489 450 832
6704 832 985 675 -290 603 523 -1521 -512 -280 -173 -412 -826 -1394 -145 728 1378 1096 16 309 -148
$$ packed form
6567C37n12LJ215j056n87N31O24r72J5J144r13o21J022o43P14l6k25o09J684j526
6587d11K55R20r51r42N04K72J027N30p33j05m28J613j813n28J279m63o68N77P91
6606G26J80n68o26K22o62l54P19Q33l10j274P57Q8L80mM90m13K24J29N87j882
6626g58J159j195J141r1m30M66L71k537J601k60R53l33J18J002n14p05P62r02
6644a52Q82n63J16p93p1K95o90P55n7j43J391q55l61k25J723j326J95K39k9K46
6664E77p43j84k42k47J466L78j653Q1p81Q54o04R47k60R76j163l30J30P8L17j60
6684e63Q19k73m74J08J05n35N91N60j023M80J058j12l42n12k13j19O50K84l9L82
6704H32J53l10r65Q93q0k044J009K32J07k39m14n68J249Q73O50k82j080K93m57
$$ plain form
6723 -148 331 -148 376 -795 -188 15 -290 -62 -425 334 -235 -363 -953 609 -521 101 -1577 127
6741 127 -803 106 -249 136 902 -1723 568 122 -2469 -652 717 -1241 342 69 -32 72 -233 24
6759 24 -957 575 -161 -495 -775 669 912 -380 703 -136 -826 1118 -852 443 474 1016 14 -1080
6777 -1080 239 344 384 -251 38 -1409 -683 509 871 -698 -415 44 768 800 -286 1100 -134 699
6795 699 -17 1133 820 -602 387 -325 -798 496 435 143 152 -582 -1530 -223 -1295 1398 751 128 -226
6814 -226 249 354 76 357 493 244 -282 -144 -869 -377 37 -652 -215 -547 474 -409 -1527 -422 -487
6833 -487 -553 189 569 1175 195 -70 12 749 1240 1254 240 1621 163 650 55 -251 411 -1196 166
6852 166 1028 488 -145 -76 -1127 993 1091 -967 429 1285 581 -115 201 129 1025 -1176 -111 -605 128
$$ packed form
6723a48M79m79N24j171O07K03l05K28l63P59n69j28n90J562j130O22j678J704
6741A27r30R09l55L85P66k625K291m46k591J817J369j958J583k73j01J04l05K57
6759B4r81J532p36l34k80J444K43j292J083q39o90J944j970J295L1N42j002j094
6777a080J319J05M0o35K89j447P26J192L62j569K83M59P24L2j086J386j234Q33
6795F99p16J150l13j422R89p12m73J294o1k92Rp34r48J307j072K693o47o23l54
6814b26M75J05k78K81J36k49n26J38p25M92M14o89M37l32J021q83j118J105o5
6833d87o6P42L80O06r80k65Q2P37M91J4j014J381j458M87n95l06O62j607J362
6852A66Q62n40o33O9j051K120R8k058J396Q56p04o96L16p2Q96k201J065m94P33
$$ plain form
6871 128 421 -973 -208 247 1080 206 -283 -129 234 1178 1608 -100 -235 -875 263 -542 -1444 -213 824
6890 824 -392 -493 -71 -64 128 480 54 1005 -974 -372 1 80 477 -109 -179 -200 399 -596 187 262 784
6911 784 -77 60 1218 512 698 -112 -45 -308 438 188 284 396 -814 457 -445 76 264 267 -217 693
6931 693 842 -825 266 -257 381 -160 -279 -369 -101 -252 204 364 -456 -1742 812 -181 382 -173 164
6950 164 -270 -816 8 -512 584 -366 157 247 -525 203 -749 -752 -93 328 -20 -405 -89 340 531 -306 -1055
6971 -1055 173 48 -311 -381 -342 14 -660 1097 28 512 -217 544 352 711 633 248 11 -301 -375 731
6991 731 -291 -621 24 441 236 -123 -534 -606 -777 571 519 -323 292 -798 -742 102 -286 5 -11 10 337
7012 337 -359 482 -772 74 336 -178 214 446 -188 -67 -313 -347 275 562 226 311 -183 -301 77 810
$$ packed form
6871A28K93j394P65M55Q33q74m89J54L63R44M30j708j35o40J138q05r02J231J037
6890H24j216j01M22PJ92L52m26R51j979O02L73P9L97n86p0k1N99r95P83P5N22
6911G84q61J37J158p06J86q10O7k63P46k50R6J12j210J271r02N21J88Lm84R10
6931F93J49j667J091n23O38n41j19r0K68j51M56J60q20j286K554r93N63n55L37
6950A64m34n46Q24n20J096r50N23R0p72P28r52lO59M21l48l85L16M29J91q37p49
6971a055J228j25l59p0L9L56o74J757j069M84p29P61j92L59p8l85k37l12p4J106
6991G31j022l30O45M17k05l59m11p2j71J348n2q42O15j090N6Q44l88K91j6K1L27
7012C37o96Q41j254Q46K62n14L92K32o34J21k46l4O22K87l36Q5m94j18L78P33
$$ plain form
7032 810 -548 153 161 139 147 585 -172 297 -406 601 -508 -498 1117 -134 26 396 -277 -160 -312 387
7052 387 -315 -170 661 43 286 -1158 246 -80 -463 -659 -352 328 901 398 -488 -424 193 192 -375 -93
7072 -93 21 -1374 150 501 -175 -897 483 164 -550 385 327 899 750 -278 680 -15 -369 1 711
7091 711 932 371 -225 402 -839 -529 406 -363 78 -313 -367 8 -107 635 -419 -862 836 324 1130
7110 1130 444 272 581 522 8 -364 240 -240 726 915 -604 -1167 -2141 868 432 -400 582 238 -84
7129 -84 685 50 420 -279 426 -1018 -291 -451 350 -619 -417 1245 66 -363 475 848 827 -237 -204 235
7149 235 536 -902 -1495 -603 -178 -595 -909 -368 -655 709 1176 342 -734 74 -330 -579 1007 -400
7167 -400 283 -46 -809 -1053 217 -62 -447 231 -370 -1258 -2149 364 60 -363 -69 -123 551 -611 487
$$ packed form
7032H10j358P01Qk2QM38p57M69p03J007j109J0J615j251J60L70o73J17j52O99
7052C87p02J45Q31o18K43j444J404l26l83j96L07O80N73n03q86O4O17jn67K82
7072i3J14j395J524L51o76p22J380l19p14R35n8N72j49j028R58o95l54L70P10
7091G11K21n61n96O27j241L10R35p69M41l91n4L75j15P42j054m43J698n12Q06
7110A130o86j72L09n9n14l72O04m80R66J89j519n63r74L009m36q32R82l44l22
7129h4P69o35L70o99P05j444P27j60Q01r69K02J662j179m29Q38L73k1j064L3M39
7149B35L01j438n93Q92M25m17l14N41k87J364M67q34j076Q08m04k49J586j407
7167d00O83l29p63k44J270k79l85O78o01q88q91K513l04m23K94n4O74j162J098
$$ plain form
7186 487 -281 -526 86 124 -359 404 -16 1129 530 -154 -259 690 309 -311 -156 518 -439 528 -1131 -1170
7206 -1170 1452 821 118 -313 921 -535 465 485 -134 -77 -1455 360 -738 -62 -624 -1214 -366 -865
7224 -865 -777 -495 812 -427 -288 524 -147 279 -504 -517 715 -40 83 -564 -951 -55 448 -265 -155 -438
7244 -438 203 -149 -551 386 750 -118 102 -320 -952 -292 -402 -258 -428 -624 -101 -32 -536 -731 -464 354
7264 354 124 -443 156 -304 -21 1088 248 62 -632 838 840 -215 -168 -129 -33 383 510 631 -471 606
7284 606 299 980 837 -1101 -156 497 245 -1357 727 -240 -462 205 228 -640 6 -187 -1053 125 236
7303 236 -375 -925 35 -989 485 390 181 651 -417 -811 522 -277 -95 -165 -768 -290 683 -758 281
7322 281 -75 1184 -53 -32 41 -603 984 -502 83 214 242 -435 -385 553 -450 -197 -531 466 128 839
$$ packed form
7186D87p68k45O12L8m83P63m20J145n99o84j05R49l81o20J55O74r57R67j659l9
7206a170K622o31p03m31J234j456J000K0o19N7j378J815j098O76n62n90Q48m99
7224h65Q8K82J307j239J39Q12o71M26p83j3J232p55J23o47l87Q96N03p13J10k83
7244d38O41l52m02R37L64q68K20m22o32O60j10J44j70j96N23O9n04j95K67Q18
7264C54k30n67N99m60K83J109q40j86o94J470Kj055M7L9R6M16J27J21j102J077
7284F06l07O81j43j938R45O53k52j602K084r67k22O67K3q68O46j93q66J178J11
7303B36o11n50R60j024J474r5k09M70j068l94J333p99J82p0o03M78R73j441J039
7322B81l56J259j237K1P3o44J587j486N85J31K8o77N0R38j003K53l34R97l38P11
$$ plain form
7342 839 -123 420 -14 -426 -519 125 -620 -52 -402 -640 -360 -8 -298 -376 -394 -597 202 -794 -747 -326 889
7363 889 -173 -550 -973 457 652 -69 -488 258 39 -242 55 -235 -224 453 -779 433 -1278 -523 -196
7382 -196 88 293 524 -146 307 -876 -147 409 -275 -942 -294 -170 381 -163 642 -147 -148 -11 -363 -513
7402 -513 -603 -229 71 121 324 100 633 133 -603 40 430 417 -289 530 -493 287 82 -33 216 133 -316
7423 -316 -422 433 459 387 284 -955 -795 87 -259 386 -215 -28 -497 -138 -253 554 630 239 287 -252 -624
7444 -624 -113 -160 -176 591 41 -555 -578 -863 -481 1328 -185 1855 237 119 -340 -765 324 -605 561
7463 561 127 -118 -211 1369 658 -505 -446 -451 -288 102 -891 -1027 -107 -276 -766 -206 615 -110 1222 -595
7483 -595 548 -245 504 82 -76 -897 103 957 -469 -472 224 -554 131 958 656 834 -250 -323 928
$$ packed form
7342H39r62N43m34m12r3O44p45N68l50k38K80L52k90p8j8k03P99r96M7M21J215
7363H89j062l77m23J430J95p21m19P46k19k81K97k90J1O77j232J212j711P55L27
7382a96K84K05K31o70M53j183P29N56o84o67O48J24N51n44Q05p89jJ37l52j50
7402e13r0L74L00N0K03k24N33n00p36O43L90j3p06Q19j023P80k05j15K49q3m49
7423c16j06Q55K6p2j03j239J60Q82l46O45o01J87m69L59j15Q07P6l91M8n39l72
7444f24N11m7j6P67n50n96k3k85L82J809j513K040j618j18m59m25J089r29J166
7463E61m34k45r3J580p11j163N9nJ63L90r93j36R20j69m90N60Q21p25J332j817
7483e95J143p93P49m22j58q21J000Q54j426lO96p78O85Q27l02J78j084p3J251
$$ plain form
7502 928 638 -84 -19 -1043 626 416 261 -679 815 199 -480 34 -18 1482 571 -1005 445 -124 503
7521 503 410 -499 814 183 711 705 138 -309 306 529 131 557 115 -343 -50 730 203 637 9 50 140
7542 140 -318 500 -1271 220 556 536 769 1188 490 -705 352 -126 -789 -708 1090 202 546 598 283
7561 283 -835 303 663 -382 -112 -415 -217 -77 -828 588 93 -200 -254 1193 139 -4 166 -750
7579 -750 118 -739 910 -17 51 -287 457 124 -63 812 135 15 -397 -412 422 838 307 699 -78 1066
7599 1066 987 225 -343 -992 -295 683 980 1441 -297 -47 -678 -1029 128 29 11 -218 -576 -70 -312 302
7619 302 -823 -1285 1294 -487 509 -878 362 874 622 702 -434 830 -739 -85 -911 273 -421
7636 -421 -245 -188 -998 587 707 1374 65 -468 475 532 -657 -130 560 70 272 521 78 35 -794 262
$$ packed form
7502I28k90p22O5j024J669k10j55r40J494o16o79N14n2J500r11j576J450n69O27
7521E03r3r09J313o31N28on67m47O15K23l98M26m42m58K93P80n27M34o28M1R0
7542A40m58Q18j771J491L36k0K33M19o98j195J057m78o63Q1J798q88L44N2l15
7561B83j118J138L60j045K70l03J98J40p51J416m95k93n4J447j054j43J70r16
7579g50Q68q57J649r27O8l38P44l33j87Q75o77j20m12j5Q34M16n31L92p77J144
7599A066p9p62n68o49O97R78K97M61j738K50o31l51J157r9j8k29l58N06k42O14
7619C02j125m62K579j781R96j387J240N12k52Q0j136J264j569O54q26J184o94
7636d21J76N7q10J585J20O67j309n33R43N7j189N27O90m90K02K49m43m3q29J056
$$ plain form
7656 262 90 -594 -486 -569 1061 590 -131 92 -308 511 -776 458 -739 460 -905 -34 163 586
7674 586 175 -111 411 -454 -225 1577 168 -150 408 63 607 -154 -285 714 -154 -288 -998 226 327
7693 327 -700 142 -570 -382 -365 -328 293 -520 -60 912 -53 212 -512 584 -219 -57 -46 -416 565 -379
7713 -379 960 334 286 -553 616 -225 551 -376 84 324 245 1064 -25 -791 -401 -459 -453 -160 104 -121 21
7734 21 -257 -255 667 -651 -389 392 729 338 -799 -622 154 374 -312 -667 508 142 99 53 530 189 -886
7755 -886 1 -212 -474 274 298 247 382 -137 -211 6 421 194 -66 541 190 -317 -380 547 273 -150 364
7776 364 323 131 80 302 -357 -681 331 147 116 119 314 349 342 150 448 -247 -311 352 -226 208 -274 -182 1079
7799 1079 163 -471 -155 495 477 -220 -64 -686 412 933 649 928 461 -569 716 -53 -884 -92 -66
$$ packed form
7656B62j72o84J08q3J630m71p21K23m00Q19j287J234j197J199j365Q71J97M23
7674E86m11k86N22q65K29J802j409l18N58l45N44p61j31R99q68j34p10J224J01
7693C27j027Q42p12J88J7L7O21q13M60R72r65K65p24J096q03J62J1l70R81r44
7713c79J339o26m8q39J169q41P76r27M60K40p9Q19j089p66L90n8OK93K64k25J42
7734B1k78KR22j318K62P81L37l91j137J77P76K20o86l55J175l66m3m6M77l41j075
7755h86Q87k13k62P48K4n1J35n19p4K17M15k27k60O07l51n07o3R27k74m23N14
7776C64m1j92n1K22o59l24J012j84l1LJ95L5pj92K98o95o4O63n78M34m82R2J261
7799A079r16o34L16O50j8o97J56o22J098N21k84K79m67j030J285p69q31P92K6
$$ plain form
7818 -66 285 -649 1332 -539 296 -533 -346 -155 740 134 -43 -148 112 -754 128 -255 376 83 935 -564
7838 -564 -258 -333 -1365 445 -108 -310 -776 723 408 195 -110 -314 -305 297 627 24 -1486 -426 -689
7857 -689 226 -59 148 588 83 793 76 -222 98 665 17 -1393 -451 -90 287 -313 369 1360 -746
7876 -746 459 -733 -550 543 116 19 31 766 -821 162 -1762 -844 63 -229 424 317 -732 1000
7894 1000 91 -691 -870 487 -656 241 -969 -134 -823 139 361 -734 423 455 89 -219 420 484 172
7913 172 -689 -269 199 -235 140 -251 -571 344 346 156 -548 106 -675 -405 453 107 -1030 -986 1194 78
7933 78 -702 718 298 1041 454 399 707 -192 867 -275 437 778 274 13 -815 -280 730 169 -788
7952 -788 133 184 596 273 -89 232 -314 -1217 -799 450 -526 -1086 126 939 398 -87 187 -738 532
$$ packed form
7818f6L51r34J981j871Q35q29J87J91Q95o06j77j05K60q66Q82l83O31k93Q52j499
7838e64L06p5j032J810n53k02m66J499l15k13l05k04RO02L30o03j510J060k63
7857f89R15k85K07M40n05P10p17k98L20N67o48j410R42L61L77o00O82R91k106
7876g46J205j192J83J093m27r7J2P35j587R83j924R18R07k92O53j07j049J732
7894A000r09p82j79J357j143Q97j210Q35o89R62K22j095J157L2l66l08O39O4l12
7913A72q61M20M68m34L75l91l20R15Kj90p04O54p81K70Q58l46j137M4K180j116
7933G8p80J420m20P43n87n5L08q99J059j142P12L41n04k61q28N35J010n61r57
7952g88R21N1M12l23l62L21n46r03M18J249r76n60J212Q13n41m85K74r25J270
$$ plain form
7971 532 -469 139 36 213 -131 -814 -724 -608 8 -1123 354 -382 107 -132 261 -1144 103 -242 -643
7990 -643 400 -47 -461 -96 -403 -683 -4 -1402 -32 -329 -202 126 365 -382 -1600 -72 347 -87
8008 -87 996 60 -296 87 -1082 -39 355 1049 205 936 1435 845 422 450 -283 -519 133 -909 122
8027 122 -314 135 -1226 315 -595 439 53 1388 -864 181 1354 -203 -613 154 72 -530 -745 91
8045 91 -175 -549 14 298 -62 -310 -1598 22 -5 593 -423 -726 -1111 -338 121 502 307 44 -269 -464
8065 -464 207 -512 -772 1685 390 858 -225 -827 -447 292 -853 -1468 -150 833 -986 -960 1168 243
8083 243 1765 1056 133 382 -37 688 499 1430 237 -1028 879 -303 254 618 -535 -785 1173 1171
8101 1171 -287 32 -36 -476 -635 42 180 100 317 229 505 487 348 660 89 -1005 368 -391 891 289
$$ packed form
7971E32j001O08j03J77l44o83R0J16O16j131J477p36M89k39L93j405J247l45m01
7990f43J043m47m14L65l07k80O79j398J370k97J27L28K39p47j218J528M19m34
8008h7J083r36l56L83j169J043L94O94q44P31M99n90m23K8p33k36O52j042J031
8027A22m36M49j361J541r10J034l86J335k252J045J173j557m10P67q2o02k15Q36
8045I1k66l74N63K84l60k48j288J620k7N98j016l03l85P73M59L81j95k63l13j95
8065d64O71p19k60K457j295M68j083o02L80P39j145o15J318R83j819K6K128r25
8083B43J522p09r23K49m19P25j89R31j193j265J907j182N57L64j153k50J958k
8101A171j458L19o8m40j59O77J38q0K17q8K76j8j39L12n71j094J373p59J282o02
$$ plain form
8121 289 -93 799 891 361 484 -488 -673 779 993 -1010 854 569 -332 784 1015 233 236 1649 -143
8140 -143 -795 -491 303 310 485 -209 101 684 -1378 753 168 -1519 588 -624 769 -52 -190 -483 781
8159 781 -152 805 -477 259 833 -117 1278 145 -1423 264 -238 -978 -517 28 -550 476 -972 -34
8177 -34 -241 1013 385 -217 598 -1101 -403 44 854 199 678 -182 -938 669
$$ packed form
8121B89l82Q92R2n30J23r72j85J452K14k003J864k85r01J116K31p82LJ413j792
8140a43o52L04P94PJ75o94L10N83k062K131n85j687K107j212J393q21j38k93J264
8159G81r33R57j282P36N74r50J395j133j568J687n02p40M61N45n78J026j448R38
8177c4k07J254o28o02Q15j699O98M47Q10o55M79q60p56J607
8191F69
$$ Imaginary data points
##PAGE= N=2
##DATA TABLE= (X++(I..I)), XYDATA
$$ plain form
0 0 0 0 0 0 0 0 0 0 0 0 -8 8 -8 8 -16 21 -24 30 -38 45 -54 63 -78 90 -106 124 -146 167 -194 224 -256 292
32 292 -330 376 -426 479 -537 603 -676 755 -841 934 -1036 1149 -1271 1402 -1550 1711 -1883
49 -1883 2076 -2287 2520 -2776 3061 -3379 3737 -4145 4609 -5144 5772 -6524 7435 -8566
63 -8566 10020 -11966 14709 -18892 26101 -41797 148234 -361832 -535743 385268 451480 -254915
75 -254915 -419226 183464 315664 -60088 -225266 -38404 108029 148429 -23382 -219365
85 -219365 -78064 283653 148028 -323728 -204827 344909 208327 -337366 -201479 310939
95 310939 159934 -284645 -109543 236824 27909 -186313 35238 126512 -98049 -91953 140631
106 140631 56587 -181807 -35495 177248 12750 -157753 -16916 107495 11573 -50219
$$ packed form
0@%%%%%%%%%%qJ6j6J6k4L7m5N4o8Q3r9J17j41J68j96K30k70L13l61M18m80N48
32B92o22P06q02R05j016J140j279J431j596J775j970K185k420K673k952L261l594
49a883L959m363M807n296N837o440P116p882Q754r753J0916j2296J3959j6001
63h566J8586k1986K6675l3601M4993o7898J90031n10066j73911R21011O6212p06395
75b54915j64311O02690J32200l75752j65178J86862J46433M0400j71811j95983
85b19365J41301L61717j35625m71756J18901N49736j36582n45693J35887N12418
95C10939j51005m44579J75102L46367k08915k14222K21551R1274k24561O096K32584
106A40631q4044k38394J46312K12743j64498j70503J40837J24411r5922o1792
$$ plain form
116 -50219 -9245 -33768 -1521 123360 -4345 -213258 -587 285720 16416 -344299 -35781
127 -35781 386035 57307 -385860 -80476 358258 116488 -306818 -141446 243145 163081
137 163081 -150181 -168758 54197 182139 46988 -176017 -126590 163475 213436 -133829
147 -133829 -266944 116182 305545 -84596 -306683 54798 299988 -18017 -266061 -973
157 -973 221381 26537 -158299 -42303 103202 56940 -46714 -54134 -3387 52357 49080 -50968
169 -50968 -72577 48687 79049 -41260 -80206 38036 68391 -46694 -46260 51684 13785 -59586
181 -59586 9136 66506 -32318 -85584 47553 95537 -62899 -106861 52101 107571 -40319
192 -40319 -117020 14976 107740 4358 -96839 -41925 71959 71903 -56312 -101727 22438
$$ packed form
116e0219M0974k4523L2247J24881j27705k08913K12671K86307k69304l60715L08518
127c5781M21816l28728m43167L05384M38734k41770m23306J65372L84591q0064
137A63081l13262j8577K22955J27942j35151k23005M9427K90065M9961l47265
147a33829j33115L83126J89363l90141k22087L61481K45190l18005k48044K65088
157i73K22354j94844j84836J15996J45505m6262j03654p420N0747N5744l277j00048
169e0968k1609J21264L0362j20309l8946J18242L0355j15085M34R7944l7899p3371
181e9586O8722N7370r8824n3266J33137M7984j58436m3962J58962N5470j47890
192d0319p6701J31996R2764j03382j01197N4914J13884n6j28215m5415J24165
$$ plain form
203 22438 115695 7250 -133377 -41797 139494 62104 -132939 -85848 113941 106263 -94551
214 -94551 -116722 71023 115348 -38385 -109822 7048 103162 18908 -88261 -39728 69711
225 69711 61659 -44709 -73113 32449 78650 -10958 -69788 -5003 70437 20315 -59573 -20314
237 -20314 50717 27377 -30919 -24753 26487 25988 -15676 -13220 9834 10782 -567 -5277 5538
250 5538 4969 -7587 3198 10735 -1086 -11832 -3448 19936 8110 -24607 -11432 22321 16613
263 16613 -20014 -27585 17175 32028 -15316 -34651 4213 33599 2506 -38232 -11260 31444
275 31444 13478 -26795 -25430 17691 29516 -17004 -33197 6188 29765 250 -35108 -10428
287 -10428 29216 9384 -25830 -17600 15879 19798 -15920 -22489 10595 15977 -4491 -16954 -2149
$$ packed form
203B2438R3257j08445j40627R1580J81291p7390j95043M7091J99789p678k00814
214i4551k2171J87745M4325j53733p1437J16870R6114q4254j07169M8533J09439
225F9711q052j06368k8404J05562M6201q9608n8830O4785P5440n0122p9888L9259
237b0314P1031k3340n8296O166N1240m99m1664K456K3054R48j1349m710J0815
250E538n69j2556J0785P537j1821j0746Q384K3384j1826l2717J3175L3753n708
263A6613l6627p571M4760J4853m7344j9335L8864K9386l1093m0738K6972M2704
275C1444j7966m0273J365M3121J1825m6520j6193L9385K3577k9515l5358K4680
287a0428L9644j9832l5214Q230L3479L919l5718o569L3084N382k0468j2463J4805
$$ plain form
300 -2149 16213 2027 -12475 -3154 6567 6532 -3724 -8547 6289 6567 -1912 -2672 -537 5690 2433
315 2433 -3657 2592 3112 821 1843 -390 4020 2168 -2018 5383 2141 -647 1958 1696 3918 549
331 549 -1635 5823 1990 -1933 1271 2472 3304 -550 -2287 6139 1914 -2560 886 1204 3061 -1371
347 -1371 -3380 4061 892 -2650 -810 -7 3340 -1762 -4955 2707 1421 -2747 -2642 -3000 3033 -356
363 -356 -6225 -1009 1237 570 -3463 -5813 3535 2657 -6926 -2539 1083 740 -2618 -7530 2920 4339
379 4339 -5432 -5261 -312 5365 -1628 -9954 748 7100 -1667 -5344 -3484 5450 4098 -6940 -3883
394 -3883 3631 3825 -740 -7571 518 8030 567 -4541 -3125 4620 8034 -3868 -5095 4224 5470
409 5470 3983 -4378 -2675 7562 6575 -492 -3867 -1322 9253 4934 -6243 -3699 6096 11223 447
$$ packed form
300b149J8362j4186j4502R321R721l5j0256m823J4836K78q479p60K135O227l257
315B433o090O249N20k291J022k233M410j852m186P401l242k788K605k62K222l369
331E49k184P458l833l923L204J201Q32l854j737Q426m225m474L446L18J857m432
347a371k009P441l169l542J840Q03L347n102l193P662j286m168J05l58O033l389
363c56n869N216K246o67m033k350R348q78r583M387L622l43l358m912J0450J419
379D339r771J71M949N677o993q326J0702O352q767l677J860Q934j352j1038L057
394c883P514J94m565o831Q089P512p463n108J416P745L414j1902j227R319J246
409E470j487q361J703J0237r87p067l375K545J0575m319j1177K544R795N127j0776
$$ plain form
424 447 -11984 2793 13252 4248 -10182 -10017 11874 14354 -8157 -13222 3086 18551 4098
437 4098 -20488 -7967 19198 11969 -14906 -17964 11563 21444 -9283 -22831 1511 19421 4374
450 4374 -19099 -9790 15424 10140 -8882 -15367 136 15629 2967 -18461 -8514 10457 12559
463 12559 -11340 -18138 5826 12872 -2013 -11883 -6499 6473 5887 -3419 -7724 -8610 4571 16007
477 16007 -6190 -22694 -383 26430 8439 -33659 -15340 33137 20264 -26621 -27224 19052
489 19052 34278 -9202 -33691 -1384 34423 20072 -29562 -34201 25282 48109 -12087 -57131
501 -57131 1208 68012 12022 -68925 -19282 67139 32142 -56663 -39173 49143 46411 -32365
513 -32365 -43169 14261 44080 6065 -37495 -20144 30371 36189 -16658 -48865 8111 55460
$$ packed form
424D47j2431J4777J0459r004j4430J65K1891K480k2511n065J6308J5465j4453
437D098k4586J2521K7165p229k6875l058K9527R881l0727j3548K4342J7910j5047
450D374k3473R309K5214n284j9022o485J5503J5493j2662k1428R947J8971K102
463A2559k3899o798K3964P046j4885r870N384J2972n86r306m305q86J3181J1436
477A6007k2197j6504K2311K6813j7991m2098J8319M8477j2873m6885o03M6276
489A9052J5226m3480k4489L2307L5807j4351m9634m639N9483K2827o0196m5044
501e7131N8339O6804n5990q0947M9643Q6421l4997q8805J7490Q8316k732p8776
513c2365j0804N7430K9819l8015m3560J7351N0515N818n2847l2207N6976M7349
$$ plain form
525 55460 -210 -55450 -7203 54688 13875 -49772 -13481 39246 8716 -25690 -4620 10818
537 10818 -4659 -683 13450 -9029 -25563 15516 31973 -19484 -37214 13740 37644 -10703
549 -10703 -38453 1018 25884 6396 -13160 -22823 -8025 31932 24567 -41151 -48889 44512 70429
562 70429 -48923 -86467 44555 95238 -35359 -102701 20054 100488 -6314 -90437 -12690
573 -12690 71858 31967 -50970 -46962 27073 58886 2518 -69190 -30826 75596 55954 -75487
585 -75487 -71623 71785 89003 -62440 -92924 55491 91152 -39432 -77697 24435 66286
596 66286 -8642 -44856 -645 23658 13573 -1200 -19507 -15188 25739 28912 -24238 -37556
608 -37556 24936 40200 -23809 -32455 21391 19325 -19155 -3832 19278 -12919 -21780 35253 24795
$$ packed form
525E5460n5670n5240M8247O1891m0813o3647L6291N2727l0530l4406K1070J5438
537A0818j5477L976J4133k2479j6534M1079J6457n1457j7730N0954K3904m8347
549a0703k7750L9471K4866j9488j9556r663J4798L9957p365o5718p738R3401K5917
562G0429j19352l7544J31022N0683j30597o7342J22755Q0434j06802q4123P7747
573a2690Q4548l9891q2937M008P4035L1813n6368p1708L8364J06422j9642j31441
585g5487L864J43408J7218j51443l0484J48415L5661j30584l8265J02132M1851
596F6286p4928l6214M4211K4303j0085j4773j8307M319M0927L173n3150j3318
608c7556O2492J5264o4009q646N3846k066l8480J5323K3110l2197q861N7033j0458
$$ plain form
621 24795 -53009 -27349 61960 33792 -68642 -42205 66926 47698 -61387 -52957 43765 55463
633 55463 -23897 -57473 -965 50038 25089 -43958 -56457 31200 80613 -22259 -99277 3185
645 3185 107544 11593 -116558 -30510 109817 39792 -99429 -53363 78709 61435 -57779
656 -57779 -67171 32294 63180 -5140 -59610 -20146 52974 40204 -41353 -55489 29370 67377
668 67377 -19023 -69727 12725 69016 -3653 -58053 -2330 50103 5273 -35202 -2637 21882
680 21882 2045 -6917 4160 2063 -8788 3032 16379 -2967 -16452 3757 18713 5573
692 5573 -16307 -13107 13092 22278 -2261 -30684 -8654 41561 20581 -47082 -31857 45104 45360
705 45360 -41168 -55274 34775 62857 -23609 -65979 6006 68699 10893 -66455 -27722 56470
$$ packed form
621B4795p7804K5660Q9309k8168j02434K6437J09131j9228j09085Q430R6722J1698
633E5463p9360l3576N6508N1003k4949o9047j2499Q7657M9413j02872p7018J02462
645C185J04359r5951j28151Q6048J40327p0025j39221M6066J32072j7274j19214
656e7779r392R9465L0886o8320n4470L9464P3120j2770q1557j4136Q4859L8007
668F7377q6400n0704Q2452N6291p2669n4400N5723N2433m4830m0475L2565K4519
680B1882j9837q962J1077k097j0851J1820J3347j9346j3485K0209J4956j3140
692E573k1880L200K6199R186k4539k8423K2030N0215k0980o7663J5225P6961K56
705D5360q6528j4106R0049K8082q6466m2370P1985O2693n7806p7348L8733Q4192
$$ plain form
717 56470 41883 -44366 -57068 29927 65989 -17580 -71733 -1429 69860 13722 -69168 -28065
729 -28065 60043 35799 -48597 -45599 33361 48825 -21758 -48609 5968 43544 5842 -41349
741 -41349 -16774 33356 20147 -26156 -23667 18863 25863 -13769 -22129 11140 17615 -4926 -12336
754 -12336 4112 8740 -6870 -3779 10029 234 -10229 1396 12454 1571 -14187 -5663 16710
767 16710 9416 -13075 -13943 11222 23241 -6124 -28268 2239 33547 7364 -34912 -14019 37465
780 37465 19528 -34796 -26025 30913 33873 -22263 -37102 17015 38092 -6141 -36698 -3610
792 -3610 33631 13150 -31452 -22230 24668 28330 -16058 -33389 11151 35735 -5609 -34835 -2571
805 -2571 31555 5619 -29429 -11665 25253 12341 -16601 -16268 11376 14468 -9564 -14440 3515
$$ packed form
717E6470j4587q6249j2702Q6995L6062q3569n4153P0304P1289n6138q2890M1103
729b8065Q8108k4244q4396K998P8960J5464p0583k6851N4577L7576l7702m7191
741d1349K4575N0130j3209m6303K489M2530P000l9632q360L3269O475k2541p410
754a2336J6448M628j5610L091J3808r795j0463J1625J1058j0883j5758Q524K2373
767A6710p294k2491q68K5165J2019k9365k2144L0507L1308k6183m2276K0893N1484
780C7465j7937n4324Q771N6938K960n6136j4839N4117K1077m4233l0557L3088
792c610L7241k0481m4602R222M6898L662m4388j7331M4540K4584m1344k9226L2264
805b571L4126k5936l5048J7764L6918j2912k8942L33K7644L092k4032m876J7955
$$ plain form
818 3515 9936 -600 -9693 -3522 8568 2927 -8639 -4807 5234 3684 -9268 -5238 8161 775
832 775 -8954 -1977 7402 2542 -10848 -957 10123 315 -9979 -2577 9636 5038 -12314 -6815
846 -6815 10288 7268 -7602 -8583 4689 12548 -413 -11398 1318 12370 5099 -11353 -7025
859 -7025 12881 8900 -8168 -8406 8231 11684 -4159 -10747 4895 10267 -521 -7710 -912 9304
873 9304 3191 -7182 -3409 6294 5571 -2752 -5041 3902 6824 -2720 -6238 273 4555 1059 -6227
888 -6227 82 3039 355 -2121 -2291 1910 2198 -4192 -508 647 103 -1404 -2806 736 1851 -1928
904 -1928 -1029 42 1170 -810 -2463 -152 1586 -2119 -1935 792 -101 -1751 -2477 178 1640 -1513
920 -1513 -1273 24 -638 -542 -1754 -474 797 -557 -344 -1332 618 319 -953 -823 747 -124 -170 -602
$$ packed form
818C515O421j0536r093O171J2090n641j1566L832J0041j550j2952M030J3399p386
832G75r729O977R379m860j3390R891J1080r808j0294P402J2213m598j7352N499
846f815J7103l020j4870r81J3272P859j2961j0985J2716J1052p271j6452M328
859g025J9906l981j7068k38J6637L453j5843o588J5642N372j0788p189O798J0216
873I304o113j0373L773R703p23q323k289Q943K922r544l518O511M282l496p286
888f227O309K957k684k476j70M201K88o390L684J155n44j507j402L542J115l779
904a928Q99J071J128j980j653K311J738l705J84K727q93j650p26K655J462l153
920a513K40J297o62R6j212J280J271j354K13r88J950k99j272J30J570q71m6m32
$$ plain form
938 -602 444 1122 -822 554 2239 52 869 3 420 808 -1220 873 1423 -2025 -636 1603 1370
955 1370 373 -2341 1789 3368 -84 -1966 -149 2924 3240 -2808 -2649 2680 2897 -241 -4417 392
971 392 6610 1220 -4288 -1445 4076 3695 -4446 -4531 4141 2896 -619 -4667 -1097 4457 1234 -4874
987 -4874 -3430 2346 3497 -1479 -5999 872 4160 1798 -3015 -4759 1412 4710 -2238 -5607 -1697
1002 -1697 3520 2933 -5568 -4582 2137 3805 -318 -7027 -966 6488 1717 -5058 -5345 3017 7048 -2199
1018 -2199 -8206 1042 7532 4650 -8822 -6677 8318 8287 -5894 -10091 2652 10972 253 -10349
1032 -10349 -2035 8157 5727 -6242 -8321 4564 9756 459 -7906 -4056 9469 7766 -7814
1045 -7814 -8274 5989 11659 -667 -10925 637 10903 3463 -5717 -6765 2522 7694 2262 -7907
$$ packed form
938f02J046O78j944J376J685k187Q17q66M17L88k028K093N50l448J389K239k33
955A370r97k714M130J579l452j882J817L073L16o048J59N329K17l138m176M809
971C92O218n390n508K843N521l81q141q5Q672j245l515m048L570N554l223o108
987d874J444N776J151m976m520O871L288k362m813j744O171L298o948l369L910
1002a697N217n87q501R86O719J668m123o709O061P454m771o775k87Q362M031r247
1018b199o007R248O490k882j3472K145J4995l1j4181m197J2743Q320j0719j0602
1032a0349Q314J0192k430j1969k079J2885N192r297q365L850J3525j703j5580
1045g814m60J4263N670j2326j0258J1562J0266p440r180j048R287N172n432j0169
$$ plain form
1059 -7907 -5635 7247 10171 -5336 -14489 4375 16843 -180 -16851 -4506 14956 7657 -14143
1072 -14143 -10251 7330 13222 -2921 -16482 -4160 14778 9853 -13382 -18994 11348 22851 -8521
1085 -8521 -25580 1352 26207 2535 -27356 -7977 23417 10146 -19905 -15377 12935 16288
1097 16288 -5769 -15947 -2358 14570 11153 -13616 -16276 8556 19790 -5199 -22320 1921
1109 1921 22067 1628 -19796 -4602 15664 6795 -8126 -6098 3374 4376 3121 -294 -8836
1122 -8836 -1969 13424 7364 -13006 -11582 15355 14554 -11836 -15811 8524 16964 -417 -14984
1135 -14984 -4630 12870 13601 -6122 -18290 1127 25487 7885 -29008 -14175 27588 23682
1147 23682 -25311 -29735 23668 34052 -16369 -33964 7154 35223 14 -32204 -10075 24669
$$ packed form
1059g907K272J2882K924j5507r153J8864J2468j7023j6671J2345J9462p299k1800
1072a4143L892J7581N892j6143j3561J2322J8938m925k3235n612L0342J1503l1372
1085h521j7059K6932K4855k3672k9891J9379L1394j3271l0051M528K8312L353
1097A6288k2057j0178J3589J6928l417k4769k660K4832J1234k4989j7121K4241
1109A921K0146k0439k1424J5194K0266q869j4921K028R472J002j255l415q542
1122h836O867J5393o060k0370J424K6937q01k6390l975K4335Q440j7381j4567
1135a4984J0354J7500P31j9723j2168J9417K4360j7602l6893J4833M1763l906
1147B3682m8993m424N3403J0384n0421j7595M1118K8069l5209l2218K2129L4744
$$ plain form
1159 24669 17173 -17927 -26200 9409 30618 -168 -32850 -9966 33466 16802 -31372 -22085
1171 -22085 26075 24563 -20965 -29332 12341 26467 -7674 -23519 -162 15832 3813 -12584
1183 -12584 -6489 2790 7200 2309 -9623 -7922 7906 11204 -4165 -10525 -1290 10208 4675 -7189
1197 -7189 -5987 1496 8595 4765 -7909 -10123 5084 17691 826 -22736 -4163 28138 9307
1210 9307 -27216 -16630 29373 24437 -25006 -27983 18444 31014 -8640 -31634 834 32174
1222 32174 9334 -28287 -17620 22378 26643 -15559 -32088 7206 37203 2118 -37342 -10799
1234 -10799 37458 17991 -34643 -23450 28588 27442 -21642 -30116 13422 27246 -5988 -23347
1246 -23347 -1799 19117 7097 -13147 -11483 7858 11487 -1793 -16187 -4473 15817 4866
$$ packed form
1159B4669p496l5100q273L5609K1209l0786l2682K2884M3432j6664m8174R287
1171b2085M8160j512m5528q367M1673J4126l4141j5845K3357J5994j2019j6397
1183a2584O095R279M410m891j1932J701J5828L298j5369o360R235J1498n533j1864
1197g189J202P483P099l830j2674k214J5207J2607j6865k3562J8573L2301j8831
1210I307l6523J0586M6003m936m9443k977M6427J2570l9654k2994L2468L1340
1222C2174k2840l7621J0667L9998M265m2202j6529L9294K9997l5085l9460K6543
1234a0799M8257j9467n2634J1193N2038j146m9084q474M3538J3824l3234j7359
1246b3347K1548K0916j2020k0244J664J9341L629j3280j4394J1714K0290j0951
$$ plain form
1258 4866 -15741 -7768 13260 6290 -10293 -3256 5576 -550 -3830 3741 3896 -8993 -3111 15023
1272 15023 3277 -20502 -6544 20131 8501 -21206 -13351 18127 13685 -13271 -16892 6806
1284 6806 16514 150 -18500 -8549 17130 17367 -13137 -25126 10793 31952 -6593 -34668 583
1297 583 36706 6465 -35555 -9762 33164 13917 -26178 -15521 21452 19149 -11685 -17290 5061
1310 5061 17349 2814 -18012 -9872 16810 16021 -11489 -18671 9551 22780 -7649 -23182 6961
1323 6961 19864 -3863 -16848 2217 13507 -3467 -10739 1852 7333 -2151 -3751 2623 628
1336 628 -3436 1620 1885 -1337 -3335 794 430 -718 -1247 -4175 -1389 4303 5463 -8177 -8061 9329
$$ packed form
1258D866k0607P973K1028o970j6583P037Q832o126l280P571J55j2889N882J8134
1272A5023j1746k3779J3958K6675j1630k9707P855L1478m442k6956l621K3698
1284F806R708j6364j8650R951K5679K37l0504j1989L5919K1159l8545k8075L5251
1297E83L6123l0241m2020K5793M2926j9247m0095J0657L6973k303l0834n605K2351
1310E061J2288j4535k0826Q140K6682p89k7510p182K8222J3229l0429j5533L0143
1323F961J2903k3727j2985J9065J1290j6974p272J2591N481r484j600O374j995
1336F28m064N056K65l222j998M129l64j148n29k928K786N692J160j3640J16J7390
$$ [...]
8191H50
##END NTUPLES=NMR FID
##END=
