##TITLE=1H_Pr Cl è Cl
 CCl4, 8 sc, 
 22.9.2020
##JCAMPDX= 6.0         $$ Bruker NMR JCAMP-DX V2.0
##DATA TYPE= NMR FID
##DATA CLASS= NTUPLES
##ORIGIN= UXNMR, Bruker Analytische Messtechnik GmbH
##OWNER= root
$$ XWIN-NMR		Version 3.5
$$ Tue Sep 22 11:47:07 2020 Russian Standard Time (UT+4h)  she@DPX200
##.OBSERVE FREQUENCY= 200.1315066352
##.OBSERVE NUCLEUS= ^1H
##.DELAY= (6, 6)
##.ACQUISITION MODE= SIMULTANEOUS
##.ACQUISITION SCHEME= undefined
##.AVERAGES= 8
##.DIGITISER RES= 18
##SPECTROMETER/DATA SYSTEM= spect
##.PULSE SEQUENCE= zg30
##.SOLVENT NAME= D2O
##.SHIFT REFERENCE= (INTERNAL, D2O, 0, 15.7039)
##AUDIT TRAIL= $$ (NUMBER, WHEN, WHO, WHERE, WHAT)
$$ ##TITLE= Audit trail, XWIN-NMR		Version 3.5
$$ ##JCAMPDX= 5.01
$$ ##ORIGIN= Bruker BioSpin GmbH
$$ ##OWNER= she
$$ F:/spectra/data/she/nmr/H-F/1/audita.txt
$$ ##AUDIT TRAIL=  $$ (NUMBER, WHEN, WHO, WHERE, WHAT)
(   1,<2020-09-22 11:46:02.65 +0400>,<she>,<DPX200>,
      <created by zg, POWCHK disabled, PULCHK disabled
       configuration hash MD5:
       00 E9 B6 7A A2 85 ED C7 34 08 36 98 17 FE 4E 26
       data hash MD5: 16K
       FF EE 0D 1B 46 8E 48 CC 19 DA F7 A2 79 08 BC 4C>)
$$ ##END=
$$ 
$$ hash MD5
$$ BD 36 62 6E 71 8F 6A 49 53 68 1E 9E 18 B0 6B 0C
##$RELAX= 
##$RELAX= 
##$RELAX= 
##$RELAX= 
##$RELAX= 
##$RELAX= 
$$ Bruker specific parameters
$$ --------------------------
##$DU= <F:/spectra>
##$EXPNO= 1
##$NAME= <H-F>
##$PROCNO= 1
##$TYPE= <nmr>
##$USER= <she>
##$AMP= (0..31)
100 100 100 100 100 100 100 100 100 100 100 100 100 100 100 100 100 100 
100 100 100 100 100 100 100 100 100 100 100 100 100 100 
##$AQSEQ= 0
##$AQ_mod= 1
##$AUNM= <au_zg>
##$AUTOPOS= <>
##$BF1= 200.13
##$BF2= 200.13
##$BF3= 200.13
##$BF4= 200.13
##$BF5= 200.13
##$BF6= 200.13
##$BF7= 200.13
##$BF8= 200.13
##$BYTORDA= 1
##$CFDGTYP= 0
##$CFRGTYP= 5
##$CHEMSTR= <none>
##$CNST= (0..31)
1 1 145 1 1 1 1 1 1 1 1 1 1 1 1 1 1 1 1 1 1 1 1 1 1 1 1 1 1 1 1 1 
##$CPDPRG= <>
##$CPDPRG1= <>
##$CPDPRG2= <>
##$CPDPRG3= <>
##$CPDPRG4= <mlev>
##$CPDPRG5= <mlev>
##$CPDPRG6= <mlev>
##$CPDPRG7= <mlev>
##$CPDPRG8= <mlev>
##$CPDPRGB= <>
##$CPDPRGT= <>
##$D= (0..31)
0 1.2 0 0 0 0 0 0 0 0.06 0 0.03 0 0 0 0 0.0002 0 0 0 0 0 0 0 0 0 0 0 0 
0 0 0 
##$DATE= 1600760762
##$DBL= (0..7)
120 120 120 120 120 120 120 120 
##$DBP= (0..7)
150 150 150 150 150 150 150 150 
##$DBP07= 0
##$DBPNAM0= <>
##$DBPNAM1= <>
##$DBPNAM2= <>
##$DBPNAM3= <>
##$DBPNAM4= <>
##$DBPNAM5= <>
##$DBPNAM6= <>
##$DBPNAM7= <>
##$DBPOAL= (0..7)
0.5 0.5 0.5 0.5 0.5 0.5 0.5 0.5 
##$DBPOFFS= (0..7)
0 0 0 0 0 0 0 0 
##$DE= 6
##$DECBNUC= <off>
##$DECIM= 32
##$DECNUC= <off>
##$DECSTAT= 4
##$DIGMOD= 1
##$DIGTYP= 9
##$DL= (0..7)
0 120 120 120 120 120 120 120 
##$DP= (0..7)
150 150 150 150 150 150 150 150 
##$DP07= 0
##$DPNAME0= <>
##$DPNAME1= <>
##$DPNAME2= <>
##$DPNAME3= <>
##$DPNAME4= <>
##$DPNAME5= <>
##$DPNAME6= <>
##$DPNAME7= <>
##$DPOAL= (0..7)
0.5 0.5 0.5 0.5 0.5 0.5 0.5 0.5 
##$DPOFFS= (0..7)
0 0 0 0 0 0 0 0 
##$DQDMODE= 0
##$DR= 18
##$DS= 0
##$DSLIST= <SSSSSSSSSSSSSSS>
$$ [...]
##$SUBNAM2= <"">
##$SUBNAM3= <"">
##$SUBNAM4= <"">
##$SUBNAM5= <"">
##$SUBNAM6= <"">
##$SUBNAM7= <"">
##$SUBNAM8= <"">
##$SUBNAM9= <"">
##$SW= 16.880792210976
##$SWIBOX= (0..15)
0 0 2 0 0 0 0 0 0 0 0 0 0 0 0 0 
##$SW_h= 3378.37837837838
##$TD= 16384
##$TD0= 1
##$TE= 0
##$TE2= 300
##$TE3= 300
##$TEG= 300
##$TL= (0..7)
0 120 120 120 120 120 120 120 
##$TP= (0..7)
150 150 150 150 150 150 150 150 
##$TP07= 0
##$TPNAME0= <>
##$TPNAME1= <>
##$TPNAME2= <>
##$TPNAME3= <>
##$TPNAME4= <>
##$TPNAME5= <>
##$TPNAME6= <>
##$TPNAME7= <>
##$TPOAL= (0..7)
0.5 0.5 0.5 0.5 0.5 0.5 0.5 0.5 
##$TPOFFS= (0..7)
0 0 0 0 0 0 0 0 
##$TUNHIN= 0
##$TUNHOUT= 0
##$TUNXOUT= 0
##$USERA1= <user>
##$USERA2= <user>
##$USERA3= <user>
##$USERA4= <user>
##$USERA5= <user>
##$V9= 5
##$VALIST= <valist>
##$VCLIST= <CCCCCCCCCCCCCCC>
##$VD= 0
##$VDLIST= <DDDDDDDDDDDDDDD>
##$VPLIST= <PPPPPPPPPPPPPPP>
##$VTLIST= <TTTTTTTTTTTTTTT>
##$WBST= 1024
##$WBSW= 4
##$XGAIN= (0..3)
0 0 0 0 
##$XL= 0
##$YL= 0
##$YMAX_a= 540827
##$YMIN_a= -494005
##$ZGOPTNS= <>
##$ZL1= 120
##$ZL2= 120
##$ZL3= 120
##$ZL4= 120
##$ABSF1= 10
##$ABSF2= 0
##$ABSG= 5
##$ABSL= 3
##$ALPHA= 0
##$AQORDER= 0
##$ASSFAC= 0
##$ASSFACI= 0
##$ASSFACX= 0
##$ASSWID= 0
##$AUNMP= <proc_1d>
##$AZFE= 0.1
##$AZFW= 0.1
##$BCFW= 1
##$BC_mod= 2
##$BYTORDP= 1
##$COROFFS= 0
##$CY= 11.3945322036743
##$DATMOD= 1
##$DC= 2
##$DFILT= <>
##$DTYPP= 0
##$F1P= 16.9975609425685
##$F2P= -3.02152046262296
##$FCOR= 0.5
##$FTSIZE= 0
##$FT_mod= 4
##$GAMMA= 1
##$GB= 0.15
##$INTBC= 1
##$INTSCL= 1
##$ISEN= 128
##$LB= 0.24
##$LEV0= 0
##$LPBIN= 0
##$MAXI= 10000
##$MC2= 0
##$MEAN= 0
##$ME_mod= 0
##$MI= 1.114404
##$NCOEF= 0
##$NC_proc= 0
##$NLEV= 6
##$NOISF1= 3.799351
##$NOISF2= 2.8
##$NSP= 1
##$NTH_PI= 0
##$NZP= 0
##$OFFSET= 15.70392
##$PC= 1
##$PHC0= -9969.62
##$PHC1= 13.0009
##$PH_mod= 1
##$PKNL= yes
##$PPARMOD= 0
##$PSCAL= 0
##$PSIGN= 0
##$REVERSE= no
##$SF= 200.130013532006
##$SI= 16384
##$SIGF1= 3
##$SIGF2= 2
##$SINO= 400
##$SIOLD= 16384
##$SREGLST= <1H.CDCl3>
##$SSB= 0
##$STSI= 0
##$STSR= 0
##$SW_p= 3612.71676300578
##$SYMM= 0
##$S_DEV= 0
##$TDeff= 0
##$TDoff= 0
##$TI= <>
##$TILT= no
##$TM1= 0
##$TM2= 0
##$TOPLEV= 0
##$USERP1= <user>
##$USERP2= <user>
##$USERP3= <user>
##$USERP4= <user>
##$USERP5= <user>
##$WDW= 1
##$XDIM= 8192
##$YMAX_p= 0
##$YMIN_p= 0
$$ End of Bruker specific parameters
$$ ---------------------------------
##NTUPLES= NMR FID
##VAR_NAME=  TIME,          FID/REAL,        FID/IMAG
##SYMBOL=    X,             R,               I
##VAR_TYPE=  INDEPENDENT,   DEPENDENT,       DEPENDENT
##VAR_FORM=  AFFN,          ASDF,            ASDF
##VAR_DIM=   8192,          8192,            8192
##UNITS=     SECONDS,       ARBITRARY UNITS, ARBITRARY UNITS
##FACTOR=    0.000296,      1,               1
##FIRST=     0,             0,               0
##LAST=      2.424536,      0,               0
##MIN=       0,             -494005,         0
##MAX=       2.424536,      540827,          0
$$ Real data points
##PAGE= N=1
##DATA TABLE= (X++(R..R)), XYDATA
0@%%%%%%%%%%%qJ6j6J6k4L8m7N7p2Q8j08J33j63J98k35K78l29L86m50N23o04O94
33C71p93R02j026J165j316J482j669J873k095K338k602K891l208L553l929M339
49B276m786N274n806O391p036P745q522R379j0334J1404j2606J3965j5514J7291
63I121j9344K1723k4458K7479l0249K9720j2804N15145r92494O47868J8266n88497
75c98524P62118n13882P6805K27363k06283q5039L98177m66412J91398K86945
85B72666o84053P51240m35559q9082N36130o82968M99990j49033j37382K11181
95I3130r6571m8726O0032J08944l46280M61622l23725l8448M39061o49841N45167
106B04365j83626k26261M57395m03985J41978J28211k19265P9026J75550l39023
$$ plain form
0 0 0 0 0 0 0 0 0 0 0 0 0 -8 8 -8 8 -16 22 -25 32 -40 48 -60 73 -90 108 -127 151 -178 208 -242 281 -323 371
33 371 -422 480 -546 619 -697 785 -884 989 -1106 1232 -1370 1521 -1687 1866 -2063 2276
49 2276 -2510 2764 -3042 3349 -3687 4058 -4464 4915 -5419 5985 -6621 7344 -8170 9121
63 9121 -10223 11500 -12958 14521 -15728 13992 1188 516333 -476161 171707 189973 -398524
75 -398524 363594 -150288 -73483 153880 -52403 -137442 260735 -205677 -14279 272666
85 272666 -411387 339853 -95706 -184788 351342 -331626 168364 19331 -118051 93130
95 93130 -3441 -52167 7865 116809 -229471 232151 -91574 -130022 309039 -340802 204365
106 204365 20739 -205522 251873 -152112 -10134 118077 -101188 -22162 153388 -185635
116a85635K62532M4347m09551O03805m89303J08736L35107o02029N57915k49151
126b3227j31733L70029l57809J48305R1390j96359J09818Q8707k44485K35063
136H9699n1521j97753L58999l33057J35705J16908k82849K83618j46413k4552
146e1216J20507r9251M937O9890n3966m8979J65324k02713J16076N5937k14987
157a38441K64708j73582k568J58714k05013J24064J9472j25808J24079j9322j11443
168h5140J73279j15847l2755J82114k37908J61125O422j68160K33693j71398K5738
179b8837J13022j67280J15942m446q9576J08253m6868m6799J07024r3354J5955
190a6964P3934j19963R5236j7695o2203R7284p3268J2862M0826n5001K7016J7572
$$ plain form
116 -185635 76897 121244 -288307 315498 -173805 -65069 270038 -331991 225924 -23227
126 -23227 -154960 215069 -142740 5565 96955 -99404 10414 99121 -145364 89699
136 89699 38178 -159575 199424 -133633 2072 118980 -163869 119749 -26664 -51216
146 -51216 69291 -29960 -25023 44867 -9099 -58078 107246 -95467 20609 76546 -138441
157 -138441 126267 -47315 -49883 108831 -96182 27882 47354 -78454 45625 26303 -85140
168 -85140 88139 -27708 -60463 121651 -116257 44868 51290 -116870 116823 -54575 -28837
179 -28837 84185 -83095 32847 28401 -61175 47078 210 -46589 60435 -32919 -16964
190 -16964 56970 -62993 32243 14548 -47655 49629 -23639 -10777 30049 -24952 2064 19636
202A9636m2736K9339J2975n2847N9285k5622k7753O7109o6494K6106K8739o3560
214c5823N7049j5559l2744N6265m0551k456M4300n7306L2495J3817n2232N8699
226B5954l0225j4882M9449n3695K7025J2543m0531M1919j8772j2379L1876k9155
238a0873Q396J5295k6536J9741j733j5589K1861j4107j122J3779j6104P853L916
251D777j1328J0235k428n962Q959m872k461P738p543K127M827q725O680m23n663
266d062Q386n743o83N982p314M220J274n252N869l262r45M193m690K242J185l603
282b203L623j551j004K309k076J023P48j679J234m07l80O58k98Q9n3r2J80j44
300b3j62J96L4j18J09j47M28k57j34j70L49K7o0l29N0K14n7nr0Q9J02l9n7L07
$$ plain form
202 19636 -23100 6239 19214 -33633 25652 30 -27723 39386 -27108 -1002 27737 -35823
214 -35823 21226 5667 -27077 29188 -11363 -13819 30481 -26825 5670 19487 -32745 25954
226 25954 -4271 -19153 30296 -23399 3626 16169 -24362 17557 -1215 -13594 18282 -10873
238 -10873 -2477 12818 -13718 6023 4290 -11299 10562 -3545 -4667 9112 -6992 861 4777
251 4777 -6551 3684 1256 -4706 4253 -619 -3080 4658 -2885 -758 4069 -4656 2024 1601 -4062
266 -4062 4324 -1419 -2102 3880 -3434 786 2060 -3192 2677 -585 -1530 2663 -2027 215 1400 -2203
282 -2203 1420 -131 -1135 1174 -902 121 869 -810 424 17 -363 295 -3 86 33 -59 121 -23
300 -23 -185 11 45 -73 36 -111 317 60 -74 -244 105 132 72 -257 -207 7 -50 -55 -145 -56 46 7 -50 257
324B57n27L85j69K06p4l5k01J99N4j91J88K8m22K71K5m7L02n96L44K27p00P26
346B50n39K59K32n57P94n50l4L27o76P39k59l32O50m08M9N28r42Q75r0r12J516
367I20j493M63J086j916J686n92j215K509k065P5K172l093J918P01l354M346k387
384b39j418M816n867L063J657n382N850k333k753O273n888J072M714p508N278
399A335R82p395R854n881k088R065j1109O512J948q987R833l769m299Q984p087
414b102j077R765j2050N919N793j5657J6739p718o502J7458j7916P341P199j6189
428h997J3518q91j3081J7645q648q818K3563k4898J0227J3286l0959L1654j4836
441a235j0329K8735k9317J2904Q851k2179J8442o35j8091K3550j0655j2905L1996
$$ plain form
324 257 -270 115 -54 152 78 43 -158 41 95 -96 92 120 -302 -31 -6 -53 249 -347 -3 224 -476 250
346 250 -289 -30 202 -355 439 -111 -145 182 -494 245 -14 -346 304 -104 -55 473 -469 406 316 -596 920
367 920 -573 -110 976 -940 746 154 -1061 1448 -617 -542 1630 -1463 455 1156 -2198 2148 -239
384 -239 -1657 3159 -2708 355 2012 -3370 2480 147 -2606 3667 -2221 -1149 3565 -3943 1335
399 1335 2317 -5078 4776 -1105 -3193 5872 -5237 1275 3223 -5764 4069 300 -3999 4985 -2102
414 -2102 -3179 6586 -5464 455 6248 -9409 7330 -388 -6890 10568 -7348 -7 7192 -8997
428 -8997 4521 3630 -9451 8194 -454 -9272 14291 -10607 -380 12906 -18053 13601 -1235
441 -1235 -11564 17171 -12146 758 9609 -12570 5872 5237 -12854 10696 41 -12864 19132
454A9132l3620J4428J4612l6381L8248j8977q616K7237k6737J0019R836j7513
466h332P084J3403k8207K4004L40l0884M7969l9470Q017K8852m9229M1628j2183
479B992j9557L3441k1745n695K7579k6020m43L4952n3525M0953k2m6849P1439
492C7500n8981J6265L2685o0352N2609j7978j9298L5519k2133q314L1595k8947
504i830m19L8386n9225M6557n124m2080O8196n9028K1135K1450m3787L6945j0536
517B640j3087J6031L078k8381L7397j7891k2310N9260o9169M2119Q985n4830O9751
530C3593m7513M286L1954l9622J7352J5841l3198J9352J9232n6308O3572l1595
542c054k4805P3753q6548N5222K739n4824P3051n0583O104L0436l7811J5014J7912
$$ plain form
454 19132 -14488 -60 14552 -21829 16419 -2558 -11174 16063 -10674 -655 9181 -8332
466 -8332 -1248 12155 -16052 7952 8292 -22592 25377 -14093 -6076 22776 -26453 15175 2992
479 2992 -16565 16876 -4869 -10564 17015 -9005 -9448 25504 -28021 12932 12910 -33939 37500
492 37500 -21481 -5216 27469 -32883 19726 1748 -17550 17969 -4164 -12478 19117 -9830
504 -9830 -10249 28137 -31088 15469 10345 -31735 36461 -22567 -1432 20018 -23769 13176 2640
517 2640 -10447 5584 8662 -19719 17678 -213 -22523 36737 -32432 9687 18672 -36158 33593
530 33593 -13920 -9634 22320 -17302 50 15891 -17307 2045 21277 -35031 28541 -3054
542 -3054 -27859 45894 -40654 14568 17307 -37517 35534 -15049 -8945 21491 -16320 -1306 16606
555A6606l4597K1004J5712n1196O0662l4687j3500N6216o9726M7544m445l3075
567b3482M4900k8925J240J6099j1304j0542L0865l0082L549L4060n9100N4376
579B1654j9805k6337N7405n5754K5182J3897l7165L1381m010k3586K9943r016
591C789k5386M9537m5235J1241L3991o3814O0513k5351k1209N2299n1963K4037
603B449J1724l2613K7866l819k0903K7933j2057j6297L8032l7776J4138J8841
615A7518m1841M1654j9202j0132K8798k7987J0945Q515j6024P547R187k0380J6171
628D769K370k3817L3683k4288K64K4321l4790K5101k176j9109K5617j4537n322
641g914K0126j9310L187J7355k8295K1635m07k2592L2986k4957L154J9459k9653
$$ plain form
555 16606 -17991 3013 18725 -32471 28191 -6496 -19996 36220 -33506 14038 9593 -23482
567 -23482 21418 -7507 -6267 9832 -1472 -12014 18851 -11231 -7682 26378 -32722 21654
579 21654 1849 -24488 32917 -22837 2345 16242 -20923 10458 6448 -17138 12805 3789
591 3789 -21597 27940 -17295 -6054 27937 -35877 24636 -715 -21924 30375 -21588 2449
603 2449 14173 -18440 9426 5607 -15296 12637 580 -15717 22315 -15461 -1323 17518
615 17518 -24323 17331 -1871 -12003 16795 -11192 -247 8268 -7756 -209 8978 -11402 4769
628 4769 7139 -16678 17005 -7283 -7019 17302 -17488 7613 5437 -13672 11945 -2592 -7914
641 -7914 12212 -7098 -3911 13444 -14851 6784 6377 -16215 16771 -8186 -5032 14427 -15226
654a5226K2502l566j4723K1623j4134j712J4483j6018O269Q095j7253J5183l471
667B052j0421J7849j4497K928R238j4226J0085n22p574Q740l295m697R069o273
681a544j478R187j1292O059L425j0990J1627n272l965J0398r842L063M953r708
695e379Q005o43p080J0002o573r44Q009j0087O085J069p578R412n517j050O232
710C963p336M016J321n098N110j888k026M598m136J006K481m155L168k79k644
725a899L483j922m85K397k619Q80J330k154J345J27j462J919j062p52K065j775
741e84M60J031k129J790m63j202J818q69j40J122j455J138j31j210J487q10j66
758c13J044j489J050R0p45R54p07QO68q55L43L22o33L76J08l10J83k44K8N98p19
$$ plain form
654 -15226 7276 3710 -11013 10610 -3524 -5236 9247 -6771 -502 7593 -9660 5523 2052
667 2052 -8369 9480 -5017 -2089 7149 -7077 3008 2486 -5088 3652 357 -4340 4729 -1544
681 -1544 -3022 6165 -5127 932 4357 -6633 4994 -278 -4243 6155 -3687 -624 4329 -5379
695 -5379 2626 1983 -5097 4905 -1668 -2612 5397 -4690 1395 2464 -5114 4298 -1219 -2269 3963
710 3963 -3373 643 1964 -3134 1976 88 -1938 2660 -1476 -470 2011 -2144 1024 745 -1899
725 -1899 1584 -338 -823 1574 -1045 -165 1165 -989 356 483 -979 940 -122 -874 1191 -584
741 -584 -124 907 -1222 568 105 -1097 721 -148 -288 834 -621 517 386 -824 663 -147 -313
758 -313 731 -758 292 382 -363 591 -116 -108 560 -295 48 370 -263 113 221 -89 94 -150 -122 476 -243
779b43K11j33K37J43k33K18k66K1J22O0j72J66J16m02J44N2j95K3J41J93o5l29
801a91J86o6p3L30n00K25J64k38L60j63j07J15j28J22M0l99N2K55p5K50R7l81
823a25K36l20j75P93n21L62n5l35L15l09R5K36n77M97j7n45P43j56m78O90n74
844b20J00K79l84L55m9l07N59n49L14K70p63M56K48q29J000o11k97J128r91L72
864H1J94p74R71k87o38J331j341N69N75j548J483l25j155J694j329K81J165k261
882a314J921k22j734K223j071o56K070k006L37J461k410K035j08k054L059k242
898g11J27K150l284K527j36k056K793j567j007K989k787K93K674m195L356k50
914I16l011M583l780O07K596m109L073J82l174L535j260k026M215l468L85L263
$$ plain form
779 -243 -32 -165 72 215 -18 200 -66 -45 77 137 -35 131 247 -155 -11 41 -154 -131 10 203 138 -191
801 -191 -5 -71 -144 186 -314 -89 75 -163 197 34 -73 42 -86 36 76 -323 -271 -16 -91 159 256 -125
823 -125 111 -209 -384 409 -112 250 195 -140 175 -134 -39 197 -380 117 100 -445 298 142 -336 354 -220
844 -220 -120 159 -225 130 81 -226 333 -216 98 368 -395 61 309 -520 480 -131 -428 700 -291 81
864 81 275 -499 472 185 -453 878 -463 106 681 -867 616 291 -864 830 -499 -218 947 -1314
882 -1314 607 385 -1349 874 -197 -853 1217 -789 -452 1009 -1401 634 526 -1528 1531 -711
898 -711 -584 1566 -1718 809 673 -1383 1410 -157 -1164 1825 -962 -669 2005 -2190 1166 916
914 916 -2095 2488 -1292 -685 1911 -2198 875 1057 -2117 1418 158 -1868 2347 -1121 -736 2527
930B527n651M789q36l590N926m848R88L000m271K687P37l512L360k48m040O421
946C439m629o49N601p902O205p61m748O868m645o7L979m595J645K397n086M141
962A193J070o593Q747o131n12P122r839P338r32n222P365n075j92M132m392J020
978i01M107o889N016J150p609J0606p588J77O783j0066P742j584m265O148l424
993e97j573M586k814k245P407q281L917L228r602J1061o690q50P369r067N237
1008A086O55m962M931k12n078O569k932l702R317j0321N544K969j0318J2063p345
1023a736k64O633q607M883J390n184M268K19n507P210l601l241R017j0230N948
1038A198J761q428J0102o150j34M831n288J869K322l650J572K890o920O646k140
$$ plain form
930 2527 -3124 1665 829 -2761 3165 -1683 -695 2305 -1966 721 1458 -2054 1306 1058 -2982 3439
946 3439 -1190 -1839 3762 -4140 2065 1304 -3444 3424 -1221 -1288 2691 -1904 -259 2138 -2948 1193
962 1193 2263 -4330 4417 -1714 -2226 4896 -4943 2395 1463 -3759 3606 -1469 -1661 2471 -1921 -901
978 -901 3206 -3683 1333 2483 -5126 5480 -2108 -1931 4852 -5214 2528 944 -3321 2827 -597
993 -597 -2170 2416 -398 -2643 4764 -3517 400 3628 -5974 5087 -1603 -2453 4916 -4151 1086
1008 1086 1741 -3221 1710 1498 -3580 2989 57 -3645 5672 -4649 895 3864 -6454 5609 -1736
1023 -1736 -2000 4633 -3974 909 2299 -2885 1383 1602 -3905 3305 -296 -3537 5480 -4750 1198
1038 1198 2959 -5469 4633 -1517 -1651 3180 -2108 -239 2083 -1567 5 2895 -4025 2621 481
1053D81m462R196q916M108K843p559P451l368k254N313l688p60M505n052J805
1068c57L701p892P880k931m250R149r141M670J662o539O867k876j863M234l292
1083i78m59M257n043J968K845o339O508k948k072O001o458L268R52l790L650j039
1099C23j969K934r37k239M386m018M72L565n379M558j397k263M764m342J216K202
1115A876l720K472O60l220L323p97k756M634m070J320K650n267M861k046j793
1130a873M396l806J276J180k582J792J79k077K789j074j322K879k983J040J221
1145A035k640K443p28p53J440j416M21J109j603O26O69j802J811j07j356J990
1161A139j604j9J478k014J547j43j370J760r63m08J211j113M53M97j406J825o93
$$ plain form
1053 481 -3981 5215 -3701 407 3250 -4309 3142 -226 -2480 2833 -855 -1615 2890 -2162 -357
1068 -357 3344 -4548 3332 401 -3849 5300 -3841 829 2491 -4048 2819 -57 -1920 2314 -978
1083 -978 -1437 2820 -2223 -255 2590 -3749 2759 -189 -2261 3740 -2718 550 1502 -2288 1362 323
1099 323 -1646 1288 351 -1888 2498 -1520 -1048 2517 -2862 1696 299 -1964 2800 -1542 -326 1876
1115 1876 -1844 628 1288 -1932 1391 594 -2162 2472 -1598 -278 2372 -2895 1966 -80 -1873
1130 -1873 2523 -1283 -7 1173 -1409 383 562 -1515 1274 200 -1122 1757 -1226 -186 1035
1145 1035 -1605 838 110 -643 797 -619 -198 911 -692 -66 603 -1199 612 505 -851 1139
1161 1139 -465 -484 994 -1020 527 384 -986 774 -189 -597 614 -499 -46 451 -955 870 177
1178A77q59J640j553N05Q93j479J040k94m71R38j043L18M51r92R66J69r54R98
1196D50m65o54J322j121N18P0o27Q69m10j22M15k78l1K36n08L08K09m96N31k69
1216e3k90M82l45J09K54m11K85K34n90O37k48k4J13n67N11J83m28O17n57j88M73
1237A97l37K44J45j77r6j18k2K43l25J85J42k54K06j30j8K63J4j32K7k37K40q8
1259b8l18J74L01j12J38k73N2J64k35R2P6j04K66k73oK48l53J71%j81M8J38P5
1282F0N1j05k7J44k66J52j47Q1o8J37K62k95j08J53k8m7Q7o8J6J59k42J30L62
1305C93m16o4J79j22K1L1j7j2J3r2j03k2K22l8J4k28L47j53m4j66K65J02k72M08
1329B46n48L35l4Q4k78K80m59N83ol47M06n90P9K75k13K11J00k33J44j4k51N45
$$ plain form
1178 177 -682 958 -595 -90 803 -676 364 70 -401 537 -506 -188 263 -729 237 406 -548 450
1196 450 -15 -669 653 -468 50 120 -507 362 -48 -170 245 -33 -64 172 -336 -28 181 -315 216 -53
1216 -53 -343 139 -206 -97 157 -254 31 265 -325 312 64 40 153 -414 97 280 -148 469 -88 -276 197
1237 197 -140 104 249 72 -24 -142 -164 79 -246 -61 81 -173 33 -97 -115 148 162 30 57 -180 60 -28
1259 -28 -346 -172 129 17 155 -118 -66 98 -137 -45 31 -73 193 -80 -86 162 -191 -20 -20 -201 -153 -15 60
1282 60 111 6 -21 123 -143 9 -138 -57 -125 12 274 -21 -129 24 -4 -51 36 -32 -16 143 -99 31 393
1305 393 -23 -87 92 -30 -9 22 5 -7 6 -86 -189 -211 11 -27 -13 -241 106 -47 -91 -257 8 110 -162 246
1329 246 -302 33 -1 83 -195 85 -374 209 203 -144 262 -328 -249 26 -187 24 124 -109 35 21 -230 315
1351C15l73k88P38p74O93k11k82M06k22r4K54l85L35j8k33M05j55m85P47p14L97
1372E6N92j262Q21k76l84R10q17L0Q49r76N40L64r23Q83m46k09J135j481O57M01
1392D64r13P79n24l11J004o43o5P21j063O83M37j418J401n13o47J531j704R29
1410A48K10r85J061l35o15J272q44j90R67j152O53Q00j978J711p80p05J918j995
1428h39J150K81j527J377k01r95J384o21p79J931j733O83R78k677K812j144r55
1445h75K177k327J002N41j518J103K01j261J806p57r96K242k314Q38J171k583
1461a550K992j635n30J785k034J112L15j282Q88O51j830J914l21j843K933k646
1477a081J046J115k706K948j294j093K112j569K32J233j632O55J145k573K176
$$ plain form
1351 315 -58 -346 392 -382 311 100 -182 224 2 -92 162 -223 112 94 -139 266 111 -374 373 -341 56
1372 56 648 -614 207 -69 -453 457 -360 -330 519 -457 83 447 -476 407 -39 -248 887 -594 63 464
1392 464 -449 330 -194 -505 499 -144 -209 512 -551 132 569 -849 552 39 -608 923 -781 148
1410 148 358 -627 434 99 -516 756 -88 -278 689 -463 190 990 -988 723 -57 -762 1156 -839
1428 -839 311 592 -935 442 241 -754 630 9 -770 1161 -572 111 1089 -1588 1224 80 -875
1445 -875 1302 -1025 -23 518 -1000 103 304 -957 849 92 -904 1338 -976 -138 1033 -1550
1461 -1550 1442 -193 -723 1062 -972 140 455 -827 61 712 -1118 796 475 -1368 1565 -1081
1477 -1081 -35 1080 -1626 1322 28 -1065 1047 -522 -290 943 -689 -34 1111 -1462 714
1492G14j51k303L510k984J155J137k803L164j334p50J903j691J73J532j950L21
1508c57J922l194K759r86j664L270k885J103J282k591K315q92p66J353q31n09
1524f71J938k028L48K120l432K768r60j436L056k642Q37R67j883J413o4r50J334
1541G15m87j471K666k037N8K058l242K764p45j602K866k695J000P11j585J238
1557B12O8j003J276k77j293K365j959N20J306k605K209o50j051J944j698L11J147
1574H22j403O75O14j591J317R9j493J956j416J22J302k170J659k49j127J603j186
1591d66J59J209j307K45R09j463R92m1j475K272j721L08J162j767J547m87p72
1608f96J099o50k46R85r26M38O07j222R51l65p61J724j012r8O93j202P49L6m03
$$ plain form
1492 714 563 -1740 1770 -1214 -59 1078 -1725 1439 105 -645 1258 -433 -260 1272 -678 -357
1508 -357 1565 -1629 1130 144 -1520 1750 -1135 -32 1250 -1341 974 82 -684 669 -162 -671
1524 -671 1267 -761 -413 1707 -1725 1043 83 -1353 1703 -939 -102 865 -1018 395 331 -619 715
1541 715 228 -1243 1423 -614 -556 1502 -1740 1024 279 -1323 1543 -1152 -152 559 -1026 212
1557 212 280 -723 553 276 -1017 1348 -611 -91 1215 -1390 819 169 -882 1062 -636 -325 822
1574 822 -581 94 708 -883 434 533 -960 996 -420 -298 1004 -1166 493 244 -883 720 -466
1591 -466 -307 902 -405 -160 749 -714 278 237 -1238 1034 -687 -379 783 -984 563 76 -696
1608 -696 403 -247 -493 492 -434 4 611 -611 340 -25 -786 938 -74 -172 521 -681 68 104 -299
1627b99O01l71q0O67m91q3N15r69N56P5p60J259r46M43L61p48N35n6l26M64m96
1648a49j42O51l88j48N38r02O88o8l30M73n22K09L61m24O27m57k53L48l6k41L72
1669B07k81O5K43k54K53k08K29J83o60K27Q8j37J33K0l88L14N4j36K71l74J96
1690D5J93n51M74j88j56O1pJ13L8j1L9K23k58K28j46o8K61n06K40kk38J77kK59
1714B18k01j53J00O1j81K24m12L17K78k79J79j20OL9k73L25k28j04K70j32j6K24
1736A42p4oj67O3R8J36k46J8K2j15R2L37l74J34o3j4P2j99J16j14J59P6K7k9J14
1761B05j8k95J35l5J70l91K64O8j64J03Ql3N2o1k09J26l96L19K95k05j4Q1n8l4
1785h7p5J55RJ29Mj3l90K32l1J72k5mk20K9J1J26K13k25K55k47m21M68j72K7J95
$$ plain form
1627 -299 302 -69 -149 518 27 -56 459 -510 46 121 -639 620 -326 117 478 -270 265 209 -117 347 -149
1648 -149 -291 360 -28 -176 362 -540 148 80 -250 223 -299 -90 271 -153 474 17 -236 112 76 -165 207
1669 207 -74 -9 234 -20 233 25 254 437 -223 4 92 -45 88 108 -280 34 88 -48 223 -151 45
1690 45 238 -313 161 -27 -183 -122 -129 -16 22 11 50 273 15 243 97 29 290 -216 24 22 -216 -39 -41 218
1714 218 17 -136 -36 25 -156 68 -344 -27 251 -28 151 31 37 76 -197 128 -100 -204 66 -66 -82 142
1736 142 68 62 -105 -42 56 192 -54 -36 -14 -129 -37 300 -74 60 -3 -17 55 -144 -28 -142 17 93 120 91 205
1761 205 187 -108 27 -8 162 -229 35 103 -61 42 50 17 69 8 -201 -75 -471 -152 143 -62 -76 5 -53 -87
1785 -87 -162 -7 2 131 135 122 -268 -36 -67 105 80 76 -144 -115 -104 22 235 10 265 18 -403 65 -107 -80 115
1810A15l25N0J67p7R9q6r0K86k25N1L14o75M75J41n75N52m85J31N15o67M67O0
1832B18p31Q17o6m77L93n19M49L58q62Q88j62p52Q03n36q1N43k86J65L21j107
1852f24R90m22m09R83p28K31L55q73K79P51j286J077j43n87J401j592O38N43j112
1871e28Q34j01j025J204l65m09J044j429O02R68j775J482m34q09J846j692P88
1888B01N37j443P86N01j313J346m68q73J517j447M77J081k183K202r95q25J924
1905A025j696K58J007j125P02M95j800J656l80j342K379k000L69J399k243J967
1921F71l31j286J995j612L35J074j477L20J301j930J757l26j846L051k681N08
1937d77J682k852K308l62j208J938j195k39J339j204j93J551k329J705L52k516
$$ plain form
1810 115 -210 -160 7 -70 29 -57 -147 139 -86 -35 279 -396 79 220 -355 197 -288 -157 358 -309 158 218
1832 218 -513 304 238 -239 154 -365 84 442 -420 468 306 -446 357 -179 -260 283 -3 162 483 -624
1852 -624 366 -56 -465 518 -210 21 376 -497 -218 533 -753 324 181 -406 995 -597 41 584 -528
1871 -528 306 205 -820 384 19 -390 654 -775 -173 795 -980 502 68 -741 1105 -587 201
1888 201 738 -705 81 582 -731 615 147 -726 791 -656 -179 902 -1281 921 -74 -899 1025
1905 1025 -671 -413 594 -531 171 666 -1134 522 142 -1200 1179 -821 -452 947 -1296 671
1921 671 340 -946 1049 -563 -228 846 -631 -311 990 -940 817 491 -1355 1696 -985 -477
1937 -477 1205 -1647 661 299 -909 1029 -166 -405 934 -270 -463 1088 -1241 464 816 -1700
1953a700L559k673L35J863k638J744J70j646J588m42j220K021j305m73K412k946
1969a351J780L31k514L218k203K49J622k273J373L70j330J236j00j503K247j201
1985d9q22K337k815J911K42k146K604j744J24J304j603M44Q58j369O12P48k133
2002a497K393q22j021K444l031J921L98k330K662j399l31J556j437K38P18j528
2018a066J058R87k505K498j113o69K412k872J404O90k007K019r44k86P94o94N1
2035b43J292j593O58O03j945K219r27r19J986k173J078N40j311J159m04m54R89
2052E55m88o89J492j361N46P17j784J764p68n45J404j384O13J72p84P38q7q89
2070g78J167l39r44J716j416N26Q82j880J724n13p68J390j235J61P00p11N17l6
$$ plain form
1953 -1700 1859 -814 -479 1384 -1254 490 660 -986 602 160 -1060 961 -344 -817 1595 -1351
1969 -1351 429 760 -1754 1464 -739 -490 1132 -1141 232 602 -728 508 408 -1095 1152 -49
1985 -49 -871 1466 -1349 562 804 -1342 1262 -482 -358 946 -657 -213 645 -724 -112 636 -1497
2002 -1497 896 74 -947 1497 -1534 387 785 -1545 1117 -282 -613 943 -494 -256 462 -1066
2018 -1066 -8 979 -1526 972 -141 -810 1602 -1270 134 824 -1183 836 -108 -394 400 -294 -243
2035 -243 1049 -544 114 717 -1228 991 64 -855 1131 -1042 36 576 -735 424 20 -434 555
2052 555 67 -622 870 -491 55 772 -1012 752 -16 -561 843 -541 72 244 -540 198 111 -778
2070 -778 389 50 -894 822 -594 -68 814 -1066 658 145 -623 767 -468 -307 393 -318 199 163
2088A63m60P90o16j60R11j036L64K52q73J201o38l45R37o49L51R6n34K68J93o92
2108d77R21l41j70O71p42O2K34m48L35O9o3J85l60L8L29n40L19K73m32O74m28
2129A09l92N78n93M09p0k37M83m63nM89k98J33k01j88N39k17j08R6j8j30L60l43
2151f7J91j52j08J51Q0k26L41l58J23J53K01k46O7m56M07nJ15r5k27J15J56k70
2173a10L39m60K86L05m53P9j11N7j9J89j84K98n45O34m47R1M0J36k95j3P6o3M5
2196a25J1R6J29j39K6q1K19M9k43O9k0j16L24k96m7K46o2n4r7R2J42k10j64K90
2220C9j25J34j44mK00j54J16J28l34l4L95j24j3J46l50QL74m21K41M4rl1n19N75
2244A38k66J08n5K79k11J76k14j46K45j01K68k12k21K43j18J16q4j8L93j75l47
$$ plain form
2088 163 -297 493 -123 -283 628 -408 -44 208 -665 536 -102 -447 490 -159 192 288 -246 22 215 -477
2108 -477 444 103 -67 604 -138 -76 158 -290 45 114 51 236 -124 -86 243 -297 22 295 -137 537 109
2129 109 -283 295 -298 111 41 -196 287 -176 -181 308 10 143 -58 -246 293 76 -32 64 46 -84 276 -67
2151 -67 124 -28 -136 15 95 -131 210 -148 -25 128 329 83 150 -306 101 96 211 116 -111 4 160 -110
2173 -110 229 -231 55 360 -93 -14 -125 -68 -87 102 -82 216 -329 305 -142 -51 -11 125 -170 -183 -107 -170 -125
2196 -125 -114 -18 111 -28 -2 -83 136 185 -58 11 -9 -125 199 -97 -144 102 40 -14 -111 -19 123 -87 -251 39
2220 39 -86 48 -96 -100 100 -54 62 190 -144 -178 217 93 80 226 -124 -116 258 -163 78 122 113 82 -437 138
2244 138 -128 -20 -75 204 -7 169 -45 -191 54 -47 221 9 -212 31 -87 29 -55 -73 320 145 -202
2265b02J97k4j50K73q4p6K10j76o4K20j55L3J12o7K84j39n1J88m95P8J24j11L43
2288B68l91k0M71n01K4M29p93Q22m92L4M52l89Q4L64m94l8N51m16J76O3k97N25
2310D32p01N87r8n76N94k13k59M32k43L9M21q23M51K17o49P71m60J61J76n32J50
2331a23K55m53N02l6n74P03m42k46P27p78M51K51p60O87k03m26R51o97nN46q10
2352d80O84K69j191J061k96n10R69r10M13M40p96P17k54o00R76n86k28O25o96
2371c93K49P23j136O53M4r28J726j556M84P23j104R60n16k96O63j99n57J104r51
2390c07n6J093j532J239j31r52J336j299L41P45q65M16J91p27Q91j12q17J224
2408F78q90j43J284j855J162O5r21J315r22K6Q94j137O09L04j209J168N2j422
$$ plain form
2265 -202 -5 -29 -179 94 10 -66 144 -32 -96 124 -31 2 114 47 331 192 141 329 -166 -88 36 -75 268
2288 268 -123 -143 328 -173 -149 280 -513 309 -183 -149 303 -86 -2 362 -132 -170 381 -35 141 204 -93 432
2310 432 -269 318 220 -356 238 25 -234 198 -45 -6 415 -408 43 260 -389 382 -78 83 259 -273 -123
2331 -123 132 -321 181 145 -429 274 -168 -414 313 -465 -14 237 -523 164 -39 -465 486 -211 -216 330 -480
2352 -480 204 473 -718 343 47 -463 506 -404 9 449 -347 370 116 -484 492 -94 -322 303 -393
2371 -393 -144 579 -557 96 140 -788 938 -618 -134 589 -515 445 -71 -367 296 97 -460 644 -307
2390 -307 -363 730 -802 437 306 -646 690 -609 -268 477 -388 28 219 -508 383 271 -546 678
2408 678 -212 -355 929 -926 236 301 -620 695 -227 -201 693 -444 165 469 -740 428 480 -942
2426i42J848j108k07J624k172J381oj050J230q96p7P55o76k09J227j407P21Q12
2444H48j903K164j232l69J580j780J008j16q95J387o02m10Q93o67m62J215j199
2461e40N57N87j641J869q87m07J417j549Q08J77p64P16k64o89R62m20n99J664
2479I97j792Q39P10j612J789j056m80J403j516N32N33j035R94J34j273J419m41
2496A45o38J207j408O51N10j222J309o70j63P92q91K09P40q26M07K54j109J079
2514C76l61o99J387j086K60N32j042J144o89k47P98o58J02O22o83J97N76j184
2532f55Q37j85m73R90p66L86J91p72O77k99k93M93Q0l67M56n44K13L48q74P28
2552A71p4m70Q49q64L93K42o24P35k74j80J35j06j12J57k68K16L08o95P89j96
$$ plain form
2426 -942 906 -202 -409 1215 -957 424 418 -632 598 -298 -375 380 -296 -505 722 -685 36 848
2444 848 -1055 1109 -123 -492 1088 -692 316 200 -695 692 90 -320 573 -94 -556 659 -540
2461 -540 17 604 -1037 832 -55 -462 955 -594 214 391 -373 343 79 -610 352 -68 -667 997
2479 997 -795 44 754 -858 931 -125 -605 798 -718 -186 347 -688 306 440 -833 586 145
2496 145 -493 714 -694 -43 467 -755 554 -116 -279 513 -378 -169 571 -255 152 406 -703 376
2514 376 15 -684 703 -383 -123 409 -633 511 -178 -425 373 -285 -183 439 -244 -47 529 -655
2532 -655 182 -3 -476 514 -252 134 325 -447 230 -69 -362 131 211 -156 300 -244 -31 317 -557 171
2552 171 97 -373 476 -388 5 247 -377 358 84 -96 39 -67 -179 -22 -290 -74 234 -461 328 132
2572A32l20M64o98O12j86l83K68P6k90L66Q3j83J39j41K2M34p39L42J25m87P04
2593C40o13L40J58k90J53K11o48O73j45j95J81l51M15k3q6n1l88L14L19l95J80
2614I9l7j40K03J11o02O11k12k87L94K0m6j18k32N83l12J6J05k29J98j09k63K00
2636d7O6k6J13k4k78K65j19N8L60k14o7j25p9L00K1l34J29k2J7J53k55O9R9l15
2660b55K97J2K56m77M0K96k05j40K99r9J61j66l98K80q9K43K3j35N4j18K4K62
2682A65r0j61J63j52p7J83q1J02k13K88J2p9j58R7r7M7K78j80l03M92n03K57J96
2705A86k42lq9K39k85J65J98j90pM0k39K39M9K40m00K38kL7l5j81n9j47L02j83
2729a29K15j66J80l07L22L3n7j48L12j66P3p9j00k7j5mML00j74k41M3O2J76k45
$$ plain form
2572 132 -188 276 -422 190 4 -379 -111 -35 -325 41 124 -59 80 -61 -39 395 -344 -2 123 -364 340
2593 340 -273 67 225 -65 88 299 -349 324 179 -16 165 -186 229 206 120 69 -319 -5 314 -81 99
2614 99 62 -78 125 236 -366 245 33 -254 140 160 114 -4 -236 347 35 51 156 -73 125 16 -247 -47
2636 -47 19 -7 106 82 -196 69 -50 8 368 154 87 -38 -117 183 204 -130 -1 -23 -6 147 -108 -39 60 -255
2660 -255 42 54 310 -167 -127 169 -36 -176 123 24 185 19 -379 -99 -188 55 78 -57 -3 -121 -97 165
2682 165 75 -86 77 -75 -152 31 -50 52 -161 127 139 60 -98 -1 -98 -51 227 47 -256 236 -267 -10 186
2705 186 -56 -59 -148 91 -194 -29 169 -21 -28 12 -227 12 61 301 -99 139 137 174 139 -42 -101 -248 54 -129
2729 -129 86 -80 100 -207 115 148 91 -57 255 89 162 83 -17 -44 -59 -63 -59 241 67 -174 -131 -69 107 -138
2753a38J00M5l9K5o1K8k2O3J91l57L96k11j90K48k36L13k5m15L61l09N3M22o09
2776c67K91j2J19LK1Roj6m8L98l73K6j49J63rj74J54j96p4M00J67j99K21l92k23
2801b66M48j30pJ45l18L56j21n9L7k36k74M49N9j91K32j83J14J49j96K08k89j22
2823a95J41j10K32Q2m76N25k35M6K63n33K86qj31J09J22n04L78P6L9j45N4J38
2845A54k92q1L57j83k39N97l72L60J19o80K83N1K7K6j74K9J88k29M7K12q03J016
2867D13k72j97K47m30J89L03m37L24j22j25K55R2k21K03k68J7M03n81M18k9m88
2888c06N19n23L99M8l78M03k44k14N23j96l05M33m92M26L8k54L83o8m94N72l20
2909e0o9L09k17R0O3m18M10j78k18O78m74J05p7m99O16k28m19R30m32j15K56j17
$$ plain form
2753 -138 -38 7 -32 -7 -68 -40 -62 1 192 -165 231 20 -170 78 -158 155 130 -285 76 -233 -180 242 -367
2776 -367 -76 -88 31 34 55 64 58 42 -6 392 19 45 -104 59 50 -124 30 -166 -240 160 327 128 349 -43 -266
2801 -266 182 52 45 190 -128 228 107 48 85 -151 -425 24 83 -108 124 -59 55 204 8 216 -73 -195
2823 -195 -54 -164 68 150 -326 199 -36 10 273 -260 26 18 -113 -4 118 -386 -8 68 107 -38 16 154
2845 154 -138 -219 138 -45 -284 313 -59 301 420 -260 23 74 101 127 -47 -18 170 -59 -12 200 -603 413
2867 413 141 -56 191 -239 -50 253 -184 140 18 -107 148 240 19 222 -46 -29 374 -207 211 182 -306
2888 -306 213 -310 89 137 -241 162 -82 -296 227 31 -274 159 -333 93 131 -123 260 192 -302 270 -50
2909 -50 -119 190 -27 63 126 -292 118 -60 -278 400 -74 31 -46 -545 71 -157 -576 354 -78 -193 63 -54
2931e4O9m9j63M44l16l97O57n32L36K34n30L24K0k73K86j17j81L46k10O8L46n45
2953b37M26k21j21L95l64oL95q45Q37k43j86J84j08N2L42m77j45N96k66R9j57
2974e0p7N56o28k1O36p81K80K49l12J93j06k27O15m60J5M14n83K91K12l35O3j98
2996b54J70M01l87J56Rj61K0J66m17O32p11L34L45o26M37J73n94O51m48k8N06
3017C74o22L16O4m43j1M72m64O08l25l9K03k55O3J87k54K43m91M02J99k69l4K60
3039A84m80K34K62l90M07l27p0L09j95O8J55m80M05Qn2K12j64j20O8j68N5J70
3061I1l58N57l72O1J26m06K15L3q7J92m1k0r3j3n9L78k25J01j07k06M18j70m7
3084c2L8o9J5J77l79N96k34k16J8K40l61K48j40Q4J45k90K88p4R6l6j15N0r6J9
$$ plain form
2931 -54 15 -34 -197 247 -69 -466 191 -341 -5 229 -301 23 43 -230 56 -61 -242 104 -106 -38 308 -237
2953 -237 189 -32 -153 242 -122 -128 267 -578 259 16 -170 14 -94 -42 300 -177 -322 274 8 107 -50
2974 -50 -127 429 -199 -220 416 -365 -85 164 -148 45 -61 -288 327 -133 -118 296 -287 4 216 -119 -56 -254
2996 -254 -84 317 -70 86 95 -66 -46 120 -297 335 -376 -42 303 -323 114 287 -307 344 -104 -132 374
3017 374 -248 68 132 -311 -322 150 -314 294 -31 -70 133 -122 -59 128 -126 117 -374 28 227 -42 -76 184
3039 184 -296 -62 200 -190 217 -110 -180 129 -66 2 157 -323 82 90 38 250 86 -34 34 -134 -79 91
3061 91 -267 290 -82 -21 105 -301 -86 -53 -140 52 11 -9 -102 -115 -174 204 -21 80 -27 -233 185 15 -32
3084 -32 6 -63 -48 129 -250 346 112 -104 -86 154 -207 41 -99 -15 130 -160 128 54 150 114 -1 49 -47 -28
3108b8j48R0j32L82l16J49j26k95L30J63J3r5J37k29O5j24J17K69k61O9QRO9J4
3132A30j28K01k12l4L47k48K6N3m4J69l20J38m9m4K55k23N6J01Kj71J33l24J42
3155d4p0J89M2l4j30PQ5J32q1l1M4l26QL21J32m12r9M3K9K53k10L28k94J81j11
3180d8L8L88l40l21M78j38p7Q3O0M6J5k40j15J10j42k7M1J85j34K30k60K77q6
3203B3N2q5o6J8L5p1J63J2L6k32Q4J94k26O8j94J65q4J01k49K88J34l47L77j12
3227H4R7j74J54q6o1L4l03L34j87J31J20k69J96k27K63j88N4P4K8j6Mj04N1pM0
3252D2l01L87k29J4J56j45N6R8k12K5J17j81L50k13J81n70M18p6L83j61l25J97
3274A1j24K56J06k22q6k60K98nj21L29q4J6p1j26N8j22r9K91j39J06N9l29M39
$$ plain form
3108 -28 -176 -86 -218 164 -152 -3 -129 -424 -94 69 82 -13 124 -105 -40 -164 -47 222 -39 30 38 47 116 130
3132 130 2 203 -9 -43 304 56 82 135 91 260 -60 78 29 -15 240 17 73 174 176 5 138 -186 -44
3155 -44 -114 75 117 83 -47 -40 45 177 96 65 109 -217 -209 112 244 -168 -267 -224 -195 58 -152 176 -118 63 -48
3180 -48 -10 378 38 -283 195 57 -20 63 123 169 184 -56 -171 -61 -203 -230 -189 -4 -138 92 -168 109 23
3203 23 75 -10 -76 -58 -23 -94 69 81 117 -115 -31 163 -63 5 -189 -24 -108 -7 -256 32 166 -181 196 84
3227 84 181 7 161 75 14 48 -255 79 -108 23 143 -126 70 -157 106 -82 -28 46 74 58 62 -42 9 2 42
3252 42 -259 128 -101 -87 69 -76 -20 78 -134 -109 8 -173 177 -36 145 -425 -7 -83 300 139 -186 11
3274 11 -113 143 249 27 -59 -319 -21 -26 -147 182 98 114 43 -83 -25 -147 -246 45 -94 12 71 -258 181
3297A81m00KJ74j7j28K44l49J05L19l87K51J15k4k2o5P9M4j13K82j57n7r7o6j22
3321b08J53L9Q3J68k52j7M0j78j7L21j98j29K68l14K83k30J60j12L29J19k02k39
3343a33J74J09j87J26o3K96l85n5L7J39j40J04P3o0j13q5J78J02j78K64l47L7
3365a07k0K45q8n6km9Q2O5r5J90q0j74K52m38L28n70N40m6j16K20k4j97J72q1
3389d9j84K02p0K38j17k55M02j94M2P1r4j61J24Q7j0L11j97p7k4q9m5J41R0j65
3413b3r8K22j89K3K45j96m6K61m47K08J37k35K44L5l78J89km9J14o2j46K90p0
3436B7J2k7J06j27n8K65j15j78J21R3j75K22k44j3J48J9r4j44J9J20K4j77K33
3459E7j36K5p5L48j58j0l02J75J39m08O07l49OP9j5O7r0J52k26M15m00J45k8n9
$$ plain form
3297 181 -219 -217 -43 -60 -188 56 -293 -188 131 -256 -5 110 86 64 -1 78 122 9 291 134 77 -20 -86 -208
3321 -208 -55 -16 67 235 -17 -34 6 -172 -189 132 -66 -195 73 -241 42 -188 -28 -140 189 308 106 -133
3343 -133 41 150 -37 89 26 322 -63 -118 -81 58 -82 22 95 35 -78 -163 15 117 -61 203 -144 -107
3365 -107 -127 118 30 -26 -28 -77 5 70 -25 165 85 -89 163 -275 53 -517 23 -23 -139 81 57 -140 32 -49
3389 -49 -233 -31 -101 137 20 -235 167 -27 15 86 -8 -169 -45 42 32 343 146 69 45 -44 -89 52 142 -23
3413 -23 -121 101 -88 -65 180 -16 -62 199 -248 -40 97 -138 106 141 -237 -48 -50 -99 15 -47 -193 97 27
3436 27 39 12 118 -9 -67 198 83 -95 26 119 -56 166 -78 -91 57 76 -18 -162 -143 -23 1 -176 57
3459 57 -79 -54 -129 219 61 51 -251 -76 63 -345 262 -87 -81 -2 -17 50 -40 112 -114 301 -99 46 18 -41
3483d1K45l10J57l8o2j4J48j78L45l84O8J48j40J74j84k02M24j12k98K60j60J77
3505B3J28m03L60k21M1P5k21K04K8N5O1J41l36K6l34L87nj16L99k95j5O8M1j14
3529b3J32r0q6J26l5N8Q9l13L15k89r2K83k44J48K51l94J33R9k62K55j05j35J28
3552e1J64m8l7r4J32m6k58L52k23P4Nol3J54p3p5J20o6J35k76Q5K49j90j55K41
3577H0r0O5P1m29M70k49J83O1l79L52j76J36j01M4l80N74l26J28J13k79L89m17
3599a60K49J40l63P5mK7J73j04j71n8K99q3N7k55L06J80m95J99m8N9J21J09l64
3622a11L25j84K7l57L28o0L63l36J99o7r8J60l64L53k98J6P2Rj3r5L96k54J29
3645A40m61L96m5l5m0J14r4j04K5j39R8J84L1L1Q0j50K6j6J95l18K72q9kk77K72
$$ plain form
3483 -41 204 -106 51 13 -49 -63 85 -93 252 -132 -64 84 -56 118 -66 -268 156 44 -254 6 -154 23
3505 23 151 -252 108 -113 -72 3 -218 -14 14 69 130 271 -65 -39 -373 14 9 -107 292 -3 -18 50 91 -23
3529 -23 109 19 -67 59 24 82 171 -142 173 -116 -208 75 -169 -21 230 -164 -31 68 -194 61 -44 -179 -51
3552 -51 113 65 28 -66 66 20 -238 114 -109 -35 -30 -36 -69 85 12 -63 57 -9 126 -150 -65 184 -6 -161 80
3577 80 -10 55 126 -303 167 -82 101 162 -217 135 -41 95 -6 38 -342 232 -94 34 147 -132 257 -160
3599 -160 89 229 -134 -59 -63 -36 137 33 -138 -196 103 20 77 -178 128 308 -187 12 -36 23 144 253 -111
3622 -111 214 30 57 -300 28 -32 331 -5 194 127 29 189 -175 178 -120 -104 -32 -23 -36 -131 265 11 140
3645 140 -321 75 30 -5 -45 69 -25 -129 -104 -243 -145 39 70 101 181 31 57 41 236 -82 190 101 99 -178 94
3670I4j44K23j70j8J67j69K78q6lm16M54k92K17%k7r1K8M3j78J33q9P4l6J60j91
3695c9O7N3k47K83l04J50k3J53J11P2m63M0L8K73k20j98N56l57J86k64J11q4P
3718i9j01RL76j01K2J40k95J13j17R6r9J0j45K12o8j25M04l19n4K41j95J74J59
3741B38m44K71k14J02K01o2k27K74j81O6j7k23R7Pk3R0Nj02J86j15m4J59L6o3
3765A7J14j44N6j34J04Rj88M00l62K12Nk37J09L70o12L15M2o8K56m87P3K79m08
3788b79L12K0m3R6j44o6K39k74J52K53j74j61L1m0K8N5j01M59l87J29j70o4L81
3811B52j71j58Q8Q1k56K50j89Q0K70n17L76j11k7K04j8r1j08k30L38j08j41L62
3833A76p0j20M5M4l8K47m99M97k96j26m2J90J15pl99M27p0p2J38k66l2J29k30
$$ plain form
3670 94 -50 173 3 -15 152 -17 261 175 172 -244 210 -82 135 135 108 17 45 88 -90 43 -46 28 -8 152 -39
3695 -39 28 81 -166 117 -187 -37 -60 93 204 276 -187 -147 -109 164 -56 -254 302 -55 131 -133 -22 -106 -99
3718 -99 -200 -191 185 84 106 246 -49 64 -53 43 -56 -46 -191 21 -47 -172 232 -87 -141 100 -95 79 238
3741 238 -206 65 -149 -47 154 92 -135 139 -42 24 7 -216 -119 -112 -135 -45 -40 -142 44 -71 -115 44 80 17
3765 17 131 -13 43 -91 13 22 -166 234 -128 84 89 -148 -39 331 -281 34 76 8 264 -223 -150 129 -279
3788 -279 33 53 10 106 -38 -104 135 -139 13 266 92 -69 -38 -78 -50 5 -96 363 -24 105 -65 -129 252
3811 252 81 -77 11 92 -164 86 -103 -23 247 -270 106 -5 -32 172 154 63 -45 -275 63 -45 -186 176
3833 176 106 -14 31 75 37 284 -215 282 -14 -140 -182 8 123 116 -283 144 74 2 140 -126 -158 -29 -259
3856b59Q5K73j93j7J5R1J58j47m6j25K28M5j79R8Nj17J3Q6j52j65L64j54K62K
3880A71m06L25k46J16J33J6q6k09J73P8j09o2J66j91P1J40l21K95k85J62K84L5
3902B50n55N72j07j72R7k18J52l8p1L7Q0o6o2J7K15j24k51L06Qj53K11k6j91K71
3926A82l67k2M25k89K48k13p4K81k66p1K22k19j91L79j47Q6M45m61L25m24J06
3947d5M02m62J18J54k66K71j74k6Q6j54L7K35n38M26j19j46K79k45J3Q1j60L03
3969G0J02j74Q1j03K39J2k08p5L33k18o5K24j80J00k29J6R2q4j5K00k10J09j6
3992Aq2J18j98O1K37l61K40J09j75N9k9N0L2j71qK8R7j81J10N1L3o4mK79k86J70
4018A16j64j27K61L2n05L32J42k62K65N6k19J75l01J31O5j6M8p2j39J96j92Q4
$$ plain form
3856 -259 -174 99 -94 -111 -96 -5 153 6 -40 -165 63 108 -71 27 32 -85 -72 14 -138 -303 61 -93 169 171
3880 171 -235 90 -156 -40 93 109 23 -186 -13 65 -44 -106 60 -131 -60 80 -241 54 -231 -69 215 250
3902 250 -305 267 160 -12 85 -133 19 -19 -90 -53 27 -39 -101 -84 131 7 -244 62 70 -83 128 102 -89 182
3926 182 -185 -207 218 -71 177 -36 -110 171 -95 -166 56 -163 -354 25 -122 -36 409 -52 273 -151 -45
3947 -45 357 -105 13 167 -99 172 -2 -28 58 -96 -59 176 -362 64 -55 -201 78 -167 -154 -73 -233 70
3969 70 172 -2 79 -24 215 227 19 -56 277 59 -6 218 38 138 -91 -75 17 -67 -82 118 -92 17 1
3992 1 -81 37 -161 -100 137 -224 16 125 -50 9 -20 30 62 -109 -117 -89 8 -173 -63 -12 21 -43 -47 232 -54 116
4018 116 -48 -175 86 118 -387 -55 87 -175 90 146 -73 102 -199 -68 -3 -19 29 -43 -182 14 -178 -94
4040i4M45m36J42k19L34n7k34J95o4q4K5k2k1K78k13q2J4m0K10m9k22K4J46r0
4064a14j90K85Q3o8l2j26K85k59J08P4j58N9K35n1k8j40O9N0j31J2J18n7j75j30
4088b81M28j79n3L6K68J6J9m1k66j03J28R7j48J07N6q0l32K99o3r4R7L02o1j13
4112C9J11j73p3N6l4K12j50k9M4j30J64k35m4L37J23l13J16k52K29j30J49l3Q2
4135F6J2r1qj54R2K31k20K03k20J6J54j93P2K66l10l8L30k8k76L10k97L38l18
4158f3j37J34O1Q4j13k21J58K72j15j23J37Rj19J77j43J74j18K8j20K21l14J91
4180F0k7oj47K45j50j5k1J68Nk16NL4K20k11L62k3j89L4P5j96j46J69k7oJ83l36
4206a56J38K53k35J22j56q6J45q1L4o4K56k42J60%k52J25J89L0k82K54o8k02J60
$$ plain form
4040 -94 351 -85 57 -162 172 115 -119 76 12 -72 -47 -69 -90 188 -25 -107 -93 -133 77 28 -194 -170 -24 -114
4064 -114 -304 -19 64 -4 -36 -162 123 -136 -28 46 -112 -53 182 131 103 -37 32 82 -49 -37 81 24 -151 -281
4088 -281 147 -32 -85 -49 219 235 254 213 -53 -156 -28 69 -79 28 84 4 -328 -29 -92 -186 -89 213 152 39
4112 39 150 -23 -96 -40 -74 138 -12 -41 3 -127 37 -198 -242 95 218 -95 21 -231 -2 -132 17 -16 66
4135 66 78 -13 -21 -175 -83 148 -72 131 -89 -73 81 -112 -40 226 -84 -122 208 180 -96 214 -83 255 -63
4158 -63 -200 -66 -5 79 -34 -255 -97 175 60 -63 74 83 -36 141 -2 172 54 82 -38 183 -131 60
4180 60 33 27 -120 125 -25 -40 -61 107 112 -104 -99 -65 155 -56 306 283 94 128 203 7 -139 30 3 -3 180 -156
4206 -156 -18 235 0 122 -34 -120 25 -56 -22 -86 170 -72 88 88 -164 -39 150 180 -102 152 84 -118 42
4229D2O3k98j2R9J06j51rK62nM1k74NK65k41K11l07K02J83l21K42Q7j28p0K4j73
4254a57K3J95J88k61R9n2p6Ok1L6K51k51o4J37l4J24l49K38j81R0J41k59L14j01
4278C6o8J63j75n8o8K75k45K00n4L9rp1j67K00k2J19k8O7n1m5J2J11k06j00M19
4303B74o68K66P2K68j07j78Q8L2K17k35O6q7k74K49O2j40J61l07L44j36k83L77
4325F1q9J39K9j11j89J67Q3k9l55K92Q4j96m3L70j67P2q4l32L26J20l8O7k44K9
4349c8K43k84q7J82N8P6k30J51j56P8r2KJ21k5P1j59J62N0j56M4k22K61L9l43
4373b54K58j41J07p1j12R0P6J59J84l24l0L09l94j65L11j56J59j2J14j36q8P2
4395d4k17K92n7K12k77J06O7J9j33J07k10K04j31Q8O3j27l3J35j85K60l57J24
$$ plain form
4229 42 105 -193 -205 -106 0 -151 -160 102 97 138 -136 -131 134 -107 104 -203 -1 182 -139 103 190 62 -8 16 -157
4254 -157 -134 61 249 -12 87 35 -41 -35 -56 -20 231 -20 -84 53 19 143 -206 32 -149 -59 82 -177 137 36
4278 36 -32 131 -44 -102 -170 105 -140 60 6 45 36 -35 -202 -2 -24 95 67 134 83 38 50 161 -45 -145 274
4303 274 -394 -128 -56 212 105 -73 15 47 264 29 95 8 -266 -17 45 -95 66 -241 103 -33 -316 61
4325 61 -28 111 140 29 -160 7 90 61 -294 -2 82 -114 -157 213 46 118 34 -298 28 148 110 177 -67 -38
4349 -38 205 -79 -166 16 74 150 -80 71 -85 -7 -99 -97 24 -1 70 -89 73 123 -33 11 -211 50 89 -254
4373 -254 4 -137 -30 -101 -213 -123 -47 112 296 -28 -58 251 -143 -308 3 -153 6 -6 108 -28 -116 -44
4395 -44 -261 31 -26 186 -91 15 82 101 -32 75 -135 69 -62 26 89 -38 -71 64 -121 139 -218 -94
4417i4K93k74M3l6J4K03j98l7P6J89k12J84J18m15K04j53M3N0Q3j32k0N6j7O1
4441B9n3j20L46k54J53j44L6q9J33j20K50k28J69j74R2p1r1K19%N9k36J56j62
4464a00q4j08L64j11k55M85l62O0J99j85J20np8QQ5j0m4K38j61j8k71J72J1J51
4488A01kk33K49j38m0oO2PK71k72o2Q3n8J96j10j73jK73m38L47m0l0k7j67M6O4
4514i8K73n0l17L12q1p5l9L24l85mJ37j17N4J34j10K48l73k1K06n8K93l49K69
4537A73o3k94j50M78q2k6j03k44L46q6J68k54J19R8r3j53K44n6j3N1j22k1K95
4560B12k26L8nJ70j41k29K32j46Q3k7l6J98O2m84Q2K52j78J31L67n14K58K8r8
4583B9M0qjJ58j82j32J28j50K20mJ13k40L9pN3m8k45N66l94J5R0j52K80o5J16
$$ plain form
4417 -94 199 -75 -32 -68 -54 149 -49 -86 -10 179 -33 151 269 -146 58 -95 -52 -2 81 -51 -71 -15 -32 29
4441 29 -24 -144 202 -52 101 -43 -7 -96 37 -83 167 -61 108 -66 26 -45 -136 83 83 142 -94 62 -100
4464 -100 -184 -292 72 -39 -294 191 -171 -111 88 -97 23 18 -60 -52 33 23 -21 217 56 38 -233 -61 -50 101
4488 101 99 -134 115 -23 -63 -69 -7 0 271 -1 -63 20 -38 158 48 -125 -126 147 -291 56 16 -14 -41 -208 -162 -98
4514 -98 175 125 -192 120 39 -36 -75 249 -136 -140 -3 -120 -66 68 -42 206 -167 -188 18 -40 253 -96 173
4537 173 110 -184 -334 144 62 36 -67 -311 35 -51 117 -137 -18 80 -13 -166 78 22 9 60 -62 -83 212
4560 212 -14 24 19 189 48 -181 51 -95 -12 -39 -75 123 185 -299 -217 35 -143 -12 355 -159 99 127 29
4583 29 69 61 60 218 36 -96 32 -118 102 98 211 -29 10 3 56 8 -237 329 -65 -50 40 -112 168 103 219
4608B19m4LK1n3k11m7K1L00j61j3r3n7j11K3J61j59K45J1l99L43k85M28Nk48O2
4633c9J01L0l2L3p7K45k43N2oRP1m69M47l02J65j3P8j80J90Q8k35M21l70K34j14
4658H4j43o6J39k2Mk01k3J46J13R8J02j31oj53J09J02k97J55J37m95O04k38j42
4681a24O1Q5O1j54J28j04KJ39j79N5r8R6N5J61Q3k60q8j98L15l4n5j26Q7J92o9
4706C1k49N11j71k36K95j92k09L21K9q1P2K3k11M1J93j90P1j42K4O4J18O1Rm67
4730b85M09l2n5K03k25jOJ05k11J0J4r1J11k54K80J33j58N6K00k83J31K9j18j40
4754a66p3J53L05j46j85L29k14l6K23o2j78l1j52K41j60K15M5k0j71J37p4qr0
4777a18P7q4K38k03L58k00J50l58J7n1J64J50n03K27L0K58l42J46nq0Q1j5r7Q6
$$ plain form
4608 219 175 178 199 146 -65 -112 -91 209 48 35 -58 -115 -226 -203 -42 -201 44 55 -344 -1 -286 142 147 -101 -39
4633 -39 62 92 60 93 16 261 18 70 64 73 144 -325 122 -180 -15 -28 50 -130 60 148 -87 334 -36 198 84
4658 84 -59 -125 14 -8 -4 -205 -228 -82 31 129 231 100 94 -59 50 152 -145 10 147 -348 256 18 -124
4681 -124 -63 22 83 -71 57 -47 -45 94 -85 -30 -128 -32 23 184 267 7 -81 -279 36 2 -53 -179 -92 100 31
4706 31 -218 293 122 -114 181 -11 -220 101 130 49 121 144 -67 -26 167 -23 48 -94 -70 -6 112 173 182 -285
4730 -285 124 92 37 240 15 14 20 125 -86 -76 -62 -153 -42 -296 -16 117 -41 15 215 -68 63 92 -26 -166
4754 -166 -239 -86 219 73 -112 217 3 -33 190 128 -50 -81 -233 8 -152 63 108 88 -83 54 -20 -28 -118
4777 -118 -41 -125 113 -90 268 68 218 -140 -123 -174 -10 140 -363 -136 -106 152 -190 -44 -49 -129 -48 -63 -160 -74
4801g4K20j03k60Q7L55k3J81k47l70K89N0j31Q5q0j35m9K95o5j80N1qK21k99J55
4825c5J3J53m14Q2J30j36K18R0j74Om4J04J03K17k41j29K58k64J18k11J56j80
4847a80J26m3L89m7m05K79k94N9J60%L6q7J57k37Q5j32R7J70J14j79m9r5J37Q
4871F9l51K03j90L00pk37M44l30J35j68L5K0qK1N7p8j03j70O00m15J81j32O8j94
4895b50p5M11o8J27k38OL8J69j97RL2l8O2j52M23m05K96J3j28j19%R6l0j24k54
4920c96K38N7Q1j56J53L9L4l4K41m50K79j80K59l47N6J18m6L28k59P7q1J9Mk76
4944b42M54l45K02P3j25n6P9K0J28j32K1l5k92K05j73J90J59p1j73o2J39j67K61
4967E8j57J6K6O4P4o0k52M82k38j0J10l45L21j62Q5k9J22j42j17J78j11J39k43
$$ plain form
4801 -74 146 43 -217 -130 225 202 383 136 -234 55 105 -26 59 -21 -156 -205 90 25 -155 -104 -112 109 -190 -35
4825 -35 -22 131 -283 -201 -71 -207 11 101 -73 -67 -111 -7 96 313 72 -57 201 -63 55 -156 0 -180
4847 -180 -54 -97 292 245 -160 119 -175 -116 44 44 80 -7 150 -87 -2 -134 -37 133 247 68 19 -76 61 69
4871 69 -282 -79 -269 31 24 -213 231 -99 36 -132 -97 -77 -85 -64 -7 -85 -188 -358 242 -173 8 -124 -56 -250
4895 -250 -325 86 18 145 -93 -87 -49 120 -77 -68 -36 -74 -12 -164 259 -146 150 163 35 -84 -84 12 -18 -142 -396
4920 -396 -158 -101 -20 -176 -23 16 50 16 257 -193 86 -94 165 -182 -126 -8 -54 274 15 92 11 30 34 -242
4944 -242 212 -133 69 142 17 -39 40 60 188 56 77 42 -250 -45 -218 -28 131 60 -113 -175 -36 -203 58
4967 58 -99 -83 -57 7 81 21 -231 251 13 3 113 -232 89 -73 12 -17 105 -37 -154 24 -87 52 -191
4990a91J18k1k2L11n9j11j73L01m5Ml33K10J17j04O3o7j84J62m0J86M9j53j88
5013a70J12J17o0q1O0jL75l45q1J69j20n0J08O0N8p1k31j79M99l3l37L94m94J06
5037a95K40j20R9L29m78O3J70k9k22J47r5K8L48l12M3n1o2K17J52j70k96L67m11
5060b38M81l26p8M8J69j93k0k48L70J56k28J99k25L7K70j53J23l05K66j22j0k04
5082b31L37k02J92r7o6J09j25K63j06J47j64J59q0l4k82L34l66N5R5k4R9m3k5
5105e5R9O5k63M73j35l12o0Q6J35j44J73O1k78L04j76m9K13k5p6P4k05m0J27k72
5129b80M09P6l80J13K53l25M08k89J22j42QN3Ok51L37j74K76k66l5K21j22n6L9
5152AK70l02L68o10J74J80k52L81j43K6j41Kp9L84j43k13L17k45J68k99J61R9
$$ plain form
4990 -191 -73 -94 -116 195 136 25 -148 153 108 112 -221 -11 106 2 65 -2 -186 -24 -64 122 171 18 -170
5013 -170 -58 59 -1 -82 -22 -23 352 7 -74 95 -25 -75 33 93 151 80 -151 -330 169 136 -201 193 -301 -195
5037 -195 45 -75 24 353 -125 -62 108 79 -143 4 -91 -63 285 -27 16 -35 -97 120 272 102 -194 173 -238
5060 -238 243 -83 -161 -113 56 -137 -157 -405 -35 121 -107 92 -133 -96 174 21 144 -161 105 -17 -27 -231
5082 -231 106 -96 96 -1 -67 42 -83 180 74 221 57 216 136 102 -180 154 -212 -157 -62 -86 13 -30 -55
5105 -55 44 109 -154 319 184 -128 -188 -102 33 -111 62 123 -155 149 -27 -76 137 112 36 110 -95 -135 -8 -280
5129 -280 129 205 -175 -62 191 -134 274 -15 107 -35 -27 26 32 -219 118 -56 220 -46 -81 140 18 -38 1
5152 1 271 -31 337 -273 -99 81 -171 210 67 93 -48 -46 -125 259 116 -97 220 -25 143 -156 5 104
5174A04J62m99J28K09k28K42k53J26k4j4p6J77l47M39j52PK3j55J40J72j10Nj47
5197g1n4r7M41o5j47N0K01k48o3J28L3k29R0J60j20Q8j46o0P5K6K5p7j4J40j97
5222a31m6J84j16j3J94J21n8l35K36J89l01K9o4J9J71p6k22K02O7o2O2k6J33j82
5246b5J03kn3J60k12j69K42q3J73n6j0k3R6o5j94R9Q9J2N8m9k02M33k39k99J18
5271i8J7K08j77j8K35m56K12L3L26q8l54L27r1j28J57J2l02K5J90N2Q4j14k01
5294a49J03J05J14k53P8K56j28l6j16K6N7j68M41l87Q2j03R0K00n6m3k59K4J8
5317a04J43J18l27r8L11r8J20p3m0J98r7Kj82P5K08j47K60k99K7Q2k20M42j07
5340A94k39R0l49J58J46q5M23m57R0o3pk5R8k3J78k13j70J10K36k25N6q0K27j94
$$ plain form
5174 104 266 -233 -105 104 -124 118 -135 -9 -33 -47 -123 54 -293 146 -6 1 24 -131 9 181 71 76 -71
5197 -71 -125 -222 219 154 7 57 258 10 -53 75 108 -121 -31 129 9 97 -49 -109 -34 -8 17 -60 -74 66 -131
5222 -131 -177 7 -109 -122 72 193 135 -200 36 225 -76 -47 -111 -92 79 3 -219 -17 50 -12 50 24 157 -25
5246 -25 78 76 23 183 -29 -198 44 -39 134 78 68 45 141 76 -118 -19 70 82 140 91 -111 322 83 -216 -98
5271 -98 -81 127 -50 -68 167 -289 -77 -44 282 194 -160 167 76 -52 105 117 -185 -160 30 82 166 52 -149
5294 -149 -46 59 173 -80 -2 254 126 90 -26 0 57 -111 330 -57 25 -78 12 212 156 113 -146 -122 -104
5317 -104 39 157 -170 -268 43 -55 65 -8 -48 150 53 55 -127 -52 156 9 269 -30 -3 79 -141 301 194
5340 194 -45 45 -304 -146 0 -85 338 -119 -29 -92 -99 -124 -26 -49 129 -84 -254 -144 92 -133 -77 -157 70 -124
5364a24L3J50l02P9L9p9J93m7o2K75l57J74KL25m52N4j7J74l9m3k30R1J28j41
5388a76J95n0pJ50m67K34O0k05K39J16P9p6j15J08k36J86j62P6L44k00l99K11
5410i5J50j89M3j3K53k25K13k18qK23j73K63j85j31q4J7K36l74M23K2J03j70j45
5433f4K39l21K71R4k69j44J73n1J22N4pJ24k51Pj9J45l08L14k66K46J56j69j09
5456c3J8R0q6j46j26L97o5j4J59l43L01n7r4L1J05j35k5m2k30M6J38Q3J87k81
5480a22m1K93j60k7J06Q0p6k37J17l2K44o1k29m4K59k18J49Rk33L12r5j2J85j15
5504E2j25r3J11K26j97j43K35j53J44j83j14L14k65J9P1K75l33J89j8j86J73j60
5526a61m0M31j51j12p3L15k48m1J94J5l04K15Mp0j16j4R2L8L3o0j00RN0J37j06
$$ plain form
5364 -124 -91 59 -243 -164 -125 -204 -11 -58 -120 155 -202 -28 -26 299 -153 -99 -116 58 19 -24 -254 -163 -35 -176
5388 -176 19 -31 -38 112 -355 -121 -61 -266 -27 89 168 92 -23 85 -151 35 -127 -51 293 93 -306 -95
5410 -95 55 -134 -91 -104 149 -76 137 -81 -89 134 -39 224 39 -92 -176 -159 77 -297 126 148 251 81 -64
5433 -64 175 -146 125 219 -50 -194 -21 -72 50 104 97 221 -30 -23 -42 103 -205 109 -157 89 245 76 -33
5456 -33 -15 75 -11 -157 -283 114 49 35 194 -149 152 95 1 32 137 2 -23 -65 -295 -249 -111 -28 159 -122
5480 -122 -163 130 -30 -57 49 129 53 -184 -67 -99 145 84 -145 -189 70 -148 1 10 -223 89 -6 -18 167 52
5504 52 -73 -166 -55 171 -26 -169 66 -87 57 -126 -240 74 -191 -172 -101 174 -159 30 12 -174 -1 -161
5526 -161 -201 230 79 -33 -106 209 -39 -80 114 129 -175 40 44 -26 -142 -156 -64 -26 7 -53 -153 -144 -94 43 -63
5551f3M04k81j04L47m05J93r4K45o25K96oJ72L5j77l6K72j66Rj78L55j18l92L76
5574E9j6j4Jk05N97l30j66n8N3J89n9j04J1M7J10k6k5Q4j54K08k6j93j3j70K44
5599D4nj2j61Q6o2l5KK93j38J46l32L17k36j06J56mKJ59j26p7l7J69J34k66R7
5624Hl4j35Q6K4K08m4J3j89J2O1l0M2k9N4J20J05j1l40L57r0j4L6j94J95l5j51
5650B5j49l25M14l7l9k4n1J79q1jJ85l17J87J34j28j9R3M3L4p0q8J74k47k9J44
5675GK9O0j40n7L05k52j10J4J45J7k00L07k72q0M50j88n7J97k8k28p0J32o3k2
5699a04K29k37J74n7rj13R1N5P7Q7m4q2j15J51j16J2r2K87j47nL1R8q0J6k41K65
5725A31Ll70L95p0N0j65K46k64l4J91j71o7O3L03l92J51L0R4k25k6L30r4j95J2
$$ plain form
5551 -63 341 60 -44 303 -102 91 -3 242 -383 -87 -93 79 114 -63 -99 173 7 16 -162 193 75 -317 59
5574 59 43 29 30 -175 422 92 -74 -132 -79 110 51 -53 -42 5 115 89 64 148 -6 202 176 -17 -30 -200 44
5599 44 39 27 -134 -48 -110 -145 -143 150 12 158 -174 143 -93 -199 -43 -47 -45 114 -12 -89 -126 43 177 -89 8
5624 8 -26 -161 -75 -51 157 113 126 -63 -51 10 -20 22 -7 47 167 272 261 -79 278 188 174 210 16 211 176 25
5650 25 -124 -449 -35 -72 -111 -135 -186 -7 -88 -89 96 -221 -34 100 -28 -47 46 89 123 53 -35 139 -108 -137 7
5675 7 36 96 -44 -101 204 -48 -158 -144 1 18 -182 125 -147 -227 223 35 -22 175 147 -81 -151 -19 -82 -104
5699 -104 125 -112 62 5 -4 -117 -26 29 106 193 149 67 -48 103 -13 -1 -93 194 47 42 73 171 91 107 -134 131
5725 131 134 -236 159 89 139 -26 220 -44 -78 113 -58 -125 -62 241 -151 0 30 124 -101 -127 203 109 -86 -74
5749g4n1L02j71l06L54n7M4n6K52k22K11j97K0l08L78k10M6q3L21k84K66j76Q9
5772H8j57J26p7J26k31L09k0j31J88j81KK4J03l79R3M1J19j36J03L8j19lq6J10
5796e0R1n3J0J4Rk92L29l2j84l1Q8k1K96j93J32j00N1j85j24L52nJ22k95M11k37
5821A03k79N08n24L65o2k40K93q5r1K1j40q9K74J88k41l20O12L9l74q4J49J99
5843B22l76J83j91j00L89N4n4m16J88J07N7J20l19K32o8j74J57O6Pq8k54M59j68
5866C3k25M30k59K8K3l1q0M2qM6m2K34j50l8J96j46j92Q0Q7j79J46J38r1J57l83
5891a84K57n5k24J13K06p2k13L40j68o9J53k99K20j16J13J34k53n4K82l54J01
5912a42J74m09N27p6N0j20oP4l76Q3L83m3o3k30O2J51l8N6p3K69j63L1p8j03n3
$$ plain form
5749 -74 -125 177 6 -300 54 -3 41 -15 237 15 226 29 49 -259 119 -91 -45 -128 193 -91 175 -1 88
5772 88 -69 57 -20 106 -125 184 164 33 221 40 42 66 169 -210 -117 -76 43 -93 10 48 -71 -74 -160 -50
5796 -50 41 -12 -2 12 21 -271 58 26 -158 -189 -101 -122 174 -19 113 13 64 -121 -245 107 102 224 -71 340 103
5821 103 -176 332 -192 173 111 -129 164 79 -12 9 -131 -220 54 242 1 -319 293 332 -42 -126 23 222
5843 222 -154 29 -162 -262 127 181 127 -289 -101 6 63 183 -136 96 28 -146 11 77 84 -4 -258 201 33
5866 33 -192 238 -21 7 30 -1 -81 -39 -47 -1 -43 191 41 3 199 53 -139 -59 28 -151 -5 133 42 199 -184
5891 -184 73 18 -206 -93 113 41 -172 168 0 -69 84 -215 5 -111 2 136 -117 -171 111 -243 -142
5912 -142 32 -377 150 74 124 4 -2 72 -304 -221 162 119 56 -174 -112 39 1 57 -16 253 90 121 43 -60 -113
5937a13Q4N6J38m31L49r0m6J8j89J33j4K45j41J03k25J80K64l74m4J28K09k17
5959B3n0j29J08J03k17P3j58Q6K25j29k4K30rj69K17n1l18J65l8l7R5j0j0m3J43
5984G6Lj64j4M9OK03k51Q0p2J3J28k37M23k45R2j04J97k35j90L38l66K6J43RJ63
6009G1k16j9J98j92K61k97P0J69qq3l1J92J8j16j39K11r2o8j1j10JK20J28k59
6033a02j04M57j43j12lj77K49q3K0K07L0j80k08J71j76J8K56L0j22j52RJ9LQ1
6057a2j96K34Nq6O9p5R2m0l7M0J24r7k48o4K22KK21k53J48j41J58k14J71j14J62
6082G1lo5N7r9J54n2m7k40K63l4j87J09j83L72J45l60k9J62j37K26p0N4P3j67
6106A3o8j22M21k22n5m6J9R6l18K46o9j6K31m7j6j04n7O6J46K9k47J58k2n7J8
$$ plain form
5937 -113 -29 27 165 -266 83 -7 -53 -35 -224 -91 -105 140 -1 102 -123 57 321 -53 -97 31 240 23
5959 23 -27 -156 -48 55 -162 -89 -247 -161 64 -65 -89 141 132 -37 180 129 -189 -24 -62 -99 -4 -14 -24 -67 76
5984 76 79 -85 -99 -50 -44 159 -92 -12 -84 -71 57 -180 243 -2 90 -14 183 -52 -242 96 -270 -244 -101 -92 71
6009 71 -145 -164 34 -158 103 -194 -124 45 37 -46 -77 115 133 17 -122 89 -3 -71 -82 -192 -191 29 157 -102
6033 -102 -206 251 108 -4 -7 -184 65 -18 2 209 239 59 -149 22 -154 -136 120 150 28 -124 -115 -96 -93 -12
6057 -12 -208 26 31 -55 14 -61 31 -9 -46 -6 118 21 -227 -291 -69 -67 154 -99 49 -92 66 -148 23 -91 71
6082 71 68 3 60 -39 115 63 16 -224 39 5 -182 -73 -256 116 261 -99 -128 34 -103 123 53 107 180 13
6106 13 -55 -177 244 22 -33 -79 -60 36 -282 -36 -105 -121 110 63 47 -57 -114 -48 98 127 -120 38 16 -41 -23
6131b3o0J08J2p5M2P5j03J09k41j93M36n5J59k26k3l50O19j94l25K29P1P8n9K4
6155C5n8l4J33n7j22Q1j59J58N8m3J90j29n1J72j24j7j39R2J96j02j4l19Q1J05
6179f7K2J51j17P5M2M8j00j8P7j80J23j51J1J81j58R7J36m35L68j62Q5L7J08j89
6203a6%q3J17J57j04J14j28r8J12J2l4K3j62L08Q6l40L9J3o1m3N8L0l6J36j1j32
6229d3J89j75M4P6J80j22k26K6%K13k82k5K4K22q4r4L02k49K7q6j10m6K15P8j7
6254C7k5K44j55N5l66K48j83P7RM6Q3j61l6K91j30k19L80l24J3J94J6p5K05m48
6278b24J90K7J46j40p5O2L2o5q7N9J4K86l30K39l66K82n0R8m2k18K90q9m7J53
6302A45P7k89J02J92J9k92J14P7j42j18q1K96k73J90K8J32k29J47j67R5J45j34
$$ plain form
6131 -23 -83 25 37 -38 4 79 -24 85 -156 -349 87 32 191 -35 -58 -408 211 17 -308 -79 -8 70 11 35
6155 35 -23 -57 76 19 -103 -22 -181 -23 35 -8 182 53 2 174 50 33 -106 -14 182 80 66 -253 -172 -67
6179 -67 -45 106 -11 64 106 154 54 36 113 -67 56 -95 -84 97 -61 36 172 -263 105 -57 28 65 173 -16
6203 -16 -16 -99 18 175 71 185 57 -41 71 83 49 72 -90 218 304 -36 3 16 -45 -88 -30 0 -36 100 89 -43
6229 -43 146 -29 15 91 271 149 -77 -51 -51 162 -120 -145 -121 101 17 -77 225 -24 3 -83 -193 -239 -24 54 37
6254 37 12 256 101 156 -210 38 -145 -68 -59 -13 70 -91 -127 164 34 -185 195 -129 -116 78 94 19 224 -224
6278 -224 -34 -7 139 -1 -76 -14 18 -47 -134 -75 -61 225 -105 134 -232 50 0 98 56 -162 128 39 -8 145
6302 145 222 -67 35 227 246 -46 68 145 3 -115 -196 100 -173 17 45 177 -52 95 -72 23 168 34
6324C4J07k4k58K21j93mK64j77rM6k8j27O1L17k91L7L1L5P7j8j26J38k29K24J31
6349B39m22J16K42m10K91k73l6K18o2L29j83n5k19M0o4p2K20J13j53L76l90k5
6371a80J87k00K13jQ0o0j18J06J67m43K46k9M3m7m5J72J7j31J34l5p2J5q8Q8L
6396B2j14N2l1J73j58J01o5j54J45K31j29j5m6j1j85M10j98K11k2k68m3K01r9
6419HR3Jo9J15ppj25q2O2K08k35L20m30K58j29J67l65M24j64j56Qn3j4J18J38
6444H4j45M0N6k2jn7l6J29j96J19J62r3j89J29j44K05J34l58K68k0j6j66L89l34
6468f2O1k0J8J4O0j47j4l6q8M61m97L21L0rk14P8j60J26L65m35L5K49j6q1j45
6493a06L7J12M9k04L1J64k02J50K23l96J6K25m5J14l34Q7K93k72O3J84j71n5k2
$$ plain form
6324 34 141 117 -141 80 -113 -117 147 -30 -39 7 -21 -148 -87 230 -61 -24 7 42 119 101 -25 113 -116 108 239
6349 239 -183 -67 175 -235 56 -217 -253 -35 -97 232 49 -6 -225 -185 -249 -321 -101 12 -141 235 -155 -180
6371 -180 7 -193 20 19 99 39 -79 27 194 -249 -3 -32 11 -36 -81 91 108 -23 111 76 4 19 -69 19 22
6396 22 -92 -40 -71 102 -56 45 -20 -174 -29 202 73 58 12 1 -184 226 28 239 217 -51 -94 107 8
6419 8 101 102 33 148 141 134 9 -73 -11 197 -38 282 -148 110 -19 148 -217 207 43 -113 -105 -158 -172 -54 84
6444 84 -61 -21 35 13 12 -45 -81 48 -148 -29 133 40 -149 -20 -164 41 175 -183 85 65 49 -117 272 -62
6468 -62 -1 -21 -3 11 71 -76 -90 -126 -214 247 -250 71 101 92 -122 -44 -204 -78 287 -148 -113 136 120 39 -106
6493 -106 -69 43 92 -112 -81 83 -119 31 254 -142 -126 99 54 168 -166 -79 214 -58 5 189 18 -37 -59
6516e9K63m38L83l94J75K8J19r5j72Q3K23j89K11O0k67L69l62P5K6j2Q5o4J4k16
6540a54K73k12j11J99K8N5k6L0k47mk5M1J01J18J49j71j59L50m21J03q5k30L71
6563b7J00j48q8K1L8j2J66j59l0P6K22j66J69j32j44K04j39jK49j84M0k85K54
6586B4q2j15L83k69P6j26mJ10J49j45N8k06J65L4p0j73J55j25P6R0l56L69J7j29
6610i4K92l42J93k5j65K63j64jJ68o6p8q3K09k17N42l51o4j59J10K28n7k36J63
6633F6o1N3j49M7J4n8J12j99j9K37l7J09lk04K10J49k36j53K55M2j97j11j1K50
6657A06j18L50k39k7o4Kr4N5L5j32J47q6L7J36l7lJ5j56Q4P2J25q2m9j50L29j28
6683A28l20J49J67j72o0K35k36Q1O4J35j72k6N9j88K38j74J85J55ln7j63j03j9
$$ plain form
6516 -59 204 -234 149 -245 -70 -42 77 -18 -190 -107 116 -73 138 198 -69 300 -62 13 39 27 112 48 62 -154
6540 -154 119 -93 -204 -5 23 78 52 82 -165 -169 -194 -153 -52 66 215 44 -115 235 -186 -83 -168 -398 -27
6563 -27 73 -75 -163 -142 -104 -116 50 -109 -139 -63 159 -7 162 30 -114 90 -49 -50 199 15 55 -230 24
6586 24 -58 -173 210 -59 17 -109 -113 -3 146 1 59 -147 18 52 -18 -191 -36 -161 -85 5 -351 18 35 -94
6610 -94 198 -144 49 24 -141 122 -42 -43 125 59 -19 -102 107 -110 432 81 17 -142 -32 196 139 -97 66
6633 66 5 58 -91 -44 -30 -88 24 -175 -194 43 6 115 112 -92 118 267 31 -122 133 175 -22 -133 -144 106
6657 106 -12 338 99 72 8 10 -84 -29 6 -126 21 -65 -28 108 71 68 83 -73 11 83 208 126 77 -73 256 128
6683 128 -192 -43 124 -48 -108 127 -109 -28 36 171 -1 -27 32 -156 82 -92 93 248 245 188 25 -78 -97
6706i7J73k12K05j29J01j45J37K2k48J75l6K77j78R5j61K7m4J14k10L7N0L01l49
6729i5JnJ34j1J70k71J00L0K00k15k23Q1L48j95j3P6l74L81L2j67K8j66L72q8
6753A30j37jk25L34J27j82j7p7m9p4J32j49K43m35L64J34N7l68L56p1o7k9j8P9
6777E7J14j02j47J3L51j63m0L9Q6o1k44J2J10J06k69K64j98QL3j73M2j12J61q0
6801a93L30j23Q6q5j33J68n3k22M66l40L13J3Q1m79J87K0j41J03j32Q3J91l5k85
6824a80K96J4r0O3J51l38J53k34L31J1l5j60R9k74L19k74K03J27k42P3j30J1K48
6847A42j54Qp8J73q1p2R1N1k10M8M5p0K05k1k79L38j56K2k53J10K77j39j51K33
6871G9K3k41P7qL04j14p7n6J15J00j20j3j80%L06k65J34R4j18J77l34J51J10p3
$$ plain form
6706 -97 76 -136 69 -60 41 -104 33 55 -193 -18 -54 223 45 140 -21 6 -38 76 -134 -97 -47 254 -95
6729 -95 -94 -99 35 24 194 -77 23 53 253 38 -185 -104 244 49 36 112 -262 119 151 -16 12 -154 218 130
6753 130 -7 -8 -233 101 228 46 29 -48 -97 -171 -39 -188 55 -380 -16 118 175 -193 163 92 25 -4 -22 57
6777 57 171 69 -78 -65 286 123 83 122 208 147 -97 -85 25 131 -138 126 -72 -64 -31 -204 -162 -274 -113 -193
6801 -193 137 14 100 15 -118 50 -3 -225 241 -99 214 227 308 -171 16 36 -105 -2 -134 -51 140 105 -180
6824 -180 116 130 40 103 254 -84 69 -165 166 177 142 -18 81 -193 126 -148 55 182 -60 13 -117 -106 142
6847 142 -12 -4 -82 91 10 -62 29 80 -130 -82 -37 -107 98 77 -202 136 -20 2 -251 -141 136 -3 -154 79
6871 79 102 -139 -62 -70 234 120 43 -13 102 202 82 69 -111 -111 195 -70 64 158 40 217 -117 34 144 71
6895G1J3O8j00lj5j1j08L47k23MJ02k68K12N5j15k4m9J67K4k2m6j8Nk41J55l5
6921e5m0J47j55N19o55J49J07l6K42l20J11K1K62m45K19r1L12k36j76J13j70K69
6943I2m6m4m7J80l12K02L8p0k23L2L37%j4j83j0k17K28K76j01j77P5j35J03l0
6967d6o1O3J09k00K76j85J04j48J55p8J84m1l5k6p9k37L55k46P6K57O0ro98N60
6991A10q4P2j19P6j53K01j11o6Q7q9K23l71M75l31K24mj14oj15J12J56j43O5j42
7015d7l2J92j06MK0J77k28J24j83q2J45O3j04j49K9M67k73J90j97j16P4k20L68
7038A16k6J70k25J90l09K25j99qJ5j92L1K35N9j31n7K29j57K0L43k52K4l33M52
7061B20j51J0m4oj78M15m93K74l0K88j33j99P2k05R2N1N1j3O9J5j79q6N3J68J7
$$ plain form
6895 71 84 152 52 49 34 23 -85 262 39 43 145 -123 89 144 29 5 -44 123 147 125 79 61 66 -175 -20 -55
6921 -55 -95 52 -103 416 -239 -90 17 -19 223 -97 14 35 297 -148 71 -20 292 56 -120 -7 -177 92
6943 92 46 2 -45 135 -177 25 63 -7 -230 -198 139 139 125 -58 -68 -285 -57 219 118 -59 16 -119 -16 -46
6967 -46 -107 -44 65 -135 141 -44 60 -88 67 -11 173 132 97 71 -8 -245 110 -136 -60 197 257 248 -450 110
6991 110 26 98 -21 55 -98 103 -8 -74 13 -76 147 -224 251 -80 144 140 26 20 -95 17 173 30 95 -47
7015 -47 -79 113 7 11 31 208 -20 104 -79 -161 -16 47 -57 -206 -177 290 17 207 10 -106 -32 -252 116
7038 116 90 260 35 225 -84 141 -58 -66 -51 -243 -212 23 82 -49 -106 123 -34 -14 329 77 101 -232 220
7061 220 69 79 35 29 -149 266 -227 47 17 305 172 -27 45 -160 -68 -17 34 21 90 105 -74 -160 -107 61 78
7086G8j7k81J55m2M1N2KJ80K08l19J42j86L3j48J00K1J65k17k9K43j34q2J07j27
7110e5Q6k2j1r0K00r4m5K37k12j01K70r8Nk92K59r3M91l25J8n3R7k4j62K16m2
7135A60j2j70M8L18l33J02M2k20K12k20J30M9O5J8q8j11N3J19l53J81Q0j02j9
7158e1q2L68l36L3J7M2p0K43m1j97Q1J62k09J35J15o8j56K48k11j17J48N3k49
7181a42J36j04L17j21j27o6p6J96L25l72J25J69j59J44j21q4k6k14Q0L73l90K53
7203A16k44J00p1J40J44O9k50OJ85k09J23l33K68k43p7L64KJ14n25K10J74M6o4
7226D5j65J68j03K9J8k05K85N4m5MK12m91L49l37J52P3J18m5K4R1l05j01J69J96
7250A90J97j62k51R3j19Q2k45M70m23K8K4P9J75q9k6P1l7R0k29m7O4q4J44n4J40
$$ plain form
7086 78 61 -220 -65 -107 -66 -14 -12 168 376 57 199 13 46 -102 -2 19 184 -33 -62 181 47 -35 72 -55
7110 -55 31 9 -2 -92 108 14 -31 206 -6 -107 163 65 70 -222 37 -56 435 110 128 75 172 148 -14 202 160
7135 160 148 -22 26 344 11 113 155 -65 147 -73 57 106 171 189 101 -10 43 162 -191 -10 70 -32 -51
7158 -51 -133 235 -101 -68 -51 -9 -79 164 123 -74 7 169 -40 95 210 142 -14 234 23 -94 54 107 -142
7181 -142 -6 -110 207 86 -41 -107 -183 13 338 -34 91 260 101 245 124 40 14 -200 -120 253 -137 116
7203 116 -128 -28 -99 41 185 254 4 10 195 -14 109 -224 44 -199 -276 88 90 204 -321 -111 63 109 45
7226 45 -120 48 -55 -26 -8 -213 72 126 81 85 297 -194 155 -182 -30 43 161 116 140 231 -74 -175 -6 190
7250 190 387 225 -26 67 -52 30 -215 255 -168 -140 -116 -37 138 49 23 94 57 147 -82 -129 -65 -149 -5 -59 81
7275H1j26P3n2K27k29j32J11J39m4J4k24L16k12j0m1R3P3j17N2j9L6Qq1m6K45
7300A35j78J70k98L71m64L17Q0l68L01M2j56k9NO2P7k87K22n8m1k5OK25Q1q3n
7325A02J27k46L04m22o0L95j69l5NqK62m43L47p7r2n9M1n8J73j76P8J75k70L73
7349B67k65%qM0Q1O7k3k96J2O1jO3p0k3K2J54j73K37o6j72J64o6K2j37J43L7J4
7376H4O7k73J00K9J73k33j6l5J03l6J46j25J93n5k35J97K6K42m12K40j56k44L04
7399H4k51K92k53J71l1Q9j42K5O0N1j67j46J06J06R8k53L42j63Q7Mj40j1J0L7
7423EP4j32j44M14k02Q1k20K67Ol06MK53k8J61k78J04k04J35j83J41M2j04K50
7446A36j01k1j51K10k20O6M7R0P2j38j86L82k27N4K87m96L27j87R8j44j18J11
$$ plain form
7275 81 -45 28 -24 203 -26 -158 -47 92 48 62 -162 154 -58 -68 -109 -16 57 -60 -8 -27 9 17 -64 -110 135
7300 135 -43 127 -171 200 -264 53 133 -235 66 108 -48 -77 -72 -10 67 -220 2 -56 -97 -122 -116 109 190 107 102
7325 102 229 -17 287 -135 -195 200 31 -4 1 -7 255 -188 159 82 -10 -69 -28 -86 87 -89 -11 164 -106 267
7349 267 2 2 -6 34 115 182 159 -137 -125 -64 -65 -2 -72 -95 -73 81 -92 145 79 -93 71 5 27 -110 33 70 84
7376 84 151 -122 -22 7 180 -53 -69 -104 -1 -37 109 -16 177 122 -113 84 110 352 -60 180 24 -220 84
7399 84 -167 125 -128 43 12 101 -41 -16 44 95 -72 -218 -112 -6 92 -161 181 18 105 109 -31 -42 -32 5
7423 5 79 -53 -197 217 15 96 -124 143 149 -157 -153 100 72 233 -45 59 -145 -10 -193 -52 -10 -114 136
7446 136 35 14 -137 73 -147 -81 -34 56 128 -10 -196 186 -41 13 300 -196 131 -56 42 -102 -220 -109
7468a09J65r6p6l1M09N1k65j77l7J48J23p5M1q7J63l49K66J27n2l42J1K36l9k87
7492b82M07p1n5P8R6j16j40PL08k31r6N7k36L75k63K57o1p6J93k26K0k9j3R6O4
7517F3j09J70p5j74J88j82J9J37J4J42j73Q6O1q4n1P4l56J53J45p2O3r1mR4p2
7542c4J10M8o9Kj57P6j27L06J15p2l03L10k37oK2j40J05m7L85j73k04J89j4j30
7566d5opQ0K9R6k25r4K25j38L22k94J06O3k06J91j11j29J70M4j8j44Lj0K18l7
7591H3k00K60j64J38j89J94J59j90L2j51J49j01j12q7N0K38j47O9k31l5M25j53
7613C7M2k39K51j75L32j75N2j70j67P9j09L46l85N30j48q1Rj24p6L01l98L62k37
7636a43J2K11j12qJ17M7k10L0l6Q6p6Q3k5r5j36K43j7K38j82J3j32k7Q1k82K70
$$ plain form
7468 -109 56 -40 -116 -147 262 313 48 -129 -166 -18 105 30 71 -16 147 -202 64 191 139 -203 -192 44 5 -282
7492 -282 125 54 -1 77 173 57 -83 -76 232 1 -95 -38 -274 101 -162 95 34 -42 151 -75 -55 -84 -97 -1 63
7517 63 -46 124 49 -125 63 -119 -100 37 51 193 20 106 167 83 32 106 -250 -97 48 -24 39 -52 -56 38 -34
7542 -34 76 124 55 57 -100 -24 -151 155 270 198 -105 205 -32 -38 -16 -156 -51 -98 287 114 -90 99 85 -45
7566 -45 -51 -58 22 51 147 -78 -172 53 -85 237 -57 49 112 -94 97 -14 -143 27 71 53 -91 -88 -98 120 83
7591 83 -117 143 -21 117 -72 122 281 91 123 -28 121 20 -92 -179 -129 109 -38 31 -200 -235 190 37
7613 37 79 -160 91 -84 248 73 125 -45 -212 -133 -242 104 -281 249 101 20 29 -95 -171 130 -268 94 -143
7636 -143 -131 80 -32 -40 77 124 -86 -56 -92 -6 -82 1 -24 -119 -255 -12 -29 209 27 40 -92 -119 -38 -320 -50
7661e0J38j17J12j0J12n9l15J53J43j24k07L92j46r0M29l13K6J2R0l00J45j10
7683h9J96Ll55K10J60m0mj31rJ26k8M0j40M8N4j43O9J29j81o3O4r4Q0J22j6oJ49
7710A51j20Q7l2k0q3j96M49m63O0K63lm0R6k12M1J83j18M4k9j1k44J2R7L10r1
7735A31m5n6o4j02K76k18K7J69l83K83J81J6m00O2J58R6O2q3l9q9M7k07K90j02
7759A0N1j5J7N8j55j0L36j99p5j61J18L1J77k89j34Q4L74j88L4Q1j04J3k51K69
7783G2q1J0K76j83j14J03n3p6ro0j85M89j36J07j50L0l16J62no1J40Q2J14k54
7807i8J92q0kk5j40k5M5R8q0N5LN8j00j33M28j84j8M9k8K16j02j49j12K57o5n5
7833Ej19l0K30M5j79K14j07j57J13om5J05j7J41k89L54q7M7j78R3j82j99K66k08
$$ plain form
7661 -50 88 -29 83 73 185 126 -189 -36 107 -17 -224 168 22 -68 361 48 74 86 176 -124 21 -89
7683 -89 107 110 -245 -35 125 85 81 -50 -59 67 39 79 -61 -13 41 -102 -33 96 -85 -148 -84 -178 -98 24 8 2 151
7710 151 31 118 86 66 -17 -213 236 -227 -167 96 93 53 149 -63 -22 161 43 87 58 47 -197 -185 -88 222 131
7735 131 86 30 -34 -136 140 -78 -51 118 -265 18 199 215 -185 -123 35 131 193 110 71 -18 29 -178 112 10
7759 10 61 46 63 121 -34 -44 292 93 18 -143 -25 6 183 -106 -240 -156 218 30 64 145 41 54 -197 72
7783 72 -9 1 277 94 -20 83 30 -46 -55 -115 -300 189 53 160 10 40 -276 -114 -119 -180 -40 42 156 -98
7807 -98 94 14 12 -13 -153 -178 -133 -35 -115 -60 -57 1 -99 -232 196 12 -6 43 15 231 129 -20 -132 125 60 5
7833 5 -114 -144 86 131 -48 166 59 -98 15 9 -36 69 52 193 -96 258 171 218 40 133 -49 -248 18 -190
7857a90L06k47r3L52j16k21L45R7r3J97l00j21QK98O6n27K67J1j40K0J13p5L15
7880B72n39L70K26l51L8Nm5qL5N2k5k9k38Q0J35k67L75j64J98k36J02K1p2jK73
7905B07m2j77R6q6j84K02N0l70M37l25J15J43k00K36J37j5n26L8P3L0J49J73j06
7928E5n0J94J2k80P0J52j72P6j72p6J55O0j16J16Ok31J99o3l25K20O3K59o0j47
7952e5K95m86K86K05m85M28k42r3M4j6K7r1L37r3J32l12J87l2j33R6L1j84K63
7975A09k21J25K6J3j18J32k43J74n5M6K82j07q1j69N6m6L8J71k37J27l42L16J35
7998A31l13L55L9J7k49q4K48P7k17Kk0K5P9Jq6%j01QK28j39J66l29P4O2j42K70
8024A02lj4J8Ok01J56N9k36J37j92R8r6K28j23J96j91N0J89l27J0j39L0K87j26
$$ plain form
7857 -190 116 -131 -224 128 12 -209 136 233 140 337 37 -84 -76 222 288 -239 28 39 -101 -81 32 -43 272
7880 272 -267 103 329 -22 16 21 -24 -32 3 55 30 1 -237 -157 -22 -289 86 -78 120 -116 -14 7 -65 -66 207
7905 207 165 -12 84 -2 -186 16 66 -304 133 -192 -77 66 -134 102 239 224 -302 -264 -191 -161 -12 161 55
7928 55 5 199 211 -69 1 153 -19 57 -115 -191 -36 24 -92 24 30 -201 -2 -65 -390 -170 -107 152 92 -55
7952 -55 240 -246 40 245 -240 188 -54 -147 -103 -119 -92 -183 154 61 193 -119 68 36 -97 -1 30 -154 109
7975 109 -112 13 39 52 -66 66 -177 -3 -58 -12 270 163 82 -87 -31 -77 -39 132 -105 22 -320 -4 131
7998 131 -182 173 212 229 -20 -104 144 221 4 6 -14 11 90 91 5 5 -96 -88 140 1 167 -162 -88 -26 -168 102
8024 102 99 85 103 109 -92 64 123 -113 24 -168 -70 -166 62 -61 135 -56 -6 183 -144 -134 -273 -243 44 -82
8048h2K04k17K74j45j3k8j3N5k9N1K33k41m4Q4M0k33Q4J48k62L3J09j10r4K32
8072C6R0j19j59J98k3P4J8j2p3J32P6j50k28J83N3k80K88m25K62J63k60r9J53
8095a02J84J88l64K56j31J8M4R6k29m7L33l23Q8j12J21k00M60k24J4j4L7q7L5
8118D1J56j22J68j46NK3j76j26Q4J62k4qR9J2j23J2j80L01j29j79OQ8n2L5L4J29
8144I0J5k12j4J72j24J27K9j56J64Q4k40O8j1R0j83k0QL66o8k81j17L01q9M8j10
8169f3J70l14L67K6l53J11N3j68J43n9n8J76j14N7p1Q1j57J15l7Q1J0N9
$$ plain form
8048 -82 122 -95 179 34 21 -7 -20 35 6 57 290 49 5 89 129 -104 -20 128 -134 -101 8 -102 -196 36
8072 36 126 7 -152 46 23 97 115 103 30 162 238 88 -140 43 96 -184 104 -321 -59 104 -156 -255 -102
8095 -102 82 270 -94 162 31 49 93 189 -40 -87 246 -77 11 -101 20 -180 280 56 70 56 93 6 41
8118 41 197 75 243 97 102 125 -51 -177 -93 69 45 37 136 148 25 37 -143 158 29 -150 -144 -56 -108 -73 -39 90
8144 90 105 -107 -121 51 -73 54 83 -73 91 175 -65 3 -8 82 -101 -121 -113 253 185 -96 -213 88 -1 47 -63
8169 -63 107 -207 160 186 -167 -56 -3 -171 -28 -87 -145 31 -83 -26 -97 -16 -173 -58 -95 -14 -4 55
8191E5
$$ Imaginary data points
##PAGE= N=2
##DATA TABLE= (X++(I..I)), XYDATA
0@%%%%%%%Qj6J6k4L2m0N6p2Q8j12J37j61K00k44K92l48M12m83N63o56P56q69R98
30E33j143J302j478J673j887K127k390K677k992L335l711M120m567N057n591O175
46C240o812P507q268R102j0021J1035j2154J3398j4790J6356j8130K0162k2512
59a1887K5263k8541L2519l7456M3763n2127O3789q1224J10285j69942M64212m55821
71i7167k10117Q48111j034832P22570j55763l04546M12155j76795j63919L22099
81A61796j57742k30302N73210o16622K91371K39213o80752P93018n34413P5350
91h5873L19305m58746L33088r8768m7011R593J47038k53147J64179J21139m49533
102b98736O08924m71061Q5710L44626n85823N18182k08045j40839L17369k39389
$$ plain form
0 0 0 0 0 0 0 0 0 8 -8 8 -16 16 -24 32 -40 48 -64 73 -88 112 -132 160 -188 224 -259 304 -352 404 -465 533
30 533 -610 692 -786 887 -1000 1127 -1263 1414 -1578 1757 -1954 2166 -2401 2656 -2935 3240
46 3240 -3572 3935 -4333 4769 -5252 5783 -6371 7027 -7763 8593 -9537 10625 -11887
59 -11887 13376 -15165 17354 -20102 23661 -28466 35323 -45901 64384 -105558 358654 -97167
71 -97167 -307284 540827 -494005 228565 72802 -231744 180411 3616 -160303 161796
81 161796 4054 -226248 346962 -269660 21711 260924 -419828 373190 -161223 -85873
91 -85873 233432 -225314 107774 9006 -38005 -28412 118626 -134521 29658 150797 -298736
102 -298736 310188 -160873 -75163 269463 -316360 201822 -6223 -147062 170307 -69082
112f9082j1K02175j99941k4756L26607m90952L75761j1711m07534O43409n59011
123b15046K01091K28804m98495M83056k30327q0344K58504k19998K9325J55600
133A12170j93329N2415J70813l22205K92708q9009j72929L43679l32571J60730
143B2472N8686j99416J98850r0445k8041O8075r627q8401J34840p4854o9173K09167
155A32133k49916J54984K7154j92104K45551j62253J360J32688j58973P1258O0940
166F2822j40837J08987J7443j55531K09844j36782k6429J85650k46460J74865
176E3572j4512j40801K04263j49963K2170R5124j32670P8410K1414r5886R6316
187C7437k5999o5913J17240r4950J5069P1884j13298Q8321j8440n0038P6139n1356
$$ plain form
112 -69082 -69093 133082 -66859 -91615 234992 -255960 119801 108090 -299444 343965 -215046
123 -215046 -13955 214849 -283646 199410 -30917 -111261 147243 -72755 -43430 112170
133 112170 -81159 -28744 142069 -180136 112572 23563 -149366 194313 -138258 22472
143 22472 81158 -118258 80592 -9853 -37894 30181 20554 -67847 66993 -7861 -77034 132133
155 132133 -117783 37201 64355 -127749 117802 -44451 -43091 89597 -69376 1882 62822
166 62822 -78015 30972 48415 -107116 102728 -34054 -60483 125167 -121293 53572
176 53572 39060 -101741 102522 -47441 -25271 69853 -62817 15593 37007 -58879 37437
187 37437 11438 -54475 62765 -32185 -17116 54768 -58530 29791 11351 -38687 37452 -13904
199a3904L39L8540l8855M272L6524n0906K5700K2932o2511O4925k6303k8984O7003
212C8772o3906K2033L0082n8959M8102o256l8189N5668l5145r750M9346n8292
224b6494L1077J5433n2085N6879k8953j3618M5246m8144K3019J2393l5773L5277
236A4257j3772j3567K8985k4384M706J6061k4331J6816Pj4915J8801j1060k202
249d598J1984j2836N196N017j0075P418K93p250Q185l161m160Q755p349J349N448
264D216q747O313o3n842P927m755q18N518o867L950R52m819N236k577j155L881
280B350l994J998P73k566K578j297m01J592j508O18L68j173J187p61J59J54j27
297e0j39J41j21L66l60j1J84J56k63Mk61J24K60J35j03l8O0J54j39k19K47r5l75
$$ plain form
199 -13904 -13565 24975 -13880 -9608 26916 -23990 1710 24642 -37869 27056 753 -28231 38772
212 38772 -25134 -3101 26981 -31978 16124 9868 -28321 27347 -7798 -17548 31798 -26494
224 -26494 4583 20016 -32069 24810 -4143 -17761 27485 -20659 2360 14753 -21020 14257
236 14257 485 -13082 15903 -8481 -3775 12286 -12045 4771 4778 -10137 8664 -2396 -4598
249 -4598 7386 -5450 -254 4763 -5312 2106 2399 -4851 3334 173 -3987 4768 -2581 -1232 4216
264 4216 -4531 1782 1719 -4123 3804 -951 -1769 3749 -3118 832 1784 -3035 2201 -376 -1531 2350
280 2350 -1644 354 1127 -1439 1139 -158 -559 1033 -475 143 511 -662 525 -236 -77 77 -50
297 -50 -189 -48 -169 197 -163 -174 10 166 -97 -93 -354 -230 30 165 62 24 84 238 99 -120 127 32 -343
320c43M99j45k92J89J63j32J0K29j85R7rK7m95J37M46l59L34k16j50K30l44Q1
342b28M26o27N82j29m18O12k01KM7l03M68l44k22N75o45Q44l79n53Q73p14M21
363H7M40j245J298m84p37J354j288M78J022j964J580j97j397K303j948l5K418
380A685l254K051J222m143M749k807j620N244n848L082J979n641N658j753l746
395c142O674n002l54O376q739N471J686q583J0708o434j929R276j0857N538K966
410C655r151Q337j041p033J0267o015l767J3073j4845O615O685j7199J8059q108
424d68o735J7105j6120M371R529j5884J0626M152j8390K0803q610j1971K8420
437A6828k8944J2207J2491l0901L1963j5236q679K4967k4232Q017J1865k1085
$$ plain form
320 -343 156 11 -281 -92 71 -61 -51 178 -7 90 81 108 -387 -250 196 -163 171 -45 -195 35 -309 -228
342 -228 198 -429 153 24 -394 218 17 19 66 -237 231 -113 -335 240 -405 439 60 -493 380 -334 87
363 87 527 -718 580 96 -641 713 -575 -97 925 -1039 541 344 -1053 1250 -698 -733 1685
380 1685 -1569 482 1704 -2439 2310 -497 -2117 3127 -2721 361 2340 -3301 2357 604 -3142
395 -3142 3532 -1470 -1824 4552 -4187 1284 2970 -5613 5095 -1339 -3268 6008 -4849 689 3655
410 3655 -5496 2841 1800 -5233 5034 -981 -4748 8325 -6520 95 6780 -10419 7640 -468
424 -468 -7203 9902 -6218 -1847 7682 -8202 2424 6576 -11814 8989 379 -11592 16828
437 16828 -12116 91 12582 -18319 13644 -1592 -10271 14696 -9536 -1519 10346 -10739
449a0739J3115O911k5325K7966j1281j5313L6151l7474J7970J1302l3074L4390
461A4599j6743p158K1069j6666p62J7046j8147R48K4074l9162L1462k698l1945
474b4083N1779m3902J2512K3296m1815L3639o387k0464K7412q952k1024L9792
486B1803l0959l739M4500o6023N2237q229m1869O9388n9902K0529K4269m7720
498b5715L8782p586k2224K8878p627k5174M5543l6160j309M4940o7996N5680j4195
511E837l2668N9074n2399K0295J3538k7567J6446P221k1575J2204J7069m7207
523b9732N4966k9204j8579O1366p4358M9221l64m3030N6482l5782j395K8298k6039
536h150l200L6435m6222K1497K6454o9661P8814m5006j4669O7731q4457N7681
$$ plain form
449 -10739 2376 9287 -16038 11928 647 -14666 21485 -15989 1981 13283 -19791 14599
461 14599 -2144 -9302 11767 -4899 -5661 11385 -6762 -5814 18260 -20902 10560 7862 -24083
474 -24083 27696 -16206 -3694 19602 -22213 11426 5039 -15425 11987 3035 -17989 21803
486 21803 -9156 -12895 31605 -34418 17819 9590 -32279 37109 -22793 -2264 22005 -25715
498 -25715 13067 5481 -16743 12135 4508 -20666 24877 -11283 -12592 32348 -35648 20032 5837
511 5837 -26831 32243 -20156 139 13677 -13890 2556 9777 -11798 406 17475 -29732
523 -29732 25234 -3970 -22549 38817 -35541 13680 13316 -29714 26768 -9014 -10409 17889 -8150
536 -8150 -11350 25085 -21137 360 26814 -42847 35967 -9039 -23708 44023 -40434 17247
548A7247n876m0335N5375l4844k308K8061k5119l288L6191m7273K4996J8917n8522
561c6778O9296m3751m053M6655o0832M2349o954k1563K6519r396j2334J9589l598
574E149k5889M7643m3252J0323L3153o2052N9158k5786j8346M7339m5373J7626
586c07J5232l0325J7895J1979l6377L5857p147l3505N9996n4792J8599K9033o0687
599c4549N9269k7549j4531M2053m0776J5700J3797k7932J7847P858k9885L1888
611A3190j1163k0043M2332m1236J7164J5298l6796L6622j7319p518K1498j7387
623e358J509J2731j4188P41J8013k7998K0165K048k5512L6030k6220K012K1478
636A5451l0772K1169J49j8302K1523q302j1555K3740j9652P55K1236l1725K3476
$$ plain form
548 17247 11371 -28964 26411 -8433 -10741 17320 -7799 -11087 25104 -22169 2827 21744 -36778
561 -36778 32518 -11233 -15286 31369 -29463 12886 5932 -15631 10888 1492 -10842 8747 5149
574 5149 -20740 26903 -16349 -6026 27127 -34925 24233 -1553 -19899 27440 -17933 -307
586 -307 14925 -15400 2495 14474 -21903 13954 6807 -26698 33298 -21494 -2895 26138 -34549
599 -34549 24720 -2829 -17360 24693 -16083 -383 13414 -14518 3329 11187 -18698 13190
611 13190 2027 -18016 24316 -16920 244 15542 -21254 15368 -1951 -9469 12029 -5358
623 -5358 -3849 8882 -5306 -4565 13448 -14550 5615 7663 -17849 18181 -8039 -6027 15451
636 15451 -15321 5848 5997 -12305 9218 916 -10639 13101 -6551 -5796 15440 -16285 7191
649G191j037k2100L2592k4636M111J6544k5551J8461j594j3677J7940r020n622
662f398J5850j5165L630J0607j8523J5337l069j0330J6695j2654J861Q128j1435
675e466O742J994q310P458l04p541J0195n881k795J0547j1834N771L783j0794
689f435J1121m555m551R992q842K140N990r877O991N85q029J0535o355j598Q009
704E121r956O218J177p167Q555m847j197N632o490L116J811m941M817j339k615
719b105M346l260L44K675l788K156O03k399K867j496q29J843j336J19J274j916
735i02R76O09j762J766o76r70K077j943N70J288k372J949l80r84J718j427J38
752c25J252j740J188m2q62J068p80p8Q82j118P61J08n52O42p21K15L37n26M47
$$ plain form
649 7191 6154 -15946 16646 -7990 -3879 12665 -12886 5575 3981 -9696 8244 -776 -6398
662 -6398 9452 -5713 -2083 8524 -9999 5338 2269 -8061 8634 -4020 -2159 5969 -5466
675 -5466 1276 3270 -5040 2418 2114 -5427 4768 -1113 -3908 6639 -5195 576 4359 -6435
689 -6435 4686 131 -4420 5572 -3270 -1130 4860 -5017 1974 2559 -5470 5065 -1290 -2888 5121
704 5121 -4835 1383 2560 -4607 3948 -899 -2096 3536 -2954 162 1973 -2968 1849 510 -2105
719 -2105 2241 -1019 -675 2000 -1788 368 971 -1428 1439 -57 -886 957 -379 -260 1014 -902
735 -902 74 683 -1079 687 11 -959 1118 -825 -255 1033 -1339 610 230 -754 964 -463 -325
752 -325 927 -813 375 333 -529 539 -241 -319 563 -555 206 314 -238 404 -317 -102 235 -291 156
771A56j71%K7NJ3J40k30R1k97Q9J93p4J57j7J43l65L08l35J73J57l46J88J1j40
795a24J32j45J17l8J0J2P9k37M29j56P3j46k81L05K75l27j24N6k7M46k31m06L79
818G1l12J38L23k2l0m5k68L50l88L15P4l65L38j10j42K74q3k45O08r70O06O9m57
841b71M83j07l85P16p01M71K06r81R01k20l58P55p78J42N11q33O20P0q42J148
861E47n38n05J011j241P92O23j285J181o98m99J461j570M17Q99j512J420o8j503
879a068K260j753J28J533k051J216K56j720J980o43j044K097j889L26J711k854
895a515K061J76k038L015k430O0K389l190J985M57k597K763q05k232L714k788
911i75R6K982m740L767m01l058M660l459K66K752l755K271J023l470L239n92l022
$$ plain form
771 156 -15 -15 12 17 30 170 -60 31 -266 -177 16 -58 99 82 225 -140 168 -167 6 163 -183 5 16 -124
795 -124 8 -137 -20 -58 -48 -36 43 -194 235 79 152 6 -275 30 305 -22 -146 -90 -117 329 98 -308 71
818 71 -241 -103 220 198 168 123 -145 205 -183 132 206 -159 179 69 -73 201 118 -127 481 -489 117 186 -271
841 -271 212 105 -280 436 -265 206 412 -569 332 112 -246 509 -269 -127 384 -449 171 241 -601 547
861 547 9 -496 515 -726 66 689 -596 585 -113 -612 849 -721 -304 595 -917 503 435 -1068
879 -1068 1192 -561 -433 1100 -951 265 521 -1199 781 138 -906 1191 -698 -372 1339 -1515
895 -1515 546 722 -1316 1699 -731 -671 1718 -1472 513 970 -1627 1136 331 -1901 1813 -975
911 -975 -879 2103 -2637 1130 729 -2329 2331 -1128 -862 1890 -1865 406 1429 -2041 1198 606 -2416
928b416N204m477P47L885o331N246j347k930N230m168O21L058l903J408K446m856
944b583L705L98n100P464n334r6N329p581N591p67m290O125l482j089M320l903
960a293j66N101p393N132R98p362R771p176P09O018r254O921r23m191N780l168
976d96j801N127m121p55O624r156O279P66q004J1073q260J411N327p981N680o84
992A029l411L565k4m346O132l462k759Q979j0373N669K219q910J0727o696j02
1007a763N778p095L282K252n417L543K208p492Q542m227l527J0404j2111P294
1021A671J282q818J0794o968L52N186n872K047K802n473L428K504p887R031m618
1036e39k922R366j1110O827O40o489P859m563m55L645l279o11M765n210J426M245
$$ plain form
928 -2416 2788 -1689 -942 2943 -3388 1858 511 -2419 2811 -1357 -736 2322 -1581 -173 2273 -2583
944 -2583 1122 1520 -3580 3884 -1450 -1546 3783 -3798 1793 1026 -3264 2861 -621 -1710 2610 -1293
960 -1293 -1459 3642 -3751 1381 2379 -4983 4788 -2388 -1679 4339 -4915 2006 1083 -3108 2672 -496
976 -496 -2297 2830 -1291 -2046 4578 -4578 1701 2467 -5537 5536 -2724 -1313 4014 -3967 1713 1029
992 1029 -2382 1183 1159 -3187 2945 -517 -3276 5703 -4670 999 3218 -5692 5035 -1661 -1763
1007 -1763 4015 -3080 202 2454 -2963 580 2788 -4704 3838 -389 -3916 6488 -5623 1671
1021 1671 2953 -5865 4929 -2039 -1687 3499 -2373 -326 2476 -2997 431 2935 -4952 4079 -539
1036 -539 -3461 5905 -5205 1622 2262 -4227 3632 -931 -1386 2259 -1020 -1631 3134 -2076 -650 3595
1052C595q610Q331l292l736Q508q570M313K104o238N848j865k761M559k287k486
1067b587O484o634K107M399r086R053l955k730P484q283M339J404n057M952j596
1082B94k453M288k347j965N485n767K377K907o558O803l382j371M715m957K289
1097C58J044l108K219N94k910K793m55l071N456m396N89L473n778M925j345k548
1113b160M525l612N91K445l337J452J586l679L434m55l171N144m598J646K417
1128B228m759L971j474j540L302k769P88J703k672J432P71k521L101j556j286
1143a281L371l171R49J282k694K477o20j047J578j038o4J309j648M55J030k104
1159a216J561O2j392K200j788L63J203j851J434l95r13J426o73o37J542j660N54
$$ plain form
1052 3595 -5015 3316 24 -3712 4796 -3774 539 2643 -3595 2253 388 -2373 2186 -101 -2587
1067 -2587 3897 -2737 -630 3769 -5317 3736 -219 -2949 4535 -3748 591 1995 -3062 1890 294
1082 294 -2159 2129 -218 -2183 3302 -2465 -88 2819 -3739 3064 -318 -1689 3026 -1931 358
1097 358 1402 -1706 513 1107 -1803 990 535 -2536 2920 -1476 -887 2586 -3192 1733 388 -2160
1113 -2160 2365 -1247 -656 1789 -1548 -96 1490 -2189 1245 790 -2381 2763 -1835 -189 2228
1128 2228 -2531 1440 -34 -1574 1728 -1041 -253 1450 -1222 210 981 -1540 1561 5 -1281
1143 -1281 2090 -1081 -132 1150 -1544 933 313 -734 844 -194 -258 1051 -597 -142 888 -1216
1159 -1216 345 407 -985 1215 -573 -210 993 -858 576 181 -732 694 21 -616 926 -734 -180
1176a80J191k036J829q87p05J918j660P34M87j481J300o02m11J010q78J58P79
1193E66p08J2N48q04N70j80q0O28r40O35k34m12M45J41l40L81m21M4M89o23K18
1214f5K76l86L95p1k88L42m19J93L34m80L99p8k19L51j64k06P6j48K28J92n71
1235c09N49j65L2J17j37j05J99o73P67p5j87J90k58K74j19j95Q1Rq6K47k60P1
1257c3k27K07J17J24k49K6K51k56N0J92m3J56l97J64N2k23O6M2M5j06o4k0J89
1280F3o9K04k12O6j17J17j56K29j36l0J43j43O7M9j20P2N9Q2r0p8L08j97j33M0
1304A8k1j47M39j63Mk45L4kJ75l37L43m34L06l8q7K44R0k11J58l64L26J33m60
1327b39J61J66j76J90j5k19L13l94L49J30o72M42J75o84Q04k65j92J69j09K51
$$ plain form
1176 -180 1011 -1025 804 -83 -788 1130 -530 204 691 -790 510 -92 -503 507 -371 -213 566
1193 566 -142 -130 418 -386 184 4 -76 552 -388 247 13 -399 46 187 -153 228 -193 -149 340 -283 -65
1214 -65 211 -175 220 149 -139 203 -216 -23 311 -169 230 152 -67 284 120 -86 -10 -158 70 262 -309
1235 -309 240 75 107 224 87 -18 181 -492 275 200 13 203 -55 219 100 -95 -14 -5 -91 156 -104 -33
1257 -33 -260 -53 64 188 -61 -35 216 -40 10 202 159 315 -82 82 134 -89 -23 19 64 -42 -106 -126 63
1280 63 -6 198 -14 52 -65 52 -104 125 -11 -41 102 -41 26 75 -45 27 86 168 78 0 308 111 -22 18
1304 18 -3 -150 289 126 130 -115 -81 -83 92 -245 98 -336 -30 -68 -155 89 179 -32 126 -238 88 221 -239
1327 -239 -78 88 -88 102 87 -132 181 -213 136 266 -406 36 211 -473 331 66 -126 43 -66 185
1347A85L0o95O78l75j6M03o25L78L64o84N03J58n36N64l65r0N59p49L03J50m80
1368c40N56l25j66P88r55M39M44q69Q20l11n92J106p70r1N58n03M35K54j315J267
1388D30l23p43J399j214P86L28j045Q37m25k69J085r49m28J286j480O87N80j276
1406g34J253o04o94J960j692J70P48j014Q76j47q72J555p42l62J147j460M84J119
1424I91k125J836q72o17J911j767M89P53j316R18K25j102J276m62j252K262k022
1441h74Q55J344k619K103j044m54J780j765N72P56j085P87O73k079J741l22j668
1458a299K732k733J432J026k896K893j212o79J651j467J24J115j281M35J234k415
1474a340J955k84j561L090l115J243J143k685K527j074n51J375o05q18J854k067
$$ plain form
1347 185 215 -480 198 -177 -193 210 -415 -37 327 -357 146 304 -232 332 -33 -123 436 -313 -10 140 -340
1368 -340 216 -109 -275 513 -442 -3 441 -428 392 81 -511 595 -175 -266 292 -211 224 478 -837 430
1388 430 107 -636 763 -451 335 663 -382 455 30 -239 846 -103 -531 755 -725 -38 542 -734
1406 -734 519 -85 -779 1181 -511 -341 407 -607 269 122 -750 805 63 -299 848 -612 -128 991
1424 991 -1134 702 -170 -787 1124 -643 -154 599 -717 201 426 -676 600 138 -1114 1148 -874
1441 -874 -19 1325 -1294 809 -235 -689 1091 -674 -102 654 -431 356 1029 -1050 691 369 -1299
1458 -1299 1433 -1300 132 1158 -1738 1155 -57 -736 915 -552 -428 687 -594 -159 1075 -1340
1474 -1340 615 331 -1230 1860 -1255 -12 1131 -1554 973 -101 -652 723 118 -700 1154 -913
1490i13L99J855l255K996q90j681L245l326J636J071k502K205o92r78J371m35
1506A06j257K460k007M63J763l332K976j087j414K994k693J112P47j737J270J04
1522D68j433J482j49j591K705k168J77K007l317K820r69j172K660k344P41P48
1538F65j581Q86P25j759J692j63j981K924k333M67J931l140K873r54j086J926
1554A092j887O02J011j463M44O87j696J823k3j574K332k198M71J636k594J963
1570F26l78r65J486r83NP00q14p7J117j698J226L29j675K234j721K49J271j843
1588i11J383j48j027J105l58o56J601j306L5J226j868J408K9j170J652j627L88
1605b44J219j730J093J02r20R42k06p29J049r49J9R52j079Q50l02p25J311q73
$$ plain form
1490 -913 -514 1341 -1914 1082 192 -1489 1756 -1570 66 1137 -1365 840 148 -830 541 106
1506 106 -1151 1309 -698 -235 1528 -1804 1172 85 -1329 1665 -1028 84 831 -906 364 468
1522 468 -965 517 368 -1223 1482 -686 -509 1498 -1819 1001 32 -1140 1520 -824 -83 665
1538 665 -916 -30 695 -1064 628 465 -1516 1408 -925 -458 1473 -1667 1206 252 -834 1092
1554 1092 -795 -193 818 -645 -201 486 -1210 613 590 -984 1348 -850 -379 1257 -1337 626
1570 626 248 -717 769 -214 -209 491 -323 -400 717 -981 245 574 -1101 1133 -588 -339 932 -911
1588 -911 472 324 -703 402 44 -612 989 -317 -282 944 -924 484 513 -657 995 -632 -244
1605 -244 975 -755 338 440 -480 462 256 -473 576 -373 -354 598 -481 369 67 -658 653 -220
1623b20J6P16p64M96j33n23L99J04l51P82o35L4L56q26P68R1p10O71l85N8L58
1644C02n28K28J34p21P85j1o34O15k54P7L28p99O47J35o13P85p35K96J35m91M89
1665A70q0l17L41o7k52O39p64L28K26m03K37k27k23K83J96j02K09j44l6N8l6K01
1687B37k47L2J77j65J78j25l59M77m61Q4K72k23K8K16l05L18M0l23L68m30K07
1708dJ04j21J44k07K70j0k12N8J11j06n2K70n01J63O0J22K39l23r4Q8k24K15j07
1731a17K06m3rn1J53l27L6M30l37K11k08n1rj0K79K8m13K36q4l0J86j39j23K16
1755C0k05M29l81j2R1o2l3M89n42L08r7L0j55P7J61J18j90L2j93J42j75J14l34
1778c58L93j32R0J2p6j3J82l90L10P7o0L20n34L25m9n2j14K11k79N40m57j9M47
$$ plain form
1623 -220 -204 512 -252 244 111 -412 -13 91 -260 522 -113 -79 277 -549 219 310 -400 271 -114 -56 302
1644 302 -226 2 136 -585 200 189 -445 170 -84 -7 321 -478 169 304 -309 476 -259 37 172 -319 170
1665 170 90 -227 114 47 -205 434 -330 -2 224 -179 58 -169 -392 -109 87 -15 194 50 14 72 36 237
1687 237 -10 22 199 34 212 87 -272 205 -256 -172 100 -123 -95 121 -184 134 174 -149 219 -211 -4
1708 -4 100 -21 123 -84 186 176 -36 22 133 27 -25 245 -256 -93 -33 89 328 5 -89 -1 -225 -10 -117
1731 -117 89 46 37 -14 139 -188 -152 278 -59 152 -56 -107 -116 -126 153 181 -232 4 -80 -110 76 -63 -186 30
1755 30 -175 254 -127 -139 -48 -110 -143 346 -196 112 15 45 -110 -33 128 246 56 88 -105 37 -138 -24 -358
1778 -358 35 -97 -7 5 -71 -84 98 -292 18 95 35 355 -179 146 97 45 -69 142 -137 403 -54 -73 374
1801C74n78K09J21l24M97q5l18L44k78J37K45m59o1J43j67K04q7m4L57l41K22
1822A11k8k83L84K24p18M70k80k01Q91q24K68J88n14N24j74k72N97p34M63M86
1842E78j078K91L47m86P94m53k62P68j077N97K96o50P70j96p57J156p07l52R95
1861E74q59K20N27j037J325p73n33J475j293L18M20r35P65J45j007J229p73k88
1879e00J414j419M64Q52j879J499k86o69J300j227J58P30j084P26O98j679J311
1896D09k95j081K151k011O23J185k414K150o14j063J755j226J62J033j434N13
1912a57J082k207J923m62j106K134k106M82J411k338J992l66r55J533j157l30
1928f27J467j506Q9J603k312J953J32k247L126k381K40J553k117J537j79j239
$$ plain form
1801 374 -204 5 126 -198 299 214 -104 240 -38 99 344 -115 -176 -33 -200 4 -83 -127 230 -111 111
1822 111 83 -200 184 408 -310 160 -120 -321 570 -254 14 202 -312 212 38 -234 363 -371 92 578
1842 578 -500 -209 138 -348 446 -7 -269 499 -578 19 315 -335 435 239 -518 638 -69 -421 574
1861 574 -285 -65 462 -575 750 -23 -556 919 -374 -56 364 -571 194 339 -668 561 -212 -500
1879 -500 914 -505 -41 811 -1068 431 145 -524 776 -451 -293 437 -647 79 777 -902 409
1896 409 114 -967 1184 -827 -204 981 -1433 717 103 -960 795 -431 -269 764 -670 -157
1912 -157 925 -1282 641 179 -927 1207 -899 -417 994 -1344 648 282 -673 860 -297 -627
1928 -627 840 -666 -577 1026 -1286 667 799 -1448 1678 -703 -463 1090 -1027 510 331 -908
1944i08J188O2j071J849j302p45K547l082K064J5k125L153k434O84J070j777R63
1961A51M90j390J193K63j740K440j710m55K238l313K425R7k046K759j872j06J353
1978G77j419M60J016j652J163M91k209K748j548o79K538l183J960J34j796K404
1994A205j349k91J420j348K56J090j982Q24J334k550K682j290r06K678k979J329
2010A23K99j477J573p11k08J168q91n56J494j708R54J152k797K877j570n62K508
2027A668k668J378K01j377J351m66q56J361n49r32K171k040N79J131k273K278
2043I57j125o11J767j612O45Q44j240L68N06j190J216l31j032J987j963M91J079
2060G56j786J921r27m74J412j300J29P25j103P36L05j088J091l87n17J137j423
$$ plain form
1944 -908 280 342 -729 1120 -182 -927 1620 -1462 602 617 -1508 1645 -789 -105 965 -812 151
1961 151 641 -749 444 707 -1033 1407 -303 -758 1480 -1833 592 689 -1357 1402 -470 -576 777
1978 777 -642 -182 834 -818 345 836 -1373 1375 -173 -852 1686 -1497 463 597 -1199 1205
1994 1205 -144 -435 985 -363 -107 983 -999 -175 1159 -1391 1291 1 -905 1773 -1206 123
2010 123 422 -1055 518 -193 -401 767 -124 -680 814 -894 60 1212 -1585 1292 -278 -840 1668
2027 1668 -1000 378 579 -798 553 87 -769 592 43 -889 1282 -758 -179 952 -1321 957
2043 957 -168 -779 988 -624 21 865 -375 -7 499 -691 525 194 -838 1149 -814 -323 756
2060 756 -1030 891 -36 -510 902 -398 -269 456 -647 89 394 -694 397 10 -507 630 -793
2077g93Q09O70j477J261n43l13Q23p74K62K31o72M06K66n67P55k00p32J166j093
2096e15M83M51j002J013n10j81M84j83k54O08o43K54M58p96N48L9o68N84n24L44
2116a0L99p71P64j06l23L03l83K3L15m99M27J50o40M71k98J04L55m37M01k33l64
2137c52M79j58j94L51k62K01M0l36K75K9j14J34j70j14L53k91l2K64k88J15j80
2158b50J32J08j23J06K90l98J00L24l56J37k06OL42m95N20k11k17L38mk5m4k57
2180a83K93M8l30K6J09J39p9j26N8N7r1J03k00q5O13l24r4L8k41L93r2p2mJ62
2204A18l85J58J9K26j96J94l39L0J3L47Q4j54k58m7J87k2OK36j79n3K55m39K22
2227B3N4j06j0L8K2K5k44K13K3k99K33L0j15K48k61M83p0j36l64K44R3N1j88k2
$$ plain form
2077 -793 16 686 -791 470 -73 -386 437 -337 -75 156 -516 -110 156 -411 344 144 -588 578 -515
2096 -515 -32 419 -583 430 -80 -261 223 40 -214 394 -249 5 463 -333 215 254 -414 170 -354 -10
2116 -10 389 -382 382 276 -47 256 -127 -104 211 -288 139 289 -351 120 -178 -74 281 -156 245 12 -352
2137 -352 127 -31 -225 126 -136 65 105 -231 44 73 -41 93 -77 -191 162 -129 -161 103 -185 -70 -250
2158 -250 -118 -10 -133 -27 263 -135 -35 289 -67 70 -136 -130 212 -283 237 26 -191 147 143 118 74 -183
2180 -183 110 158 -172 -146 -37 102 23 -103 -45 12 -79 24 -176 -261 352 28 -66 -28 -269 124 32 -40 -44 118
2204 118 -267 -109 -90 136 -60 134 -205 -175 -162 185 269 115 -143 -190 -3 -25 -19 217 38 -15 240 -199 23
2227 23 77 -29 -39 -1 21 46 -198 15 38 -261 -28 2 -113 135 -126 357 287 151 -213 31 124 175 -13 -35
2251c5R5l0r8J84j86L2Pl36O00k61p9N8R5k3k6j35K55J7l59L43j97o9K97l16Q8
2276g9L03j71k67K24k13J87j13K50%m28M46k59kL49l91k00L88l13K99K38o82L33
2298a01P8m80Q76p57M13J73n46M52J45m51K47Rn66Q15p38O04n4m50O51j26j78
2319A6L07l33j98M83o84M52K75r22N59K48n56O00m89J96L10l64R2K88o31P74m42
2340a9n42J190q19K65L16p98O98j68j96N39o48J01M11q25N82K46r44J057l85m30
2360c69R72j134M29O11j152P96o0n42J001p38j71R46p42O9P06j498J319j27q85
2379e69J246j030K43N03j026J134j17o72O92l05q96J557j072K13R41j653J345
2396E34m74o70J394r47n3P05r72K41N82j294J067J17j005J717j175k38J427j698
$$ plain form
2251 -35 60 30 -68 116 -70 -38 -31 -367 233 -28 -107 -49 46 23 -3 -138 117 134 -225 118 -79 -148 149 -167 -79
2276 -79 224 53 -214 10 -203 -16 -129 121 121 -307 139 -120 -122 227 -164 -364 24 -289 10 248 -434 -101
2298 -101 -23 -503 373 -384 29 202 -344 108 253 -198 49 58 -508 307 -431 173 119 -331 320 194 16
2319 16 323 -10 -208 275 -409 43 318 -604 -45 203 -353 247 -242 -46 264 -100 -8 280 -351 423 -19
2340 -19 -561 629 -190 75 391 -407 291 123 -73 466 -182 -81 330 -495 87 333 -611 446 61 -369
2360 -369 603 -531 -102 509 -643 153 93 -449 552 -186 -357 589 -153 -84 622 -876 443 316 -569
2379 -569 677 -353 -110 393 -633 501 384 -288 404 99 -797 760 -312 -99 842 -811 534
2396 534 60 -610 784 -163 -216 489 -483 -242 340 -954 113 230 -775 942 -233 -471 956 -742
2414g42J004P7j118J564j157j7J139j023r3J134j474J010O4j489K173j279o1R99
2432G11j543J166p7r12J275n98m49R57o28l29J270j486P05M10j563K125j309j3
2450b88J298j735Q77N6p37P09K45r03J161p57o00J603j680J037J97j736K025r73
2468b01k13R85j063O44O9q48M73P93j341J494n18q48J672k140J158M28j355J621
2486H10j259J25R52r84L24M55j133P01K37n57Q64m28q06J618j638P65L72j311
2504h93J280m06m00P68n46j35P81r76L72O62j171J423q46l57J114j384Q80K31
2522C97q48P30k74k56M35k98k24O08n91J29O90j520J378q3o87R39q67K49K57m34
2542b70P69l13m87O86j87m89Q36q42K31M11o78R26m02l76P36p43J88M46p17J09
$$ plain form
2414 -742 262 339 -779 785 -372 -389 750 -273 -366 768 -706 304 368 -1121 1052 -227 -288 711
2432 711 -832 334 257 -655 620 22 -427 530 -98 -427 843 -643 62 472 -1091 1034 -275 -288
2450 -288 1010 -725 152 208 -529 180 425 -478 683 -74 -674 929 -751 286 483 -1253 772 -201
2468 -201 -414 571 -492 152 221 -627 -154 639 -702 792 274 -574 1098 -1042 116 544 -811 810
2486 810 -449 -324 628 -356 -32 423 -710 -9 228 -329 535 107 -699 919 -719 46 418 -893
2504 -893 387 -19 -419 349 -197 -332 449 -527 -155 507 -664 759 -87 -444 670 -714 166 397
2522 397 -451 279 5 -251 184 -114 -338 270 -321 -192 498 -1022 356 273 -414 525 -342 -93 164 -270
2542 -270 499 186 -301 385 198 -291 545 -297 -66 345 -333 593 191 -185 551 -192 -4 442 -275 -166
2562a66K01n53P07n5l78N19n18K53K0m67O71r6m13N47m49j65L03j66M20n2j91
2583b8L55j78m20M21k60mJ85l87O65m01j8L29m42J24L61m64K72j47l80P80m79
2604a16r2K36m20J87M58o44P30m97J12L49l72Q0K61k20j00k3m3K27j02k92L09
2625B8j92j95N90k30J79k83P5J7R3k56K25j29k49L20j48r3J20N1J68l13K44K87
2647C09j74r0q1P3K88k36p6O0k17K41N6k15R0j80m1M9j48K36p6j86M01Q6j32j1
2671B6j24J22o7n5JP8qL1o8K21j53%J11k25N4K99j82j5j8J0J9q9Q6Q4j38k65K52
2698a3j4k25J54J08p3M7L6j6R6p6j09P9o7K72k08M7j38K38q8p8j20K42l44J26
2722a24j13q1K80k02L78j42j19K13j05oQ0r2m5k32N06N6J5l38J17j69J09l8k49
$$ plain form
2562 -166 35 -518 189 134 -244 275 -243 10 30 -437 234 138 -275 272 -177 -342 -39 -205 215 163 -28
2583 -28 327 149 -271 150 -110 -114 71 -316 349 -52 -70 259 -183 -59 302 -162 110 -37 -417 363 -116
2604 -116 -208 28 -392 -205 253 -391 339 -158 -46 303 -69 11 272 52 -48 -71 -114 113 11 -281 28
2625 28 -164 -359 231 1 180 -103 -28 -11 82 -174 51 -78 -327 -7 -155 -248 -128 -77 91 -222 22 309
2647 309 135 45 -36 37 325 89 13 73 -144 97 153 -62 28 -152 -193 -144 -292 -56 -132 -318 83 169 37 26
2671 26 -98 24 -43 -98 -97 -19 -27 4 -64 157 4 4 115 -110 -56 243 61 46 28 38 57 -32 54 138 0 -265 -13
2698 -13 -27 -252 -98 10 -63 -16 20 4 100 24 -85 -6 -73 199 -9 38 -100 138 50 -28 -148 94 -250 -124
2722 -124 -237 -318 -38 -240 138 -4 -123 90 -15 -21 59 -33 -78 -310 196 252 267 -71 46 -123 -14 -52 -301
2745c01J34K43k29j02L83o6K92l55M1J64l27L0J21J4j81K49l12L32m7k63J97M7
2767F4j50K41l61L07r6k15L37L2J14k06k50J83J01k11k9J08k56K33K52k16K39
2788B21l87K47p2k1M00o09K00K36k55M1J93m33K19P8j27m1O7J18L2l62J74Q7r7
2811i1J92pj70L69l89NJ72l33L37J6j01K80l58J38K80o68L68J50m97P71l40k81
2833a57L56m18M5M22k50OP1j1k07j0M7J40n5j13L79n75O25m00o1M03j49q5J68
2856A71k64J48J97m36K85p7l57N81l00K53J52n06N72k92m54N50l29Q6L18n00L79
2877A77k57n1M91o30Q3O16n23k6K85m72L60j21lK74m60J68L27m26M60l42q5L24
2899A69m0k07O18n46j89M11m94M49r7n31P22n97J38M65l94J28Q1m00M21K3k26
$$ plain form
2745 -301 -167 76 -153 -255 128 62 354 -1 40 204 -123 -93 28 42 -139 110 -202 130 83 -180 17 64
2767 64 -86 155 -206 101 5 -210 127 159 273 67 -183 0 101 -110 -139 -31 -287 -54 198 -18 221
2788 221 -166 81 9 -12 388 -221 -21 215 -40 1 194 -239 -20 58 -69 -110 -43 75 107 -255 -81 6 -91
2811 -91 101 94 -76 293 -96 -91 81 -252 85 101 0 280 -78 60 340 -328 40 190 -307 464 124 -157
2833 -157 199 -219 -174 248 -2 4 75 64 -143 -153 -106 34 -21 -134 245 -330 295 -105 -166 237 88 3 171
2856 171 -93 55 252 -184 101 24 -333 248 -52 201 353 -153 419 127 -327 223 -106 -20 298 -202 177
2877 177 -80 -131 360 -270 -187 429 -94 -120 165 -307 53 -68 -71 203 -257 -89 238 -188 272 -70 -155 169
2899 169 129 -78 540 -6 -195 216 -278 171 74 -457 265 -332 -194 271 -123 5 86 -314 107 130 -96
2920i6L96n71m1N83o16N06l67K0L24j16l42L18k06L5M46m91K73J25l03K62j45
2941fj09L47m03K87j13l14N98m03k22N52m19M4K39l30L30j25p0L11k11j14M58
2962C27n54J51J53k02L16k71k18M31k09L2L95n47K96j20k73M80j69o9K04m70L66
2983D9l9j60K56q8p6L15n69K58J60k21L47j40j46M14m96n0L98l56J38J64j88L06
3005B76L4m14L30k7j81K07n18L07J74k98L37j77k80M54k79K52K7l26J90M3j49
3026a8R2J24n08N93m40O9j5OK22k42r9M79l13K6L36o62J83K43m43N08j5k20K03
3049A09k22K29m9j49K18k64q8L89j49j83M32m20jJ28l84O24j23j03mj04K72n9
3071I9l57L45n8l79M98l04J59M02n26O6n6j08L21m5M3k7j82L37K4l41K70j66j83
$$ plain form
2920 -96 300 -271 -312 271 -345 161 -206 -186 138 22 -320 -2 -208 -173 273 -218 55 180 -123 139 -6
2941 -6 -115 232 -171 116 3 -311 287 -116 -338 214 -205 -161 78 -252 78 -47 -117 194 -17 -131 327
2962 327 -227 -76 77 -125 191 -80 -298 133 -76 -44 351 -196 100 -20 -293 187 18 -51 153 -317 49
2983 49 10 -150 106 18 -58 257 -312 -54 106 -115 232 92 -54 360 -136 -186 212 -144 -6 158 -30 276
3005 276 310 -104 226 199 18 225 -293 14 188 -110 227 50 -230 224 -55 197 224 -102 88 131 -18
3026 -18 74 198 -310 283 -157 -88 -103 -97 125 -117 -216 263 -50 -24 312 -350 -167 76 -367 141 126 -94 109
3049 109 -113 116 67 -82 136 -128 -216 173 24 -159 273 -147 -148 -20 -404 220 97 -6 -10 -114 158 99
3071 99 -258 87 29 -350 148 -156 3 405 -121 -55 -111 -219 102 57 100 73 -109 228 252 -89 181 15 -168
3094a68K18J8l53L06j02J87M9l50K04K4l61K99j46k1K22q2J39M8j57R7n0M9L77
3117D47o27L62k65j53L32L4k84J21m1L4K71m68L31m4j86L79m80J10J18N1o8J38
3139A12n14O12q9r4Q9j43k45L28Q5o0n0j4l5n0lJ32k75J47k06K23P5o3N9k48k6
3164b53K98J37j55K32j19j58J5p0jJ70k75M2L53m12J01J95r6Km5K4P2j43K9J10
3188E3n7n5K47j02p2j70O6J83l31K04jQ9P6j49k35J80N3rL5j6kq7k22J59K31q4
3214a6J78l22K02J46m39K00K3pK46m70L7K77l81J71K84j63J32l5j2K0j05kj35
3237a71J32J32k36P9L6J02j58L41l68K71j56j39L42k73R9j9R4k78J04k48M16K7
3259A29j04Q0O6l29K51j96J54K13k86P3j4P0k42K58m08J74M1K65j27j40J69K03
$$ plain form
3094 -168 50 68 -285 21 -81 106 155 -195 9 33 -328 -29 -175 -196 26 -56 83 131 -26 71 21 70 447
3117 447 -180 182 -83 -236 96 130 -154 -33 -74 -40 231 -237 94 50 -136 243 -237 -127 -9 42 -26 112
3139 112 -402 210 121 27 116 -27 -272 56 141 81 31 17 -18 -68 -71 61 -214 -67 -273 -50 25 -38 21 -227 -253
3164 -253 45 182 27 259 140 -18 -3 -73 -74 96 -179 -137 216 -196 -95 100 4 6 -39 -15 57 -86 -57 53
3188 53 -4 -59 188 86 14 -156 -90 93 -238 -34 -35 54 130 -19 -254 -74 -21 -30 5 -11 -13 -100 -322 -163 68 -16
3214 -16 162 -160 42 188 -251 -51 -28 -35 211 -259 -222 55 -326 -155 129 -34 98 63 51 71 -34 -36 -171
3237 -171 -39 93 -143 -64 -28 74 -84 257 -111 160 4 -135 207 -66 33 14 108 -170 -66 -314 102 129
3259 129 25 105 171 -158 93 -103 51 264 -22 51 37 107 -135 123 -285 -111 -70 195 68 -72 97 300
3281C00l85j14J79k01J81n3J94J27p4m7j32j59K99l37M44k77l2L7J35j88J49K1
$$ plain form
3281 300 -85 -199 -20 -221 -40 -93 101 228 154 107 -25 -184 115 -222 222 -55 -87 -50 85 -103 46 67
$$ [...]
8191a43
##END NTUPLES=NMR FID
##END=
